<?xml version="1.5"?>
<robot name="inertias"
    xmlns:xacro="http://www.ros.org/wiki/xacro">

    <!--@ Assuming constant density -->

    <!--& box -->
    <xacro:macro name="box_inertia" params="m w h d x:=0.0 y:=0.0 z:=0.0 roll:=0.0 pitch:=0.0 yaw:=0.0">
        <!--@ x-axis = d, y-axis = w, z-axis = h -->
        <inertial>
            <mass value="${m}"/>
            <inertia ixx="${1/12.*m*(w*w + h*h)}" ixy = "0.0" ixz = "0.0" iyy="${1/12.*m*(d*d + h*h)}" iyz = "0.0" izz="${1/12.*m*(d*d + w*w)}"/>
            <origin xyz="${x} ${y} ${z}" rpy="${roll} ${pitch} ${yaw}"/>
        </inertial>
    </xacro:macro>

    <!--& cylinder -->
    <xacro:macro name="cylinder_inertia" params="m r t x:=0 y:=0 z:=0 roll:=0 pitch:=0 yaw:=0">
        <!--@ z-axis is rotational axis -->
        <inertial>
            <mass value="${m}"/>
            <inertia ixx="${1/4.*m*r*r + 1/12.*m*t*t}" ixy = "0" ixz = "0" iyy="${1/4.*m*r*r + 1/12.*m*t*t}" iyz = "0" izz="${1/2.*m*r*r}"/>
            <origin xyz="${x} ${y} ${z}" rpy="${roll} ${pitch} ${yaw}"/>
        </inertial>
    </xacro:macro>

    <!--& sphere -->
    <xacro:macro name="sphere_inertia" params="m r">
        <inertial>
            <mass value="${m}"/>
            <inertia ixx="${2/5.*m*r*r}" ixy = "0" ixz = "0" iyy="${2/5.*m*r*r}" iyz = "0" izz="${2/5.*m*r*r}"/>
        </inertial>
    </xacro:macro>

    <!--& triangle -->
    <xacro:macro name="triangle_inertia" params="m w h d x:=0 y:=0 z:=0 roll:=0 pitch:=0 yaw:=0">
        <!--@ x-axis = h, y-axis = w, z-axis = d -->
        <inertial>
            <origin xyz="${-1/6.*h} 0 ${-1/6.*d}"/>
            <mass value="${m}"/>
            <inertia ixx="${1/36.*m * (2**d*d + 3*w*w)}" ixy = "0" ixz = "0" iyy="${1/18.*m * (d*d + h*h)}" iyz = "0" izz="${1}"/>
        </inertial>
    </xacro:macro>

    <!--& small -->
    <xacro:macro name="small_inertia">
        <inertial>
            <mass value="0.00001"/>
            <inertia ixx="1" ixy = "0" ixz = "0" iyy="1" iyz = "0" izz="1"/>
        </inertial>
    </xacro:macro>

</robot>
