['firstName'],['lastName'],['age'],['address']['streetAddress'],['address']['city'],['address']['postalCode'],['phoneNumbers']['type'],['phoneNumbers']['number']['codes'],['phoneNumbers']['number']['number']
John,Doe,26,Nice Street,New Good City,60192,mobile,00123,4567-8999
John,Doe,26,Nice Street,New Good City,60192,mobile,+123,4567-8999
John,Doe,26,Nice Street,New Good City,60192,home,0044,4567-8910
John,Doe,26,Nice Street,New Good City,60192,home,+44,4567-8910