[
  {
    "['X']": "0",
    "['A']": "1",
    "['B']['D']": "4",
    "['B']['E']": "5",
    "['C']['H']": "8",
    "['C']['I']": "9"
  },
  {
    "['X']": "0",
    "['A']": "1",
    "['B']['D']": "4",
    "['B']['E']['J']": "10",
    "['B']['E']['K']": "11",
    "['C']['H']": "8",
    "['C']['I']": "9"
  },
  {
    "['X']": "0",
    "['A']": "1",
    "['B']['F']": "6",
    "['B']['G']": "7",
    "['C']['H']": "8",
    "['C']['I']": "9"
  }
]