{
  "firstName": "John",
  "lastName": "Doe",
  "age": 26,
  "address": {
    "streetAddress": "Nice Street",
    "city": "New Good City",
    "postalCode": "60192"
  },
  "phoneNumbers": [
    {
      "type": "mobile",
      "number": {
        "codes": [
          "00123",
          "+123"
        ],
        "number": "4567-8999"
      }
    },
    {
      "type" : "home",
      "number": {
        "codes" : [
          "0044",
          "+44"
        ],
        "number" : "4567-8910"
      }
    }
  ]
}