%YAML 1.1
%TAG !u! tag:unity3d.com,2011:
--- !u!1001 &4552404904248143921
PrefabInstance:
  m_ObjectHideFlags: 0
  serializedVersion: 2
  m_Modification:
    m_TransformParent: {fileID: 0}
    m_Modifications:
    - target: {fileID: 3435119964350125953, guid: 9f87e4e27e32a1647aff787cc88412ea,
        type: 3}
      propertyPath: m_LocalScale.x
      value: 0.3
      objectReference: {fileID: 0}
    - target: {fileID: 3435119964350125953, guid: 9f87e4e27e32a1647aff787cc88412ea,
        type: 3}
      propertyPath: m_LocalScale.y
      value: 0.3
      objectReference: {fileID: 0}
    - target: {fileID: 3435119964350125953, guid: 9f87e4e27e32a1647aff787cc88412ea,
        type: 3}
      propertyPath: m_LocalScale.z
      value: 0.3
      objectReference: {fileID: 0}
    - target: {fileID: 4372384750011834594, guid: 9f87e4e27e32a1647aff787cc88412ea,
        type: 3}
      propertyPath: m_Pivot.x
      value: 0.5
      objectReference: {fileID: 0}
    - target: {fileID: 4372384750011834594, guid: 9f87e4e27e32a1647aff787cc88412ea,
        type: 3}
      propertyPath: m_Pivot.y
      value: 0.5
      objectReference: {fileID: 0}
    - target: {fileID: 4372384750011834594, guid: 9f87e4e27e32a1647aff787cc88412ea,
        type: 3}
      propertyPath: m_RootOrder
      value: 0
      objectReference: {fileID: 0}
    - target: {fileID: 4372384750011834594, guid: 9f87e4e27e32a1647aff787cc88412ea,
        type: 3}
      propertyPath: m_AnchorMax.x
      value: 0
      objectReference: {fileID: 0}
    - target: {fileID: 4372384750011834594, guid: 9f87e4e27e32a1647aff787cc88412ea,
        type: 3}
      propertyPath: m_AnchorMax.y
      value: 1
      objectReference: {fileID: 0}
    - target: {fileID: 4372384750011834594, guid: 9f87e4e27e32a1647aff787cc88412ea,
        type: 3}
      propertyPath: m_AnchorMin.x
      value: 0
      objectReference: {fileID: 0}
    - target: {fileID: 4372384750011834594, guid: 9f87e4e27e32a1647aff787cc88412ea,
        type: 3}
      propertyPath: m_AnchorMin.y
      value: 1
      objectReference: {fileID: 0}
    - target: {fileID: 4372384750011834594, guid: 9f87e4e27e32a1647aff787cc88412ea,
        type: 3}
      propertyPath: m_SizeDelta.x
      value: 100
      objectReference: {fileID: 0}
    - target: {fileID: 4372384750011834594, guid: 9f87e4e27e32a1647aff787cc88412ea,
        type: 3}
      propertyPath: m_SizeDelta.y
      value: 100
      objectReference: {fileID: 0}
    - target: {fileID: 4372384750011834594, guid: 9f87e4e27e32a1647aff787cc88412ea,
        type: 3}
      propertyPath: m_LocalPosition.x
      value: 0
      objectReference: {fileID: 0}
    - target: {fileID: 4372384750011834594, guid: 9f87e4e27e32a1647aff787cc88412ea,
        type: 3}
      propertyPath: m_LocalPosition.y
      value: 0
      objectReference: {fileID: 0}
    - target: {fileID: 4372384750011834594, guid: 9f87e4e27e32a1647aff787cc88412ea,
        type: 3}
      propertyPath: m_LocalPosition.z
      value: 0
      objectReference: {fileID: 0}
    - target: {fileID: 4372384750011834594, guid: 9f87e4e27e32a1647aff787cc88412ea,
        type: 3}
      propertyPath: m_LocalRotation.w
      value: 1
      objectReference: {fileID: 0}
    - target: {fileID: 4372384750011834594, guid: 9f87e4e27e32a1647aff787cc88412ea,
        type: 3}
      propertyPath: m_LocalRotation.x
      value: -0
      objectReference: {fileID: 0}
    - target: {fileID: 4372384750011834594, guid: 9f87e4e27e32a1647aff787cc88412ea,
        type: 3}
      propertyPath: m_LocalRotation.y
      value: -0
      objectReference: {fileID: 0}
    - target: {fileID: 4372384750011834594, guid: 9f87e4e27e32a1647aff787cc88412ea,
        type: 3}
      propertyPath: m_LocalRotation.z
      value: -0
      objectReference: {fileID: 0}
    - target: {fileID: 4372384750011834594, guid: 9f87e4e27e32a1647aff787cc88412ea,
        type: 3}
      propertyPath: m_AnchoredPosition.x
      value: 134
      objectReference: {fileID: 0}
    - target: {fileID: 4372384750011834594, guid: 9f87e4e27e32a1647aff787cc88412ea,
        type: 3}
      propertyPath: m_AnchoredPosition.y
      value: 342
      objectReference: {fileID: 0}
    - target: {fileID: 4372384750011834594, guid: 9f87e4e27e32a1647aff787cc88412ea,
        type: 3}
      propertyPath: m_LocalEulerAnglesHint.x
      value: 0
      objectReference: {fileID: 0}
    - target: {fileID: 4372384750011834594, guid: 9f87e4e27e32a1647aff787cc88412ea,
        type: 3}
      propertyPath: m_LocalEulerAnglesHint.y
      value: 0
      objectReference: {fileID: 0}
    - target: {fileID: 4372384750011834594, guid: 9f87e4e27e32a1647aff787cc88412ea,
        type: 3}
      propertyPath: m_LocalEulerAnglesHint.z
      value: 0
      objectReference: {fileID: 0}
    - target: {fileID: 7543800762802288987, guid: 9f87e4e27e32a1647aff787cc88412ea,
        type: 3}
      propertyPath: m_Sprite
      value: 
      objectReference: {fileID: -7357873357605312705, guid: 35154e19198e84c4b825c15ea3489dee,
        type: 3}
    - target: {fileID: 8238935512095821548, guid: 9f87e4e27e32a1647aff787cc88412ea,
        type: 3}
      propertyPath: m_Name
      value: SkillDefault
      objectReference: {fileID: 0}
    - target: {fileID: 9200190169657820462, guid: 9f87e4e27e32a1647aff787cc88412ea,
        type: 3}
      propertyPath: m_text
      value: Beam
      objectReference: {fileID: 0}
    m_RemovedComponents: []
  m_SourcePrefab: {fileID: 100100000, guid: 9f87e4e27e32a1647aff787cc88412ea, type: 3}
