%YAML 1.1
%TAG !u! tag:unity3d.com,2011:
--- !u!1001 &2656696610298212401
PrefabInstance:
  m_ObjectHideFlags: 0
  serializedVersion: 2
  m_Modification:
    m_TransformParent: {fileID: 0}
    m_Modifications:
    - target: {fileID: 5362316875418117318, guid: de4bbfdc42736384eb3db4a6f3200857,
        type: 3}
      propertyPath: m_Name
      value: MissionRed50 Variant
      objectReference: {fileID: 0}
    - target: {fileID: 5362316875418117337, guid: de4bbfdc42736384eb3db4a6f3200857,
        type: 3}
      propertyPath: m_Pivot.x
      value: 0.5
      objectReference: {fileID: 0}
    - target: {fileID: 5362316875418117337, guid: de4bbfdc42736384eb3db4a6f3200857,
        type: 3}
      propertyPath: m_Pivot.y
      value: 0.5
      objectReference: {fileID: 0}
    - target: {fileID: 5362316875418117337, guid: de4bbfdc42736384eb3db4a6f3200857,
        type: 3}
      propertyPath: m_RootOrder
      value: 0
      objectReference: {fileID: 0}
    - target: {fileID: 5362316875418117337, guid: de4bbfdc42736384eb3db4a6f3200857,
        type: 3}
      propertyPath: m_AnchorMax.x
      value: 0
      objectReference: {fileID: 0}
    - target: {fileID: 5362316875418117337, guid: de4bbfdc42736384eb3db4a6f3200857,
        type: 3}
      propertyPath: m_AnchorMax.y
      value: 0
      objectReference: {fileID: 0}
    - target: {fileID: 5362316875418117337, guid: de4bbfdc42736384eb3db4a6f3200857,
        type: 3}
      propertyPath: m_AnchorMin.x
      value: 0
      objectReference: {fileID: 0}
    - target: {fileID: 5362316875418117337, guid: de4bbfdc42736384eb3db4a6f3200857,
        type: 3}
      propertyPath: m_AnchorMin.y
      value: 0
      objectReference: {fileID: 0}
    - target: {fileID: 5362316875418117337, guid: de4bbfdc42736384eb3db4a6f3200857,
        type: 3}
      propertyPath: m_SizeDelta.x
      value: 0
      objectReference: {fileID: 0}
    - target: {fileID: 5362316875418117337, guid: de4bbfdc42736384eb3db4a6f3200857,
        type: 3}
      propertyPath: m_SizeDelta.y
      value: 0
      objectReference: {fileID: 0}
    - target: {fileID: 5362316875418117337, guid: de4bbfdc42736384eb3db4a6f3200857,
        type: 3}
      propertyPath: m_LocalPosition.x
      value: 0
      objectReference: {fileID: 0}
    - target: {fileID: 5362316875418117337, guid: de4bbfdc42736384eb3db4a6f3200857,
        type: 3}
      propertyPath: m_LocalPosition.y
      value: 0
      objectReference: {fileID: 0}
    - target: {fileID: 5362316875418117337, guid: de4bbfdc42736384eb3db4a6f3200857,
        type: 3}
      propertyPath: m_LocalPosition.z
      value: 0
      objectReference: {fileID: 0}
    - target: {fileID: 5362316875418117337, guid: de4bbfdc42736384eb3db4a6f3200857,
        type: 3}
      propertyPath: m_LocalRotation.w
      value: 1
      objectReference: {fileID: 0}
    - target: {fileID: 5362316875418117337, guid: de4bbfdc42736384eb3db4a6f3200857,
        type: 3}
      propertyPath: m_LocalRotation.x
      value: 0
      objectReference: {fileID: 0}
    - target: {fileID: 5362316875418117337, guid: de4bbfdc42736384eb3db4a6f3200857,
        type: 3}
      propertyPath: m_LocalRotation.y
      value: 0
      objectReference: {fileID: 0}
    - target: {fileID: 5362316875418117337, guid: de4bbfdc42736384eb3db4a6f3200857,
        type: 3}
      propertyPath: m_LocalRotation.z
      value: 0
      objectReference: {fileID: 0}
    - target: {fileID: 5362316875418117337, guid: de4bbfdc42736384eb3db4a6f3200857,
        type: 3}
      propertyPath: m_AnchoredPosition.x
      value: 0
      objectReference: {fileID: 0}
    - target: {fileID: 5362316875418117337, guid: de4bbfdc42736384eb3db4a6f3200857,
        type: 3}
      propertyPath: m_AnchoredPosition.y
      value: 0
      objectReference: {fileID: 0}
    - target: {fileID: 5362316875418117337, guid: de4bbfdc42736384eb3db4a6f3200857,
        type: 3}
      propertyPath: m_LocalEulerAnglesHint.x
      value: 0
      objectReference: {fileID: 0}
    - target: {fileID: 5362316875418117337, guid: de4bbfdc42736384eb3db4a6f3200857,
        type: 3}
      propertyPath: m_LocalEulerAnglesHint.y
      value: 0
      objectReference: {fileID: 0}
    - target: {fileID: 5362316875418117337, guid: de4bbfdc42736384eb3db4a6f3200857,
        type: 3}
      propertyPath: m_LocalEulerAnglesHint.z
      value: 0
      objectReference: {fileID: 0}
    - target: {fileID: 5362316876446211693, guid: de4bbfdc42736384eb3db4a6f3200857,
        type: 3}
      propertyPath: m_Sprite
      value: 
      objectReference: {fileID: 21300000, guid: 1f0e1478be6645740a6e88fe22147487,
        type: 3}
    - target: {fileID: 7337978273859615294, guid: de4bbfdc42736384eb3db4a6f3200857,
        type: 3}
      propertyPath: money
      value: 1000
      objectReference: {fileID: 0}
    - target: {fileID: 7337978273859615294, guid: de4bbfdc42736384eb3db4a6f3200857,
        type: 3}
      propertyPath: nbKillMax
      value: 50
      objectReference: {fileID: 0}
    - target: {fileID: 7337978273859615294, guid: de4bbfdc42736384eb3db4a6f3200857,
        type: 3}
      propertyPath: enemyToKill
      value: 
      objectReference: {fileID: 11400000, guid: b4147ca90619f604da09bc551f3dfe62,
        type: 2}
    - target: {fileID: 7337978273859615294, guid: de4bbfdc42736384eb3db4a6f3200857,
        type: 3}
      propertyPath: typeMission
      value: Kill
      objectReference: {fileID: 0}
    m_RemovedComponents: []
  m_SourcePrefab: {fileID: 100100000, guid: de4bbfdc42736384eb3db4a6f3200857, type: 3}
