%YAML 1.1
%TAG !u! tag:unity3d.com,2011:
--- !u!114 &11400000
MonoBehaviour:
  m_ObjectHideFlags: 0
  m_CorrespondingSourceObject: {fileID: 0}
  m_PrefabInstance: {fileID: 0}
  m_PrefabAsset: {fileID: 0}
  m_GameObject: {fileID: 0}
  m_Enabled: 1
  m_EditorHideFlags: 0
  m_Script: {fileID: 11500000, guid: 71c226e013d890541ac9ca0309696664, type: 3}
  m_Name: DataEnemy2
  m_EditorClassIdentifier: 
  nameEnemy: Orange
  moveSpeed: 3
  life: 2
  score: 2
  materialColor: {fileID: 2100000, guid: 486b524d8539dbf44be6f3f7914c0d85, type: 2}
