%YAML 1.1
%TAG !u! tag:unity3d.com,2011:
--- !u!1001 &3245810584639391641
PrefabInstance:
  m_ObjectHideFlags: 0
  serializedVersion: 2
  m_Modification:
    m_TransformParent: {fileID: 0}
    m_Modifications:
    - target: {fileID: 1234895954, guid: 048b155a81189744ca0467dbdd33c7f9, type: 3}
      propertyPath: m_text
      value: Reduce cooldown
      objectReference: {fileID: 0}
    - target: {fileID: 1075879648316371790, guid: 048b155a81189744ca0467dbdd33c7f9,
        type: 3}
      propertyPath: m_Sprite
      value: 
      objectReference: {fileID: 21300000, guid: 508344cfad4709f43a85ca6d7d937949,
        type: 3}
    - target: {fileID: 1075879648316371791, guid: 048b155a81189744ca0467dbdd33c7f9,
        type: 3}
      propertyPath: m_LocalScale.x
      value: 0.35
      objectReference: {fileID: 0}
    - target: {fileID: 1075879648316371791, guid: 048b155a81189744ca0467dbdd33c7f9,
        type: 3}
      propertyPath: m_LocalScale.y
      value: 0.35
      objectReference: {fileID: 0}
    - target: {fileID: 1075879648316371791, guid: 048b155a81189744ca0467dbdd33c7f9,
        type: 3}
      propertyPath: m_LocalScale.z
      value: 0.35
      objectReference: {fileID: 0}
    - target: {fileID: 1075879649028906028, guid: 048b155a81189744ca0467dbdd33c7f9,
        type: 3}
      propertyPath: m_Pivot.x
      value: 0.5
      objectReference: {fileID: 0}
    - target: {fileID: 1075879649028906028, guid: 048b155a81189744ca0467dbdd33c7f9,
        type: 3}
      propertyPath: m_Pivot.y
      value: 0.5
      objectReference: {fileID: 0}
    - target: {fileID: 1075879649028906028, guid: 048b155a81189744ca0467dbdd33c7f9,
        type: 3}
      propertyPath: m_RootOrder
      value: 0
      objectReference: {fileID: 0}
    - target: {fileID: 1075879649028906028, guid: 048b155a81189744ca0467dbdd33c7f9,
        type: 3}
      propertyPath: m_AnchorMax.x
      value: 0.5
      objectReference: {fileID: 0}
    - target: {fileID: 1075879649028906028, guid: 048b155a81189744ca0467dbdd33c7f9,
        type: 3}
      propertyPath: m_AnchorMax.y
      value: 0.5
      objectReference: {fileID: 0}
    - target: {fileID: 1075879649028906028, guid: 048b155a81189744ca0467dbdd33c7f9,
        type: 3}
      propertyPath: m_AnchorMin.x
      value: 0.5
      objectReference: {fileID: 0}
    - target: {fileID: 1075879649028906028, guid: 048b155a81189744ca0467dbdd33c7f9,
        type: 3}
      propertyPath: m_AnchorMin.y
      value: 0.5
      objectReference: {fileID: 0}
    - target: {fileID: 1075879649028906028, guid: 048b155a81189744ca0467dbdd33c7f9,
        type: 3}
      propertyPath: m_SizeDelta.x
      value: 100
      objectReference: {fileID: 0}
    - target: {fileID: 1075879649028906028, guid: 048b155a81189744ca0467dbdd33c7f9,
        type: 3}
      propertyPath: m_SizeDelta.y
      value: 100
      objectReference: {fileID: 0}
    - target: {fileID: 1075879649028906028, guid: 048b155a81189744ca0467dbdd33c7f9,
        type: 3}
      propertyPath: m_LocalPosition.x
      value: 0
      objectReference: {fileID: 0}
    - target: {fileID: 1075879649028906028, guid: 048b155a81189744ca0467dbdd33c7f9,
        type: 3}
      propertyPath: m_LocalPosition.y
      value: 0
      objectReference: {fileID: 0}
    - target: {fileID: 1075879649028906028, guid: 048b155a81189744ca0467dbdd33c7f9,
        type: 3}
      propertyPath: m_LocalPosition.z
      value: 0
      objectReference: {fileID: 0}
    - target: {fileID: 1075879649028906028, guid: 048b155a81189744ca0467dbdd33c7f9,
        type: 3}
      propertyPath: m_LocalRotation.w
      value: 1
      objectReference: {fileID: 0}
    - target: {fileID: 1075879649028906028, guid: 048b155a81189744ca0467dbdd33c7f9,
        type: 3}
      propertyPath: m_LocalRotation.x
      value: 0
      objectReference: {fileID: 0}
    - target: {fileID: 1075879649028906028, guid: 048b155a81189744ca0467dbdd33c7f9,
        type: 3}
      propertyPath: m_LocalRotation.y
      value: 0
      objectReference: {fileID: 0}
    - target: {fileID: 1075879649028906028, guid: 048b155a81189744ca0467dbdd33c7f9,
        type: 3}
      propertyPath: m_LocalRotation.z
      value: 0
      objectReference: {fileID: 0}
    - target: {fileID: 1075879649028906028, guid: 048b155a81189744ca0467dbdd33c7f9,
        type: 3}
      propertyPath: m_AnchoredPosition.x
      value: 226
      objectReference: {fileID: 0}
    - target: {fileID: 1075879649028906028, guid: 048b155a81189744ca0467dbdd33c7f9,
        type: 3}
      propertyPath: m_AnchoredPosition.y
      value: -295
      objectReference: {fileID: 0}
    - target: {fileID: 1075879649028906028, guid: 048b155a81189744ca0467dbdd33c7f9,
        type: 3}
      propertyPath: m_LocalEulerAnglesHint.x
      value: 0
      objectReference: {fileID: 0}
    - target: {fileID: 1075879649028906028, guid: 048b155a81189744ca0467dbdd33c7f9,
        type: 3}
      propertyPath: m_LocalEulerAnglesHint.y
      value: 0
      objectReference: {fileID: 0}
    - target: {fileID: 1075879649028906028, guid: 048b155a81189744ca0467dbdd33c7f9,
        type: 3}
      propertyPath: m_LocalEulerAnglesHint.z
      value: 0
      objectReference: {fileID: 0}
    - target: {fileID: 1075879649028906029, guid: 048b155a81189744ca0467dbdd33c7f9,
        type: 3}
      propertyPath: m_Name
      value: SkillCard (1)
      objectReference: {fileID: 0}
    m_RemovedComponents: []
  m_SourcePrefab: {fileID: 100100000, guid: 048b155a81189744ca0467dbdd33c7f9, type: 3}
