%YAML 1.1
%TAG !u! tag:unity3d.com,2011:
--- !u!114 &11400000
MonoBehaviour:
  m_ObjectHideFlags: 0
  m_CorrespondingSourceObject: {fileID: 0}
  m_PrefabInstance: {fileID: 0}
  m_PrefabAsset: {fileID: 0}
  m_GameObject: {fileID: 0}
  m_Enabled: 1
  m_EditorHideFlags: 0
  m_Script: {fileID: 11500000, guid: cf849ab1733424d4e849752c1ad626a2, type: 3}
  m_Name: DataBeam
  m_EditorClassIdentifier: 
  cardPrice: 0
  skillHaveLock: 0
  nameSkill: BeamType
  nameSkillLock: BeamTypeLock
  skillValueSet: 0
  skillRevertValueSet: 0
