%YAML 1.1
%TAG !u! tag:unity3d.com,2011:
--- !u!114 &11400000
MonoBehaviour:
  m_ObjectHideFlags: 0
  m_CorrespondingSourceObject: {fileID: 0}
  m_PrefabInstance: {fileID: 0}
  m_PrefabAsset: {fileID: 0}
  m_GameObject: {fileID: 0}
  m_Enabled: 1
  m_EditorHideFlags: 0
  m_Script: {fileID: 11500000, guid: 7df4b4f65ee49e943b12b8e49e6ed8ef, type: 3}
  m_Name: TestBoat
  m_EditorClassIdentifier: 
  Life: 20
  BoatRole: test
  Speed: 5
  LookSensitivity: 3
