2021-02-03T11:53:00.2917829-08:00  [INF] Application started. Press Ctrl+C to shut down. (dcaefe54)
2021-02-03T11:53:00.3095246-08:00  [INF] Hosting environment: "Development" (c3307c92)
2021-02-03T11:53:00.3127797-08:00  [INF] Content root path: "C:\Users\Viktor\source\repos\ProjectGoldFlow\GoldFlowAPI" (b5d60022)
