2021-01-23T14:17:15.3232888-08:00  [INF] Application started. Press Ctrl+C to shut down. (dcaefe54)
2021-01-23T14:17:15.3392151-08:00  [INF] Hosting environment: "Development" (c3307c92)
2021-01-23T14:17:15.3451901-08:00  [INF] Content root path: "C:\Users\Viktor\source\repos\ProjectGoldFlow\GoldFlowAPI" (b5d60022)
2021-01-23T14:17:40.4248911-08:00 80000004-0003-ff00-b63f-84710c7967bb [ERR] 



------------------------------------------------------------------------------
Error Message: Unable to resolve service for type 'GoldFlowAPI.Services.ITaskService' while attempting to activate 'GoldFlowAPI.Controllers.TaskController'.
Error Type: System.InvalidOperationException
File: 
Method: GetService
Line: 0
Line: line 29
Date: 23.01.2021 14:17:40
------------------------------------------------------------------------------


 (42f8300a)
2021-01-23T14:17:56.9742419-08:00 80000005-0003-ff00-b63f-84710c7967bb [ERR] 



------------------------------------------------------------------------------
Error Message: Unable to resolve service for type 'GoldFlowAPI.Services.ITaskService' while attempting to activate 'GoldFlowAPI.Controllers.TaskController'.
Error Type: System.InvalidOperationException
File: 
Method: GetService
Line: 0
Line: line 29
Date: 23.01.2021 14:17:56
------------------------------------------------------------------------------


 (98962da8)
2021-01-23T14:18:08.5294620-08:00 80000006-0003-ff00-b63f-84710c7967bb [ERR] 



------------------------------------------------------------------------------
Error Message: Unable to resolve service for type 'GoldFlowAPI.Services.ITaskService' while attempting to activate 'GoldFlowAPI.Controllers.TaskController'.
Error Type: System.InvalidOperationException
File: 
Method: GetService
Line: 0
Line: line 29
Date: 23.01.2021 14:18:08
------------------------------------------------------------------------------


 (7ceeddfe)
2021-01-23T14:18:30.3769896-08:00 80000007-0003-ff00-b63f-84710c7967bb [ERR] 



------------------------------------------------------------------------------
Error Message: Unable to resolve service for type 'GoldFlowAPI.Services.ITaskService' while attempting to activate 'GoldFlowAPI.Controllers.TaskController'.
Error Type: System.InvalidOperationException
File: 
Method: GetService
Line: 0
Line: line 29
Date: 23.01.2021 14:18:30
------------------------------------------------------------------------------


 (ef8371ab)
2021-01-23T14:19:52.8617538-08:00  [INF] Application started. Press Ctrl+C to shut down. (dcaefe54)
2021-01-23T14:19:52.8701465-08:00  [INF] Hosting environment: "Development" (c3307c92)
2021-01-23T14:19:52.8722133-08:00  [INF] Content root path: "C:\Users\Viktor\source\repos\ProjectGoldFlow\GoldFlowAPI" (b5d60022)
2021-01-23T14:20:01.8719362-08:00 8000000b-0001-ff00-b63f-84710c7967bb [ERR] 



------------------------------------------------------------------------------
Error Message: Unable to resolve service for type 'GoldFlowAPI.Services.ITaskService' while attempting to activate 'GoldFlowAPI.Controllers.TaskController'.
Error Type: System.InvalidOperationException
File: 
Method: GetService
Line: 0
Line: line 29
Date: 23.01.2021 14:20:01
------------------------------------------------------------------------------


 (c89605af)
2021-01-23T14:26:29.4088591-08:00  [INF] Application started. Press Ctrl+C to shut down. (dcaefe54)
2021-01-23T14:26:29.4169970-08:00  [INF] Hosting environment: "Development" (c3307c92)
2021-01-23T14:26:29.4186345-08:00  [INF] Content root path: "C:\Users\Viktor\source\repos\ProjectGoldFlow\GoldFlowAPI" (b5d60022)
2021-01-23T14:26:39.2757687-08:00 8000000b-0003-ff00-b63f-84710c7967bb [ERR] 



------------------------------------------------------------------------------
Error Message: Unable to resolve service for type 'GoldFlowAPI.Services.ITaskService' while attempting to activate 'GoldFlowAPI.Controllers.TaskController'.
Error Type: System.InvalidOperationException
File: 
Method: GetService
Line: 0
Line: line 29
Date: 23.01.2021 14:26:39
------------------------------------------------------------------------------


 (caa795be)
2021-01-23T14:40:25.2251849-08:00  [INF] Application started. Press Ctrl+C to shut down. (dcaefe54)
2021-01-23T14:40:25.2371516-08:00  [INF] Hosting environment: "Development" (c3307c92)
2021-01-23T14:40:25.2396619-08:00  [INF] Content root path: "C:\Users\Viktor\source\repos\ProjectGoldFlow\GoldFlowAPI" (b5d60022)
2021-01-23T14:40:41.5119828-08:00 80000009-0004-ff00-b63f-84710c7967bb [ERR] 



------------------------------------------------------------------------------
Error Message: Unable to resolve service for type 'GoldFlowAPI.Services.ITaskService' while attempting to activate 'GoldFlowAPI.Controllers.TaskController'.
Error Type: System.InvalidOperationException
File: 
Method: GetService
Line: 0
Line: line 31
Date: 23.01.2021 14:40:41
------------------------------------------------------------------------------


 (3cb190b2)
2021-01-23T14:46:40.8203998-08:00  [INF] Application started. Press Ctrl+C to shut down. (dcaefe54)
2021-01-23T14:46:40.8448806-08:00  [INF] Hosting environment: "Development" (c3307c92)
2021-01-23T14:46:40.8473278-08:00  [INF] Content root path: "C:\Users\Viktor\source\repos\ProjectGoldFlow\GoldFlowAPI" (b5d60022)
2021-01-23T14:46:49.3512499-08:00 80000010-0001-ff00-b63f-84710c7967bb [ERR] 



------------------------------------------------------------------------------
Error Message: Unable to resolve service for type 'GoldFlowAPI.Services.ITaskService' while attempting to activate 'GoldFlowAPI.Controllers.TaskController'.
Error Type: System.InvalidOperationException
File: 
Method: GetService
Line: 0
Line: line 29
Date: 23.01.2021 14:46:49
------------------------------------------------------------------------------


 (e69ab81c)
2021-01-23T14:47:25.0041349-08:00 80000011-0001-ff00-b63f-84710c7967bb [ERR] 



------------------------------------------------------------------------------
Error Message: Unable to resolve service for type 'GoldFlowAPI.Services.ITaskService' while attempting to activate 'GoldFlowAPI.Controllers.TaskController'.
Error Type: System.InvalidOperationException
File: 
Method: GetService
Line: 0
Line: line 29
Date: 23.01.2021 14:47:24
------------------------------------------------------------------------------


 (76090d30)
2021-01-23T15:16:22.5653854-08:00  [INF] Application started. Press Ctrl+C to shut down. (dcaefe54)
2021-01-23T15:16:22.5724865-08:00  [INF] Hosting environment: "Development" (c3307c92)
2021-01-23T15:16:22.5740679-08:00  [INF] Content root path: "C:\Users\Viktor\source\repos\ProjectGoldFlow\GoldFlowAPI" (b5d60022)
2021-01-23T15:16:28.0824828-08:00 8000000d-0004-ff00-b63f-84710c7967bb [ERR] 



------------------------------------------------------------------------------
Error Message: Unable to resolve service for type 'GoldFlowAPI.Services.ITaskService' while attempting to activate 'GoldFlowAPI.Controllers.TaskController'.
Error Type: System.InvalidOperationException
File: 
Method: GetService
Line: 0
Line: line 29
Date: 23.01.2021 15:16:28
------------------------------------------------------------------------------


 (3cf0a53c)
