2021-02-02T13:25:58.0930374-08:00  [INF] Application started. Press Ctrl+C to shut down. (dcaefe54)
2021-02-02T13:25:58.1035171-08:00  [INF] Hosting environment: "Development" (c3307c92)
2021-02-02T13:25:58.1053328-08:00  [INF] Content root path: "C:\Users\Viktor\source\repos\ProjectGoldFlow\GoldFlowAPI" (b5d60022)
2021-02-02T13:27:06.3611962-08:00 8000003b-0000-fd00-b63f-84710c7967bb [ERR] 



------------------------------------------------------------------------------
Error Message: 535: 5.7.3 Authentication unsuccessful [VI1PR02CA0046.eurprd02.prod.outlook.com]
Error Type: MailKit.Security.AuthenticationException
File: 
Method: MoveNext
Line: 0
Line: line 29
Date: 02.02.2021 13:27:06
------------------------------------------------------------------------------


 (bf63b6e8)
2021-02-02T13:29:28.6590214-08:00  [INF] Application started. Press Ctrl+C to shut down. (dcaefe54)
2021-02-02T13:29:28.6672166-08:00  [INF] Hosting environment: "Development" (c3307c92)
2021-02-02T13:29:28.6689323-08:00  [INF] Content root path: "C:\Users\Viktor\source\repos\ProjectGoldFlow\GoldFlowAPI" (b5d60022)
2021-02-02T13:30:12.3933869-08:00 80000050-0002-ff00-b63f-84710c7967bb [ERR] 



------------------------------------------------------------------------------
Error Message: 5.7.57 SMTP; Client was not authenticated to send anonymous mail during MAIL FROM [VI1PR04CA0091.eurprd04.prod.outlook.com]
Error Type: MailKit.ServiceNotAuthenticatedException
File: 
Method: ProcessMailFromResponse
Line: 0
Line: line 29
Date: 02.02.2021 13:30:12
------------------------------------------------------------------------------


 (7dc3d42c)
2021-02-02T13:31:18.7759968-08:00  [INF] Application started. Press Ctrl+C to shut down. (dcaefe54)
2021-02-02T13:31:18.7836768-08:00  [INF] Hosting environment: "Development" (c3307c92)
2021-02-02T13:31:18.7853056-08:00  [INF] Content root path: "C:\Users\Viktor\source\repos\ProjectGoldFlow\GoldFlowAPI" (b5d60022)
2021-02-02T14:00:12.0160965-08:00  [INF] Application started. Press Ctrl+C to shut down. (dcaefe54)
2021-02-02T14:00:12.0265926-08:00  [INF] Hosting environment: "Development" (c3307c92)
2021-02-02T14:00:12.0281109-08:00  [INF] Content root path: "C:\Users\Viktor\source\repos\ProjectGoldFlow\GoldFlowAPI" (b5d60022)
2021-02-02T14:01:20.2656801-08:00 80000048-0005-ff00-b63f-84710c7967bb [ERR] 



------------------------------------------------------------------------------
Error Message: Deserialization of reference types without parameterless constructor is not supported. Type 'MimeKit.InternetAddress'
Error Type: System.NotSupportedException
File: 
Method: ThrowNotSupportedException_DeserializeCreateObjectDelegateIsNull
Line: 0
Line: line 29
Date: 02.02.2021 14:01:20
------------------------------------------------------------------------------


 (898d7122)
2021-02-02T14:03:25.0197220-08:00  [INF] Application started. Press Ctrl+C to shut down. (dcaefe54)
2021-02-02T14:03:25.0269849-08:00  [INF] Hosting environment: "Development" (c3307c92)
2021-02-02T14:03:25.0287350-08:00  [INF] Content root path: "C:\Users\Viktor\source\repos\ProjectGoldFlow\GoldFlowAPI" (b5d60022)
2021-02-02T14:05:11.4501639-08:00 8000003b-0003-fd00-b63f-84710c7967bb [ERR] 



------------------------------------------------------------------------------
Error Message: Deserialization of reference types without parameterless constructor is not supported. Type 'MimeKit.MailboxAddress'
Error Type: System.NotSupportedException
File: 
Method: ThrowNotSupportedException_DeserializeCreateObjectDelegateIsNull
Line: 0
Line: line 29
Date: 02.02.2021 14:05:11
------------------------------------------------------------------------------


 (915cfdcf)
2021-02-02T14:18:52.5766341-08:00  [INF] Application started. Press Ctrl+C to shut down. (dcaefe54)
2021-02-02T14:18:52.5832868-08:00  [INF] Hosting environment: "Development" (c3307c92)
2021-02-02T14:18:52.5848992-08:00  [INF] Content root path: "C:\Users\Viktor\source\repos\ProjectGoldFlow\GoldFlowAPI" (b5d60022)
2021-02-02T14:37:32.1860035-08:00  [INF] Application started. Press Ctrl+C to shut down. (dcaefe54)
2021-02-02T14:37:32.1935496-08:00  [INF] Hosting environment: "Development" (c3307c92)
2021-02-02T14:37:32.1954777-08:00  [INF] Content root path: "C:\Users\Viktor\source\repos\ProjectGoldFlow\GoldFlowAPI" (b5d60022)
2021-02-02T14:43:36.1743073-08:00  [INF] Application started. Press Ctrl+C to shut down. (dcaefe54)
2021-02-02T14:43:36.1830436-08:00  [INF] Hosting environment: "Development" (c3307c92)
2021-02-02T14:43:36.1847884-08:00  [INF] Content root path: "C:\Users\Viktor\source\repos\ProjectGoldFlow\GoldFlowAPI" (b5d60022)
2021-02-02T14:48:56.1046861-08:00  [INF] Application started. Press Ctrl+C to shut down. (dcaefe54)
2021-02-02T14:48:56.1123166-08:00  [INF] Hosting environment: "Development" (c3307c92)
2021-02-02T14:48:56.1138666-08:00  [INF] Content root path: "C:\Users\Viktor\source\repos\ProjectGoldFlow\GoldFlowAPI" (b5d60022)
2021-02-02T14:56:22.3141721-08:00  [INF] Application started. Press Ctrl+C to shut down. (dcaefe54)
2021-02-02T14:56:22.3223186-08:00  [INF] Hosting environment: "Development" (c3307c92)
2021-02-02T14:56:22.3239307-08:00  [INF] Content root path: "C:\Users\Viktor\source\repos\ProjectGoldFlow\GoldFlowAPI" (b5d60022)
2021-02-02T15:03:06.1031483-08:00  [INF] Application started. Press Ctrl+C to shut down. (dcaefe54)
2021-02-02T15:03:06.1111313-08:00  [INF] Hosting environment: "Development" (c3307c92)
2021-02-02T15:03:06.1129980-08:00  [INF] Content root path: "C:\Users\Viktor\source\repos\ProjectGoldFlow\GoldFlowAPI" (b5d60022)
2021-02-02T15:38:17.0267581-08:00  [INF] Application started. Press Ctrl+C to shut down. (dcaefe54)
2021-02-02T15:38:17.0351725-08:00  [INF] Hosting environment: "Development" (c3307c92)
2021-02-02T15:38:17.0373712-08:00  [INF] Content root path: "C:\Users\Viktor\source\repos\ProjectGoldFlow\GoldFlowAPI" (b5d60022)
2021-02-02T15:41:46.0178362-08:00  [INF] Application started. Press Ctrl+C to shut down. (dcaefe54)
2021-02-02T15:41:46.0262649-08:00  [INF] Hosting environment: "Development" (c3307c92)
2021-02-02T15:41:46.0277654-08:00  [INF] Content root path: "C:\Users\Viktor\source\repos\ProjectGoldFlow\GoldFlowAPI" (b5d60022)
2021-02-02T15:43:01.1896446-08:00  [INF] Application started. Press Ctrl+C to shut down. (dcaefe54)
2021-02-02T15:43:01.1978247-08:00  [INF] Hosting environment: "Development" (c3307c92)
2021-02-02T15:43:01.1996378-08:00  [INF] Content root path: "C:\Users\Viktor\source\repos\ProjectGoldFlow\GoldFlowAPI" (b5d60022)
2021-02-02T15:44:00.5238455-08:00 80000004-0006-fd00-b63f-84710c7967bb [ERR] 



------------------------------------------------------------------------------
Error Message: Error mapping types.

Mapping types:
CreateTaskDTO -> Task
DTOs.CreateTaskDTO -> GoldFlowAPI.Models.Task

Type Map configuration:
CreateTaskDTO -> Task
DTOs.CreateTaskDTO -> GoldFlowAPI.Models.Task

Destination Member:
TeamMemberId

Error Type: AutoMapper.AutoMapperMappingException
File: 
Method: lambda_method
Line: 0
Line: line 29
Date: 02.02.2021 15:44:00
------------------------------------------------------------------------------


 (eeb174fe)
2021-02-02T16:13:33.7388196-08:00  [INF] Application started. Press Ctrl+C to shut down. (dcaefe54)
2021-02-02T16:13:33.7485929-08:00  [INF] Hosting environment: "Development" (c3307c92)
2021-02-02T16:13:33.7503526-08:00  [INF] Content root path: "C:\Users\Viktor\source\repos\ProjectGoldFlow\GoldFlowAPI" (b5d60022)
2021-02-02T16:14:03.5935192-08:00 8000001c-0004-fd00-b63f-84710c7967bb [ERR] 



------------------------------------------------------------------------------
Error Message: Value cannot be null. (Parameter 'userName')
Error Type: System.ArgumentNullException
File: 
Method: AuthenticateAsync
Line: 0
Line: line 29
Date: 02.02.2021 16:14:03
------------------------------------------------------------------------------


 (c2e19074)
2021-02-02T16:15:20.1904737-08:00  [INF] Application started. Press Ctrl+C to shut down. (dcaefe54)
2021-02-02T16:15:20.1997870-08:00  [INF] Hosting environment: "Development" (c3307c92)
2021-02-02T16:15:20.2012851-08:00  [INF] Content root path: "C:\Users\Viktor\source\repos\ProjectGoldFlow\GoldFlowAPI" (b5d60022)
2021-02-02T16:16:55.3444641-08:00  [INF] Application started. Press Ctrl+C to shut down. (dcaefe54)
2021-02-02T16:16:55.3525758-08:00  [INF] Hosting environment: "Development" (c3307c92)
2021-02-02T16:16:55.3543926-08:00  [INF] Content root path: "C:\Users\Viktor\source\repos\ProjectGoldFlow\GoldFlowAPI" (b5d60022)
