2021-01-25T13:04:17.9025289-08:00  [INF] Application started. Press Ctrl+C to shut down. (dcaefe54)
2021-01-25T13:04:17.9131327-08:00  [INF] Hosting environment: "Development" (c3307c92)
2021-01-25T13:04:17.9155966-08:00  [INF] Content root path: "C:\Users\Viktor\source\repos\ProjectGoldFlow\GoldFlowAPI" (b5d60022)
2021-01-25T13:06:30.4874551-08:00  [INF] Application started. Press Ctrl+C to shut down. (dcaefe54)
2021-01-25T13:06:30.4965040-08:00  [INF] Hosting environment: "Development" (c3307c92)
2021-01-25T13:06:30.4980005-08:00  [INF] Content root path: "C:\Users\Viktor\source\repos\ProjectGoldFlow\GoldFlowAPI" (b5d60022)
2021-01-25T13:09:01.2876425-08:00  [INF] Application started. Press Ctrl+C to shut down. (dcaefe54)
2021-01-25T13:09:01.2960110-08:00  [INF] Hosting environment: "Development" (c3307c92)
2021-01-25T13:09:01.2977488-08:00  [INF] Content root path: "C:\Users\Viktor\source\repos\ProjectGoldFlow\GoldFlowAPI" (b5d60022)
2021-01-25T13:09:11.4015497-08:00 80000013-0003-ff00-b63f-84710c7967bb [ERR] 



------------------------------------------------------------------------------
Error Message: Incorrect input. Please check the mandatory fields!
Error Type: System.ArgumentException
File: C:\Users\Viktor\source\repos\ProjectGoldFlow\GoldFlowAPI\Controllers\UserController.cs
Method: MoveNext
Line: 57
Line: line 29
Date: 25.01.2021 13:09:11
------------------------------------------------------------------------------


 (e915a4e3)
2021-01-25T13:15:47.4981933-08:00  [INF] Application started. Press Ctrl+C to shut down. (dcaefe54)
2021-01-25T13:15:47.5060349-08:00  [INF] Hosting environment: "Development" (c3307c92)
2021-01-25T13:15:47.5075466-08:00  [INF] Content root path: "C:\Users\Viktor\source\repos\ProjectGoldFlow\GoldFlowAPI" (b5d60022)
2021-01-25T13:24:23.7536007-08:00  [INF] Application started. Press Ctrl+C to shut down. (dcaefe54)
2021-01-25T13:24:23.7612697-08:00  [INF] Hosting environment: "Development" (c3307c92)
2021-01-25T13:24:23.7630618-08:00  [INF] Content root path: "C:\Users\Viktor\source\repos\ProjectGoldFlow\GoldFlowAPI" (b5d60022)
2021-01-25T13:26:19.0480292-08:00  [INF] Application started. Press Ctrl+C to shut down. (dcaefe54)
2021-01-25T13:26:19.0565058-08:00  [INF] Hosting environment: "Development" (c3307c92)
2021-01-25T13:26:19.0580254-08:00  [INF] Content root path: "C:\Users\Viktor\source\repos\ProjectGoldFlow\GoldFlowAPI" (b5d60022)
2021-01-25T13:29:12.0331746-08:00  [INF] Application started. Press Ctrl+C to shut down. (dcaefe54)
2021-01-25T13:29:12.0428880-08:00  [INF] Hosting environment: "Development" (c3307c92)
2021-01-25T13:29:12.0446259-08:00  [INF] Content root path: "C:\Users\Viktor\source\repos\ProjectGoldFlow\GoldFlowAPI" (b5d60022)
2021-01-25T13:46:34.9342378-08:00  [INF] Application started. Press Ctrl+C to shut down. (dcaefe54)
2021-01-25T13:46:34.9422768-08:00  [INF] Hosting environment: "Development" (c3307c92)
2021-01-25T13:46:34.9438813-08:00  [INF] Content root path: "C:\Users\Viktor\source\repos\ProjectGoldFlow\GoldFlowAPI" (b5d60022)
2021-01-25T13:51:52.3977308-08:00  [INF] Application started. Press Ctrl+C to shut down. (dcaefe54)
2021-01-25T13:51:52.4056445-08:00  [INF] Hosting environment: "Development" (c3307c92)
2021-01-25T13:51:52.4072283-08:00  [INF] Content root path: "C:\Users\Viktor\source\repos\ProjectGoldFlow\GoldFlowAPI" (b5d60022)
2021-01-25T13:54:02.0473143-08:00  [INF] Application started. Press Ctrl+C to shut down. (dcaefe54)
2021-01-25T13:54:02.0559065-08:00  [INF] Hosting environment: "Development" (c3307c92)
2021-01-25T13:54:02.0573405-08:00  [INF] Content root path: "C:\Users\Viktor\source\repos\ProjectGoldFlow\GoldFlowAPI" (b5d60022)
2021-01-25T14:00:04.0238580-08:00  [INF] Application started. Press Ctrl+C to shut down. (dcaefe54)
2021-01-25T14:00:04.0316343-08:00  [INF] Hosting environment: "Development" (c3307c92)
2021-01-25T14:00:04.0333435-08:00  [INF] Content root path: "C:\Users\Viktor\source\repos\ProjectGoldFlow\GoldFlowAPI" (b5d60022)
2021-01-25T14:00:21.2949632-08:00  [INF] Application started. Press Ctrl+C to shut down. (dcaefe54)
2021-01-25T14:00:21.3034980-08:00  [INF] Hosting environment: "Development" (c3307c92)
2021-01-25T14:00:21.3050089-08:00  [INF] Content root path: "C:\Users\Viktor\source\repos\ProjectGoldFlow\GoldFlowAPI" (b5d60022)
2021-01-25T14:03:16.7846138-08:00 80000004-0000-fd00-b63f-84710c7967bb [ERR] 



------------------------------------------------------------------------------
Error Message: Object reference not set to an instance of an object.
Error Type: System.NullReferenceException
File: C:\Users\Viktor\source\repos\ProjectGoldFlow\GoldFlowAPI\Controllers\UserController.cs
Method: MoveNext
Line: 51
Line: line 29
Date: 25.01.2021 14:03:16
------------------------------------------------------------------------------


 (03add4cf)
2021-01-25T14:05:01.2871021-08:00  [INF] Application started. Press Ctrl+C to shut down. (dcaefe54)
2021-01-25T14:05:01.2946848-08:00  [INF] Hosting environment: "Development" (c3307c92)
2021-01-25T14:05:01.2961606-08:00  [INF] Content root path: "C:\Users\Viktor\source\repos\ProjectGoldFlow\GoldFlowAPI" (b5d60022)
2021-01-25T14:06:22.1536290-08:00 80000025-0001-ff00-b63f-84710c7967bb [ERR] 



------------------------------------------------------------------------------
Error Message: Object reference not set to an instance of an object.
Error Type: System.NullReferenceException
File: C:\Users\Viktor\source\repos\ProjectGoldFlow\GoldFlowAPI\Controllers\UserController.cs
Method: MoveNext
Line: 51
Line: line 29
Date: 25.01.2021 14:06:22
------------------------------------------------------------------------------


 (d9c9c6b4)
2021-01-25T14:09:45.6561387-08:00  [INF] Application started. Press Ctrl+C to shut down. (dcaefe54)
2021-01-25T14:09:45.6647645-08:00  [INF] Hosting environment: "Development" (c3307c92)
2021-01-25T14:09:45.6669104-08:00  [INF] Content root path: "C:\Users\Viktor\source\repos\ProjectGoldFlow\GoldFlowAPI" (b5d60022)
2021-01-25T14:13:53.5368948-08:00  [INF] Application started. Press Ctrl+C to shut down. (dcaefe54)
2021-01-25T14:13:53.5475931-08:00  [INF] Hosting environment: "Development" (c3307c92)
2021-01-25T14:13:53.5494660-08:00  [INF] Content root path: "C:\Users\Viktor\source\repos\ProjectGoldFlow\GoldFlowAPI" (b5d60022)
2021-01-25T14:16:56.5957571-08:00  [INF] Application started. Press Ctrl+C to shut down. (dcaefe54)
2021-01-25T14:16:56.6091962-08:00  [INF] Hosting environment: "Development" (c3307c92)
2021-01-25T14:16:56.6113258-08:00  [INF] Content root path: "C:\Users\Viktor\source\repos\ProjectGoldFlow\GoldFlowAPI" (b5d60022)
2021-01-25T14:17:25.5523748-08:00  [INF] Application started. Press Ctrl+C to shut down. (dcaefe54)
2021-01-25T14:17:25.5611386-08:00  [INF] Hosting environment: "Development" (c3307c92)
2021-01-25T14:17:25.5633497-08:00  [INF] Content root path: "C:\Users\Viktor\source\repos\ProjectGoldFlow\GoldFlowAPI" (b5d60022)
2021-01-25T14:19:30.3391781-08:00  [INF] Application started. Press Ctrl+C to shut down. (dcaefe54)
2021-01-25T14:19:30.3478395-08:00  [INF] Hosting environment: "Development" (c3307c92)
2021-01-25T14:19:30.3492812-08:00  [INF] Content root path: "C:\Users\Viktor\source\repos\ProjectGoldFlow\GoldFlowAPI" (b5d60022)
2021-01-25T14:23:38.3848338-08:00  [INF] Application started. Press Ctrl+C to shut down. (dcaefe54)
2021-01-25T14:23:38.3958315-08:00  [INF] Hosting environment: "Development" (c3307c92)
2021-01-25T14:23:38.3977164-08:00  [INF] Content root path: "C:\Users\Viktor\source\repos\ProjectGoldFlow\GoldFlowAPI" (b5d60022)
2021-01-25T16:04:36.7932196-08:00  [INF] Application started. Press Ctrl+C to shut down. (dcaefe54)
2021-01-25T16:04:36.8051533-08:00  [INF] Hosting environment: "Development" (c3307c92)
2021-01-25T16:04:36.8082318-08:00  [INF] Content root path: "C:\Users\Viktor\source\repos\ProjectGoldFlow\GoldFlowAPI" (b5d60022)
2021-01-25T16:10:14.3340006-08:00  [INF] Application started. Press Ctrl+C to shut down. (dcaefe54)
2021-01-25T16:10:14.3523130-08:00  [INF] Hosting environment: "Development" (c3307c92)
2021-01-25T16:10:14.3555646-08:00  [INF] Content root path: "C:\Users\Viktor\source\repos\ProjectGoldFlow\GoldFlowAPI" (b5d60022)
2021-01-25T16:12:20.3535111-08:00 80000011-0000-fd00-b63f-84710c7967bb [ERR] 



------------------------------------------------------------------------------
Error Message: One or more errors occurred. (The input is not a valid Base-64 string as it contains a non-base 64 character, more than two padding characters, or an illegal character among the padding characters.)
Error Type: System.AggregateException
File: 
Method: ThrowIfExceptional
Line: 0
Line: line 29
Date: 25.01.2021 16:12:20
------------------------------------------------------------------------------


 (16b821ce)
2021-01-25T18:16:34.5654996-08:00  [INF] Application started. Press Ctrl+C to shut down. (dcaefe54)
2021-01-25T18:16:34.5725686-08:00  [INF] Hosting environment: "Development" (c3307c92)
2021-01-25T18:16:34.5740510-08:00  [INF] Content root path: "C:\Users\Viktor\source\repos\ProjectGoldFlow\GoldFlowAPI" (b5d60022)
2021-01-25T18:18:28.5067107-08:00  [INF] Application started. Press Ctrl+C to shut down. (dcaefe54)
2021-01-25T18:18:28.5154329-08:00  [INF] Hosting environment: "Development" (c3307c92)
2021-01-25T18:18:28.5170876-08:00  [INF] Content root path: "C:\Users\Viktor\source\repos\ProjectGoldFlow\GoldFlowAPI" (b5d60022)
2021-01-25T18:21:06.9225833-08:00 80000012-0002-ff00-b63f-84710c7967bb [ERR] 



------------------------------------------------------------------------------
Error Message: One or more errors occurred. (Input string was not in a correct format.)
Error Type: System.AggregateException
File: 
Method: ThrowIfExceptional
Line: 0
Line: line 29
Date: 25.01.2021 18:21:06
------------------------------------------------------------------------------


 (ccc4f075)
2021-01-25T18:21:58.9010413-08:00 80000013-0002-ff00-b63f-84710c7967bb [ERR] 



------------------------------------------------------------------------------
Error Message: One or more errors occurred. (Input string was not in a correct format.)
Error Type: System.AggregateException
File: 
Method: ThrowIfExceptional
Line: 0
Line: line 29
Date: 25.01.2021 18:21:58
------------------------------------------------------------------------------


 (e37cc7c0)
2021-01-25T18:22:27.5277747-08:00 80000014-0002-ff00-b63f-84710c7967bb [ERR] 



------------------------------------------------------------------------------
Error Message: One or more errors occurred. (Input string was not in a correct format.)
Error Type: System.AggregateException
File: 
Method: ThrowIfExceptional
Line: 0
Line: line 29
Date: 25.01.2021 18:22:27
------------------------------------------------------------------------------


 (a067475a)
2021-01-25T18:23:20.9491332-08:00 80000015-0002-ff00-b63f-84710c7967bb [ERR] 



------------------------------------------------------------------------------
Error Message: One or more errors occurred. (Input string was not in a correct format.)
Error Type: System.AggregateException
File: 
Method: ThrowIfExceptional
Line: 0
Line: line 29
Date: 25.01.2021 18:23:20
------------------------------------------------------------------------------


 (3c141daf)
2021-01-25T18:23:24.7585461-08:00 80000016-0002-ff00-b63f-84710c7967bb [ERR] 



------------------------------------------------------------------------------
Error Message: One or more errors occurred. (Input string was not in a correct format.)
Error Type: System.AggregateException
File: 
Method: ThrowIfExceptional
Line: 0
Line: line 29
Date: 25.01.2021 18:23:24
------------------------------------------------------------------------------


 (7d027b2e)
2021-01-25T18:24:08.2429428-08:00 80000017-0002-ff00-b63f-84710c7967bb [ERR] 



------------------------------------------------------------------------------
Error Message: One or more errors occurred. (Input string was not in a correct format.)
Error Type: System.AggregateException
File: 
Method: ThrowIfExceptional
Line: 0
Line: line 29
Date: 25.01.2021 18:24:08
------------------------------------------------------------------------------


 (d476084f)
2021-01-25T18:25:39.6840922-08:00  [INF] Application started. Press Ctrl+C to shut down. (dcaefe54)
2021-01-25T18:25:39.6921023-08:00  [INF] Hosting environment: "Development" (c3307c92)
2021-01-25T18:25:39.6938104-08:00  [INF] Content root path: "C:\Users\Viktor\source\repos\ProjectGoldFlow\GoldFlowAPI" (b5d60022)
2021-01-25T18:26:22.1410386-08:00 80000031-0001-ff00-b63f-84710c7967bb [ERR] 



------------------------------------------------------------------------------
Error Message: Error mapping types.

Mapping types:
CreateProjectDTO -> Project
DTOs.CreateProjectDTO -> GoldFlowAPI.Models.Project

Type Map configuration:
CreateProjectDTO -> Project
DTOs.CreateProjectDTO -> GoldFlowAPI.Models.Project

Destination Member:
ManagerId

Error Type: AutoMapper.AutoMapperMappingException
File: 
Method: lambda_method
Line: 0
Line: line 29
Date: 25.01.2021 18:26:22
------------------------------------------------------------------------------


 (6247e8f3)
2021-01-25T19:03:22.0853390-08:00  [INF] Application started. Press Ctrl+C to shut down. (dcaefe54)
2021-01-25T19:03:22.0923061-08:00  [INF] Hosting environment: "Development" (c3307c92)
2021-01-25T19:03:22.0945626-08:00  [INF] Content root path: "C:\Users\Viktor\source\repos\ProjectGoldFlow\GoldFlowAPI" (b5d60022)
2021-01-25T19:04:05.0807734-08:00 80000012-0006-ff00-b63f-84710c7967bb [ERR] 



------------------------------------------------------------------------------
Error Message: One or more errors occurred. (Input string was not in a correct format.)
Error Type: System.AggregateException
File: 
Method: ThrowIfExceptional
Line: 0
Line: line 29
Date: 25.01.2021 19:04:05
------------------------------------------------------------------------------


 (567dd020)
2021-01-25T19:07:33.4287761-08:00  [INF] Application started. Press Ctrl+C to shut down. (dcaefe54)
2021-01-25T19:07:33.4368794-08:00  [INF] Hosting environment: "Development" (c3307c92)
2021-01-25T19:07:33.4387125-08:00  [INF] Content root path: "C:\Users\Viktor\source\repos\ProjectGoldFlow\GoldFlowAPI" (b5d60022)
2021-01-25T19:07:49.3524583-08:00 80000009-0003-fd00-b63f-84710c7967bb [ERR] 



------------------------------------------------------------------------------
Error Message: One or more errors occurred. (Input string was not in a correct format.)
Error Type: System.AggregateException
File: 
Method: ThrowIfExceptional
Line: 0
Line: line 29
Date: 25.01.2021 19:07:49
------------------------------------------------------------------------------


 (44d3d620)
2021-01-25T19:11:10.9507887-08:00 80000008-0005-ff00-b63f-84710c7967bb [ERR] 



------------------------------------------------------------------------------
Error Message: One or more errors occurred. (Input string was not in a correct format.)
Error Type: System.AggregateException
File: 
Method: ThrowIfExceptional
Line: 0
Line: line 29
Date: 25.01.2021 19:11:10
------------------------------------------------------------------------------


 (4f0aef88)
2021-01-25T19:11:12.7455327-08:00 80000009-0005-ff00-b63f-84710c7967bb [ERR] 



------------------------------------------------------------------------------
Error Message: One or more errors occurred. (Input string was not in a correct format.)
Error Type: System.AggregateException
File: 
Method: ThrowIfExceptional
Line: 0
Line: line 29
Date: 25.01.2021 19:11:12
------------------------------------------------------------------------------


 (a22c9ef6)
2021-01-25T19:11:13.5112594-08:00 8000000a-0005-ff00-b63f-84710c7967bb [ERR] 



------------------------------------------------------------------------------
Error Message: One or more errors occurred. (Input string was not in a correct format.)
Error Type: System.AggregateException
File: 
Method: ThrowIfExceptional
Line: 0
Line: line 29
Date: 25.01.2021 19:11:13
------------------------------------------------------------------------------


 (ac0b4bc0)
2021-01-25T19:11:14.2302225-08:00 8000000b-0005-ff00-b63f-84710c7967bb [ERR] 



------------------------------------------------------------------------------
Error Message: One or more errors occurred. (Input string was not in a correct format.)
Error Type: System.AggregateException
File: 
Method: ThrowIfExceptional
Line: 0
Line: line 29
Date: 25.01.2021 19:11:14
------------------------------------------------------------------------------


 (b85a1752)
2021-01-25T19:14:39.4334406-08:00  [INF] Application started. Press Ctrl+C to shut down. (dcaefe54)
2021-01-25T19:14:39.4421761-08:00  [INF] Hosting environment: "Development" (c3307c92)
2021-01-25T19:14:39.4435507-08:00  [INF] Content root path: "C:\Users\Viktor\source\repos\ProjectGoldFlow\GoldFlowAPI" (b5d60022)
2021-01-25T19:14:54.9825894-08:00 80000036-0001-ff00-b63f-84710c7967bb [ERR] 



------------------------------------------------------------------------------
Error Message: One or more errors occurred. (Input string was not in a correct format.)
Error Type: System.AggregateException
File: 
Method: ThrowIfExceptional
Line: 0
Line: line 29
Date: 25.01.2021 19:14:54
------------------------------------------------------------------------------


 (fe491b4f)
2021-01-25T19:17:20.0726656-08:00 80000016-0004-ff00-b63f-84710c7967bb [ERR] 



------------------------------------------------------------------------------
Error Message: One or more errors occurred. (The input is not a valid Base-64 string as it contains a non-base 64 character, more than two padding characters, or an illegal character among the padding characters.)
Error Type: System.AggregateException
File: 
Method: ThrowIfExceptional
Line: 0
Line: line 29
Date: 25.01.2021 19:17:20
------------------------------------------------------------------------------


 (8d8a1200)
2021-01-25T19:22:40.3032907-08:00  [INF] Application started. Press Ctrl+C to shut down. (dcaefe54)
2021-01-25T19:22:40.3132468-08:00  [INF] Hosting environment: "Development" (c3307c92)
2021-01-25T19:22:40.3149180-08:00  [INF] Content root path: "C:\Users\Viktor\source\repos\ProjectGoldFlow\GoldFlowAPI" (b5d60022)
2021-01-25T19:26:16.1967275-08:00  [INF] Application started. Press Ctrl+C to shut down. (dcaefe54)
2021-01-25T19:26:16.2048174-08:00  [INF] Hosting environment: "Development" (c3307c92)
2021-01-25T19:26:16.2063649-08:00  [INF] Content root path: "C:\Users\Viktor\source\repos\ProjectGoldFlow\GoldFlowAPI" (b5d60022)
2021-01-25T19:31:41.5225262-08:00  [INF] Application started. Press Ctrl+C to shut down. (dcaefe54)
2021-01-25T19:31:41.5310892-08:00  [INF] Hosting environment: "Development" (c3307c92)
2021-01-25T19:31:41.5327883-08:00  [INF] Content root path: "C:\Users\Viktor\source\repos\ProjectGoldFlow\GoldFlowAPI" (b5d60022)
2021-01-25T19:32:11.4541978-08:00 8000001d-0004-ff00-b63f-84710c7967bb [ERR] 



------------------------------------------------------------------------------
Error Message: One or more errors occurred. (The input is not a valid Base-64 string as it contains a non-base 64 character, more than two padding characters, or an illegal character among the padding characters.)
Error Type: System.AggregateException
File: 
Method: ThrowIfExceptional
Line: 0
Line: line 29
Date: 25.01.2021 19:32:11
------------------------------------------------------------------------------


 (a5014683)
2021-01-25T19:32:20.8025922-08:00 8000001e-0004-ff00-b63f-84710c7967bb [ERR] 



------------------------------------------------------------------------------
Error Message: One or more errors occurred. (Padding is invalid and cannot be removed.)
Error Type: System.AggregateException
File: 
Method: ThrowIfExceptional
Line: 0
Line: line 29
Date: 25.01.2021 19:32:20
------------------------------------------------------------------------------


 (5fce957c)
2021-01-25T19:32:25.4227379-08:00 8000001f-0004-ff00-b63f-84710c7967bb [ERR] 



------------------------------------------------------------------------------
Error Message: One or more errors occurred. (Padding is invalid and cannot be removed.)
Error Type: System.AggregateException
File: 
Method: ThrowIfExceptional
Line: 0
Line: line 29
Date: 25.01.2021 19:32:25
------------------------------------------------------------------------------


 (98f475db)
2021-01-25T19:32:27.8901814-08:00 80000020-0004-ff00-b63f-84710c7967bb [ERR] 



------------------------------------------------------------------------------
Error Message: One or more errors occurred. (Padding is invalid and cannot be removed.)
Error Type: System.AggregateException
File: 
Method: ThrowIfExceptional
Line: 0
Line: line 29
Date: 25.01.2021 19:32:27
------------------------------------------------------------------------------


 (ba545e3c)
2021-01-25T19:39:04.9336151-08:00  [INF] Application started. Press Ctrl+C to shut down. (dcaefe54)
2021-01-25T19:39:04.9438054-08:00  [INF] Hosting environment: "Development" (c3307c92)
2021-01-25T19:39:04.9451978-08:00  [INF] Content root path: "C:\Users\Viktor\source\repos\ProjectGoldFlow\GoldFlowAPI" (b5d60022)
2021-01-25T19:41:33.0468789-08:00  [INF] Application started. Press Ctrl+C to shut down. (dcaefe54)
2021-01-25T19:41:33.0691041-08:00  [INF] Hosting environment: "Development" (c3307c92)
2021-01-25T19:41:33.0718384-08:00  [INF] Content root path: "C:\Users\Viktor\source\repos\ProjectGoldFlow\GoldFlowAPI" (b5d60022)
