2021-02-01T14:05:08.8703864-08:00  [INF] Application started. Press Ctrl+C to shut down. (dcaefe54)
2021-02-01T14:05:08.8793569-08:00  [INF] Hosting environment: "Development" (c3307c92)
2021-02-01T14:05:08.8811284-08:00  [INF] Content root path: "C:\Users\Viktor\source\repos\ProjectGoldFlow\GoldFlowAPI" (b5d60022)
2021-02-01T15:37:19.7068827-08:00  [INF] Application started. Press Ctrl+C to shut down. (dcaefe54)
2021-02-01T15:37:19.7192395-08:00  [INF] Hosting environment: "Development" (c3307c92)
2021-02-01T15:37:19.7215940-08:00  [INF] Content root path: "C:\Users\Viktor\source\repos\ProjectGoldFlow\GoldFlowAPI" (b5d60022)
2021-02-01T16:08:32.1420984-08:00  [INF] Application started. Press Ctrl+C to shut down. (dcaefe54)
2021-02-01T16:08:32.1500024-08:00  [INF] Hosting environment: "Development" (c3307c92)
2021-02-01T16:08:32.1515668-08:00  [INF] Content root path: "C:\Users\Viktor\source\repos\ProjectGoldFlow\GoldFlowAPI" (b5d60022)
2021-02-01T16:24:13.9468033-08:00  [INF] Application started. Press Ctrl+C to shut down. (dcaefe54)
2021-02-01T16:24:13.9546502-08:00  [INF] Hosting environment: "Development" (c3307c92)
2021-02-01T16:24:13.9562533-08:00  [INF] Content root path: "C:\Users\Viktor\source\repos\ProjectGoldFlow\GoldFlowAPI" (b5d60022)
