2021-01-29T14:35:30.8930246-08:00  [INF] Application started. Press Ctrl+C to shut down. (dcaefe54)
2021-01-29T14:35:30.9016408-08:00  [INF] Hosting environment: "Development" (c3307c92)
2021-01-29T14:35:30.9036812-08:00  [INF] Content root path: "C:\Users\Viktor\source\repos\ProjectGoldFlow\GoldFlowAPI" (b5d60022)
2021-01-29T14:57:00.4983118-08:00  [INF] Application started. Press Ctrl+C to shut down. (dcaefe54)
2021-01-29T14:57:00.5058699-08:00  [INF] Hosting environment: "Development" (c3307c92)
2021-01-29T14:57:00.5075100-08:00  [INF] Content root path: "C:\Users\Viktor\source\repos\ProjectGoldFlow\GoldFlowAPI" (b5d60022)
