<svg width="2" height="166" viewBox="0 0 2 166" fill="none" xmlns="http://www.w3.org/2000/svg">
<g id="Vector 1665">
<path d="M1 1L0.999993 165" stroke="white" stroke-width="2" stroke-linecap="round" stroke-dasharray="4 4"/>
<path d="M1 1L0.999993 165" stroke="white" stroke-width="2" stroke-linecap="round" stroke-dasharray="4 4"/>
</g>
</svg>
