<svg width="6" height="7" viewBox="0 0 6 7" fill="none" xmlns="http://www.w3.org/2000/svg">
<path d="M4.165 1.86321C5.34538 2.5447 5.93557 2.88545 5.99337 3.38506C6.00221 3.46143 6.00221 3.53857 5.99337 3.61494C5.93557 4.11455 5.34538 4.4553 4.165 5.13679L3.085 5.76033C1.90462 6.44182 1.31443 6.78256 0.852852 6.58282C0.782295 6.55228 0.715495 6.51372 0.653775 6.46788C0.25 6.16801 0.25 5.48652 0.25 4.12354L0.25 2.87646C0.25 1.51348 0.25 0.831989 0.653775 0.532119C0.715495 0.486281 0.782296 0.447714 0.852852 0.417182C1.31443 0.217437 1.90462 0.558183 3.085 1.23967L4.165 1.86321Z" fill="#0665FD"/>
<path d="M4.165 1.86321C5.34538 2.5447 5.93557 2.88545 5.99337 3.38506C6.00221 3.46143 6.00221 3.53857 5.99337 3.61494C5.93557 4.11455 5.34538 4.4553 4.165 5.13679L3.085 5.76033C1.90462 6.44182 1.31443 6.78256 0.852852 6.58282C0.782295 6.55228 0.715495 6.51372 0.653775 6.46788C0.25 6.16801 0.25 5.48652 0.25 4.12354L0.25 2.87646C0.25 1.51348 0.25 0.831989 0.653775 0.532119C0.715495 0.486281 0.782296 0.447714 0.852852 0.417182C1.31443 0.217437 1.90462 0.558183 3.085 1.23967L4.165 1.86321Z" fill="#0665FD"/>
<path d="M4.165 1.86321C5.34538 2.5447 5.93557 2.88545 5.99337 3.38506C6.00221 3.46143 6.00221 3.53857 5.99337 3.61494C5.93557 4.11455 5.34538 4.4553 4.165 5.13679L3.085 5.76033C1.90462 6.44182 1.31443 6.78256 0.852852 6.58282C0.782295 6.55228 0.715495 6.51372 0.653775 6.46788C0.25 6.16801 0.25 5.48652 0.25 4.12354L0.25 2.87646C0.25 1.51348 0.25 0.831989 0.653775 0.532119C0.715495 0.486281 0.782296 0.447714 0.852852 0.417182C1.31443 0.217437 1.90462 0.558183 3.085 1.23967L4.165 1.86321Z" fill="#0665FD"/>
</svg>
