{
  "compilerOptions": {
    "baseUrl": "./",
    "module": "commonjs",
    "target": "es6",
    "allowSyntheticDefaultImports": true,
    "paths": {
      "@/*": ["./src/*"],
      "@components/*": ["./src/components/*"]
    }
  },
  "include": ["src/**/*"]
}
