// Jest Snapshot v1, https://goo.gl/fbAQLP

exports[`should render header correctly 1`] = `
<header
  className="header"
>
  <div
    className="content-container"
  >
    <div
      className="header__content"
    >
      <Link
        className="header__title"
        to="/dashboard"
      >
        <h1>
          Boilerplate
        </h1>
      </Link>
      <button
        className="button button--link"
        id="logout"
        onClick={[Function]}
      >
        Logout
      </button>
    </div>
  </div>
</header>
`;
