%TF.GenerationSoftware,KiCad,Pcbnew,5.1.10-1.fc34*%
%TF.CreationDate,2021-06-08T11:44:03-04:00*%
%TF.ProjectId,BREAD_Slice,42524541-445f-4536-9c69-63652e6b6963,rev?*%
%TF.SameCoordinates,Original*%
%TF.FileFunction,Copper,L1,Top*%
%TF.FilePolarity,Positive*%
%FSLAX46Y46*%
G04 Gerber Fmt 4.6, Leading zero omitted, Abs format (unit mm)*
G04 Created by KiCad (PCBNEW 5.1.10-1.fc34) date 2021-06-08 11:44:03*
%MOMM*%
%LPD*%
G01*
G04 APERTURE LIST*
%TA.AperFunction,ComponentPad*%
%ADD10O,1.800000X1.275000*%
%TD*%
%TA.AperFunction,ComponentPad*%
%ADD11R,1.800000X1.275000*%
%TD*%
%TA.AperFunction,ComponentPad*%
%ADD12C,3.000000*%
%TD*%
%TA.AperFunction,ComponentPad*%
%ADD13C,2.000000*%
%TD*%
%TA.AperFunction,ComponentPad*%
%ADD14C,1.440000*%
%TD*%
%TA.AperFunction,ComponentPad*%
%ADD15C,2.400000*%
%TD*%
%TA.AperFunction,ComponentPad*%
%ADD16C,2.100000*%
%TD*%
%TA.AperFunction,ComponentPad*%
%ADD17R,2.100000X2.100000*%
%TD*%
%TA.AperFunction,ComponentPad*%
%ADD18O,1.800000X1.800000*%
%TD*%
%TA.AperFunction,ComponentPad*%
%ADD19R,1.800000X1.800000*%
%TD*%
%TA.AperFunction,ComponentPad*%
%ADD20C,1.900000*%
%TD*%
%TA.AperFunction,ComponentPad*%
%ADD21R,1.900000X2.000000*%
%TD*%
%TA.AperFunction,ComponentPad*%
%ADD22C,5.600000*%
%TD*%
%TA.AperFunction,ComponentPad*%
%ADD23R,1.600000X1.600000*%
%TD*%
%TA.AperFunction,ComponentPad*%
%ADD24O,1.600000X1.600000*%
%TD*%
%TA.AperFunction,ComponentPad*%
%ADD25R,1.700000X1.700000*%
%TD*%
%TA.AperFunction,ComponentPad*%
%ADD26O,1.700000X1.700000*%
%TD*%
%TA.AperFunction,ViaPad*%
%ADD27C,0.800000*%
%TD*%
%TA.AperFunction,Conductor*%
%ADD28C,0.500000*%
%TD*%
G04 APERTURE END LIST*
D10*
%TO.P,U1,5*%
%TO.N,GND*%
X174670000Y-56811000D03*
%TO.P,U1,4*%
%TO.N,Net-(R4-Pad1)*%
X174670000Y-55111000D03*
%TO.P,U1,3*%
%TO.N,GND*%
X174670000Y-53411000D03*
%TO.P,U1,2*%
%TO.N,Net-(D4-Pad1)*%
X174670000Y-51711000D03*
D11*
%TO.P,U1,1*%
%TO.N,Net-(C4-Pad1)*%
X174670000Y-50011000D03*
%TD*%
D12*
%TO.P,TP1,1*%
%TO.N,GND*%
X186735000Y-64489000D03*
%TD*%
%TO.P,TP2,1*%
%TO.N,Net-(RV1-Pad2)*%
X186735000Y-85253500D03*
%TD*%
D13*
%TO.P,TH1,2*%
%TO.N,Net-(R6-Pad2)*%
X186735000Y-109591000D03*
%TO.P,TH1,1*%
%TO.N,GND*%
X186735000Y-118591000D03*
%TD*%
D14*
%TO.P,RV1,3*%
%TO.N,GND*%
X186925500Y-72934500D03*
%TO.P,RV1,2*%
%TO.N,Net-(RV1-Pad2)*%
X186925500Y-75474500D03*
%TO.P,RV1,1*%
%TO.N,VCC*%
X186925500Y-78014500D03*
%TD*%
D15*
%TO.P,L1,2*%
%TO.N,Net-(D4-Pad1)*%
X164764000Y-49917000D03*
%TO.P,L1,1*%
%TO.N,VCC*%
X164764000Y-59917000D03*
%TD*%
D16*
%TO.P,J3,2*%
%TO.N,GND*%
X185719000Y-98525000D03*
D17*
%TO.P,J3,1*%
%TO.N,Net-(C6-Pad1)*%
X185719000Y-95985000D03*
%TD*%
D16*
%TO.P,J2,2*%
%TO.N,GND*%
X186354000Y-53313000D03*
D17*
%TO.P,J2,1*%
%TO.N,Net-(C4-Pad1)*%
X186354000Y-50773000D03*
%TD*%
D18*
%TO.P,D4,2*%
%TO.N,GND*%
X154858000Y-43153000D03*
D19*
%TO.P,D4,1*%
%TO.N,Net-(D4-Pad1)*%
X154858000Y-50773000D03*
%TD*%
D20*
%TO.P,D3,2*%
%TO.N,Net-(D3-Pad2)*%
X157398000Y-77189000D03*
D21*
%TO.P,D3,1*%
%TO.N,/PG*%
X154858000Y-77189000D03*
%TD*%
D20*
%TO.P,D2,2*%
%TO.N,Net-(D2-Pad2)*%
X149143000Y-77316000D03*
D21*
%TO.P,D2,1*%
%TO.N,/DONE*%
X146603000Y-77316000D03*
%TD*%
D20*
%TO.P,D1,2*%
%TO.N,Net-(D1-Pad2)*%
X140634000Y-77316000D03*
D21*
%TO.P,D1,1*%
%TO.N,/CHG*%
X138094000Y-77316000D03*
%TD*%
D22*
%TO.P,H4,1*%
%TO.N,N/C*%
X187600000Y-134800000D03*
%TD*%
%TO.P,H3,1*%
%TO.N,N/C*%
X127600000Y-134800000D03*
%TD*%
%TO.P,H2,1*%
%TO.N,N/C*%
X187600000Y-44800000D03*
%TD*%
%TO.P,H1,1*%
%TO.N,N/C*%
X127600000Y-44800000D03*
%TD*%
D23*
%TO.P,A1,1*%
%TO.N,Net-(A1-Pad1)*%
X135000000Y-100000000D03*
D24*
%TO.P,A1,17*%
%TO.N,Net-(A1-Pad17)*%
X150240000Y-133020000D03*
%TO.P,A1,2*%
%TO.N,Net-(A1-Pad2)*%
X135000000Y-102540000D03*
%TO.P,A1,18*%
%TO.N,Net-(A1-Pad18)*%
X150240000Y-130480000D03*
%TO.P,A1,3*%
%TO.N,Net-(A1-Pad3)*%
X135000000Y-105080000D03*
%TO.P,A1,19*%
%TO.N,Net-(A1-Pad19)*%
X150240000Y-127940000D03*
%TO.P,A1,4*%
%TO.N,GND*%
X135000000Y-107620000D03*
%TO.P,A1,20*%
%TO.N,Net-(A1-Pad20)*%
X150240000Y-125400000D03*
%TO.P,A1,5*%
%TO.N,/E_STOP*%
X135000000Y-110160000D03*
%TO.P,A1,21*%
%TO.N,Net-(A1-Pad21)*%
X150240000Y-122860000D03*
%TO.P,A1,6*%
%TO.N,/INT*%
X135000000Y-112700000D03*
%TO.P,A1,22*%
%TO.N,Net-(A1-Pad22)*%
X150240000Y-120320000D03*
%TO.P,A1,7*%
%TO.N,/SYNC*%
X135000000Y-115240000D03*
%TO.P,A1,23*%
%TO.N,/I2C_DAT*%
X150240000Y-117780000D03*
%TO.P,A1,8*%
%TO.N,/CHG*%
X135000000Y-117780000D03*
%TO.P,A1,24*%
%TO.N,/I2C_CLK*%
X150240000Y-115240000D03*
%TO.P,A1,9*%
%TO.N,/DONE*%
X135000000Y-120320000D03*
%TO.P,A1,25*%
%TO.N,Net-(A1-Pad25)*%
X150240000Y-112700000D03*
%TO.P,A1,10*%
%TO.N,/PG*%
X135000000Y-122860000D03*
%TO.P,A1,26*%
%TO.N,Net-(A1-Pad26)*%
X150240000Y-110160000D03*
%TO.P,A1,11*%
%TO.N,Net-(A1-Pad11)*%
X135000000Y-125400000D03*
%TO.P,A1,27*%
%TO.N,+5V*%
X150240000Y-107620000D03*
%TO.P,A1,12*%
%TO.N,Net-(A1-Pad12)*%
X135000000Y-127940000D03*
%TO.P,A1,28*%
%TO.N,Net-(A1-Pad28)*%
X150240000Y-105080000D03*
%TO.P,A1,13*%
%TO.N,Net-(A1-Pad13)*%
X135000000Y-130480000D03*
%TO.P,A1,29*%
%TO.N,GND*%
X150240000Y-102540000D03*
%TO.P,A1,14*%
%TO.N,Net-(A1-Pad14)*%
X135000000Y-133020000D03*
%TO.P,A1,30*%
%TO.N,/PWR*%
X150240000Y-100000000D03*
%TO.P,A1,15*%
%TO.N,Net-(A1-Pad15)*%
X135000000Y-135560000D03*
%TO.P,A1,16*%
%TO.N,Net-(A1-Pad16)*%
X150240000Y-135560000D03*
%TD*%
D25*
%TO.P,J1,1*%
%TO.N,GND*%
X129600000Y-78800000D03*
D26*
%TO.P,J1,2*%
%TO.N,/PWR*%
X129600000Y-81340000D03*
%TO.P,J1,3*%
%TO.N,/I2C_CLK*%
X129600000Y-83880000D03*
%TO.P,J1,4*%
%TO.N,/I2C_DAT*%
X129600000Y-86420000D03*
%TO.P,J1,5*%
%TO.N,GND*%
X129600000Y-88960000D03*
%TO.P,J1,6*%
%TO.N,/E_STOP*%
X129600000Y-91500000D03*
%TO.P,J1,7*%
%TO.N,/INT*%
X129600000Y-94040000D03*
%TO.P,J1,8*%
%TO.N,/SYNC*%
X129600000Y-96580000D03*
%TO.P,J1,9*%
%TO.N,/PWR*%
X129600000Y-99120000D03*
%TO.P,J1,10*%
%TO.N,GND*%
X129600000Y-101660000D03*
%TD*%
D27*
%TO.N,GND*%
X150667000Y-61060000D03*
X162224000Y-64616000D03*
X129585000Y-71093000D03*
X133268000Y-92429000D03*
%TO.N,/CHG*%
X129458000Y-117765500D03*
X157334500Y-85126500D03*
%TO.N,/DONE*%
X129458000Y-120305500D03*
X157334500Y-88111000D03*
%TO.N,/PG*%
X129458000Y-122845500D03*
X157334500Y-91159000D03*
%TO.N,/PWR*%
X157017000Y-104367000D03*
X173781000Y-105510000D03*
%TO.N,VCC*%
X164510000Y-97763000D03*
X167431000Y-103732000D03*
X168193000Y-104367000D03*
X173908000Y-102462000D03*
%TD*%
D28*
%TO.N,GND*%
X154223000Y-64616000D02*
X162224000Y-64616000D01*
X150667000Y-61060000D02*
X154223000Y-64616000D01*
X133268000Y-74776000D02*
X133268000Y-92429000D01*
X129585000Y-71093000D02*
X133268000Y-74776000D01*
%TO.N,/CHG*%
X147463498Y-85126500D02*
X157334500Y-85126500D01*
X130900001Y-101689997D02*
X147463498Y-85126500D01*
X130900001Y-116323499D02*
X130900001Y-101689997D01*
X129458000Y-117765500D02*
X130900001Y-116323499D01*
%TO.N,/DONE*%
X133971999Y-101250001D02*
X136702499Y-101250001D01*
X133749999Y-101472001D02*
X133971999Y-101250001D01*
X133749999Y-116013501D02*
X133749999Y-101472001D01*
X129458000Y-120305500D02*
X133749999Y-116013501D01*
X149841500Y-88111000D02*
X157334500Y-88111000D01*
X136702499Y-101250001D02*
X149841500Y-88111000D01*
%TO.N,/PG*%
X135600001Y-119030001D02*
X138665500Y-115964502D01*
X133273499Y-119030001D02*
X135600001Y-119030001D01*
X129458000Y-122845500D02*
X133273499Y-119030001D01*
X138665500Y-115964502D02*
X138665500Y-105891000D01*
X153397500Y-91159000D02*
X157334500Y-91159000D01*
X138665500Y-105891000D02*
X153397500Y-91159000D01*
%TO.N,/PWR*%
X158160000Y-105510000D02*
X173781000Y-105510000D01*
X157017000Y-104367000D02*
X158160000Y-105510000D01*
%TO.N,VCC*%
X167431000Y-100684000D02*
X167431000Y-103732000D01*
X164510000Y-97763000D02*
X167431000Y-100684000D01*
X170098000Y-102462000D02*
X173908000Y-102462000D01*
X168193000Y-104367000D02*
X170098000Y-102462000D01*
%TD*%
M02*
