%TF.GenerationSoftware,KiCad,Pcbnew,5.1.10*%
%TF.CreationDate,2021-10-26T18:05:11-04:00*%
%TF.ProjectId,BREAD_Slice,42524541-445f-4536-9c69-63652e6b6963,rev?*%
%TF.SameCoordinates,Original*%
%TF.FileFunction,Soldermask,Top*%
%TF.FilePolarity,Negative*%
%FSLAX46Y46*%
G04 Gerber Fmt 4.6, Leading zero omitted, Abs format (unit mm)*
G04 Created by KiCad (PCBNEW 5.1.10) date 2021-10-26 18:05:11*
%MOMM*%
%LPD*%
G01*
G04 APERTURE LIST*
%ADD10O,1.700000X1.700000*%
%ADD11C,1.700000*%
%ADD12C,1.540000*%
%ADD13O,1.799260X3.600120*%
%ADD14C,3.100000*%
%ADD15C,2.600000*%
%ADD16C,2.098980*%
%ADD17C,1.400000*%
%ADD18C,5.700000*%
%ADD19O,1.800000X1.800000*%
G04 APERTURE END LIST*
D10*
%TO.C,R1*%
X165780000Y-75030000D03*
D11*
X165780000Y-59790000D03*
%TD*%
D12*
%TO.C,RV1*%
X154850000Y-87120000D03*
X157390000Y-89660000D03*
X159930000Y-87120000D03*
%TD*%
D13*
%TO.C,Q1*%
X141650000Y-82650000D03*
X146730000Y-82650000D03*
X144190000Y-82650000D03*
%TD*%
D14*
%TO.C,L1*%
X160690000Y-59790000D03*
X131490000Y-59790000D03*
%TD*%
D15*
%TO.C,J3*%
X184830000Y-58440000D03*
G36*
G01*
X183580000Y-52140000D02*
X186080000Y-52140000D01*
G75*
G02*
X186130000Y-52190000I0J-50000D01*
G01*
X186130000Y-54690000D01*
G75*
G02*
X186080000Y-54740000I-50000J0D01*
G01*
X183580000Y-54740000D01*
G75*
G02*
X183530000Y-54690000I0J50000D01*
G01*
X183530000Y-52190000D01*
G75*
G02*
X183580000Y-52140000I50000J0D01*
G01*
G37*
%TD*%
%TO.C,J2*%
X184830000Y-82570000D03*
G36*
G01*
X183580000Y-76270000D02*
X186080000Y-76270000D01*
G75*
G02*
X186130000Y-76320000I0J-50000D01*
G01*
X186130000Y-78820000D01*
G75*
G02*
X186080000Y-78870000I-50000J0D01*
G01*
X183580000Y-78870000D01*
G75*
G02*
X183530000Y-78820000I0J50000D01*
G01*
X183530000Y-76320000D01*
G75*
G02*
X183580000Y-76270000I50000J0D01*
G01*
G37*
%TD*%
%TO.C,D1*%
G36*
G01*
X136302030Y-78619490D02*
X134303050Y-78619490D01*
G75*
G02*
X134253050Y-78569490I0J50000D01*
G01*
X134253050Y-76570510D01*
G75*
G02*
X134303050Y-76520510I50000J0D01*
G01*
X136302030Y-76520510D01*
G75*
G02*
X136352030Y-76570510I0J-50000D01*
G01*
X136352030Y-78569490D01*
G75*
G02*
X136302030Y-78619490I-50000J0D01*
G01*
G37*
D16*
X135302540Y-87730000D03*
%TD*%
%TO.C,C3*%
G36*
G01*
X168890000Y-51550000D02*
X168890000Y-50250000D01*
G75*
G02*
X168940000Y-50200000I50000J0D01*
G01*
X170240000Y-50200000D01*
G75*
G02*
X170290000Y-50250000I0J-50000D01*
G01*
X170290000Y-51550000D01*
G75*
G02*
X170240000Y-51600000I-50000J0D01*
G01*
X168940000Y-51600000D01*
G75*
G02*
X168890000Y-51550000I0J50000D01*
G01*
G37*
D17*
X173090000Y-50900000D03*
%TD*%
D18*
%TO.C,H4*%
X187600000Y-134800000D03*
%TD*%
%TO.C,H3*%
X127600000Y-134800000D03*
%TD*%
%TO.C,H2*%
X187600000Y-44800000D03*
%TD*%
%TO.C,H1*%
X127600000Y-44800000D03*
%TD*%
%TO.C,A1*%
G36*
G01*
X134150000Y-100800000D02*
X134150000Y-99200000D01*
G75*
G02*
X134200000Y-99150000I50000J0D01*
G01*
X135800000Y-99150000D01*
G75*
G02*
X135850000Y-99200000I0J-50000D01*
G01*
X135850000Y-100800000D01*
G75*
G02*
X135800000Y-100850000I-50000J0D01*
G01*
X134200000Y-100850000D01*
G75*
G02*
X134150000Y-100800000I0J50000D01*
G01*
G37*
D10*
X150240000Y-133020000D03*
X135000000Y-102540000D03*
X150240000Y-130480000D03*
X135000000Y-105080000D03*
X150240000Y-127940000D03*
X135000000Y-107620000D03*
X150240000Y-125400000D03*
X135000000Y-110160000D03*
X150240000Y-122860000D03*
X135000000Y-112700000D03*
X150240000Y-120320000D03*
X135000000Y-115240000D03*
X150240000Y-117780000D03*
X135000000Y-117780000D03*
X150240000Y-115240000D03*
X135000000Y-120320000D03*
X150240000Y-112700000D03*
X135000000Y-122860000D03*
X150240000Y-110160000D03*
X135000000Y-125400000D03*
X150240000Y-107620000D03*
X135000000Y-127940000D03*
X150240000Y-105080000D03*
X135000000Y-130480000D03*
X150240000Y-102540000D03*
X135000000Y-133020000D03*
X150240000Y-100000000D03*
X135000000Y-135560000D03*
X150240000Y-135560000D03*
%TD*%
%TO.C,J1*%
G36*
G01*
X128700000Y-79650000D02*
X128700000Y-77950000D01*
G75*
G02*
X128750000Y-77900000I50000J0D01*
G01*
X130450000Y-77900000D01*
G75*
G02*
X130500000Y-77950000I0J-50000D01*
G01*
X130500000Y-79650000D01*
G75*
G02*
X130450000Y-79700000I-50000J0D01*
G01*
X128750000Y-79700000D01*
G75*
G02*
X128700000Y-79650000I0J50000D01*
G01*
G37*
D19*
X129600000Y-81340000D03*
X129600000Y-83880000D03*
X129600000Y-86420000D03*
X129600000Y-88960000D03*
X129600000Y-91500000D03*
X129600000Y-94040000D03*
X129600000Y-96580000D03*
X129600000Y-99120000D03*
X129600000Y-101660000D03*
%TD*%
M02*
