(export (version D)
  (design
    (source /home/daedalus/Documents/SLC_THRM/Hardware/BREAD_Slice.sch)
    (date "Thu 17 Jun 2021 09:00:24 AM EDT")
    (tool "Eeschema 5.1.10-1.fc34")
    (sheet (number 1) (name /) (tstamps /)
      (title_block
        (title)
        (company)
        (rev)
        (date)
        (source BREAD_Slice.sch)
        (comment (number 1) (value ""))
        (comment (number 2) (value ""))
        (comment (number 3) (value ""))
        (comment (number 4) (value "")))))
  (components
    (comp (ref C1)
      (value 10uF_t)
      (footprint OCI_UPL_FOOTPRINTS:C_2312)
      (datasheet https://www.digikey.com/short/qcd8n7)
      (fields
        (field (name "Part #") T491C106K025AT)
        (field (name "UPL #") 2.021))
      (libsource (lib OCI_UPL_2_Capacitors) (part 10uF_t) (description "SMD 10uF tantalum capacitor 25V [UPL 2.021]"))
      (sheetpath (names /) (tstamps /))
      (tstamp 5FA94020))
    (comp (ref H1)
      (value MountingHole)
      (footprint MountingHole:MountingHole_3.2mm_M3_DIN965_Pad)
      (datasheet ~)
      (libsource (lib Mechanical) (part MountingHole) (description "Mounting Hole without connection"))
      (sheetpath (names /) (tstamps /))
      (tstamp 5FAB1765))
    (comp (ref H3)
      (value MountingHole)
      (footprint MountingHole:MountingHole_3.2mm_M3_DIN965_Pad)
      (datasheet ~)
      (libsource (lib Mechanical) (part MountingHole) (description "Mounting Hole without connection"))
      (sheetpath (names /) (tstamps /))
      (tstamp 5FAB1B3E))
    (comp (ref H2)
      (value MountingHole)
      (footprint MountingHole:MountingHole_3.2mm_M3_DIN965_Pad)
      (datasheet ~)
      (libsource (lib Mechanical) (part MountingHole) (description "Mounting Hole without connection"))
      (sheetpath (names /) (tstamps /))
      (tstamp 5FAB217D))
    (comp (ref H4)
      (value MountingHole)
      (footprint MountingHole:MountingHole_3.2mm_M3_DIN965_Pad)
      (datasheet ~)
      (libsource (lib Mechanical) (part MountingHole) (description "Mounting Hole without connection"))
      (sheetpath (names /) (tstamps /))
      (tstamp 5FAB25F7))
    (comp (ref A1)
      (value Arduino_Nano_v3.x)
      (footprint Module:Arduino_Nano)
      (datasheet http://www.mouser.com/pdfdocs/Gravitech_Arduino_Nano3_0.pdf)
      (libsource (lib MCU_Module) (part Arduino_Nano_v3.x) (description "Arduino Nano v3.x"))
      (sheetpath (names /) (tstamps /))
      (tstamp 5FCAD89B))
    (comp (ref J1)
      (value Conn_01x10_Female)
      (footprint Connector_PinSocket_2.54mm:PinSocket_1x10_P2.54mm_Horizontal)
      (datasheet ~)
      (libsource (lib Connector) (part Conn_01x10_Female) (description "Generic connector, single row, 01x10, script generated (kicad-library-utils/schlib/autogen/connector/)"))
      (sheetpath (names /) (tstamps /))
      (tstamp 5FE6B3C7))
    (comp (ref C2)
      (value 10uF_t)
      (footprint OCI_UPL_FOOTPRINTS:C_2312)
      (datasheet https://www.digikey.com/short/qcd8n7)
      (fields
        (field (name "Part #") T491C106K025AT)
        (field (name "UPL #") 2.021))
      (libsource (lib OCI_UPL_2_Capacitors) (part 10uF_t) (description "SMD 10uF tantalum capacitor 25V [UPL 2.021]"))
      (sheetpath (names /) (tstamps /))
      (tstamp 5FE84189))
    (comp (ref Logo1)
      (value Logo_Open_Hardware_Small)
      (footprint Symbol:OSHW-Symbol_6.7x6mm_SilkScreen)
      (datasheet ~)
      (libsource (lib Graphic) (part Logo_Open_Hardware_Small) (description "Open Hardware logo, small"))
      (sheetpath (names /) (tstamps /))
      (tstamp 5FE4A934))
    (comp (ref U1)
      (value MAX31855KASA)
      (footprint Package_SO:SOIC-8_3.9x4.9mm_P1.27mm)
      (datasheet http://datasheets.maximintegrated.com/en/ds/MAX31855.pdf)
      (libsource (lib Sensor_Temperature) (part MAX31855KASA) (description "Cold Junction K-type Termocouple Interface, SPI, SO8"))
      (sheetpath (names /) (tstamps /))
      (tstamp 6128D708))
    (comp (ref FB1)
      (value Ferrite_Bead_Small)
      (footprint Resistor_SMD:R_1206_3216Metric_Pad1.30x1.75mm_HandSolder)
      (datasheet ~)
      (libsource (lib Device) (part Ferrite_Bead_Small) (description "Ferrite bead, small symbol"))
      (sheetpath (names /) (tstamps /))
      (tstamp 6128E93C))
    (comp (ref FB2)
      (value Ferrite_Bead_Small)
      (footprint Resistor_SMD:R_1206_3216Metric_Pad1.30x1.75mm_HandSolder)
      (datasheet ~)
      (libsource (lib Device) (part Ferrite_Bead_Small) (description "Ferrite bead, small symbol"))
      (sheetpath (names /) (tstamps /))
      (tstamp 6128F168))
    (comp (ref C3)
      (value "0.01 uF")
      (footprint Capacitor_SMD:C_1206_3216Metric_Pad1.33x1.80mm_HandSolder)
      (datasheet ~)
      (libsource (lib Device) (part C) (description "Unpolarized capacitor"))
      (sheetpath (names /) (tstamps /))
      (tstamp 6129745B))
    (comp (ref J2)
      (value Screw_Terminal_01x02)
      (footprint TerminalBlock_TE-Connectivity:TerminalBlock_TE_282834-2_1x02_P2.54mm_Horizontal)
      (datasheet ~)
      (libsource (lib Connector) (part Screw_Terminal_01x02) (description "Generic screw terminal, single row, 01x02, script generated (kicad-library-utils/schlib/autogen/connector/)"))
      (sheetpath (names /) (tstamps /))
      (tstamp 61297D2F))
    (comp (ref R2)
      (value 10k)
      (footprint Resistor_SMD:R_1206_3216Metric_Pad1.30x1.75mm_HandSolder)
      (datasheet ~)
      (libsource (lib Device) (part R) (description Resistor))
      (sheetpath (names /) (tstamps /))
      (tstamp 61299841))
    (comp (ref U3)
      (value MAX31855KASA)
      (footprint Package_SO:SOIC-8_3.9x4.9mm_P1.27mm)
      (datasheet http://datasheets.maximintegrated.com/en/ds/MAX31855.pdf)
      (libsource (lib Sensor_Temperature) (part MAX31855KASA) (description "Cold Junction K-type Termocouple Interface, SPI, SO8"))
      (sheetpath (names /) (tstamps /))
      (tstamp 6132598F))
    (comp (ref FB5)
      (value Ferrite_Bead_Small)
      (footprint Resistor_SMD:R_1206_3216Metric_Pad1.30x1.75mm_HandSolder)
      (datasheet ~)
      (libsource (lib Device) (part Ferrite_Bead_Small) (description "Ferrite bead, small symbol"))
      (sheetpath (names /) (tstamps /))
      (tstamp 61325995))
    (comp (ref FB6)
      (value Ferrite_Bead_Small)
      (footprint Resistor_SMD:R_1206_3216Metric_Pad1.30x1.75mm_HandSolder)
      (datasheet ~)
      (libsource (lib Device) (part Ferrite_Bead_Small) (description "Ferrite bead, small symbol"))
      (sheetpath (names /) (tstamps /))
      (tstamp 6132599B))
    (comp (ref C5)
      (value "0.01 uF")
      (footprint Capacitor_SMD:C_1206_3216Metric_Pad1.33x1.80mm_HandSolder)
      (datasheet ~)
      (libsource (lib Device) (part C) (description "Unpolarized capacitor"))
      (sheetpath (names /) (tstamps /))
      (tstamp 613259A1))
    (comp (ref J4)
      (value Screw_Terminal_01x02)
      (footprint TerminalBlock_TE-Connectivity:TerminalBlock_TE_282834-2_1x02_P2.54mm_Horizontal)
      (datasheet ~)
      (libsource (lib Connector) (part Screw_Terminal_01x02) (description "Generic screw terminal, single row, 01x02, script generated (kicad-library-utils/schlib/autogen/connector/)"))
      (sheetpath (names /) (tstamps /))
      (tstamp 613259A7))
    (comp (ref R4)
      (value 10k)
      (footprint Resistor_SMD:R_1206_3216Metric_Pad1.30x1.75mm_HandSolder)
      (datasheet ~)
      (libsource (lib Device) (part R) (description Resistor))
      (sheetpath (names /) (tstamps /))
      (tstamp 613259AD))
    (comp (ref U2)
      (value MAX31855KASA)
      (footprint Package_SO:SOIC-8_3.9x4.9mm_P1.27mm)
      (datasheet http://datasheets.maximintegrated.com/en/ds/MAX31855.pdf)
      (libsource (lib Sensor_Temperature) (part MAX31855KASA) (description "Cold Junction K-type Termocouple Interface, SPI, SO8"))
      (sheetpath (names /) (tstamps /))
      (tstamp 6132A147))
    (comp (ref FB3)
      (value Ferrite_Bead_Small)
      (footprint Resistor_SMD:R_1206_3216Metric_Pad1.30x1.75mm_HandSolder)
      (datasheet ~)
      (libsource (lib Device) (part Ferrite_Bead_Small) (description "Ferrite bead, small symbol"))
      (sheetpath (names /) (tstamps /))
      (tstamp 6132A14D))
    (comp (ref FB4)
      (value Ferrite_Bead_Small)
      (footprint Resistor_SMD:R_1206_3216Metric_Pad1.30x1.75mm_HandSolder)
      (datasheet ~)
      (libsource (lib Device) (part Ferrite_Bead_Small) (description "Ferrite bead, small symbol"))
      (sheetpath (names /) (tstamps /))
      (tstamp 6132A153))
    (comp (ref C4)
      (value "0.01 uF")
      (footprint Capacitor_SMD:C_1206_3216Metric_Pad1.33x1.80mm_HandSolder)
      (datasheet ~)
      (libsource (lib Device) (part C) (description "Unpolarized capacitor"))
      (sheetpath (names /) (tstamps /))
      (tstamp 6132A159))
    (comp (ref J3)
      (value Screw_Terminal_01x02)
      (footprint TerminalBlock_TE-Connectivity:TerminalBlock_TE_282834-2_1x02_P2.54mm_Horizontal)
      (datasheet ~)
      (libsource (lib Connector) (part Screw_Terminal_01x02) (description "Generic screw terminal, single row, 01x02, script generated (kicad-library-utils/schlib/autogen/connector/)"))
      (sheetpath (names /) (tstamps /))
      (tstamp 6132A15F))
    (comp (ref R3)
      (value 10k)
      (footprint Resistor_SMD:R_1206_3216Metric_Pad1.30x1.75mm_HandSolder)
      (datasheet ~)
      (libsource (lib Device) (part R) (description Resistor))
      (sheetpath (names /) (tstamps /))
      (tstamp 6132A165))
    (comp (ref R1)
      (value 10k)
      (footprint Resistor_SMD:R_1206_3216Metric_Pad1.30x1.75mm_HandSolder)
      (datasheet ~)
      (libsource (lib Device) (part R) (description Resistor))
      (sheetpath (names /) (tstamps /))
      (tstamp 6132A171))
    (comp (ref U4)
      (value MAX31855KASA)
      (footprint Package_SO:SOIC-8_3.9x4.9mm_P1.27mm)
      (datasheet http://datasheets.maximintegrated.com/en/ds/MAX31855.pdf)
      (libsource (lib Sensor_Temperature) (part MAX31855KASA) (description "Cold Junction K-type Termocouple Interface, SPI, SO8"))
      (sheetpath (names /) (tstamps /))
      (tstamp 6132DC3B))
    (comp (ref FB7)
      (value Ferrite_Bead_Small)
      (footprint Resistor_SMD:R_1206_3216Metric_Pad1.30x1.75mm_HandSolder)
      (datasheet ~)
      (libsource (lib Device) (part Ferrite_Bead_Small) (description "Ferrite bead, small symbol"))
      (sheetpath (names /) (tstamps /))
      (tstamp 6132DC41))
    (comp (ref FB8)
      (value Ferrite_Bead_Small)
      (footprint Resistor_SMD:R_1206_3216Metric_Pad1.30x1.75mm_HandSolder)
      (datasheet ~)
      (libsource (lib Device) (part Ferrite_Bead_Small) (description "Ferrite bead, small symbol"))
      (sheetpath (names /) (tstamps /))
      (tstamp 6132DC47))
    (comp (ref C6)
      (value "0.01 uF")
      (footprint Capacitor_SMD:C_1206_3216Metric_Pad1.33x1.80mm_HandSolder)
      (datasheet ~)
      (libsource (lib Device) (part C) (description "Unpolarized capacitor"))
      (sheetpath (names /) (tstamps /))
      (tstamp 6132DC4D))
    (comp (ref J5)
      (value Screw_Terminal_01x02)
      (footprint TerminalBlock_TE-Connectivity:TerminalBlock_TE_282834-2_1x02_P2.54mm_Horizontal)
      (datasheet ~)
      (libsource (lib Connector) (part Screw_Terminal_01x02) (description "Generic screw terminal, single row, 01x02, script generated (kicad-library-utils/schlib/autogen/connector/)"))
      (sheetpath (names /) (tstamps /))
      (tstamp 6132DC53))
    (comp (ref R5)
      (value 10k)
      (footprint Resistor_SMD:R_1206_3216Metric_Pad1.30x1.75mm_HandSolder)
      (datasheet ~)
      (libsource (lib Device) (part R) (description Resistor))
      (sheetpath (names /) (tstamps /))
      (tstamp 6132DC59)))
  (libparts
    (libpart (lib Connector) (part Conn_01x10_Female)
      (description "Generic connector, single row, 01x10, script generated (kicad-library-utils/schlib/autogen/connector/)")
      (docs ~)
      (footprints
        (fp Connector*:*_1x??_*))
      (fields
        (field (name Reference) J)
        (field (name Value) Conn_01x10_Female))
      (pins
        (pin (num 1) (name Pin_1) (type passive))
        (pin (num 2) (name Pin_2) (type passive))
        (pin (num 3) (name Pin_3) (type passive))
        (pin (num 4) (name Pin_4) (type passive))
        (pin (num 5) (name Pin_5) (type passive))
        (pin (num 6) (name Pin_6) (type passive))
        (pin (num 7) (name Pin_7) (type passive))
        (pin (num 8) (name Pin_8) (type passive))
        (pin (num 9) (name Pin_9) (type passive))
        (pin (num 10) (name Pin_10) (type passive))))
    (libpart (lib Connector) (part Screw_Terminal_01x02)
      (description "Generic screw terminal, single row, 01x02, script generated (kicad-library-utils/schlib/autogen/connector/)")
      (docs ~)
      (footprints
        (fp TerminalBlock*:*))
      (fields
        (field (name Reference) J)
        (field (name Value) Screw_Terminal_01x02))
      (pins
        (pin (num 1) (name Pin_1) (type passive))
        (pin (num 2) (name Pin_2) (type passive))))
    (libpart (lib Device) (part C)
      (description "Unpolarized capacitor")
      (docs ~)
      (footprints
        (fp C_*))
      (fields
        (field (name Reference) C)
        (field (name Value) C))
      (pins
        (pin (num 1) (name ~) (type passive))
        (pin (num 2) (name ~) (type passive))))
    (libpart (lib Device) (part Ferrite_Bead_Small)
      (description "Ferrite bead, small symbol")
      (docs ~)
      (footprints
        (fp Inductor_*)
        (fp L_*)
        (fp *Ferrite*))
      (fields
        (field (name Reference) FB)
        (field (name Value) Ferrite_Bead_Small))
      (pins
        (pin (num 1) (name ~) (type passive))
        (pin (num 2) (name ~) (type passive))))
    (libpart (lib Device) (part R)
      (description Resistor)
      (docs ~)
      (footprints
        (fp R_*))
      (fields
        (field (name Reference) R)
        (field (name Value) R))
      (pins
        (pin (num 1) (name ~) (type passive))
        (pin (num 2) (name ~) (type passive))))
    (libpart (lib Graphic) (part Logo_Open_Hardware_Small)
      (description "Open Hardware logo, small")
      (docs ~)
      (fields
        (field (name Reference) "#LOGO")
        (field (name Value) Logo_Open_Hardware_Small)))
    (libpart (lib MCU_Module) (part Arduino_Nano_v2.x)
      (aliases
        (alias Arduino_Nano_v3.x))
      (description "Arduino Nano v2.x")
      (docs https://www.arduino.cc/en/uploads/Main/ArduinoNanoManual23.pdf)
      (footprints
        (fp Arduino*Nano*))
      (fields
        (field (name Reference) A)
        (field (name Value) Arduino_Nano_v2.x)
        (field (name Footprint) Module:Arduino_Nano))
      (pins
        (pin (num 1) (name D1/TX) (type BiDi))
        (pin (num 2) (name D0/RX) (type BiDi))
        (pin (num 3) (name ~RESET) (type input))
        (pin (num 4) (name GND) (type power_in))
        (pin (num 5) (name D2) (type BiDi))
        (pin (num 6) (name D3) (type BiDi))
        (pin (num 7) (name D4) (type BiDi))
        (pin (num 8) (name D5) (type BiDi))
        (pin (num 9) (name D6) (type BiDi))
        (pin (num 10) (name D7) (type BiDi))
        (pin (num 11) (name D8) (type BiDi))
        (pin (num 12) (name D9) (type BiDi))
        (pin (num 13) (name D10) (type BiDi))
        (pin (num 14) (name D11) (type BiDi))
        (pin (num 15) (name D12) (type BiDi))
        (pin (num 16) (name D13) (type BiDi))
        (pin (num 17) (name 3V3) (type power_out))
        (pin (num 18) (name AREF) (type input))
        (pin (num 19) (name A0) (type BiDi))
        (pin (num 20) (name A1) (type BiDi))
        (pin (num 21) (name A2) (type BiDi))
        (pin (num 22) (name A3) (type BiDi))
        (pin (num 23) (name A4) (type BiDi))
        (pin (num 24) (name A5) (type BiDi))
        (pin (num 25) (name A6) (type BiDi))
        (pin (num 26) (name A7) (type BiDi))
        (pin (num 27) (name +5V) (type power_out))
        (pin (num 28) (name ~RESET) (type input))
        (pin (num 29) (name GND) (type power_in))
        (pin (num 30) (name VIN) (type power_in))))
    (libpart (lib Mechanical) (part MountingHole)
      (description "Mounting Hole without connection")
      (docs ~)
      (footprints
        (fp MountingHole*))
      (fields
        (field (name Reference) H)
        (field (name Value) MountingHole)))
    (libpart (lib OCI_UPL_2_Capacitors) (part 10uF_t)
      (description "SMD 10uF tantalum capacitor 25V [UPL 2.021]")
      (footprints
        (fp SMD*_Pol)
        (fp c_elec*)
        (fp C*elec)
        (fp TantalC*)
        (fp Elko*)
        (fp CP*))
      (fields
        (field (name Reference) C)
        (field (name Value) 10uF_t)
        (field (name Footprint) OCI_UPL_FOOTPRINTS:C_2312)
        (field (name Datasheet) https://www.digikey.com/short/qcd8n7)
        (field (name "Part #") T491C106K025AT)
        (field (name "UPL #") 2.021))
      (pins
        (pin (num 1) (name ~) (type passive))
        (pin (num 2) (name ~) (type passive))))
    (libpart (lib Sensor_Temperature) (part MAX31855KASA)
      (aliases
        (alias MAX31855JASA)
        (alias MAX31855NASA)
        (alias MAX31855SASA)
        (alias MAX31855TASA)
        (alias MAX31855EASA)
        (alias MAX31855RASA))
      (description "Cold Junction K-type Termocouple Interface, SPI, SO8")
      (docs http://datasheets.maximintegrated.com/en/ds/MAX31855.pdf)
      (footprints
        (fp SOIC*3.9x4.9mm*P1.27mm*))
      (fields
        (field (name Reference) U)
        (field (name Value) MAX31855KASA)
        (field (name Footprint) Package_SO:SOIC-8_3.9x4.9mm_P1.27mm))
      (pins
        (pin (num 1) (name GND) (type power_in))
        (pin (num 2) (name T-) (type passive))
        (pin (num 3) (name T+) (type passive))
        (pin (num 4) (name VCC) (type power_in))
        (pin (num 5) (name SCK) (type input))
        (pin (num 6) (name ~CS~) (type input))
        (pin (num 7) (name SO) (type 3state)))))
  (libraries
    (library (logical Connector)
      (uri /usr/share/kicad/library/Connector.lib))
    (library (logical Device)
      (uri /usr/share/kicad/library/Device.lib))
    (library (logical Graphic)
      (uri /usr/share/kicad/library/Graphic.lib))
    (library (logical MCU_Module)
      (uri /usr/share/kicad/library/MCU_Module.lib))
    (library (logical Mechanical)
      (uri /usr/share/kicad/library/Mechanical.lib))
    (library (logical OCI_UPL_2_Capacitors)
      (uri /home/daedalus/Documents/OCI_UPL_Symbols/OCI_UPL_2_Capacitors.lib))
    (library (logical Sensor_Temperature)
      (uri /usr/share/kicad/library/Sensor_Temperature.lib)))
  (nets
    (net (code 1) (name "Net-(C4-Pad2)")
      (node (ref C4) (pin 2))
      (node (ref FB4) (pin 2))
      (node (ref U2) (pin 2)))
    (net (code 2) (name /SS3)
      (node (ref U2) (pin 6))
      (node (ref A1) (pin 11))
      (node (ref R3) (pin 1)))
    (net (code 3) (name GND)
      (node (ref C2) (pin 2))
      (node (ref C1) (pin 2))
      (node (ref U3) (pin 1))
      (node (ref U2) (pin 1))
      (node (ref A1) (pin 4))
      (node (ref A1) (pin 29))
      (node (ref U1) (pin 1))
      (node (ref J1) (pin 5))
      (node (ref J1) (pin 10))
      (node (ref J1) (pin 1))
      (node (ref U4) (pin 1)))
    (net (code 4) (name "Net-(C4-Pad1)")
      (node (ref FB3) (pin 2))
      (node (ref C4) (pin 1))
      (node (ref U2) (pin 3)))
    (net (code 5) (name "Net-(FB4-Pad1)")
      (node (ref J3) (pin 1))
      (node (ref FB4) (pin 1)))
    (net (code 6) (name "Net-(FB3-Pad1)")
      (node (ref FB3) (pin 1))
      (node (ref J3) (pin 2)))
    (net (code 7) (name "Net-(C6-Pad1)")
      (node (ref C6) (pin 1))
      (node (ref U4) (pin 3))
      (node (ref FB7) (pin 2)))
    (net (code 8) (name "Net-(FB8-Pad1)")
      (node (ref J5) (pin 1))
      (node (ref FB8) (pin 1)))
    (net (code 9) (name "Net-(FB7-Pad1)")
      (node (ref J5) (pin 2))
      (node (ref FB7) (pin 1)))
    (net (code 10) (name "Net-(C5-Pad2)")
      (node (ref FB6) (pin 2))
      (node (ref C5) (pin 2))
      (node (ref U3) (pin 2)))
    (net (code 11) (name /SS2)
      (node (ref R4) (pin 1))
      (node (ref A1) (pin 10))
      (node (ref U3) (pin 6)))
    (net (code 12) (name "Net-(C5-Pad1)")
      (node (ref C5) (pin 1))
      (node (ref FB5) (pin 2))
      (node (ref U3) (pin 3)))
    (net (code 13) (name "Net-(FB6-Pad1)")
      (node (ref J4) (pin 1))
      (node (ref FB6) (pin 1)))
    (net (code 14) (name "Net-(FB5-Pad1)")
      (node (ref J4) (pin 2))
      (node (ref FB5) (pin 1)))
    (net (code 15) (name /DATA)
      (node (ref U2) (pin 7))
      (node (ref U3) (pin 7))
      (node (ref A1) (pin 15))
      (node (ref U4) (pin 7))
      (node (ref U1) (pin 7)))
    (net (code 16) (name +5V)
      (node (ref U3) (pin 4))
      (node (ref R2) (pin 2))
      (node (ref C2) (pin 1))
      (node (ref U1) (pin 4))
      (node (ref A1) (pin 27))
      (node (ref U4) (pin 4))
      (node (ref R5) (pin 2))
      (node (ref U2) (pin 4))
      (node (ref R4) (pin 2))
      (node (ref R3) (pin 2))
      (node (ref R1) (pin 1)))
    (net (code 17) (name /CLK)
      (node (ref A1) (pin 16))
      (node (ref R1) (pin 2))
      (node (ref U3) (pin 5))
      (node (ref U4) (pin 5))
      (node (ref U1) (pin 5))
      (node (ref U2) (pin 5)))
    (net (code 19) (name "Net-(A1-Pad17)")
      (node (ref A1) (pin 17)))
    (net (code 20) (name "Net-(A1-Pad14)")
      (node (ref A1) (pin 14)))
    (net (code 21) (name "Net-(A1-Pad13)")
      (node (ref A1) (pin 13)))
    (net (code 22) (name /SS4)
      (node (ref U4) (pin 6))
      (node (ref A1) (pin 12))
      (node (ref R5) (pin 1)))
    (net (code 23) (name "Net-(C6-Pad2)")
      (node (ref U4) (pin 2))
      (node (ref C6) (pin 2))
      (node (ref FB8) (pin 2)))
    (net (code 24) (name "Net-(A1-Pad26)")
      (node (ref A1) (pin 26)))
    (net (code 25) (name "Net-(A1-Pad25)")
      (node (ref A1) (pin 25)))
    (net (code 26) (name "Net-(A1-Pad8)")
      (node (ref A1) (pin 8)))
    (net (code 27) (name "Net-(A1-Pad22)")
      (node (ref A1) (pin 22)))
    (net (code 28) (name "Net-(A1-Pad21)")
      (node (ref A1) (pin 21)))
    (net (code 29) (name "Net-(A1-Pad20)")
      (node (ref A1) (pin 20)))
    (net (code 30) (name "Net-(A1-Pad19)")
      (node (ref A1) (pin 19)))
    (net (code 31) (name /SS1)
      (node (ref A1) (pin 9))
      (node (ref R2) (pin 1))
      (node (ref U1) (pin 6)))
    (net (code 32) (name /E_STOP)
      (node (ref J1) (pin 6))
      (node (ref A1) (pin 5)))
    (net (code 33) (name "Net-(A1-Pad3)")
      (node (ref A1) (pin 3)))
    (net (code 34) (name "Net-(A1-Pad28)")
      (node (ref A1) (pin 28)))
    (net (code 35) (name /I2C_CLK)
      (node (ref J1) (pin 3))
      (node (ref A1) (pin 24)))
    (net (code 36) (name /I2C_DAT)
      (node (ref J1) (pin 4))
      (node (ref A1) (pin 23)))
    (net (code 37) (name "Net-(A1-Pad2)")
      (node (ref A1) (pin 2)))
    (net (code 38) (name "Net-(A1-Pad18)")
      (node (ref A1) (pin 18)))
    (net (code 39) (name +12V)
      (node (ref J1) (pin 2))
      (node (ref A1) (pin 30))
      (node (ref J1) (pin 9))
      (node (ref C1) (pin 1)))
    (net (code 40) (name /SYNC)
      (node (ref A1) (pin 7))
      (node (ref J1) (pin 8)))
    (net (code 41) (name /INT)
      (node (ref A1) (pin 6))
      (node (ref J1) (pin 7)))
    (net (code 42) (name "Net-(A1-Pad1)")
      (node (ref A1) (pin 1)))
    (net (code 43) (name "Net-(C3-Pad1)")
      (node (ref FB1) (pin 2))
      (node (ref C3) (pin 1))
      (node (ref U1) (pin 3)))
    (net (code 44) (name "Net-(C3-Pad2)")
      (node (ref C3) (pin 2))
      (node (ref FB2) (pin 2))
      (node (ref U1) (pin 2)))
    (net (code 45) (name "Net-(FB2-Pad1)")
      (node (ref J2) (pin 1))
      (node (ref FB2) (pin 1)))
    (net (code 46) (name "Net-(FB1-Pad1)")
      (node (ref J2) (pin 2))
      (node (ref FB1) (pin 1)))))