EESchema Schematic File Version 4
EELAYER 30 0
EELAYER END
$Descr A4 11693 8268
encoding utf-8
Sheet 1 1
Title ""
Date ""
Rev ""
Comp ""
Comment1 ""
Comment2 ""
Comment3 ""
Comment4 ""
$EndDescr
$Comp
L power:GND #PWR06
U 1 1 5FA66343
P 1800 4600
F 0 "#PWR06" H 1800 4350 50  0001 C CNN
F 1 "GND" H 2150 4650 50  0000 C CNN
F 2 "" H 1800 4600 50  0001 C CNN
F 3 "" H 1800 4600 50  0001 C CNN
	1    1800 4600
	1    0    0    -1  
$EndComp
Wire Wire Line
	1750 4500 1750 4550
Wire Wire Line
	1750 4550 1800 4550
Wire Wire Line
	1850 4550 1850 4500
Wire Wire Line
	1800 4550 1800 4600
Connection ~ 1800 4550
Wire Wire Line
	1800 4550 1850 4550
$Comp
L power:+5V #PWR07
U 1 1 5FA67628
P 1950 2400
F 0 "#PWR07" H 1950 2250 50  0001 C CNN
F 1 "+5V" H 1965 2573 50  0000 C CNN
F 2 "" H 1950 2400 50  0001 C CNN
F 3 "" H 1950 2400 50  0001 C CNN
	1    1950 2400
	1    0    0    -1  
$EndComp
Wire Wire Line
	1950 2400 1950 2500
$Comp
L power:+12V #PWR05
U 1 1 5FA6990A
P 1650 2400
F 0 "#PWR05" H 1650 2250 50  0001 C CNN
F 1 "+12V" H 1665 2573 50  0000 C CNN
F 2 "" H 1650 2400 50  0001 C CNN
F 3 "" H 1650 2400 50  0001 C CNN
	1    1650 2400
	1    0    0    -1  
$EndComp
NoConn ~ 1250 2900
NoConn ~ 1250 3000
Wire Wire Line
	800  3300 1250 3300
Text Label 800  3200 0    50   ~ 0
INT
Text Label 2600 4000 2    50   ~ 0
I2C_CLK
Text Label 2600 3900 2    50   ~ 0
I2C_DAT
Wire Wire Line
	2600 3900 2250 3900
Wire Wire Line
	2250 4000 2600 4000
NoConn ~ 1850 2500
NoConn ~ 2250 2900
NoConn ~ 2250 3000
NoConn ~ 2250 3300
Text Label 800  3100 0    50   ~ 0
E_STOP
Wire Wire Line
	800  3200 1250 3200
Wire Wire Line
	1250 3100 800  3100
$Comp
L OCI_UPL_2_Capacitors:10uF_t C1
U 1 1 5FA94020
P 1600 1350
F 0 "C1" H 1715 1396 50  0000 L CNN
F 1 "10uF_t" H 1715 1305 50  0000 L CNN
F 2 "OCI_UPL_FOOTPRINTS:C_2312" H 1600 1100 30  0001 C CNN
F 3 "https://www.digikey.com/short/qcd8n7" H 1600 1550 30  0001 C CNN
F 4 "T491C106K025AT" H 1600 1600 30  0001 C CNN "Part #"
F 5 "2.021" H 1600 1150 30  0001 C CNN "UPL #"
	1    1600 1350
	1    0    0    -1  
$EndComp
$Comp
L power:GND #PWR04
U 1 1 5FA94026
P 1600 1550
F 0 "#PWR04" H 1600 1300 50  0001 C CNN
F 1 "GND" H 1605 1377 50  0000 C CNN
F 2 "" H 1600 1550 50  0001 C CNN
F 3 "" H 1600 1550 50  0001 C CNN
	1    1600 1550
	1    0    0    -1  
$EndComp
Wire Wire Line
	1600 1200 1600 1150
Wire Wire Line
	1600 1550 1600 1500
$Comp
L Mechanical:MountingHole H1
U 1 1 5FAB1765
P 1100 4900
F 0 "H1" H 1200 4946 50  0000 L CNN
F 1 "MountingHole" H 1200 4855 50  0000 L CNN
F 2 "MountingHole:MountingHole_3.2mm_M3_DIN965_Pad" H 1100 4900 50  0001 C CNN
F 3 "~" H 1100 4900 50  0001 C CNN
	1    1100 4900
	1    0    0    -1  
$EndComp
$Comp
L Mechanical:MountingHole H3
U 1 1 5FAB1B3E
P 1850 4900
F 0 "H3" H 1950 4946 50  0000 L CNN
F 1 "MountingHole" H 1950 4855 50  0000 L CNN
F 2 "MountingHole:MountingHole_3.2mm_M3_DIN965_Pad" H 1850 4900 50  0001 C CNN
F 3 "~" H 1850 4900 50  0001 C CNN
	1    1850 4900
	1    0    0    -1  
$EndComp
$Comp
L Mechanical:MountingHole H2
U 1 1 5FAB217D
P 1100 5100
F 0 "H2" H 1200 5146 50  0000 L CNN
F 1 "MountingHole" H 1200 5055 50  0000 L CNN
F 2 "MountingHole:MountingHole_3.2mm_M3_DIN965_Pad" H 1100 5100 50  0001 C CNN
F 3 "~" H 1100 5100 50  0001 C CNN
	1    1100 5100
	1    0    0    -1  
$EndComp
$Comp
L Mechanical:MountingHole H4
U 1 1 5FAB25F7
P 1850 5100
F 0 "H4" H 1950 5146 50  0000 L CNN
F 1 "MountingHole" H 1950 5055 50  0000 L CNN
F 2 "MountingHole:MountingHole_3.2mm_M3_DIN965_Pad" H 1850 5100 50  0001 C CNN
F 3 "~" H 1850 5100 50  0001 C CNN
	1    1850 5100
	1    0    0    -1  
$EndComp
$Comp
L MCU_Module:Arduino_Nano_v3.x A1
U 1 1 5FCAD89B
P 1750 3500
F 0 "A1" H 1750 2411 50  0000 C CNN
F 1 "Arduino_Nano_v3.x" H 2250 2550 50  0000 C CNN
F 2 "Module:Arduino_Nano" H 1750 3500 50  0001 C CIN
F 3 "http://www.mouser.com/pdfdocs/Gravitech_Arduino_Nano3_0.pdf" H 1750 3500 50  0001 C CNN
	1    1750 3500
	1    0    0    -1  
$EndComp
Text Label 800  3300 0    50   ~ 0
SYNC
$Comp
L Connector:Conn_01x10_Female J1
U 1 1 5FE6B3C7
P 1400 1450
F 0 "J1" H 1428 1380 50  0000 L CNN
F 1 "Conn_01x10_Female" H 1428 1335 50  0001 L CNN
F 2 "Connector_PinSocket_2.54mm:PinSocket_1x10_P2.54mm_Horizontal" H 1400 1450 50  0001 C CNN
F 3 "~" H 1400 1450 50  0001 C CNN
	1    1400 1450
	1    0    0    -1  
$EndComp
$Comp
L power:+12V #PWR01
U 1 1 5FE6D224
P 1100 1000
F 0 "#PWR01" H 1100 850 50  0001 C CNN
F 1 "+12V" H 1115 1173 50  0000 C CNN
F 2 "" H 1100 1000 50  0001 C CNN
F 3 "" H 1100 1000 50  0001 C CNN
	1    1100 1000
	1    0    0    -1  
$EndComp
$Comp
L power:GND #PWR02
U 1 1 5FE6E4CA
P 1150 2000
F 0 "#PWR02" H 1150 1750 50  0001 C CNN
F 1 "GND" H 1155 1827 50  0000 C CNN
F 2 "" H 1150 2000 50  0001 C CNN
F 3 "" H 1150 2000 50  0001 C CNN
	1    1150 2000
	1    0    0    -1  
$EndComp
Wire Wire Line
	1150 2000 1150 1950
Wire Wire Line
	1150 1050 1200 1050
Wire Wire Line
	1200 1950 1150 1950
Connection ~ 1150 1950
Wire Wire Line
	1100 1000 1100 1150
Wire Wire Line
	1100 1150 1200 1150
Wire Wire Line
	1200 1850 1100 1850
Wire Wire Line
	1100 1850 1100 1150
Connection ~ 1100 1150
Wire Wire Line
	1200 1450 1150 1450
Connection ~ 1150 1450
Wire Wire Line
	1150 1450 1150 1050
Text Label 750  1250 0    50   ~ 0
I2C_CLK
Text Label 750  1350 0    50   ~ 0
I2C_DAT
Text Label 750  1550 0    50   ~ 0
E_STOP
Text Label 750  1650 0    50   ~ 0
INT
Text Label 750  1750 0    50   ~ 0
SYNC
Wire Wire Line
	1200 1250 750  1250
Wire Wire Line
	750  1350 1200 1350
Wire Wire Line
	1150 1950 1150 1450
Wire Wire Line
	1200 1550 750  1550
Wire Wire Line
	750  1650 1200 1650
Wire Wire Line
	750  1750 1200 1750
$Comp
L power:+12V #PWR03
U 1 1 5FE73FEC
P 1600 1150
F 0 "#PWR03" H 1600 1000 50  0001 C CNN
F 1 "+12V" H 1615 1323 50  0000 C CNN
F 2 "" H 1600 1150 50  0001 C CNN
F 3 "" H 1600 1150 50  0001 C CNN
	1    1600 1150
	1    0    0    -1  
$EndComp
Wire Wire Line
	1650 2400 1650 2500
$Comp
L OCI_UPL_2_Capacitors:10uF_t C2
U 1 1 5FE84189
P 2100 1350
F 0 "C2" H 2215 1396 50  0000 L CNN
F 1 "10uF_t" H 2215 1305 50  0000 L CNN
F 2 "OCI_UPL_FOOTPRINTS:C_2312" H 2100 1100 30  0001 C CNN
F 3 "https://www.digikey.com/short/qcd8n7" H 2100 1550 30  0001 C CNN
F 4 "T491C106K025AT" H 2100 1600 30  0001 C CNN "Part #"
F 5 "2.021" H 2100 1150 30  0001 C CNN "UPL #"
	1    2100 1350
	1    0    0    -1  
$EndComp
$Comp
L power:GND #PWR09
U 1 1 5FE8418F
P 2100 1550
F 0 "#PWR09" H 2100 1300 50  0001 C CNN
F 1 "GND" H 2105 1377 50  0000 C CNN
F 2 "" H 2100 1550 50  0001 C CNN
F 3 "" H 2100 1550 50  0001 C CNN
	1    2100 1550
	1    0    0    -1  
$EndComp
Wire Wire Line
	2100 1200 2100 1150
Wire Wire Line
	2100 1550 2100 1500
$Comp
L power:+5V #PWR08
U 1 1 5FE8466D
P 2100 1150
F 0 "#PWR08" H 2100 1000 50  0001 C CNN
F 1 "+5V" H 2115 1323 50  0000 C CNN
F 2 "" H 2100 1150 50  0001 C CNN
F 3 "" H 2100 1150 50  0001 C CNN
	1    2100 1150
	1    0    0    -1  
$EndComp
Wire Notes Line
	700  5250 2650 5250
Wire Notes Line
	2650 5250 2650 750 
Wire Notes Line
	2650 750  700  750 
Wire Notes Line
	700  750  700  5250
Wire Notes Line
	2700 600  650  600 
Wire Notes Line
	650  600  650  5300
Text Notes 750  750  0    100  ~ 0
Core Slice Components
$Comp
L Graphic:Logo_Open_Hardware_Small Logo1
U 1 1 5FE4A934
P 10950 6850
F 0 "Logo1" H 10950 7125 50  0001 C CNN
F 1 "Logo_Open_Hardware_Small" H 10950 6625 50  0001 C CNN
F 2 "Symbol:OSHW-Symbol_6.7x6mm_SilkScreen" H 10950 6850 50  0001 C CNN
F 3 "~" H 10950 6850 50  0001 C CNN
	1    10950 6850
	1    0    0    -1  
$EndComp
$Comp
L Connector:AudioJack3 J2
U 1 1 60958487
P 9750 1150
F 0 "J2" H 9470 1083 50  0000 R CNN
F 1 "Aux" H 9470 1174 50  0000 R CNN
F 2 "Connector_Audio:Jack_3.5mm_CUI_SJ1-3533NG_Horizontal" H 9750 1150 50  0001 C CNN
F 3 "~" H 9750 1150 50  0001 C CNN
	1    9750 1150
	-1   0    0    1   
$EndComp
$Comp
L power:GND #PWR0101
U 1 1 60959A10
P 9400 1350
F 0 "#PWR0101" H 9400 1100 50  0001 C CNN
F 1 "GND" H 9405 1177 50  0000 C CNN
F 2 "" H 9400 1350 50  0001 C CNN
F 3 "" H 9400 1350 50  0001 C CNN
	1    9400 1350
	1    0    0    -1  
$EndComp
$Comp
L Connector:AudioJack3 J3
U 1 1 6095AE7C
P 9800 1950
F 0 "J3" H 9520 1883 50  0000 R CNN
F 1 "Q_Inch" H 9520 1974 50  0000 R CNN
F 2 "Connector_Audio:Jack_6.35mm_Neutrik_NMJ6HCD2_Horizontal" H 9800 1950 50  0001 C CNN
F 3 "~" H 9800 1950 50  0001 C CNN
	1    9800 1950
	-1   0    0    1   
$EndComp
$Comp
L power:GND #PWR0102
U 1 1 6095BDDB
P 9500 2200
F 0 "#PWR0102" H 9500 1950 50  0001 C CNN
F 1 "GND" H 9505 2027 50  0000 C CNN
F 2 "" H 9500 2200 50  0001 C CNN
F 3 "" H 9500 2200 50  0001 C CNN
	1    9500 2200
	1    0    0    -1  
$EndComp
Wire Wire Line
	9550 1250 9400 1250
Wire Wire Line
	9400 1250 9400 1350
Wire Wire Line
	9600 2050 9500 2050
Wire Wire Line
	9500 2050 9500 2200
$Comp
L Device:R R13
U 1 1 60962525
P 9000 1050
F 0 "R13" V 8900 1050 50  0000 C CNN
F 1 "500" V 9100 1050 50  0000 C CNN
F 2 "Resistor_SMD:R_1206_3216Metric_Pad1.30x1.75mm_HandSolder" V 8930 1050 50  0001 C CNN
F 3 "~" H 9000 1050 50  0001 C CNN
	1    9000 1050
	0    1    1    0   
$EndComp
$Comp
L Device:R R14
U 1 1 60962A94
P 9000 1150
F 0 "R14" V 9100 1150 50  0000 C CNN
F 1 "500" V 8900 1150 50  0000 C CNN
F 2 "Resistor_SMD:R_1206_3216Metric_Pad1.30x1.75mm_HandSolder" V 8930 1150 50  0001 C CNN
F 3 "~" H 9000 1150 50  0001 C CNN
	1    9000 1150
	0    1    1    0   
$EndComp
$Comp
L Device:R R15
U 1 1 60962DA0
P 9050 1850
F 0 "R15" V 8950 1850 50  0000 C CNN
F 1 "500" V 9050 1850 50  0000 C CNN
F 2 "Resistor_SMD:R_1206_3216Metric_Pad1.30x1.75mm_HandSolder" V 8980 1850 50  0001 C CNN
F 3 "~" H 9050 1850 50  0001 C CNN
	1    9050 1850
	0    1    1    0   
$EndComp
$Comp
L Device:R R16
U 1 1 609634EF
P 9050 1950
F 0 "R16" V 9150 1950 50  0000 C CNN
F 1 "500" V 9050 1950 50  0000 C CNN
F 2 "Resistor_SMD:R_1206_3216Metric_Pad1.30x1.75mm_HandSolder" V 8980 1950 50  0001 C CNN
F 3 "~" H 9050 1950 50  0001 C CNN
	1    9050 1950
	0    1    1    0   
$EndComp
Wire Wire Line
	9550 1050 9150 1050
Wire Wire Line
	9150 1150 9550 1150
Wire Wire Line
	9600 1850 9200 1850
Wire Wire Line
	9600 1950 9200 1950
Wire Wire Line
	8850 1050 8700 1050
Wire Wire Line
	8700 1150 8850 1150
Wire Wire Line
	8900 1850 8750 1850
Wire Wire Line
	8750 1950 8900 1950
Wire Wire Line
	8700 1050 8700 1100
Wire Wire Line
	8750 1850 8750 1900
$Comp
L Device:R_POT_TRIM RV1
U 1 1 609BDAE4
P 3850 1500
F 0 "RV1" H 3950 2250 50  0000 R CNN
F 1 "10k" H 4100 2150 50  0000 R CNN
F 2 "Potentiometer_THT:Potentiometer_Bourns_3266W_Vertical" H 3850 1500 50  0001 C CNN
F 3 "~" H 3850 1500 50  0001 C CNN
	1    3850 1500
	1    0    0    -1  
$EndComp
$Comp
L power:GND #PWR0103
U 1 1 609CA2D5
P 3850 1750
F 0 "#PWR0103" H 3850 1500 50  0001 C CNN
F 1 "GND" H 3855 1577 50  0000 C CNN
F 2 "" H 3850 1750 50  0001 C CNN
F 3 "" H 3850 1750 50  0001 C CNN
	1    3850 1750
	1    0    0    -1  
$EndComp
$Comp
L power:+5V #PWR0104
U 1 1 609CA9BF
P 3850 1200
F 0 "#PWR0104" H 3850 1050 50  0001 C CNN
F 1 "+5V" H 3865 1373 50  0000 C CNN
F 2 "" H 3850 1200 50  0001 C CNN
F 3 "" H 3850 1200 50  0001 C CNN
	1    3850 1200
	1    0    0    -1  
$EndComp
Wire Wire Line
	3850 1200 3850 1350
Wire Wire Line
	3850 1650 3850 1750
Wire Wire Line
	4000 1500 4250 1500
$Comp
L Device:R R1
U 1 1 609CE5EB
P 4600 1950
F 0 "R1" V 4393 1950 50  0000 C CNN
F 1 "1k" V 4484 1950 50  0000 C CNN
F 2 "Resistor_SMD:R_1206_3216Metric_Pad1.30x1.75mm_HandSolder" V 4530 1950 50  0001 C CNN
F 3 "~" H 4600 1950 50  0001 C CNN
	1    4600 1950
	0    1    1    0   
$EndComp
Wire Wire Line
	4250 1700 4250 1950
Wire Wire Line
	4250 1950 4450 1950
Wire Wire Line
	4750 1950 4900 1950
Wire Wire Line
	4900 1950 4900 1600
Wire Wire Line
	4900 1600 4850 1600
$Comp
L Device:R R2
U 1 1 609D6371
P 5050 1600
F 0 "R2" V 5200 1600 50  0000 C CNN
F 1 "1k" V 5300 1600 50  0000 C CNN
F 2 "Resistor_SMD:R_1206_3216Metric_Pad1.30x1.75mm_HandSolder" V 4980 1600 50  0001 C CNN
F 3 "~" H 5050 1600 50  0001 C CNN
	1    5050 1600
	0    1    1    0   
$EndComp
Connection ~ 4900 1600
Wire Wire Line
	5250 1600 5200 1600
Text Label 8550 1100 2    50   ~ 0
AUX_IN
Wire Wire Line
	8700 1100 8550 1100
Connection ~ 8700 1100
Wire Wire Line
	8700 1100 8700 1150
Text Label 8550 1900 2    50   ~ 0
Q_IN
Wire Wire Line
	8750 1900 8550 1900
Connection ~ 8750 1900
Wire Wire Line
	8750 1900 8750 1950
$Comp
L Device:R R4
U 1 1 609E7CEE
P 5150 1000
F 0 "R4" H 5000 950 50  0000 C CNN
F 1 "1k" H 5000 1050 50  0000 C CNN
F 2 "Resistor_SMD:R_1206_3216Metric_Pad1.30x1.75mm_HandSolder" V 5080 1000 50  0001 C CNN
F 3 "~" H 5150 1000 50  0001 C CNN
	1    5150 1000
	-1   0    0    1   
$EndComp
$Comp
L Amplifier_Operational:MCP6004 U1
U 1 1 6098AEE1
P 4550 1600
F 0 "U1" H 4350 1050 50  0000 C CNN
F 1 "MCP6004" H 4400 1150 50  0000 C CNN
F 2 "Package_DIP:DIP-14_W7.62mm_Socket" H 4500 1700 50  0001 C CNN
F 3 "http://ww1.microchip.com/downloads/en/DeviceDoc/21733j.pdf" H 4600 1800 50  0001 C CNN
	1    4550 1600
	1    0    0    -1  
$EndComp
Text Label 4600 1250 2    50   ~ 0
AUX_IN
Wire Wire Line
	4800 1400 4750 1400
Wire Wire Line
	4750 1400 4750 1250
Wire Wire Line
	4750 1250 4600 1250
Wire Wire Line
	5100 1400 5150 1400
Wire Wire Line
	5150 1150 5150 1400
Connection ~ 5150 1400
Wire Wire Line
	5150 1400 5250 1400
$Comp
L power:GND #PWR0105
U 1 1 609FD52D
P 4900 850
F 0 "#PWR0105" H 4900 600 50  0001 C CNN
F 1 "GND" H 4905 677 50  0000 C CNN
F 2 "" H 4900 850 50  0001 C CNN
F 3 "" H 4900 850 50  0001 C CNN
	1    4900 850 
	1    0    0    -1  
$EndComp
Wire Wire Line
	5150 850  5150 750 
Wire Wire Line
	5150 750  4900 750 
Wire Wire Line
	4900 750  4900 850 
Wire Wire Line
	5850 1500 5950 1500
$Comp
L Device:R R5
U 1 1 60A0D698
P 5600 1900
F 0 "R5" V 5750 1900 50  0000 C CNN
F 1 "1k" V 5850 1900 50  0000 C CNN
F 2 "Resistor_SMD:R_1206_3216Metric_Pad1.30x1.75mm_HandSolder" V 5530 1900 50  0001 C CNN
F 3 "~" H 5600 1900 50  0001 C CNN
	1    5600 1900
	0    1    1    0   
$EndComp
Wire Wire Line
	5200 1600 5200 1900
Wire Wire Line
	5200 1900 5450 1900
Connection ~ 5200 1600
Wire Wire Line
	5750 1900 5950 1900
Wire Wire Line
	5950 1900 5950 1500
Connection ~ 5950 1500
Wire Wire Line
	5950 1500 6100 1500
$Comp
L Device:R_POT_TRIM RV2
U 1 1 60A1136F
P 7000 1950
F 0 "RV2" H 6930 1904 50  0000 R CNN
F 1 "10k" H 6930 1995 50  0000 R CNN
F 2 "Potentiometer_THT:Potentiometer_Bourns_3266W_Vertical" H 7000 1950 50  0001 C CNN
F 3 "~" H 7000 1950 50  0001 C CNN
	1    7000 1950
	-1   0    0    1   
$EndComp
$Comp
L Device:R R6
U 1 1 60A11FAC
P 6500 1950
F 0 "R6" V 6650 1950 50  0000 C CNN
F 1 "1k" V 6750 1950 50  0000 C CNN
F 2 "Resistor_SMD:R_1206_3216Metric_Pad1.30x1.75mm_HandSolder" V 6430 1950 50  0001 C CNN
F 3 "~" H 6500 1950 50  0001 C CNN
	1    6500 1950
	0    1    1    0   
$EndComp
Wire Wire Line
	6100 1700 6100 1950
Wire Wire Line
	6100 1950 6350 1950
Wire Wire Line
	6650 1950 6850 1950
Wire Wire Line
	6700 1600 7000 1600
Wire Wire Line
	7000 1600 7000 1800
$Comp
L power:GND #PWR0106
U 1 1 60A1812F
P 7000 2150
F 0 "#PWR0106" H 7000 1900 50  0001 C CNN
F 1 "GND" H 7005 1977 50  0000 C CNN
F 2 "" H 7000 2150 50  0001 C CNN
F 3 "" H 7000 2150 50  0001 C CNN
	1    7000 2150
	1    0    0    -1  
$EndComp
Wire Wire Line
	7000 2100 7000 2150
Text Label 7250 1600 0    50   ~ 0
AUX_SW
Wire Wire Line
	7000 1600 7250 1600
Connection ~ 7000 1600
$Comp
L Device:R_POT_TRIM RV3
U 1 1 60A2BE37
P 3850 3050
F 0 "RV3" H 3950 3700 50  0000 R CNN
F 1 "10k" H 4050 3600 50  0000 R CNN
F 2 "Potentiometer_THT:Potentiometer_Bourns_3266W_Vertical" H 3850 3050 50  0001 C CNN
F 3 "~" H 3850 3050 50  0001 C CNN
	1    3850 3050
	1    0    0    -1  
$EndComp
$Comp
L power:GND #PWR0107
U 1 1 60A2BE3D
P 3850 3300
F 0 "#PWR0107" H 3850 3050 50  0001 C CNN
F 1 "GND" H 3855 3127 50  0000 C CNN
F 2 "" H 3850 3300 50  0001 C CNN
F 3 "" H 3850 3300 50  0001 C CNN
	1    3850 3300
	1    0    0    -1  
$EndComp
$Comp
L power:+5V #PWR0108
U 1 1 60A2BE43
P 3850 2750
F 0 "#PWR0108" H 3850 2600 50  0001 C CNN
F 1 "+5V" H 3865 2923 50  0000 C CNN
F 2 "" H 3850 2750 50  0001 C CNN
F 3 "" H 3850 2750 50  0001 C CNN
	1    3850 2750
	1    0    0    -1  
$EndComp
Wire Wire Line
	3850 2750 3850 2900
Wire Wire Line
	3850 3200 3850 3300
Wire Wire Line
	4000 3050 4250 3050
$Comp
L Device:R R7
U 1 1 60A2BE4C
P 4600 3500
F 0 "R7" V 4393 3500 50  0000 C CNN
F 1 "1k" V 4484 3500 50  0000 C CNN
F 2 "Resistor_SMD:R_1206_3216Metric_Pad1.30x1.75mm_HandSolder" V 4530 3500 50  0001 C CNN
F 3 "~" H 4600 3500 50  0001 C CNN
	1    4600 3500
	0    1    1    0   
$EndComp
Wire Wire Line
	4250 3250 4250 3500
Wire Wire Line
	4250 3500 4450 3500
Wire Wire Line
	4750 3500 4900 3500
Wire Wire Line
	4900 3500 4900 3150
Wire Wire Line
	4900 3150 4850 3150
$Comp
L Device:R R8
U 1 1 60A2BE57
P 5050 3150
F 0 "R8" V 5200 3150 50  0000 C CNN
F 1 "1k" V 5300 3150 50  0000 C CNN
F 2 "Resistor_SMD:R_1206_3216Metric_Pad1.30x1.75mm_HandSolder" V 4980 3150 50  0001 C CNN
F 3 "~" H 5050 3150 50  0001 C CNN
	1    5050 3150
	0    1    1    0   
$EndComp
Connection ~ 4900 3150
Wire Wire Line
	5250 3150 5200 3150
$Comp
L Device:R R10
U 1 1 60A2BE5F
P 5150 2550
F 0 "R10" H 5000 2500 50  0000 C CNN
F 1 "1k" H 5000 2600 50  0000 C CNN
F 2 "Resistor_SMD:R_1206_3216Metric_Pad1.30x1.75mm_HandSolder" V 5080 2550 50  0001 C CNN
F 3 "~" H 5150 2550 50  0001 C CNN
	1    5150 2550
	-1   0    0    1   
$EndComp
$Comp
L Device:R R9
U 1 1 60A2BE65
P 4950 2950
F 0 "R9" V 5100 2950 50  0000 C CNN
F 1 "1k" V 5200 2950 50  0000 C CNN
F 2 "Resistor_SMD:R_1206_3216Metric_Pad1.30x1.75mm_HandSolder" V 4880 2950 50  0001 C CNN
F 3 "~" H 4950 2950 50  0001 C CNN
	1    4950 2950
	0    -1   -1   0   
$EndComp
$Comp
L Amplifier_Operational:MCP6004 U2
U 1 1 60A2BE6B
P 4550 3150
F 0 "U2" H 4350 2600 50  0000 C CNN
F 1 "MCP6004" H 4400 2700 50  0000 C CNN
F 2 "Package_DIP:DIP-14_W7.62mm_Socket" H 4500 3250 50  0001 C CNN
F 3 "http://ww1.microchip.com/downloads/en/DeviceDoc/21733j.pdf" H 4600 3350 50  0001 C CNN
	1    4550 3150
	1    0    0    -1  
$EndComp
Text Label 4600 2800 2    50   ~ 0
Q_IN
Wire Wire Line
	4800 2950 4750 2950
Wire Wire Line
	4750 2950 4750 2800
Wire Wire Line
	4750 2800 4600 2800
Wire Wire Line
	5100 2950 5150 2950
Wire Wire Line
	5150 2700 5150 2950
Connection ~ 5150 2950
Wire Wire Line
	5150 2950 5250 2950
$Comp
L power:GND #PWR0109
U 1 1 60A2BE79
P 4900 2400
F 0 "#PWR0109" H 4900 2150 50  0001 C CNN
F 1 "GND" H 4905 2227 50  0000 C CNN
F 2 "" H 4900 2400 50  0001 C CNN
F 3 "" H 4900 2400 50  0001 C CNN
	1    4900 2400
	1    0    0    -1  
$EndComp
Wire Wire Line
	5150 2400 5150 2300
Wire Wire Line
	5150 2300 4900 2300
Wire Wire Line
	4900 2300 4900 2400
Wire Wire Line
	5850 3050 5950 3050
$Comp
L Device:R R11
U 1 1 60A2BE83
P 5600 3450
F 0 "R11" V 5750 3450 50  0000 C CNN
F 1 "1k" V 5850 3450 50  0000 C CNN
F 2 "Resistor_SMD:R_1206_3216Metric_Pad1.30x1.75mm_HandSolder" V 5530 3450 50  0001 C CNN
F 3 "~" H 5600 3450 50  0001 C CNN
	1    5600 3450
	0    1    1    0   
$EndComp
Wire Wire Line
	5200 3150 5200 3450
Wire Wire Line
	5200 3450 5450 3450
Connection ~ 5200 3150
Wire Wire Line
	5750 3450 5950 3450
Wire Wire Line
	5950 3450 5950 3050
Connection ~ 5950 3050
Wire Wire Line
	5950 3050 6100 3050
$Comp
L Device:R_POT_TRIM RV4
U 1 1 60A2BE90
P 7000 3500
F 0 "RV4" H 6930 3454 50  0000 R CNN
F 1 "10k" H 6930 3545 50  0000 R CNN
F 2 "Potentiometer_THT:Potentiometer_Bourns_3266W_Vertical" H 7000 3500 50  0001 C CNN
F 3 "~" H 7000 3500 50  0001 C CNN
	1    7000 3500
	-1   0    0    1   
$EndComp
$Comp
L Device:R R12
U 1 1 60A2BE96
P 6500 3500
F 0 "R12" V 6650 3500 50  0000 C CNN
F 1 "1k" V 6750 3500 50  0000 C CNN
F 2 "Resistor_SMD:R_1206_3216Metric_Pad1.30x1.75mm_HandSolder" V 6430 3500 50  0001 C CNN
F 3 "~" H 6500 3500 50  0001 C CNN
	1    6500 3500
	0    1    1    0   
$EndComp
Wire Wire Line
	6100 3250 6100 3500
Wire Wire Line
	6100 3500 6350 3500
Wire Wire Line
	6650 3500 6850 3500
Wire Wire Line
	7000 3150 7000 3350
$Comp
L power:GND #PWR0110
U 1 1 60A2BEA1
P 7000 3700
F 0 "#PWR0110" H 7000 3450 50  0001 C CNN
F 1 "GND" H 7005 3527 50  0000 C CNN
F 2 "" H 7000 3700 50  0001 C CNN
F 3 "" H 7000 3700 50  0001 C CNN
	1    7000 3700
	1    0    0    -1  
$EndComp
Wire Wire Line
	7000 3650 7000 3700
Text Label 7250 3150 0    50   ~ 0
Q_SW
Wire Wire Line
	7000 3150 7250 3150
Connection ~ 7000 3150
Text Label 10000 3000 0    50   ~ 0
Q_SW
Text Label 10000 2800 0    50   ~ 0
AUX_SW
Text Label 8950 2900 2    50   ~ 0
FILTER_IN
Wire Wire Line
	9200 2900 9150 2900
$Comp
L Device:C C4
U 1 1 60A7F808
P 5550 4700
F 0 "C4" H 5435 4654 50  0000 R CNN
F 1 "0.1 uF" H 5435 4745 50  0000 R CNN
F 2 "Capacitor_SMD:C_1206_3216Metric_Pad1.33x1.80mm_HandSolder" H 5588 4550 50  0001 C CNN
F 3 "~" H 5550 4700 50  0001 C CNN
	1    5550 4700
	-1   0    0    1   
$EndComp
$Comp
L power:GND #PWR0111
U 1 1 60A8C8A9
P 5550 4900
F 0 "#PWR0111" H 5550 4650 50  0001 C CNN
F 1 "GND" H 5700 4850 50  0000 C CNN
F 2 "" H 5550 4900 50  0001 C CNN
F 3 "" H 5550 4900 50  0001 C CNN
	1    5550 4900
	1    0    0    -1  
$EndComp
Wire Wire Line
	5300 4350 5550 4350
Wire Wire Line
	5550 4350 5550 4550
Wire Wire Line
	5550 4900 5550 4850
Connection ~ 5550 4350
Text Label 1150 4000 2    50   ~ 0
SIG_SEL
Wire Wire Line
	1250 4000 1150 4000
Wire Notes Line
	2700 5300 2700 600 
Wire Notes Line
	650  5300 2700 5300
$Comp
L Device:C C5
U 1 1 60C600A7
P 4150 5200
F 0 "C5" V 3898 5200 50  0000 C CNN
F 1 "0.1 uF" V 3989 5200 50  0000 C CNN
F 2 "Capacitor_SMD:C_1206_3216Metric_Pad1.33x1.80mm_HandSolder" H 4188 5050 50  0001 C CNN
F 3 "~" H 4150 5200 50  0001 C CNN
	1    4150 5200
	0    1    1    0   
$EndComp
$Comp
L Device:C C6
U 1 1 60C600AD
P 5550 5550
F 0 "C6" H 5435 5504 50  0000 R CNN
F 1 "0.1 uF" H 5435 5595 50  0000 R CNN
F 2 "Capacitor_SMD:C_1206_3216Metric_Pad1.33x1.80mm_HandSolder" H 5588 5400 50  0001 C CNN
F 3 "~" H 5550 5550 50  0001 C CNN
	1    5550 5550
	-1   0    0    1   
$EndComp
$Comp
L Device:R R19
U 1 1 60C600B3
P 4650 5550
F 0 "R19" H 4580 5504 50  0000 R CNN
F 1 "1.8 k" H 4580 5595 50  0000 R CNN
F 2 "Resistor_SMD:R_1206_3216Metric_Pad1.30x1.75mm_HandSolder" V 4580 5550 50  0001 C CNN
F 3 "~" H 4650 5550 50  0001 C CNN
	1    4650 5550
	-1   0    0    1   
$EndComp
$Comp
L Device:R R20
U 1 1 60C600B9
P 5150 5200
F 0 "R20" V 4943 5200 50  0000 C CNN
F 1 "900" V 5034 5200 50  0000 C CNN
F 2 "Resistor_SMD:R_1206_3216Metric_Pad1.30x1.75mm_HandSolder" V 5080 5200 50  0001 C CNN
F 3 "~" H 5150 5200 50  0001 C CNN
	1    5150 5200
	0    1    1    0   
$EndComp
$Comp
L power:GND #PWR0112
U 1 1 60C600BF
P 4650 5750
F 0 "#PWR0112" H 4650 5500 50  0001 C CNN
F 1 "GND" H 5000 5800 50  0000 C CNN
F 2 "" H 4650 5750 50  0001 C CNN
F 3 "" H 4650 5750 50  0001 C CNN
	1    4650 5750
	1    0    0    -1  
$EndComp
$Comp
L power:GND #PWR0113
U 1 1 60C600C5
P 5550 5750
F 0 "#PWR0113" H 5550 5500 50  0001 C CNN
F 1 "GND" H 5900 5800 50  0000 C CNN
F 2 "" H 5550 5750 50  0001 C CNN
F 3 "" H 5550 5750 50  0001 C CNN
	1    5550 5750
	1    0    0    -1  
$EndComp
Wire Wire Line
	4300 5200 4650 5200
Wire Wire Line
	5300 5200 5550 5200
Wire Wire Line
	5550 5200 5550 5400
Wire Wire Line
	4650 5400 4650 5200
Connection ~ 4650 5200
Wire Wire Line
	4650 5200 5000 5200
Wire Wire Line
	4650 5750 4650 5700
Wire Wire Line
	5550 5750 5550 5700
Text Label 3800 5200 2    50   ~ 0
FILTER_IN
Wire Wire Line
	3800 5200 4000 5200
Connection ~ 5550 5200
$Comp
L Device:C C7
U 1 1 60C66B5F
P 4150 6100
F 0 "C7" V 3898 6100 50  0000 C CNN
F 1 "0.1 uF" V 3989 6100 50  0000 C CNN
F 2 "Capacitor_SMD:C_1206_3216Metric_Pad1.33x1.80mm_HandSolder" H 4188 5950 50  0001 C CNN
F 3 "~" H 4150 6100 50  0001 C CNN
	1    4150 6100
	0    1    1    0   
$EndComp
$Comp
L Device:R R22
U 1 1 60C66B71
P 5150 6100
F 0 "R22" V 4943 6100 50  0000 C CNN
F 1 "600" V 5034 6100 50  0000 C CNN
F 2 "Resistor_SMD:R_1206_3216Metric_Pad1.30x1.75mm_HandSolder" V 5080 6100 50  0001 C CNN
F 3 "~" H 5150 6100 50  0001 C CNN
	1    5150 6100
	0    1    1    0   
$EndComp
Wire Wire Line
	4300 6100 4650 6100
Wire Wire Line
	5300 6100 5550 6100
Wire Wire Line
	5550 6100 5550 6300
Wire Wire Line
	4650 6300 4650 6100
Connection ~ 4650 6100
Wire Wire Line
	4650 6100 5000 6100
Text Label 3800 6100 2    50   ~ 0
FILTER_IN
Wire Wire Line
	3800 6100 4000 6100
Connection ~ 5550 6100
$Comp
L Device:C C11
U 1 1 60C77D95
P 8150 5550
F 0 "C11" V 7898 5550 50  0000 C CNN
F 1 "0.1 uF" V 7989 5550 50  0000 C CNN
F 2 "Capacitor_SMD:C_1206_3216Metric_Pad1.33x1.80mm_HandSolder" H 8188 5400 50  0001 C CNN
F 3 "~" H 8150 5550 50  0001 C CNN
	1    8150 5550
	0    1    1    0   
$EndComp
$Comp
L Device:C C12
U 1 1 60C77D9B
P 9550 5900
F 0 "C12" H 9435 5854 50  0000 R CNN
F 1 "0.1 uF" H 9435 5945 50  0000 R CNN
F 2 "Capacitor_SMD:C_1206_3216Metric_Pad1.33x1.80mm_HandSolder" H 9588 5750 50  0001 C CNN
F 3 "~" H 9550 5900 50  0001 C CNN
	1    9550 5900
	-1   0    0    1   
$EndComp
$Comp
L Device:R R25
U 1 1 60C77DA1
P 8650 5900
F 0 "R25" H 8580 5854 50  0000 R CNN
F 1 "450" H 8580 5945 50  0000 R CNN
F 2 "Resistor_SMD:R_1206_3216Metric_Pad1.30x1.75mm_HandSolder" V 8580 5900 50  0001 C CNN
F 3 "~" H 8650 5900 50  0001 C CNN
	1    8650 5900
	-1   0    0    1   
$EndComp
$Comp
L Device:R R26
U 1 1 60C77DA7
P 9150 5550
F 0 "R26" V 8943 5550 50  0000 C CNN
F 1 "360" V 9034 5550 50  0000 C CNN
F 2 "Resistor_SMD:R_1206_3216Metric_Pad1.30x1.75mm_HandSolder" V 9080 5550 50  0001 C CNN
F 3 "~" H 9150 5550 50  0001 C CNN
	1    9150 5550
	0    1    1    0   
$EndComp
$Comp
L power:GND #PWR0114
U 1 1 60C77DAD
P 8650 6100
F 0 "#PWR0114" H 8650 5850 50  0001 C CNN
F 1 "GND" H 9000 6150 50  0000 C CNN
F 2 "" H 8650 6100 50  0001 C CNN
F 3 "" H 8650 6100 50  0001 C CNN
	1    8650 6100
	1    0    0    -1  
$EndComp
$Comp
L power:GND #PWR0115
U 1 1 60C77DB3
P 9550 6100
F 0 "#PWR0115" H 9550 5850 50  0001 C CNN
F 1 "GND" H 9900 6150 50  0000 C CNN
F 2 "" H 9550 6100 50  0001 C CNN
F 3 "" H 9550 6100 50  0001 C CNN
	1    9550 6100
	1    0    0    -1  
$EndComp
Wire Wire Line
	8300 5550 8650 5550
Wire Wire Line
	9300 5550 9550 5550
Wire Wire Line
	9550 5550 9550 5750
Wire Wire Line
	8650 5750 8650 5550
Connection ~ 8650 5550
Wire Wire Line
	8650 5550 9000 5550
Wire Wire Line
	8650 6100 8650 6050
Wire Wire Line
	9550 6100 9550 6050
Text Label 7800 5550 2    50   ~ 0
FILTER_IN
Wire Wire Line
	7800 5550 8000 5550
Connection ~ 9550 5550
$Comp
L Device:R R18
U 1 1 60A81850
P 5150 4350
F 0 "R18" V 4943 4350 50  0000 C CNN
F 1 "1.8 k" V 5034 4350 50  0000 C CNN
F 2 "Resistor_SMD:R_1206_3216Metric_Pad1.30x1.75mm_HandSolder" V 5080 4350 50  0001 C CNN
F 3 "~" H 5150 4350 50  0001 C CNN
	1    5150 4350
	0    1    1    0   
$EndComp
$Comp
L Device:C C3
U 1 1 60CF4E96
P 4150 4350
F 0 "C3" V 3898 4350 50  0000 C CNN
F 1 "10 uF" V 3989 4350 50  0000 C CNN
F 2 "Capacitor_SMD:C_1206_3216Metric_Pad1.33x1.80mm_HandSolder" H 4188 4200 50  0001 C CNN
F 3 "~" H 4150 4350 50  0001 C CNN
	1    4150 4350
	0    1    1    0   
$EndComp
$Comp
L Device:R R17
U 1 1 60CF4E9C
P 4650 4700
F 0 "R17" H 4580 4654 50  0000 R CNN
F 1 "400" H 4580 4745 50  0000 R CNN
F 2 "Resistor_SMD:R_1206_3216Metric_Pad1.30x1.75mm_HandSolder" V 4580 4700 50  0001 C CNN
F 3 "~" H 4650 4700 50  0001 C CNN
	1    4650 4700
	-1   0    0    1   
$EndComp
$Comp
L power:GND #PWR0116
U 1 1 60CF4EA2
P 4650 4900
F 0 "#PWR0116" H 4650 4650 50  0001 C CNN
F 1 "GND" H 5000 4950 50  0000 C CNN
F 2 "" H 4650 4900 50  0001 C CNN
F 3 "" H 4650 4900 50  0001 C CNN
	1    4650 4900
	1    0    0    -1  
$EndComp
Wire Wire Line
	4300 4350 4650 4350
Wire Wire Line
	4650 4550 4650 4350
Connection ~ 4650 4350
Wire Wire Line
	4650 4350 5000 4350
Wire Wire Line
	4650 4900 4650 4850
Text Label 3800 4350 2    50   ~ 0
FILTER_IN
Wire Wire Line
	3800 4350 4000 4350
Text Label 6000 4350 0    50   ~ 0
LOW
Text Label 6000 5200 0    50   ~ 0
LOW_MID
Text Label 6000 6100 0    50   ~ 0
MID
Text Label 10000 5550 0    50   ~ 0
HIGH
Wire Wire Line
	5550 4350 6000 4350
Wire Wire Line
	5550 5200 6000 5200
Wire Wire Line
	5550 6100 6000 6100
Wire Wire Line
	9550 5550 10000 5550
$Comp
L Device:R R21
U 1 1 60C66B6B
P 4650 6450
F 0 "R21" H 4580 6404 50  0000 R CNN
F 1 "900" H 4580 6495 50  0000 R CNN
F 2 "Resistor_SMD:R_1206_3216Metric_Pad1.30x1.75mm_HandSolder" V 4580 6450 50  0001 C CNN
F 3 "~" H 4650 6450 50  0001 C CNN
	1    4650 6450
	-1   0    0    1   
$EndComp
$Comp
L Device:C C8
U 1 1 60C66B65
P 5550 6450
F 0 "C8" H 5435 6404 50  0000 R CNN
F 1 "0.1 uF" H 5435 6495 50  0000 R CNN
F 2 "Capacitor_SMD:C_1206_3216Metric_Pad1.33x1.80mm_HandSolder" H 5588 6300 50  0001 C CNN
F 3 "~" H 5550 6450 50  0001 C CNN
	1    5550 6450
	-1   0    0    1   
$EndComp
Wire Wire Line
	4650 6650 4650 6600
Wire Wire Line
	5550 6650 5550 6600
Wire Wire Line
	9550 4350 10000 4350
Text Label 10000 4350 0    50   ~ 0
HIGH_MID
Connection ~ 9550 4350
Wire Wire Line
	7800 4350 8000 4350
Text Label 7800 4350 2    50   ~ 0
FILTER_IN
Wire Wire Line
	9550 4900 9550 4850
Wire Wire Line
	8650 4900 8650 4850
Wire Wire Line
	8650 4350 9000 4350
Connection ~ 8650 4350
Wire Wire Line
	8650 4550 8650 4350
Wire Wire Line
	9550 4350 9550 4550
Wire Wire Line
	9300 4350 9550 4350
Wire Wire Line
	8300 4350 8650 4350
$Comp
L power:GND #PWR0117
U 1 1 60C6D53F
P 9550 4900
F 0 "#PWR0117" H 9550 4650 50  0001 C CNN
F 1 "GND" H 9550 4700 50  0000 C CNN
F 2 "" H 9550 4900 50  0001 C CNN
F 3 "" H 9550 4900 50  0001 C CNN
	1    9550 4900
	1    0    0    -1  
$EndComp
$Comp
L power:GND #PWR0118
U 1 1 60C6D539
P 8650 4900
F 0 "#PWR0118" H 8650 4650 50  0001 C CNN
F 1 "GND" H 8650 4700 50  0000 C CNN
F 2 "" H 8650 4900 50  0001 C CNN
F 3 "" H 8650 4900 50  0001 C CNN
	1    8650 4900
	1    0    0    -1  
$EndComp
$Comp
L Device:R R24
U 1 1 60C6D533
P 9150 4350
F 0 "R24" V 8943 4350 50  0000 C CNN
F 1 "450" V 9034 4350 50  0000 C CNN
F 2 "Resistor_SMD:R_1206_3216Metric_Pad1.30x1.75mm_HandSolder" V 9080 4350 50  0001 C CNN
F 3 "~" H 9150 4350 50  0001 C CNN
	1    9150 4350
	0    1    1    0   
$EndComp
$Comp
L Device:R R23
U 1 1 60C6D52D
P 8650 4700
F 0 "R23" H 8580 4654 50  0000 R CNN
F 1 "600" H 8580 4745 50  0000 R CNN
F 2 "Resistor_SMD:R_1206_3216Metric_Pad1.30x1.75mm_HandSolder" V 8580 4700 50  0001 C CNN
F 3 "~" H 8650 4700 50  0001 C CNN
	1    8650 4700
	-1   0    0    1   
$EndComp
$Comp
L Device:C C10
U 1 1 60C6D527
P 9550 4700
F 0 "C10" H 9435 4654 50  0000 R CNN
F 1 "0.1 uF" H 9435 4745 50  0000 R CNN
F 2 "Capacitor_SMD:C_1206_3216Metric_Pad1.33x1.80mm_HandSolder" H 9588 4550 50  0001 C CNN
F 3 "~" H 9550 4700 50  0001 C CNN
	1    9550 4700
	-1   0    0    1   
$EndComp
$Comp
L Device:C C9
U 1 1 60C6D521
P 8150 4350
F 0 "C9" V 7898 4350 50  0000 C CNN
F 1 "0.1 uF" V 7989 4350 50  0000 C CNN
F 2 "Capacitor_SMD:C_1206_3216Metric_Pad1.33x1.80mm_HandSolder" H 8188 4200 50  0001 C CNN
F 3 "~" H 8150 4350 50  0001 C CNN
	1    8150 4350
	0    1    1    0   
$EndComp
$Comp
L power:GND #PWR0119
U 1 1 60C66B7D
P 5550 6650
F 0 "#PWR0119" H 5550 6400 50  0001 C CNN
F 1 "GND" H 5900 6700 50  0000 C CNN
F 2 "" H 5550 6650 50  0001 C CNN
F 3 "" H 5550 6650 50  0001 C CNN
	1    5550 6650
	1    0    0    -1  
$EndComp
$Comp
L power:GND #PWR0120
U 1 1 60C66B77
P 4650 6650
F 0 "#PWR0120" H 4650 6400 50  0001 C CNN
F 1 "GND" H 5000 6700 50  0000 C CNN
F 2 "" H 4650 6650 50  0001 C CNN
F 3 "" H 4650 6650 50  0001 C CNN
	1    4650 6650
	1    0    0    -1  
$EndComp
Text Label 2350 3600 0    50   ~ 0
LOW
Text Label 2350 3700 0    50   ~ 0
LOW_MID
Text Label 2350 3800 0    50   ~ 0
MID
Text Label 2350 4100 0    50   ~ 0
HIGH_MID
Text Label 2350 4200 0    50   ~ 0
HIGH
Text Label 8950 3100 2    50   ~ 0
FULL_SPEC
Wire Wire Line
	9150 2900 9150 3100
Wire Wire Line
	9150 3100 8950 3100
Connection ~ 9150 2900
Wire Wire Line
	9150 2900 8950 2900
Text Label 2350 3500 0    50   ~ 0
FULL_SPEC
Wire Wire Line
	2350 3500 2250 3500
Wire Wire Line
	2350 3600 2250 3600
Wire Wire Line
	2350 3700 2250 3700
Wire Wire Line
	2350 3800 2250 3800
Wire Wire Line
	2350 4100 2250 4100
Wire Wire Line
	2350 4200 2250 4200
$Comp
L Amplifier_Operational:MCP6004 U1
U 5 1 60F545EA
P 3450 1450
F 0 "U1" H 3408 1496 50  0000 L CNN
F 1 "MCP6004" H 3408 1405 50  0000 L CNN
F 2 "Package_DIP:DIP-14_W7.62mm_Socket" H 3400 1550 50  0001 C CNN
F 3 "http://ww1.microchip.com/downloads/en/DeviceDoc/21733j.pdf" H 3500 1650 50  0001 C CNN
	5    3450 1450
	1    0    0    -1  
$EndComp
$Comp
L Amplifier_Operational:MCP6004 U2
U 5 1 60F5A12F
P 3450 3000
F 0 "U2" H 3408 3046 50  0000 L CNN
F 1 "MCP6004" H 3408 2955 50  0000 L CNN
F 2 "Package_DIP:DIP-14_W7.62mm_Socket" H 3400 3100 50  0001 C CNN
F 3 "http://ww1.microchip.com/downloads/en/DeviceDoc/21733j.pdf" H 3500 3200 50  0001 C CNN
	5    3450 3000
	1    0    0    -1  
$EndComp
$Comp
L Amplifier_Operational:MCP6004 U1
U 3 1 60F6BD95
P 6400 1600
F 0 "U1" H 6400 1967 50  0000 C CNN
F 1 "MCP6004" H 6400 1876 50  0000 C CNN
F 2 "Package_DIP:DIP-14_W7.62mm_Socket" H 6350 1700 50  0001 C CNN
F 3 "http://ww1.microchip.com/downloads/en/DeviceDoc/21733j.pdf" H 6450 1800 50  0001 C CNN
	3    6400 1600
	1    0    0    -1  
$EndComp
$Comp
L Amplifier_Operational:MCP6004 U1
U 2 1 60F5C440
P 5550 1500
F 0 "U1" H 5550 1867 50  0000 C CNN
F 1 "MCP6004" H 5550 1776 50  0000 C CNN
F 2 "Package_DIP:DIP-14_W7.62mm_Socket" H 5500 1600 50  0001 C CNN
F 3 "http://ww1.microchip.com/downloads/en/DeviceDoc/21733j.pdf" H 5600 1700 50  0001 C CNN
	2    5550 1500
	1    0    0    -1  
$EndComp
$Comp
L Amplifier_Operational:MCP6004 U2
U 2 1 60F878C0
P 5550 3050
F 0 "U2" H 5550 3417 50  0000 C CNN
F 1 "MCP6004" H 5550 3326 50  0000 C CNN
F 2 "Package_DIP:DIP-14_W7.62mm_Socket" H 5500 3150 50  0001 C CNN
F 3 "http://ww1.microchip.com/downloads/en/DeviceDoc/21733j.pdf" H 5600 3250 50  0001 C CNN
	2    5550 3050
	1    0    0    -1  
$EndComp
Wire Wire Line
	6700 3150 7000 3150
$Comp
L Amplifier_Operational:MCP6004 U2
U 3 1 60F8B60A
P 6400 3150
F 0 "U2" H 6400 3517 50  0000 C CNN
F 1 "MCP6004" H 6400 3426 50  0000 C CNN
F 2 "Package_DIP:DIP-14_W7.62mm_Socket" H 6350 3250 50  0001 C CNN
F 3 "http://ww1.microchip.com/downloads/en/DeviceDoc/21733j.pdf" H 6450 3350 50  0001 C CNN
	3    6400 3150
	1    0    0    -1  
$EndComp
$Comp
L power:+5V #PWR0121
U 1 1 60F8CB03
P 3350 1150
F 0 "#PWR0121" H 3350 1000 50  0001 C CNN
F 1 "+5V" H 3365 1323 50  0000 C CNN
F 2 "" H 3350 1150 50  0001 C CNN
F 3 "" H 3350 1150 50  0001 C CNN
	1    3350 1150
	1    0    0    -1  
$EndComp
$Comp
L power:+5V #PWR0122
U 1 1 60FAD54F
P 3350 2700
F 0 "#PWR0122" H 3350 2550 50  0001 C CNN
F 1 "+5V" H 3365 2873 50  0000 C CNN
F 2 "" H 3350 2700 50  0001 C CNN
F 3 "" H 3350 2700 50  0001 C CNN
	1    3350 2700
	1    0    0    -1  
$EndComp
$Comp
L power:GND #PWR0123
U 1 1 60FAEA10
P 3350 1750
F 0 "#PWR0123" H 3350 1500 50  0001 C CNN
F 1 "GND" H 3355 1577 50  0000 C CNN
F 2 "" H 3350 1750 50  0001 C CNN
F 3 "" H 3350 1750 50  0001 C CNN
	1    3350 1750
	1    0    0    -1  
$EndComp
$Comp
L power:GND #PWR0124
U 1 1 60FAF92B
P 3350 3300
F 0 "#PWR0124" H 3350 3050 50  0001 C CNN
F 1 "GND" H 3355 3127 50  0000 C CNN
F 2 "" H 3350 3300 50  0001 C CNN
F 3 "" H 3350 3300 50  0001 C CNN
	1    3350 3300
	1    0    0    -1  
$EndComp
$Comp
L Device:R R3
U 1 1 609E870D
P 4950 1400
F 0 "R3" V 5100 1400 50  0000 C CNN
F 1 "1k" V 5200 1400 50  0000 C CNN
F 2 "Resistor_SMD:R_1206_3216Metric_Pad1.30x1.75mm_HandSolder" V 4880 1400 50  0001 C CNN
F 3 "~" H 4950 1400 50  0001 C CNN
	1    4950 1400
	0    -1   -1   0   
$EndComp
NoConn ~ 1250 4200
NoConn ~ 1250 4100
NoConn ~ 1250 3900
NoConn ~ 1250 3800
NoConn ~ 1250 3700
NoConn ~ 1250 3600
NoConn ~ 1250 3500
NoConn ~ 1250 3400
Wire Wire Line
	9200 2800 9200 2900
Wire Wire Line
	9200 2800 10000 2800
Wire Wire Line
	9200 3000 9200 2900
Wire Wire Line
	9200 3000 10000 3000
Connection ~ 9200 2900
$EndSCHEMATC
