%TF.GenerationSoftware,KiCad,Pcbnew,(6.0.4)*%
%TF.CreationDate,2023-07-24T12:51:13-04:00*%
%TF.ProjectId,BREAD_Slice,42524541-445f-4536-9c69-63652e6b6963,rev?*%
%TF.SameCoordinates,Original*%
%TF.FileFunction,Profile,NP*%
%FSLAX46Y46*%
G04 Gerber Fmt 4.6, Leading zero omitted, Abs format (unit mm)*
G04 Created by KiCad (PCBNEW (6.0.4)) date 2023-07-24 12:51:13*
%MOMM*%
%LPD*%
G01*
G04 APERTURE LIST*
%TA.AperFunction,Profile*%
%ADD10C,0.050000*%
%TD*%
G04 APERTURE END LIST*
D10*
X192600000Y-44800000D02*
X192600000Y-134800000D01*
X127600000Y-39800000D02*
G75*
G03*
X122600000Y-44800000I0J-5000000D01*
G01*
X122600000Y-134800000D02*
G75*
G03*
X127600000Y-139800000I5000000J0D01*
G01*
X192600000Y-44800000D02*
G75*
G03*
X187600000Y-39800000I-5000000J0D01*
G01*
X127600000Y-39800000D02*
X187600000Y-39800000D01*
X187600000Y-139800000D02*
G75*
G03*
X192600000Y-134800000I0J5000000D01*
G01*
X127600000Y-139800000D02*
X187600000Y-139800000D01*
X122600000Y-134800000D02*
X122600000Y-44800000D01*
M02*
