EESchema Schematic File Version 4
EELAYER 30 0
EELAYER END
$Descr A4 11693 8268
encoding utf-8
Sheet 1 1
Title ""
Date ""
Rev ""
Comp ""
Comment1 ""
Comment2 ""
Comment3 ""
Comment4 ""
$EndDescr
$Comp
L power:GND #PWR06
U 1 1 5FA66343
P 1800 4600
F 0 "#PWR06" H 1800 4350 50  0001 C CNN
F 1 "GND" H 2150 4650 50  0000 C CNN
F 2 "" H 1800 4600 50  0001 C CNN
F 3 "" H 1800 4600 50  0001 C CNN
	1    1800 4600
	1    0    0    -1  
$EndComp
Wire Wire Line
	1750 4500 1750 4550
Wire Wire Line
	1750 4550 1800 4550
Wire Wire Line
	1850 4550 1850 4500
Wire Wire Line
	1800 4550 1800 4600
Connection ~ 1800 4550
Wire Wire Line
	1800 4550 1850 4550
$Comp
L power:+5V #PWR07
U 1 1 5FA67628
P 1950 2400
F 0 "#PWR07" H 1950 2250 50  0001 C CNN
F 1 "+5V" H 1965 2573 50  0000 C CNN
F 2 "" H 1950 2400 50  0001 C CNN
F 3 "" H 1950 2400 50  0001 C CNN
	1    1950 2400
	1    0    0    -1  
$EndComp
Wire Wire Line
	1950 2400 1950 2500
$Comp
L power:+12V #PWR05
U 1 1 5FA6990A
P 1650 2400
F 0 "#PWR05" H 1650 2250 50  0001 C CNN
F 1 "+12V" H 1665 2573 50  0000 C CNN
F 2 "" H 1650 2400 50  0001 C CNN
F 3 "" H 1650 2400 50  0001 C CNN
	1    1650 2400
	1    0    0    -1  
$EndComp
NoConn ~ 1250 2900
NoConn ~ 1250 3000
Wire Wire Line
	800  3300 1250 3300
Text Label 800  3200 0    50   ~ 0
INT
Text Label 2600 4000 2    50   ~ 0
I2C_CLK
Text Label 2600 3900 2    50   ~ 0
I2C_DAT
Wire Wire Line
	2600 3900 2250 3900
Wire Wire Line
	2250 4000 2600 4000
NoConn ~ 1850 2500
NoConn ~ 2250 2900
NoConn ~ 2250 3000
NoConn ~ 2250 3300
Text Label 800  3100 0    50   ~ 0
E_STOP
Wire Wire Line
	800  3200 1250 3200
Wire Wire Line
	1250 3100 800  3100
$Comp
L OCI_UPL_2_Capacitors:10uF_t C1
U 1 1 5FA94020
P 1600 1350
F 0 "C1" H 1715 1396 50  0000 L CNN
F 1 "10uF_t" H 1715 1305 50  0000 L CNN
F 2 "OCI_UPL_FOOTPRINTS:C_2312" H 1600 1100 30  0001 C CNN
F 3 "https://www.digikey.com/short/qcd8n7" H 1600 1550 30  0001 C CNN
F 4 "T491C106K025AT" H 1600 1600 30  0001 C CNN "Part #"
F 5 "2.021" H 1600 1150 30  0001 C CNN "UPL #"
	1    1600 1350
	1    0    0    -1  
$EndComp
$Comp
L power:GND #PWR04
U 1 1 5FA94026
P 1600 1550
F 0 "#PWR04" H 1600 1300 50  0001 C CNN
F 1 "GND" H 1605 1377 50  0000 C CNN
F 2 "" H 1600 1550 50  0001 C CNN
F 3 "" H 1600 1550 50  0001 C CNN
	1    1600 1550
	1    0    0    -1  
$EndComp
Wire Wire Line
	1600 1200 1600 1150
Wire Wire Line
	1600 1550 1600 1500
$Comp
L Mechanical:MountingHole H1
U 1 1 5FAB1765
P 1100 4900
F 0 "H1" H 1200 4946 50  0000 L CNN
F 1 "MountingHole" H 1200 4855 50  0000 L CNN
F 2 "MountingHole:MountingHole_3.2mm_M3_DIN965_Pad" H 1100 4900 50  0001 C CNN
F 3 "~" H 1100 4900 50  0001 C CNN
	1    1100 4900
	1    0    0    -1  
$EndComp
$Comp
L Mechanical:MountingHole H3
U 1 1 5FAB1B3E
P 1850 4900
F 0 "H3" H 1950 4946 50  0000 L CNN
F 1 "MountingHole" H 1950 4855 50  0000 L CNN
F 2 "MountingHole:MountingHole_3.2mm_M3_DIN965_Pad" H 1850 4900 50  0001 C CNN
F 3 "~" H 1850 4900 50  0001 C CNN
	1    1850 4900
	1    0    0    -1  
$EndComp
$Comp
L Mechanical:MountingHole H2
U 1 1 5FAB217D
P 1100 5100
F 0 "H2" H 1200 5146 50  0000 L CNN
F 1 "MountingHole" H 1200 5055 50  0000 L CNN
F 2 "MountingHole:MountingHole_3.2mm_M3_DIN965_Pad" H 1100 5100 50  0001 C CNN
F 3 "~" H 1100 5100 50  0001 C CNN
	1    1100 5100
	1    0    0    -1  
$EndComp
$Comp
L Mechanical:MountingHole H4
U 1 1 5FAB25F7
P 1850 5100
F 0 "H4" H 1950 5146 50  0000 L CNN
F 1 "MountingHole" H 1950 5055 50  0000 L CNN
F 2 "MountingHole:MountingHole_3.2mm_M3_DIN965_Pad" H 1850 5100 50  0001 C CNN
F 3 "~" H 1850 5100 50  0001 C CNN
	1    1850 5100
	1    0    0    -1  
$EndComp
$Comp
L MCU_Module:Arduino_Nano_v3.x A1
U 1 1 5FCAD89B
P 1750 3500
F 0 "A1" H 1750 2411 50  0000 C CNN
F 1 "Arduino_Nano_v3.x" H 2250 2550 50  0000 C CNN
F 2 "Module:Arduino_Nano" H 1750 3500 50  0001 C CIN
F 3 "http://www.mouser.com/pdfdocs/Gravitech_Arduino_Nano3_0.pdf" H 1750 3500 50  0001 C CNN
	1    1750 3500
	1    0    0    -1  
$EndComp
Text Label 800  3300 0    50   ~ 0
SYNC
$Comp
L Connector:Conn_01x10_Female J1
U 1 1 5FE6B3C7
P 1400 1450
F 0 "J1" H 1428 1380 50  0000 L CNN
F 1 "Conn_01x10_Female" H 1428 1335 50  0001 L CNN
F 2 "Connector_PinSocket_2.54mm:PinSocket_1x10_P2.54mm_Horizontal" H 1400 1450 50  0001 C CNN
F 3 "~" H 1400 1450 50  0001 C CNN
	1    1400 1450
	1    0    0    -1  
$EndComp
$Comp
L power:+12V #PWR01
U 1 1 5FE6D224
P 1100 1000
F 0 "#PWR01" H 1100 850 50  0001 C CNN
F 1 "+12V" H 1115 1173 50  0000 C CNN
F 2 "" H 1100 1000 50  0001 C CNN
F 3 "" H 1100 1000 50  0001 C CNN
	1    1100 1000
	1    0    0    -1  
$EndComp
$Comp
L power:GND #PWR02
U 1 1 5FE6E4CA
P 1150 2000
F 0 "#PWR02" H 1150 1750 50  0001 C CNN
F 1 "GND" H 1155 1827 50  0000 C CNN
F 2 "" H 1150 2000 50  0001 C CNN
F 3 "" H 1150 2000 50  0001 C CNN
	1    1150 2000
	1    0    0    -1  
$EndComp
Wire Wire Line
	1150 2000 1150 1950
Wire Wire Line
	1150 1050 1200 1050
Wire Wire Line
	1200 1950 1150 1950
Connection ~ 1150 1950
Wire Wire Line
	1100 1000 1100 1150
Wire Wire Line
	1100 1150 1200 1150
Wire Wire Line
	1200 1850 1100 1850
Wire Wire Line
	1100 1850 1100 1150
Connection ~ 1100 1150
Wire Wire Line
	1200 1450 1150 1450
Connection ~ 1150 1450
Wire Wire Line
	1150 1450 1150 1050
Text Label 750  1250 0    50   ~ 0
I2C_CLK
Text Label 750  1350 0    50   ~ 0
I2C_DAT
Text Label 750  1550 0    50   ~ 0
E_STOP
Text Label 750  1650 0    50   ~ 0
INT
Text Label 750  1750 0    50   ~ 0
SYNC
Wire Wire Line
	1200 1250 750  1250
Wire Wire Line
	750  1350 1200 1350
Wire Wire Line
	1150 1950 1150 1450
Wire Wire Line
	1200 1550 750  1550
Wire Wire Line
	750  1650 1200 1650
Wire Wire Line
	750  1750 1200 1750
$Comp
L power:+12V #PWR03
U 1 1 5FE73FEC
P 1600 1150
F 0 "#PWR03" H 1600 1000 50  0001 C CNN
F 1 "+12V" H 1615 1323 50  0000 C CNN
F 2 "" H 1600 1150 50  0001 C CNN
F 3 "" H 1600 1150 50  0001 C CNN
	1    1600 1150
	1    0    0    -1  
$EndComp
Wire Wire Line
	1650 2400 1650 2500
$Comp
L OCI_UPL_2_Capacitors:10uF_t C2
U 1 1 5FE84189
P 2100 1350
F 0 "C2" H 2215 1396 50  0000 L CNN
F 1 "10uF_t" H 2215 1305 50  0000 L CNN
F 2 "OCI_UPL_FOOTPRINTS:C_2312" H 2100 1100 30  0001 C CNN
F 3 "https://www.digikey.com/short/qcd8n7" H 2100 1550 30  0001 C CNN
F 4 "T491C106K025AT" H 2100 1600 30  0001 C CNN "Part #"
F 5 "2.021" H 2100 1150 30  0001 C CNN "UPL #"
	1    2100 1350
	1    0    0    -1  
$EndComp
$Comp
L power:GND #PWR09
U 1 1 5FE8418F
P 2100 1550
F 0 "#PWR09" H 2100 1300 50  0001 C CNN
F 1 "GND" H 2105 1377 50  0000 C CNN
F 2 "" H 2100 1550 50  0001 C CNN
F 3 "" H 2100 1550 50  0001 C CNN
	1    2100 1550
	1    0    0    -1  
$EndComp
Wire Wire Line
	2100 1200 2100 1150
Wire Wire Line
	2100 1550 2100 1500
$Comp
L power:+5V #PWR08
U 1 1 5FE8466D
P 2100 1150
F 0 "#PWR08" H 2100 1000 50  0001 C CNN
F 1 "+5V" H 2115 1323 50  0000 C CNN
F 2 "" H 2100 1150 50  0001 C CNN
F 3 "" H 2100 1150 50  0001 C CNN
	1    2100 1150
	1    0    0    -1  
$EndComp
Wire Notes Line
	700  5250 2650 5250
Wire Notes Line
	2650 5250 2650 750 
Wire Notes Line
	2650 750  700  750 
Wire Notes Line
	700  750  700  5250
Wire Notes Line
	650  5300 2700 5300
Wire Notes Line
	2700 5300 2700 600 
Wire Notes Line
	2700 600  650  600 
Wire Notes Line
	650  600  650  5300
Text Notes 750  750  0    100  ~ 0
Core Slice Components
$Comp
L Graphic:Logo_Open_Hardware_Small Logo1
U 1 1 5FE4A934
P 10950 6850
F 0 "Logo1" H 10950 7125 50  0001 C CNN
F 1 "Logo_Open_Hardware_Small" H 10950 6625 50  0001 C CNN
F 2 "Symbol:OSHW-Symbol_6.7x6mm_SilkScreen" H 10950 6850 50  0001 C CNN
F 3 "~" H 10950 6850 50  0001 C CNN
	1    10950 6850
	1    0    0    -1  
$EndComp
$Comp
L Connector:Screw_Terminal_01x03 J2
U 1 1 60A582EB
P 4950 1600
F 0 "J2" H 5030 1642 50  0000 L CNN
F 1 "Screw_Terminal_01x03" H 5030 1551 50  0000 L CNN
F 2 "TerminalBlock_TE-Connectivity:TerminalBlock_TE_282834-3_1x03_P2.54mm_Horizontal" H 4950 1600 50  0001 C CNN
F 3 "~" H 4950 1600 50  0001 C CNN
	1    4950 1600
	1    0    0    -1  
$EndComp
Text Label 4550 1500 2    50   ~ 0
PWM1
$Comp
L power:GND #PWR011
U 1 1 60A5F4C4
P 4650 1800
F 0 "#PWR011" H 4650 1550 50  0001 C CNN
F 1 "GND" H 4655 1627 50  0000 C CNN
F 2 "" H 4650 1800 50  0001 C CNN
F 3 "" H 4650 1800 50  0001 C CNN
	1    4650 1800
	1    0    0    -1  
$EndComp
Wire Wire Line
	4750 1500 4550 1500
Wire Wire Line
	4750 1600 4550 1600
Wire Wire Line
	4750 1700 4650 1700
Wire Wire Line
	4650 1700 4650 1800
$Comp
L Connector:Screw_Terminal_01x03 J4
U 1 1 60A682C3
P 6950 1550
F 0 "J4" H 7030 1592 50  0000 L CNN
F 1 "Screw_Terminal_01x03" H 7030 1501 50  0000 L CNN
F 2 "TerminalBlock_TE-Connectivity:TerminalBlock_TE_282834-3_1x03_P2.54mm_Horizontal" H 6950 1550 50  0001 C CNN
F 3 "~" H 6950 1550 50  0001 C CNN
	1    6950 1550
	1    0    0    -1  
$EndComp
Text Label 6550 1450 2    50   ~ 0
PWM2
$Comp
L power:GND #PWR015
U 1 1 60A682D0
P 6650 1750
F 0 "#PWR015" H 6650 1500 50  0001 C CNN
F 1 "GND" H 6655 1577 50  0000 C CNN
F 2 "" H 6650 1750 50  0001 C CNN
F 3 "" H 6650 1750 50  0001 C CNN
	1    6650 1750
	1    0    0    -1  
$EndComp
Wire Wire Line
	6750 1450 6550 1450
Wire Wire Line
	6750 1550 6550 1550
Wire Wire Line
	6750 1650 6650 1650
Wire Wire Line
	6650 1650 6650 1750
$Comp
L Connector:Screw_Terminal_01x03 J6
U 1 1 60A69345
P 8900 1550
F 0 "J6" H 8980 1592 50  0000 L CNN
F 1 "Screw_Terminal_01x03" H 8980 1501 50  0000 L CNN
F 2 "TerminalBlock_TE-Connectivity:TerminalBlock_TE_282834-3_1x03_P2.54mm_Horizontal" H 8900 1550 50  0001 C CNN
F 3 "~" H 8900 1550 50  0001 C CNN
	1    8900 1550
	1    0    0    -1  
$EndComp
Text Label 8500 1450 2    50   ~ 0
PWM3
$Comp
L power:GND #PWR019
U 1 1 60A69352
P 8600 1750
F 0 "#PWR019" H 8600 1500 50  0001 C CNN
F 1 "GND" H 8605 1577 50  0000 C CNN
F 2 "" H 8600 1750 50  0001 C CNN
F 3 "" H 8600 1750 50  0001 C CNN
	1    8600 1750
	1    0    0    -1  
$EndComp
Wire Wire Line
	8700 1450 8500 1450
Wire Wire Line
	8700 1550 8500 1550
Wire Wire Line
	8700 1650 8600 1650
Wire Wire Line
	8600 1650 8600 1750
$Comp
L Connector:Screw_Terminal_01x03 J3
U 1 1 60A6A56F
P 6000 2750
F 0 "J3" H 6080 2792 50  0000 L CNN
F 1 "Screw_Terminal_01x03" H 6080 2701 50  0000 L CNN
F 2 "TerminalBlock_TE-Connectivity:TerminalBlock_TE_282834-3_1x03_P2.54mm_Horizontal" H 6000 2750 50  0001 C CNN
F 3 "~" H 6000 2750 50  0001 C CNN
	1    6000 2750
	1    0    0    -1  
$EndComp
Text Label 5600 2650 2    50   ~ 0
PWM4
$Comp
L power:GND #PWR013
U 1 1 60A6A57C
P 5700 2950
F 0 "#PWR013" H 5700 2700 50  0001 C CNN
F 1 "GND" H 5705 2777 50  0000 C CNN
F 2 "" H 5700 2950 50  0001 C CNN
F 3 "" H 5700 2950 50  0001 C CNN
	1    5700 2950
	1    0    0    -1  
$EndComp
Wire Wire Line
	5800 2650 5600 2650
Wire Wire Line
	5800 2750 5600 2750
Wire Wire Line
	5800 2850 5700 2850
Wire Wire Line
	5700 2850 5700 2950
$Comp
L Connector:Screw_Terminal_01x03 J5
U 1 1 60A6C181
P 8150 2750
F 0 "J5" H 8230 2792 50  0000 L CNN
F 1 "Screw_Terminal_01x03" H 8230 2701 50  0000 L CNN
F 2 "TerminalBlock_TE-Connectivity:TerminalBlock_TE_282834-3_1x03_P2.54mm_Horizontal" H 8150 2750 50  0001 C CNN
F 3 "~" H 8150 2750 50  0001 C CNN
	1    8150 2750
	1    0    0    -1  
$EndComp
Text Label 7750 2650 2    50   ~ 0
PWM5
$Comp
L power:GND #PWR017
U 1 1 60A6C18E
P 7850 2950
F 0 "#PWR017" H 7850 2700 50  0001 C CNN
F 1 "GND" H 7855 2777 50  0000 C CNN
F 2 "" H 7850 2950 50  0001 C CNN
F 3 "" H 7850 2950 50  0001 C CNN
	1    7850 2950
	1    0    0    -1  
$EndComp
Wire Wire Line
	7950 2650 7750 2650
Wire Wire Line
	7950 2750 7750 2750
Wire Wire Line
	7850 2850 7850 2950
Text Label 1150 3400 2    50   ~ 0
PWM1
Text Label 1150 3500 2    50   ~ 0
PWM2
Text Label 1150 3800 2    50   ~ 0
PWM3
Text Label 1150 3900 2    50   ~ 0
PWM4
Text Label 1150 4000 2    50   ~ 0
PWM5
Wire Wire Line
	1150 3400 1250 3400
Wire Wire Line
	1150 3500 1250 3500
Wire Wire Line
	1150 3800 1250 3800
Wire Wire Line
	1150 3900 1250 3900
Wire Wire Line
	1150 4000 1250 4000
Wire Wire Line
	7950 2850 7850 2850
NoConn ~ 1250 3600
NoConn ~ 1250 3700
NoConn ~ 1250 4100
NoConn ~ 1250 4200
NoConn ~ 2250 4200
NoConn ~ 2250 4100
NoConn ~ 2250 3800
NoConn ~ 2250 3700
NoConn ~ 2250 3600
NoConn ~ 2250 3500
$Comp
L Connector:Conn_01x03_Male J7
U 1 1 60AC40B6
P 5900 3900
F 0 "J7" H 5850 4200 50  0000 C CNN
F 1 "Conn_01x03_Male" H 5900 4100 50  0000 C CNN
F 2 "Connector_PinSocket_2.54mm:PinSocket_1x03_P2.54mm_Vertical" H 5900 3900 50  0001 C CNN
F 3 "~" H 5900 3900 50  0001 C CNN
	1    5900 3900
	-1   0    0    1   
$EndComp
$Comp
L power:+12V #PWR010
U 1 1 60AC9B99
P 5550 3700
F 0 "#PWR010" H 5550 3550 50  0001 C CNN
F 1 "+12V" H 5565 3873 50  0000 C CNN
F 2 "" H 5550 3700 50  0001 C CNN
F 3 "" H 5550 3700 50  0001 C CNN
	1    5550 3700
	1    0    0    -1  
$EndComp
Text Label 5550 3900 2    50   ~ 0
CSTM
Wire Wire Line
	5700 4000 5550 4000
Wire Wire Line
	5700 3900 5550 3900
Text Label 5600 2750 2    50   ~ 0
PWR
Text Label 5550 4000 2    50   ~ 0
PWR
Text Label 7750 2750 2    50   ~ 0
PWR
Text Label 4550 1600 2    50   ~ 0
PWR
Text Label 6550 1550 2    50   ~ 0
PWR
$Comp
L Connector:Screw_Terminal_01x02 J8
U 1 1 60AD530D
P 7500 4050
F 0 "J8" H 7580 4042 50  0000 L CNN
F 1 "Screw_Terminal_01x02" H 7580 3951 50  0000 L CNN
F 2 "TerminalBlock_TE-Connectivity:TerminalBlock_TE_282834-2_1x02_P2.54mm_Horizontal" H 7500 4050 50  0001 C CNN
F 3 "~" H 7500 4050 50  0001 C CNN
	1    7500 4050
	1    0    0    -1  
$EndComp
Wire Wire Line
	5700 3800 5550 3800
Wire Wire Line
	5550 3800 5550 3700
Text Label 7150 4050 2    50   ~ 0
CSTM
$Comp
L power:GND #PWR012
U 1 1 60ADDB68
P 7150 4150
F 0 "#PWR012" H 7150 3900 50  0001 C CNN
F 1 "GND" H 7155 3977 50  0000 C CNN
F 2 "" H 7150 4150 50  0001 C CNN
F 3 "" H 7150 4150 50  0001 C CNN
	1    7150 4150
	1    0    0    -1  
$EndComp
Wire Wire Line
	7300 4050 7150 4050
Wire Wire Line
	7300 4150 7150 4150
$EndSCHEMATC
