%TF.GenerationSoftware,KiCad,Pcbnew,(6.0.4)*%
%TF.CreationDate,2023-02-01T16:26:22-05:00*%
%TF.ProjectId,BREAD_Slice,42524541-445f-4536-9c69-63652e6b6963,rev?*%
%TF.SameCoordinates,PX74eba40PY8552dc0*%
%TF.FileFunction,Profile,NP*%
%FSLAX46Y46*%
G04 Gerber Fmt 4.6, Leading zero omitted, Abs format (unit mm)*
G04 Created by KiCad (PCBNEW (6.0.4)) date 2023-02-01 16:26:22*
%MOMM*%
%LPD*%
G01*
G04 APERTURE LIST*
%TA.AperFunction,Profile*%
%ADD10C,0.050000*%
%TD*%
G04 APERTURE END LIST*
D10*
X70000000Y95000000D02*
X70000000Y45000000D01*
X65000000Y0D02*
G75*
G03*
X70000000Y5000000I0J5000000D01*
G01*
X5000000Y100000000D02*
G75*
G03*
X0Y95000000I0J-5000000D01*
G01*
X70000000Y45000000D02*
X70000000Y5000000D01*
X0Y5000000D02*
X0Y95000000D01*
X5000000Y100000000D02*
X30000000Y100000000D01*
X0Y5000000D02*
G75*
G03*
X5000000Y0I5000000J0D01*
G01*
X30000000Y0D02*
X65000000Y0D01*
X5000000Y0D02*
X30000000Y0D01*
X30000000Y100000000D02*
X65000000Y100000000D01*
X70000000Y95000000D02*
G75*
G03*
X65000000Y100000000I-5000000J0D01*
G01*
M02*
