(export (version D)
  (design
    (source /home/daedalus/Documents/RELAY_SLC/Hardware/BREAD_Slice.sch)
    (date "Thu 06 May 2021 03:10:11 PM EDT")
    (tool "Eeschema 5.1.9-2.fc34")
    (sheet (number 1) (name /) (tstamps /)
      (title_block
        (title)
        (company)
        (rev)
        (date)
        (source BREAD_Slice.sch)
        (comment (number 1) (value ""))
        (comment (number 2) (value ""))
        (comment (number 3) (value ""))
        (comment (number 4) (value "")))))
  (components
    (comp (ref C1)
      (value 10uF_t)
      (footprint OCI_UPL_FOOTPRINTS:C_2312)
      (datasheet https://www.digikey.com/short/qcd8n7)
      (fields
        (field (name "Part #") T491C106K025AT)
        (field (name "UPL #") 2.021))
      (libsource (lib OCI_UPL_2_Capacitors) (part 10uF_t) (description "SMD 10uF tantalum capacitor 25V [UPL 2.021]"))
      (sheetpath (names /) (tstamps /))
      (tstamp 5FA94020))
    (comp (ref H1)
      (value MountingHole)
      (footprint MountingHole:MountingHole_3.2mm_M3_DIN965_Pad)
      (datasheet ~)
      (libsource (lib Mechanical) (part MountingHole) (description "Mounting Hole without connection"))
      (sheetpath (names /) (tstamps /))
      (tstamp 5FAB1765))
    (comp (ref H3)
      (value MountingHole)
      (footprint MountingHole:MountingHole_3.2mm_M3_DIN965_Pad)
      (datasheet ~)
      (libsource (lib Mechanical) (part MountingHole) (description "Mounting Hole without connection"))
      (sheetpath (names /) (tstamps /))
      (tstamp 5FAB1B3E))
    (comp (ref H2)
      (value MountingHole)
      (footprint MountingHole:MountingHole_3.2mm_M3_DIN965_Pad)
      (datasheet ~)
      (libsource (lib Mechanical) (part MountingHole) (description "Mounting Hole without connection"))
      (sheetpath (names /) (tstamps /))
      (tstamp 5FAB217D))
    (comp (ref H4)
      (value MountingHole)
      (footprint MountingHole:MountingHole_3.2mm_M3_DIN965_Pad)
      (datasheet ~)
      (libsource (lib Mechanical) (part MountingHole) (description "Mounting Hole without connection"))
      (sheetpath (names /) (tstamps /))
      (tstamp 5FAB25F7))
    (comp (ref A1)
      (value Arduino_Nano_v3.x)
      (footprint Module:Arduino_Nano)
      (datasheet http://www.mouser.com/pdfdocs/Gravitech_Arduino_Nano3_0.pdf)
      (libsource (lib MCU_Module) (part Arduino_Nano_v3.x) (description "Arduino Nano v3.x"))
      (sheetpath (names /) (tstamps /))
      (tstamp 5FCAD89B))
    (comp (ref J1)
      (value Conn_01x10_Female)
      (footprint Connector_PinSocket_2.54mm:PinSocket_1x10_P2.54mm_Horizontal)
      (datasheet ~)
      (libsource (lib Connector) (part Conn_01x10_Female) (description "Generic connector, single row, 01x10, script generated (kicad-library-utils/schlib/autogen/connector/)"))
      (sheetpath (names /) (tstamps /))
      (tstamp 5FE6B3C7))
    (comp (ref C2)
      (value 10uF_t)
      (footprint OCI_UPL_FOOTPRINTS:C_2312)
      (datasheet https://www.digikey.com/short/qcd8n7)
      (fields
        (field (name "Part #") T491C106K025AT)
        (field (name "UPL #") 2.021))
      (libsource (lib OCI_UPL_2_Capacitors) (part 10uF_t) (description "SMD 10uF tantalum capacitor 25V [UPL 2.021]"))
      (sheetpath (names /) (tstamps /))
      (tstamp 5FE84189))
    (comp (ref Logo1)
      (value Logo_Open_Hardware_Small)
      (footprint Symbol:OSHW-Symbol_6.7x6mm_SilkScreen)
      (datasheet ~)
      (libsource (lib Graphic) (part Logo_Open_Hardware_Small) (description "Open Hardware logo, small"))
      (sheetpath (names /) (tstamps /))
      (tstamp 5FE4A934))
    (comp (ref D1)
      (value D)
      (footprint Diode_SMD:D_1206_3216Metric_Pad1.42x1.75mm_HandSolder)
      (datasheet ~)
      (libsource (lib Device) (part D) (description Diode))
      (sheetpath (names /) (tstamps /))
      (tstamp 6094E236))
    (comp (ref J6)
      (value Screw_Terminal_01x04)
      (footprint TerminalBlock_TE-Connectivity:TerminalBlock_TE_282834-4_1x04_P2.54mm_Horizontal)
      (datasheet ~)
      (libsource (lib Connector) (part Screw_Terminal_01x04) (description "Generic screw terminal, single row, 01x04, script generated (kicad-library-utils/schlib/autogen/connector/)"))
      (sheetpath (names /) (tstamps /))
      (tstamp 609A3CB6))
    (comp (ref D5)
      (value D_Zener)
      (footprint Diode_SMD:D_1206_3216Metric_Pad1.42x1.75mm_HandSolder)
      (datasheet ~)
      (libsource (lib Device) (part D_Zener) (description "Zener diode"))
      (sheetpath (names /) (tstamps /))
      (tstamp 609C336E))
    (comp (ref D6)
      (value D_Zener)
      (footprint Diode_SMD:D_1206_3216Metric_Pad1.42x1.75mm_HandSolder)
      (datasheet ~)
      (libsource (lib Device) (part D_Zener) (description "Zener diode"))
      (sheetpath (names /) (tstamps /))
      (tstamp 609C9BBD))
    (comp (ref U1)
      (value TCMT1100)
      (footprint Package_SO:SOP-4_4.4x2.6mm_P1.27mm)
      (datasheet http://www.vishay.com/docs/83510/tcmt1100.pdf)
      (libsource (lib Isolator) (part TCMT1100) (description "Optocoupler, Vce 70V, CTR 50-600%, Viso 3750V (RMS), SOP-4"))
      (sheetpath (names /) (tstamps /))
      (tstamp 60B19516))
    (comp (ref D7)
      (value D_Zener)
      (footprint Diode_SMD:D_1206_3216Metric_Pad1.42x1.75mm_HandSolder)
      (datasheet ~)
      (libsource (lib Device) (part D_Zener) (description "Zener diode"))
      (sheetpath (names /) (tstamps /))
      (tstamp 609C6770))
    (comp (ref D8)
      (value D_Zener)
      (footprint Diode_SMD:D_1206_3216Metric_Pad1.42x1.75mm_HandSolder)
      (datasheet ~)
      (libsource (lib Device) (part D_Zener) (description "Zener diode"))
      (sheetpath (names /) (tstamps /))
      (tstamp 609B6ACB))
    (comp (ref R1)
      (value 1k)
      (footprint Resistor_SMD:R_1206_3216Metric_Pad1.30x1.75mm_HandSolder)
      (libsource (lib OCI_UPL_1_Resistors) (part R) (description Resistor))
      (sheetpath (names /) (tstamps /))
      (tstamp 60B1F8CB))
    (comp (ref J2)
      (value Screw_Terminal_01x03)
      (footprint TerminalBlock_TE-Connectivity:TerminalBlock_TE_282834-3_1x03_P2.54mm_Horizontal)
      (datasheet ~)
      (libsource (lib Connector) (part Screw_Terminal_01x03) (description "Generic screw terminal, single row, 01x03, script generated (kicad-library-utils/schlib/autogen/connector/)"))
      (sheetpath (names /) (tstamps /))
      (tstamp 60D750B5))
    (comp (ref RV4)
      (value R_POT_TRIM)
      (footprint Potentiometer_THT:Potentiometer_Bourns_3266W_Vertical)
      (datasheet ~)
      (libsource (lib Device) (part R_POT_TRIM) (description Trim-potentiometer))
      (sheetpath (names /) (tstamps /))
      (tstamp 60D90B34))
    (comp (ref RV3)
      (value R_POT_TRIM)
      (footprint Potentiometer_THT:Potentiometer_Bourns_3266W_Vertical)
      (datasheet ~)
      (libsource (lib Device) (part R_POT_TRIM) (description Trim-potentiometer))
      (sheetpath (names /) (tstamps /))
      (tstamp 60D91EAE))
    (comp (ref RV2)
      (value R_POT_TRIM)
      (footprint Potentiometer_THT:Potentiometer_Bourns_3266W_Vertical)
      (datasheet ~)
      (libsource (lib Device) (part R_POT_TRIM) (description Trim-potentiometer))
      (sheetpath (names /) (tstamps /))
      (tstamp 60D9235C))
    (comp (ref RV1)
      (value R_POT_TRIM)
      (footprint Potentiometer_THT:Potentiometer_Bourns_3266W_Vertical)
      (datasheet ~)
      (libsource (lib Device) (part R_POT_TRIM) (description Trim-potentiometer))
      (sheetpath (names /) (tstamps /))
      (tstamp 60D92949))
    (comp (ref D2)
      (value D)
      (footprint Diode_SMD:D_1206_3216Metric_Pad1.42x1.75mm_HandSolder)
      (datasheet ~)
      (libsource (lib Device) (part D) (description Diode))
      (sheetpath (names /) (tstamps /))
      (tstamp 60DA254C))
    (comp (ref U2)
      (value TCMT1100)
      (footprint Package_SO:SOP-4_4.4x2.6mm_P1.27mm)
      (datasheet http://www.vishay.com/docs/83510/tcmt1100.pdf)
      (libsource (lib Isolator) (part TCMT1100) (description "Optocoupler, Vce 70V, CTR 50-600%, Viso 3750V (RMS), SOP-4"))
      (sheetpath (names /) (tstamps /))
      (tstamp 60DA255F))
    (comp (ref R2)
      (value 1k)
      (footprint Resistor_SMD:R_1206_3216Metric_Pad1.30x1.75mm_HandSolder)
      (libsource (lib OCI_UPL_1_Resistors) (part R) (description Resistor))
      (sheetpath (names /) (tstamps /))
      (tstamp 60DA256F))
    (comp (ref J3)
      (value Screw_Terminal_01x03)
      (footprint TerminalBlock_TE-Connectivity:TerminalBlock_TE_282834-3_1x03_P2.54mm_Horizontal)
      (datasheet ~)
      (libsource (lib Connector) (part Screw_Terminal_01x03) (description "Generic screw terminal, single row, 01x03, script generated (kicad-library-utils/schlib/autogen/connector/)"))
      (sheetpath (names /) (tstamps /))
      (tstamp 60DA2580))
    (comp (ref D3)
      (value D)
      (footprint Diode_SMD:D_1206_3216Metric_Pad1.42x1.75mm_HandSolder)
      (datasheet ~)
      (libsource (lib Device) (part D) (description Diode))
      (sheetpath (names /) (tstamps /))
      (tstamp 60DA9DD9))
    (comp (ref U3)
      (value TCMT1100)
      (footprint Package_SO:SOP-4_4.4x2.6mm_P1.27mm)
      (datasheet http://www.vishay.com/docs/83510/tcmt1100.pdf)
      (libsource (lib Isolator) (part TCMT1100) (description "Optocoupler, Vce 70V, CTR 50-600%, Viso 3750V (RMS), SOP-4"))
      (sheetpath (names /) (tstamps /))
      (tstamp 60DA9DEC))
    (comp (ref J4)
      (value Screw_Terminal_01x03)
      (footprint TerminalBlock_TE-Connectivity:TerminalBlock_TE_282834-3_1x03_P2.54mm_Horizontal)
      (datasheet ~)
      (libsource (lib Connector) (part Screw_Terminal_01x03) (description "Generic screw terminal, single row, 01x03, script generated (kicad-library-utils/schlib/autogen/connector/)"))
      (sheetpath (names /) (tstamps /))
      (tstamp 60DA9E0D))
    (comp (ref D4)
      (value D)
      (footprint Diode_SMD:D_1206_3216Metric_Pad1.42x1.75mm_HandSolder)
      (datasheet ~)
      (libsource (lib Device) (part D) (description Diode))
      (sheetpath (names /) (tstamps /))
      (tstamp 60DB03BE))
    (comp (ref U4)
      (value TCMT1100)
      (footprint Package_SO:SOP-4_4.4x2.6mm_P1.27mm)
      (datasheet http://www.vishay.com/docs/83510/tcmt1100.pdf)
      (libsource (lib Isolator) (part TCMT1100) (description "Optocoupler, Vce 70V, CTR 50-600%, Viso 3750V (RMS), SOP-4"))
      (sheetpath (names /) (tstamps /))
      (tstamp 60DB03D1))
    (comp (ref R4)
      (value 1k)
      (footprint Resistor_SMD:R_1206_3216Metric_Pad1.30x1.75mm_HandSolder)
      (libsource (lib OCI_UPL_1_Resistors) (part R) (description Resistor))
      (sheetpath (names /) (tstamps /))
      (tstamp 60DB03E1))
    (comp (ref J5)
      (value Screw_Terminal_01x03)
      (footprint TerminalBlock_TE-Connectivity:TerminalBlock_TE_282834-3_1x03_P2.54mm_Horizontal)
      (datasheet ~)
      (libsource (lib Connector) (part Screw_Terminal_01x03) (description "Generic screw terminal, single row, 01x03, script generated (kicad-library-utils/schlib/autogen/connector/)"))
      (sheetpath (names /) (tstamps /))
      (tstamp 60DB03F2))
    (comp (ref R3)
      (value 1k)
      (footprint Resistor_SMD:R_1206_3216Metric_Pad1.30x1.75mm_HandSolder)
      (libsource (lib OCI_UPL_1_Resistors) (part R) (description Resistor))
      (sheetpath (names /) (tstamps /))
      (tstamp 60DA9DFC))
    (comp (ref K3)
      (value G5Q-1)
      (footprint Relay_THT:Relay_SPDT_Omron-G5Q-1)
      (datasheet https://www.omron.com/ecb/products/pdf/en-g5q.pdf)
      (libsource (lib Relay) (part G5Q-1) (description "Omron G5G relay, Miniature Single Pole, SPDT, 10A"))
      (sheetpath (names /) (tstamps /))
      (tstamp 60E0E6DC))
    (comp (ref K1)
      (value G5Q-1)
      (footprint Relay_THT:Relay_SPDT_Omron-G5Q-1)
      (datasheet https://www.omron.com/ecb/products/pdf/en-g5q.pdf)
      (libsource (lib Relay) (part G5Q-1) (description "Omron G5G relay, Miniature Single Pole, SPDT, 10A"))
      (sheetpath (names /) (tstamps /))
      (tstamp 60E0F07C))
    (comp (ref K2)
      (value G5Q-1)
      (footprint Relay_THT:Relay_SPDT_Omron-G5Q-1)
      (datasheet https://www.omron.com/ecb/products/pdf/en-g5q.pdf)
      (libsource (lib Relay) (part G5Q-1) (description "Omron G5G relay, Miniature Single Pole, SPDT, 10A"))
      (sheetpath (names /) (tstamps /))
      (tstamp 60E22773))
    (comp (ref K4)
      (value G5Q-1)
      (footprint Relay_THT:Relay_SPDT_Omron-G5Q-1)
      (datasheet https://www.omron.com/ecb/products/pdf/en-g5q.pdf)
      (libsource (lib Relay) (part G5Q-1) (description "Omron G5G relay, Miniature Single Pole, SPDT, 10A"))
      (sheetpath (names /) (tstamps /))
      (tstamp 60E23BFE)))
  (libparts
    (libpart (lib Connector) (part Conn_01x10_Female)
      (description "Generic connector, single row, 01x10, script generated (kicad-library-utils/schlib/autogen/connector/)")
      (docs ~)
      (footprints
        (fp Connector*:*_1x??_*))
      (fields
        (field (name Reference) J)
        (field (name Value) Conn_01x10_Female))
      (pins
        (pin (num 1) (name Pin_1) (type passive))
        (pin (num 2) (name Pin_2) (type passive))
        (pin (num 3) (name Pin_3) (type passive))
        (pin (num 4) (name Pin_4) (type passive))
        (pin (num 5) (name Pin_5) (type passive))
        (pin (num 6) (name Pin_6) (type passive))
        (pin (num 7) (name Pin_7) (type passive))
        (pin (num 8) (name Pin_8) (type passive))
        (pin (num 9) (name Pin_9) (type passive))
        (pin (num 10) (name Pin_10) (type passive))))
    (libpart (lib Connector) (part Screw_Terminal_01x03)
      (description "Generic screw terminal, single row, 01x03, script generated (kicad-library-utils/schlib/autogen/connector/)")
      (docs ~)
      (footprints
        (fp TerminalBlock*:*))
      (fields
        (field (name Reference) J)
        (field (name Value) Screw_Terminal_01x03))
      (pins
        (pin (num 1) (name Pin_1) (type passive))
        (pin (num 2) (name Pin_2) (type passive))
        (pin (num 3) (name Pin_3) (type passive))))
    (libpart (lib Connector) (part Screw_Terminal_01x04)
      (description "Generic screw terminal, single row, 01x04, script generated (kicad-library-utils/schlib/autogen/connector/)")
      (docs ~)
      (footprints
        (fp TerminalBlock*:*))
      (fields
        (field (name Reference) J)
        (field (name Value) Screw_Terminal_01x04))
      (pins
        (pin (num 1) (name Pin_1) (type passive))
        (pin (num 2) (name Pin_2) (type passive))
        (pin (num 3) (name Pin_3) (type passive))
        (pin (num 4) (name Pin_4) (type passive))))
    (libpart (lib Device) (part D)
      (description Diode)
      (docs ~)
      (footprints
        (fp TO-???*)
        (fp *_Diode_*)
        (fp *SingleDiode*)
        (fp D_*))
      (fields
        (field (name Reference) D)
        (field (name Value) D))
      (pins
        (pin (num 1) (name K) (type passive))
        (pin (num 2) (name A) (type passive))))
    (libpart (lib Device) (part D_Zener)
      (description "Zener diode")
      (docs ~)
      (footprints
        (fp TO-???*)
        (fp *_Diode_*)
        (fp *SingleDiode*)
        (fp D_*))
      (fields
        (field (name Reference) D)
        (field (name Value) D_Zener))
      (pins
        (pin (num 1) (name K) (type passive))
        (pin (num 2) (name A) (type passive))))
    (libpart (lib Device) (part R_POT_TRIM)
      (description Trim-potentiometer)
      (docs ~)
      (footprints
        (fp Potentiometer*))
      (fields
        (field (name Reference) RV)
        (field (name Value) R_POT_TRIM))
      (pins
        (pin (num 1) (name 1) (type passive))
        (pin (num 2) (name 2) (type passive))
        (pin (num 3) (name 3) (type passive))))
    (libpart (lib Graphic) (part Logo_Open_Hardware_Small)
      (description "Open Hardware logo, small")
      (docs ~)
      (fields
        (field (name Reference) "#LOGO")
        (field (name Value) Logo_Open_Hardware_Small)))
    (libpart (lib Isolator) (part TCMT1100)
      (aliases
        (alias TCMT1101)
        (alias TCMT1102)
        (alias TCMT1103)
        (alias TCMT1104)
        (alias TCMT1105)
        (alias TCMT1106)
        (alias TCMT1107)
        (alias TCMT1108)
        (alias TCMT1109))
      (description "Optocoupler, Vce 70V, CTR 50-600%, Viso 3750V (RMS), SOP-4")
      (docs http://www.vishay.com/docs/83510/tcmt1100.pdf)
      (footprints
        (fp SOP*4.4x2.6mm*P1.27mm*))
      (fields
        (field (name Reference) U)
        (field (name Value) TCMT1100)
        (field (name Footprint) Package_SO:SOP-4_4.4x2.6mm_P1.27mm))
      (pins
        (pin (num 1) (name ~) (type passive))
        (pin (num 2) (name ~) (type passive))
        (pin (num 3) (name ~) (type passive))
        (pin (num 4) (name ~) (type passive))))
    (libpart (lib MCU_Module) (part Arduino_Nano_v2.x)
      (aliases
        (alias Arduino_Nano_v3.x))
      (description "Arduino Nano v2.x")
      (docs https://www.arduino.cc/en/uploads/Main/ArduinoNanoManual23.pdf)
      (footprints
        (fp Arduino*Nano*))
      (fields
        (field (name Reference) A)
        (field (name Value) Arduino_Nano_v2.x)
        (field (name Footprint) Module:Arduino_Nano))
      (pins
        (pin (num 1) (name D1/TX) (type BiDi))
        (pin (num 2) (name D0/RX) (type BiDi))
        (pin (num 3) (name ~RESET) (type input))
        (pin (num 4) (name GND) (type power_in))
        (pin (num 5) (name D2) (type BiDi))
        (pin (num 6) (name D3) (type BiDi))
        (pin (num 7) (name D4) (type BiDi))
        (pin (num 8) (name D5) (type BiDi))
        (pin (num 9) (name D6) (type BiDi))
        (pin (num 10) (name D7) (type BiDi))
        (pin (num 11) (name D8) (type BiDi))
        (pin (num 12) (name D9) (type BiDi))
        (pin (num 13) (name D10) (type BiDi))
        (pin (num 14) (name D11) (type BiDi))
        (pin (num 15) (name D12) (type BiDi))
        (pin (num 16) (name D13) (type BiDi))
        (pin (num 17) (name 3V3) (type power_out))
        (pin (num 18) (name AREF) (type input))
        (pin (num 19) (name A0) (type BiDi))
        (pin (num 20) (name A1) (type BiDi))
        (pin (num 21) (name A2) (type BiDi))
        (pin (num 22) (name A3) (type BiDi))
        (pin (num 23) (name A4) (type BiDi))
        (pin (num 24) (name A5) (type BiDi))
        (pin (num 25) (name A6) (type BiDi))
        (pin (num 26) (name A7) (type BiDi))
        (pin (num 27) (name +5V) (type power_out))
        (pin (num 28) (name ~RESET) (type input))
        (pin (num 29) (name GND) (type power_in))
        (pin (num 30) (name VIN) (type power_in))))
    (libpart (lib Mechanical) (part MountingHole)
      (description "Mounting Hole without connection")
      (docs ~)
      (footprints
        (fp MountingHole*))
      (fields
        (field (name Reference) H)
        (field (name Value) MountingHole)))
    (libpart (lib OCI_UPL_1_Resistors) (part R)
      (description Resistor)
      (footprints
        (fp R_*)
        (fp Resistor_*))
      (fields
        (field (name Reference) R)
        (field (name Value) R))
      (pins
        (pin (num 1) (name ~) (type passive))
        (pin (num 2) (name ~) (type passive))))
    (libpart (lib OCI_UPL_2_Capacitors) (part 10uF_t)
      (description "SMD 10uF tantalum capacitor 25V [UPL 2.021]")
      (footprints
        (fp SMD*_Pol)
        (fp c_elec*)
        (fp C*elec)
        (fp TantalC*)
        (fp Elko*)
        (fp CP*))
      (fields
        (field (name Reference) C)
        (field (name Value) 10uF_t)
        (field (name Footprint) OCI_UPL_FOOTPRINTS:C_2312)
        (field (name Datasheet) https://www.digikey.com/short/qcd8n7)
        (field (name "Part #") T491C106K025AT)
        (field (name "UPL #") 2.021))
      (pins
        (pin (num 1) (name ~) (type passive))
        (pin (num 2) (name ~) (type passive))))
    (libpart (lib Relay) (part G5Q-1)
      (description "Omron G5G relay, Miniature Single Pole, SPDT, 10A")
      (docs https://www.omron.com/ecb/products/pdf/en-g5q.pdf)
      (footprints
        (fp Relay*SPDT*Omron*G5Q*))
      (fields
        (field (name Reference) K)
        (field (name Value) G5Q-1)
        (field (name Footprint) Relay_THT:Relay_SPDT_Omron-G5Q-1))
      (pins
        (pin (num 1) (name ~) (type passive))
        (pin (num 2) (name ~) (type passive))
        (pin (num 3) (name ~) (type passive))
        (pin (num 4) (name ~) (type passive))
        (pin (num 5) (name ~) (type passive)))))
  (libraries
    (library (logical Connector)
      (uri /usr/share/kicad/library/Connector.lib))
    (library (logical Device)
      (uri /usr/share/kicad/library/Device.lib))
    (library (logical Graphic)
      (uri /usr/share/kicad/library/Graphic.lib))
    (library (logical Isolator)
      (uri /usr/share/kicad/library/Isolator.lib))
    (library (logical MCU_Module)
      (uri /usr/share/kicad/library/MCU_Module.lib))
    (library (logical Mechanical)
      (uri /usr/share/kicad/library/Mechanical.lib))
    (library (logical OCI_UPL_1_Resistors)
      (uri /home/daedalus/Documents/OCI_UPL_Symbols/OCI_UPL_1_Resistors.lib))
    (library (logical OCI_UPL_2_Capacitors)
      (uri /home/daedalus/Documents/OCI_UPL_Symbols/OCI_UPL_2_Capacitors.lib))
    (library (logical Relay)
      (uri /usr/share/kicad/library/Relay.lib)))
  (nets
    (net (code 1) (name GND)
      (node (ref A1) (pin 4))
      (node (ref A1) (pin 29))
      (node (ref D8) (pin 2))
      (node (ref C1) (pin 2))
      (node (ref U4) (pin 3))
      (node (ref U4) (pin 2))
      (node (ref RV4) (pin 3))
      (node (ref D8) (pin 1))
      (node (ref RV3) (pin 3))
      (node (ref J1) (pin 1))
      (node (ref RV2) (pin 3))
      (node (ref J1) (pin 5))
      (node (ref RV1) (pin 3))
      (node (ref J1) (pin 10))
      (node (ref U3) (pin 3))
      (node (ref C2) (pin 2))
      (node (ref U2) (pin 2))
      (node (ref U2) (pin 3))
      (node (ref U3) (pin 2))
      (node (ref D6) (pin 2))
      (node (ref D6) (pin 1))
      (node (ref U1) (pin 3))
      (node (ref U1) (pin 2))
      (node (ref D7) (pin 2))
      (node (ref D7) (pin 1))
      (node (ref D5) (pin 2))
      (node (ref D5) (pin 1)))
    (net (code 2) (name "Net-(J3-Pad1)")
      (node (ref K3) (pin 4))
      (node (ref J3) (pin 1)))
    (net (code 3) (name "Net-(J3-Pad3)")
      (node (ref J3) (pin 3))
      (node (ref K3) (pin 2)))
    (net (code 4) (name "Net-(J3-Pad2)")
      (node (ref K3) (pin 3))
      (node (ref J3) (pin 2)))
    (net (code 5) (name +5V)
      (node (ref A1) (pin 27))
      (node (ref D4) (pin 1))
      (node (ref D1) (pin 1))
      (node (ref K3) (pin 5))
      (node (ref D2) (pin 1))
      (node (ref C2) (pin 1))
      (node (ref K4) (pin 5))
      (node (ref K2) (pin 5))
      (node (ref K1) (pin 5))
      (node (ref D3) (pin 1)))
    (net (code 6) (name "Net-(D2-Pad2)")
      (node (ref K3) (pin 1))
      (node (ref U2) (pin 4))
      (node (ref D2) (pin 2)))
    (net (code 7) (name "Net-(R2-Pad2)")
      (node (ref U2) (pin 1))
      (node (ref R2) (pin 2)))
    (net (code 8) (name /SW2)
      (node (ref R2) (pin 1))
      (node (ref A1) (pin 13)))
    (net (code 9) (name "Net-(J2-Pad3)")
      (node (ref J2) (pin 3))
      (node (ref K1) (pin 2)))
    (net (code 10) (name "Net-(J2-Pad2)")
      (node (ref J2) (pin 2))
      (node (ref K1) (pin 3)))
    (net (code 11) (name "Net-(J2-Pad1)")
      (node (ref J2) (pin 1))
      (node (ref K1) (pin 4)))
    (net (code 12) (name "Net-(D1-Pad2)")
      (node (ref U1) (pin 4))
      (node (ref D1) (pin 2))
      (node (ref K1) (pin 1)))
    (net (code 13) (name "Net-(R3-Pad2)")
      (node (ref R3) (pin 2))
      (node (ref U3) (pin 1)))
    (net (code 14) (name /SW3)
      (node (ref R3) (pin 1))
      (node (ref A1) (pin 12)))
    (net (code 15) (name "Net-(J5-Pad3)")
      (node (ref K4) (pin 2))
      (node (ref J5) (pin 3)))
    (net (code 16) (name "Net-(J5-Pad2)")
      (node (ref J5) (pin 2))
      (node (ref K4) (pin 3)))
    (net (code 17) (name "Net-(J5-Pad1)")
      (node (ref J5) (pin 1))
      (node (ref K4) (pin 4)))
    (net (code 18) (name "Net-(D4-Pad2)")
      (node (ref U4) (pin 4))
      (node (ref D4) (pin 2))
      (node (ref K4) (pin 1)))
    (net (code 19) (name "Net-(D3-Pad2)")
      (node (ref U3) (pin 4))
      (node (ref D3) (pin 2))
      (node (ref K2) (pin 1)))
    (net (code 20) (name "Net-(J4-Pad2)")
      (node (ref K2) (pin 3))
      (node (ref J4) (pin 2)))
    (net (code 21) (name "Net-(J4-Pad3)")
      (node (ref J4) (pin 3))
      (node (ref K2) (pin 2)))
    (net (code 22) (name "Net-(J4-Pad1)")
      (node (ref J4) (pin 1))
      (node (ref K2) (pin 4)))
    (net (code 23) (name "Net-(R4-Pad2)")
      (node (ref U4) (pin 1))
      (node (ref R4) (pin 2)))
    (net (code 24) (name /SW4)
      (node (ref R4) (pin 1))
      (node (ref A1) (pin 14)))
    (net (code 25) (name /SYNC)
      (node (ref J1) (pin 7))
      (node (ref A1) (pin 6)))
    (net (code 26) (name /E_STOP)
      (node (ref J1) (pin 6))
      (node (ref A1) (pin 5)))
    (net (code 27) (name /I2C_DAT)
      (node (ref A1) (pin 23))
      (node (ref J1) (pin 4)))
    (net (code 28) (name /SW1)
      (node (ref R1) (pin 1))
      (node (ref A1) (pin 9)))
    (net (code 29) (name "Net-(A1-Pad8)")
      (node (ref A1) (pin 8)))
    (net (code 30) (name /INT)
      (node (ref J1) (pin 8))
      (node (ref A1) (pin 7)))
    (net (code 31) (name "Net-(A1-Pad3)")
      (node (ref A1) (pin 3)))
    (net (code 32) (name "Net-(A1-Pad28)")
      (node (ref A1) (pin 28)))
    (net (code 33) (name /I2C_CLK)
      (node (ref A1) (pin 24))
      (node (ref J1) (pin 3)))
    (net (code 34) (name "Net-(A1-Pad26)")
      (node (ref A1) (pin 26)))
    (net (code 35) (name +12V)
      (node (ref A1) (pin 30))
      (node (ref J1) (pin 2))
      (node (ref J1) (pin 9))
      (node (ref C1) (pin 1)))
    (net (code 36) (name "Net-(A1-Pad2)")
      (node (ref A1) (pin 2)))
    (net (code 37) (name "Net-(A1-Pad18)")
      (node (ref A1) (pin 18)))
    (net (code 38) (name "Net-(A1-Pad17)")
      (node (ref A1) (pin 17)))
    (net (code 39) (name "Net-(A1-Pad1)")
      (node (ref A1) (pin 1)))
    (net (code 40) (name "Net-(A1-Pad25)")
      (node (ref A1) (pin 25)))
    (net (code 41) (name /A_IN4)
      (node (ref RV4) (pin 2))
      (node (ref A1) (pin 22)))
    (net (code 42) (name /A_IN3)
      (node (ref RV3) (pin 2))
      (node (ref A1) (pin 21)))
    (net (code 43) (name /A_IN2)
      (node (ref A1) (pin 20))
      (node (ref RV2) (pin 2)))
    (net (code 44) (name /A_IN1)
      (node (ref RV1) (pin 2))
      (node (ref A1) (pin 19)))
    (net (code 45) (name "Net-(A1-Pad16)")
      (node (ref A1) (pin 16)))
    (net (code 46) (name "Net-(A1-Pad15)")
      (node (ref A1) (pin 15)))
    (net (code 47) (name "Net-(A1-Pad11)")
      (node (ref A1) (pin 11)))
    (net (code 48) (name "Net-(A1-Pad10)")
      (node (ref A1) (pin 10)))
    (net (code 49) (name "Net-(R1-Pad2)")
      (node (ref R1) (pin 2))
      (node (ref U1) (pin 1)))
    (net (code 50) (name /F_2)
      (node (ref RV2) (pin 1))
      (node (ref J6) (pin 2)))
    (net (code 51) (name /F_1)
      (node (ref J6) (pin 1))
      (node (ref RV1) (pin 1)))
    (net (code 52) (name /F_3)
      (node (ref RV3) (pin 1))
      (node (ref J6) (pin 3)))
    (net (code 53) (name /F_4)
      (node (ref RV4) (pin 1))
      (node (ref J6) (pin 4)))))