EESchema Schematic File Version 5
EELAYER 36 0
EELAYER END
$Descr A4 11693 8268
encoding utf-8
Sheet 1 1
Title ""
Date ""
Rev ""
Comp ""
Comment1 ""
Comment2 ""
Comment3 ""
Comment4 ""
Comment5 ""
Comment6 ""
Comment7 ""
Comment8 ""
Comment9 ""
$EndDescr
Connection ~ 1100 1150
Connection ~ 1150 1450
Connection ~ 1150 1950
Connection ~ 1800 4550
Connection ~ 4700 5250
Connection ~ 4750 3450
Connection ~ 5450 4900
Connection ~ 5500 3150
NoConn ~ 1250 2900
NoConn ~ 1250 3000
NoConn ~ 1850 2500
NoConn ~ 2250 2900
NoConn ~ 2250 3000
NoConn ~ 2250 3300
Wire Wire Line
	750  1350 1200 1350
Wire Wire Line
	750  1650 1200 1650
Wire Wire Line
	750  1750 1200 1750
Wire Wire Line
	800  3200 1250 3200
Wire Wire Line
	800  3300 1250 3300
Wire Wire Line
	1100 1000 1100 1150
Wire Wire Line
	1100 1150 1200 1150
Wire Wire Line
	1100 1850 1100 1150
Wire Wire Line
	1150 1050 1200 1050
Wire Wire Line
	1150 1450 1150 1050
Wire Wire Line
	1150 1950 1150 1450
Wire Wire Line
	1150 2000 1150 1950
Wire Wire Line
	1200 1250 750  1250
Wire Wire Line
	1200 1450 1150 1450
Wire Wire Line
	1200 1550 750  1550
Wire Wire Line
	1200 1850 1100 1850
Wire Wire Line
	1200 1950 1150 1950
Wire Wire Line
	1250 3100 800  3100
Wire Wire Line
	1600 1200 1600 1150
Wire Wire Line
	1600 1550 1600 1500
Wire Wire Line
	1650 2400 1650 2500
Wire Wire Line
	1750 4500 1750 4550
Wire Wire Line
	1750 4550 1800 4550
Wire Wire Line
	1800 4550 1800 4600
Wire Wire Line
	1800 4550 1850 4550
Wire Wire Line
	1850 4550 1850 4500
Wire Wire Line
	1950 2400 1950 2500
Wire Wire Line
	2100 1200 2100 1150
Wire Wire Line
	2100 1550 2100 1500
Wire Wire Line
	2250 3500 2350 3500
Wire Wire Line
	2250 3600 2350 3600
Wire Wire Line
	2250 4000 2600 4000
Wire Wire Line
	2600 3900 2250 3900
Wire Wire Line
	4500 4800 4800 4800
Wire Wire Line
	4600 3050 4800 3050
Wire Wire Line
	4700 5000 4800 5000
Wire Wire Line
	4700 5250 4700 5000
Wire Wire Line
	4700 5250 4700 5300
Wire Wire Line
	4700 5600 4700 5750
Wire Wire Line
	4750 3250 4750 3450
Wire Wire Line
	4750 3450 4750 3500
Wire Wire Line
	4750 3800 4750 3850
Wire Wire Line
	4800 3250 4750 3250
Wire Wire Line
	4950 3450 4750 3450
Wire Wire Line
	4950 5250 4700 5250
Wire Wire Line
	5000 1250 5000 1350
Wire Wire Line
	5000 1950 5000 2050
Wire Wire Line
	5250 3450 5500 3450
Wire Wire Line
	5400 4900 5450 4900
Wire Wire Line
	5450 4900 5450 5250
Wire Wire Line
	5450 4900 5700 4900
Wire Wire Line
	5450 5250 5250 5250
Wire Wire Line
	5500 3150 5400 3150
Wire Wire Line
	5500 3150 5750 3150
Wire Wire Line
	5500 3450 5500 3150
Wire Wire Line
	8550 2150 8700 2150
Wire Wire Line
	8550 2300 8700 2300
Wire Wire Line
	8550 2850 8700 2850
Wire Wire Line
	8550 3000 8550 3100
Wire Wire Line
	8550 3650 8700 3650
Wire Wire Line
	8550 3800 8550 3900
Wire Wire Line
	8550 5050 8650 5050
Wire Wire Line
	8700 3000 8550 3000
Wire Wire Line
	8700 3800 8550 3800
Wire Wire Line
	8950 4700 8950 4850
Wire Wire Line
	8950 5250 8950 5350
Wire Notes Line
	650  600  650  5300
Wire Notes Line
	650  5300 2700 5300
Wire Notes Line
	700  750  700  5250
Wire Notes Line
	700  5250 2650 5250
Wire Notes Line
	2650 750  700  750 
Wire Notes Line
	2650 5250 2650 750 
Wire Notes Line
	2700 600  650  600 
Wire Notes Line
	2700 5300 2700 600 
Text Notes 750  750  0    100  ~ 0
Core Slice Components
Text Label 750  1250 0    50   ~ 0
I2C_CLK
Text Label 750  1350 0    50   ~ 0
I2C_DAT
Text Label 750  1550 0    50   ~ 0
E_STOP
Text Label 750  1650 0    50   ~ 0
INT
Text Label 750  1750 0    50   ~ 0
SYNC
Text Label 800  3100 0    50   ~ 0
E_STOP
Text Label 800  3200 0    50   ~ 0
INT
Text Label 800  3300 0    50   ~ 0
SYNC
Text Label 2350 3500 0    50   ~ 0
A_TO_PUMP
Text Label 2350 3600 0    50   ~ 0
A_FB
Text Label 2600 3900 2    50   ~ 0
I2C_DAT
Text Label 2600 4000 2    50   ~ 0
I2C_CLK
Text Label 4500 4800 2    50   ~ 0
A_OUT
Text Label 4600 3050 2    50   ~ 0
A_TO_PUMP
Text Label 5700 4900 0    50   ~ 0
A_FB
Text Label 5750 3150 0    50   ~ 0
A_IN
Text Label 8550 2150 2    50   ~ 0
A_IN
Text Label 8550 2300 2    50   ~ 0
A_OUT
Text Label 8550 2850 2    50   ~ 0
start
Text Label 8550 3650 2    50   ~ 0
error_io
Text Label 8550 5050 2    50   ~ 0
start_sw
Text Label 8950 4700 1    50   ~ 0
start
$Comp
L power:+12V #PWR01
U 1 1 5FE6D224
P 1100 1000
F 0 "#PWR01" H 1100 850 50  0001 C CNN
F 1 "+12V" H 1115 1173 50  0000 C CNN
F 2 "" H 1100 1000 50  0001 C CNN
F 3 "" H 1100 1000 50  0001 C CNN
	1    1100 1000
	1    0    0    -1  
$EndComp
$Comp
L power:+12V #PWR03
U 1 1 5FE73FEC
P 1600 1150
F 0 "#PWR03" H 1600 1000 50  0001 C CNN
F 1 "+12V" H 1615 1323 50  0000 C CNN
F 2 "" H 1600 1150 50  0001 C CNN
F 3 "" H 1600 1150 50  0001 C CNN
	1    1600 1150
	1    0    0    -1  
$EndComp
$Comp
L power:+12V #PWR05
U 1 1 5FA6990A
P 1650 2400
F 0 "#PWR05" H 1650 2250 50  0001 C CNN
F 1 "+12V" H 1665 2573 50  0000 C CNN
F 2 "" H 1650 2400 50  0001 C CNN
F 3 "" H 1650 2400 50  0001 C CNN
	1    1650 2400
	1    0    0    -1  
$EndComp
$Comp
L power:+5V #PWR07
U 1 1 5FA67628
P 1950 2400
F 0 "#PWR07" H 1950 2250 50  0001 C CNN
F 1 "+5V" H 1965 2573 50  0000 C CNN
F 2 "" H 1950 2400 50  0001 C CNN
F 3 "" H 1950 2400 50  0001 C CNN
	1    1950 2400
	1    0    0    -1  
$EndComp
$Comp
L power:+5V #PWR08
U 1 1 5FE8466D
P 2100 1150
F 0 "#PWR08" H 2100 1000 50  0001 C CNN
F 1 "+5V" H 2115 1323 50  0000 C CNN
F 2 "" H 2100 1150 50  0001 C CNN
F 3 "" H 2100 1150 50  0001 C CNN
	1    2100 1150
	1    0    0    -1  
$EndComp
$Comp
L power:+12V #PWR?
U 1 1 00000000
P 5000 1250
F 0 "#PWR?" H 5000 1100 50  0001 C CNN
F 1 "+12V" H 5015 1423 50  0000 C CNN
F 2 "" H 5000 1250 50  0001 C CNN
F 3 "" H 5000 1250 50  0001 C CNN
	1    5000 1250
	1    0    0    -1  
$EndComp
$Comp
L power:GND #PWR02
U 1 1 5FE6E4CA
P 1150 2000
F 0 "#PWR02" H 1150 1750 50  0001 C CNN
F 1 "GND" H 1155 1827 50  0000 C CNN
F 2 "" H 1150 2000 50  0001 C CNN
F 3 "" H 1150 2000 50  0001 C CNN
	1    1150 2000
	1    0    0    -1  
$EndComp
$Comp
L power:GND #PWR04
U 1 1 5FA94026
P 1600 1550
F 0 "#PWR04" H 1600 1300 50  0001 C CNN
F 1 "GND" H 1605 1377 50  0000 C CNN
F 2 "" H 1600 1550 50  0001 C CNN
F 3 "" H 1600 1550 50  0001 C CNN
	1    1600 1550
	1    0    0    -1  
$EndComp
$Comp
L power:GND #PWR06
U 1 1 5FA66343
P 1800 4600
F 0 "#PWR06" H 1800 4350 50  0001 C CNN
F 1 "GND" H 2150 4650 50  0000 C CNN
F 2 "" H 1800 4600 50  0001 C CNN
F 3 "" H 1800 4600 50  0001 C CNN
	1    1800 4600
	1    0    0    -1  
$EndComp
$Comp
L power:GND #PWR09
U 1 1 5FE8418F
P 2100 1550
F 0 "#PWR09" H 2100 1300 50  0001 C CNN
F 1 "GND" H 2105 1377 50  0000 C CNN
F 2 "" H 2100 1550 50  0001 C CNN
F 3 "" H 2100 1550 50  0001 C CNN
	1    2100 1550
	1    0    0    -1  
$EndComp
$Comp
L power:GND #PWR?
U 1 1 00000000
P 4700 5750
F 0 "#PWR?" H 4700 5500 50  0001 C CNN
F 1 "GND" H 4705 5577 50  0000 C CNN
F 2 "" H 4700 5750 50  0001 C CNN
F 3 "" H 4700 5750 50  0001 C CNN
	1    4700 5750
	1    0    0    -1  
$EndComp
$Comp
L power:GND #PWR?
U 1 1 00000000
P 4750 3850
F 0 "#PWR?" H 4750 3600 50  0001 C CNN
F 1 "GND" H 4755 3677 50  0000 C CNN
F 2 "" H 4750 3850 50  0001 C CNN
F 3 "" H 4750 3850 50  0001 C CNN
	1    4750 3850
	1    0    0    -1  
$EndComp
$Comp
L power:GND #PWR?
U 1 1 00000000
P 5000 2050
F 0 "#PWR?" H 5000 1800 50  0001 C CNN
F 1 "GND" H 5005 1877 50  0000 C CNN
F 2 "" H 5000 2050 50  0001 C CNN
F 3 "" H 5000 2050 50  0001 C CNN
	1    5000 2050
	1    0    0    -1  
$EndComp
$Comp
L power:GND #PWR?
U 1 1 00000000
P 8550 3100
F 0 "#PWR?" H 8550 2850 50  0001 C CNN
F 1 "GND" H 8555 2927 50  0000 C CNN
F 2 "" H 8550 3100 50  0001 C CNN
F 3 "" H 8550 3100 50  0001 C CNN
	1    8550 3100
	1    0    0    -1  
$EndComp
$Comp
L power:GND #PWR?
U 1 1 00000000
P 8550 3900
F 0 "#PWR?" H 8550 3650 50  0001 C CNN
F 1 "GND" H 8555 3727 50  0000 C CNN
F 2 "" H 8550 3900 50  0001 C CNN
F 3 "" H 8550 3900 50  0001 C CNN
	1    8550 3900
	1    0    0    -1  
$EndComp
$Comp
L power:GND #PWR?
U 1 1 00000000
P 8950 5350
F 0 "#PWR?" H 8950 5100 50  0001 C CNN
F 1 "GND" H 8955 5177 50  0000 C CNN
F 2 "" H 8950 5350 50  0001 C CNN
F 3 "" H 8950 5350 50  0001 C CNN
	1    8950 5350
	1    0    0    -1  
$EndComp
$Comp
L Amplifier_Operational:LM358 U?
U 3 1 00000000
P 5100 1650
F 0 "U?" H 5025 1686 50  0000 L CNN
F 1 "LM358" H 5025 1577 50  0000 L CNN
F 2 "" H 5100 1650 50  0001 C CNN
F 3 "http://www.ti.com/lit/ds/symlink/lm2904-n.pdf" H 5100 1650 50  0001 C CNN
	3    5100 1650
	1    0    0    -1  
$EndComp
$Comp
L Mechanical:MountingHole H1
U 1 1 5FAB1765
P 1100 4900
F 0 "H1" H 1200 4946 50  0000 L CNN
F 1 "MountingHole" H 1200 4855 50  0000 L CNN
F 2 "MountingHole:MountingHole_3.2mm_M3_DIN965_Pad" H 1100 4900 50  0001 C CNN
F 3 "~" H 1100 4900 50  0001 C CNN
	1    1100 4900
	1    0    0    -1  
$EndComp
$Comp
L Mechanical:MountingHole H2
U 1 1 5FAB217D
P 1100 5100
F 0 "H2" H 1200 5146 50  0000 L CNN
F 1 "MountingHole" H 1200 5055 50  0000 L CNN
F 2 "MountingHole:MountingHole_3.2mm_M3_DIN965_Pad" H 1100 5100 50  0001 C CNN
F 3 "~" H 1100 5100 50  0001 C CNN
	1    1100 5100
	1    0    0    -1  
$EndComp
$Comp
L Mechanical:MountingHole H3
U 1 1 5FAB1B3E
P 1850 4900
F 0 "H3" H 1950 4946 50  0000 L CNN
F 1 "MountingHole" H 1950 4855 50  0000 L CNN
F 2 "MountingHole:MountingHole_3.2mm_M3_DIN965_Pad" H 1850 4900 50  0001 C CNN
F 3 "~" H 1850 4900 50  0001 C CNN
	1    1850 4900
	1    0    0    -1  
$EndComp
$Comp
L Mechanical:MountingHole H4
U 1 1 5FAB25F7
P 1850 5100
F 0 "H4" H 1950 5146 50  0000 L CNN
F 1 "MountingHole" H 1950 5055 50  0000 L CNN
F 2 "MountingHole:MountingHole_3.2mm_M3_DIN965_Pad" H 1850 5100 50  0001 C CNN
F 3 "~" H 1850 5100 50  0001 C CNN
	1    1850 5100
	1    0    0    -1  
$EndComp
$Comp
L Device:R_US R?
U 1 1 00000000
P 4700 5450
F 0 "R?" H 4635 5414 50  0000 R CNN
F 1 "1k" H 4635 5523 50  0000 R CNN
F 2 "" V 4740 5440 50  0001 C CNN
F 3 "~" H 4700 5450 50  0001 C CNN
	1    4700 5450
	-1   0    0    1   
$EndComp
$Comp
L Device:R_US R?
U 1 1 00000000
P 4750 3650
F 0 "R?" H 4685 3614 50  0000 R CNN
F 1 "1k" H 4685 3723 50  0000 R CNN
F 2 "" V 4790 3640 50  0001 C CNN
F 3 "~" H 4750 3650 50  0001 C CNN
	1    4750 3650
	-1   0    0    1   
$EndComp
$Comp
L Device:R_US R?
U 1 1 00000000
P 5100 3450
F 0 "R?" V 5000 3450 50  0000 C CNN
F 1 "1k" V 5000 3250 50  0000 C CNN
F 2 "" V 5140 3440 50  0001 C CNN
F 3 "~" H 5100 3450 50  0001 C CNN
	1    5100 3450
	0    -1   -1   0   
$EndComp
$Comp
L Device:R_US R?
U 1 1 00000000
P 5100 5250
F 0 "R?" V 5000 5250 50  0000 C CNN
F 1 "R_US" V 5000 5050 50  0000 C CNN
F 2 "" V 5140 5240 50  0001 C CNN
F 3 "~" H 5100 5250 50  0001 C CNN
	1    5100 5250
	0    -1   -1   0   
$EndComp
$Comp
L OCI_UPL_2_Capacitors:10uF_t C1
U 1 1 5FA94020
P 1600 1350
F 0 "C1" H 1715 1396 50  0000 L CNN
F 1 "10uF_t" H 1715 1305 50  0000 L CNN
F 2 "OCI_UPL_FOOTPRINTS:C_2312" H 1600 1100 30  0001 C CNN
F 3 "https://www.digikey.com/short/qcd8n7" H 1600 1550 30  0001 C CNN
F 4 "T491C106K025AT" H 1600 1600 30  0001 C CNN "Part #"
F 5 "2.021" H 1600 1150 30  0001 C CNN "UPL #"
	1    1600 1350
	1    0    0    -1  
$EndComp
$Comp
L OCI_UPL_2_Capacitors:10uF_t C2
U 1 1 5FE84189
P 2100 1350
F 0 "C2" H 2215 1396 50  0000 L CNN
F 1 "10uF_t" H 2215 1305 50  0000 L CNN
F 2 "OCI_UPL_FOOTPRINTS:C_2312" H 2100 1100 30  0001 C CNN
F 3 "https://www.digikey.com/short/qcd8n7" H 2100 1550 30  0001 C CNN
F 4 "T491C106K025AT" H 2100 1600 30  0001 C CNN "Part #"
F 5 "2.021" H 2100 1150 30  0001 C CNN "UPL #"
	1    2100 1350
	1    0    0    -1  
$EndComp
$Comp
L OCI_UPL_10_Connectors:Term_2 J?
U 1 1 00000000
P 8950 2300
F 0 "J?" H 9035 2417 60  0000 L CNN
F 1 "Term_2" H 9035 2288 60  0000 L CNN
F 2 "OCI_UPL_FOOTPRINTS:TerminalBlock_Pheonix_MKDS1.5-2pol" H 9800 2500 30  0001 C CNN
F 3 "https://www.digikey.com/short/q7wbhd" H 9800 2350 30  0001 C CNN
F 4 "1935161" H 9800 2400 30  0001 C CNN "Part #"
F 5 "10.003" H 9850 2450 30  0001 C CNN "UPL #"
	1    8950 2300
	1    0    0    -1  
$EndComp
$Comp
L OCI_UPL_10_Connectors:Term_2 J?
U 1 1 00000000
P 8950 3000
F 0 "J?" H 9035 3117 60  0000 L CNN
F 1 "Term_2" H 9035 2988 60  0000 L CNN
F 2 "OCI_UPL_FOOTPRINTS:TerminalBlock_Pheonix_MKDS1.5-2pol" H 9800 3200 30  0001 C CNN
F 3 "https://www.digikey.com/short/q7wbhd" H 9800 3050 30  0001 C CNN
F 4 "1935161" H 9800 3100 30  0001 C CNN "Part #"
F 5 "10.003" H 9850 3150 30  0001 C CNN "UPL #"
	1    8950 3000
	1    0    0    -1  
$EndComp
$Comp
L OCI_UPL_10_Connectors:Term_2 J?
U 1 1 00000000
P 8950 3800
F 0 "J?" H 9035 3917 60  0000 L CNN
F 1 "Term_2" H 9035 3788 60  0000 L CNN
F 2 "OCI_UPL_FOOTPRINTS:TerminalBlock_Pheonix_MKDS1.5-2pol" H 9800 4000 30  0001 C CNN
F 3 "https://www.digikey.com/short/q7wbhd" H 9800 3850 30  0001 C CNN
F 4 "1935161" H 9800 3900 30  0001 C CNN "Part #"
F 5 "10.003" H 9850 3950 30  0001 C CNN "UPL #"
	1    8950 3800
	1    0    0    -1  
$EndComp
$Comp
L Transistor_BJT:TIP120 Q?
U 1 1 00000000
P 8850 5050
F 0 "Q?" H 9057 5086 50  0000 L CNN
F 1 "TIP120" H 9057 4977 50  0000 L CNN
F 2 "Package_TO_SOT_THT:TO-220-3_Vertical" H 9050 4975 50  0001 L CIN
F 3 "https://www.onsemi.com/pub/Collateral/TIP120-D.PDF" H 8850 5050 50  0001 L CNN
	1    8850 5050
	1    0    0    -1  
$EndComp
$Comp
L Graphic:Logo_Open_Hardware_Small Logo1
U 1 1 5FE4A934
P 10950 6850
F 0 "Logo1" H 10950 7125 50  0001 C CNN
F 1 "Logo_Open_Hardware_Small" H 10950 6625 50  0001 C CNN
F 2 "Symbol:OSHW-Symbol_6.7x6mm_SilkScreen" H 10950 6850 50  0001 C CNN
F 3 "~" H 10950 6850 50  0001 C CNN
	1    10950 6850
	1    0    0    -1  
$EndComp
$Comp
L Connector:Conn_01x10_Female J1
U 1 1 5FE6B3C7
P 1400 1450
F 0 "J1" H 1428 1380 50  0000 L CNN
F 1 "Conn_01x10_Female" H 1428 1335 50  0001 L CNN
F 2 "Connector_PinSocket_2.54mm:PinSocket_1x10_P2.54mm_Horizontal" H 1400 1450 50  0001 C CNN
F 3 "~" H 1400 1450 50  0001 C CNN
	1    1400 1450
	1    0    0    -1  
$EndComp
$Comp
L Amplifier_Operational:LM358 U?
U 1 1 00000000
P 5100 3150
F 0 "U?" H 5100 3506 50  0000 C CNN
F 1 "LM358" H 5100 3397 50  0000 C CNN
F 2 "" H 5100 3150 50  0001 C CNN
F 3 "http://www.ti.com/lit/ds/symlink/lm2904-n.pdf" H 5100 3150 50  0001 C CNN
	1    5100 3150
	1    0    0    -1  
$EndComp
$Comp
L Amplifier_Operational:LM358 U?
U 2 1 00000000
P 5100 4900
F 0 "U?" H 5100 5256 50  0000 C CNN
F 1 "LM358" H 5100 5147 50  0000 C CNN
F 2 "" H 5100 4900 50  0001 C CNN
F 3 "http://www.ti.com/lit/ds/symlink/lm2904-n.pdf" H 5100 4900 50  0001 C CNN
	2    5100 4900
	1    0    0    -1  
$EndComp
$Comp
L MCU_Module:Arduino_Nano_v3.x A1
U 1 1 5FCAD89B
P 1750 3500
F 0 "A1" H 1750 2411 50  0000 C CNN
F 1 "Arduino_Nano_v3.x" H 2250 2550 50  0000 C CNN
F 2 "Module:Arduino_Nano" H 1750 3500 50  0001 C CIN
F 3 "http://www.mouser.com/pdfdocs/Gravitech_Arduino_Nano3_0.pdf" H 1750 3500 50  0001 C CNN
	1    1750 3500
	1    0    0    -1  
$EndComp
$EndSCHEMATC
