(export (version D)
  (design
    (source /home/shane/Documents/BREAD/Designs/Slices/SLC_TEMPLATE/Hardware/BREAD_Slice.sch)
    (date "Thu 24 Dec 2020 08:41:56 AM EST")
    (tool "Eeschema 5.1.7-a382d34a8~88~ubuntu16.04.1")
    (sheet (number 1) (name /) (tstamps /)
      (title_block
        (title)
        (company)
        (rev)
        (date)
        (source BREAD_Slice.sch)
        (comment (number 1) (value ""))
        (comment (number 2) (value ""))
        (comment (number 3) (value ""))
        (comment (number 4) (value "")))))
  (components
    (comp (ref C1)
      (value 10uF_t)
      (footprint OCI_UPL_FOOTPRINTS:C_2312)
      (datasheet https://www.digikey.com/short/qcd8n7)
      (fields
        (field (name "Part #") T491C106K025AT)
        (field (name "UPL #") 2.021))
      (libsource (lib OCI_UPL_2_Capacitors) (part 10uF_t) (description "SMD 10uF tantalum capacitor 25V [UPL 2.021]"))
      (sheetpath (names /) (tstamps /))
      (tstamp 5FA94020))
    (comp (ref H1)
      (value MountingHole)
      (footprint MountingHole:MountingHole_3.2mm_M3_DIN965_Pad)
      (datasheet ~)
      (libsource (lib Mechanical) (part MountingHole) (description "Mounting Hole without connection"))
      (sheetpath (names /) (tstamps /))
      (tstamp 5FAB1765))
    (comp (ref H3)
      (value MountingHole)
      (footprint MountingHole:MountingHole_3.2mm_M3_DIN965_Pad)
      (datasheet ~)
      (libsource (lib Mechanical) (part MountingHole) (description "Mounting Hole without connection"))
      (sheetpath (names /) (tstamps /))
      (tstamp 5FAB1B3E))
    (comp (ref H2)
      (value MountingHole)
      (footprint MountingHole:MountingHole_3.2mm_M3_DIN965_Pad)
      (datasheet ~)
      (libsource (lib Mechanical) (part MountingHole) (description "Mounting Hole without connection"))
      (sheetpath (names /) (tstamps /))
      (tstamp 5FAB217D))
    (comp (ref H4)
      (value MountingHole)
      (footprint MountingHole:MountingHole_3.2mm_M3_DIN965_Pad)
      (datasheet ~)
      (libsource (lib Mechanical) (part MountingHole) (description "Mounting Hole without connection"))
      (sheetpath (names /) (tstamps /))
      (tstamp 5FAB25F7))
    (comp (ref A1)
      (value Arduino_Nano_v3.x)
      (footprint Module:Arduino_Nano)
      (datasheet http://www.mouser.com/pdfdocs/Gravitech_Arduino_Nano3_0.pdf)
      (libsource (lib MCU_Module) (part Arduino_Nano_v3.x) (description "Arduino Nano v3.x"))
      (sheetpath (names /) (tstamps /))
      (tstamp 5FCAD89B))
    (comp (ref J1)
      (value Conn_01x10_Female)
      (footprint Connector_PinSocket_2.54mm:PinSocket_1x10_P2.54mm_Horizontal)
      (datasheet ~)
      (libsource (lib Connector) (part Conn_01x10_Female) (description "Generic connector, single row, 01x10, script generated (kicad-library-utils/schlib/autogen/connector/)"))
      (sheetpath (names /) (tstamps /))
      (tstamp 5FE6B3C7))
    (comp (ref C2)
      (value 10uF_t)
      (footprint OCI_UPL_FOOTPRINTS:C_2312)
      (datasheet https://www.digikey.com/short/qcd8n7)
      (fields
        (field (name "Part #") T491C106K025AT)
        (field (name "UPL #") 2.021))
      (libsource (lib OCI_UPL_2_Capacitors) (part 10uF_t) (description "SMD 10uF tantalum capacitor 25V [UPL 2.021]"))
      (sheetpath (names /) (tstamps /))
      (tstamp 5FE84189))
    (comp (ref Logo1)
      (value Logo_Open_Hardware_Small)
      (footprint Symbol:OSHW-Symbol_6.7x6mm_SilkScreen)
      (datasheet ~)
      (libsource (lib Graphic) (part Logo_Open_Hardware_Small) (description "Open Hardware logo, small"))
      (sheetpath (names /) (tstamps /))
      (tstamp 5FE4A934)))
  (libparts
    (libpart (lib Connector) (part Conn_01x10_Female)
      (description "Generic connector, single row, 01x10, script generated (kicad-library-utils/schlib/autogen/connector/)")
      (docs ~)
      (footprints
        (fp Connector*:*_1x??_*))
      (fields
        (field (name Reference) J)
        (field (name Value) Conn_01x10_Female))
      (pins
        (pin (num 1) (name Pin_1) (type passive))
        (pin (num 2) (name Pin_2) (type passive))
        (pin (num 3) (name Pin_3) (type passive))
        (pin (num 4) (name Pin_4) (type passive))
        (pin (num 5) (name Pin_5) (type passive))
        (pin (num 6) (name Pin_6) (type passive))
        (pin (num 7) (name Pin_7) (type passive))
        (pin (num 8) (name Pin_8) (type passive))
        (pin (num 9) (name Pin_9) (type passive))
        (pin (num 10) (name Pin_10) (type passive))))
    (libpart (lib Graphic) (part Logo_Open_Hardware_Small)
      (description "Open Hardware logo, small")
      (docs ~)
      (fields
        (field (name Reference) "#LOGO")
        (field (name Value) Logo_Open_Hardware_Small)))
    (libpart (lib MCU_Module) (part Arduino_Nano_v2.x)
      (aliases
        (alias Arduino_Nano_v3.x))
      (description "Arduino Nano v2.x")
      (docs https://www.arduino.cc/en/uploads/Main/ArduinoNanoManual23.pdf)
      (footprints
        (fp Arduino*Nano*))
      (fields
        (field (name Reference) A)
        (field (name Value) Arduino_Nano_v2.x)
        (field (name Footprint) Module:Arduino_Nano))
      (pins
        (pin (num 1) (name D1/TX) (type BiDi))
        (pin (num 2) (name D0/RX) (type BiDi))
        (pin (num 3) (name ~RESET) (type input))
        (pin (num 4) (name GND) (type power_in))
        (pin (num 5) (name D2) (type BiDi))
        (pin (num 6) (name D3) (type BiDi))
        (pin (num 7) (name D4) (type BiDi))
        (pin (num 8) (name D5) (type BiDi))
        (pin (num 9) (name D6) (type BiDi))
        (pin (num 10) (name D7) (type BiDi))
        (pin (num 11) (name D8) (type BiDi))
        (pin (num 12) (name D9) (type BiDi))
        (pin (num 13) (name D10) (type BiDi))
        (pin (num 14) (name D11) (type BiDi))
        (pin (num 15) (name D12) (type BiDi))
        (pin (num 16) (name D13) (type BiDi))
        (pin (num 17) (name 3V3) (type power_out))
        (pin (num 18) (name AREF) (type input))
        (pin (num 19) (name A0) (type BiDi))
        (pin (num 20) (name A1) (type BiDi))
        (pin (num 21) (name A2) (type BiDi))
        (pin (num 22) (name A3) (type BiDi))
        (pin (num 23) (name A4) (type BiDi))
        (pin (num 24) (name A5) (type BiDi))
        (pin (num 25) (name A6) (type BiDi))
        (pin (num 26) (name A7) (type BiDi))
        (pin (num 27) (name +5V) (type power_out))
        (pin (num 28) (name ~RESET) (type input))
        (pin (num 29) (name GND) (type power_in))
        (pin (num 30) (name VIN) (type power_in))))
    (libpart (lib Mechanical) (part MountingHole)
      (description "Mounting Hole without connection")
      (docs ~)
      (footprints
        (fp MountingHole*))
      (fields
        (field (name Reference) H)
        (field (name Value) MountingHole)))
    (libpart (lib OCI_UPL_2_Capacitors) (part 10uF_t)
      (description "SMD 10uF tantalum capacitor 25V [UPL 2.021]")
      (footprints
        (fp SMD*_Pol)
        (fp c_elec*)
        (fp C*elec)
        (fp TantalC*)
        (fp Elko*)
        (fp CP*))
      (fields
        (field (name Reference) C)
        (field (name Value) 10uF_t)
        (field (name Footprint) OCI_UPL_FOOTPRINTS:C_2312)
        (field (name Datasheet) https://www.digikey.com/short/qcd8n7)
        (field (name "Part #") T491C106K025AT)
        (field (name "UPL #") 2.021))
      (pins
        (pin (num 1) (name ~) (type passive))
        (pin (num 2) (name ~) (type passive)))))
  (libraries
    (library (logical Connector)
      (uri /usr/share/kicad/library/Connector.lib))
    (library (logical Graphic)
      (uri /usr/share/kicad/library/Graphic.lib))
    (library (logical MCU_Module)
      (uri /usr/share/kicad/library/MCU_Module.lib))
    (library (logical Mechanical)
      (uri /usr/share/kicad/library/Mechanical.lib))
    (library (logical OCI_UPL_2_Capacitors)
      (uri /home/shane/Documents/OCI_UPL_Symbols/OCI_UPL_2_Capacitors.lib)))
  (nets
    (net (code 1) (name GND)
      (node (ref J1) (pin 10))
      (node (ref J1) (pin 1))
      (node (ref J1) (pin 5))
      (node (ref A1) (pin 4))
      (node (ref C1) (pin 2))
      (node (ref C2) (pin 2))
      (node (ref A1) (pin 29)))
    (net (code 2) (name +12V)
      (node (ref C1) (pin 1))
      (node (ref J1) (pin 2))
      (node (ref A1) (pin 30))
      (node (ref J1) (pin 9)))
    (net (code 3) (name /SYNC)
      (node (ref J1) (pin 7))
      (node (ref A1) (pin 6)))
    (net (code 4) (name /E_STOP)
      (node (ref J1) (pin 6))
      (node (ref A1) (pin 5)))
    (net (code 5) (name /I2C_DAT)
      (node (ref J1) (pin 4))
      (node (ref A1) (pin 23)))
    (net (code 6) (name /I2C_CLK)
      (node (ref J1) (pin 3))
      (node (ref A1) (pin 24)))
    (net (code 7) (name "Net-(A1-Pad9)")
      (node (ref A1) (pin 9)))
    (net (code 8) (name "Net-(A1-Pad8)")
      (node (ref A1) (pin 8)))
    (net (code 9) (name /INT)
      (node (ref J1) (pin 8))
      (node (ref A1) (pin 7)))
    (net (code 10) (name +5V)
      (node (ref A1) (pin 27))
      (node (ref C2) (pin 1)))
    (net (code 11) (name "Net-(A1-Pad3)")
      (node (ref A1) (pin 3)))
    (net (code 12) (name "Net-(A1-Pad1)")
      (node (ref A1) (pin 1)))
    (net (code 13) (name "Net-(A1-Pad18)")
      (node (ref A1) (pin 18)))
    (net (code 14) (name "Net-(A1-Pad28)")
      (node (ref A1) (pin 28)))
    (net (code 15) (name "Net-(A1-Pad17)")
      (node (ref A1) (pin 17)))
    (net (code 16) (name "Net-(A1-Pad2)")
      (node (ref A1) (pin 2)))
    (net (code 17) (name "Net-(A1-Pad26)")
      (node (ref A1) (pin 26)))
    (net (code 18) (name "Net-(A1-Pad25)")
      (node (ref A1) (pin 25)))
    (net (code 19) (name "Net-(A1-Pad22)")
      (node (ref A1) (pin 22)))
    (net (code 20) (name "Net-(A1-Pad21)")
      (node (ref A1) (pin 21)))
    (net (code 21) (name "Net-(A1-Pad20)")
      (node (ref A1) (pin 20)))
    (net (code 22) (name "Net-(A1-Pad19)")
      (node (ref A1) (pin 19)))
    (net (code 23) (name "Net-(A1-Pad16)")
      (node (ref A1) (pin 16)))
    (net (code 24) (name "Net-(A1-Pad15)")
      (node (ref A1) (pin 15)))
    (net (code 25) (name "Net-(A1-Pad14)")
      (node (ref A1) (pin 14)))
    (net (code 26) (name "Net-(A1-Pad13)")
      (node (ref A1) (pin 13)))
    (net (code 27) (name "Net-(A1-Pad12)")
      (node (ref A1) (pin 12)))
    (net (code 28) (name "Net-(A1-Pad11)")
      (node (ref A1) (pin 11)))
    (net (code 29) (name "Net-(A1-Pad10)")
      (node (ref A1) (pin 10)))))