%TF.GenerationSoftware,KiCad,Pcbnew,5.1.10*%
%TF.CreationDate,2021-10-26T18:06:13-04:00*%
%TF.ProjectId,BREAD_Slice,42524541-445f-4536-9c69-63652e6b6963,rev?*%
%TF.SameCoordinates,Original*%
%TF.FileFunction,Legend,Top*%
%TF.FilePolarity,Positive*%
%FSLAX46Y46*%
G04 Gerber Fmt 4.6, Leading zero omitted, Abs format (unit mm)*
G04 Created by KiCad (PCBNEW 5.1.10) date 2021-10-26 18:06:13*
%MOMM*%
%LPD*%
G01*
G04 APERTURE LIST*
%ADD10C,0.150000*%
%ADD11C,0.120000*%
%ADD12C,0.010000*%
G04 APERTURE END LIST*
D10*
X177352857Y-58011904D02*
X177352857Y-56488095D01*
X176448095Y-62472857D02*
X177971904Y-62472857D01*
X177210000Y-63234761D02*
X177210000Y-61710952D01*
X191632380Y-61980476D02*
X190632380Y-61980476D01*
X191108571Y-61980476D02*
X191108571Y-61409047D01*
X191632380Y-61409047D02*
X190632380Y-61409047D01*
X191584761Y-60551904D02*
X191632380Y-60647142D01*
X191632380Y-60837619D01*
X191584761Y-60932857D01*
X191489523Y-60980476D01*
X191108571Y-60980476D01*
X191013333Y-60932857D01*
X190965714Y-60837619D01*
X190965714Y-60647142D01*
X191013333Y-60551904D01*
X191108571Y-60504285D01*
X191203809Y-60504285D01*
X191299047Y-60980476D01*
X191632380Y-59647142D02*
X191108571Y-59647142D01*
X191013333Y-59694761D01*
X190965714Y-59790000D01*
X190965714Y-59980476D01*
X191013333Y-60075714D01*
X191584761Y-59647142D02*
X191632380Y-59742380D01*
X191632380Y-59980476D01*
X191584761Y-60075714D01*
X191489523Y-60123333D01*
X191394285Y-60123333D01*
X191299047Y-60075714D01*
X191251428Y-59980476D01*
X191251428Y-59742380D01*
X191203809Y-59647142D01*
X190965714Y-59313809D02*
X190965714Y-58932857D01*
X190632380Y-59170952D02*
X191489523Y-59170952D01*
X191584761Y-59123333D01*
X191632380Y-59028095D01*
X191632380Y-58932857D01*
X191584761Y-58218571D02*
X191632380Y-58313809D01*
X191632380Y-58504285D01*
X191584761Y-58599523D01*
X191489523Y-58647142D01*
X191108571Y-58647142D01*
X191013333Y-58599523D01*
X190965714Y-58504285D01*
X190965714Y-58313809D01*
X191013333Y-58218571D01*
X191108571Y-58170952D01*
X191203809Y-58170952D01*
X191299047Y-58647142D01*
X191632380Y-57742380D02*
X190965714Y-57742380D01*
X191156190Y-57742380D02*
X191060952Y-57694761D01*
X191013333Y-57647142D01*
X190965714Y-57551904D01*
X190965714Y-57456666D01*
X190632380Y-86173333D02*
X190632380Y-85601904D01*
X191632380Y-85887619D02*
X190632380Y-85887619D01*
X191632380Y-85268571D02*
X190632380Y-85268571D01*
X191632380Y-84840000D02*
X191108571Y-84840000D01*
X191013333Y-84887619D01*
X190965714Y-84982857D01*
X190965714Y-85125714D01*
X191013333Y-85220952D01*
X191060952Y-85268571D01*
X191584761Y-83982857D02*
X191632380Y-84078095D01*
X191632380Y-84268571D01*
X191584761Y-84363809D01*
X191489523Y-84411428D01*
X191108571Y-84411428D01*
X191013333Y-84363809D01*
X190965714Y-84268571D01*
X190965714Y-84078095D01*
X191013333Y-83982857D01*
X191108571Y-83935238D01*
X191203809Y-83935238D01*
X191299047Y-84411428D01*
X191632380Y-83506666D02*
X190965714Y-83506666D01*
X191156190Y-83506666D02*
X191060952Y-83459047D01*
X191013333Y-83411428D01*
X190965714Y-83316190D01*
X190965714Y-83220952D01*
X191632380Y-82887619D02*
X190965714Y-82887619D01*
X191060952Y-82887619D02*
X191013333Y-82840000D01*
X190965714Y-82744761D01*
X190965714Y-82601904D01*
X191013333Y-82506666D01*
X191108571Y-82459047D01*
X191632380Y-82459047D01*
X191108571Y-82459047D02*
X191013333Y-82411428D01*
X190965714Y-82316190D01*
X190965714Y-82173333D01*
X191013333Y-82078095D01*
X191108571Y-82030476D01*
X191632380Y-82030476D01*
X191632380Y-81411428D02*
X191584761Y-81506666D01*
X191537142Y-81554285D01*
X191441904Y-81601904D01*
X191156190Y-81601904D01*
X191060952Y-81554285D01*
X191013333Y-81506666D01*
X190965714Y-81411428D01*
X190965714Y-81268571D01*
X191013333Y-81173333D01*
X191060952Y-81125714D01*
X191156190Y-81078095D01*
X191441904Y-81078095D01*
X191537142Y-81125714D01*
X191584761Y-81173333D01*
X191632380Y-81268571D01*
X191632380Y-81411428D01*
X191584761Y-80220952D02*
X191632380Y-80316190D01*
X191632380Y-80506666D01*
X191584761Y-80601904D01*
X191537142Y-80649523D01*
X191441904Y-80697142D01*
X191156190Y-80697142D01*
X191060952Y-80649523D01*
X191013333Y-80601904D01*
X190965714Y-80506666D01*
X190965714Y-80316190D01*
X191013333Y-80220952D01*
X191632380Y-79649523D02*
X191584761Y-79744761D01*
X191537142Y-79792380D01*
X191441904Y-79840000D01*
X191156190Y-79840000D01*
X191060952Y-79792380D01*
X191013333Y-79744761D01*
X190965714Y-79649523D01*
X190965714Y-79506666D01*
X191013333Y-79411428D01*
X191060952Y-79363809D01*
X191156190Y-79316190D01*
X191441904Y-79316190D01*
X191537142Y-79363809D01*
X191584761Y-79411428D01*
X191632380Y-79506666D01*
X191632380Y-79649523D01*
X190965714Y-78459047D02*
X191632380Y-78459047D01*
X190965714Y-78887619D02*
X191489523Y-78887619D01*
X191584761Y-78840000D01*
X191632380Y-78744761D01*
X191632380Y-78601904D01*
X191584761Y-78506666D01*
X191537142Y-78459047D01*
X190965714Y-77982857D02*
X191965714Y-77982857D01*
X191013333Y-77982857D02*
X190965714Y-77887619D01*
X190965714Y-77697142D01*
X191013333Y-77601904D01*
X191060952Y-77554285D01*
X191156190Y-77506666D01*
X191441904Y-77506666D01*
X191537142Y-77554285D01*
X191584761Y-77601904D01*
X191632380Y-77697142D01*
X191632380Y-77887619D01*
X191584761Y-77982857D01*
X191632380Y-76935238D02*
X191584761Y-77030476D01*
X191489523Y-77078095D01*
X190632380Y-77078095D01*
X191584761Y-76173333D02*
X191632380Y-76268571D01*
X191632380Y-76459047D01*
X191584761Y-76554285D01*
X191489523Y-76601904D01*
X191108571Y-76601904D01*
X191013333Y-76554285D01*
X190965714Y-76459047D01*
X190965714Y-76268571D01*
X191013333Y-76173333D01*
X191108571Y-76125714D01*
X191203809Y-76125714D01*
X191299047Y-76601904D01*
X191632380Y-74935238D02*
X190632380Y-74935238D01*
X190965714Y-74459047D02*
X191632380Y-74459047D01*
X191060952Y-74459047D02*
X191013333Y-74411428D01*
X190965714Y-74316190D01*
X190965714Y-74173333D01*
X191013333Y-74078095D01*
X191108571Y-74030476D01*
X191632380Y-74030476D01*
X190965714Y-73554285D02*
X191965714Y-73554285D01*
X191013333Y-73554285D02*
X190965714Y-73459047D01*
X190965714Y-73268571D01*
X191013333Y-73173333D01*
X191060952Y-73125714D01*
X191156190Y-73078095D01*
X191441904Y-73078095D01*
X191537142Y-73125714D01*
X191584761Y-73173333D01*
X191632380Y-73268571D01*
X191632380Y-73459047D01*
X191584761Y-73554285D01*
X190965714Y-72220952D02*
X191632380Y-72220952D01*
X190965714Y-72649523D02*
X191489523Y-72649523D01*
X191584761Y-72601904D01*
X191632380Y-72506666D01*
X191632380Y-72363809D01*
X191584761Y-72268571D01*
X191537142Y-72220952D01*
X190965714Y-71887619D02*
X190965714Y-71506666D01*
X190632380Y-71744761D02*
X191489523Y-71744761D01*
X191584761Y-71697142D01*
X191632380Y-71601904D01*
X191632380Y-71506666D01*
X190632380Y-105255238D02*
X190632380Y-104683809D01*
X191632380Y-104969523D02*
X190632380Y-104969523D01*
X191632380Y-104350476D02*
X190632380Y-104350476D01*
X191632380Y-103921904D02*
X191108571Y-103921904D01*
X191013333Y-103969523D01*
X190965714Y-104064761D01*
X190965714Y-104207619D01*
X191013333Y-104302857D01*
X191060952Y-104350476D01*
X191584761Y-103064761D02*
X191632380Y-103160000D01*
X191632380Y-103350476D01*
X191584761Y-103445714D01*
X191489523Y-103493333D01*
X191108571Y-103493333D01*
X191013333Y-103445714D01*
X190965714Y-103350476D01*
X190965714Y-103160000D01*
X191013333Y-103064761D01*
X191108571Y-103017142D01*
X191203809Y-103017142D01*
X191299047Y-103493333D01*
X191632380Y-102588571D02*
X190965714Y-102588571D01*
X191156190Y-102588571D02*
X191060952Y-102540952D01*
X191013333Y-102493333D01*
X190965714Y-102398095D01*
X190965714Y-102302857D01*
X191632380Y-101969523D02*
X190965714Y-101969523D01*
X191060952Y-101969523D02*
X191013333Y-101921904D01*
X190965714Y-101826666D01*
X190965714Y-101683809D01*
X191013333Y-101588571D01*
X191108571Y-101540952D01*
X191632380Y-101540952D01*
X191108571Y-101540952D02*
X191013333Y-101493333D01*
X190965714Y-101398095D01*
X190965714Y-101255238D01*
X191013333Y-101160000D01*
X191108571Y-101112380D01*
X191632380Y-101112380D01*
X191632380Y-100636190D02*
X190965714Y-100636190D01*
X190632380Y-100636190D02*
X190680000Y-100683809D01*
X190727619Y-100636190D01*
X190680000Y-100588571D01*
X190632380Y-100636190D01*
X190727619Y-100636190D01*
X191584761Y-100207619D02*
X191632380Y-100112380D01*
X191632380Y-99921904D01*
X191584761Y-99826666D01*
X191489523Y-99779047D01*
X191441904Y-99779047D01*
X191346666Y-99826666D01*
X191299047Y-99921904D01*
X191299047Y-100064761D01*
X191251428Y-100160000D01*
X191156190Y-100207619D01*
X191108571Y-100207619D01*
X191013333Y-100160000D01*
X190965714Y-100064761D01*
X190965714Y-99921904D01*
X191013333Y-99826666D01*
X190965714Y-99493333D02*
X190965714Y-99112380D01*
X190632380Y-99350476D02*
X191489523Y-99350476D01*
X191584761Y-99302857D01*
X191632380Y-99207619D01*
X191632380Y-99112380D01*
X191632380Y-98636190D02*
X191584761Y-98731428D01*
X191537142Y-98779047D01*
X191441904Y-98826666D01*
X191156190Y-98826666D01*
X191060952Y-98779047D01*
X191013333Y-98731428D01*
X190965714Y-98636190D01*
X190965714Y-98493333D01*
X191013333Y-98398095D01*
X191060952Y-98350476D01*
X191156190Y-98302857D01*
X191441904Y-98302857D01*
X191537142Y-98350476D01*
X191584761Y-98398095D01*
X191632380Y-98493333D01*
X191632380Y-98636190D01*
X191632380Y-97874285D02*
X190965714Y-97874285D01*
X191156190Y-97874285D02*
X191060952Y-97826666D01*
X191013333Y-97779047D01*
X190965714Y-97683809D01*
X190965714Y-97588571D01*
X191632380Y-96493333D02*
X190632380Y-96493333D01*
X190965714Y-96017142D02*
X191632380Y-96017142D01*
X191060952Y-96017142D02*
X191013333Y-95969523D01*
X190965714Y-95874285D01*
X190965714Y-95731428D01*
X191013333Y-95636190D01*
X191108571Y-95588571D01*
X191632380Y-95588571D01*
X190965714Y-95112380D02*
X191965714Y-95112380D01*
X191013333Y-95112380D02*
X190965714Y-95017142D01*
X190965714Y-94826666D01*
X191013333Y-94731428D01*
X191060952Y-94683809D01*
X191156190Y-94636190D01*
X191441904Y-94636190D01*
X191537142Y-94683809D01*
X191584761Y-94731428D01*
X191632380Y-94826666D01*
X191632380Y-95017142D01*
X191584761Y-95112380D01*
X190965714Y-93779047D02*
X191632380Y-93779047D01*
X190965714Y-94207619D02*
X191489523Y-94207619D01*
X191584761Y-94160000D01*
X191632380Y-94064761D01*
X191632380Y-93921904D01*
X191584761Y-93826666D01*
X191537142Y-93779047D01*
X190965714Y-93445714D02*
X190965714Y-93064761D01*
X190632380Y-93302857D02*
X191489523Y-93302857D01*
X191584761Y-93255238D01*
X191632380Y-93160000D01*
X191632380Y-93064761D01*
X152790475Y-134602380D02*
X152790475Y-133602380D01*
X152790475Y-134078571D02*
X153361903Y-134078571D01*
X153361903Y-134602380D02*
X153361903Y-133602380D01*
X154219046Y-134554761D02*
X154123808Y-134602380D01*
X153933332Y-134602380D01*
X153838094Y-134554761D01*
X153790475Y-134459523D01*
X153790475Y-134078571D01*
X153838094Y-133983333D01*
X153933332Y-133935714D01*
X154123808Y-133935714D01*
X154219046Y-133983333D01*
X154266665Y-134078571D01*
X154266665Y-134173809D01*
X153790475Y-134269047D01*
X155123808Y-134602380D02*
X155123808Y-134078571D01*
X155076189Y-133983333D01*
X154980951Y-133935714D01*
X154790475Y-133935714D01*
X154695237Y-133983333D01*
X155123808Y-134554761D02*
X155028570Y-134602380D01*
X154790475Y-134602380D01*
X154695237Y-134554761D01*
X154647618Y-134459523D01*
X154647618Y-134364285D01*
X154695237Y-134269047D01*
X154790475Y-134221428D01*
X155028570Y-134221428D01*
X155123808Y-134173809D01*
X155457141Y-133935714D02*
X155838094Y-133935714D01*
X155599999Y-133602380D02*
X155599999Y-134459523D01*
X155647618Y-134554761D01*
X155742856Y-134602380D01*
X155838094Y-134602380D01*
X156171427Y-134602380D02*
X156171427Y-133935714D01*
X156171427Y-133602380D02*
X156123808Y-133650000D01*
X156171427Y-133697619D01*
X156219046Y-133650000D01*
X156171427Y-133602380D01*
X156171427Y-133697619D01*
X156647618Y-133935714D02*
X156647618Y-134602380D01*
X156647618Y-134030952D02*
X156695237Y-133983333D01*
X156790475Y-133935714D01*
X156933332Y-133935714D01*
X157028570Y-133983333D01*
X157076189Y-134078571D01*
X157076189Y-134602380D01*
X157980951Y-133935714D02*
X157980951Y-134745238D01*
X157933332Y-134840476D01*
X157885713Y-134888095D01*
X157790475Y-134935714D01*
X157647618Y-134935714D01*
X157552379Y-134888095D01*
X157980951Y-134554761D02*
X157885713Y-134602380D01*
X157695237Y-134602380D01*
X157599999Y-134554761D01*
X157552379Y-134507142D01*
X157504760Y-134411904D01*
X157504760Y-134126190D01*
X157552379Y-134030952D01*
X157599999Y-133983333D01*
X157695237Y-133935714D01*
X157885713Y-133935714D01*
X157980951Y-133983333D01*
X159171427Y-134554761D02*
X159314284Y-134602380D01*
X159552379Y-134602380D01*
X159647618Y-134554761D01*
X159695237Y-134507142D01*
X159742856Y-134411904D01*
X159742856Y-134316666D01*
X159695237Y-134221428D01*
X159647618Y-134173809D01*
X159552379Y-134126190D01*
X159361903Y-134078571D01*
X159266665Y-134030952D01*
X159219046Y-133983333D01*
X159171427Y-133888095D01*
X159171427Y-133792857D01*
X159219046Y-133697619D01*
X159266665Y-133650000D01*
X159361903Y-133602380D01*
X159599999Y-133602380D01*
X159742856Y-133650000D01*
X160314284Y-134602380D02*
X160219046Y-134554761D01*
X160171427Y-134459523D01*
X160171427Y-133602380D01*
X160695237Y-134602380D02*
X160695237Y-133935714D01*
X160695237Y-133602380D02*
X160647618Y-133650000D01*
X160695237Y-133697619D01*
X160742856Y-133650000D01*
X160695237Y-133602380D01*
X160695237Y-133697619D01*
X161599999Y-134554761D02*
X161504760Y-134602380D01*
X161314284Y-134602380D01*
X161219046Y-134554761D01*
X161171427Y-134507142D01*
X161123808Y-134411904D01*
X161123808Y-134126190D01*
X161171427Y-134030952D01*
X161219046Y-133983333D01*
X161314284Y-133935714D01*
X161504760Y-133935714D01*
X161599999Y-133983333D01*
X162409522Y-134554761D02*
X162314284Y-134602380D01*
X162123808Y-134602380D01*
X162028570Y-134554761D01*
X161980951Y-134459523D01*
X161980951Y-134078571D01*
X162028570Y-133983333D01*
X162123808Y-133935714D01*
X162314284Y-133935714D01*
X162409522Y-133983333D01*
X162457141Y-134078571D01*
X162457141Y-134173809D01*
X161980951Y-134269047D01*
X154242856Y-136204761D02*
X154385713Y-136252380D01*
X154623808Y-136252380D01*
X154719046Y-136204761D01*
X154766665Y-136157142D01*
X154814284Y-136061904D01*
X154814284Y-135966666D01*
X154766665Y-135871428D01*
X154719046Y-135823809D01*
X154623808Y-135776190D01*
X154433332Y-135728571D01*
X154338094Y-135680952D01*
X154290475Y-135633333D01*
X154242856Y-135538095D01*
X154242856Y-135442857D01*
X154290475Y-135347619D01*
X154338094Y-135300000D01*
X154433332Y-135252380D01*
X154671427Y-135252380D01*
X154814284Y-135300000D01*
X155719046Y-136252380D02*
X155242856Y-136252380D01*
X155242856Y-135252380D01*
X156623808Y-136157142D02*
X156576189Y-136204761D01*
X156433332Y-136252380D01*
X156338094Y-136252380D01*
X156195237Y-136204761D01*
X156099999Y-136109523D01*
X156052379Y-136014285D01*
X156004760Y-135823809D01*
X156004760Y-135680952D01*
X156052379Y-135490476D01*
X156099999Y-135395238D01*
X156195237Y-135300000D01*
X156338094Y-135252380D01*
X156433332Y-135252380D01*
X156576189Y-135300000D01*
X156623808Y-135347619D01*
X156814284Y-136347619D02*
X157576189Y-136347619D01*
X157814284Y-136252380D02*
X157814284Y-135252380D01*
X157814284Y-135728571D02*
X158385713Y-135728571D01*
X158385713Y-136252380D02*
X158385713Y-135252380D01*
X158861903Y-135728571D02*
X159195237Y-135728571D01*
X159338094Y-136252380D02*
X158861903Y-136252380D01*
X158861903Y-135252380D01*
X159338094Y-135252380D01*
X159719046Y-135966666D02*
X160195237Y-135966666D01*
X159623808Y-136252380D02*
X159957141Y-135252380D01*
X160290475Y-136252380D01*
X160480951Y-135252380D02*
X161052379Y-135252380D01*
X160766665Y-136252380D02*
X160766665Y-135252380D01*
X155147618Y-137902380D02*
X154814284Y-137426190D01*
X154576189Y-137902380D02*
X154576189Y-136902380D01*
X154957141Y-136902380D01*
X155052379Y-136950000D01*
X155099999Y-136997619D01*
X155147618Y-137092857D01*
X155147618Y-137235714D01*
X155099999Y-137330952D01*
X155052379Y-137378571D01*
X154957141Y-137426190D01*
X154576189Y-137426190D01*
X155766665Y-136902380D02*
X155861903Y-136902380D01*
X155957141Y-136950000D01*
X156004760Y-136997619D01*
X156052379Y-137092857D01*
X156099999Y-137283333D01*
X156099999Y-137521428D01*
X156052379Y-137711904D01*
X156004760Y-137807142D01*
X155957141Y-137854761D01*
X155861903Y-137902380D01*
X155766665Y-137902380D01*
X155671427Y-137854761D01*
X155623808Y-137807142D01*
X155576189Y-137711904D01*
X155528570Y-137521428D01*
X155528570Y-137283333D01*
X155576189Y-137092857D01*
X155623808Y-136997619D01*
X155671427Y-136950000D01*
X155766665Y-136902380D01*
X157242856Y-136997619D02*
X157290475Y-136950000D01*
X157385713Y-136902380D01*
X157623808Y-136902380D01*
X157719046Y-136950000D01*
X157766665Y-136997619D01*
X157814284Y-137092857D01*
X157814284Y-137188095D01*
X157766665Y-137330952D01*
X157195237Y-137902380D01*
X157814284Y-137902380D01*
X158433332Y-136902380D02*
X158528570Y-136902380D01*
X158623808Y-136950000D01*
X158671427Y-136997619D01*
X158719046Y-137092857D01*
X158766665Y-137283333D01*
X158766665Y-137521428D01*
X158719046Y-137711904D01*
X158671427Y-137807142D01*
X158623808Y-137854761D01*
X158528570Y-137902380D01*
X158433332Y-137902380D01*
X158338094Y-137854761D01*
X158290475Y-137807142D01*
X158242856Y-137711904D01*
X158195237Y-137521428D01*
X158195237Y-137283333D01*
X158242856Y-137092857D01*
X158290475Y-136997619D01*
X158338094Y-136950000D01*
X158433332Y-136902380D01*
X159147618Y-136997619D02*
X159195237Y-136950000D01*
X159290475Y-136902380D01*
X159528570Y-136902380D01*
X159623808Y-136950000D01*
X159671427Y-136997619D01*
X159719046Y-137092857D01*
X159719046Y-137188095D01*
X159671427Y-137330952D01*
X159099999Y-137902380D01*
X159719046Y-137902380D01*
X160671427Y-137902380D02*
X160099999Y-137902380D01*
X160385713Y-137902380D02*
X160385713Y-136902380D01*
X160290475Y-137045238D01*
X160195237Y-137140476D01*
X160099999Y-137188095D01*
D11*
%TO.C,Q2*%
X140920000Y-68099000D02*
X142430000Y-68099000D01*
X140920000Y-71800000D02*
X142430000Y-71800000D01*
X142430000Y-75070000D02*
X142430000Y-64830000D01*
X140920000Y-64830000D02*
X145561000Y-64830000D01*
X140920000Y-75070000D02*
X145561000Y-75070000D01*
X145561000Y-75070000D02*
X145561000Y-64830000D01*
X140920000Y-75070000D02*
X140920000Y-64830000D01*
%TO.C,Q1*%
X140920000Y-80799000D02*
X142430000Y-80799000D01*
X140920000Y-84500000D02*
X142430000Y-84500000D01*
X142430000Y-87770000D02*
X142430000Y-77530000D01*
X140920000Y-77530000D02*
X145561000Y-77530000D01*
X140920000Y-87770000D02*
X145561000Y-87770000D01*
X145561000Y-87770000D02*
X145561000Y-77530000D01*
X140920000Y-87770000D02*
X140920000Y-77530000D01*
D10*
%TO.C,J4*%
X179630000Y-102930000D02*
X189430000Y-102930000D01*
X179630000Y-92930000D02*
X179630000Y-102930000D01*
X189430000Y-92930000D02*
X179630000Y-92930000D01*
X189430000Y-102930000D02*
X189430000Y-92930000D01*
X188930000Y-102930000D02*
X188930000Y-92930000D01*
X182530000Y-102930000D02*
X182530000Y-92930000D01*
X187430000Y-102930000D02*
X187430000Y-92930000D01*
X186930000Y-100430000D02*
G75*
G03*
X186930000Y-100430000I-2000000J0D01*
G01*
X186930000Y-95430000D02*
G75*
G03*
X186930000Y-95430000I-2000000J0D01*
G01*
X188930000Y-97930000D02*
X189430000Y-97930000D01*
%TO.C,J3*%
X179630000Y-64830000D02*
X189430000Y-64830000D01*
X179630000Y-54830000D02*
X179630000Y-64830000D01*
X189430000Y-54830000D02*
X179630000Y-54830000D01*
X189430000Y-64830000D02*
X189430000Y-54830000D01*
X188930000Y-64830000D02*
X188930000Y-54830000D01*
X182530000Y-64830000D02*
X182530000Y-54830000D01*
X187430000Y-64830000D02*
X187430000Y-54830000D01*
X186930000Y-62330000D02*
G75*
G03*
X186930000Y-62330000I-2000000J0D01*
G01*
X186930000Y-57330000D02*
G75*
G03*
X186930000Y-57330000I-2000000J0D01*
G01*
X188930000Y-59830000D02*
X189430000Y-59830000D01*
%TO.C,J2*%
X190030000Y-73800000D02*
X180230000Y-73800000D01*
X190030000Y-83800000D02*
X190030000Y-73800000D01*
X180230000Y-83800000D02*
X190030000Y-83800000D01*
X180230000Y-73800000D02*
X180230000Y-83800000D01*
X180730000Y-73800000D02*
X180730000Y-83800000D01*
X187130000Y-73800000D02*
X187130000Y-83800000D01*
X182230000Y-73800000D02*
X182230000Y-83800000D01*
X186730000Y-76300000D02*
G75*
G03*
X186730000Y-76300000I-2000000J0D01*
G01*
X186730000Y-81300000D02*
G75*
G03*
X186730000Y-81300000I-2000000J0D01*
G01*
X180730000Y-78800000D02*
X180230000Y-78800000D01*
D12*
%TO.C,Logo1*%
G36*
X167155814Y-133268931D02*
G01*
X167239635Y-133713555D01*
X167548920Y-133841053D01*
X167858206Y-133968551D01*
X168229246Y-133716246D01*
X168333157Y-133645996D01*
X168427087Y-133583272D01*
X168506652Y-133530938D01*
X168567470Y-133491857D01*
X168605157Y-133468893D01*
X168615421Y-133463942D01*
X168633910Y-133476676D01*
X168673420Y-133511882D01*
X168729522Y-133565062D01*
X168797787Y-133631718D01*
X168873786Y-133707354D01*
X168953092Y-133787472D01*
X169031275Y-133867574D01*
X169103907Y-133943164D01*
X169166559Y-134009745D01*
X169214803Y-134062818D01*
X169244210Y-134097887D01*
X169251241Y-134109623D01*
X169241123Y-134131260D01*
X169212759Y-134178662D01*
X169169129Y-134247193D01*
X169113218Y-134332215D01*
X169048006Y-134429093D01*
X169010219Y-134484350D01*
X168941343Y-134585248D01*
X168880140Y-134676299D01*
X168829578Y-134752970D01*
X168792628Y-134810728D01*
X168772258Y-134845043D01*
X168769197Y-134852254D01*
X168776136Y-134872748D01*
X168795051Y-134920513D01*
X168823087Y-134988832D01*
X168857391Y-135070989D01*
X168895109Y-135160270D01*
X168933387Y-135249958D01*
X168969370Y-135333338D01*
X169000206Y-135403694D01*
X169023039Y-135454310D01*
X169035017Y-135478471D01*
X169035724Y-135479422D01*
X169054531Y-135484036D01*
X169104618Y-135494328D01*
X169180793Y-135509287D01*
X169277865Y-135527901D01*
X169390643Y-135549159D01*
X169456442Y-135561418D01*
X169576950Y-135584362D01*
X169685797Y-135606195D01*
X169777476Y-135625722D01*
X169846481Y-135641748D01*
X169887304Y-135653079D01*
X169895511Y-135656674D01*
X169903548Y-135681006D01*
X169910033Y-135735959D01*
X169914970Y-135815108D01*
X169918364Y-135912026D01*
X169920218Y-136020287D01*
X169920538Y-136133465D01*
X169919327Y-136245135D01*
X169916590Y-136348868D01*
X169912331Y-136438241D01*
X169906555Y-136506826D01*
X169899267Y-136548197D01*
X169894895Y-136556810D01*
X169868764Y-136567133D01*
X169813393Y-136581892D01*
X169736107Y-136599352D01*
X169644230Y-136617780D01*
X169612158Y-136623741D01*
X169457524Y-136652066D01*
X169335375Y-136674876D01*
X169241673Y-136693080D01*
X169172384Y-136707583D01*
X169123471Y-136719292D01*
X169090897Y-136729115D01*
X169070628Y-136737956D01*
X169058626Y-136746724D01*
X169056947Y-136748457D01*
X169040184Y-136776371D01*
X169014614Y-136830695D01*
X168982788Y-136904777D01*
X168947260Y-136991965D01*
X168910583Y-137085608D01*
X168875311Y-137179052D01*
X168843996Y-137265647D01*
X168819193Y-137338740D01*
X168803454Y-137391678D01*
X168799332Y-137417811D01*
X168799676Y-137418726D01*
X168813641Y-137440086D01*
X168845322Y-137487084D01*
X168891391Y-137554827D01*
X168948518Y-137638423D01*
X169013373Y-137732982D01*
X169031843Y-137759854D01*
X169097699Y-137857275D01*
X169155650Y-137946163D01*
X169202538Y-138021412D01*
X169235207Y-138077920D01*
X169250500Y-138110581D01*
X169251241Y-138114593D01*
X169238392Y-138135684D01*
X169202888Y-138177464D01*
X169149293Y-138235445D01*
X169082171Y-138305135D01*
X169006087Y-138382045D01*
X168925604Y-138461683D01*
X168845287Y-138539561D01*
X168769699Y-138611186D01*
X168703405Y-138672070D01*
X168650969Y-138717721D01*
X168616955Y-138743650D01*
X168607545Y-138747883D01*
X168585643Y-138737912D01*
X168540800Y-138711020D01*
X168480321Y-138671736D01*
X168433789Y-138640117D01*
X168349475Y-138582098D01*
X168249626Y-138513784D01*
X168149473Y-138445579D01*
X168095627Y-138409075D01*
X167913371Y-138285800D01*
X167760381Y-138368520D01*
X167690682Y-138404759D01*
X167631414Y-138432926D01*
X167591311Y-138448991D01*
X167581103Y-138451226D01*
X167568829Y-138434722D01*
X167544613Y-138388082D01*
X167510263Y-138315609D01*
X167467588Y-138221606D01*
X167418394Y-138110374D01*
X167364490Y-137986215D01*
X167307684Y-137853432D01*
X167249782Y-137716327D01*
X167192593Y-137579202D01*
X167137924Y-137446358D01*
X167087584Y-137322098D01*
X167043380Y-137210725D01*
X167007119Y-137116539D01*
X166980609Y-137043844D01*
X166965658Y-136996941D01*
X166963254Y-136980833D01*
X166982311Y-136960286D01*
X167024036Y-136926933D01*
X167079706Y-136887702D01*
X167084378Y-136884599D01*
X167228264Y-136769423D01*
X167344283Y-136635053D01*
X167431430Y-136485784D01*
X167488699Y-136325913D01*
X167515086Y-136159737D01*
X167509585Y-135991552D01*
X167471190Y-135825655D01*
X167398895Y-135666342D01*
X167377626Y-135631487D01*
X167266996Y-135490737D01*
X167136302Y-135377714D01*
X166990064Y-135293003D01*
X166832808Y-135237194D01*
X166669057Y-135210874D01*
X166503333Y-135214630D01*
X166340162Y-135249050D01*
X166184065Y-135314723D01*
X166039567Y-135412235D01*
X165994869Y-135451813D01*
X165881112Y-135575703D01*
X165798218Y-135706124D01*
X165741356Y-135852315D01*
X165709687Y-135997088D01*
X165701869Y-136159860D01*
X165727938Y-136323440D01*
X165785245Y-136482298D01*
X165871144Y-136630906D01*
X165982986Y-136763735D01*
X166118123Y-136875256D01*
X166135883Y-136887011D01*
X166192150Y-136925508D01*
X166234923Y-136958863D01*
X166255372Y-136980160D01*
X166255669Y-136980833D01*
X166251279Y-137003871D01*
X166233876Y-137056157D01*
X166205268Y-137133390D01*
X166167265Y-137231268D01*
X166121674Y-137345491D01*
X166070303Y-137471758D01*
X166014962Y-137605767D01*
X165957458Y-137743218D01*
X165899601Y-137879808D01*
X165843198Y-138011237D01*
X165790058Y-138133205D01*
X165741990Y-138241409D01*
X165700801Y-138331549D01*
X165668301Y-138399323D01*
X165646297Y-138440430D01*
X165637436Y-138451226D01*
X165610360Y-138442819D01*
X165559697Y-138420272D01*
X165494183Y-138387613D01*
X165458159Y-138368520D01*
X165305168Y-138285800D01*
X165122912Y-138409075D01*
X165029875Y-138472228D01*
X164928015Y-138541727D01*
X164832562Y-138607165D01*
X164784750Y-138640117D01*
X164717505Y-138685273D01*
X164660564Y-138721057D01*
X164621354Y-138742938D01*
X164608619Y-138747563D01*
X164590083Y-138735085D01*
X164549059Y-138700252D01*
X164489525Y-138646678D01*
X164415458Y-138577983D01*
X164330835Y-138497781D01*
X164277315Y-138446286D01*
X164183681Y-138354286D01*
X164102759Y-138271999D01*
X164037823Y-138202945D01*
X163992142Y-138150644D01*
X163968989Y-138118616D01*
X163966768Y-138112116D01*
X163977076Y-138087394D01*
X164005561Y-138037405D01*
X164049063Y-137967212D01*
X164104423Y-137881875D01*
X164168480Y-137786456D01*
X164186697Y-137759854D01*
X164253073Y-137663167D01*
X164312622Y-137576117D01*
X164362016Y-137503595D01*
X164397925Y-137450493D01*
X164417019Y-137421703D01*
X164418864Y-137418726D01*
X164416105Y-137395782D01*
X164401462Y-137345336D01*
X164377487Y-137274041D01*
X164346734Y-137188547D01*
X164311756Y-137095507D01*
X164275107Y-137001574D01*
X164239339Y-136913399D01*
X164207006Y-136837634D01*
X164180662Y-136780931D01*
X164162858Y-136749943D01*
X164161593Y-136748457D01*
X164150706Y-136739601D01*
X164132318Y-136730843D01*
X164102394Y-136721277D01*
X164056897Y-136709996D01*
X163991791Y-136696093D01*
X163903039Y-136678663D01*
X163786607Y-136656798D01*
X163638458Y-136629591D01*
X163606382Y-136623741D01*
X163511314Y-136605374D01*
X163428435Y-136587405D01*
X163365070Y-136571569D01*
X163328542Y-136559600D01*
X163323644Y-136556810D01*
X163315573Y-136532072D01*
X163309013Y-136476790D01*
X163303967Y-136397389D01*
X163300441Y-136300296D01*
X163298439Y-136191938D01*
X163297964Y-136078740D01*
X163299023Y-135967128D01*
X163301618Y-135863529D01*
X163305754Y-135774368D01*
X163311437Y-135706072D01*
X163318669Y-135665066D01*
X163323029Y-135656674D01*
X163347302Y-135648208D01*
X163402574Y-135634435D01*
X163483338Y-135616550D01*
X163584088Y-135595748D01*
X163699317Y-135573223D01*
X163762098Y-135561418D01*
X163881213Y-135539151D01*
X163987435Y-135518979D01*
X164075573Y-135501915D01*
X164140434Y-135488969D01*
X164176826Y-135481155D01*
X164182816Y-135479422D01*
X164192939Y-135459890D01*
X164214338Y-135412843D01*
X164244161Y-135345003D01*
X164279555Y-135263091D01*
X164317668Y-135173828D01*
X164355647Y-135083935D01*
X164390640Y-135000135D01*
X164419794Y-134929147D01*
X164440257Y-134877694D01*
X164449177Y-134852497D01*
X164449343Y-134851396D01*
X164439231Y-134831519D01*
X164410883Y-134785777D01*
X164367277Y-134718717D01*
X164311394Y-134634884D01*
X164246213Y-134538826D01*
X164208321Y-134483650D01*
X164139275Y-134382481D01*
X164077950Y-134290630D01*
X164027337Y-134212744D01*
X163990429Y-134153469D01*
X163970218Y-134117451D01*
X163967299Y-134109377D01*
X163979847Y-134090584D01*
X164014537Y-134050457D01*
X164066937Y-133993493D01*
X164132616Y-133924185D01*
X164207144Y-133847031D01*
X164286087Y-133766525D01*
X164365017Y-133687163D01*
X164439500Y-133613440D01*
X164505106Y-133549852D01*
X164557404Y-133500894D01*
X164591961Y-133471061D01*
X164603522Y-133463942D01*
X164622346Y-133473953D01*
X164667369Y-133502078D01*
X164734213Y-133545454D01*
X164818501Y-133601218D01*
X164915856Y-133666506D01*
X164989293Y-133716246D01*
X165360333Y-133968551D01*
X165978905Y-133713555D01*
X166062725Y-133268931D01*
X166146546Y-132824307D01*
X167071994Y-132824307D01*
X167155814Y-133268931D01*
G37*
X167155814Y-133268931D02*
X167239635Y-133713555D01*
X167548920Y-133841053D01*
X167858206Y-133968551D01*
X168229246Y-133716246D01*
X168333157Y-133645996D01*
X168427087Y-133583272D01*
X168506652Y-133530938D01*
X168567470Y-133491857D01*
X168605157Y-133468893D01*
X168615421Y-133463942D01*
X168633910Y-133476676D01*
X168673420Y-133511882D01*
X168729522Y-133565062D01*
X168797787Y-133631718D01*
X168873786Y-133707354D01*
X168953092Y-133787472D01*
X169031275Y-133867574D01*
X169103907Y-133943164D01*
X169166559Y-134009745D01*
X169214803Y-134062818D01*
X169244210Y-134097887D01*
X169251241Y-134109623D01*
X169241123Y-134131260D01*
X169212759Y-134178662D01*
X169169129Y-134247193D01*
X169113218Y-134332215D01*
X169048006Y-134429093D01*
X169010219Y-134484350D01*
X168941343Y-134585248D01*
X168880140Y-134676299D01*
X168829578Y-134752970D01*
X168792628Y-134810728D01*
X168772258Y-134845043D01*
X168769197Y-134852254D01*
X168776136Y-134872748D01*
X168795051Y-134920513D01*
X168823087Y-134988832D01*
X168857391Y-135070989D01*
X168895109Y-135160270D01*
X168933387Y-135249958D01*
X168969370Y-135333338D01*
X169000206Y-135403694D01*
X169023039Y-135454310D01*
X169035017Y-135478471D01*
X169035724Y-135479422D01*
X169054531Y-135484036D01*
X169104618Y-135494328D01*
X169180793Y-135509287D01*
X169277865Y-135527901D01*
X169390643Y-135549159D01*
X169456442Y-135561418D01*
X169576950Y-135584362D01*
X169685797Y-135606195D01*
X169777476Y-135625722D01*
X169846481Y-135641748D01*
X169887304Y-135653079D01*
X169895511Y-135656674D01*
X169903548Y-135681006D01*
X169910033Y-135735959D01*
X169914970Y-135815108D01*
X169918364Y-135912026D01*
X169920218Y-136020287D01*
X169920538Y-136133465D01*
X169919327Y-136245135D01*
X169916590Y-136348868D01*
X169912331Y-136438241D01*
X169906555Y-136506826D01*
X169899267Y-136548197D01*
X169894895Y-136556810D01*
X169868764Y-136567133D01*
X169813393Y-136581892D01*
X169736107Y-136599352D01*
X169644230Y-136617780D01*
X169612158Y-136623741D01*
X169457524Y-136652066D01*
X169335375Y-136674876D01*
X169241673Y-136693080D01*
X169172384Y-136707583D01*
X169123471Y-136719292D01*
X169090897Y-136729115D01*
X169070628Y-136737956D01*
X169058626Y-136746724D01*
X169056947Y-136748457D01*
X169040184Y-136776371D01*
X169014614Y-136830695D01*
X168982788Y-136904777D01*
X168947260Y-136991965D01*
X168910583Y-137085608D01*
X168875311Y-137179052D01*
X168843996Y-137265647D01*
X168819193Y-137338740D01*
X168803454Y-137391678D01*
X168799332Y-137417811D01*
X168799676Y-137418726D01*
X168813641Y-137440086D01*
X168845322Y-137487084D01*
X168891391Y-137554827D01*
X168948518Y-137638423D01*
X169013373Y-137732982D01*
X169031843Y-137759854D01*
X169097699Y-137857275D01*
X169155650Y-137946163D01*
X169202538Y-138021412D01*
X169235207Y-138077920D01*
X169250500Y-138110581D01*
X169251241Y-138114593D01*
X169238392Y-138135684D01*
X169202888Y-138177464D01*
X169149293Y-138235445D01*
X169082171Y-138305135D01*
X169006087Y-138382045D01*
X168925604Y-138461683D01*
X168845287Y-138539561D01*
X168769699Y-138611186D01*
X168703405Y-138672070D01*
X168650969Y-138717721D01*
X168616955Y-138743650D01*
X168607545Y-138747883D01*
X168585643Y-138737912D01*
X168540800Y-138711020D01*
X168480321Y-138671736D01*
X168433789Y-138640117D01*
X168349475Y-138582098D01*
X168249626Y-138513784D01*
X168149473Y-138445579D01*
X168095627Y-138409075D01*
X167913371Y-138285800D01*
X167760381Y-138368520D01*
X167690682Y-138404759D01*
X167631414Y-138432926D01*
X167591311Y-138448991D01*
X167581103Y-138451226D01*
X167568829Y-138434722D01*
X167544613Y-138388082D01*
X167510263Y-138315609D01*
X167467588Y-138221606D01*
X167418394Y-138110374D01*
X167364490Y-137986215D01*
X167307684Y-137853432D01*
X167249782Y-137716327D01*
X167192593Y-137579202D01*
X167137924Y-137446358D01*
X167087584Y-137322098D01*
X167043380Y-137210725D01*
X167007119Y-137116539D01*
X166980609Y-137043844D01*
X166965658Y-136996941D01*
X166963254Y-136980833D01*
X166982311Y-136960286D01*
X167024036Y-136926933D01*
X167079706Y-136887702D01*
X167084378Y-136884599D01*
X167228264Y-136769423D01*
X167344283Y-136635053D01*
X167431430Y-136485784D01*
X167488699Y-136325913D01*
X167515086Y-136159737D01*
X167509585Y-135991552D01*
X167471190Y-135825655D01*
X167398895Y-135666342D01*
X167377626Y-135631487D01*
X167266996Y-135490737D01*
X167136302Y-135377714D01*
X166990064Y-135293003D01*
X166832808Y-135237194D01*
X166669057Y-135210874D01*
X166503333Y-135214630D01*
X166340162Y-135249050D01*
X166184065Y-135314723D01*
X166039567Y-135412235D01*
X165994869Y-135451813D01*
X165881112Y-135575703D01*
X165798218Y-135706124D01*
X165741356Y-135852315D01*
X165709687Y-135997088D01*
X165701869Y-136159860D01*
X165727938Y-136323440D01*
X165785245Y-136482298D01*
X165871144Y-136630906D01*
X165982986Y-136763735D01*
X166118123Y-136875256D01*
X166135883Y-136887011D01*
X166192150Y-136925508D01*
X166234923Y-136958863D01*
X166255372Y-136980160D01*
X166255669Y-136980833D01*
X166251279Y-137003871D01*
X166233876Y-137056157D01*
X166205268Y-137133390D01*
X166167265Y-137231268D01*
X166121674Y-137345491D01*
X166070303Y-137471758D01*
X166014962Y-137605767D01*
X165957458Y-137743218D01*
X165899601Y-137879808D01*
X165843198Y-138011237D01*
X165790058Y-138133205D01*
X165741990Y-138241409D01*
X165700801Y-138331549D01*
X165668301Y-138399323D01*
X165646297Y-138440430D01*
X165637436Y-138451226D01*
X165610360Y-138442819D01*
X165559697Y-138420272D01*
X165494183Y-138387613D01*
X165458159Y-138368520D01*
X165305168Y-138285800D01*
X165122912Y-138409075D01*
X165029875Y-138472228D01*
X164928015Y-138541727D01*
X164832562Y-138607165D01*
X164784750Y-138640117D01*
X164717505Y-138685273D01*
X164660564Y-138721057D01*
X164621354Y-138742938D01*
X164608619Y-138747563D01*
X164590083Y-138735085D01*
X164549059Y-138700252D01*
X164489525Y-138646678D01*
X164415458Y-138577983D01*
X164330835Y-138497781D01*
X164277315Y-138446286D01*
X164183681Y-138354286D01*
X164102759Y-138271999D01*
X164037823Y-138202945D01*
X163992142Y-138150644D01*
X163968989Y-138118616D01*
X163966768Y-138112116D01*
X163977076Y-138087394D01*
X164005561Y-138037405D01*
X164049063Y-137967212D01*
X164104423Y-137881875D01*
X164168480Y-137786456D01*
X164186697Y-137759854D01*
X164253073Y-137663167D01*
X164312622Y-137576117D01*
X164362016Y-137503595D01*
X164397925Y-137450493D01*
X164417019Y-137421703D01*
X164418864Y-137418726D01*
X164416105Y-137395782D01*
X164401462Y-137345336D01*
X164377487Y-137274041D01*
X164346734Y-137188547D01*
X164311756Y-137095507D01*
X164275107Y-137001574D01*
X164239339Y-136913399D01*
X164207006Y-136837634D01*
X164180662Y-136780931D01*
X164162858Y-136749943D01*
X164161593Y-136748457D01*
X164150706Y-136739601D01*
X164132318Y-136730843D01*
X164102394Y-136721277D01*
X164056897Y-136709996D01*
X163991791Y-136696093D01*
X163903039Y-136678663D01*
X163786607Y-136656798D01*
X163638458Y-136629591D01*
X163606382Y-136623741D01*
X163511314Y-136605374D01*
X163428435Y-136587405D01*
X163365070Y-136571569D01*
X163328542Y-136559600D01*
X163323644Y-136556810D01*
X163315573Y-136532072D01*
X163309013Y-136476790D01*
X163303967Y-136397389D01*
X163300441Y-136300296D01*
X163298439Y-136191938D01*
X163297964Y-136078740D01*
X163299023Y-135967128D01*
X163301618Y-135863529D01*
X163305754Y-135774368D01*
X163311437Y-135706072D01*
X163318669Y-135665066D01*
X163323029Y-135656674D01*
X163347302Y-135648208D01*
X163402574Y-135634435D01*
X163483338Y-135616550D01*
X163584088Y-135595748D01*
X163699317Y-135573223D01*
X163762098Y-135561418D01*
X163881213Y-135539151D01*
X163987435Y-135518979D01*
X164075573Y-135501915D01*
X164140434Y-135488969D01*
X164176826Y-135481155D01*
X164182816Y-135479422D01*
X164192939Y-135459890D01*
X164214338Y-135412843D01*
X164244161Y-135345003D01*
X164279555Y-135263091D01*
X164317668Y-135173828D01*
X164355647Y-135083935D01*
X164390640Y-135000135D01*
X164419794Y-134929147D01*
X164440257Y-134877694D01*
X164449177Y-134852497D01*
X164449343Y-134851396D01*
X164439231Y-134831519D01*
X164410883Y-134785777D01*
X164367277Y-134718717D01*
X164311394Y-134634884D01*
X164246213Y-134538826D01*
X164208321Y-134483650D01*
X164139275Y-134382481D01*
X164077950Y-134290630D01*
X164027337Y-134212744D01*
X163990429Y-134153469D01*
X163970218Y-134117451D01*
X163967299Y-134109377D01*
X163979847Y-134090584D01*
X164014537Y-134050457D01*
X164066937Y-133993493D01*
X164132616Y-133924185D01*
X164207144Y-133847031D01*
X164286087Y-133766525D01*
X164365017Y-133687163D01*
X164439500Y-133613440D01*
X164505106Y-133549852D01*
X164557404Y-133500894D01*
X164591961Y-133471061D01*
X164603522Y-133463942D01*
X164622346Y-133473953D01*
X164667369Y-133502078D01*
X164734213Y-133545454D01*
X164818501Y-133601218D01*
X164915856Y-133666506D01*
X164989293Y-133716246D01*
X165360333Y-133968551D01*
X165978905Y-133713555D01*
X166062725Y-133268931D01*
X166146546Y-132824307D01*
X167071994Y-132824307D01*
X167155814Y-133268931D01*
D11*
%TO.C,A1*%
X136270000Y-101270000D02*
X136270000Y-98730000D01*
X136270000Y-98730000D02*
X133600000Y-98730000D01*
X133600000Y-101270000D02*
X133600000Y-139500000D01*
X133600000Y-96060000D02*
X133600000Y-98730000D01*
X148970000Y-98730000D02*
X151640000Y-98730000D01*
X148970000Y-98730000D02*
X148970000Y-136830000D01*
X148970000Y-136830000D02*
X151640000Y-136830000D01*
X136270000Y-101270000D02*
X133600000Y-101270000D01*
X136270000Y-101270000D02*
X136270000Y-136830000D01*
X136270000Y-136830000D02*
X133600000Y-136830000D01*
X133600000Y-139500000D02*
X151640000Y-139500000D01*
X151640000Y-139500000D02*
X151640000Y-96060000D01*
X151640000Y-96060000D02*
X133600000Y-96060000D01*
%TO.C,J1*%
X129600000Y-77470000D02*
X130710000Y-77470000D01*
X130710000Y-77470000D02*
X130710000Y-78800000D01*
X119510000Y-77470000D02*
X119510000Y-102990000D01*
X119510000Y-102990000D02*
X128140000Y-102990000D01*
X128140000Y-77470000D02*
X128140000Y-102990000D01*
X119510000Y-77470000D02*
X128140000Y-77470000D01*
X119510000Y-100390000D02*
X128140000Y-100390000D01*
X119510000Y-97850000D02*
X128140000Y-97850000D01*
X119510000Y-95310000D02*
X128140000Y-95310000D01*
X119510000Y-92770000D02*
X128140000Y-92770000D01*
X119510000Y-90230000D02*
X128140000Y-90230000D01*
X119510000Y-87690000D02*
X128140000Y-87690000D01*
X119510000Y-85150000D02*
X128140000Y-85150000D01*
X119510000Y-82610000D02*
X128140000Y-82610000D01*
X119510000Y-80070000D02*
X128140000Y-80070000D01*
X128140000Y-102020000D02*
X128550000Y-102020000D01*
X128140000Y-101300000D02*
X128550000Y-101300000D01*
X128140000Y-99480000D02*
X128550000Y-99480000D01*
X128140000Y-98760000D02*
X128550000Y-98760000D01*
X128140000Y-96940000D02*
X128550000Y-96940000D01*
X128140000Y-96220000D02*
X128550000Y-96220000D01*
X128140000Y-94400000D02*
X128550000Y-94400000D01*
X128140000Y-93680000D02*
X128550000Y-93680000D01*
X128140000Y-91860000D02*
X128550000Y-91860000D01*
X128140000Y-91140000D02*
X128550000Y-91140000D01*
X128140000Y-89320000D02*
X128550000Y-89320000D01*
X128140000Y-88600000D02*
X128550000Y-88600000D01*
X128140000Y-86780000D02*
X128550000Y-86780000D01*
X128140000Y-86060000D02*
X128550000Y-86060000D01*
X128140000Y-84240000D02*
X128550000Y-84240000D01*
X128140000Y-83520000D02*
X128550000Y-83520000D01*
X128140000Y-81700000D02*
X128550000Y-81700000D01*
X128140000Y-80980000D02*
X128550000Y-80980000D01*
X128140000Y-79160000D02*
X128490000Y-79160000D01*
X128140000Y-78440000D02*
X128490000Y-78440000D01*
X119510000Y-79951900D02*
X128140000Y-79951900D01*
X119510000Y-79833805D02*
X128140000Y-79833805D01*
X119510000Y-79715710D02*
X128140000Y-79715710D01*
X119510000Y-79597615D02*
X128140000Y-79597615D01*
X119510000Y-79479520D02*
X128140000Y-79479520D01*
X119510000Y-79361425D02*
X128140000Y-79361425D01*
X119510000Y-79243330D02*
X128140000Y-79243330D01*
X119510000Y-79125235D02*
X128140000Y-79125235D01*
X119510000Y-79007140D02*
X128140000Y-79007140D01*
X119510000Y-78889045D02*
X128140000Y-78889045D01*
X119510000Y-78770950D02*
X128140000Y-78770950D01*
X119510000Y-78652855D02*
X128140000Y-78652855D01*
X119510000Y-78534760D02*
X128140000Y-78534760D01*
X119510000Y-78416665D02*
X128140000Y-78416665D01*
X119510000Y-78298570D02*
X128140000Y-78298570D01*
X119510000Y-78180475D02*
X128140000Y-78180475D01*
X119510000Y-78062380D02*
X128140000Y-78062380D01*
X119510000Y-77944285D02*
X128140000Y-77944285D01*
X119510000Y-77826190D02*
X128140000Y-77826190D01*
X119510000Y-77708095D02*
X128140000Y-77708095D01*
X119510000Y-77590000D02*
X128140000Y-77590000D01*
%TO.C,Q2*%
D10*
X140467619Y-70045238D02*
X140420000Y-70140476D01*
X140324761Y-70235714D01*
X140181904Y-70378571D01*
X140134285Y-70473809D01*
X140134285Y-70569047D01*
X140372380Y-70521428D02*
X140324761Y-70616666D01*
X140229523Y-70711904D01*
X140039047Y-70759523D01*
X139705714Y-70759523D01*
X139515238Y-70711904D01*
X139420000Y-70616666D01*
X139372380Y-70521428D01*
X139372380Y-70330952D01*
X139420000Y-70235714D01*
X139515238Y-70140476D01*
X139705714Y-70092857D01*
X140039047Y-70092857D01*
X140229523Y-70140476D01*
X140324761Y-70235714D01*
X140372380Y-70330952D01*
X140372380Y-70521428D01*
X139467619Y-69711904D02*
X139420000Y-69664285D01*
X139372380Y-69569047D01*
X139372380Y-69330952D01*
X139420000Y-69235714D01*
X139467619Y-69188095D01*
X139562857Y-69140476D01*
X139658095Y-69140476D01*
X139800952Y-69188095D01*
X140372380Y-69759523D01*
X140372380Y-69140476D01*
%TO.C,Q1*%
X140467619Y-82745238D02*
X140420000Y-82840476D01*
X140324761Y-82935714D01*
X140181904Y-83078571D01*
X140134285Y-83173809D01*
X140134285Y-83269047D01*
X140372380Y-83221428D02*
X140324761Y-83316666D01*
X140229523Y-83411904D01*
X140039047Y-83459523D01*
X139705714Y-83459523D01*
X139515238Y-83411904D01*
X139420000Y-83316666D01*
X139372380Y-83221428D01*
X139372380Y-83030952D01*
X139420000Y-82935714D01*
X139515238Y-82840476D01*
X139705714Y-82792857D01*
X140039047Y-82792857D01*
X140229523Y-82840476D01*
X140324761Y-82935714D01*
X140372380Y-83030952D01*
X140372380Y-83221428D01*
X140372380Y-81840476D02*
X140372380Y-82411904D01*
X140372380Y-82126190D02*
X139372380Y-82126190D01*
X139515238Y-82221428D01*
X139610476Y-82316666D01*
X139658095Y-82411904D01*
%TO.C,J4*%
X177932380Y-96953333D02*
X178646666Y-96953333D01*
X178789523Y-97000952D01*
X178884761Y-97096190D01*
X178932380Y-97239047D01*
X178932380Y-97334285D01*
X178265714Y-96048571D02*
X178932380Y-96048571D01*
X177884761Y-96286666D02*
X178599047Y-96524761D01*
X178599047Y-95905714D01*
%TO.C,J3*%
X185552380Y-51233333D02*
X186266666Y-51233333D01*
X186409523Y-51280952D01*
X186504761Y-51376190D01*
X186552380Y-51519047D01*
X186552380Y-51614285D01*
X185552380Y-50852380D02*
X185552380Y-50233333D01*
X185933333Y-50566666D01*
X185933333Y-50423809D01*
X185980952Y-50328571D01*
X186028571Y-50280952D01*
X186123809Y-50233333D01*
X186361904Y-50233333D01*
X186457142Y-50280952D01*
X186504761Y-50328571D01*
X186552380Y-50423809D01*
X186552380Y-50709523D01*
X186504761Y-50804761D01*
X186457142Y-50852380D01*
%TO.C,J2*%
X178382380Y-79133333D02*
X179096666Y-79133333D01*
X179239523Y-79180952D01*
X179334761Y-79276190D01*
X179382380Y-79419047D01*
X179382380Y-79514285D01*
X178477619Y-78704761D02*
X178430000Y-78657142D01*
X178382380Y-78561904D01*
X178382380Y-78323809D01*
X178430000Y-78228571D01*
X178477619Y-78180952D01*
X178572857Y-78133333D01*
X178668095Y-78133333D01*
X178810952Y-78180952D01*
X179382380Y-78752380D01*
X179382380Y-78133333D01*
%TO.C,A1*%
X141905714Y-95086666D02*
X142381904Y-95086666D01*
X141810476Y-95372380D02*
X142143809Y-94372380D01*
X142477142Y-95372380D01*
X143334285Y-95372380D02*
X142762857Y-95372380D01*
X143048571Y-95372380D02*
X143048571Y-94372380D01*
X142953333Y-94515238D01*
X142858095Y-94610476D01*
X142762857Y-94658095D01*
%TO.C,J1*%
X124886666Y-75482380D02*
X124886666Y-76196666D01*
X124839047Y-76339523D01*
X124743809Y-76434761D01*
X124600952Y-76482380D01*
X124505714Y-76482380D01*
X125886666Y-76482380D02*
X125315238Y-76482380D01*
X125600952Y-76482380D02*
X125600952Y-75482380D01*
X125505714Y-75625238D01*
X125410476Y-75720476D01*
X125315238Y-75768095D01*
%TD*%
M02*
