%TF.GenerationSoftware,KiCad,Pcbnew,5.1.10*%
%TF.CreationDate,2021-10-26T18:06:13-04:00*%
%TF.ProjectId,BREAD_Slice,42524541-445f-4536-9c69-63652e6b6963,rev?*%
%TF.SameCoordinates,Original*%
%TF.FileFunction,Soldermask,Top*%
%TF.FilePolarity,Negative*%
%FSLAX46Y46*%
G04 Gerber Fmt 4.6, Leading zero omitted, Abs format (unit mm)*
G04 Created by KiCad (PCBNEW 5.1.10) date 2021-10-26 18:06:13*
%MOMM*%
%LPD*%
G01*
G04 APERTURE LIST*
%ADD10O,2.100000X2.005000*%
%ADD11C,2.600000*%
%ADD12C,5.700000*%
%ADD13O,1.700000X1.700000*%
%ADD14O,1.800000X1.800000*%
G04 APERTURE END LIST*
D10*
%TO.C,Q2*%
X144190000Y-67410000D03*
X144190000Y-69950000D03*
G36*
G01*
X145190000Y-73492500D02*
X143190000Y-73492500D01*
G75*
G02*
X143140000Y-73442500I0J50000D01*
G01*
X143140000Y-71537500D01*
G75*
G02*
X143190000Y-71487500I50000J0D01*
G01*
X145190000Y-71487500D01*
G75*
G02*
X145240000Y-71537500I0J-50000D01*
G01*
X145240000Y-73442500D01*
G75*
G02*
X145190000Y-73492500I-50000J0D01*
G01*
G37*
%TD*%
%TO.C,Q1*%
X144190000Y-80110000D03*
X144190000Y-82650000D03*
G36*
G01*
X145190000Y-86192500D02*
X143190000Y-86192500D01*
G75*
G02*
X143140000Y-86142500I0J50000D01*
G01*
X143140000Y-84237500D01*
G75*
G02*
X143190000Y-84187500I50000J0D01*
G01*
X145190000Y-84187500D01*
G75*
G02*
X145240000Y-84237500I0J-50000D01*
G01*
X145240000Y-86142500D01*
G75*
G02*
X145190000Y-86192500I-50000J0D01*
G01*
G37*
%TD*%
D11*
%TO.C,J4*%
X184830000Y-95430000D03*
G36*
G01*
X186080000Y-101730000D02*
X183580000Y-101730000D01*
G75*
G02*
X183530000Y-101680000I0J50000D01*
G01*
X183530000Y-99180000D01*
G75*
G02*
X183580000Y-99130000I50000J0D01*
G01*
X186080000Y-99130000D01*
G75*
G02*
X186130000Y-99180000I0J-50000D01*
G01*
X186130000Y-101680000D01*
G75*
G02*
X186080000Y-101730000I-50000J0D01*
G01*
G37*
%TD*%
%TO.C,J3*%
X184830000Y-57330000D03*
G36*
G01*
X186080000Y-63630000D02*
X183580000Y-63630000D01*
G75*
G02*
X183530000Y-63580000I0J50000D01*
G01*
X183530000Y-61080000D01*
G75*
G02*
X183580000Y-61030000I50000J0D01*
G01*
X186080000Y-61030000D01*
G75*
G02*
X186130000Y-61080000I0J-50000D01*
G01*
X186130000Y-63580000D01*
G75*
G02*
X186080000Y-63630000I-50000J0D01*
G01*
G37*
%TD*%
%TO.C,J2*%
X184830000Y-81300000D03*
G36*
G01*
X183580000Y-75000000D02*
X186080000Y-75000000D01*
G75*
G02*
X186130000Y-75050000I0J-50000D01*
G01*
X186130000Y-77550000D01*
G75*
G02*
X186080000Y-77600000I-50000J0D01*
G01*
X183580000Y-77600000D01*
G75*
G02*
X183530000Y-77550000I0J50000D01*
G01*
X183530000Y-75050000D01*
G75*
G02*
X183580000Y-75000000I50000J0D01*
G01*
G37*
%TD*%
D12*
%TO.C,H4*%
X187600000Y-134800000D03*
%TD*%
%TO.C,H3*%
X127600000Y-134800000D03*
%TD*%
%TO.C,H2*%
X187600000Y-44800000D03*
%TD*%
%TO.C,H1*%
X127600000Y-44800000D03*
%TD*%
%TO.C,A1*%
G36*
G01*
X134150000Y-100800000D02*
X134150000Y-99200000D01*
G75*
G02*
X134200000Y-99150000I50000J0D01*
G01*
X135800000Y-99150000D01*
G75*
G02*
X135850000Y-99200000I0J-50000D01*
G01*
X135850000Y-100800000D01*
G75*
G02*
X135800000Y-100850000I-50000J0D01*
G01*
X134200000Y-100850000D01*
G75*
G02*
X134150000Y-100800000I0J50000D01*
G01*
G37*
D13*
X150240000Y-133020000D03*
X135000000Y-102540000D03*
X150240000Y-130480000D03*
X135000000Y-105080000D03*
X150240000Y-127940000D03*
X135000000Y-107620000D03*
X150240000Y-125400000D03*
X135000000Y-110160000D03*
X150240000Y-122860000D03*
X135000000Y-112700000D03*
X150240000Y-120320000D03*
X135000000Y-115240000D03*
X150240000Y-117780000D03*
X135000000Y-117780000D03*
X150240000Y-115240000D03*
X135000000Y-120320000D03*
X150240000Y-112700000D03*
X135000000Y-122860000D03*
X150240000Y-110160000D03*
X135000000Y-125400000D03*
X150240000Y-107620000D03*
X135000000Y-127940000D03*
X150240000Y-105080000D03*
X135000000Y-130480000D03*
X150240000Y-102540000D03*
X135000000Y-133020000D03*
X150240000Y-100000000D03*
X135000000Y-135560000D03*
X150240000Y-135560000D03*
%TD*%
%TO.C,J1*%
G36*
G01*
X128700000Y-79650000D02*
X128700000Y-77950000D01*
G75*
G02*
X128750000Y-77900000I50000J0D01*
G01*
X130450000Y-77900000D01*
G75*
G02*
X130500000Y-77950000I0J-50000D01*
G01*
X130500000Y-79650000D01*
G75*
G02*
X130450000Y-79700000I-50000J0D01*
G01*
X128750000Y-79700000D01*
G75*
G02*
X128700000Y-79650000I0J50000D01*
G01*
G37*
D14*
X129600000Y-81340000D03*
X129600000Y-83880000D03*
X129600000Y-86420000D03*
X129600000Y-88960000D03*
X129600000Y-91500000D03*
X129600000Y-94040000D03*
X129600000Y-96580000D03*
X129600000Y-99120000D03*
X129600000Y-101660000D03*
%TD*%
M02*
