%TF.GenerationSoftware,KiCad,Pcbnew,5.1.10*%
%TF.CreationDate,2021-10-26T18:06:13-04:00*%
%TF.ProjectId,BREAD_Slice,42524541-445f-4536-9c69-63652e6b6963,rev?*%
%TF.SameCoordinates,Original*%
%TF.FileFunction,Legend,Bot*%
%TF.FilePolarity,Positive*%
%FSLAX46Y46*%
G04 Gerber Fmt 4.6, Leading zero omitted, Abs format (unit mm)*
G04 Created by KiCad (PCBNEW 5.1.10) date 2021-10-26 18:06:13*
%MOMM*%
%LPD*%
G01*
G04 APERTURE LIST*
%ADD10C,0.120000*%
%ADD11C,0.150000*%
G04 APERTURE END LIST*
D10*
%TO.C,U1*%
X159430000Y-76280000D02*
X162880000Y-76280000D01*
X159430000Y-76280000D02*
X157480000Y-76280000D01*
X159430000Y-81400000D02*
X161380000Y-81400000D01*
X159430000Y-81400000D02*
X157480000Y-81400000D01*
D11*
%TO.C,R3*%
X160430000Y-82845000D02*
X158430000Y-82845000D01*
X158430000Y-84995000D02*
X160430000Y-84995000D01*
%TO.C,R2*%
X158430000Y-92615000D02*
X160430000Y-92615000D01*
X160430000Y-90465000D02*
X158430000Y-90465000D01*
%TO.C,R1*%
X173670000Y-101505000D02*
X175670000Y-101505000D01*
X175670000Y-99355000D02*
X173670000Y-99355000D01*
%TO.C,FB2*%
X174940000Y-77375000D02*
X176940000Y-77375000D01*
X176940000Y-75225000D02*
X174940000Y-75225000D01*
%TO.C,FB1*%
X174940000Y-82455000D02*
X176940000Y-82455000D01*
X176940000Y-80305000D02*
X174940000Y-80305000D01*
%TO.C,C3*%
X168565000Y-79840000D02*
X168565000Y-77840000D01*
X170615000Y-77840000D02*
X170615000Y-79840000D01*
%TO.C,C1*%
X158570000Y-97930000D02*
X156560000Y-97930000D01*
X158600000Y-100070000D02*
X156590000Y-100070000D01*
%TO.C,C2*%
X158600000Y-108870000D02*
X156590000Y-108870000D01*
X158570000Y-106730000D02*
X156560000Y-106730000D01*
%TO.C,U1*%
X160191904Y-74892380D02*
X160191904Y-75701904D01*
X160144285Y-75797142D01*
X160096666Y-75844761D01*
X160001428Y-75892380D01*
X159810952Y-75892380D01*
X159715714Y-75844761D01*
X159668095Y-75797142D01*
X159620476Y-75701904D01*
X159620476Y-74892380D01*
X158620476Y-75892380D02*
X159191904Y-75892380D01*
X158906190Y-75892380D02*
X158906190Y-74892380D01*
X159001428Y-75035238D01*
X159096666Y-75130476D01*
X159191904Y-75178095D01*
%TO.C,R3*%
X159596666Y-86912380D02*
X159930000Y-86436190D01*
X160168095Y-86912380D02*
X160168095Y-85912380D01*
X159787142Y-85912380D01*
X159691904Y-85960000D01*
X159644285Y-86007619D01*
X159596666Y-86102857D01*
X159596666Y-86245714D01*
X159644285Y-86340952D01*
X159691904Y-86388571D01*
X159787142Y-86436190D01*
X160168095Y-86436190D01*
X159263333Y-85912380D02*
X158644285Y-85912380D01*
X158977619Y-86293333D01*
X158834761Y-86293333D01*
X158739523Y-86340952D01*
X158691904Y-86388571D01*
X158644285Y-86483809D01*
X158644285Y-86721904D01*
X158691904Y-86817142D01*
X158739523Y-86864761D01*
X158834761Y-86912380D01*
X159120476Y-86912380D01*
X159215714Y-86864761D01*
X159263333Y-86817142D01*
%TO.C,R2*%
X159596666Y-89452380D02*
X159930000Y-88976190D01*
X160168095Y-89452380D02*
X160168095Y-88452380D01*
X159787142Y-88452380D01*
X159691904Y-88500000D01*
X159644285Y-88547619D01*
X159596666Y-88642857D01*
X159596666Y-88785714D01*
X159644285Y-88880952D01*
X159691904Y-88928571D01*
X159787142Y-88976190D01*
X160168095Y-88976190D01*
X159215714Y-88547619D02*
X159168095Y-88500000D01*
X159072857Y-88452380D01*
X158834761Y-88452380D01*
X158739523Y-88500000D01*
X158691904Y-88547619D01*
X158644285Y-88642857D01*
X158644285Y-88738095D01*
X158691904Y-88880952D01*
X159263333Y-89452380D01*
X158644285Y-89452380D01*
%TO.C,R1*%
X174836666Y-103182380D02*
X175170000Y-102706190D01*
X175408095Y-103182380D02*
X175408095Y-102182380D01*
X175027142Y-102182380D01*
X174931904Y-102230000D01*
X174884285Y-102277619D01*
X174836666Y-102372857D01*
X174836666Y-102515714D01*
X174884285Y-102610952D01*
X174931904Y-102658571D01*
X175027142Y-102706190D01*
X175408095Y-102706190D01*
X173884285Y-103182380D02*
X174455714Y-103182380D01*
X174170000Y-103182380D02*
X174170000Y-102182380D01*
X174265238Y-102325238D01*
X174360476Y-102420476D01*
X174455714Y-102468095D01*
%TO.C,FB2*%
X176773333Y-78528571D02*
X177106666Y-78528571D01*
X177106666Y-79052380D02*
X177106666Y-78052380D01*
X176630476Y-78052380D01*
X175916190Y-78528571D02*
X175773333Y-78576190D01*
X175725714Y-78623809D01*
X175678095Y-78719047D01*
X175678095Y-78861904D01*
X175725714Y-78957142D01*
X175773333Y-79004761D01*
X175868571Y-79052380D01*
X176249523Y-79052380D01*
X176249523Y-78052380D01*
X175916190Y-78052380D01*
X175820952Y-78100000D01*
X175773333Y-78147619D01*
X175725714Y-78242857D01*
X175725714Y-78338095D01*
X175773333Y-78433333D01*
X175820952Y-78480952D01*
X175916190Y-78528571D01*
X176249523Y-78528571D01*
X175297142Y-78147619D02*
X175249523Y-78100000D01*
X175154285Y-78052380D01*
X174916190Y-78052380D01*
X174820952Y-78100000D01*
X174773333Y-78147619D01*
X174725714Y-78242857D01*
X174725714Y-78338095D01*
X174773333Y-78480952D01*
X175344761Y-79052380D01*
X174725714Y-79052380D01*
%TO.C,FB1*%
X176773333Y-83608571D02*
X177106666Y-83608571D01*
X177106666Y-84132380D02*
X177106666Y-83132380D01*
X176630476Y-83132380D01*
X175916190Y-83608571D02*
X175773333Y-83656190D01*
X175725714Y-83703809D01*
X175678095Y-83799047D01*
X175678095Y-83941904D01*
X175725714Y-84037142D01*
X175773333Y-84084761D01*
X175868571Y-84132380D01*
X176249523Y-84132380D01*
X176249523Y-83132380D01*
X175916190Y-83132380D01*
X175820952Y-83180000D01*
X175773333Y-83227619D01*
X175725714Y-83322857D01*
X175725714Y-83418095D01*
X175773333Y-83513333D01*
X175820952Y-83560952D01*
X175916190Y-83608571D01*
X176249523Y-83608571D01*
X174725714Y-84132380D02*
X175297142Y-84132380D01*
X175011428Y-84132380D02*
X175011428Y-83132380D01*
X175106666Y-83275238D01*
X175201904Y-83370476D01*
X175297142Y-83418095D01*
%TO.C,C3*%
X172247142Y-78673333D02*
X172294761Y-78625714D01*
X172342380Y-78482857D01*
X172342380Y-78387619D01*
X172294761Y-78244761D01*
X172199523Y-78149523D01*
X172104285Y-78101904D01*
X171913809Y-78054285D01*
X171770952Y-78054285D01*
X171580476Y-78101904D01*
X171485238Y-78149523D01*
X171390000Y-78244761D01*
X171342380Y-78387619D01*
X171342380Y-78482857D01*
X171390000Y-78625714D01*
X171437619Y-78673333D01*
X171342380Y-79006666D02*
X171342380Y-79625714D01*
X171723333Y-79292380D01*
X171723333Y-79435238D01*
X171770952Y-79530476D01*
X171818571Y-79578095D01*
X171913809Y-79625714D01*
X172151904Y-79625714D01*
X172247142Y-79578095D01*
X172294761Y-79530476D01*
X172342380Y-79435238D01*
X172342380Y-79149523D01*
X172294761Y-79054285D01*
X172247142Y-79006666D01*
%TO.C,C1*%
X162766666Y-99357142D02*
X162814285Y-99404761D01*
X162957142Y-99452380D01*
X163052380Y-99452380D01*
X163195238Y-99404761D01*
X163290476Y-99309523D01*
X163338095Y-99214285D01*
X163385714Y-99023809D01*
X163385714Y-98880952D01*
X163338095Y-98690476D01*
X163290476Y-98595238D01*
X163195238Y-98500000D01*
X163052380Y-98452380D01*
X162957142Y-98452380D01*
X162814285Y-98500000D01*
X162766666Y-98547619D01*
X161814285Y-99452380D02*
X162385714Y-99452380D01*
X162100000Y-99452380D02*
X162100000Y-98452380D01*
X162195238Y-98595238D01*
X162290476Y-98690476D01*
X162385714Y-98738095D01*
%TO.C,C2*%
X162766666Y-108157142D02*
X162814285Y-108204761D01*
X162957142Y-108252380D01*
X163052380Y-108252380D01*
X163195238Y-108204761D01*
X163290476Y-108109523D01*
X163338095Y-108014285D01*
X163385714Y-107823809D01*
X163385714Y-107680952D01*
X163338095Y-107490476D01*
X163290476Y-107395238D01*
X163195238Y-107300000D01*
X163052380Y-107252380D01*
X162957142Y-107252380D01*
X162814285Y-107300000D01*
X162766666Y-107347619D01*
X162385714Y-107347619D02*
X162338095Y-107300000D01*
X162242857Y-107252380D01*
X162004761Y-107252380D01*
X161909523Y-107300000D01*
X161861904Y-107347619D01*
X161814285Y-107442857D01*
X161814285Y-107538095D01*
X161861904Y-107680952D01*
X162433333Y-108252380D01*
X161814285Y-108252380D01*
%TD*%
M02*
