%TF.GenerationSoftware,KiCad,Pcbnew,(6.0.4)*%
%TF.CreationDate,2023-07-24T13:42:22-04:00*%
%TF.ProjectId,BREAD_Slice,42524541-445f-4536-9c69-63652e6b6963,rev?*%
%TF.SameCoordinates,PX74eba40PY8552dc0*%
%TF.FileFunction,Legend,Bot*%
%TF.FilePolarity,Positive*%
%FSLAX46Y46*%
G04 Gerber Fmt 4.6, Leading zero omitted, Abs format (unit mm)*
G04 Created by KiCad (PCBNEW (6.0.4)) date 2023-07-24 13:42:22*
%MOMM*%
%LPD*%
G01*
G04 APERTURE LIST*
%ADD10C,0.150000*%
%ADD11C,0.120000*%
G04 APERTURE END LIST*
D10*
%TO.C,C2*%
X40166666Y31642858D02*
X40214285Y31595239D01*
X40357142Y31547620D01*
X40452380Y31547620D01*
X40595238Y31595239D01*
X40690476Y31690477D01*
X40738095Y31785715D01*
X40785714Y31976191D01*
X40785714Y32119048D01*
X40738095Y32309524D01*
X40690476Y32404762D01*
X40595238Y32500000D01*
X40452380Y32547620D01*
X40357142Y32547620D01*
X40214285Y32500000D01*
X40166666Y32452381D01*
X39785714Y32452381D02*
X39738095Y32500000D01*
X39642857Y32547620D01*
X39404761Y32547620D01*
X39309523Y32500000D01*
X39261904Y32452381D01*
X39214285Y32357143D01*
X39214285Y32261905D01*
X39261904Y32119048D01*
X39833333Y31547620D01*
X39214285Y31547620D01*
%TO.C,C1*%
X40166666Y40442858D02*
X40214285Y40395239D01*
X40357142Y40347620D01*
X40452380Y40347620D01*
X40595238Y40395239D01*
X40690476Y40490477D01*
X40738095Y40585715D01*
X40785714Y40776191D01*
X40785714Y40919048D01*
X40738095Y41109524D01*
X40690476Y41204762D01*
X40595238Y41300000D01*
X40452380Y41347620D01*
X40357142Y41347620D01*
X40214285Y41300000D01*
X40166666Y41252381D01*
X39214285Y40347620D02*
X39785714Y40347620D01*
X39500000Y40347620D02*
X39500000Y41347620D01*
X39595238Y41204762D01*
X39690476Y41109524D01*
X39785714Y41061905D01*
%TO.C,C3*%
X15021142Y80176667D02*
X15068761Y80224286D01*
X15116380Y80367143D01*
X15116380Y80462381D01*
X15068761Y80605239D01*
X14973523Y80700477D01*
X14878285Y80748096D01*
X14687809Y80795715D01*
X14544952Y80795715D01*
X14354476Y80748096D01*
X14259238Y80700477D01*
X14164000Y80605239D01*
X14116380Y80462381D01*
X14116380Y80367143D01*
X14164000Y80224286D01*
X14211619Y80176667D01*
X14116380Y79843334D02*
X14116380Y79224286D01*
X14497333Y79557620D01*
X14497333Y79414762D01*
X14544952Y79319524D01*
X14592571Y79271905D01*
X14687809Y79224286D01*
X14925904Y79224286D01*
X15021142Y79271905D01*
X15068761Y79319524D01*
X15116380Y79414762D01*
X15116380Y79700477D01*
X15068761Y79795715D01*
X15021142Y79843334D01*
%TO.C,C4*%
X33313666Y91789858D02*
X33361285Y91742239D01*
X33504142Y91694620D01*
X33599380Y91694620D01*
X33742238Y91742239D01*
X33837476Y91837477D01*
X33885095Y91932715D01*
X33932714Y92123191D01*
X33932714Y92266048D01*
X33885095Y92456524D01*
X33837476Y92551762D01*
X33742238Y92647000D01*
X33599380Y92694620D01*
X33504142Y92694620D01*
X33361285Y92647000D01*
X33313666Y92599381D01*
X32456523Y92361286D02*
X32456523Y91694620D01*
X32694619Y92742239D02*
X32932714Y92027953D01*
X32313666Y92027953D01*
%TO.C,FB1*%
X14392571Y89098334D02*
X14392571Y89431667D01*
X14916380Y89431667D02*
X13916380Y89431667D01*
X13916380Y88955477D01*
X14392571Y88241191D02*
X14440190Y88098334D01*
X14487809Y88050715D01*
X14583047Y88003096D01*
X14725904Y88003096D01*
X14821142Y88050715D01*
X14868761Y88098334D01*
X14916380Y88193572D01*
X14916380Y88574524D01*
X13916380Y88574524D01*
X13916380Y88241191D01*
X13964000Y88145953D01*
X14011619Y88098334D01*
X14106857Y88050715D01*
X14202095Y88050715D01*
X14297333Y88098334D01*
X14344952Y88145953D01*
X14392571Y88241191D01*
X14392571Y88574524D01*
X14916380Y87050715D02*
X14916380Y87622143D01*
X14916380Y87336429D02*
X13916380Y87336429D01*
X14059238Y87431667D01*
X14154476Y87526905D01*
X14202095Y87622143D01*
%TO.C,R1*%
X22899666Y87544620D02*
X23233000Y88020810D01*
X23471095Y87544620D02*
X23471095Y88544620D01*
X23090142Y88544620D01*
X22994904Y88497000D01*
X22947285Y88449381D01*
X22899666Y88354143D01*
X22899666Y88211286D01*
X22947285Y88116048D01*
X22994904Y88068429D01*
X23090142Y88020810D01*
X23471095Y88020810D01*
X21947285Y87544620D02*
X22518714Y87544620D01*
X22233000Y87544620D02*
X22233000Y88544620D01*
X22328238Y88401762D01*
X22423476Y88306524D01*
X22518714Y88258905D01*
%TO.C,U1*%
X62356904Y52557620D02*
X62356904Y51748096D01*
X62309285Y51652858D01*
X62261666Y51605239D01*
X62166428Y51557620D01*
X61975952Y51557620D01*
X61880714Y51605239D01*
X61833095Y51652858D01*
X61785476Y51748096D01*
X61785476Y52557620D01*
X60785476Y51557620D02*
X61356904Y51557620D01*
X61071190Y51557620D02*
X61071190Y52557620D01*
X61166428Y52414762D01*
X61261666Y52319524D01*
X61356904Y52271905D01*
%TO.C,U2*%
X32892904Y74688620D02*
X32892904Y73879096D01*
X32845285Y73783858D01*
X32797666Y73736239D01*
X32702428Y73688620D01*
X32511952Y73688620D01*
X32416714Y73736239D01*
X32369095Y73783858D01*
X32321476Y73879096D01*
X32321476Y74688620D01*
X31892904Y74593381D02*
X31845285Y74641000D01*
X31750047Y74688620D01*
X31511952Y74688620D01*
X31416714Y74641000D01*
X31369095Y74593381D01*
X31321476Y74498143D01*
X31321476Y74402905D01*
X31369095Y74260048D01*
X31940523Y73688620D01*
X31321476Y73688620D01*
%TO.C,C5*%
X23766666Y71992858D02*
X23814285Y71945239D01*
X23957142Y71897620D01*
X24052380Y71897620D01*
X24195238Y71945239D01*
X24290476Y72040477D01*
X24338095Y72135715D01*
X24385714Y72326191D01*
X24385714Y72469048D01*
X24338095Y72659524D01*
X24290476Y72754762D01*
X24195238Y72850000D01*
X24052380Y72897620D01*
X23957142Y72897620D01*
X23814285Y72850000D01*
X23766666Y72802381D01*
X22861904Y72897620D02*
X23338095Y72897620D01*
X23385714Y72421429D01*
X23338095Y72469048D01*
X23242857Y72516667D01*
X23004761Y72516667D01*
X22909523Y72469048D01*
X22861904Y72421429D01*
X22814285Y72326191D01*
X22814285Y72088096D01*
X22861904Y71992858D01*
X22909523Y71945239D01*
X23004761Y71897620D01*
X23242857Y71897620D01*
X23338095Y71945239D01*
X23385714Y71992858D01*
%TO.C,R2*%
X20682380Y76066667D02*
X20206190Y76400000D01*
X20682380Y76638096D02*
X19682380Y76638096D01*
X19682380Y76257143D01*
X19730000Y76161905D01*
X19777619Y76114286D01*
X19872857Y76066667D01*
X20015714Y76066667D01*
X20110952Y76114286D01*
X20158571Y76161905D01*
X20206190Y76257143D01*
X20206190Y76638096D01*
X19777619Y75685715D02*
X19730000Y75638096D01*
X19682380Y75542858D01*
X19682380Y75304762D01*
X19730000Y75209524D01*
X19777619Y75161905D01*
X19872857Y75114286D01*
X19968095Y75114286D01*
X20110952Y75161905D01*
X20682380Y75733334D01*
X20682380Y75114286D01*
%TO.C,C2*%
X35970000Y33070000D02*
X33960000Y33070000D01*
X36000000Y30930000D02*
X33990000Y30930000D01*
%TO.C,C1*%
X35970000Y41870000D02*
X33960000Y41870000D01*
X36000000Y39730000D02*
X33990000Y39730000D01*
%TO.C,C3*%
X15694000Y79010000D02*
X15694000Y81020000D01*
X17834000Y79040000D02*
X17834000Y81050000D01*
D11*
%TO.C,C4*%
X33858252Y89387000D02*
X32435748Y89387000D01*
X33858252Y91207000D02*
X32435748Y91207000D01*
D10*
%TO.C,FB1*%
X15689000Y89265000D02*
X15689000Y87265000D01*
X17839000Y87265000D02*
X17839000Y89265000D01*
%TO.C,R1*%
X23733000Y91372000D02*
X21733000Y91372000D01*
X21733000Y89222000D02*
X23733000Y89222000D01*
%TO.C,U1*%
X63270000Y52935000D02*
X63270000Y53235000D01*
X59920000Y52935000D02*
X59920000Y53160000D01*
X59920000Y53160000D02*
X58695000Y53160000D01*
X59920000Y52935000D02*
X63270000Y52935000D01*
X59920000Y56285000D02*
X63270000Y56285000D01*
X63270000Y56285000D02*
X63270000Y55985000D01*
X59920000Y56285000D02*
X59920000Y55985000D01*
%TO.C,U2*%
X29256000Y85716000D02*
X35006000Y85716000D01*
X35006000Y85716000D02*
X35006000Y85066000D01*
X29256000Y75066000D02*
X29256000Y75641000D01*
X35006000Y75066000D02*
X35006000Y75716000D01*
X29256000Y75641000D02*
X27656000Y75641000D01*
X29256000Y75066000D02*
X35006000Y75066000D01*
X29256000Y85716000D02*
X29256000Y85066000D01*
D11*
%TO.C,C5*%
X24311252Y71410000D02*
X22888748Y71410000D01*
X24311252Y69590000D02*
X22888748Y69590000D01*
%TO.C,R2*%
X21140000Y76627064D02*
X21140000Y75172936D01*
X22960000Y76627064D02*
X22960000Y75172936D01*
%TD*%
M02*
