EESchema Schematic File Version 4
EELAYER 30 0
EELAYER END
$Descr A4 11693 8268
encoding utf-8
Sheet 1 1
Title ""
Date ""
Rev ""
Comp ""
Comment1 ""
Comment2 ""
Comment3 ""
Comment4 ""
$EndDescr
$Comp
L power:GND #PWR06
U 1 1 5FA66343
P 1800 4600
F 0 "#PWR06" H 1800 4350 50  0001 C CNN
F 1 "GND" H 2150 4650 50  0000 C CNN
F 2 "" H 1800 4600 50  0001 C CNN
F 3 "" H 1800 4600 50  0001 C CNN
	1    1800 4600
	1    0    0    -1  
$EndComp
Wire Wire Line
	1750 4500 1750 4550
Wire Wire Line
	1750 4550 1800 4550
Wire Wire Line
	1850 4550 1850 4500
Wire Wire Line
	1800 4550 1800 4600
Connection ~ 1800 4550
Wire Wire Line
	1800 4550 1850 4550
$Comp
L power:+5V #PWR07
U 1 1 5FA67628
P 1950 2400
F 0 "#PWR07" H 1950 2250 50  0001 C CNN
F 1 "+5V" H 1965 2573 50  0000 C CNN
F 2 "" H 1950 2400 50  0001 C CNN
F 3 "" H 1950 2400 50  0001 C CNN
	1    1950 2400
	1    0    0    -1  
$EndComp
Wire Wire Line
	1950 2400 1950 2500
$Comp
L power:+12V #PWR05
U 1 1 5FA6990A
P 1650 2400
F 0 "#PWR05" H 1650 2250 50  0001 C CNN
F 1 "+12V" H 1665 2573 50  0000 C CNN
F 2 "" H 1650 2400 50  0001 C CNN
F 3 "" H 1650 2400 50  0001 C CNN
	1    1650 2400
	1    0    0    -1  
$EndComp
Wire Wire Line
	800  3300 1250 3300
Text Label 800  3200 0    50   ~ 0
INT
Text Label 2600 4000 2    50   ~ 0
I2C_CLK
Text Label 2600 3900 2    50   ~ 0
I2C_DAT
Wire Wire Line
	2600 3900 2250 3900
Wire Wire Line
	2250 4000 2600 4000
NoConn ~ 1850 2500
NoConn ~ 2250 2900
NoConn ~ 2250 3000
NoConn ~ 2250 3300
Text Label 800  3100 0    50   ~ 0
E_STOP
Wire Wire Line
	800  3200 1250 3200
Wire Wire Line
	1250 3100 800  3100
$Comp
L BREAD_Slice-rescue:10uF_t-OCI_UPL_2_Capacitors C1
U 1 1 5FA94020
P 1600 1350
F 0 "C1" H 1715 1396 50  0000 L CNN
F 1 "10uF_t" H 1715 1305 50  0000 L CNN
F 2 "OCI_UPL_FOOTPRINTS:C_2312" H 1600 1100 30  0001 C CNN
F 3 "https://www.digikey.com/short/qcd8n7" H 1600 1550 30  0001 C CNN
F 4 "T491C106K025AT" H 1600 1600 30  0001 C CNN "Part #"
F 5 "2.021" H 1600 1150 30  0001 C CNN "UPL #"
	1    1600 1350
	1    0    0    -1  
$EndComp
$Comp
L power:GND #PWR04
U 1 1 5FA94026
P 1600 1550
F 0 "#PWR04" H 1600 1300 50  0001 C CNN
F 1 "GND" H 1605 1377 50  0000 C CNN
F 2 "" H 1600 1550 50  0001 C CNN
F 3 "" H 1600 1550 50  0001 C CNN
	1    1600 1550
	1    0    0    -1  
$EndComp
Wire Wire Line
	1600 1200 1600 1150
Wire Wire Line
	1600 1550 1600 1500
$Comp
L Mechanical:MountingHole H1
U 1 1 5FAB1765
P 1100 4900
F 0 "H1" H 1200 4946 50  0000 L CNN
F 1 "MountingHole" H 1200 4855 50  0000 L CNN
F 2 "MountingHole:MountingHole_3.2mm_M3_DIN965_Pad" H 1100 4900 50  0001 C CNN
F 3 "~" H 1100 4900 50  0001 C CNN
	1    1100 4900
	1    0    0    -1  
$EndComp
$Comp
L Mechanical:MountingHole H3
U 1 1 5FAB1B3E
P 1850 4900
F 0 "H3" H 1950 4946 50  0000 L CNN
F 1 "MountingHole" H 1950 4855 50  0000 L CNN
F 2 "MountingHole:MountingHole_3.2mm_M3_DIN965_Pad" H 1850 4900 50  0001 C CNN
F 3 "~" H 1850 4900 50  0001 C CNN
	1    1850 4900
	1    0    0    -1  
$EndComp
$Comp
L Mechanical:MountingHole H2
U 1 1 5FAB217D
P 1100 5100
F 0 "H2" H 1200 5146 50  0000 L CNN
F 1 "MountingHole" H 1200 5055 50  0000 L CNN
F 2 "MountingHole:MountingHole_3.2mm_M3_DIN965_Pad" H 1100 5100 50  0001 C CNN
F 3 "~" H 1100 5100 50  0001 C CNN
	1    1100 5100
	1    0    0    -1  
$EndComp
$Comp
L Mechanical:MountingHole H4
U 1 1 5FAB25F7
P 1850 5100
F 0 "H4" H 1950 5146 50  0000 L CNN
F 1 "MountingHole" H 1950 5055 50  0000 L CNN
F 2 "MountingHole:MountingHole_3.2mm_M3_DIN965_Pad" H 1850 5100 50  0001 C CNN
F 3 "~" H 1850 5100 50  0001 C CNN
	1    1850 5100
	1    0    0    -1  
$EndComp
$Comp
L MCU_Module:Arduino_Nano_v3.x A1
U 1 1 5FCAD89B
P 1750 3500
F 0 "A1" H 1750 2411 50  0000 C CNN
F 1 "Arduino_Nano_v3.x" H 2250 2550 50  0000 C CNN
F 2 "Module:Arduino_Nano" H 1750 3500 50  0001 C CIN
F 3 "http://www.mouser.com/pdfdocs/Gravitech_Arduino_Nano3_0.pdf" H 1750 3500 50  0001 C CNN
	1    1750 3500
	1    0    0    -1  
$EndComp
Text Label 800  3300 0    50   ~ 0
SYNC
$Comp
L Connector:Conn_01x10_Female J1
U 1 1 5FE6B3C7
P 1400 1450
F 0 "J1" H 1428 1380 50  0000 L CNN
F 1 "Conn_01x10_Female" H 1428 1335 50  0001 L CNN
F 2 "Connector_PinSocket_2.54mm:PinSocket_1x10_P2.54mm_Horizontal" H 1400 1450 50  0001 C CNN
F 3 "~" H 1400 1450 50  0001 C CNN
	1    1400 1450
	1    0    0    -1  
$EndComp
$Comp
L power:+12V #PWR01
U 1 1 5FE6D224
P 1100 1000
F 0 "#PWR01" H 1100 850 50  0001 C CNN
F 1 "+12V" H 1115 1173 50  0000 C CNN
F 2 "" H 1100 1000 50  0001 C CNN
F 3 "" H 1100 1000 50  0001 C CNN
	1    1100 1000
	1    0    0    -1  
$EndComp
$Comp
L power:GND #PWR02
U 1 1 5FE6E4CA
P 1150 2000
F 0 "#PWR02" H 1150 1750 50  0001 C CNN
F 1 "GND" H 1155 1827 50  0000 C CNN
F 2 "" H 1150 2000 50  0001 C CNN
F 3 "" H 1150 2000 50  0001 C CNN
	1    1150 2000
	1    0    0    -1  
$EndComp
Wire Wire Line
	1150 2000 1150 1950
Wire Wire Line
	1150 1050 1200 1050
Wire Wire Line
	1200 1950 1150 1950
Connection ~ 1150 1950
Wire Wire Line
	1100 1000 1100 1150
Wire Wire Line
	1100 1150 1200 1150
Wire Wire Line
	1200 1850 1100 1850
Wire Wire Line
	1100 1850 1100 1150
Connection ~ 1100 1150
Wire Wire Line
	1200 1450 1150 1450
Connection ~ 1150 1450
Wire Wire Line
	1150 1450 1150 1050
Text Label 750  1250 0    50   ~ 0
I2C_CLK
Text Label 750  1350 0    50   ~ 0
I2C_DAT
Text Label 750  1550 0    50   ~ 0
E_STOP
Text Label 750  1650 0    50   ~ 0
INT
Text Label 750  1750 0    50   ~ 0
SYNC
Wire Wire Line
	1200 1250 750  1250
Wire Wire Line
	750  1350 1200 1350
Wire Wire Line
	1150 1950 1150 1450
Wire Wire Line
	1200 1550 750  1550
Wire Wire Line
	750  1650 1200 1650
Wire Wire Line
	750  1750 1200 1750
$Comp
L power:+12V #PWR03
U 1 1 5FE73FEC
P 1600 1150
F 0 "#PWR03" H 1600 1000 50  0001 C CNN
F 1 "+12V" H 1615 1323 50  0000 C CNN
F 2 "" H 1600 1150 50  0001 C CNN
F 3 "" H 1600 1150 50  0001 C CNN
	1    1600 1150
	1    0    0    -1  
$EndComp
Wire Wire Line
	1650 2400 1650 2500
$Comp
L BREAD_Slice-rescue:10uF_t-OCI_UPL_2_Capacitors C2
U 1 1 5FE84189
P 2100 1350
F 0 "C2" H 2215 1396 50  0000 L CNN
F 1 "10uF_t" H 2215 1305 50  0000 L CNN
F 2 "OCI_UPL_FOOTPRINTS:C_2312" H 2100 1100 30  0001 C CNN
F 3 "https://www.digikey.com/short/qcd8n7" H 2100 1550 30  0001 C CNN
F 4 "T491C106K025AT" H 2100 1600 30  0001 C CNN "Part #"
F 5 "2.021" H 2100 1150 30  0001 C CNN "UPL #"
	1    2100 1350
	1    0    0    -1  
$EndComp
$Comp
L power:GND #PWR09
U 1 1 5FE8418F
P 2100 1550
F 0 "#PWR09" H 2100 1300 50  0001 C CNN
F 1 "GND" H 2105 1377 50  0000 C CNN
F 2 "" H 2100 1550 50  0001 C CNN
F 3 "" H 2100 1550 50  0001 C CNN
	1    2100 1550
	1    0    0    -1  
$EndComp
Wire Wire Line
	2100 1200 2100 1150
Wire Wire Line
	2100 1550 2100 1500
$Comp
L power:+5V #PWR08
U 1 1 5FE8466D
P 2100 1150
F 0 "#PWR08" H 2100 1000 50  0001 C CNN
F 1 "+5V" H 2115 1323 50  0000 C CNN
F 2 "" H 2100 1150 50  0001 C CNN
F 3 "" H 2100 1150 50  0001 C CNN
	1    2100 1150
	1    0    0    -1  
$EndComp
Wire Notes Line
	700  5250 2650 5250
Wire Notes Line
	2650 750  700  750 
Wire Notes Line
	700  750  700  5250
Wire Notes Line
	650  5300 2700 5300
Wire Notes Line
	2700 600  650  600 
Wire Notes Line
	650  600  650  5300
Text Notes 750  750  0    100  ~ 0
Core Slice Components
$Comp
L Graphic:Logo_Open_Hardware_Small Logo1
U 1 1 5FE4A934
P 10950 6850
F 0 "Logo1" H 10950 7125 50  0001 C CNN
F 1 "Logo_Open_Hardware_Small" H 10950 6625 50  0001 C CNN
F 2 "Symbol:OSHW-Symbol_6.7x6mm_SilkScreen" H 10950 6850 50  0001 C CNN
F 3 "~" H 10950 6850 50  0001 C CNN
	1    10950 6850
	1    0    0    -1  
$EndComp
$Comp
L Connector:USB_A J2
U 1 1 611F870C
P 3800 3500
F 0 "J2" H 3857 3967 50  0000 C CNN
F 1 "USB_A" H 3857 3876 50  0000 C CNN
F 2 "Connector_USB:USB_A_Molex_67643_Horizontal" H 3950 3450 50  0001 C CNN
F 3 " ~" H 3950 3450 50  0001 C CNN
	1    3800 3500
	1    0    0    -1  
$EndComp
Wire Notes Line
	2700 5300 2700 600 
Wire Notes Line
	2650 5250 2650 750 
$Comp
L Connector:USB_A J3
U 1 1 60C5FDC3
P 3800 4550
F 0 "J3" H 3857 5017 50  0000 C CNN
F 1 "USB_A" H 3857 4926 50  0000 C CNN
F 2 "Connector_USB:USB_A_Molex_67643_Horizontal" H 3950 4500 50  0001 C CNN
F 3 " ~" H 3950 4500 50  0001 C CNN
	1    3800 4550
	1    0    0    -1  
$EndComp
$Comp
L power:+5V #PWR0101
U 1 1 60C5FDC9
P 6950 2150
F 0 "#PWR0101" H 6950 2000 50  0001 C CNN
F 1 "+5V" H 6965 2323 50  0000 C CNN
F 2 "" H 6950 2150 50  0001 C CNN
F 3 "" H 6950 2150 50  0001 C CNN
	1    6950 2150
	1    0    0    -1  
$EndComp
$Comp
L Interface_USB:FT232RL U2
U 1 1 60C5FDD5
P 8000 3500
F 0 "U2" H 8350 4650 50  0000 C CNN
F 1 "FT232RL" H 8400 4500 50  0000 C CNN
F 2 "Package_SO:SSOP-28_5.3x10.2mm_P0.65mm" H 9100 2600 50  0001 C CNN
F 3 "https://www.ftdichip.com/Support/Documents/DataSheets/ICs/DS_FT232R.pdf" H 8000 3500 50  0001 C CNN
	1    8000 3500
	1    0    0    -1  
$EndComp
$Comp
L power:GND #PWR0102
U 1 1 60C5FDDB
P 7600 4650
F 0 "#PWR0102" H 7600 4400 50  0001 C CNN
F 1 "GND" H 7605 4477 50  0000 C CNN
F 2 "" H 7600 4650 50  0001 C CNN
F 3 "" H 7600 4650 50  0001 C CNN
	1    7600 4650
	1    0    0    -1  
$EndComp
Wire Wire Line
	7200 4200 7200 4500
Wire Wire Line
	7200 4500 7600 4500
Connection ~ 7800 4500
Wire Wire Line
	7800 4500 8000 4500
Connection ~ 8000 4500
Wire Wire Line
	8000 4500 8100 4500
Connection ~ 8100 4500
Wire Wire Line
	8100 4500 8200 4500
Wire Wire Line
	7600 4650 7600 4500
Connection ~ 7600 4500
Wire Wire Line
	7600 4500 7800 4500
$Comp
L Device:Ferrite_Bead FB1
U 1 1 60C5FDF0
P 5300 1650
F 0 "FB1" V 5026 1650 50  0000 C CNN
F 1 "Ferrite_Bead" V 5117 1650 50  0000 C CNN
F 2 "OCI_UPL_FOOTPRINTS:R_1206_HandSoldering" V 5230 1650 50  0001 C CNN
F 3 "~" H 5300 1650 50  0001 C CNN
	1    5300 1650
	0    1    1    0   
$EndComp
$Comp
L BREAD_Slice-rescue:10uF_t-OCI_UPL_2_Capacitors C3
U 1 1 60C5FDF8
P 4950 1300
F 0 "C3" H 5065 1346 50  0000 L CNN
F 1 "10 nF" H 5065 1255 50  0000 L CNN
F 2 "OCI_UPL_FOOTPRINTS:C_2312" H 4950 1050 30  0001 C CNN
F 3 "https://www.digikey.com/short/qcd8n7" H 4950 1500 30  0001 C CNN
F 4 "T491C106K025AT" H 4950 1550 30  0001 C CNN "Part #"
F 5 "2.021" H 4950 1100 30  0001 C CNN "UPL #"
	1    4950 1300
	-1   0    0    1   
$EndComp
$Comp
L power:GND #PWR0103
U 1 1 60C5FDFE
P 4950 1050
F 0 "#PWR0103" H 4950 800 50  0001 C CNN
F 1 "GND" H 4955 877 50  0000 C CNN
F 2 "" H 4950 1050 50  0001 C CNN
F 3 "" H 4950 1050 50  0001 C CNN
	1    4950 1050
	-1   0    0    1   
$EndComp
Wire Wire Line
	6950 2500 6950 2150
Wire Wire Line
	4950 1050 4950 1150
Wire Wire Line
	4950 1450 4950 1650
Connection ~ 4950 1650
Wire Wire Line
	4950 1650 5150 1650
Wire Wire Line
	8100 2500 7900 2500
Connection ~ 7900 2500
Wire Wire Line
	7900 2500 6950 2500
NoConn ~ 7200 3500
NoConn ~ 7200 3700
NoConn ~ 7200 3900
$Comp
L Device:C C4
U 1 1 60C5FE18
P 7000 2800
F 0 "C4" V 6850 2800 50  0000 C CNN
F 1 "100 nF" V 6750 2800 50  0000 C CNN
F 2 "OCI_UPL_FOOTPRINTS:C_1206_HandSoldering" H 7038 2650 50  0001 C CNN
F 3 "~" H 7000 2800 50  0001 C CNN
	1    7000 2800
	0    -1   -1   0   
$EndComp
$Comp
L power:GND #PWR0104
U 1 1 60C5FE1E
P 6700 2800
F 0 "#PWR0104" H 6700 2550 50  0001 C CNN
F 1 "GND" H 6705 2627 50  0000 C CNN
F 2 "" H 6700 2800 50  0001 C CNN
F 3 "" H 6700 2800 50  0001 C CNN
	1    6700 2800
	0    1    1    0   
$EndComp
Wire Wire Line
	7200 2800 7150 2800
Wire Wire Line
	6850 2800 6700 2800
Text Label 8950 2800 0    50   ~ 0
TR
Text Label 8950 2900 0    50   ~ 0
RT
Wire Wire Line
	8800 2800 8950 2800
Wire Wire Line
	8800 2900 8950 2900
Text Label 8950 3000 0    50   ~ 0
RTS
Text Label 8950 3100 0    50   ~ 0
CTS
Wire Wire Line
	8800 3000 8950 3000
Wire Wire Line
	8800 3100 8950 3100
NoConn ~ 8800 3200
NoConn ~ 8800 3300
NoConn ~ 8800 3400
NoConn ~ 8800 3500
NoConn ~ 8800 3900
NoConn ~ 8800 3800
NoConn ~ 8800 4000
NoConn ~ 8800 4200
Text Label 9700 4100 0    50   ~ 0
PWREN
$Comp
L Device:R R1
U 1 1 60C5FE37
P 9300 3800
F 0 "R1" H 9370 3846 50  0000 L CNN
F 1 "10k" H 9370 3755 50  0000 L CNN
F 2 "OCI_UPL_FOOTPRINTS:R_1206_HandSoldering" V 9230 3800 50  0001 C CNN
F 3 "~" H 9300 3800 50  0001 C CNN
	1    9300 3800
	1    0    0    -1  
$EndComp
$Comp
L power:+5V #PWR0105
U 1 1 60C5FE3D
P 9300 3650
F 0 "#PWR0105" H 9300 3500 50  0001 C CNN
F 1 "+5V" H 9315 3823 50  0000 C CNN
F 2 "" H 9300 3650 50  0001 C CNN
F 3 "" H 9300 3650 50  0001 C CNN
	1    9300 3650
	1    0    0    -1  
$EndComp
Wire Wire Line
	8800 4100 9300 4100
Wire Wire Line
	9300 3950 9300 4100
Connection ~ 9300 4100
Wire Wire Line
	9300 4100 9700 4100
Text Label 1050 2900 2    50   ~ 0
TR
Text Label 1050 3000 2    50   ~ 0
RT
Wire Wire Line
	1050 2900 1250 2900
Wire Wire Line
	1050 3000 1250 3000
Wire Wire Line
	1250 3600 1100 3600
$Comp
L Interface_USB:FSUSB42MUX U1
U 1 1 60CAD33B
P 4750 2750
F 0 "U1" V 5050 3300 50  0000 L CNN
F 1 "FSUSB42MUX" V 5150 3150 50  0000 L CNN
F 2 "Package_SO:MSOP-10_3x3mm_P0.5mm" H 4750 1950 50  0001 C CNN
F 3 "https://www.onsemi.com/pub/Collateral/FSUSB42-D.PDF" H 4750 2650 50  0001 C CNN
	1    4750 2750
	0    1    1    0   
$EndComp
Wire Wire Line
	4100 3500 4650 3500
Wire Wire Line
	4650 3500 4650 3150
Wire Wire Line
	4100 3600 4550 3600
Wire Wire Line
	4550 3600 4550 3150
Wire Wire Line
	4100 4550 4950 4550
Wire Wire Line
	4950 4550 4950 3150
Wire Wire Line
	4100 4650 4850 4650
Wire Wire Line
	4850 4650 4850 3150
Wire Wire Line
	4100 3300 4200 3300
Wire Wire Line
	4100 4350 4200 4350
Wire Wire Line
	4200 4350 4200 3300
Connection ~ 4200 3300
$Comp
L power:GND #PWR0107
U 1 1 60D6FDA1
P 3450 5050
F 0 "#PWR0107" H 3450 4800 50  0001 C CNN
F 1 "GND" H 3455 4877 50  0000 C CNN
F 2 "" H 3450 5050 50  0001 C CNN
F 3 "" H 3450 5050 50  0001 C CNN
	1    3450 5050
	1    0    0    -1  
$EndComp
Wire Wire Line
	3800 4950 3700 4950
Wire Wire Line
	3800 3900 3700 3900
Wire Wire Line
	3700 3900 3450 3900
Wire Wire Line
	3450 3900 3450 4950
Connection ~ 3700 3900
Wire Wire Line
	3700 4950 3450 4950
Connection ~ 3700 4950
Connection ~ 3450 4950
Wire Wire Line
	3450 4950 3450 5050
Wire Wire Line
	4200 1650 4950 1650
Wire Wire Line
	4200 1650 4200 3300
$Comp
L power:GND #PWR0108
U 1 1 60DD8FA9
P 4300 2850
F 0 "#PWR0108" H 4300 2600 50  0001 C CNN
F 1 "GND" H 4305 2677 50  0000 C CNN
F 2 "" H 4300 2850 50  0001 C CNN
F 3 "" H 4300 2850 50  0001 C CNN
	1    4300 2850
	1    0    0    -1  
$EndComp
Wire Wire Line
	4350 2750 4300 2750
Wire Wire Line
	4300 2750 4300 2850
Text Label 4450 2200 2    50   ~ 0
SEL
Wire Wire Line
	4450 2200 4550 2200
Wire Wire Line
	4550 2200 4550 2350
$Comp
L power:GND #PWR0109
U 1 1 60DDFF3E
P 4650 2100
F 0 "#PWR0109" H 4650 1850 50  0001 C CNN
F 1 "GND" H 4655 1927 50  0000 C CNN
F 2 "" H 4650 2100 50  0001 C CNN
F 3 "" H 4650 2100 50  0001 C CNN
	1    4650 2100
	-1   0    0    1   
$EndComp
Wire Wire Line
	4650 2350 4650 2100
Text Label 5100 2200 0    50   ~ 0
D+
Text Label 5100 1950 0    50   ~ 0
D-
Wire Wire Line
	4950 2350 4950 2200
Wire Wire Line
	4950 2200 5100 2200
Wire Wire Line
	4850 2350 4850 1950
Wire Wire Line
	4850 1950 5100 1950
Text Label 6900 3350 2    50   ~ 0
D-
Text Label 6850 3200 2    50   ~ 0
D+
Wire Wire Line
	7200 3100 7050 3100
Wire Wire Line
	7050 3100 7050 3200
Wire Wire Line
	7050 3200 6850 3200
Wire Wire Line
	7200 3200 7150 3200
Wire Wire Line
	7150 3200 7150 3350
Wire Wire Line
	7150 3350 6900 3350
Text Label 1100 3600 2    50   ~ 0
SEL
Text Label 1100 3500 2    50   ~ 0
RTS
Text Label 1100 3400 2    50   ~ 0
CTS
Wire Wire Line
	1250 3500 1100 3500
Wire Wire Line
	1250 3400 1100 3400
NoConn ~ 1250 4000
NoConn ~ 1250 4100
NoConn ~ 1250 4200
NoConn ~ 2250 4200
NoConn ~ 2250 4100
NoConn ~ 2250 3800
NoConn ~ 2250 3700
NoConn ~ 2250 3600
NoConn ~ 2250 3500
$Comp
L power:+5V #PWR0110
U 1 1 60E555AA
P 5300 2650
F 0 "#PWR0110" H 5300 2500 50  0001 C CNN
F 1 "+5V" H 5315 2823 50  0000 C CNN
F 2 "" H 5300 2650 50  0001 C CNN
F 3 "" H 5300 2650 50  0001 C CNN
	1    5300 2650
	1    0    0    -1  
$EndComp
Wire Wire Line
	5150 2750 5300 2750
Wire Wire Line
	5300 2750 5300 2650
Text Label 1100 3700 2    50   ~ 0
PWREN
Wire Wire Line
	1250 3700 1100 3700
$Comp
L power:+5V #PWR0106
U 1 1 60E8BE46
P 5950 1450
F 0 "#PWR0106" H 5950 1300 50  0001 C CNN
F 1 "+5V" H 5965 1623 50  0000 C CNN
F 2 "" H 5950 1450 50  0001 C CNN
F 3 "" H 5950 1450 50  0001 C CNN
	1    5950 1450
	1    0    0    -1  
$EndComp
Wire Wire Line
	5950 1650 5950 1450
Wire Wire Line
	5450 1650 5950 1650
$EndSCHEMATC
