{
    "@context": "https://schema.org/",
    "@type": "Dataset",
    "@id": "https://uvacreate.gitlab.io/cinema-context/cinema-context-lod-workshop-homer-2022/id/metzww1/",
    "name": "Metz World War I",
    "description": "Films from several reels shown at the Palast-Kinema (400 seats) and the Eden-Theater (700 seats) in Metz (about 65,000 inhabitants) between late September 1914 and late December 1915. All the theaters in the city had closed at the beginning of the conflict, only two downtown theaters were allowed to reopen during this period. Multi-reel films were shown in programs that also included single-reel films, which were not included in the database. All the programs come from the daily newspaper Metzer Zeitung, consulted in the Archives départementales de la Moselle. \\n Theaters are open seven days a week. Programs are renewed on Saturdays and Wednesdays. Each screening in the database therefore lasts three days (Wednesday, Thursday, Friday) or four days (Saturday, Sunday, Monday, Tuesday).",
    "spatialCoverage": {
        "@type": "Place",
        "name": "Metz, Germany"
    },
    "temporalCoverage": "1914/1915",
    "license": "https://creativecommons.org/licenses/by/4.0/",
    "dateCreated": "2022-07-06",
    "datePublished": "2022-07-06",
    "dateModified": "2022-07-06",
    "keywords": [
        "Cinema History",
        "HoMER 2022"
    ],
    "includedInDataCatalog": {
        "@id": "https://uvacreate.gitlab.io/cinema-context/cinema-context-lod-workshop-homer-2022/",
        "@type": "DataCatalog",
        "name": "Linking Cinema Data - Workshop HoMER 2022"
    },
    "publisher": [{
        "@type": "Organization",
        "name": "CREATE",
        "alternateName": "Creative Amsterdam: An E-Humanities Perspective",
        "url": "https://www.create.humanities.uva.nl/"
    }, {
        "@type": "Person",
        "name": "Julia Noordegraaf",
        "sameAs": "https://orcid.org/0000-0003-0146-642X"
    }, {
        "@type": "Person",
        "name": "Leon van Wissen",
        "sameAs": "https://orcid.org/0000-0001-8672-025X"
    }, {
        "@type": "Person",
        "name": "Thunnis van Oort",
        "sameAs": "https://orcid.org/0000-0001-8912-0508"
    }, {
        "@type": "Person",
        "name": "Ivan Kisjes"
    }, {
        "@type": "Person",
        "name": "Clara Pafort-Overduin",
        "sameAs": "https://orcid.org/0000-0001-7498-9470"
    }],
    "creator": {
        "@type": "Person",
        "name": "Pierre Stotzky"
    },
    "distribution": [{
            "@type": "DataDownload",
            "encodingFormat": "text/csv",
            "contentUrl": "https://uvacreate.gitlab.io/cinema-context/cinema-context-lod-workshop-homer-2022/data/datasets/original/workshop_lod_homer2022_metzww1.csv",
            "name": "Dataset in spreadsheet format.",
            "datePublished": "2022-07-06",
            "dateModified": "2022-07-06",
            "contentSize": "2022-07-06"
        },
        {
            "@type": "DataDownload",
            "encodingFormat": "application/trig",
            "contentUrl": "https://uvacreate.gitlab.io/cinema-context/cinema-context-lod-workshop-homer-2022/data/datasets/rdf/workshop_lod_homer2022_metzww1.trig",
            "name": "Dataset in RDF TriG format.",
            "datePublished": "2022-07-06",
            "dateModified": "2022-07-06",
            "contentSize": "2022-07-06"
        }
    ]
}