{
    "@context": "https://schema.org/",
    "@type": "Dataset",
    "@id": "https://uvacreate.gitlab.io/cinema-context/cinema-context-lod-workshop-homer-2022/id/orebro/",
    "name": "Örebro films screened 1956-1958 and 1966-1968",
    "description": "The data set is organised in five separate sheets/pages. (1) 'Screenings 1956-1958' include screenings at 39 locations (23 different owners) that screened films with different frequency but all with some form of regularity. Source: One regional and two local news papers. The data is comprehensive and cleaned. (2)'Screenings 1966' - collected from the same sources as above. The locations and owners will vary compared to the 1956-1958 data set. (3) 'Screenings 1966' - collected from the same sources as above. This data has not been cleaned. there is also the complication of missing names of cinemas (and the names are important to establish changes in fx ownership/distribution - if in chains - compared to the earlier years). \\n The screening events are single screening events.",
    "spatialCoverage": {
        "@type": "Place",
        "name": "Örebro, Sweden"
    },
    "temporalCoverage": "1956/1968",
    "license": "https://creativecommons.org/licenses/by/4.0/",
    "dateCreated": "2022-07-06",
    "datePublished": "2022-07-06",
    "dateModified": "2022-07-06",
    "keywords": [
        "Cinema History",
        "HoMER 2022"
    ],
    "includedInDataCatalog": {
        "@id": "https://uvacreate.gitlab.io/cinema-context/cinema-context-lod-workshop-homer-2022/",
        "@type": "DataCatalog",
        "name": "Linking Cinema Data - Workshop HoMER 2022"
    },
    "publisher": [{
        "@type": "Organization",
        "name": "CREATE",
        "alternateName": "Creative Amsterdam: An E-Humanities Perspective",
        "url": "https://www.create.humanities.uva.nl/"
    }, {
        "@type": "Person",
        "name": "Julia Noordegraaf",
        "sameAs": "https://orcid.org/0000-0003-0146-642X"
    }, {
        "@type": "Person",
        "name": "Leon van Wissen",
        "sameAs": "https://orcid.org/0000-0001-8672-025X"
    }, {
        "@type": "Person",
        "name": "Thunnis van Oort",
        "sameAs": "https://orcid.org/0000-0001-8912-0508"
    }, {
        "@type": "Person",
        "name": "Ivan Kisjes"
    }, {
        "@type": "Person",
        "name": "Clara Pafort-Overduin",
        "sameAs": "https://orcid.org/0000-0001-7498-9470"
    }],
    "creator": [{
        "@type": "Person",
        "name": "Åsa Jernudd"
    }],
    "distribution": [{
            "@type": "DataDownload",
            "encodingFormat": "text/csv",
            "contentUrl": "https://uvacreate.gitlab.io/cinema-context/cinema-context-lod-workshop-homer-2022/data/datasets/original/workshop_lod_homer2022_orebro.csv",
            "name": "Dataset in spreadsheet format.",
            "datePublished": "2022-07-06",
            "dateModified": "2022-07-06",
            "contentSize": "2022-07-06"
        },
        {
            "@type": "DataDownload",
            "encodingFormat": "application/trig",
            "contentUrl": "https://uvacreate.gitlab.io/cinema-context/cinema-context-lod-workshop-homer-2022/data/datasets/rdf/workshop_lod_homer2022_orebro.trig",
            "name": "Dataset in RDF TriG format.",
            "datePublished": "2022-07-06",
            "dateModified": "2022-07-06",
            "contentSize": "2022-07-06"
        }
    ]
}