{
    "@context": "https://schema.org/",
    "@type": "Dataset",
    "@id": "https://uvacreate.gitlab.io/cinema-context/cinema-context-lod-workshop-homer-2022/id/moscow/",
    "name": "Moscow film programming",
    "description": "With two students Anastasia and Ivan, we collected data on film programming of Moscow cinema theaters from 1946 to 1955. In different years, there were up to 55 cinema theaters in Moscow. We collected data based on film programmes published in daily newspaper Vecherniaia Moskva. We have information about screening days, cinemas' capacity, partly about ticket prices. Unfortunately, we do not have information about numbers of seances in each cinema. Each screening event is single screening event. \\n We collect data based on daily film programmes.",
    "spatialCoverage": {
        "@type": "Place",
        "name": "Moscow, Russia"
    },
    "temporalCoverage": "1946/1955",
    "license": "https://creativecommons.org/licenses/by/4.0/",
    "dateCreated": "2022-07-06",
    "datePublished": "2022-07-06",
    "dateModified": "2022-07-06",
    "keywords": [
        "Cinema History",
        "HoMER 2022"
    ],
    "includedInDataCatalog": {
        "@id": "https://uvacreate.gitlab.io/cinema-context/cinema-context-lod-workshop-homer-2022/",
        "@type": "DataCatalog",
        "name": "Linking Cinema Data - Workshop HoMER 2022"
    },
    "publisher": [{
        "@type": "Organization",
        "name": "CREATE",
        "alternateName": "Creative Amsterdam: An E-Humanities Perspective",
        "url": "https://www.create.humanities.uva.nl/"
    }, {
        "@type": "Person",
        "name": "Julia Noordegraaf",
        "sameAs": "https://orcid.org/0000-0003-0146-642X"
    }, {
        "@type": "Person",
        "name": "Leon van Wissen",
        "sameAs": "https://orcid.org/0000-0001-8672-025X"
    }, {
        "@type": "Person",
        "name": "Thunnis van Oort",
        "sameAs": "https://orcid.org/0000-0001-8912-0508"
    }, {
        "@type": "Person",
        "name": "Ivan Kisjes"
    }, {
        "@type": "Person",
        "name": "Clara Pafort-Overduin",
        "sameAs": "https://orcid.org/0000-0001-7498-9470"
    }],
    "creator": [{
        "@type": "Person",
        "name": "Kristina Tanis"
    }, {
        "@type": "Person",
        "name": "Anastasia Balukova"
    }, {
        "@type": "Person",
        "name": "Ivan Karnaukhov"
    }],
    "distribution": [{
            "@type": "DataDownload",
            "encodingFormat": "text/csv",
            "contentUrl": "https://uvacreate.gitlab.io/cinema-context/cinema-context-lod-workshop-homer-2022/data/datasets/original/workshop_lod_homer2022_moscow.csv",
            "name": "Dataset in spreadsheet format.",
            "datePublished": "2022-07-06",
            "dateModified": "2022-07-06",
            "contentSize": "2022-07-06"
        },
        {
            "@type": "DataDownload",
            "encodingFormat": "application/trig",
            "contentUrl": "https://uvacreate.gitlab.io/cinema-context/cinema-context-lod-workshop-homer-2022/data/datasets/rdf/workshop_lod_homer2022_moscow.trig",
            "name": "Dataset in RDF TriG format.",
            "datePublished": "2022-07-06",
            "dateModified": "2022-07-06",
            "contentSize": "2022-07-06"
        }
    ]
}