{
    "@context": "https://schema.org/",
    "@type": "Dataset",
    "@id": "https://uvacreate.gitlab.io/cinema-context/cinema-context-lod-workshop-homer-2022/id/cinemacontext/",
    "name": "Cinema Context",
    "description": "Cinema Context (http://www.cinemacontext.nl/) is an online database containing places, persons and companies involved in more than 100,000 film screenings since 1895.",
    "spatialCoverage": {
        "@type": "Place",
        "name": "The Netherlands"
    },
    "temporalCoverage": "1909/1947",
    "license": "https://creativecommons.org/licenses/by/4.0/",
    "dateCreated": "2022-07-06",
    "datePublished": "2022-07-06",
    "dateModified": "2022-07-06",
    "keywords": [
        "Cinema History",
        "HoMER 2022"
    ],
    "includedInDataCatalog": {
        "@id": "https://uvacreate.gitlab.io/cinema-context/cinema-context-lod-workshop-homer-2022/",
        "@type": "DataCatalog",
        "name": "Linking Cinema Data - Workshop HoMER 2022"
    },
    "publisher": [{
        "@type": "Organization",
        "name": "CREATE",
        "alternateName": "Creative Amsterdam: An E-Humanities Perspective",
        "url": "https://www.create.humanities.uva.nl/"
    }, {
        "@type": "Person",
        "name": "Julia Noordegraaf",
        "sameAs": "https://orcid.org/0000-0003-0146-642X"
    }, {
        "@type": "Person",
        "name": "Leon van Wissen",
        "sameAs": "https://orcid.org/0000-0001-8672-025X"
    }, {
        "@type": "Person",
        "name": "Thunnis van Oort",
        "sameAs": "https://orcid.org/0000-0001-8912-0508"
    }, {
        "@type": "Person",
        "name": "Ivan Kisjes"
    }, {
        "@type": "Person",
        "name": "Clara Pafort-Overduin",
        "sameAs": "https://orcid.org/0000-0001-7498-9470"
    }],
    "creator": {
        "@type": "Organization",
        "name": "Cinema Context",
        "url": "https://www.cinemacontext.nl/"
    },
    "distribution": [{
            "@type": "DataDownload",
            "encodingFormat": "text/csv",
            "contentUrl": "https://uvacreate.gitlab.io/cinema-context/cinema-context-lod-workshop-homer-2022/data/datasets/original/workshop_lod_homer2022_cinemacontext.csv",
            "name": "Dataset in spreadsheet format.",
            "datePublished": "2022-07-06",
            "dateModified": "2022-07-06",
            "contentSize": "2022-07-06"
        },
        {
            "@type": "DataDownload",
            "encodingFormat": "application/trig",
            "contentUrl": "https://uvacreate.gitlab.io/cinema-context/cinema-context-lod-workshop-homer-2022/data/datasets/rdf/workshop_lod_homer2022_cinemacontext.trig",
            "name": "Dataset in RDF TriG format.",
            "datePublished": "2022-07-06",
            "dateModified": "2022-07-06",
            "contentSize": "2022-07-06"
        }
    ]
}