cinema;seat_capacity;city;lat;lng;lat;lng
81466-VENUE-30079;792;ANT;51.2234735286397;4.4245030675842;51.2234735286397;4.4245030675842
19814-VENUE-38418;450;ANT;51.2186946176397;4.41817630158506;51.2186946176397;4.41817630158506
46389-VENUE-23885;1500;ANT;51.21697951964;4.41748825358544;51.21697951964;4.41748825358544
95842-VENUE-20408;830;ANT;51.2186923766409;4.42331644858524;51.2186923766409;4.42331644858524
31788-VENUE-30408;481;ANT;51.2188106046402;4.42064616958511;51.2188106046402;4.42064616958511
84558-VENUE-40730;1331;ANT;51.2176563566398;4.41750177358528;51.2176563566398;4.41750177358528
89098-VENUE-45378;800;ANT;51.2064437259184;4.46834817856838;51.2064437259184;4.46834817856838
92115-VENUE-19586;945;ANT;51.1802979466406;4.37036143459189;51.1802979466406;4.37036143459189
62576-VENUE-95481;800;ANT;51.2153673045729;4.43558084627498;51.2153673045729;4.43558084627498
70142-VENUE-94621;500;ANT;51.2181074516378;4.4092613675849;51.2181074516378;4.4092613675849
56257-VENUE-60757;700;ANT;51.2176962026396;4.41678631158523;51.2176962026396;4.41678631158523
16688-VENUE-91573;900;ANT;51.2236293426406;4.42896777358432;51.2236293426406;4.42896777358432
27326-VENUE-81421;900;ANT;51.2173666626397;4.41656329558529;51.2173666626397;4.41656329558529
36422-VENUE-61890;600;ANT;51.2084223121521;4.46301542062511;51.2084223121521;4.46301542062511
58884-VENUE-29907;1564;ANT;51.2165597756401;4.41736996458553;51.2165597756401;4.41736996458553
45224-VENUE-47705;500;ANT;51.2209738046409;4.42672306658484;51.2209738046409;4.42672306658484
36935-VENUE-19313;987;ANT;51.2133986506366;4.39776491158559;51.2133986506366;4.39776491158559
28690-VENUE-72707;380;ANT;51.2186105866402;4.42063617458518;51.2186105866402;4.42063617458518
56915-VENUE-54498;1600;ANT;51.2178994126418;4.42658782858551;51.2178994126418;4.42658782858551
35885-VENUE-49663;1650;ANT;51.2186946176397;4.41817630158506;51.2186946176397;4.41817630158506
98656-VENUE-66675;364;ANT;51.1921628546392;4.38021572758961;51.1921628546392;4.38021572758961
46809-VENUE-80283;500;ANT;51.2051422326379;4.39225622358718;51.2051422326379;4.39225622358718
31011-VENUE-71882;900;ANT;51.2212911996413;4.42893421358481;51.2212911996413;4.42893421358481
48858-VENUE-65581;796;ANT;51.1901216366393;4.37810058559001;51.1901216366393;4.37810058559001
89817-VENUE-10833;600;ANT;51.2175732236392;4.41469807658522;51.2175732236392;4.41469807658522
39182-VENUE-35564;1170;ANT;51.2176726546398;4.41735606558528;51.2176726546398;4.41735606558528
59880-VENUE-58387;500;ANT;51.21833953764;4.41939894558517;51.21833953764;4.41939894558517
79286-VENUE-60206;640;ANT;51.2173666626397;4.41656329558529;51.2173666626397;4.41656329558529
69785-VENUE-14583;280;ANT;51.2176643596398;4.41744575458527;51.2176643596398;4.41744575458527
46179-VENUE-29476;1100;ANT;51.2177273166398;4.41739389458527;51.2177273166398;4.41739389458527
33350-VENUE-50625;500;ANT;51.2179739096418;4.42631962758545;51.2179739096418;4.42631962758545
17468-VENUE-90500;2000;ANT;51.2137963079116;4.44010842609641;51.2137963079116;4.44010842609641
20630-VENUE-83562;2000;ANT;51.2180030186381;4.41054973058498;51.2180030186381;4.41054973058498
33458-VENUE-52307;700;ANT;51.2101438196366;4.39309682758614;51.2101438196366;4.39309682758614
92115-VENUE-19586;960;ANT;51.1802979466406;4.37036143459189;51.1802979466406;4.37036143459189
46574-VENUE-71617;950;ANT;51.2042127425272;4.39483438071315;51.2042127425272;4.39483438071315
44489-VENUE-11075;480;ANT;51.226000593634;4.40349790258304;51.226000593634;4.40349790258304
99766-VENUE-28124;1080;ANT;51.2189206256405;4.42216807158516;51.2189206256405;4.42216807158516
88709-VENUE-75177;570;ANT;51.2186105866402;4.42063617458518;51.2186105866402;4.42063617458518
68546-VENUE-50179;500;ANT;51.2179739096418;4.42631962758545;51.2179739096418;4.42631962758545
24873-VENUE-23205;700;ANT;51.2181459626373;4.40726678558482;51.2181459626373;4.40726678558482
14156-VENUE-18346;355;ANT;51.2188106046402;4.42064616958511;51.2188106046402;4.42064616958511
18982-VENUE-57215;600;ANT;51.216047912006;4.32884302064676;51.216047912006;4.32884302064676
10499-VENUE-61398;900;ANT;51.2427170528486;4.44097121766269;51.2427170528486;4.44097121766269
25679-VENUE-81441;195;ANT;51.2180139726398;4.4179170145852;51.2180139726398;4.4179170145852
15011-VENUE-88703;750;ANT;51.2143258986754;4.44001837731525;51.2143258986754;4.44001837731525
23131-VENUE-21065;1000;ANT;51.2140923190287;4.44121155575169;51.2140923190287;4.44121155575169
33706-VENUE-22730;1150;ANT;51.2435997076834;4.44288247519208;51.2435997076834;4.44288247519208
alhambra;700;AMS;52.35926;4.89748;52.35926;4.89748
alhambra 1;700;AMS;52.35926;4.89748;52.35926;4.89748
alhambra 2;157;AMS;52.371482;4.858368;52.371482;4.858368
ambassade;360;AMS;52.382807;4.887195;52.382807;4.887195
apollo;625;AMS;52.392197;4.913254;52.392197;4.913254
astoria;600;AMS;52.364457;4.880986;52.364457;4.880986
bellevue cinerama;651;AMS;52.35488;4.92882;52.35488;4.92882
bio;454;AMS;52.364457;4.880986;52.364457;4.880986
calypso;600;AMS;52.372829;4.879017;52.372829;4.879017
capitol;840;AMS;52.352634;4.891479;52.352634;4.891479
ceintuur;466;AMS;52.37726;4.896706;52.37726;4.896706
centraal;136;AMS;52.367003;4.909755;52.367003;4.909755
cine d;80;AMS;52.37479;4.8952;52.37479;4.8952
cineac damrak;750;AMS;52.366528;4.895019;52.366528;4.895019
cineac reg brstr;428;AMS;52.363534;4.838507;52.363534;4.838507
cinema hollandia;240;AMS;52.3839638330024;4.8846411601287;;
cinema west;531;AMS;52.352633;4.906345;52.352633;4.906345
cinetol;680;AMS;52.36333;4.88363;52.36333;4.88363
city;1389;AMS;52.36977;4.891141;52.36977;4.891141
corso;516;AMS;52.352633;4.906345;52.352633;4.906345
cultura;680;AMS;52.369819;4.871578;52.369819;4.871578
de liefde;387;AMS;52.367003;4.909755;52.367003;4.909755
desmet;350;AMS;52.347946;4.884338;52.347946;4.884338
du midi;700;AMS;52.36954;4.88015;52.36954;4.88015
edison;514;AMS;52.366097;4.899298;52.366097;4.899298
flora;680;AMS;52.37529;4.86402;52.37529;4.86402
hallen;640;AMS;52.3841744865518;4.88462376949259;52.3841744865518;4.88462376949259
hollandia;280;AMS;52.362527;4.910832;52.362527;4.910832
kriterion;420;AMS;52.364579;4.882721;52.364579;4.882721
leidsepleintheater;395;AMS;52.37603;4.89556;52.37603;4.89556
luxor;580;AMS;52.3593;4.92562;52.3593;4.92562
national;283;AMS;52.36649;4.89505;52.36649;4.89505
noggerath;572;AMS;52.376023;4.884729;52.376023;4.884729
nova;380;AMS;52.367553;4.888932;52.367553;4.888932
odeon;608;AMS;52.36674;4.86457;52.36674;4.86457
olympia;309;AMS;52.377195;4.896797;52.377195;4.896797
parisien;188;AMS;52.374694;4.893673;52.374694;4.893673
passage;441;AMS;52.36739;4.89261;52.36739;4.89261
plaza;452;AMS;52.366418;4.89638;52.366418;4.89638
rembrandtpleintheater;804;AMS;52.37959;4.89354;52.37959;4.89354
rex;536;AMS;52.353038;4.893937;52.353038;4.893937
rialto;590;AMS;52.36737;4.892407;52.36737;4.892407
roxy;438;AMS;52.375539;4.894814;52.375539;4.894814
royal;1162;AMS;52.362527;4.910832;52.362527;4.910832
studio k;151;AMS;52.38401;4.884694;52.38401;4.884694
the movies;240;AMS;52.366497;4.894665;52.366497;4.894665
tuschinski;1290;AMS;52.364763;4.884371;52.364763;4.884371
uitkijk;159;AMS;52.36194;4.9241;52.36194;4.9241
van swinden;480;AMS;52.35054;4.85186;52.35054;4.85186
victoria;615;AMS;52.371482;4.858368;52.371482;4.858368
west end;373;AMS;52.371488;4.858354;;
