{
  "@context": "https://schema.org/",
  "@type": "Dataset",
  "@id": "https://doi.org/10.5281/zenodo.6907004",
  "name": "Amsterdam waterlevel during the flood in 1775",
  "description": "The Amsterdam City Archives provide the inventory of the archive of the Amsterdam City Water Office (Stadswaterkantoor). This archive offers water level registers from 1601 up to 1841. This dataset provides the transcribed and transformed (from duim into meters) measurements from the 9th of November until the 21st of November 1775. The measurements were taken in the IJ and in the city. The specific reason for the chosen time period is the flood on the 14th and 15th of November 1775. The city centre was spared from disaster (due to effective sluice management) but streets, houses and cellars near the IJ, e.g. in Kattenburg, Wittenburg and Oostenburg, were flooded. The dataset shows the normal water level up to 7 days before and after the flood, which amplifies the extreme water levels during the flood. Thanks to Kees Hogenes for helping out. Explanation of column names:</p>\n\n<table>\n\t<tbody>\n\t\t<tr>\n\t\t\t<td>year</td>\n\t\t\t<td>month</td>\n\t\t\t<td>day</td>\n\t\t\t<td>time</td>\n\t\t\t<td>ij-waterlevel(m)</td>\n\t\t\t<td>city-waterlevel(m)</td>\n\t\t\t<td>a_ij-waterlevel(duim)</td>\n\t\t\t<td>b_ij-waterlevel(duim)</td>\n\t\t\t<td>b_city-waterlevel(duim)</td>\n\t\t\t<td>ij-waterlevel(duim)</td>\n\t\t\t<td>city-waterlevel(duim)</td>\n\t\t</tr>\n\t\t<tr>\n\t\t\t<td>year</td>\n\t\t\t<td>month</td>\n\t\t\t<td>day</td>\n\t\t\t<td>(hh:mm)</td>\n\t\t\t<td>into meters transformed water level in IJ</td>\n\t\t\t<td>into meters transformed water level in city</td>\n\t\t\t<td>transcribed measured water level in IJ, above NAP</td>\n\t\t\t<td>transcribed measured water level in IJ, beneath NAP</td>\n\t\t\t<td>transcribed measured water level in city, beneath NAP</td>\n\t\t\t<td>rewritten water level in IJ</td>\n\t\t\t<td>rewritten water level in city</td>\n\t\t</tr>\n\t</tbody>\n</table>\n\n<p> Source: Amsterdam City Archives 335, 38, 1775. Permalink: https://archief.amsterdam/inventarissen/file/b449d4c851c58677227fda6a3c8f1d96",
  "license": "https://creativecommons.org/licenses/by/4.0/",
  "dateCreated": "2022-07-26",
  "datePublished": "2022-07-26",
  "dateModified": "2022-07-26",
  "keywords": [
    "water level",
    "amsterdam",
    "flood",
    "1775",
    "amsterdam time machine"
  ],
  "inLanguage": [
    "nl-NL",
    "en-US"
  ],
  "publisher": {
    "@id": "https://www.amsterdamtimemachine.nl/",
    "@type": "Organization",
    "name": "Amsterdam Time Machine"
  },
  "creator": {
    "affiliation": "University of Amsterdam",
    "@id": "https://orcid.org/0000-0003-1284-5708",
    "@type": "Person",
    "name": "Daan Groot"
  },
  "distribution": [
    {
      "@type": "DataDownload",
      "encodingFormat": "text/csv",
      "contentUrl": "https://zenodo.org/api/files/84a9d1fa-83c9-421c-ab15-9c80cdcf3faf/Amsterdam%20Waterlevel%201775%20-%20flood1775.csv"
    }
  ]
}