{
  "tiles" : [ {
    "scaleFactors" : [ 32, 16, 8, 4, 2, 1 ],
    "width" : 128,
    "height" : 128
  } ],
  "protocol" : "http://iiif.io/api/image",
  "sizes" : [ {
    "width" : 68,
    "height" : 42
  }, {
    "width" : 136,
    "height" : 83
  }, {
    "width" : 272,
    "height" : 166
  }, {
    "width" : 543,
    "height" : 331
  }, {
    "width" : 1086,
    "height" : 662
  }, {
    "width" : 2172,
    "height" : 1324
  } ],
  "profile" : "level0",
  "width" : 2172,
  "id" : "https://uvacreate.gitlab.io/amsterdam-time-machine/iiif-level0-maps/iiif/010194001652",
  "type" : "ImageService3",
  "@context" : "http://iiif.io/api/image/3/context.json",
  "height" : 1324
}