{
    "$schema": "https://docs.renovatebot.com/renovate-schema.json",
    "extends": [
        "config:best-practices",
        "schedule:weekends"
    ],
    "automerge": true,
    "automergeType": "pr",
    "platformAutomerge": true,
    "prConcurrentLimit": 4,
    "pinDigests": true,
    "prHourlyLimit": 0,
    "labels": [
        "renovate-bot"
    ],
    "separateMultipleMajor": true,
    "separateMajorMinor": true,
    "separateMinorPatch": true,
    "dependencyDashboard": true,
    "postUpdateOptions": [
        "gomodTidy",
        "gomodUpdateImportPaths"
    ],
    "customManagers": [
        {
            "description": "Update Debian version codenames in container image tags, for example 'buster' in 'node:20.10.0-buster'.",
            "customType": "regex",
            "fileMatch": [
                "(^|/|\\.)([Dd]ocker|[Cc]ontainer)file$",
                "(^|/)([Dd]ocker|[Cc]ontainer)file[^/]*$",
                "\\.ya?ml$"
            ],
            "matchStrings": [
                "(?:^|[ \"'])(?<depName>[\\w/.:-]+?):[\\w.-]+?-(?<currentValue>[a-z]+)(?:-slim)?(?:@(?<currentDigest>sha256:[0-9a-f]{64}))?(?:$|[ \"'])"
            ],
            "datasourceTemplate": "docker",
            "versioningTemplate": "debian"
        },
        {
            "description": "Update the Alpine version in container image tags. For example, update php:8.2.24-fpm-alpine3.19 to php:8.2.24-fpm-alpine3.20.",
            "customType": "regex",
            "fileMatch": [
              "(^|/|\\.)([Dd]ocker|[Cc]ontainer)file$",
              "(^|/)([Dd]ocker|[Cc]ontainer)file[^/]*$",
              ".*\\.ya?ml$"
            ],
            "matchStrings": [
              "(?:FROM|image:)[ ]+[\"']?(?<depName>[^@\"'\\s]+):(?<currentValue>[^:@\"'\\s]*alpine\\d+\\.\\d+[^:@\"'\\s]*)(?:@(?<currentDigest>sha256:[0-9a-f]+))?[\"']?\\s"
            ],
            "versioningTemplate": "regex:^(?<compatibility>.*alpine)(?<major>\\d+)\\.(?<minor>\\d+).*$",
            "datasourceTemplate": "docker"
          }
    ]
}
