digraph {

subgraph cluster_velero {   // perrepo
    label="Velero";         // perrepo
    color=grey;       // perrepo

    velero [color=cadetblue1, style=filled, label="Velero"]
}   // perrepo

    velero -> minio [label="store backups"]
}
