{
  "$schema": "https://docs.renovatebot.com/renovate-schema.json",
  "extends": [
    "config:best-practices"
  ],
  "configMigration": true,
  "pinDigests": true,
  "prHourlyLimit": 0,
  "labels": [
    "renovate-bot"
  ],
  "automerge": true,
  "automergeType": "pr",
  "platformAutomerge": true,
  "separateMinorPatch": true,
  "separateMajorMinor": true,
  "separateMultipleMajor": true,
  "ignorePaths": [],
  "postUpgradeTasks": {
    "commands": [
      "ci/post-update.sh"
    ],
    "fileFilters": [
      "**/**"
    ]
  },
  "dependencyDashboard": false,
  "kubernetes": {
    "fileMatch": [
      "^docker-hub-rate-limit-exporter/chart/templates.*\\.ya?ml(\\.tpl)?$",
      "^ingress/chart/templates.*\\.ya?ml(\\.tpl)?$",
      "^jaeger/chart/templates.*\\.ya?ml(\\.tpl)?$",
      "^kube-prometheus-stack/chart/templates.*\\.ya?ml(\\.tpl)?$",
      "^kube-prometheus-stack-crds/chart/templates.*\\.ya?ml(\\.tpl)?$",
      "^loki/chart/templates.*\\.ya?ml(\\.tpl)?$",
      "^tests/chart/templates.*\\.ya?ml(\\.tpl)?$"
    ]
  },
  "packageRules": [
    {
      "matchDatasources": [
        "docker"
      ],
      "matchPackageNames": [
        "viadee/docker-hub-rate-limit-exporter",
        "docker.io/viadee/docker-hub-rate-limit-exporter"
      ],
      "versioning": "regex:^(?<compatibility>.*)-v?(?<major>\\d+)(?:\\.(?<minor>\\d+)(?:\\.(?<patch>\\d+))?)?$"
    }
  ]
}
