{
  "$schema": "https://docs.renovatebot.com/renovate-schema.json",
  "extends": [
    "config:recommended"
  ],
  "pinDigests": true,
  "prHourlyLimit": 0,
  "labels": [
    "renovate-bot"
  ],
  "automerge": true,
  "automergeType": "pr",
  "platformAutomerge": true,
  "postUpgradeTasks": {
    "commands": [],
    "fileFilters": [
      "**/**"
    ]
  },
  "dependencyDashboard": false,
  "kubernetes": {
    "fileMatch": [
      "^registry/chart/templates.*\\.ya?ml(\\.tpl)?$",
      "^tests/chart/templates.*\\.ya?ml(\\.tpl)?$"
    ]
  }
}
