digraph {

subgraph cluster_cib {                  // perrepo
    label="Container Image Builder";    // perrepo
    color=grey;                         // perrepo

    cib_coordinator  [color=greenyellow, style=filled, label="Container Image Builder Server"]
    cib_workers      [color=greenyellow, style=filled, label="Container Image Builder Worker"]
    cib_mirror       [color=greenyellow, style=filled, label="Docker Hub Mirror"]
    cib_cache        [color=greenyellow, style=filled, label="Build Cache\n(Docker Registry)"]
}   // perrepo

    docker_hub       [color=red, label="Docker Hub"]

    cib_coordinator -> cib_workers [label="distributes docker\nbuilds between"]
    cib_workers     -> cib_mirror  [label="cache public\nimages via"]
    cib_mirror      -> docker_hub  [label="loads images from"]
    cib_workers     -> cib_cache   [label="push and pull\nimage builds"]
    cib_workers     -> cib_workers [label="builds images via\ndocker in docker\ncontainer in Pod"]

    cib_mirror -> storage_class [label="stores files in"]
    cib_cache -> storage_class [label="stores files in"]
}
