{
  "name": "Project",
  "plural": "Projects",
  "base": "PersistedModel",
  "idInjection": true,
  "options": {
    "validateUpsert": true
  },
  "mixins": {
    "RestrictAccess": {},
    "Timestamp": {}
  },
  "properties": {
    "title": {
      "type": "string",
      "default": ""
    },
    "description": {
      "type": "string",
      "default": ""
    },
    "state": {
      "type": "string",
      "default": "IDLE"
    },
    "startedAt": "date",
    "stoppedAt": "date"
  },
  "validations": [],
  "relations": {
    "user": {
      "type": "belongsTo",
      "model": "AppUser",
      "foreignKey": "userId",
      "options": {
        "disableInclude": true
      }
    }
  },
  "acls": [
    {
      "principalType": "ROLE",
      "principalId": "$everyone",
      "permission": "DENY"
    },
    {
      "principalType": "ROLE",
      "principalId": "admin",
      "permission": "ALLOW"
    },
    {
      "principalType": "ROLE",
      "principalId": "$owner",
      "permission": "ALLOW"
    },
    {
      "principalType": "ROLE",
      "principalId": "$authenticated",
      "permission": "ALLOW",
      "property": "find"
    },
    {
      "principalType": "ROLE",
      "principalId": "$authenticated",
      "permission": "ALLOW",
      "property": "create"
    },
    {
      "principalType": "ROLE",
      "principalId": "$authenticated",
      "permission": "ALLOW",
      "property": "stats"
    }
  ],
  "methods": {}
}
