module github.com/usvc/dev

go 1.13

require (
	github.com/StackExchange/wmi v0.0.0-20190523213315-cbe66965904d // indirect
	github.com/dustin/go-humanize v1.0.0
	github.com/gen2brain/beeep v0.0.0-20200420150314-13046a26d502
	github.com/getlantern/systray v0.0.0-20200324212034-d3ab4fd25d99
	github.com/ghodss/yaml v1.0.0
	github.com/go-git/go-git/v5 v5.0.0
	github.com/go-ole/go-ole v1.2.4 // indirect
	github.com/go-telegram-bot-api/telegram-bot-api v4.6.4+incompatible
	github.com/google/uuid v1.1.1
	github.com/gorilla/mux v1.7.4
	github.com/jroimartin/gocui v0.4.0
	github.com/kylelemons/godebug v1.1.0 // indirect
	github.com/mattn/go-runewidth v0.0.6 // indirect
	github.com/mattn/go-sqlite3 v2.0.3+incompatible
	github.com/nsf/termbox-go v0.0.0-20200418040025-38ba6e5628f1 // indirect
	github.com/sahilm/fuzzy v0.1.0
	github.com/sanity-io/litter v1.2.0
	github.com/shirou/gopsutil v2.20.4+incompatible
	github.com/spf13/cobra v0.0.7
	github.com/stretchr/testify v1.5.1
	github.com/technoweenie/multipartstreamer v1.0.1 // indirect
	github.com/usvc/go-config v0.2.2
	github.com/usvc/go-logger v0.6.3
	gopkg.in/yaml.v2 v2.2.4
)
