<?xml version="1.0" encoding="utf-8"?>
<!DOCTYPE eagle SYSTEM "eagle.dtd">
<eagle version="9.1.3">
<drawing>
<settings>
<setting alwaysvectorfont="no"/>
<setting verticaltext="up"/>
</settings>
<grid distance="10" unitdist="mil" unit="mil" style="lines" multiple="1" display="no" altdistance="5" altunitdist="mil" altunit="mil"/>
<layers>
<layer number="1" name="Top" color="4" fill="1" visible="yes" active="yes"/>
<layer number="2" name="Route2" color="16" fill="1" visible="no" active="no"/>
<layer number="3" name="Route3" color="17" fill="1" visible="no" active="no"/>
<layer number="4" name="Route4" color="18" fill="1" visible="no" active="no"/>
<layer number="5" name="Route5" color="19" fill="1" visible="no" active="no"/>
<layer number="6" name="Route6" color="25" fill="1" visible="no" active="no"/>
<layer number="7" name="Route7" color="26" fill="1" visible="no" active="no"/>
<layer number="8" name="Route8" color="27" fill="1" visible="no" active="no"/>
<layer number="9" name="Route9" color="28" fill="1" visible="no" active="no"/>
<layer number="10" name="Route10" color="29" fill="1" visible="no" active="no"/>
<layer number="11" name="Route11" color="30" fill="1" visible="no" active="no"/>
<layer number="12" name="Route12" color="20" fill="1" visible="no" active="no"/>
<layer number="13" name="Route13" color="21" fill="1" visible="no" active="no"/>
<layer number="14" name="Route14" color="22" fill="1" visible="no" active="no"/>
<layer number="15" name="Route15" color="23" fill="1" visible="no" active="no"/>
<layer number="16" name="Bottom" color="1" fill="1" visible="yes" active="yes"/>
<layer number="17" name="Pads" color="2" fill="1" visible="yes" active="yes"/>
<layer number="18" name="Vias" color="2" fill="1" visible="yes" active="yes"/>
<layer number="19" name="Unrouted" color="6" fill="1" visible="yes" active="yes"/>
<layer number="20" name="Dimension" color="24" fill="1" visible="yes" active="yes"/>
<layer number="21" name="tPlace" color="7" fill="1" visible="yes" active="yes"/>
<layer number="22" name="bPlace" color="7" fill="1" visible="yes" active="yes"/>
<layer number="23" name="tOrigins" color="15" fill="1" visible="yes" active="yes"/>
<layer number="24" name="bOrigins" color="15" fill="1" visible="yes" active="yes"/>
<layer number="25" name="tNames" color="7" fill="1" visible="yes" active="yes"/>
<layer number="26" name="bNames" color="7" fill="1" visible="yes" active="yes"/>
<layer number="27" name="tValues" color="7" fill="1" visible="yes" active="yes"/>
<layer number="28" name="bValues" color="7" fill="1" visible="yes" active="yes"/>
<layer number="29" name="tStop" color="7" fill="3" visible="no" active="yes"/>
<layer number="30" name="bStop" color="7" fill="6" visible="no" active="yes"/>
<layer number="31" name="tCream" color="7" fill="4" visible="no" active="yes"/>
<layer number="32" name="bCream" color="7" fill="5" visible="no" active="yes"/>
<layer number="33" name="tFinish" color="6" fill="3" visible="no" active="yes"/>
<layer number="34" name="bFinish" color="6" fill="6" visible="no" active="yes"/>
<layer number="35" name="tGlue" color="7" fill="4" visible="no" active="yes"/>
<layer number="36" name="bGlue" color="7" fill="5" visible="no" active="yes"/>
<layer number="37" name="tTest" color="7" fill="1" visible="no" active="yes"/>
<layer number="38" name="bTest" color="7" fill="1" visible="no" active="yes"/>
<layer number="39" name="tKeepout" color="4" fill="11" visible="yes" active="yes"/>
<layer number="40" name="bKeepout" color="1" fill="11" visible="yes" active="yes"/>
<layer number="41" name="tRestrict" color="4" fill="10" visible="yes" active="yes"/>
<layer number="42" name="bRestrict" color="1" fill="10" visible="yes" active="yes"/>
<layer number="43" name="vRestrict" color="2" fill="10" visible="yes" active="yes"/>
<layer number="44" name="Drills" color="7" fill="1" visible="no" active="yes"/>
<layer number="45" name="Holes" color="7" fill="1" visible="no" active="yes"/>
<layer number="46" name="Milling" color="3" fill="1" visible="no" active="yes"/>
<layer number="47" name="Measures" color="7" fill="1" visible="no" active="yes"/>
<layer number="48" name="Document" color="7" fill="1" visible="yes" active="yes"/>
<layer number="49" name="Reference" color="7" fill="1" visible="yes" active="yes"/>
<layer number="50" name="dxf" color="7" fill="1" visible="no" active="no"/>
<layer number="51" name="tDocu" color="7" fill="1" visible="yes" active="yes"/>
<layer number="52" name="bDocu" color="7" fill="1" visible="yes" active="yes"/>
<layer number="53" name="tGND_GNDA" color="7" fill="9" visible="no" active="no"/>
<layer number="54" name="bGND_GNDA" color="1" fill="9" visible="no" active="no"/>
<layer number="56" name="wert" color="7" fill="1" visible="no" active="no"/>
<layer number="57" name="tCAD" color="7" fill="1" visible="no" active="no"/>
<layer number="59" name="tCarbon" color="7" fill="1" visible="no" active="no"/>
<layer number="60" name="bCarbon" color="7" fill="1" visible="no" active="no"/>
<layer number="88" name="SimResults" color="9" fill="1" visible="no" active="no"/>
<layer number="89" name="SimProbes" color="9" fill="1" visible="no" active="no"/>
<layer number="90" name="Modules" color="5" fill="1" visible="no" active="no"/>
<layer number="91" name="Nets" color="2" fill="1" visible="no" active="no"/>
<layer number="92" name="Busses" color="1" fill="1" visible="no" active="no"/>
<layer number="93" name="Pins" color="2" fill="1" visible="no" active="no"/>
<layer number="94" name="Symbols" color="4" fill="1" visible="no" active="no"/>
<layer number="95" name="Names" color="7" fill="1" visible="no" active="no"/>
<layer number="96" name="Values" color="7" fill="1" visible="no" active="no"/>
<layer number="97" name="Info" color="7" fill="1" visible="no" active="no"/>
<layer number="98" name="Guide" color="6" fill="1" visible="no" active="no"/>
<layer number="99" name="SpiceOrder" color="7" fill="1" visible="no" active="no"/>
<layer number="100" name="Release" color="7" fill="1" visible="no" active="no"/>
<layer number="101" name="Heatsink" color="1" fill="7" visible="no" active="no"/>
<layer number="102" name="tMarkings" color="1" fill="7" visible="no" active="no"/>
<layer number="103" name="bMarkings" color="1" fill="7" visible="no" active="no"/>
<layer number="104" name="tSchirm" color="7" fill="4" visible="no" active="no"/>
<layer number="105" name="bSchirm" color="7" fill="5" visible="no" active="no"/>
<layer number="106" name="shield" color="11" fill="1" visible="no" active="no"/>
<layer number="107" name="ShieldTop" color="12" fill="1" visible="no" active="no"/>
<layer number="108" name="MeasuresWall" color="7" fill="1" visible="no" active="no"/>
<layer number="109" name="SYSONDER" color="7" fill="1" visible="no" active="no"/>
<layer number="110" name="fp0" color="7" fill="1" visible="yes" active="yes"/>
<layer number="111" name="tStopDoku" color="7" fill="1" visible="no" active="no"/>
<layer number="112" name="bStopDoku" color="7" fill="1" visible="no" active="no"/>
<layer number="113" name="bTPoint" color="7" fill="1" visible="no" active="no"/>
<layer number="114" name="Änderung" color="7" fill="1" visible="no" active="no"/>
<layer number="115" name="Component" color="7" fill="1" visible="yes" active="yes"/>
<layer number="116" name="Patch_BOT" color="7" fill="1" visible="no" active="no"/>
<layer number="117" name="housing" color="7" fill="1" visible="yes" active="yes"/>
<layer number="118" name="PCB" color="7" fill="1" visible="yes" active="yes"/>
<layer number="119" name="Layout_Info" color="7" fill="1" visible="yes" active="yes"/>
<layer number="120" name="lotbs" color="7" fill="1" visible="no" active="no"/>
<layer number="121" name="lotls" color="7" fill="1" visible="no" active="no"/>
<layer number="122" name="bTestdril" color="7" fill="1" visible="no" active="no"/>
<layer number="123" name="BOHRFILM" color="7" fill="1" visible="no" active="no"/>
<layer number="124" name="bTestmark" color="7" fill="1" visible="no" active="no"/>
<layer number="125" name="_tNames" color="7" fill="1" visible="no" active="no"/>
<layer number="126" name="_bNames" color="7" fill="1" visible="no" active="no"/>
<layer number="127" name="Mods" color="7" fill="1" visible="yes" active="yes"/>
<layer number="128" name="_bValues" color="7" fill="1" visible="yes" active="yes"/>
<layer number="129" name="Mask" color="7" fill="1" visible="yes" active="yes"/>
<layer number="131" name="tAdjust" color="7" fill="1" visible="no" active="no"/>
<layer number="132" name="bAdjust" color="7" fill="1" visible="no" active="no"/>
<layer number="144" name="DrillLegend" color="7" fill="1" visible="yes" active="yes"/>
<layer number="148" name="Document_mirrored" color="7" fill="1" visible="no" active="no"/>
<layer number="150" name="References" color="4" fill="1" visible="no" active="no"/>
<layer number="151" name="FaceHelp" color="5" fill="1" visible="no" active="no"/>
<layer number="152" name="FaceFrame" color="6" fill="1" visible="no" active="no"/>
<layer number="153" name="FacePlate" color="2" fill="1" visible="no" active="no"/>
<layer number="154" name="FaceLabel" color="7" fill="1" visible="no" active="no"/>
<layer number="155" name="FabDoc3" color="7" fill="1" visible="yes" active="yes"/>
<layer number="156" name="gesam-Maß" color="1" fill="7" visible="no" active="no"/>
<layer number="157" name="FaceMchng" color="3" fill="1" visible="no" active="no"/>
<layer number="158" name="FaceMMeas" color="3" fill="1" visible="no" active="no"/>
<layer number="159" name="Geh-Bear2" color="1" fill="7" visible="no" active="no"/>
<layer number="160" name="Topologie" color="9" fill="1" visible="no" active="no"/>
<layer number="161" name="tomplace2" color="7" fill="1" visible="no" active="no"/>
<layer number="199" name="Bauteile" color="7" fill="1" visible="no" active="no"/>
<layer number="200" name="200bmp" color="1" fill="10" visible="no" active="no"/>
<layer number="201" name="bBauteile" color="1" fill="7" visible="no" active="no"/>
<layer number="202" name="value" color="7" fill="1" visible="no" active="no"/>
<layer number="203" name="no" color="7" fill="1" visible="no" active="no"/>
<layer number="204" name="204bmp" color="7" fill="1" visible="no" active="no"/>
<layer number="205" name="205bmp" color="7" fill="1" visible="no" active="no"/>
<layer number="206" name="206bmp" color="7" fill="1" visible="no" active="no"/>
<layer number="207" name="207bmp" color="7" fill="1" visible="no" active="no"/>
<layer number="208" name="208bmp" color="7" fill="1" visible="no" active="no"/>
<layer number="209" name="209bmp" color="7" fill="1" visible="no" active="no"/>
<layer number="210" name="tPNR" color="7" fill="1" visible="no" active="no"/>
<layer number="211" name="bPNR" color="7" fill="1" visible="no" active="no"/>
<layer number="212" name="212bmp" color="7" fill="1" visible="yes" active="yes"/>
<layer number="213" name="213bmp" color="7" fill="1" visible="yes" active="yes"/>
<layer number="214" name="214bmp" color="7" fill="1" visible="yes" active="yes"/>
<layer number="215" name="215bmp" color="7" fill="1" visible="yes" active="yes"/>
<layer number="216" name="216bmp" color="7" fill="1" visible="yes" active="yes"/>
<layer number="217" name="217bmp" color="18" fill="1" visible="no" active="no"/>
<layer number="218" name="218bmp" color="19" fill="1" visible="no" active="no"/>
<layer number="219" name="219bmp" color="20" fill="1" visible="no" active="no"/>
<layer number="220" name="ausheb_u" color="7" fill="1" visible="no" active="no"/>
<layer number="221" name="ausheb_o" color="7" fill="1" visible="no" active="no"/>
<layer number="222" name="frontpla" color="7" fill="1" visible="no" active="no"/>
<layer number="223" name="223bmp" color="24" fill="1" visible="no" active="no"/>
<layer number="224" name="224bmp" color="25" fill="1" visible="no" active="no"/>
<layer number="225" name="225bmp" color="7" fill="1" visible="yes" active="yes"/>
<layer number="226" name="226bmp" color="7" fill="1" visible="yes" active="yes"/>
<layer number="227" name="227bmp" color="7" fill="1" visible="yes" active="yes"/>
<layer number="228" name="228bmp" color="7" fill="1" visible="yes" active="yes"/>
<layer number="229" name="229bmp" color="7" fill="1" visible="yes" active="yes"/>
<layer number="230" name="230bmp" color="7" fill="1" visible="yes" active="yes"/>
<layer number="231" name="231bmp" color="7" fill="1" visible="yes" active="yes"/>
<layer number="248" name="PLCDoku" color="7" fill="1" visible="no" active="no"/>
<layer number="249" name="MillDoku" color="7" fill="1" visible="no" active="no"/>
<layer number="250" name="Descript" color="3" fill="1" visible="no" active="no"/>
<layer number="251" name="SMDround" color="12" fill="11" visible="no" active="no"/>
<layer number="252" name="BR-BS" color="7" fill="1" visible="no" active="no"/>
<layer number="253" name="BR-LS" color="7" fill="1" visible="no" active="no"/>
<layer number="254" name="OrgLBR" color="13" fill="1" visible="no" active="no"/>
<layer number="255" name="ZchnBlatt" color="7" fill="1" visible="no" active="no"/>
</layers>
<board>
<plain>
<wire x1="0" y1="11.4" x2="0" y2="100" width="0" layer="20"/>
<wire x1="0" y1="100" x2="89" y2="100" width="0" layer="20"/>
<wire x1="89" y1="100" x2="100" y2="100" width="0" layer="20"/>
<wire x1="100" y1="100" x2="100" y2="11.4" width="0" layer="20"/>
<text x="47.498" y="76.962" size="1.016" layer="25" rot="R90">5V/GND/Press</text>
<text x="9.144" y="77.216" size="1.016" layer="25" rot="R90">5V/GND/Water</text>
<text x="8.128" y="14.732" size="1.016" layer="25" rot="R90">PWM1</text>
<text x="8.382" y="22.098" size="1.016" layer="25" rot="R90">PWM2</text>
<text x="8.89" y="30.734" size="1.016" layer="25" rot="R90">PWM3</text>
<text x="9.144" y="38.608" size="1.016" layer="25" rot="R90">PWM4</text>
<text x="9.144" y="47.498" size="1.016" layer="25" rot="R90">PWM5</text>
<text x="8.89" y="55.118" size="1.016" layer="25" rot="R90">PWM6</text>
<text x="9.144" y="62.992" size="1.016" layer="25" rot="R90">GND/SDA/SCL/3.3V</text>
<text x="48.006" y="15.24" size="1.016" layer="25" rot="R90">PWM7</text>
<text x="48.006" y="22.606" size="1.016" layer="25" rot="R90">PWM8</text>
<text x="48.514" y="31.496" size="1.016" layer="25" rot="R90">PWM9</text>
<text x="48.006" y="39.116" size="1.016" layer="25" rot="R90">PWM10</text>
<text x="48.768" y="47.498" size="1.016" layer="25" rot="R90">PWM11</text>
<text x="48.768" y="55.118" size="1.016" layer="25" rot="R90">PWM12</text>
<text x="56.642" y="27.432" size="1.778" layer="25" rot="R90">PWM: Sig/Pwr/Gnd</text>
<text x="9.652" y="89.154" size="1.016" layer="25" rot="R90">GND/KILLSW</text>
</plain>
<libraries>
<library name="AggieMarineRobotics">
<packages>
<package name="120PIN_EDGE_BOARD">
<smd name="GND1" x="30.4" y="-5.8" dx="7" dy="7" layer="1" rot="R90"/>
<smd name="PWR1" x="21.3" y="-5.8" dx="7" dy="7" layer="1" rot="R90"/>
<smd name="A1" x="36.4" y="-8.85" dx="2.5" dy="0.5" layer="1" rot="R90"/>
<smd name="A2" x="37.2" y="-8.85" dx="2.5" dy="0.5" layer="1" rot="R90"/>
<smd name="A3" x="38" y="-8.85" dx="2.5" dy="0.5" layer="1" rot="R90"/>
<smd name="A4" x="38.8" y="-8.85" dx="2.5" dy="0.5" layer="1" rot="R90"/>
<smd name="GND2" x="30.4" y="-5.8" dx="7" dy="7" layer="16" rot="R90"/>
<smd name="PWR2" x="21.3" y="-5.8" dx="7" dy="7" layer="16" rot="R90" thermals="no"/>
<smd name="B1" x="36" y="-8.85" dx="2.5" dy="0.5" layer="16" rot="R90"/>
<smd name="B2" x="36.8" y="-8.85" dx="2.5" dy="0.5" layer="16" rot="R90"/>
<smd name="B3" x="37.6" y="-8.85" dx="2.5" dy="0.5" layer="16" rot="R90"/>
<wire x1="35.55" y1="-4" x2="35" y2="-3.45" width="0" layer="20" curve="90"/>
<wire x1="35" y1="-3.45" x2="34.45" y2="-4" width="0" layer="20" curve="90"/>
<wire x1="34.45" y1="-4" x2="34.45" y2="-10.9" width="0" layer="20"/>
<wire x1="34.45" y1="-10.9" x2="33.95" y2="-11.4" width="0" layer="20"/>
<wire x1="33.95" y1="-11.4" x2="17.85" y2="-11.4" width="0" layer="20"/>
<wire x1="35.55" y1="-4" x2="35.55" y2="-10.9" width="0" layer="20"/>
<wire x1="35.55" y1="-10.9" x2="36.05" y2="-11.4" width="0" layer="20"/>
<wire x1="36.05" y1="-11.4" x2="84.3" y2="-11.4" width="0" layer="20"/>
<wire x1="84.3" y1="-11.4" x2="84.8" y2="-10.9" width="0" layer="20"/>
<wire x1="84.8" y1="-10.9" x2="84.8" y2="0" width="0" layer="20"/>
<wire x1="17.85" y1="-11.4" x2="17.35" y2="-10.9" width="0" layer="20"/>
<wire x1="17.35" y1="-10.9" x2="17.35" y2="0" width="0" layer="20"/>
<smd name="B4" x="38.4" y="-8.85" dx="2.5" dy="0.5" layer="16" rot="R90"/>
<smd name="A5" x="39.6" y="-8.85" dx="2.5" dy="0.5" layer="1" rot="R90"/>
<smd name="A6" x="40.4" y="-8.85" dx="2.5" dy="0.5" layer="1" rot="R90"/>
<smd name="A7" x="41.2" y="-8.85" dx="2.5" dy="0.5" layer="1" rot="R90"/>
<smd name="A8" x="42" y="-8.85" dx="2.5" dy="0.5" layer="1" rot="R90"/>
<smd name="B5" x="39.2" y="-8.85" dx="2.5" dy="0.5" layer="16" rot="R90"/>
<smd name="B6" x="40" y="-8.85" dx="2.5" dy="0.5" layer="16" rot="R90"/>
<smd name="B7" x="40.8" y="-8.85" dx="2.5" dy="0.5" layer="16" rot="R90"/>
<smd name="B8" x="41.6" y="-8.85" dx="2.5" dy="0.5" layer="16" rot="R90"/>
<smd name="A9" x="42.8" y="-8.85" dx="2.5" dy="0.5" layer="1" rot="R90"/>
<smd name="A10" x="43.6" y="-8.85" dx="2.5" dy="0.5" layer="1" rot="R90"/>
<smd name="A11" x="44.4" y="-8.85" dx="2.5" dy="0.5" layer="1" rot="R90"/>
<smd name="A12" x="45.2" y="-8.85" dx="2.5" dy="0.5" layer="1" rot="R90"/>
<smd name="B9" x="42.4" y="-8.85" dx="2.5" dy="0.5" layer="16" rot="R90"/>
<smd name="B10" x="43.2" y="-8.85" dx="2.5" dy="0.5" layer="16" rot="R90"/>
<smd name="B11" x="44" y="-8.85" dx="2.5" dy="0.5" layer="16" rot="R90"/>
<smd name="B12" x="44.8" y="-8.85" dx="2.5" dy="0.5" layer="16" rot="R90"/>
<smd name="A13" x="46" y="-8.85" dx="2.5" dy="0.5" layer="1" rot="R90"/>
<smd name="A14" x="46.8" y="-8.85" dx="2.5" dy="0.5" layer="1" rot="R90"/>
<smd name="A15" x="47.6" y="-8.85" dx="2.5" dy="0.5" layer="1" rot="R90"/>
<smd name="A16" x="48.4" y="-8.85" dx="2.5" dy="0.5" layer="1" rot="R90"/>
<smd name="B13" x="45.6" y="-8.85" dx="2.5" dy="0.5" layer="16" rot="R90"/>
<smd name="B14" x="46.4" y="-8.85" dx="2.5" dy="0.5" layer="16" rot="R90"/>
<smd name="B15" x="47.2" y="-8.85" dx="2.5" dy="0.5" layer="16" rot="R90"/>
<smd name="B16" x="48" y="-8.85" dx="2.5" dy="0.5" layer="16" rot="R90"/>
<smd name="A17" x="49.2" y="-8.85" dx="2.5" dy="0.5" layer="1" rot="R90"/>
<smd name="A18" x="50" y="-8.85" dx="2.5" dy="0.5" layer="1" rot="R90"/>
<smd name="A19" x="50.8" y="-8.85" dx="2.5" dy="0.5" layer="1" rot="R90"/>
<smd name="A20" x="51.6" y="-8.85" dx="2.5" dy="0.5" layer="1" rot="R90"/>
<smd name="B17" x="48.8" y="-8.85" dx="2.5" dy="0.5" layer="16" rot="R90"/>
<smd name="B18" x="49.6" y="-8.85" dx="2.5" dy="0.5" layer="16" rot="R90"/>
<smd name="B19" x="50.4" y="-8.85" dx="2.5" dy="0.5" layer="16" rot="R90"/>
<smd name="B20" x="51.2" y="-8.85" dx="2.5" dy="0.5" layer="16" rot="R90"/>
<smd name="A21" x="52.4" y="-8.85" dx="2.5" dy="0.5" layer="1" rot="R90"/>
<smd name="A22" x="53.2" y="-8.85" dx="2.5" dy="0.5" layer="1" rot="R90"/>
<smd name="A23" x="54" y="-8.85" dx="2.5" dy="0.5" layer="1" rot="R90"/>
<smd name="A24" x="54.8" y="-8.85" dx="2.5" dy="0.5" layer="1" rot="R90"/>
<smd name="B21" x="52" y="-8.85" dx="2.5" dy="0.5" layer="16" rot="R90"/>
<smd name="B22" x="52.8" y="-8.85" dx="2.5" dy="0.5" layer="16" rot="R90"/>
<smd name="B23" x="53.6" y="-8.85" dx="2.5" dy="0.5" layer="16" rot="R90"/>
<smd name="B24" x="54.4" y="-8.85" dx="2.5" dy="0.5" layer="16" rot="R90"/>
<smd name="A25" x="55.6" y="-8.85" dx="2.5" dy="0.5" layer="1" rot="R90"/>
<smd name="A26" x="56.4" y="-8.85" dx="2.5" dy="0.5" layer="1" rot="R90"/>
<smd name="A27" x="57.2" y="-8.85" dx="2.5" dy="0.5" layer="1" rot="R90"/>
<smd name="A28" x="58" y="-8.85" dx="2.5" dy="0.5" layer="1" rot="R90"/>
<smd name="B25" x="55.2" y="-8.85" dx="2.5" dy="0.5" layer="16" rot="R90"/>
<smd name="B26" x="56" y="-8.85" dx="2.5" dy="0.5" layer="16" rot="R90"/>
<smd name="B27" x="56.8" y="-8.85" dx="2.5" dy="0.5" layer="16" rot="R90"/>
<smd name="B28" x="57.6" y="-8.85" dx="2.5" dy="0.5" layer="16" rot="R90"/>
<smd name="A29" x="58.8" y="-8.85" dx="2.5" dy="0.5" layer="1" rot="R90"/>
<smd name="A30" x="59.6" y="-8.85" dx="2.5" dy="0.5" layer="1" rot="R90"/>
<smd name="A31" x="60.4" y="-8.85" dx="2.5" dy="0.5" layer="1" rot="R90"/>
<smd name="A32" x="61.2" y="-8.85" dx="2.5" dy="0.5" layer="1" rot="R90"/>
<smd name="B29" x="58.4" y="-8.85" dx="2.5" dy="0.5" layer="16" rot="R90"/>
<smd name="B30" x="59.2" y="-8.85" dx="2.5" dy="0.5" layer="16" rot="R90"/>
<smd name="B31" x="60" y="-8.85" dx="2.5" dy="0.5" layer="16" rot="R90"/>
<smd name="B32" x="60.8" y="-8.85" dx="2.5" dy="0.5" layer="16" rot="R90"/>
<smd name="A33" x="62" y="-8.85" dx="2.5" dy="0.5" layer="1" rot="R90"/>
<smd name="A34" x="62.8" y="-8.85" dx="2.5" dy="0.5" layer="1" rot="R90"/>
<smd name="A35" x="63.6" y="-8.85" dx="2.5" dy="0.5" layer="1" rot="R90"/>
<smd name="A36" x="64.4" y="-8.85" dx="2.5" dy="0.5" layer="1" rot="R90"/>
<smd name="B33" x="61.6" y="-8.85" dx="2.5" dy="0.5" layer="16" rot="R90"/>
<smd name="B34" x="62.4" y="-8.85" dx="2.5" dy="0.5" layer="16" rot="R90"/>
<smd name="B35" x="63.2" y="-8.85" dx="2.5" dy="0.5" layer="16" rot="R90"/>
<smd name="B36" x="64" y="-8.85" dx="2.5" dy="0.5" layer="16" rot="R90"/>
<smd name="A37" x="65.2" y="-8.85" dx="2.5" dy="0.5" layer="1" rot="R90"/>
<smd name="A38" x="66" y="-8.85" dx="2.5" dy="0.5" layer="1" rot="R90"/>
<smd name="A39" x="66.8" y="-8.85" dx="2.5" dy="0.5" layer="1" rot="R90"/>
<smd name="A40" x="67.6" y="-8.85" dx="2.5" dy="0.5" layer="1" rot="R90"/>
<smd name="B37" x="64.8" y="-8.85" dx="2.5" dy="0.5" layer="16" rot="R90"/>
<smd name="B38" x="65.6" y="-8.85" dx="2.5" dy="0.5" layer="16" rot="R90"/>
<smd name="B39" x="66.4" y="-8.85" dx="2.5" dy="0.5" layer="16" rot="R90"/>
<smd name="B40" x="67.2" y="-8.85" dx="2.5" dy="0.5" layer="16" rot="R90"/>
<smd name="A41" x="68.4" y="-8.85" dx="2.5" dy="0.5" layer="1" rot="R90"/>
<smd name="A42" x="69.2" y="-8.85" dx="2.5" dy="0.5" layer="1" rot="R90"/>
<smd name="A43" x="70" y="-8.85" dx="2.5" dy="0.5" layer="1" rot="R90"/>
<smd name="A44" x="70.8" y="-8.85" dx="2.5" dy="0.5" layer="1" rot="R90"/>
<smd name="B41" x="68" y="-8.85" dx="2.5" dy="0.5" layer="16" rot="R90"/>
<smd name="B42" x="68.8" y="-8.85" dx="2.5" dy="0.5" layer="16" rot="R90"/>
<smd name="B43" x="69.6" y="-8.85" dx="2.5" dy="0.5" layer="16" rot="R90"/>
<smd name="B44" x="70.4" y="-8.85" dx="2.5" dy="0.5" layer="16" rot="R90"/>
<smd name="A45" x="71.6" y="-8.85" dx="2.5" dy="0.5" layer="1" rot="R90"/>
<smd name="A46" x="72.4" y="-8.85" dx="2.5" dy="0.5" layer="1" rot="R90"/>
<smd name="A47" x="73.2" y="-8.85" dx="2.5" dy="0.5" layer="1" rot="R90"/>
<smd name="A48" x="74" y="-8.85" dx="2.5" dy="0.5" layer="1" rot="R90"/>
<smd name="B45" x="71.2" y="-8.85" dx="2.5" dy="0.5" layer="16" rot="R90"/>
<smd name="B46" x="72" y="-8.85" dx="2.5" dy="0.5" layer="16" rot="R90"/>
<smd name="B47" x="72.8" y="-8.85" dx="2.5" dy="0.5" layer="16" rot="R90"/>
<smd name="B48" x="73.6" y="-8.85" dx="2.5" dy="0.5" layer="16" rot="R90"/>
<smd name="A49" x="74.8" y="-8.85" dx="2.5" dy="0.5" layer="1" rot="R90"/>
<smd name="A50" x="75.6" y="-8.85" dx="2.5" dy="0.5" layer="1" rot="R90"/>
<smd name="A51" x="76.4" y="-8.85" dx="2.5" dy="0.5" layer="1" rot="R90"/>
<smd name="A52" x="77.2" y="-8.85" dx="2.5" dy="0.5" layer="1" rot="R90"/>
<smd name="B49" x="74.4" y="-8.85" dx="2.5" dy="0.5" layer="16" rot="R90"/>
<smd name="B50" x="75.2" y="-8.85" dx="2.5" dy="0.5" layer="16" rot="R90"/>
<smd name="B51" x="76" y="-8.85" dx="2.5" dy="0.5" layer="16" rot="R90"/>
<smd name="B52" x="76.8" y="-8.85" dx="2.5" dy="0.5" layer="16" rot="R90"/>
<smd name="A53" x="78" y="-8.85" dx="2.5" dy="0.5" layer="1" rot="R90"/>
<smd name="A54" x="78.8" y="-8.85" dx="2.5" dy="0.5" layer="1" rot="R90"/>
<smd name="A55" x="79.6" y="-8.85" dx="2.5" dy="0.5" layer="1" rot="R90"/>
<smd name="A56" x="80.4" y="-8.85" dx="2.5" dy="0.5" layer="1" rot="R90"/>
<smd name="B53" x="77.6" y="-8.85" dx="2.5" dy="0.5" layer="16" rot="R90"/>
<smd name="B54" x="78.4" y="-8.85" dx="2.5" dy="0.5" layer="16" rot="R90"/>
<smd name="B55" x="79.2" y="-8.85" dx="2.5" dy="0.5" layer="16" rot="R90"/>
<smd name="B56" x="80" y="-8.85" dx="2.5" dy="0.5" layer="16" rot="R90"/>
<smd name="A57" x="81.2" y="-8.85" dx="2.5" dy="0.5" layer="1" rot="R90"/>
<smd name="A58" x="82" y="-8.85" dx="2.5" dy="0.5" layer="1" rot="R90"/>
<smd name="A59" x="82.8" y="-8.85" dx="2.5" dy="0.5" layer="1" rot="R90"/>
<smd name="A60" x="83.6" y="-8.85" dx="2.5" dy="0.5" layer="1" rot="R90"/>
<smd name="B57" x="80.8" y="-8.85" dx="2.5" dy="0.5" layer="16" rot="R90"/>
<smd name="B58" x="81.6" y="-8.85" dx="2.5" dy="0.5" layer="16" rot="R90"/>
<smd name="B59" x="82.4" y="-8.85" dx="2.5" dy="0.5" layer="16" rot="R90"/>
<smd name="B60" x="83.2" y="-8.85" dx="2.5" dy="0.5" layer="16" rot="R90"/>
<wire x1="17.35" y1="0" x2="0" y2="0" width="0" layer="20"/>
<wire x1="84.8" y1="0" x2="100" y2="0" width="0" layer="20"/>
</package>
</packages>
</library>
<library name="con-lstb" urn="urn:adsk.eagle:library:162">
<description>&lt;b&gt;Pin Headers&lt;/b&gt;&lt;p&gt;
Naming:&lt;p&gt;
MA = male&lt;p&gt;
# contacts - # rows&lt;p&gt;
W = angled&lt;p&gt;
&lt;author&gt;Created by librarian@cadsoft.de&lt;/author&gt;</description>
<packages>
<package name="MA04-1" urn="urn:adsk.eagle:footprint:8285/1" library_version="1">
<description>&lt;b&gt;PIN HEADER&lt;/b&gt;</description>
<wire x1="-4.445" y1="1.27" x2="-3.175" y2="1.27" width="0.1524" layer="21"/>
<wire x1="-3.175" y1="1.27" x2="-2.54" y2="0.635" width="0.1524" layer="21"/>
<wire x1="-2.54" y1="-0.635" x2="-3.175" y2="-1.27" width="0.1524" layer="21"/>
<wire x1="-2.54" y1="0.635" x2="-1.905" y2="1.27" width="0.1524" layer="21"/>
<wire x1="-1.905" y1="1.27" x2="-0.635" y2="1.27" width="0.1524" layer="21"/>
<wire x1="-0.635" y1="1.27" x2="0" y2="0.635" width="0.1524" layer="21"/>
<wire x1="0" y1="-0.635" x2="-0.635" y2="-1.27" width="0.1524" layer="21"/>
<wire x1="-0.635" y1="-1.27" x2="-1.905" y2="-1.27" width="0.1524" layer="21"/>
<wire x1="-1.905" y1="-1.27" x2="-2.54" y2="-0.635" width="0.1524" layer="21"/>
<wire x1="-5.08" y1="0.635" x2="-5.08" y2="-0.635" width="0.1524" layer="21"/>
<wire x1="-4.445" y1="1.27" x2="-5.08" y2="0.635" width="0.1524" layer="21"/>
<wire x1="-5.08" y1="-0.635" x2="-4.445" y2="-1.27" width="0.1524" layer="21"/>
<wire x1="-3.175" y1="-1.27" x2="-4.445" y2="-1.27" width="0.1524" layer="21"/>
<wire x1="0" y1="0.635" x2="0.635" y2="1.27" width="0.1524" layer="21"/>
<wire x1="0.635" y1="1.27" x2="1.905" y2="1.27" width="0.1524" layer="21"/>
<wire x1="1.905" y1="1.27" x2="2.54" y2="0.635" width="0.1524" layer="21"/>
<wire x1="2.54" y1="-0.635" x2="1.905" y2="-1.27" width="0.1524" layer="21"/>
<wire x1="1.905" y1="-1.27" x2="0.635" y2="-1.27" width="0.1524" layer="21"/>
<wire x1="0.635" y1="-1.27" x2="0" y2="-0.635" width="0.1524" layer="21"/>
<wire x1="3.175" y1="1.27" x2="4.445" y2="1.27" width="0.1524" layer="21"/>
<wire x1="4.445" y1="1.27" x2="5.08" y2="0.635" width="0.1524" layer="21"/>
<wire x1="5.08" y1="0.635" x2="5.08" y2="-0.635" width="0.1524" layer="21"/>
<wire x1="5.08" y1="-0.635" x2="4.445" y2="-1.27" width="0.1524" layer="21"/>
<wire x1="3.175" y1="1.27" x2="2.54" y2="0.635" width="0.1524" layer="21"/>
<wire x1="2.54" y1="-0.635" x2="3.175" y2="-1.27" width="0.1524" layer="21"/>
<wire x1="4.445" y1="-1.27" x2="3.175" y2="-1.27" width="0.1524" layer="21"/>
<pad name="1" x="-3.81" y="0" drill="1.016" shape="long" rot="R90"/>
<pad name="2" x="-1.27" y="0" drill="1.016" shape="long" rot="R90"/>
<pad name="3" x="1.27" y="0" drill="1.016" shape="long" rot="R90"/>
<pad name="4" x="3.81" y="0" drill="1.016" shape="long" rot="R90"/>
<text x="-5.08" y="1.651" size="1.27" layer="25" ratio="10">&gt;NAME</text>
<text x="-6.223" y="-0.635" size="1.27" layer="21" ratio="10">1</text>
<text x="0.635" y="1.651" size="1.27" layer="27" ratio="10">&gt;VALUE</text>
<text x="5.334" y="-0.635" size="1.27" layer="21" ratio="10">4</text>
<rectangle x1="-1.524" y1="-0.254" x2="-1.016" y2="0.254" layer="51"/>
<rectangle x1="-4.064" y1="-0.254" x2="-3.556" y2="0.254" layer="51"/>
<rectangle x1="1.016" y1="-0.254" x2="1.524" y2="0.254" layer="51"/>
<rectangle x1="3.556" y1="-0.254" x2="4.064" y2="0.254" layer="51"/>
</package>
<package name="MA06-1" urn="urn:adsk.eagle:footprint:8287/1" library_version="1">
<description>&lt;b&gt;PIN HEADER&lt;/b&gt;</description>
<wire x1="-6.985" y1="1.27" x2="-5.715" y2="1.27" width="0.1524" layer="21"/>
<wire x1="-5.715" y1="1.27" x2="-5.08" y2="0.635" width="0.1524" layer="21"/>
<wire x1="-5.08" y1="-0.635" x2="-5.715" y2="-1.27" width="0.1524" layer="21"/>
<wire x1="-5.08" y1="0.635" x2="-4.445" y2="1.27" width="0.1524" layer="21"/>
<wire x1="-4.445" y1="1.27" x2="-3.175" y2="1.27" width="0.1524" layer="21"/>
<wire x1="-3.175" y1="1.27" x2="-2.54" y2="0.635" width="0.1524" layer="21"/>
<wire x1="-2.54" y1="-0.635" x2="-3.175" y2="-1.27" width="0.1524" layer="21"/>
<wire x1="-3.175" y1="-1.27" x2="-4.445" y2="-1.27" width="0.1524" layer="21"/>
<wire x1="-4.445" y1="-1.27" x2="-5.08" y2="-0.635" width="0.1524" layer="21"/>
<wire x1="-7.62" y1="0.635" x2="-7.62" y2="-0.635" width="0.1524" layer="21"/>
<wire x1="-6.985" y1="1.27" x2="-7.62" y2="0.635" width="0.1524" layer="21"/>
<wire x1="-7.62" y1="-0.635" x2="-6.985" y2="-1.27" width="0.1524" layer="21"/>
<wire x1="-5.715" y1="-1.27" x2="-6.985" y2="-1.27" width="0.1524" layer="21"/>
<wire x1="-2.54" y1="0.635" x2="-1.905" y2="1.27" width="0.1524" layer="21"/>
<wire x1="-1.905" y1="1.27" x2="-0.635" y2="1.27" width="0.1524" layer="21"/>
<wire x1="-0.635" y1="1.27" x2="0" y2="0.635" width="0.1524" layer="21"/>
<wire x1="0" y1="-0.635" x2="-0.635" y2="-1.27" width="0.1524" layer="21"/>
<wire x1="-0.635" y1="-1.27" x2="-1.905" y2="-1.27" width="0.1524" layer="21"/>
<wire x1="-1.905" y1="-1.27" x2="-2.54" y2="-0.635" width="0.1524" layer="21"/>
<wire x1="0.635" y1="1.27" x2="1.905" y2="1.27" width="0.1524" layer="21"/>
<wire x1="1.905" y1="1.27" x2="2.54" y2="0.635" width="0.1524" layer="21"/>
<wire x1="2.54" y1="-0.635" x2="1.905" y2="-1.27" width="0.1524" layer="21"/>
<wire x1="2.54" y1="0.635" x2="3.175" y2="1.27" width="0.1524" layer="21"/>
<wire x1="3.175" y1="1.27" x2="4.445" y2="1.27" width="0.1524" layer="21"/>
<wire x1="4.445" y1="1.27" x2="5.08" y2="0.635" width="0.1524" layer="21"/>
<wire x1="5.08" y1="-0.635" x2="4.445" y2="-1.27" width="0.1524" layer="21"/>
<wire x1="4.445" y1="-1.27" x2="3.175" y2="-1.27" width="0.1524" layer="21"/>
<wire x1="3.175" y1="-1.27" x2="2.54" y2="-0.635" width="0.1524" layer="21"/>
<wire x1="0.635" y1="1.27" x2="0" y2="0.635" width="0.1524" layer="21"/>
<wire x1="0" y1="-0.635" x2="0.635" y2="-1.27" width="0.1524" layer="21"/>
<wire x1="1.905" y1="-1.27" x2="0.635" y2="-1.27" width="0.1524" layer="21"/>
<wire x1="5.08" y1="0.635" x2="5.715" y2="1.27" width="0.1524" layer="21"/>
<wire x1="5.715" y1="1.27" x2="6.985" y2="1.27" width="0.1524" layer="21"/>
<wire x1="6.985" y1="1.27" x2="7.62" y2="0.635" width="0.1524" layer="21"/>
<wire x1="7.62" y1="-0.635" x2="6.985" y2="-1.27" width="0.1524" layer="21"/>
<wire x1="6.985" y1="-1.27" x2="5.715" y2="-1.27" width="0.1524" layer="21"/>
<wire x1="5.715" y1="-1.27" x2="5.08" y2="-0.635" width="0.1524" layer="21"/>
<wire x1="7.62" y1="0.635" x2="7.62" y2="-0.635" width="0.1524" layer="21"/>
<pad name="1" x="-6.35" y="0" drill="1.016" shape="long" rot="R90"/>
<pad name="2" x="-3.81" y="0" drill="1.016" shape="long" rot="R90"/>
<pad name="3" x="-1.27" y="0" drill="1.016" shape="long" rot="R90"/>
<pad name="4" x="1.27" y="0" drill="1.016" shape="long" rot="R90"/>
<pad name="5" x="3.81" y="0" drill="1.016" shape="long" rot="R90"/>
<pad name="6" x="6.35" y="0" drill="1.016" shape="long" rot="R90"/>
<text x="-7.62" y="1.651" size="1.27" layer="25" ratio="10">&gt;NAME</text>
<text x="-6.985" y="-2.921" size="1.27" layer="21" ratio="10">1</text>
<text x="5.715" y="1.651" size="1.27" layer="21" ratio="10">6</text>
<text x="-2.54" y="-2.921" size="1.27" layer="27" ratio="10">&gt;VALUE</text>
<rectangle x1="-4.064" y1="-0.254" x2="-3.556" y2="0.254" layer="51"/>
<rectangle x1="-6.604" y1="-0.254" x2="-6.096" y2="0.254" layer="51"/>
<rectangle x1="-1.524" y1="-0.254" x2="-1.016" y2="0.254" layer="51"/>
<rectangle x1="3.556" y1="-0.254" x2="4.064" y2="0.254" layer="51"/>
<rectangle x1="1.016" y1="-0.254" x2="1.524" y2="0.254" layer="51"/>
<rectangle x1="6.096" y1="-0.254" x2="6.604" y2="0.254" layer="51"/>
</package>
<package name="MA03-1" urn="urn:adsk.eagle:footprint:8281/1" library_version="1">
<description>&lt;b&gt;PIN HEADER&lt;/b&gt;</description>
<wire x1="-3.175" y1="1.27" x2="-1.905" y2="1.27" width="0.1524" layer="21"/>
<wire x1="-1.905" y1="1.27" x2="-1.27" y2="0.635" width="0.1524" layer="21"/>
<wire x1="-1.27" y1="-0.635" x2="-1.905" y2="-1.27" width="0.1524" layer="21"/>
<wire x1="-1.27" y1="0.635" x2="-0.635" y2="1.27" width="0.1524" layer="21"/>
<wire x1="-0.635" y1="1.27" x2="0.635" y2="1.27" width="0.1524" layer="21"/>
<wire x1="0.635" y1="1.27" x2="1.27" y2="0.635" width="0.1524" layer="21"/>
<wire x1="1.27" y1="-0.635" x2="0.635" y2="-1.27" width="0.1524" layer="21"/>
<wire x1="0.635" y1="-1.27" x2="-0.635" y2="-1.27" width="0.1524" layer="21"/>
<wire x1="-0.635" y1="-1.27" x2="-1.27" y2="-0.635" width="0.1524" layer="21"/>
<wire x1="-3.81" y1="0.635" x2="-3.81" y2="-0.635" width="0.1524" layer="21"/>
<wire x1="-3.175" y1="1.27" x2="-3.81" y2="0.635" width="0.1524" layer="21"/>
<wire x1="-3.81" y1="-0.635" x2="-3.175" y2="-1.27" width="0.1524" layer="21"/>
<wire x1="-1.905" y1="-1.27" x2="-3.175" y2="-1.27" width="0.1524" layer="21"/>
<wire x1="1.27" y1="0.635" x2="1.905" y2="1.27" width="0.1524" layer="21"/>
<wire x1="1.905" y1="1.27" x2="3.175" y2="1.27" width="0.1524" layer="21"/>
<wire x1="3.175" y1="1.27" x2="3.81" y2="0.635" width="0.1524" layer="21"/>
<wire x1="3.81" y1="-0.635" x2="3.175" y2="-1.27" width="0.1524" layer="21"/>
<wire x1="3.175" y1="-1.27" x2="1.905" y2="-1.27" width="0.1524" layer="21"/>
<wire x1="1.905" y1="-1.27" x2="1.27" y2="-0.635" width="0.1524" layer="21"/>
<wire x1="3.81" y1="0.635" x2="3.81" y2="-0.635" width="0.1524" layer="21"/>
<pad name="1" x="-2.54" y="0" drill="1.016" shape="long" rot="R90"/>
<pad name="2" x="0" y="0" drill="1.016" shape="long" rot="R90"/>
<pad name="3" x="2.54" y="0" drill="1.016" shape="long" rot="R90"/>
<text x="-3.81" y="1.651" size="1.27" layer="25" ratio="10">&gt;NAME</text>
<text x="-5.08" y="-0.635" size="1.27" layer="21" ratio="10">1</text>
<text x="-3.81" y="-2.921" size="1.27" layer="27" ratio="10">&gt;VALUE</text>
<rectangle x1="-0.254" y1="-0.254" x2="0.254" y2="0.254" layer="51"/>
<rectangle x1="-2.794" y1="-0.254" x2="-2.286" y2="0.254" layer="51"/>
<rectangle x1="2.286" y1="-0.254" x2="2.794" y2="0.254" layer="51"/>
</package>
</packages>
<packages3d>
<package3d name="MA04-1" urn="urn:adsk.eagle:package:8337/1" type="box" library_version="1">
<description>PIN HEADER</description>
<packageinstances>
<packageinstance name="MA04-1"/>
</packageinstances>
</package3d>
<package3d name="MA06-1" urn="urn:adsk.eagle:package:8340/1" type="box" library_version="1">
<description>PIN HEADER</description>
<packageinstances>
<packageinstance name="MA06-1"/>
</packageinstances>
</package3d>
<package3d name="MA03-1" urn="urn:adsk.eagle:package:8339/1" type="box" library_version="1">
<description>PIN HEADER</description>
<packageinstances>
<packageinstance name="MA03-1"/>
</packageinstances>
</package3d>
</packages3d>
</library>
<library name="jumper" urn="urn:adsk.eagle:library:252">
<description>&lt;b&gt;Jumpers&lt;/b&gt;&lt;p&gt;
&lt;author&gt;Created by librarian@cadsoft.de&lt;/author&gt;</description>
<packages>
<package name="JP1" urn="urn:adsk.eagle:footprint:15398/1" library_version="1">
<description>&lt;b&gt;JUMPER&lt;/b&gt;</description>
<wire x1="-1.016" y1="0" x2="-1.27" y2="0.254" width="0.1524" layer="21"/>
<wire x1="-1.016" y1="0" x2="-1.27" y2="-0.254" width="0.1524" layer="21"/>
<wire x1="1.016" y1="0" x2="1.27" y2="0.254" width="0.1524" layer="21"/>
<wire x1="1.016" y1="0" x2="1.27" y2="-0.254" width="0.1524" layer="21"/>
<wire x1="1.27" y1="-0.254" x2="1.27" y2="-2.286" width="0.1524" layer="21"/>
<wire x1="1.016" y1="-2.54" x2="1.27" y2="-2.286" width="0.1524" layer="21"/>
<wire x1="1.27" y1="2.286" x2="1.016" y2="2.54" width="0.1524" layer="21"/>
<wire x1="1.27" y1="2.286" x2="1.27" y2="0.254" width="0.1524" layer="21"/>
<wire x1="1.016" y1="2.54" x2="-1.016" y2="2.54" width="0.1524" layer="21"/>
<wire x1="-1.27" y1="2.286" x2="-1.016" y2="2.54" width="0.1524" layer="21"/>
<wire x1="-1.27" y1="2.286" x2="-1.27" y2="0.254" width="0.1524" layer="21"/>
<wire x1="-1.27" y1="-0.254" x2="-1.27" y2="-2.286" width="0.1524" layer="21"/>
<wire x1="-1.016" y1="-2.54" x2="-1.27" y2="-2.286" width="0.1524" layer="21"/>
<wire x1="-1.016" y1="-2.54" x2="1.016" y2="-2.54" width="0.1524" layer="21"/>
<pad name="1" x="0" y="-1.27" drill="0.9144" shape="long"/>
<pad name="2" x="0" y="1.27" drill="0.9144" shape="long"/>
<text x="-1.651" y="-2.54" size="1.27" layer="25" ratio="10" rot="R90">&gt;NAME</text>
<text x="2.921" y="-2.54" size="1.27" layer="27" ratio="10" rot="R90">&gt;VALUE</text>
<rectangle x1="-0.3048" y1="0.9652" x2="0.3048" y2="1.5748" layer="51"/>
<rectangle x1="-0.3048" y1="-1.5748" x2="0.3048" y2="-0.9652" layer="51"/>
</package>
</packages>
<packages3d>
<package3d name="JP1" urn="urn:adsk.eagle:package:15455/1" type="box" library_version="1">
<description>JUMPER</description>
<packageinstances>
<packageinstance name="JP1"/>
</packageinstances>
</package3d>
</packages3d>
</library>
</libraries>
<attributes>
</attributes>
<variantdefs>
</variantdefs>
<classes>
<class number="0" name="default" width="0" drill="0">
</class>
</classes>
<designrules name="default">
<description language="de">&lt;b&gt;EAGLE Design Rules&lt;/b&gt;
&lt;p&gt;
Die Standard-Design-Rules sind so gewählt, dass sie für 
die meisten Anwendungen passen. Sollte ihre Platine 
besondere Anforderungen haben, treffen Sie die erforderlichen
Einstellungen hier und speichern die Design Rules unter 
einem neuen Namen ab.</description>
<description language="en">&lt;b&gt;EAGLE Design Rules&lt;/b&gt;
&lt;p&gt;
The default Design Rules have been set to cover
a wide range of applications. Your particular design
may have different requirements, so please make the
necessary adjustments and save your customized
design rules under a new name.</description>
<param name="layerSetup" value="(1*16)"/>
<param name="mtCopper" value="0.035mm 0.035mm 0.035mm 0.035mm 0.035mm 0.035mm 0.035mm 0.035mm 0.035mm 0.035mm 0.035mm 0.035mm 0.035mm 0.035mm 0.035mm 0.035mm"/>
<param name="mtIsolate" value="1.5mm 0.15mm 0.2mm 0.15mm 0.2mm 0.15mm 0.2mm 0.15mm 0.2mm 0.15mm 0.2mm 0.15mm 0.2mm 0.15mm 0.2mm"/>
<param name="mdWireWire" value="6mil"/>
<param name="mdWirePad" value="6mil"/>
<param name="mdWireVia" value="6mil"/>
<param name="mdPadPad" value="6mil"/>
<param name="mdPadVia" value="6mil"/>
<param name="mdViaVia" value="6mil"/>
<param name="mdSmdPad" value="6mil"/>
<param name="mdSmdVia" value="6mil"/>
<param name="mdSmdSmd" value="6mil"/>
<param name="mdViaViaSameLayer" value="6mil"/>
<param name="mnLayersViaInSmd" value="2"/>
<param name="mdCopperDimension" value="40mil"/>
<param name="mdDrill" value="6mil"/>
<param name="mdSmdStop" value="0mil"/>
<param name="msWidth" value="6mil"/>
<param name="msDrill" value="0.35mm"/>
<param name="msMicroVia" value="9.99mm"/>
<param name="msBlindViaRatio" value="0.5"/>
<param name="rvPadTop" value="0.25"/>
<param name="rvPadInner" value="0.25"/>
<param name="rvPadBottom" value="0.25"/>
<param name="rvViaOuter" value="0.25"/>
<param name="rvViaInner" value="0.25"/>
<param name="rvMicroViaOuter" value="0.25"/>
<param name="rvMicroViaInner" value="0.25"/>
<param name="rlMinPadTop" value="10mil"/>
<param name="rlMaxPadTop" value="20mil"/>
<param name="rlMinPadInner" value="10mil"/>
<param name="rlMaxPadInner" value="20mil"/>
<param name="rlMinPadBottom" value="10mil"/>
<param name="rlMaxPadBottom" value="20mil"/>
<param name="rlMinViaOuter" value="8mil"/>
<param name="rlMaxViaOuter" value="20mil"/>
<param name="rlMinViaInner" value="8mil"/>
<param name="rlMaxViaInner" value="20mil"/>
<param name="rlMinMicroViaOuter" value="4mil"/>
<param name="rlMaxMicroViaOuter" value="20mil"/>
<param name="rlMinMicroViaInner" value="4mil"/>
<param name="rlMaxMicroViaInner" value="20mil"/>
<param name="psTop" value="-1"/>
<param name="psBottom" value="-1"/>
<param name="psFirst" value="-1"/>
<param name="psElongationLong" value="100"/>
<param name="psElongationOffset" value="100"/>
<param name="mvStopFrame" value="1"/>
<param name="mvCreamFrame" value="0"/>
<param name="mlMinStopFrame" value="4mil"/>
<param name="mlMaxStopFrame" value="4mil"/>
<param name="mlMinCreamFrame" value="0mil"/>
<param name="mlMaxCreamFrame" value="0mil"/>
<param name="mlViaStopLimit" value="0mil"/>
<param name="srRoundness" value="0"/>
<param name="srMinRoundness" value="0mil"/>
<param name="srMaxRoundness" value="0mil"/>
<param name="slThermalIsolate" value="10mil"/>
<param name="slThermalsForVias" value="0"/>
<param name="dpMaxLengthDifference" value="10mm"/>
<param name="dpGapFactor" value="2.5"/>
<param name="checkAngle" value="0"/>
<param name="checkFont" value="1"/>
<param name="checkRestrict" value="1"/>
<param name="checkStop" value="0"/>
<param name="checkValues" value="0"/>
<param name="checkNames" value="1"/>
<param name="checkWireStubs" value="1"/>
<param name="checkPolygonWidth" value="0"/>
<param name="useDiameter" value="13"/>
<param name="maxErrors" value="50"/>
</designrules>
<autorouter>
<pass name="Default">
<param name="RoutingGrid" value="50mil"/>
<param name="AutoGrid" value="1"/>
<param name="Efforts" value="0"/>
<param name="TopRouterVariant" value="1"/>
<param name="tpViaShape" value="round"/>
<param name="PrefDir.1" value="a"/>
<param name="PrefDir.2" value="0"/>
<param name="PrefDir.3" value="0"/>
<param name="PrefDir.4" value="0"/>
<param name="PrefDir.5" value="0"/>
<param name="PrefDir.6" value="0"/>
<param name="PrefDir.7" value="0"/>
<param name="PrefDir.8" value="0"/>
<param name="PrefDir.9" value="0"/>
<param name="PrefDir.10" value="0"/>
<param name="PrefDir.11" value="0"/>
<param name="PrefDir.12" value="0"/>
<param name="PrefDir.13" value="0"/>
<param name="PrefDir.14" value="0"/>
<param name="PrefDir.15" value="0"/>
<param name="PrefDir.16" value="a"/>
<param name="cfVia" value="8"/>
<param name="cfNonPref" value="5"/>
<param name="cfChangeDir" value="2"/>
<param name="cfOrthStep" value="2"/>
<param name="cfDiagStep" value="3"/>
<param name="cfExtdStep" value="0"/>
<param name="cfBonusStep" value="1"/>
<param name="cfMalusStep" value="1"/>
<param name="cfPadImpact" value="4"/>
<param name="cfSmdImpact" value="4"/>
<param name="cfBusImpact" value="0"/>
<param name="cfHugging" value="3"/>
<param name="cfAvoid" value="4"/>
<param name="cfPolygon" value="10"/>
<param name="cfBase.1" value="0"/>
<param name="cfBase.2" value="1"/>
<param name="cfBase.3" value="1"/>
<param name="cfBase.4" value="1"/>
<param name="cfBase.5" value="1"/>
<param name="cfBase.6" value="1"/>
<param name="cfBase.7" value="1"/>
<param name="cfBase.8" value="1"/>
<param name="cfBase.9" value="1"/>
<param name="cfBase.10" value="1"/>
<param name="cfBase.11" value="1"/>
<param name="cfBase.12" value="1"/>
<param name="cfBase.13" value="1"/>
<param name="cfBase.14" value="1"/>
<param name="cfBase.15" value="1"/>
<param name="cfBase.16" value="0"/>
<param name="mnVias" value="20"/>
<param name="mnSegments" value="9999"/>
<param name="mnExtdSteps" value="9999"/>
<param name="mnRipupLevel" value="10"/>
<param name="mnRipupSteps" value="100"/>
<param name="mnRipupTotal" value="100"/>
</pass>
<pass name="Follow-me" refer="Default" active="yes">
</pass>
<pass name="Busses" refer="Default" active="yes">
<param name="cfNonPref" value="4"/>
<param name="cfBusImpact" value="4"/>
<param name="cfHugging" value="0"/>
<param name="mnVias" value="0"/>
</pass>
<pass name="Route" refer="Default" active="yes">
</pass>
<pass name="Optimize1" refer="Default" active="yes">
<param name="cfVia" value="99"/>
<param name="cfExtdStep" value="10"/>
<param name="cfHugging" value="1"/>
<param name="mnExtdSteps" value="1"/>
<param name="mnRipupLevel" value="0"/>
</pass>
<pass name="Optimize2" refer="Optimize1" active="yes">
<param name="cfNonPref" value="0"/>
<param name="cfChangeDir" value="6"/>
<param name="cfExtdStep" value="0"/>
<param name="cfBonusStep" value="2"/>
<param name="cfMalusStep" value="2"/>
<param name="cfPadImpact" value="2"/>
<param name="cfSmdImpact" value="2"/>
<param name="cfHugging" value="0"/>
</pass>
<pass name="Optimize3" refer="Optimize2" active="yes">
<param name="cfChangeDir" value="8"/>
<param name="cfPadImpact" value="0"/>
<param name="cfSmdImpact" value="0"/>
</pass>
<pass name="Optimize4" refer="Optimize3" active="yes">
<param name="cfChangeDir" value="25"/>
</pass>
</autorouter>
<elements>
<element name="EDGE2" library="AggieMarineRobotics" package="120PIN_EDGE_BOARD" value="EDGE_CONN_LAYOUT" x="0" y="11.4"/>
<element name="SV1" library="con-lstb" library_urn="urn:adsk.eagle:library:162" package="MA06-1" package3d_urn="urn:adsk.eagle:package:8340/1" value="" x="3.81" y="20.32" rot="R270">
<attribute name="MF" value="" x="3.81" y="20.32" size="1.778" layer="27" rot="R270" display="off"/>
<attribute name="MPN" value="" x="3.81" y="20.32" size="1.778" layer="27" rot="R270" display="off"/>
<attribute name="OC_FARNELL" value="unknown" x="3.81" y="20.32" size="1.778" layer="27" rot="R270" display="off"/>
<attribute name="OC_NEWARK" value="unknown" x="3.81" y="20.32" size="1.778" layer="27" rot="R270" display="off"/>
</element>
<element name="SV2" library="con-lstb" library_urn="urn:adsk.eagle:library:162" package="MA06-1" package3d_urn="urn:adsk.eagle:package:8340/1" value="" x="3.81" y="36.83" rot="R270">
<attribute name="MF" value="" x="3.81" y="36.83" size="1.778" layer="27" rot="R270" display="off"/>
<attribute name="MPN" value="" x="3.81" y="36.83" size="1.778" layer="27" rot="R270" display="off"/>
<attribute name="OC_FARNELL" value="unknown" x="3.81" y="36.83" size="1.778" layer="27" rot="R270" display="off"/>
<attribute name="OC_NEWARK" value="unknown" x="3.81" y="36.83" size="1.778" layer="27" rot="R270" display="off"/>
</element>
<element name="SV3" library="con-lstb" library_urn="urn:adsk.eagle:library:162" package="MA06-1" package3d_urn="urn:adsk.eagle:package:8340/1" value="" x="3.81" y="53.34" rot="R270">
<attribute name="MF" value="" x="3.81" y="53.34" size="1.778" layer="27" rot="R270" display="off"/>
<attribute name="MPN" value="" x="3.81" y="53.34" size="1.778" layer="27" rot="R270" display="off"/>
<attribute name="OC_FARNELL" value="unknown" x="3.81" y="53.34" size="1.778" layer="27" rot="R270" display="off"/>
<attribute name="OC_NEWARK" value="unknown" x="3.81" y="53.34" size="1.778" layer="27" rot="R270" display="off"/>
</element>
<element name="SV4" library="con-lstb" library_urn="urn:adsk.eagle:library:162" package="MA06-1" package3d_urn="urn:adsk.eagle:package:8340/1" value="" x="42.926" y="21.082" rot="R270">
<attribute name="MF" value="" x="42.926" y="21.082" size="1.778" layer="27" rot="R270" display="off"/>
<attribute name="MPN" value="" x="42.926" y="21.082" size="1.778" layer="27" rot="R270" display="off"/>
<attribute name="OC_FARNELL" value="unknown" x="42.926" y="21.082" size="1.778" layer="27" rot="R270" display="off"/>
<attribute name="OC_NEWARK" value="unknown" x="42.926" y="21.082" size="1.778" layer="27" rot="R270" display="off"/>
</element>
<element name="SV5" library="con-lstb" library_urn="urn:adsk.eagle:library:162" package="MA04-1" package3d_urn="urn:adsk.eagle:package:8337/1" value="" x="3.81" y="69.723" rot="R270">
<attribute name="MF" value="" x="3.81" y="69.723" size="1.778" layer="27" rot="R270" display="off"/>
<attribute name="MPN" value="" x="3.81" y="69.723" size="1.778" layer="27" rot="R270" display="off"/>
<attribute name="OC_FARNELL" value="unknown" x="3.81" y="69.723" size="1.778" layer="27" rot="R270" display="off"/>
<attribute name="OC_NEWARK" value="unknown" x="3.81" y="69.723" size="1.778" layer="27" rot="R270" display="off"/>
</element>
<element name="SV6" library="con-lstb" library_urn="urn:adsk.eagle:library:162" package="MA06-1" package3d_urn="urn:adsk.eagle:package:8340/1" value="" x="42.926" y="53.594" rot="R270">
<attribute name="MF" value="" x="42.926" y="53.594" size="1.778" layer="27" rot="R270" display="off"/>
<attribute name="MPN" value="" x="42.926" y="53.594" size="1.778" layer="27" rot="R270" display="off"/>
<attribute name="OC_FARNELL" value="unknown" x="42.926" y="53.594" size="1.778" layer="27" rot="R270" display="off"/>
<attribute name="OC_NEWARK" value="unknown" x="42.926" y="53.594" size="1.778" layer="27" rot="R270" display="off"/>
</element>
<element name="SV7" library="con-lstb" library_urn="urn:adsk.eagle:library:162" package="MA06-1" package3d_urn="urn:adsk.eagle:package:8340/1" value="" x="42.926" y="37.338" rot="R270">
<attribute name="MF" value="" x="42.926" y="37.338" size="1.778" layer="27" rot="R270" display="off"/>
<attribute name="MPN" value="" x="42.926" y="37.338" size="1.778" layer="27" rot="R270" display="off"/>
<attribute name="OC_FARNELL" value="unknown" x="42.926" y="37.338" size="1.778" layer="27" rot="R270" display="off"/>
<attribute name="OC_NEWARK" value="unknown" x="42.926" y="37.338" size="1.778" layer="27" rot="R270" display="off"/>
</element>
<element name="SV8" library="con-lstb" library_urn="urn:adsk.eagle:library:162" package="MA03-1" package3d_urn="urn:adsk.eagle:package:8339/1" value="" x="42.418" y="81.28" rot="R270">
<attribute name="MF" value="" x="42.418" y="81.28" size="1.778" layer="27" rot="R270" display="off"/>
<attribute name="MPN" value="" x="42.418" y="81.28" size="1.778" layer="27" rot="R270" display="off"/>
<attribute name="OC_FARNELL" value="unknown" x="42.418" y="81.28" size="1.778" layer="27" rot="R270" display="off"/>
<attribute name="OC_NEWARK" value="unknown" x="42.418" y="81.28" size="1.778" layer="27" rot="R270" display="off"/>
</element>
<element name="SV9" library="con-lstb" library_urn="urn:adsk.eagle:library:162" package="MA03-1" package3d_urn="urn:adsk.eagle:package:8339/1" value="" x="4.064" y="81.28" rot="R270">
<attribute name="MF" value="" x="4.064" y="81.28" size="1.778" layer="27" rot="R270" display="off"/>
<attribute name="MPN" value="" x="4.064" y="81.28" size="1.778" layer="27" rot="R270" display="off"/>
<attribute name="OC_FARNELL" value="unknown" x="4.064" y="81.28" size="1.778" layer="27" rot="R270" display="off"/>
<attribute name="OC_NEWARK" value="unknown" x="4.064" y="81.28" size="1.778" layer="27" rot="R270" display="off"/>
</element>
<element name="JP1" library="jumper" library_urn="urn:adsk.eagle:library:252" package="JP1" package3d_urn="urn:adsk.eagle:package:15455/1" value="" x="4.826" y="94.742"/>
</elements>
<signals>
<signal name="P2">
<contactref element="EDGE2" pad="PWR2"/>
</signal>
<signal name="G2">
<contactref element="EDGE2" pad="GND2"/>
</signal>
<signal name="PWM1">
<contactref element="SV1" pad="6"/>
<contactref element="EDGE2" pad="A13"/>
<wire x1="3.81" y1="13.97" x2="46" y2="2.55" width="0" layer="19" extent="1-1"/>
</signal>
<signal name="PWM2">
<contactref element="SV1" pad="3"/>
<contactref element="EDGE2" pad="A12"/>
<wire x1="3.81" y1="21.59" x2="45.2" y2="2.55" width="0" layer="19" extent="1-1"/>
</signal>
<signal name="PWM3">
<contactref element="SV2" pad="6"/>
<contactref element="EDGE2" pad="A11"/>
<wire x1="3.81" y1="30.48" x2="44.4" y2="2.55" width="0" layer="19" extent="1-1"/>
</signal>
<signal name="PWM4">
<contactref element="SV2" pad="3"/>
<contactref element="EDGE2" pad="A10"/>
<wire x1="3.81" y1="38.1" x2="43.6" y2="2.55" width="0" layer="19" extent="1-1"/>
</signal>
<signal name="PWM5">
<contactref element="SV3" pad="6"/>
<contactref element="EDGE2" pad="A9"/>
<wire x1="42.8" y1="2.55" x2="3.81" y2="46.99" width="0" layer="19" extent="1-1"/>
</signal>
<signal name="PWM6">
<contactref element="SV3" pad="3"/>
<contactref element="EDGE2" pad="A8"/>
<wire x1="42" y1="2.55" x2="3.81" y2="54.61" width="0" layer="19" extent="1-1"/>
</signal>
<signal name="PWM7">
<contactref element="EDGE2" pad="A7"/>
<contactref element="SV4" pad="6"/>
<wire x1="41.2" y1="2.55" x2="42.926" y2="14.732" width="0" layer="19" extent="1-1"/>
</signal>
<signal name="PWM8">
<contactref element="SV4" pad="3"/>
<contactref element="EDGE2" pad="A6"/>
<wire x1="40.4" y1="2.55" x2="42.926" y2="22.352" width="0" layer="19" extent="1-1"/>
</signal>
<signal name="GND">
<polygon width="0.1524" layer="16">
<vertex x="0" y="101.6"/>
<vertex x="102.235" y="101.6"/>
<vertex x="102.235" y="1.27"/>
<vertex x="102.235" y="-1.27"/>
<vertex x="-0.635" y="-1.27"/>
<vertex x="-0.635" y="101.6"/>
</polygon>
</signal>
<signal name="IMU_SDA">
<contactref element="SV5" pad="3"/>
<contactref element="EDGE2" pad="A24"/>
<wire x1="54.8" y1="2.55" x2="3.81" y2="68.453" width="0" layer="19" extent="1-1"/>
</signal>
<signal name="IMU_SCL">
<contactref element="SV5" pad="2"/>
<contactref element="EDGE2" pad="A25"/>
<wire x1="55.6" y1="2.55" x2="3.81" y2="70.993" width="0" layer="19" extent="1-1"/>
</signal>
<signal name="3.3V">
<contactref element="SV5" pad="1"/>
<contactref element="EDGE2" pad="A1"/>
<wire x1="36.4" y1="2.55" x2="3.81" y2="73.533" width="0" layer="19" extent="1-1"/>
</signal>
<signal name="PWM9">
<contactref element="EDGE2" pad="A5"/>
<contactref element="SV7" pad="6"/>
<wire x1="42.926" y1="30.988" x2="39.6" y2="2.55" width="0" layer="19" extent="1-1"/>
</signal>
<signal name="PWM10">
<contactref element="EDGE2" pad="A4"/>
<contactref element="SV7" pad="3"/>
<wire x1="42.926" y1="38.608" x2="38.8" y2="2.55" width="0" layer="19" extent="1-1"/>
</signal>
<signal name="PWM11">
<contactref element="EDGE2" pad="A3"/>
<contactref element="SV6" pad="6"/>
<wire x1="42.926" y1="47.244" x2="38" y2="2.55" width="0" layer="19" extent="1-1"/>
</signal>
<signal name="PWM12">
<contactref element="EDGE2" pad="A2"/>
<contactref element="SV6" pad="3"/>
<wire x1="42.926" y1="54.864" x2="37.2" y2="2.55" width="0" layer="19" extent="1-1"/>
</signal>
<signal name="WATER_SENS">
<contactref element="EDGE2" pad="A59"/>
<contactref element="SV9" pad="1"/>
<wire x1="4.064" y1="83.82" x2="82.8" y2="2.55" width="0" layer="19" extent="1-1"/>
</signal>
<signal name="PRESS_SENS">
<contactref element="EDGE2" pad="A60"/>
<contactref element="SV8" pad="1"/>
<wire x1="42.418" y1="83.82" x2="83.6" y2="2.55" width="0" layer="19" extent="1-1"/>
</signal>
<signal name="PGND">
<contactref element="EDGE2" pad="B1"/>
<contactref element="SV5" pad="4"/>
<contactref element="EDGE2" pad="GND1"/>
<wire x1="30.4" y1="5.6" x2="3.81" y2="65.913" width="0" layer="19" extent="1-1"/>
<wire x1="36" y1="2.55" x2="30.4" y2="5.6" width="0" layer="19" extent="1-16"/>
</signal>
<signal name="DGND">
<contactref element="EDGE2" pad="B2"/>
<contactref element="EDGE2" pad="B13"/>
<contactref element="EDGE2" pad="B12"/>
<contactref element="EDGE2" pad="B11"/>
<contactref element="EDGE2" pad="B10"/>
<contactref element="EDGE2" pad="B9"/>
<contactref element="EDGE2" pad="B8"/>
<contactref element="EDGE2" pad="B7"/>
<contactref element="EDGE2" pad="B6"/>
<contactref element="EDGE2" pad="B5"/>
<contactref element="EDGE2" pad="B4"/>
<contactref element="EDGE2" pad="B3"/>
<contactref element="EDGE2" pad="B24"/>
<contactref element="EDGE2" pad="B25"/>
<contactref element="SV6" pad="1"/>
<contactref element="SV6" pad="4"/>
<contactref element="SV7" pad="1"/>
<contactref element="SV7" pad="4"/>
<contactref element="SV4" pad="1"/>
<contactref element="SV4" pad="4"/>
<contactref element="SV3" pad="1"/>
<contactref element="SV3" pad="4"/>
<contactref element="SV2" pad="4"/>
<contactref element="SV2" pad="1"/>
<contactref element="SV1" pad="1"/>
<contactref element="SV1" pad="4"/>
<wire x1="42.926" y1="19.812" x2="42.926" y2="27.432" width="0" layer="19" extent="1-1"/>
<wire x1="3.81" y1="59.69" x2="42.926" y2="19.812" width="0" layer="19" extent="1-1"/>
<wire x1="3.81" y1="52.07" x2="3.81" y2="59.69" width="0" layer="19" extent="1-1"/>
<wire x1="3.81" y1="43.18" x2="3.81" y2="52.07" width="0" layer="19" extent="1-1"/>
<wire x1="3.81" y1="35.56" x2="3.81" y2="43.18" width="0" layer="19" extent="1-1"/>
<wire x1="3.81" y1="26.67" x2="3.81" y2="35.56" width="0" layer="19" extent="1-1"/>
<wire x1="3.81" y1="19.05" x2="3.81" y2="26.67" width="0" layer="19" extent="1-1"/>
<wire x1="42.926" y1="59.944" x2="3.81" y2="19.05" width="0" layer="19" extent="1-1"/>
<wire x1="42.926" y1="43.688" x2="42.926" y2="59.944" width="0" layer="19" extent="1-1"/>
<wire x1="42.926" y1="52.324" x2="42.926" y2="59.944" width="0" layer="19" extent="1-1"/>
<wire x1="42.926" y1="36.068" x2="42.926" y2="52.324" width="0" layer="19" extent="1-1"/>
<wire x1="36.8" y1="2.55" x2="42.926" y2="52.324" width="0" layer="19" extent="16-16"/>
<wire x1="37.6" y1="2.55" x2="36.8" y2="2.55" width="0" layer="19" extent="16-16"/>
<wire x1="38.4" y1="2.55" x2="37.6" y2="2.55" width="0" layer="19" extent="16-16"/>
<wire x1="39.2" y1="2.55" x2="38.4" y2="2.55" width="0" layer="19" extent="16-16"/>
<wire x1="40" y1="2.55" x2="39.2" y2="2.55" width="0" layer="19" extent="16-16"/>
<wire x1="40.8" y1="2.55" x2="40" y2="2.55" width="0" layer="19" extent="16-16"/>
<wire x1="41.6" y1="2.55" x2="40.8" y2="2.55" width="0" layer="19" extent="16-16"/>
<wire x1="42.4" y1="2.55" x2="41.6" y2="2.55" width="0" layer="19" extent="16-16"/>
<wire x1="43.2" y1="2.55" x2="42.4" y2="2.55" width="0" layer="19" extent="16-16"/>
<wire x1="44" y1="2.55" x2="43.2" y2="2.55" width="0" layer="19" extent="16-16"/>
<wire x1="44.8" y1="2.55" x2="44" y2="2.55" width="0" layer="19" extent="16-16"/>
<wire x1="45.6" y1="2.55" x2="44.8" y2="2.55" width="0" layer="19" extent="16-16"/>
<wire x1="54.4" y1="2.55" x2="45.6" y2="2.55" width="0" layer="19" extent="16-16"/>
<wire x1="55.2" y1="2.55" x2="54.4" y2="2.55" width="0" layer="19" extent="16-16"/>
</signal>
<signal name="AGND">
<contactref element="EDGE2" pad="B60"/>
<contactref element="EDGE2" pad="B59"/>
<contactref element="SV8" pad="2"/>
<contactref element="SV9" pad="2"/>
<wire x1="82.4" y1="2.55" x2="83.2" y2="2.55" width="0" layer="19" extent="16-16"/>
<wire x1="42.418" y1="81.28" x2="82.4" y2="2.55" width="0" layer="19" extent="16-16"/>
<wire x1="4.064" y1="81.28" x2="42.418" y2="81.28" width="0" layer="19" extent="1-1"/>
</signal>
<signal name="5V">
<contactref element="EDGE2" pad="PWR1"/>
<contactref element="SV8" pad="3"/>
<contactref element="SV9" pad="3"/>
<wire x1="42.418" y1="78.74" x2="21.3" y2="5.6" width="0" layer="19" extent="1-1"/>
<wire x1="4.064" y1="78.74" x2="42.418" y2="78.74" width="0" layer="19" extent="1-1"/>
</signal>
<signal name="MAG_KILL_SW">
<contactref element="EDGE2" pad="A32"/>
<contactref element="JP1" pad="2"/>
<wire x1="4.826" y1="96.012" x2="61.2" y2="2.55" width="0" layer="19" extent="1-1"/>
</signal>
<signal name="SW_GND">
<contactref element="JP1" pad="1"/>
<contactref element="EDGE2" pad="B32"/>
<wire x1="4.826" y1="93.472" x2="60.8" y2="2.55" width="0" layer="19" extent="16-16"/>
</signal>
</signals>
<mfgpreviewcolors>
<mfgpreviewcolor name="soldermaskcolor" color="0xC8008000"/>
<mfgpreviewcolor name="silkscreencolor" color="0xFFFEFEFE"/>
<mfgpreviewcolor name="backgroundcolor" color="0xFF282828"/>
<mfgpreviewcolor name="coppercolor" color="0xFFFFBF00"/>
<mfgpreviewcolor name="substratecolor" color="0xFF786E46"/>
</mfgpreviewcolors>
<errors>
<approved hash="4,1,721a283b93714c13"/>
<approved hash="4,1,eda69591cb4b7fdb"/>
<approved hash="4,1,e60fc9695306a2af"/>
<approved hash="4,1,1418e62be2e81447"/>
<approved hash="4,1,569774fe4398d43c"/>
<approved hash="4,1,593c5168d8be3832"/>
<approved hash="4,16,721a283b93714c13"/>
<approved hash="4,16,eda69591cb4b7fdb"/>
<approved hash="4,16,e60fc9695306a2af"/>
<approved hash="4,16,b637a774c6223ae5"/>
<approved hash="4,16,1d8fe1ebda58d316"/>
<approved hash="4,16,65008b70e56de1c5"/>
<approved hash="4,1,c09ec77827a898a4"/>
<approved hash="4,1,91990c38a3412c5e"/>
<approved hash="4,16,b8a5b2bd0c970666"/>
</errors>
</board>
</drawing>
<compatibility>
<note version="8.2" severity="warning">
Since Version 8.2, EAGLE supports online libraries. The ids
of those online libraries will not be understood (or retained)
with this version.
</note>
<note version="8.3" severity="warning">
Since Version 8.3, EAGLE supports URNs for individual library
assets (packages, symbols, and devices). The URNs of those assets
will not be understood (or retained) with this version.
</note>
<note version="8.3" severity="warning">
Since Version 8.3, EAGLE supports the association of 3D packages
with devices in libraries, schematics, and board files. Those 3D
packages will not be understood (or retained) with this version.
</note>
</compatibility>
</eagle>
