<?xml version="1.0" encoding="utf-8"?>
<!DOCTYPE eagle SYSTEM "eagle.dtd">
<eagle version="9.1.3">
<drawing>
<settings>
<setting alwaysvectorfont="no"/>
<setting verticaltext="up"/>
</settings>
<grid distance="0.1" unitdist="inch" unit="inch" style="lines" multiple="1" display="no" altdistance="0.01" altunitdist="inch" altunit="inch"/>
<layers>
<layer number="1" name="Top" color="4" fill="1" visible="no" active="no"/>
<layer number="2" name="Route2" color="16" fill="1" visible="no" active="no"/>
<layer number="3" name="Route3" color="17" fill="1" visible="no" active="no"/>
<layer number="4" name="Route4" color="18" fill="1" visible="no" active="no"/>
<layer number="5" name="Route5" color="19" fill="1" visible="no" active="no"/>
<layer number="6" name="Route6" color="25" fill="1" visible="no" active="no"/>
<layer number="7" name="Route7" color="26" fill="1" visible="no" active="no"/>
<layer number="8" name="Route8" color="27" fill="1" visible="no" active="no"/>
<layer number="9" name="Route9" color="28" fill="1" visible="no" active="no"/>
<layer number="10" name="Route10" color="29" fill="1" visible="no" active="no"/>
<layer number="11" name="Route11" color="30" fill="1" visible="no" active="no"/>
<layer number="12" name="Route12" color="20" fill="1" visible="no" active="no"/>
<layer number="13" name="Route13" color="21" fill="1" visible="no" active="no"/>
<layer number="14" name="Route14" color="22" fill="1" visible="no" active="no"/>
<layer number="15" name="Route15" color="23" fill="1" visible="no" active="no"/>
<layer number="16" name="Bottom" color="1" fill="1" visible="no" active="no"/>
<layer number="17" name="Pads" color="2" fill="1" visible="no" active="no"/>
<layer number="18" name="Vias" color="2" fill="1" visible="no" active="no"/>
<layer number="19" name="Unrouted" color="6" fill="1" visible="no" active="no"/>
<layer number="20" name="Dimension" color="24" fill="1" visible="no" active="no"/>
<layer number="21" name="tPlace" color="7" fill="1" visible="no" active="no"/>
<layer number="22" name="bPlace" color="7" fill="1" visible="no" active="no"/>
<layer number="23" name="tOrigins" color="15" fill="1" visible="no" active="no"/>
<layer number="24" name="bOrigins" color="15" fill="1" visible="no" active="no"/>
<layer number="25" name="tNames" color="7" fill="1" visible="no" active="no"/>
<layer number="26" name="bNames" color="7" fill="1" visible="no" active="no"/>
<layer number="27" name="tValues" color="7" fill="1" visible="no" active="no"/>
<layer number="28" name="bValues" color="7" fill="1" visible="no" active="no"/>
<layer number="29" name="tStop" color="7" fill="3" visible="no" active="no"/>
<layer number="30" name="bStop" color="7" fill="6" visible="no" active="no"/>
<layer number="31" name="tCream" color="7" fill="4" visible="no" active="no"/>
<layer number="32" name="bCream" color="7" fill="5" visible="no" active="no"/>
<layer number="33" name="tFinish" color="6" fill="3" visible="no" active="no"/>
<layer number="34" name="bFinish" color="6" fill="6" visible="no" active="no"/>
<layer number="35" name="tGlue" color="7" fill="4" visible="no" active="no"/>
<layer number="36" name="bGlue" color="7" fill="5" visible="no" active="no"/>
<layer number="37" name="tTest" color="7" fill="1" visible="no" active="no"/>
<layer number="38" name="bTest" color="7" fill="1" visible="no" active="no"/>
<layer number="39" name="tKeepout" color="4" fill="11" visible="no" active="no"/>
<layer number="40" name="bKeepout" color="1" fill="11" visible="no" active="no"/>
<layer number="41" name="tRestrict" color="4" fill="10" visible="no" active="no"/>
<layer number="42" name="bRestrict" color="1" fill="10" visible="no" active="no"/>
<layer number="43" name="vRestrict" color="2" fill="10" visible="no" active="no"/>
<layer number="44" name="Drills" color="7" fill="1" visible="no" active="no"/>
<layer number="45" name="Holes" color="7" fill="1" visible="no" active="no"/>
<layer number="46" name="Milling" color="3" fill="1" visible="no" active="no"/>
<layer number="47" name="Measures" color="7" fill="1" visible="no" active="no"/>
<layer number="48" name="Document" color="7" fill="1" visible="no" active="no"/>
<layer number="49" name="Reference" color="7" fill="1" visible="no" active="no"/>
<layer number="51" name="tDocu" color="7" fill="1" visible="no" active="no"/>
<layer number="52" name="bDocu" color="7" fill="1" visible="no" active="no"/>
<layer number="88" name="SimResults" color="9" fill="1" visible="yes" active="yes"/>
<layer number="89" name="SimProbes" color="9" fill="1" visible="yes" active="yes"/>
<layer number="90" name="Modules" color="5" fill="1" visible="yes" active="yes"/>
<layer number="91" name="Nets" color="2" fill="1" visible="yes" active="yes"/>
<layer number="92" name="Busses" color="1" fill="1" visible="yes" active="yes"/>
<layer number="93" name="Pins" color="2" fill="1" visible="no" active="yes"/>
<layer number="94" name="Symbols" color="4" fill="1" visible="yes" active="yes"/>
<layer number="95" name="Names" color="7" fill="1" visible="yes" active="yes"/>
<layer number="96" name="Values" color="7" fill="1" visible="yes" active="yes"/>
<layer number="97" name="Info" color="7" fill="1" visible="yes" active="yes"/>
<layer number="98" name="Guide" color="6" fill="1" visible="yes" active="yes"/>
</layers>
<schematic xreflabel="%F%N/%S.%C%R" xrefpart="/%S.%C%R">
<libraries>
<library name="AMR_ESC">
<packages>
<package name="KISS-ESC25S-25A">
<wire x1="-13" y1="6.25" x2="13" y2="6.25" width="0.127" layer="21"/>
<wire x1="13" y1="6.25" x2="13" y2="4.9" width="0.127" layer="21"/>
<wire x1="13" y1="4.9" x2="13" y2="2.6" width="0.127" layer="21"/>
<wire x1="13" y1="2.6" x2="13" y2="1.15" width="0.127" layer="21"/>
<wire x1="13" y1="1.15" x2="13" y2="1.25" width="0.127" layer="21"/>
<wire x1="13" y1="1.25" x2="13" y2="1.15" width="0.127" layer="21"/>
<wire x1="13" y1="1.15" x2="13" y2="-1.15" width="0.127" layer="21"/>
<wire x1="13" y1="-1.15" x2="13" y2="-2.6" width="0.127" layer="21"/>
<wire x1="13" y1="-2.6" x2="13" y2="-4.9" width="0.127" layer="21"/>
<wire x1="13" y1="-4.9" x2="13" y2="-6.25" width="0.127" layer="21"/>
<wire x1="13" y1="-6.25" x2="-13" y2="-6.25" width="0.127" layer="21"/>
<wire x1="-13" y1="-6.25" x2="-13" y2="-5.4" width="0.127" layer="21"/>
<wire x1="-13" y1="-5.4" x2="-13" y2="-3.1" width="0.127" layer="21"/>
<wire x1="-13" y1="-3.1" x2="-13" y2="-2" width="0.127" layer="21"/>
<wire x1="-13" y1="-2" x2="-13" y2="-1.75" width="0.127" layer="21"/>
<wire x1="-13" y1="-1.75" x2="-13" y2="-1" width="0.127" layer="21"/>
<wire x1="-13" y1="-1" x2="-13" y2="-0.5" width="0.127" layer="21"/>
<wire x1="-13" y1="-0.5" x2="-13" y2="-0.25" width="0.127" layer="21"/>
<wire x1="-13" y1="-0.25" x2="-13" y2="0.5" width="0.127" layer="21"/>
<wire x1="-13" y1="0.5" x2="-13" y2="0.75" width="0.127" layer="21"/>
<wire x1="-13" y1="0.75" x2="-13" y2="1" width="0.127" layer="21"/>
<wire x1="-13" y1="1" x2="-13" y2="1.5" width="0.127" layer="21"/>
<wire x1="-13" y1="1.5" x2="-13" y2="2" width="0.127" layer="21"/>
<wire x1="-13" y1="2" x2="-13" y2="3.1" width="0.127" layer="21"/>
<wire x1="-13" y1="3.1" x2="-13" y2="5.4" width="0.127" layer="21"/>
<wire x1="-13" y1="5.4" x2="-13" y2="6.25" width="0.127" layer="21"/>
<wire x1="-13" y1="5.4" x2="-13" y2="3.1" width="0.127" layer="21" curve="-180" cap="flat"/>
<wire x1="-13" y1="-5.4" x2="-13" y2="-3.1" width="0.127" layer="21" curve="180" cap="flat"/>
<wire x1="-13" y1="0.5" x2="-13" y2="-0.5" width="0.127" layer="21" curve="-180" cap="flat"/>
<wire x1="-13" y1="2" x2="-13" y2="1" width="0.127" layer="21" curve="-180" cap="flat"/>
<wire x1="-13" y1="-1" x2="-13" y2="-2" width="0.127" layer="21" curve="-180" cap="flat"/>
<wire x1="13" y1="4.9" x2="13" y2="2.6" width="0.127" layer="21" curve="180" cap="flat"/>
<wire x1="13" y1="-4.9" x2="13" y2="-2.6" width="0.127" layer="21" curve="-180" cap="flat"/>
<wire x1="13" y1="-1.15" x2="13" y2="1.15" width="0.127" layer="21" curve="-180" cap="flat"/>
<smd name="S" x="-13" y="1.5" dx="1" dy="3" layer="1" rot="R90"/>
<smd name="T" x="-13" y="0" dx="1" dy="3" layer="1" rot="R90"/>
<smd name="G" x="-13" y="-1.5" dx="1" dy="3" layer="1" rot="R90"/>
<text x="-13" y="6.5" size="0.8128" layer="25">&gt;NAME</text>
<text x="-13" y="-7.25" size="0.8128" layer="25">&gt;VALUE</text>
<wire x1="11.246" y1="-5.25" x2="-11.246" y2="-5.25" width="0.0762" layer="20"/>
<wire x1="-11.246" y1="-5.25" x2="-11.5" y2="-4.996" width="0.0762" layer="20" curve="-90"/>
<wire x1="-11.5" y1="-4.996" x2="-11.5" y2="4.996" width="0.0762" layer="20"/>
<wire x1="-11.5" y1="4.996" x2="-11.246" y2="5.25" width="0.0762" layer="20" curve="-90"/>
<wire x1="-11.246" y1="5.25" x2="11.246" y2="5.25" width="0.0762" layer="20"/>
<wire x1="11.246" y1="5.25" x2="11.5" y2="4.996" width="0.0762" layer="20" curve="-90"/>
<wire x1="11.5" y1="4.996" x2="11.5" y2="-4.996" width="0.0762" layer="20"/>
<wire x1="11.5" y1="-4.996" x2="11.246" y2="-5.25" width="0.0762" layer="20" curve="-90"/>
<pad name="-BAT1" x="-13" y="4.25" drill="2" diameter="3" shape="square"/>
<pad name="+BAT1" x="-13" y="-4.25" drill="2" diameter="3" shape="square"/>
<pad name="-BAT2" x="-16" y="4.25" drill="2" diameter="3" shape="square"/>
<pad name="+BAT2" x="-16" y="-4.25" drill="2" diameter="3" shape="square"/>
<pad name="A" x="13" y="3.75" drill="2" diameter="3" shape="square"/>
<pad name="B" x="13" y="0" drill="2" diameter="3" shape="square"/>
<pad name="C" x="13" y="-3.75" drill="2" diameter="3" shape="square"/>
<hole x="-23" y="4.25" drill="2.5"/>
<hole x="-23" y="-4.25" drill="2.5"/>
<hole x="23" y="-3.75" drill="2.5"/>
<hole x="23" y="0" drill="2.5"/>
<hole x="23" y="3.75" drill="2.5"/>
</package>
</packages>
<symbols>
<symbol name="KISS-ESC">
<wire x1="-17.78" y1="10.16" x2="17.78" y2="10.16" width="0.254" layer="94"/>
<wire x1="17.78" y1="10.16" x2="17.78" y2="-10.16" width="0.254" layer="94"/>
<wire x1="17.78" y1="-10.16" x2="-17.78" y2="-10.16" width="0.254" layer="94"/>
<wire x1="-17.78" y1="-10.16" x2="-17.78" y2="10.16" width="0.254" layer="94"/>
<pin name="+BAT" x="-22.86" y="7.62" length="middle" direction="pwr"/>
<pin name="-BAT" x="-22.86" y="5.08" length="middle" direction="pwr"/>
<pin name="SIG" x="-22.86" y="-2.54" length="middle"/>
<pin name="TEL" x="-22.86" y="-5.08" length="middle"/>
<pin name="GND" x="-22.86" y="-7.62" length="middle"/>
<pin name="MOT_A" x="22.86" y="7.62" length="middle" swaplevel="1" rot="R180"/>
<pin name="MOT_B" x="22.86" y="0" length="middle" swaplevel="1" rot="R180"/>
<pin name="MOT_C" x="22.86" y="-7.62" length="middle" swaplevel="1" rot="R180"/>
<text x="-17.78" y="10.16" size="2.1844" layer="94">&gt;NAME</text>
<text x="-17.78" y="-12.7" size="2.1844" layer="94">&gt;VALUE</text>
</symbol>
</symbols>
<devicesets>
<deviceset name="KISS-ESC25S-25A" prefix="ESC">
<gates>
<gate name="G$1" symbol="KISS-ESC" x="0" y="0"/>
</gates>
<devices>
<device name="" package="KISS-ESC25S-25A">
<connects>
<connect gate="G$1" pin="+BAT" pad="+BAT1 +BAT2"/>
<connect gate="G$1" pin="-BAT" pad="-BAT1 -BAT2"/>
<connect gate="G$1" pin="GND" pad="G"/>
<connect gate="G$1" pin="MOT_A" pad="A"/>
<connect gate="G$1" pin="MOT_B" pad="B"/>
<connect gate="G$1" pin="MOT_C" pad="C"/>
<connect gate="G$1" pin="SIG" pad="S"/>
<connect gate="G$1" pin="TEL" pad="T"/>
</connects>
<technologies>
<technology name=""/>
</technologies>
</device>
</devices>
</deviceset>
</devicesets>
</library>
<library name="AMR_Connectors">
<packages>
<package name="04JST-53048-THRU">
<pad name="2" x="-0.625" y="0" drill="0.5"/>
<pad name="3" x="0.625" y="0" drill="0.5"/>
<pad name="1" x="-1.875" y="0" drill="0.5"/>
<pad name="4" x="1.875" y="0" drill="0.5"/>
<wire x1="-3.375" y1="1.05" x2="-3.375" y2="-4.45" width="0.127" layer="21"/>
<wire x1="-3.375" y1="-4.45" x2="3.375" y2="-4.45" width="0.127" layer="21"/>
<wire x1="3.375" y1="-4.45" x2="3.375" y2="1.05" width="0.127" layer="21"/>
<wire x1="3.375" y1="1.05" x2="-3.375" y2="1.05" width="0.127" layer="21"/>
<text x="3.75" y="0" size="0.6096" layer="21">&gt;NAME</text>
<text x="-3.125" y="1.25" size="0.6096" layer="21">&gt;VALUE</text>
</package>
</packages>
<symbols>
<symbol name="JST04">
<wire x1="-2.54" y1="7.62" x2="2.54" y2="7.62" width="0.254" layer="94"/>
<wire x1="2.54" y1="7.62" x2="2.54" y2="-5.08" width="0.254" layer="94"/>
<wire x1="2.54" y1="-5.08" x2="-2.54" y2="-5.08" width="0.254" layer="94"/>
<wire x1="-2.54" y1="-5.08" x2="-2.54" y2="7.62" width="0.254" layer="94"/>
<pin name="1" x="7.62" y="5.08" length="middle" swaplevel="1" rot="R180"/>
<pin name="2" x="7.62" y="2.54" length="middle" swaplevel="1" rot="R180"/>
<pin name="3" x="7.62" y="0" length="middle" swaplevel="1" rot="R180"/>
<pin name="4" x="7.62" y="-2.54" length="middle" swaplevel="1" rot="R180"/>
<text x="-2.54" y="7.62" size="1.9304" layer="94">&gt;NAME</text>
<text x="-2.54" y="-7.62" size="1.9304" layer="94">&gt;VALUE</text>
</symbol>
</symbols>
<devicesets>
<deviceset name="04JST-53048-THRU" prefix="JST">
<gates>
<gate name="G$1" symbol="JST04" x="0" y="-2.54"/>
</gates>
<devices>
<device name="" package="04JST-53048-THRU">
<connects>
<connect gate="G$1" pin="1" pad="1"/>
<connect gate="G$1" pin="2" pad="2"/>
<connect gate="G$1" pin="3" pad="3"/>
<connect gate="G$1" pin="4" pad="4"/>
</connects>
<technologies>
<technology name=""/>
</technologies>
</device>
</devices>
</deviceset>
</devicesets>
</library>
</libraries>
<attributes>
</attributes>
<variantdefs>
</variantdefs>
<classes>
<class number="0" name="default" width="0" drill="0">
</class>
</classes>
<parts>
<part name="ESC1" library="AMR_ESC" deviceset="KISS-ESC25S-25A" device=""/>
<part name="ESC2" library="AMR_ESC" deviceset="KISS-ESC25S-25A" device=""/>
<part name="JST1" library="AMR_Connectors" deviceset="04JST-53048-THRU" device=""/>
<part name="JST2" library="AMR_Connectors" deviceset="04JST-53048-THRU" device=""/>
</parts>
<sheets>
<sheet>
<plain>
</plain>
<instances>
<instance part="ESC1" gate="G$1" x="27.94" y="43.18"/>
<instance part="ESC2" gate="G$1" x="27.94" y="15.24"/>
<instance part="JST1" gate="G$1" x="-27.94" y="38.1"/>
<instance part="JST2" gate="G$1" x="-27.94" y="10.16"/>
</instances>
<busses>
</busses>
<nets>
<net name="N$1" class="0">
<segment>
<pinref part="ESC1" gate="G$1" pin="+BAT"/>
<pinref part="ESC2" gate="G$1" pin="+BAT"/>
<wire x1="-7.62" y1="50.8" x2="5.08" y2="50.8" width="0.1524" layer="91"/>
<wire x1="5.08" y1="22.86" x2="-7.62" y2="22.86" width="0.1524" layer="91"/>
<wire x1="-7.62" y1="22.86" x2="-7.62" y2="43.18" width="0.1524" layer="91"/>
<wire x1="-7.62" y1="43.18" x2="-7.62" y2="50.8" width="0.1524" layer="91"/>
<wire x1="-20.32" y1="15.24" x2="-7.62" y2="15.24" width="0.1524" layer="91"/>
<wire x1="-7.62" y1="15.24" x2="-7.62" y2="22.86" width="0.1524" layer="91"/>
<junction x="-7.62" y="22.86"/>
<wire x1="-20.32" y1="43.18" x2="-7.62" y2="43.18" width="0.1524" layer="91"/>
<junction x="-7.62" y="43.18"/>
<pinref part="JST1" gate="G$1" pin="1"/>
<pinref part="JST2" gate="G$1" pin="1"/>
</segment>
</net>
<net name="N$2" class="0">
<segment>
<pinref part="ESC1" gate="G$1" pin="SIG"/>
<wire x1="-20.32" y1="40.64" x2="-5.08" y2="40.64" width="0.1524" layer="91"/>
<pinref part="ESC2" gate="G$1" pin="SIG"/>
<wire x1="-5.08" y1="40.64" x2="5.08" y2="40.64" width="0.1524" layer="91"/>
<wire x1="-5.08" y1="40.64" x2="-5.08" y2="12.7" width="0.1524" layer="91"/>
<wire x1="-5.08" y1="12.7" x2="5.08" y2="12.7" width="0.1524" layer="91"/>
<junction x="-5.08" y="40.64"/>
<wire x1="-5.08" y1="12.7" x2="-20.32" y2="12.7" width="0.1524" layer="91"/>
<junction x="-5.08" y="12.7"/>
<pinref part="JST1" gate="G$1" pin="2"/>
<pinref part="JST2" gate="G$1" pin="2"/>
</segment>
</net>
<net name="N$3" class="0">
<segment>
<pinref part="ESC1" gate="G$1" pin="TEL"/>
<wire x1="-20.32" y1="38.1" x2="-2.54" y2="38.1" width="0.1524" layer="91"/>
<pinref part="ESC2" gate="G$1" pin="TEL"/>
<wire x1="-2.54" y1="38.1" x2="5.08" y2="38.1" width="0.1524" layer="91"/>
<wire x1="-2.54" y1="38.1" x2="-2.54" y2="10.16" width="0.1524" layer="91"/>
<wire x1="-2.54" y1="10.16" x2="5.08" y2="10.16" width="0.1524" layer="91"/>
<junction x="-2.54" y="38.1"/>
<wire x1="-20.32" y1="10.16" x2="-2.54" y2="10.16" width="0.1524" layer="91"/>
<junction x="-2.54" y="10.16"/>
<pinref part="JST1" gate="G$1" pin="3"/>
<pinref part="JST2" gate="G$1" pin="3"/>
</segment>
</net>
<net name="N$4" class="0">
<segment>
<pinref part="ESC1" gate="G$1" pin="GND"/>
<wire x1="-20.32" y1="35.56" x2="0" y2="35.56" width="0.1524" layer="91"/>
<pinref part="ESC2" gate="G$1" pin="GND"/>
<wire x1="0" y1="35.56" x2="5.08" y2="35.56" width="0.1524" layer="91"/>
<wire x1="0" y1="35.56" x2="0" y2="7.62" width="0.1524" layer="91"/>
<wire x1="0" y1="7.62" x2="5.08" y2="7.62" width="0.1524" layer="91"/>
<junction x="0" y="35.56"/>
<wire x1="-20.32" y1="7.62" x2="0" y2="7.62" width="0.1524" layer="91"/>
<junction x="0" y="7.62"/>
<pinref part="JST1" gate="G$1" pin="4"/>
<pinref part="JST2" gate="G$1" pin="4"/>
</segment>
</net>
</nets>
</sheet>
</sheets>
</schematic>
</drawing>
</eagle>
