Codi;;17/18;16/17;Dif
08000013;Escola Francesc Platón i Sartí;38,625;38,1250;0,5000
EES;;2,000;2,0000;0,0000
EES;DIV;1,000;1,0000;0,0000
INF;;8,000;8,5000;-0,5000
INF;DIV;1,000;1,0000;0,0000
PAN;;3,000;3,0000;0,0000
PEF;;2,000;2,0000;0,0000
PMU;;1,000;2,0000;-1,0000
PRI;;19,000;17,0000;2,0000
R02;;0,625;0,6250;0,0000
UEE;;1,000;1,0000;0,0000
08014589;Escola Sant Cristòfor;31,125;29,1250;2,0000
EES;;1,000;1,0000;0,0000
INF;;8,000;8,0000;0,0000
INF;DIV;1,000;1,0000;0,0000
PAN;;5,500;4,5000;1,0000
PEF;;2,000;2,0000;0,0000
PMU;;1,000;1,0000;0,0000
PRI;;11,000;10,0000;1,0000
R02;;0,625;0,6250;0,0000
UEE;;1,000;1,0000;0,0000
08014814;Escola El Bruc;14,750;14,7500;0,0000
EES;;1,000;0,5000;0,5000
INF;;4,000;4,0000;0,0000
PAN;;1,000;1,0000;0,0000
PEF;;1,000;1,0000;0,0000
PMU;;0,500;1,0000;-0,5000
PRI;;7,000;7,0000;0,0000
R02;;0,250;0,2500;0,0000
08015843;Escola Lluís Vives;29,250;28,7500;0,5000
AAP;;1,000;1,0000;0,0000
EES;;1,000;1,0000;0,0000
INF;;6,000;7,5000;-1,5000
INF;DIV;1,000;0;1,000
INF;IAN;1,000;0;1,000
PAN;;2,000;2,0000;0,0000
PEF;;2,000;2,0000;0,0000
PMU;;1,000;1,0000;0,0000
PRI;;11,500;11,5000;0,0000
PRI;DIV;1,000;1,0000;0,0000
PRI;IAN;1,000;1,0000;0,0000
R02;;0,750;0,7500;0,0000
08015855;Escola Els Pins;29,250;28,2500;1,0000
EES;;2,000;2,0000;0,0000
INF;;7,000;7,0000;0,0000
PAN;;3,000;2,5000;0,5000
PEF;;2,000;2,0000;0,0000
PMU;;1,000;1,0000;0,0000
PMU;IAN;1,000;1,0000;0,0000
PRI;;10,000;11,5000;-1,5000
PRI;EGI;1,000;0;1,000
PRI;IAN;2,000;1,0000;1,0000
R02;;0,250;0,2500;0,0000
08015961;Escola Jacint Verdaguer;15,000;14,5000;0,5000
EES;;1,000;1,0000;0,0000
INF;;4,000;4,0000;0,0000
PAN;;1,000;1,0000;0,0000
PEF;;1,000;1,0000;0,0000
PMU;;1,500;1,5000;0,0000
PRI;;4,500;4,0000;0,5000
PRI;IAN;1,000;1,0000;0,0000
PRI;TIC;1,000;1,0000;0,0000
08016173;Escola Mare de Déu de Montserrat;13,000;12,0000;1,0000
EES;;1,000;1,0000;0,0000
INF;;3,000;3,0000;0,0000
PAN;;1,000;1,0000;0,0000
PEF;;1,000;1,0000;0,0000
PMU;;1,000;1,0000;0,0000
PRI;;6,000;5,0000;1,0000
08016240;Escola Santa Maria de Cervelló;27,500;26,5000;1,0000
EES;;1,500;1,5000;0,0000
INF;;7,000;7,0000;0,0000
PAN;;4,000;3,0000;1,0000
PEF;;2,000;2,0000;0,0000
PMU;;1,000;1,0000;0,0000
PRI;;12,000;12,0000;0,0000
08016264;Escola El Solell;19,875;21,3750;-1,5000
EES;;1,000;1,0000;0,0000
INF;;5,000;5,0000;0,0000
PAN;;2,000;2,0000;0,0000
PEF;;1,000;2,0000;-1,0000
PMU;;1,000;1,0000;0,0000
PRI;;9,500;10,0000;-0,5000
R02;;0,375;0,3750;0,0000
08016331;Escola Jaume Balmes;27,500;26,0000;1,5000
EES;;2,500;2,0000;0,5000
INF;;7,000;6,0000;1,0000
PAN;;2,000;2,0000;0,0000
PEF;;2,000;2,0000;0,0000
PMU;;2,000;1,0000;1,0000
PRI;;11,000;12,0000;-1,0000
R02;;1,000;1,0000;0,0000
08016367;Escola Dolors Almeda;27,500;26,5000;1,0000
EES;;1,500;1,5000;0,0000
INF;;8,000;8,0000;0,0000
PAN;;2,000;2,0000;0,0000
PEF;;2,000;2,0000;0,0000
PMU;;1,000;1,0000;0,0000
PRI;;11,000;11,0000;0,0000
PRI;EGI;1,000;0;1,000
PRI;IAN;1,000;1,0000;0,0000
08016380;Escola Anselm Clavé;15,500;15,0000;0,5000
EES;;1,000;1,0000;0,0000
INF;;4,000;3,5000;0,5000
PAN;;1,000;1,0000;0,0000
PEF;;1,000;1,0000;0,0000
PMU;;1,000;1,0000;0,0000
PRI;;7,000;7,0000;0,0000
R02;;0,500;0,5000;0,0000
08016392;Escola Mossèn Jacint Verdaguer;15,500;14,5000;1,0000
EES;;1,000;1,0000;0,0000
INF;;4,000;4,0000;0,0000
PAN;;2,000;1,0000;1,0000
PEF;;1,000;1,0000;0,0000
PMU;;1,500;1,5000;0,0000
PRI;;6,000;6,0000;0,0000
08016409;Escola Montserrat ;16,000;15,5000;0,5000
EES;;1,000;1,0000;0,0000
INF;;4,000;4,0000;0,0000
PAN;;1,000;1,0000;0,0000
PAN;DIV;1,000;1,0000;0,0000
PEF;;1,000;1,0000;0,0000
PMU;;1,000;1,0000;0,0000
PRI;;7,000;6,5000;0,5000
08016410;Escola Sant Ildefons ;28,250;27,7500;0,5000
AAP;;1,000;1,0000;0,0000
EES;;2,000;2,0000;0,0000
INF;;5,500;5,0000;0,5000
PAN;;2,000;2,0000;0,0000
PEF;;2,000;2,0000;0,0000
PMU;;1,000;1,0000;0,0000
PRI;;14,000;14,0000;0,0000
R02;;0,750;0,7500;0,0000
08016422;Escola Abat Oliba;25,500;22,5000;3,0000
AAP;;0,500;0,5000;0,0000
EES;;2,000;2,0000;0,0000
INF;;5,000;5,0000;0,0000
PAN;;2,000;2,0000;0,0000
PEF;;2,000;2,0000;0,0000
PMU;;1,000;1,0000;0,0000
PRI;;12,000;10,0000;2,0000
UEE;;1,000;0;1,000
08016744;Escola Antoni Gaudí;20,000;18,5000;1,5000
EES;;1,000;1,0000;0,0000
EES;DIV;1,000;1,0000;0,0000
INF;;5,000;5,0000;0,0000
PAN;;1,000;1,0000;0,0000
PAN;DIV;1,000;1,0000;0,0000
PEF;;1,000;1,0000;0,0000
PMU;;1,000;1,0000;0,0000
PRI;;7,500;6,0000;1,5000
PRI;DIV;1,000;1,0000;0,0000
R02;;0,500;0,5000;0,0000
08016771;Escola Els Pins;27,500;26,5000;1,0000
EES;;3,000;3,0000;0,0000
INF;;7,500;7,5000;0,0000
PAN;;2,000;2,0000;0,0000
PEF;;2,000;2,0000;0,0000
PMU;;1,000;1,0000;0,0000
PRI;;11,000;11,0000;0,0000
PRI;EGI;1,000;0;1,000
08016781;Institut Esteve Terradas i Illa ;140,830;134,0000;6,8300
501;;6,500;6,0000;0,5000
502;;1,000;1,0000;0,0000
505;;6,500;6,0000;0,5000
507;;11,500;11,0000;0,5000
511;;3,000;3,0000;0,0000
512;;7,500;7,0000;0,5000
522;;3,500;3,5000;0,0000
525;;2,000;2,0000;0,0000
609;;6,000;6,0000;0,0000
611;;10,000;9,0000;1,0000
622;;7,000;6,0000;1,0000
623;;7,500;6,0000;1,5000
627;;8,000;8,0000;0,0000
ADC;;1,500;1,0000;0,5000
AL;;0,500;0;0,500
AN;;9,000;9,5000;-0,5000
CLA;;1,000;1,0000;0,0000
CN;;3,500;3,5000;0,0000
DI;;2,000;2,0000;0,0000
ECO;;1,000;1,5000;-0,5000
EF;;2,500;2,0000;0,5000
FI;;1,000;1,0000;0,0000
FQ;;3,500;3,5000;0,0000
FR;;1,000;1,0000;0,0000
GE;;4,500;4,5000;0,0000
LC;;5,000;5,0000;0,0000
LE;;5,500;5,5000;0,0000
MA;;7,000;7,0000;0,0000
MU;;1,500;1,5000;0,0000
PFI;;1,330;1,0000;0,3300
PSI;;1,500;1,5000;0,0000
R01;;1,000;1,0000;0,0000
TEC;;5,000;5,0000;0,0000
UES;;2,000;1,5000;0,5000
08016793;Institut Francesc Macià;61,500;54,5000;7,0000
ADC;;1,000;0,5000;0,5000
AN;;6,500;6,5000;0,0000
CLA;;1,000;1,0000;0,0000
CN;;4,000;4,0000;0,0000
DI;;2,500;2,0000;0,5000
ECO;;1,500;1,0000;0,5000
EF;;2,500;2,5000;0,0000
FI;;2,000;1,0000;1,0000
FQ;;3,500;4,0000;-0,5000
FR;;1,000;1,0000;0,0000
GE;;5,000;5,0000;0,0000
LC;;7,500;6,0000;1,5000
LE;;6,000;5,0000;1,0000
MA;;7,000;6,0000;1,0000
MU;;1,500;1,5000;0,0000
PSI;;2,000;1,0000;1,0000
R01;;0,500;0,5000;0,0000
TEC;;5,000;4,5000;0,5000
UES;;1,500;1,5000;0,0000
08016872;Escola Mare de Déu de la Muntanya;15,250;14,7500;0,5000
EES;;1,000;1,0000;0,0000
INF;;4,000;4,0000;0,0000
PAN;;1,000;1,0000;0,0000
PEF;;1,000;1,0000;0,0000
PMU;;1,000;1,0000;0,0000
PRI;;7,000;6,5000;0,5000
R02;;0,250;0,2500;0,0000
08016938;Escola Taquígraf Garriga;29,125;28,1250;1,0000
EES;;2,500;2,0000;0,5000
INF;;7,000;6,0000;1,0000
PAN;;3,000;2,5000;0,5000
PEF;;2,000;2,0000;0,0000
PMU;;1,000;1,0000;0,0000
PRI;;12,000;13,0000;-1,0000
R02;;0,625;0,6250;0,0000
UEE;;1,000;1,0000;0,0000
08016941;Escola Isidre Martí;22,500;21,5000;1,0000
EES;;2,000;2,0000;0,0000
INF;;5,000;5,0000;0,0000
PAN;;3,000;1,0000;2,0000
PAN;TIC;1,000;1,0000;0,0000
PEF;;1,000;2,0000;-1,0000
PMU;;1,000;1,0000;0,0000
PRI;;8,000;8,0000;0,0000
PRI;IAN;1,000;1,0000;0,0000
R02;;0,500;0,5000;0,0000
08017104;Escola Gras i Soler;17,080;16,5800;0,5000
AAP;;1,000;1,0000;0,0000
EES;;1,000;1,0000;0,0000
INF;;4,000;4,0000;0,0000
PAN;;1,000;1,0000;0,0000
PEF;;1,000;1,0000;0,0000
PMU;;1,000;1,0000;0,0000
PRI;;7,500;7,0000;0,5000
R02;;0,500;0,5000;0,0000
R03;;0,080;0,0800;0,0000
08017116;Escola Matilde Orduña ;16,500;15,5000;1,0000
AAP;;0,500;0;0,500
EES;;1,000;1,0000;0,0000
INF;;4,000;4,0000;0,0000
PAN;;2,000;2,0000;0,0000
PEF;;1,000;1,0000;0,0000
PMU;;1,000;1,0000;0,0000
PRI;;6,000;5,5000;0,5000
PRI;LBI;1,000;1,0000;0,0000
08017131;Institut Severo Ochoa;88,500;82,5000;6,0000
501;;3,500;4,0000;-0,5000
502;;6,000;6,0000;0,0000
505;;3,000;3,0000;0,0000
508;;10,000;10,0000;0,0000
524;;2,000;2,0000;0,0000
602;;0,500;1,0000;-0,5000
608;;3,000;3,0000;0,0000
615;;1,000;1,0000;0,0000
620;;2,000;2,0000;0,0000
622;;4,000;3,5000;0,5000
625;;12,500;11,0000;1,5000
ADC;;1,500;0,5000;1,0000
AN;;5,000;4,5000;0,5000
CLA;;1,000;1,0000;0,0000
CN;;2,500;2,0000;0,5000
DI;;1,500;1,5000;0,0000
E17;;1,000;0,5000;0,5000
ECO;;1,000;1,0000;0,0000
EF;;2,000;2,0000;0,0000
FI;;1,000;1,0000;0,0000
FPB;;2,000;2,0000;0,0000
FQ;;2,000;2,0000;0,0000
FR;;1,000;1,0000;0,0000
GE;;2,000;2,0000;0,0000
LC;;2,000;1,5000;0,5000
LC;DIV;1,000;1,0000;0,0000
LE;;3,000;2,0000;1,0000
MA;;3,000;2,5000;0,5000
MA;IFR;1,000;1,0000;0,0000
MU;;1,000;1,0000;0,0000
PSI;DIV;1,000;1,0000;0,0000
R01;;0,500;0,5000;0,0000
TEC;;2,000;2,0000;0,0000
UES;;2,000;1,5000;0,5000
08017153;Institut Joanot Martorell ;45,500;42,0000;3,5000
ADC;;1,000;1,0000;0,0000
AN;;4,000;4,0000;0,0000
CLA;;1,000;1,0000;0,0000
CN;;3,000;2,5000;0,5000
DI;;2,000;1,5000;0,5000
ECO;;1,000;1,0000;0,0000
EF;;1,000;1,0000;0,0000
EF;IAN;1,000;1,0000;0,0000
FI;;1,000;1,0000;0,0000
FQ;;2,000;2,0000;0,0000
FR;;1,000;1,0000;0,0000
GE;;4,000;3,5000;0,5000
GE;IAN;1,000;0;1,000
LC;;4,500;3,0000;1,5000
LE;;3,000;2,5000;0,5000
LE;DIV;1,000;1,0000;0,0000
MA;;5,000;5,0000;0,0000
MU;;1,000;1,0000;0,0000
PSI;;2,000;1,0000;1,0000
R01;;1,000;1,0000;0,0000
TEC;;4,000;4,0000;0,0000
UES;;1,000;2,0000;-1,0000
08017359;Escola Salvador Lluch;29,500;28,5000;1,0000
EES;;1,500;1,5000;0,0000
INF;;8,000;8,0000;0,0000
PAN;;3,000;3,0000;0,0000
PEF;;2,000;2,0000;0,0000
PMU;;1,000;1,0000;0,0000
PRI;;11,000;11,0000;0,0000
PRI;IAN;1,000;0;1,000
R02;;1,000;1,0000;0,0000
UEE;;1,000;1,0000;0,0000
08017360;Escola Jacme March ;23,500;24,0000;-0,5000
AAP;;1,000;1,0000;0,0000
ALL;;1,000;1,0000;0,0000
EES;;1,000;1,0000;0,0000
INF;;5,000;5,0000;0,0000
PAN;;2,500;2,0000;0,5000
PEF;;2,000;2,0000;0,0000
PMU;;1,000;1,0000;0,0000
PRI;;9,000;10,0000;-1,0000
R02;;1,000;1,0000;0,0000
08017505;Escola Juan Salamero ;14,500;13,0000;1,5000
EES;;2,000;2,0000;0,0000
INF;;3,500;3,0000;0,5000
PAN;;1,000;1,0000;0,0000
PEF;;2,000;2,0000;0,0000
PMU;;1,000;1,0000;0,0000
PRI;;5,000;4,0000;1,0000
08017530;Institut de Bruguers;50,500;43,0000;7,5000
512;;1,000;1,0000;0,0000
525;;1,000;1,0000;0,0000
ADC;;1,000;0,5000;0,5000
AL;;0,500;0;0,500
AN;;3,500;3,0000;0,5000
CLA;;2,000;1,0000;1,0000
CN;;4,000;3,0000;1,0000
DI;;2,000;2,0000;0,0000
ECO;;1,000;0;1,000
EF;;2,000;2,0000;0,0000
FI;;1,500;1,0000;0,5000
FQ;;3,000;3,0000;0,0000
FR;;1,000;1,0000;0,0000
GE;;4,000;4,0000;0,0000
LC;;3,000;3,5000;-0,5000
LE;;5,000;4,0000;1,0000
MA;;5,500;4,0000;1,5000
MU;;1,000;1,0000;0,0000
PAN;;1,000;1,0000;0,0000
PSI;;2,000;1,0000;1,0000
R01;;1,000;1,0000;0,0000
TEC;;1,500;2,0000;-0,5000
08020498;Escola Els Convents ;17,000;16,5000;0,5000
EES;;2,000;2,0000;0,0000
INF;;4,000;4,0000;0,0000
PAN;;2,000;1,0000;1,0000
PEF;;1,000;1,0000;0,0000
PMU;;1,000;1,0000;0,0000
PRI;;7,000;7,5000;-0,5000
08020516;CEE El Pontarró ;27,000;26,0000;1,0000
ALL;;3,000;3,0000;0,0000
EES;;23,000;22,0000;1,0000
PEF;;1,000;1,0000;0,0000
08020607;Escola Juan Ramón Jiménez;28,250;27,2500;1,0000
EES;;2,000;2,0000;0,0000
INF;;8,000;7,5000;0,5000
PAN;;2,500;2,0000;0,5000
PEF;;2,000;2,0000;0,0000
PMU;;1,000;1,0000;0,0000
PRI;;12,000;12,0000;0,0000
R02;;0,750;0,7500;0,0000
08020619;Escola José Echegaray ;31,125;30,1250;1,0000
AAP;;1,000;1,0000;0,0000
EES;;2,000;3,0000;-1,0000
INF;;6,000;5,0000;1,0000
PAN;;3,000;2,0000;1,0000
PEF;;2,000;2,0000;0,0000
PMU;;1,000;1,0000;0,0000
PRI;;14,500;14,5000;0,0000
PRI;IAN;1,000;1,0000;0,0000
R02;;0,625;0,6250;0,0000
08020620;Institut Pompeu Fabra;76,500;66,5000;10,0000
ADC;;0,500;0,5000;0,0000
AN;;6,500;5,0000;1,5000
CLA;;2,000;2,0000;0,0000
CN;;5,000;4,0000;1,0000
DI;;6,500;5,0000;1,5000
DI;DIV;1,000;1,0000;0,0000
ECO;;2,000;1,5000;0,5000
EF;;3,000;2,5000;0,5000
FI;;2,000;2,0000;0,0000
FQ;;5,000;4,0000;1,0000
FR;;0,500;1,0000;-0,5000
GE;;8,000;7,0000;1,0000
LC;;5,000;5,0000;0,0000
LC;DIV;1,000;1,0000;0,0000
LE;;6,500;5,5000;1,0000
MA;;7,000;6,0000;1,0000
MA;DIV;1,000;1,0000;0,0000
MU;;1,500;1,0000;0,5000
PAN;;1,000;1,0000;0,0000
PSI;;1,000;1,0000;0,0000
PSI;DIV;1,000;1,0000;0,0000
R01;;1,000;1,0000;0,0000
TEC;;6,500;5,5000;1,0000
08020841;Escola El Turó;32,500;27,3750;5,1250
EES;;1,000;1,0000;0,0000
INF;;8,000;8,0000;0,0000
PAN;;2,000;2,0000;0,0000
PEF;;3,000;2,0000;1,0000
PMU;;2,000;1,5000;0,5000
PRI;;15,500;12,0000;3,5000
R02;;1,000;0,8750;0,1250
08021351;Escola El Palau;15,000;15,5000;-0,5000
EES;;1,000;1,0000;0,0000
INF;;4,000;4,0000;0,0000
PAN;;2,000;1,5000;0,5000
PEF;;1,000;1,0000;0,0000
PMU;;1,000;1,0000;0,0000
PRI;;6,000;7,0000;-1,0000
08021363;Escola L'Alzina;15,330;14,8300;0,5000
EES;;1,000;1,0000;0,0000
INF;;4,000;4,0000;0,0000
PAN;;1,000;1,0000;0,0000
PEF;;1,000;1,0000;0,0000
PMU;;1,000;1,0000;0,0000
PRI;;6,000;5,5000;0,5000
PRI;IAN;1,000;1,0000;0,0000
R02;;0,250;0,2500;0,0000
R03;;0,080;0,0800;0,0000
08021430;Institut Lluís de Requesens;57,000;46,5000;10,5000
AN;;6,000;5,0000;1,0000
CLA;;1,000;1,0000;0,0000
CN;;4,000;3,0000;1,0000
CN;DIV;1,000;1,0000;0,0000
DI;;2,000;1,5000;0,5000
ECO;;1,500;1,0000;0,5000
EF;;2,500;2,0000;0,5000
FI;;1,500;1,0000;0,5000
FQ;;3,000;3,0000;0,0000
FR;;1,000;1,0000;0,0000
GE;;6,000;4,0000;2,0000
LC;;6,000;5,5000;0,5000
LE;;4,000;3,0000;1,0000
LE;DIV;1,000;1,0000;0,0000
MA;;6,000;4,0000;2,0000
MU;;1,500;1,0000;0,5000
PSI;;1,500;1,0000;0,5000
R01;;0,500;0,5000;0,0000
TEC;;3,000;3,0000;0,0000
UES;;2,000;2,0000;0,0000
08021442;Escola Castell Ciuró;26,375;25,3750;1,0000
EES;;1,000;1,0000;0,0000
INF;;7,000;7,0000;0,0000
INF;EGI;1,000;0;1,000
PAN;;3,000;3,0000;0,0000
PEF;;1,000;1,0000;0,0000
PMU;;1,000;1,0000;0,0000
PRI;;11,000;10,0000;1,0000
PRI;LBI;0;1,0000;-1,0000
PRI;TIC;1,000;1,0000;0,0000
R02;;0,375;0,3750;0,0000
08022380;Escola Mare de Déu de Montserrat ;26,500;26,0000;0,5000
EES;;2,000;3,0000;-1,0000
INF;;6,000;6,0000;0,0000
PAN;;3,000;2,0000;1,0000
PEF;;3,000;2,0000;1,0000
PMU;;1,000;1,0000;0,0000
PRI;;9,500;10,0000;-0,5000
PRI;DIV;1,000;1,0000;0,0000
R02;;1,000;1,0000;0,0000
08022461;Escola Sant Bernat;29,000;28,0000;1,0000
AAP;;0,500;0,5000;0,0000
ALL;;1,000;1,0000;0,0000
EES;;1,000;1,0000;0,0000
INF;;8,000;8,0000;0,0000
PAN;;1,500;1,5000;0,0000
PEF;;2,000;2,0000;0,0000
PMU;;1,000;1,0000;0,0000
PRI;;13,000;12,0000;1,0000
R02;;1,000;1,0000;0,0000
08022665;Escola Àngel Guimerà;22,750;22,7500;0,0000
EES;;1,000;1,0000;0,0000
INF;;4,000;4,0000;0,0000
PAN;;2,000;2,0000;0,0000
PEF;;1,000;1,0000;0,0000
PMU;;1,000;1,0000;0,0000
PRI;;13,000;13,0000;0,0000
R02;;0,750;0,7500;0,0000
08022677;Escola Jacint Verdaguer;16,500;16,0000;0,5000
EES;;1,000;1,0000;0,0000
INF;;5,000;5,0000;0,0000
PAN;;1,000;1,0000;0,0000
PEF;;0;1,0000;-1,0000
PEF;IAN;1,000;0;1,000
PMU;;1,500;1,5000;0,0000
PRI;;6,500;6,0000;0,5000
R02;;0,500;0,5000;0,0000
08022689;Escola Pau Vila;27,125;25,1250;2,0000
EES;;2,000;2,0000;0,0000
INF;;8,000;7,0000;1,0000
PAN;;2,000;2,0000;0,0000
PEF;;2,000;2,0000;0,0000
PMU;;1,000;1,0000;0,0000
PRI;;12,000;11,0000;1,0000
R02;;0,125;0,1250;0,0000
08022884;Escola Joan Maragall;17,500;17,0000;0,5000
EES;;0;1,0000;-1,0000
EES;LBI;1,000;0;1,000
INF;;5,000;4,5000;0,5000
PAN;;1,000;1,0000;0,0000
PEF;;1,000;1,0000;0,0000
PMU;;1,000;1,0000;0,0000
PRI;;6,000;6,0000;0,0000
PRI;DIV;1,000;1,0000;0,0000
PRI;IAN;1,000;1,0000;0,0000
R02;;0,500;0,5000;0,0000
08022902;Escola del Parc;29,000;28,0000;1,0000
EES;;2,000;2,0000;0,0000
INF;;7,000;7,0000;0,0000
INF;IAN;1,000;1,0000;0,0000
PAN;;2,000;2,0000;0,0000
PEF;;2,500;2,0000;0,5000
PMU;;1,000;1,0000;0,0000
PRI;;12,000;12,5000;-0,5000
PRI;EGI;1,000;0;1,000
R02;;0,500;0,5000;0,0000
08022914;Escola Jaume Balmes ;33,000;27,5000;5,5000
AAP;;1,000;0;1,000
EES;;3,000;3,0000;0,0000
INF;;9,000;7,0000;2,0000
PAN;;2,000;2,0000;0,0000
PEF;;1,000;1,0000;0,0000
PMU;;1,000;1,0000;0,0000
PRI;;13,000;10,5000;2,5000
PRI;DIV;3,000;3,0000;0,0000
08022926;CEE Can Rigol ;28,500;27,5000;1,0000
ALL;;3,000;3,0000;0,0000
EES;;18,500;17,5000;1,0000
EES;DIV;6,000;6,0000;0,0000
PEF;;1,000;1,0000;0,0000
08022938;Escola Jacint Verdaguer;29,500;28,5000;1,0000
EES;;1,500;1,5000;0,0000
INF;;8,000;8,0000;0,0000
PAN;;3,000;3,0000;0,0000
PEF;;2,000;2,0000;0,0000
PMU;;1,500;1,0000;0,5000
PRI;;11,000;12,5000;-1,5000
PRI;DIV;1,000;0;1,000
PRI;IAN;1,000;0;1,000
R02;;0,500;0,5000;0,0000
08023131;Institut Baldiri Guilera ;59,500;54,5000;5,0000
525;;1,000;1,0000;0,0000
ADC;;1,000;0,5000;0,5000
AN;;6,000;5,0000;1,0000
CLA;;2,000;2,0000;0,0000
CN;;4,000;4,0000;0,0000
DI;;3,000;3,0000;0,0000
ECO;;1,000;1,0000;0,0000
EF;;2,000;2,0000;0,0000
FI;;1,000;1,0000;0,0000
FQ;;4,500;4,0000;0,5000
FR;;1,000;0,5000;0,5000
GE;;4,000;4,0000;0,0000
LC;;4,500;5,0000;-0,5000
LE;;6,000;4,5000;1,5000
MA;;4,000;4,0000;0,0000
MU;;1,000;1,0000;0,0000
PSI;;3,000;2,0000;1,0000
R01;;0,500;0,5000;0,0000
TEC;;4,000;3,5000;0,5000
08025241;Escola Joan Maragall;15,500;15,0000;0,5000
EES;;1,000;1,0000;0,0000
INF;;4,000;4,0000;0,0000
PAN;;1,000;1,0000;0,0000
PEF;;2,000;1,0000;1,0000
PMU;;1,000;1,5000;-0,5000
PRI;;5,000;6,0000;-1,0000
PRI;DIV;1,000;0;1,000
R02;;0,500;0,5000;0,0000
08025265;Escola Àngel Guimerà;34,500;34,0000;0,5000
EES;;3,000;3,0000;0,0000
INF;;7,000;7,0000;0,0000
PAN;;3,000;3,0000;0,0000
PEF;;2,000;2,0000;0,0000
PMU;;2,000;2,0000;0,0000
PRI;;16,500;16,0000;0,5000
R02;;1,000;1,0000;0,0000
08025344;Escola Amat Verdú;25,500;25,0000;0,5000
EES;;2,500;2,5000;0,0000
INF;;6,000;6,0000;0,0000
PAN;;1,000;1,0000;0,0000
PEF;;2,000;2,0000;0,0000
PMU;;1,000;1,0000;0,0000
PRI;;11,000;10,5000;0,5000
PRI;LBI;1,000;1,0000;0,0000
UEE;;1,000;1,0000;0,0000
08025526;Escola Ciutat Cooperativa ;16,000;15,5000;0,5000
AAP;;0,500;0,5000;0,0000
EES;;1,000;1,0000;0,0000
INF;;3,000;3,0000;0,0000
PAN;;2,000;1,5000;0,5000
PEF;;1,000;1,0000;0,0000
PMU;;1,000;1,0000;0,0000
PRI;;6,000;6,0000;0,0000
R02;;0,500;0,5000;0,0000
UEE;;1,000;1,0000;0,0000
08025587;Escola Casablanca ;30,000;29,0000;1,0000
EES;;2,000;2,0000;0,0000
INF;;9,000;9,0000;0,0000
PAN;;3,000;2,0000;1,0000
PEF;;2,000;2,0000;0,0000
PMU;;1,000;1,0000;0,0000
PRI;;12,500;12,5000;0,0000
R02;;0,500;0,5000;0,0000
08025599;Escola Marianao;16,500;15,0000;1,5000
EES;;2,000;2,0000;0,0000
INF;;6,000;5,0000;1,0000
PAN;;1,000;1,0000;0,0000
PEF;;1,000;1,0000;0,0000
PMU;;1,000;1,5000;-0,5000
PRI;;5,000;4,0000;1,0000
R02;;0,500;0,5000;0,0000
08025605;Institut Camps Blancs ;112,000;104,5000;7,5000
501;;3,500;3,5000;0,0000
503;;4,000;4,5000;-0,5000
505;;4,000;4,0000;0,0000
508;;8,000;6,5000;1,5000
511;;5,000;4,0000;1,0000
524;;3,500;3,5000;0,0000
524;GPS;1,000;1,0000;0,0000
602;;4,000;3,0000;1,0000
603;;7,000;6,5000;0,5000
609;;7,000;8,0000;-1,0000
618;;4,000;4,0000;0,0000
620;;2,000;2,0000;0,0000
622;;4,000;3,5000;0,5000
625;;8,000;6,0000;2,0000
AN;;5,000;4,0000;1,0000
AN;DIV;1,000;1,0000;0,0000
CN;;1,000;1,0000;0,0000
CN;DIV;1,000;1,0000;0,0000
DI;;3,000;3,0000;0,0000
E17;;1,000;1,0000;0,0000
ECO;;1,000;1,0000;0,0000
EF;;1,000;1,0000;0,0000
FI;;1,000;1,0000;0,0000
FQ;;4,000;4,0000;0,0000
FR;;1,000;1,0000;0,0000
GE;;4,000;4,0000;0,0000
LC;;4,000;2,0000;2,0000
LC;DIV;0;1,0000;-1,0000
LE;;2,000;3,0000;-1,0000
LE;DIV;1,000;0;1,000
MA;;4,500;4,0000;0,5000
MU;;1,000;1,0000;0,0000
PFI;;0,500;0,5000;0,0000
PSI;;2,000;2,0000;0,0000
R01;;0,500;0,5000;0,0000
TEC;;3,000;3,0000;0,0000
UES;;1,500;1,5000;0,0000
08025642;Escola Josep Maria Ciurana;28,500;27,5000;1,0000
EES;;3,000;3,0000;0,0000
INF;;7,500;7,5000;0,0000
PAN;;2,000;2,0000;0,0000
PEF;;2,000;2,0000;0,0000
PMU;;1,000;1,0000;0,0000
PRI;;6,000;8,0000;-2,0000
PRI;DIV;3,000;1,0000;2,0000
PRI;IAN;3,000;2,0000;1,0000
UEE;;1,000;1,0000;0,0000
08025654;Institut Joaquim Rubió i Ors;59,000;51,5000;7,5000
524;;1,000;1,0000;0,0000
ADC;;1,000;0,5000;0,5000
AN;;6,500;5,5000;1,0000
CLA;;2,000;2,0000;0,0000
CN;;3,000;3,0000;0,0000
DI;;2,000;1,5000;0,5000
ECO;;2,000;1,5000;0,5000
EF;;3,000;2,5000;0,5000
FI;;2,000;1,5000;0,5000
FQ;;5,000;4,0000;1,0000
FR;;1,000;1,0000;0,0000
GE;;5,000;5,0000;0,0000
LC;;5,500;4,5000;1,0000
LE;;5,000;4,5000;0,5000
MA;;5,000;5,0000;0,0000
MU;;2,500;2,0000;0,5000
PSI;;2,000;1,0000;1,0000
R01;;0,500;0,5000;0,0000
TEC;;4,000;4,0000;0,0000
08025812;Escola Sant Climent;31,000;31,0000;0,0000
ALL;;1,000;1,0000;0,0000
EES;;1,000;1,0000;0,0000
INF;;8,000;8,0000;0,0000
PAN;;2,500;2,5000;0,0000
PEF;;2,000;2,0000;0,0000
PMU;;1,000;1,0000;0,0000
PRI;;14,000;14,0000;0,0000
R02;;0,500;0,5000;0,0000
UEE;;1,000;1,0000;0,0000
08026130;Escola La Roureda;26,500;27,0000;-0,5000
EES;;2,000;2,0000;0,0000
INF;;7,000;7,0000;0,0000
PAN;;2,000;2,5000;-0,5000
PEF;;2,000;2,0000;0,0000
PMU;;1,000;1,0000;0,0000
PRI;;9,000;9,0000;0,0000
PRI;DIV;2,000;2,0000;0,0000
PRI;EGI;1,000;1,0000;0,0000
R02;;0,500;0,5000;0,0000
08026211;Escola Nadal;28,500;27,5000;1,0000
EES;;2,000;2,0000;0,0000
INF;;6,000;6,0000;0,0000
INF;IAN;2,000;2,0000;0,0000
PAN;;2,500;2,5000;0,0000
PEF;;2,000;2,0000;0,0000
PMU;;1,000;1,0000;0,0000
PRI;;11,000;10,0000;1,0000
PRI;IAN;1,000;1,0000;0,0000
R02;;1,000;1,0000;0,0000
08026221;Escola Falguera;15,750;14,7500;1,0000
EES;;1,000;1,0000;0,0000
INF;;4,500;4,5000;0,0000
PAN;;1,000;1,0000;0,0000
PEF;;2,000;2,0000;0,0000
PMU;;1,000;1,0000;0,0000
PRI;;4,000;4,0000;0,0000
PRI;DIV;1,000;0;1,000
PRI;IAN;1,000;1,0000;0,0000
R02;;0,250;0,2500;0,0000
08026373;Escola Josep Monmany Amat;23,500;22,5000;1,0000
AAP;;1,000;0;1,000
EES;;2,000;2,0000;0,0000
INF;;4,000;4,0000;0,0000
PAN;;3,000;3,0000;0,0000
PEF;;1,000;1,0000;0,0000
PMU;;2,000;2,0000;0,0000
PRI;;10,000;10,0000;0,0000
R02;;0,500;0,5000;0,0000
08026385;Escola Arquitecte Gaudí;18,125;18,1250;0,0000
EES;;2,000;1,5000;0,5000
INF;;4,000;4,0000;0,0000
PAN;;2,000;1,5000;0,5000
PEF;;2,000;1,0000;1,0000
PMU;;1,000;1,0000;0,0000
PRI;;6,000;8,0000;-2,0000
R02;;0,125;0,1250;0,0000
UEE;;1,000;1,0000;0,0000
08026397;Institut Olorda;65,000;58,0000;7,0000
ADC;;1,000;1,0000;0,0000
AN;;5,500;4,5000;1,0000
AN;DIV;1,000;1,0000;0,0000
AN;EDP;1,000;1,0000;0,0000
CLA;;1,000;1,0000;0,0000
CN;;3,000;3,0000;0,0000
CN;DIV;1,000;1,0000;0,0000
DI;;3,500;3,0000;0,5000
DI;EDP;2,000;2,0000;0,0000
EES;;0;1,0000;-1,0000
EF;;2,000;2,0000;0,0000
EF;DIV;1,000;1,0000;0,0000
FI;;1,000;1,0000;0,0000
FQ;;5,000;4,0000;1,0000
FR;;1,000;1,0000;0,0000
GE;;5,000;4,5000;0,5000
LC;;7,000;5,0000;2,0000
LE;;5,500;5,5000;0,0000
LE;DIV;1,000;1,0000;0,0000
MA;;7,500;6,0000;1,5000
MU;;2,500;2,0000;0,5000
PSI;;2,000;1,0000;1,0000
R01;;0,500;0,5000;0,0000
TEC;;4,000;4,0000;0,0000
08026567;Escola Sant Francesc d'Assís;30,500;30,5000;0,0000
ALL;;1,000;1,0000;0,0000
EES;;0;1,0000;-1,0000
EES;DIV;1,000;0;1,000
INF;;8,000;9,0000;-1,0000
PAN;;3,000;2,0000;1,0000
PEF;;2,000;2,0000;0,0000
PMU;;1,000;1,0000;0,0000
PRI;;14,000;14,0000;0,0000
R02;;0,500;0,5000;0,0000
08026661;Escola Pau Casals;27,500;26,5000;1,0000
EES;;2,000;2,0000;0,0000
INF;;8,000;8,0000;0,0000
PAN;;2,000;2,0000;0,0000
PEF;;2,000;2,0000;0,0000
PMU;;1,000;1,0000;0,0000
PRI;;11,500;10,5000;1,0000
PRI;IAN;1,000;1,0000;0,0000
08026671;Escola Joan Perich i Valls;17,000;18,0000;-1,0000
EES;;1,000;2,0000;-1,0000
INF;;4,000;4,0000;0,0000
PAN;;2,000;2,0000;0,0000
PEF;;1,000;1,0000;0,0000
PMU;;1,000;1,0000;0,0000
PRI;;7,000;8,0000;-1,0000
PRI;IAN;1,000;0;1,000
08026683;Institut Francesc Ferrer i Guàrdia;73,500;69,5000;4,0000
504;;0;2,0000;-2,0000
505;;1,000;1,5000;-0,5000
510;;5,000;4,5000;0,5000
510;IAN;1,000;1,0000;0,0000
518;;1,500;1,5000;0,0000
518;IAN;1,000;1,0000;0,0000
620;;6,000;5,5000;0,5000
621;;4,000;4,0000;0,0000
ADC;;1,000;1,0000;0,0000
AN;;6,500;6,5000;0,0000
CLA;;1,500;1,0000;0,5000
CN;;3,000;2,0000;1,0000
DI;;1,500;1,5000;0,0000
ECO;;1,500;1,0000;0,5000
EF;;2,000;2,0000;0,0000
FI;;1,000;1,0000;0,0000
FQ;;3,000;3,0000;0,0000
FR;;1,000;1,0000;0,0000
GE;;4,000;3,5000;0,5000
GE;DIV;1,000;0;1,000
LC;;4,000;3,0000;1,0000
LC;DIV;1,000;1,0000;0,0000
LE;;4,000;4,0000;0,0000
MA;;6,000;5,0000;1,0000
MU;;1,000;1,0000;0,0000
MU;DIV;1,000;1,0000;0,0000
PSI;;1,000;1,0000;0,0000
PSI;DIV;1,000;1,0000;0,0000
R01;;1,000;1,0000;0,0000
TEC;;5,000;5,0000;0,0000
TEC;DIV;1,000;1,0000;0,0000
08026816;Escola Montserrat;23,500;20,0000;3,5000
EES;;1,000;1,0000;0,0000
INF;;7,000;6,5000;0,5000
INF;LBI;1,000;0;1,000
PAN;;2,000;2,0000;0,0000
PEF;;1,000;1,0000;0,0000
PMU;;2,000;1,0000;1,0000
PRI;;9,000;8,0000;1,0000
R02;;0,500;0,5000;0,0000
08028588;Escola Sant Jordi;17,625;17,1250;0,5000
EES;;1,000;1,0000;0,0000
INF;;4,000;3,5000;0,5000
PAN;;2,000;2,0000;0,0000
PEF;;1,000;1,0000;0,0000
PMU;;1,000;1,0000;0,0000
PRI;;6,000;8,0000;-2,0000
PRI;DIV;2,000;0;2,000
R02;;0,625;0,6250;0,0000
08028591;Escola La Vinyala;26,250;25,7500;0,5000
EES;;2,000;1,0000;1,0000
INF;;7,000;7,0000;0,0000
PAN;;2,500;2,0000;0,5000
PEF;;2,000;2,0000;0,0000
PMU;;1,000;1,0000;0,0000
PRI;;11,000;12,0000;-1,0000
R02;;0,750;0,7500;0,0000
08028667;Escola Joan Juncadella;29,750;24,7500;5,0000
EES;;3,000;2,0000;1,0000
INF;;7,000;5,5000;1,5000
PAN;;2,000;2,0000;0,0000
PEF;;1,000;2,0000;-1,0000
PEF;IAN;1,000;0;1,000
PMU;;1,000;1,0000;0,0000
PRI;;13,500;11,0000;2,5000
R02;;0,250;0,2500;0,0000
UEE;;1,000;1,0000;0,0000
08030649;Escola Sant Martí;26,375;26,8750;-0,5000
EES;;1,000;1,0000;0,0000
INF;;7,000;7,5000;-0,5000
PAN;;2,000;2,0000;0,0000
PEF;;2,000;2,0000;0,0000
PMU;;1,000;1,0000;0,0000
PRI;;12,000;12,0000;0,0000
PRI;DIV;1,000;1,0000;0,0000
R02;;0,375;0,3750;0,0000
08030789;Escola Pompeu Fabra;22,500;23,0000;-0,5000
EES;;2,000;2,0000;0,0000
INF;;5,000;5,0000;0,0000
PAN;;2,000;2,0000;0,0000
PEF;;1,000;1,0000;0,0000
PMU;;1,000;1,0000;0,0000
PRI;;11,000;11,5000;-0,5000
R02;;0,500;0,5000;0,0000
08031083;Escola Àngela Roca ;24,250;24,7500;-0,5000
EES;;2,000;2,0000;0,0000
INF;;4,500;5,0000;-0,5000
PAN;;2,000;2,0000;0,0000
PEF;;3,000;2,0000;1,0000
PMU;;1,000;1,0000;0,0000
PRI;;11,000;12,0000;-1,0000
R02;;0,750;0,7500;0,0000
08031101;Escola Montserratina;29,000;28,5000;0,5000
AAP;;0;1,0000;-1,0000
EES;;2,000;2,0000;0,0000
INF;;7,000;7,0000;0,0000
INF;IAN;1,000;1,0000;0,0000
PAN;;3,000;3,0000;0,0000
PEF;;2,000;2,0000;0,0000
PMU;;1,000;1,0000;0,0000
PRI;;10,500;9,0000;1,5000
PRI;DIV;1,000;1,0000;0,0000
PRI;LBI;1,000;1,0000;0,0000
R02;;0,500;0,5000;0,0000
08031204;Escola El Garrofer;28,000;28,0000;0,0000
EES;;1,500;1,5000;0,0000
INF;;8,000;8,0000;0,0000
PAN;;2,000;2,0000;0,0000
PEF;;2,000;2,0000;0,0000
PMU;;1,000;1,0000;0,0000
PRI;;10,000;10,0000;0,0000
PRI;DIV;1,000;1,0000;0,0000
PRI;EGI;1,000;0;1,000
PRI;ISL;1,000;0;1,000
PRI;LBI;0;1,0000;-1,0000
PRI;TIC;0;1,0000;-1,0000
R02;;0,500;0,5000;0,0000
08031228;Institut Torre Roja;83,500;81,0000;2,5000
501;;1,000;1,0000;0,0000
505;;1,000;1,0000;0,0000
507;;3,000;2,5000;0,5000
508;;2,000;2,0000;0,0000
510;;3,500;3,0000;0,5000
620;;1,000;1,0000;0,0000
621;;3,000;5,0000;-2,0000
622;;2,000;1,0000;1,0000
625;;1,000;1,0000;0,0000
627;;1,000;2,0000;-1,0000
ADC;;1,000;1,0000;0,0000
AN;;6,500;6,0000;0,5000
CLA;;1,000;1,0000;0,0000
CN;;4,000;4,0000;0,0000
DI;;2,500;2,0000;0,5000
ECO;;1,000;1,0000;0,0000
EF;;3,000;2,5000;0,5000
EF;EDP;0;1,0000;-1,0000
FI;;1,000;1,0000;0,0000
FQ;;4,000;3,5000;0,5000
FR;;1,000;1,0000;0,0000
GE;;5,000;5,0000;0,0000
LC;;6,000;5,0000;1,0000
LE;;4,500;5,0000;-0,5000
MA;;6,000;6,0000;0,0000
MU;;2,000;2,0000;0,0000
PAN;;1,000;1,0000;0,0000
PFI;;0,500;0,5000;0,0000
PSI;;5,500;3,5000;2,0000
PSI;DIV;1,000;1,0000;0,0000
R01;;0,500;0,5000;0,0000
TEC;;5,000;5,0000;0,0000
08031836;Institut Illa dels Banyols;44,000;42,0000;2,0000
505;;2,500;2,0000;0,5000
511;;3,000;3,0000;0,0000
511;EDP;2,000;2,0000;0,0000
513;;3,500;4,5000;-1,0000
525;;4,000;4,0000;0,0000
525;EDP;1,000;1,0000;0,0000
605;;4,000;4,0000;0,0000
606;;5,000;4,0000;1,0000
609;;11,000;10,0000;1,0000
AN;;1,500;1,0000;0,5000
E05;;6,000;6,0000;0,0000
LC;;0,500;0,5000;0,0000
08032476;Escola Prat de la Riba;15,500;14,5000;1,0000
AAP;;0,500;0;0,500
EES;;1,000;1,0000;0,0000
INF;;4,000;4,0000;0,0000
PAN;;1,000;1,5000;-0,5000
PEF;;1,000;1,0000;0,0000
PMU;;1,000;1,0000;0,0000
PRI;;6,000;5,0000;1,0000
PRI;IAN;1,000;1,0000;0,0000
08032521;Escola Vall de Palau;29,125;28,1250;1,0000
EES;;4,000;3,0000;1,0000
INF;;8,000;10,0000;-2,0000
PAN;;2,500;2,0000;0,5000
PEF;;2,000;2,0000;0,0000
PMU;;1,000;1,0000;0,0000
PRI;;11,000;9,5000;1,5000
R02;;0,625;0,6250;0,0000
08032580;Escola Canigó;27,875;26,8750;1,0000
EES;;2,000;2,0000;0,0000
INF;;7,000;7,0000;0,0000
INF;IAN;1,000;0;1,000
PAN;;2,000;2,0000;0,0000
PEF;;2,000;2,0000;0,0000
PMU;;1,000;1,0000;0,0000
PRI;;8,500;9,5000;-1,0000
PRI;DIV;1,000;0;1,000
PRI;IAN;3,000;3,0000;0,0000
R02;;0,375;0,3750;0,0000
08032658;Escola L'Eramprunyà;29,500;27,5000;2,0000
AAP;;1,000;0;1,000
EES;;1,500;1,5000;0,0000
INF;;8,000;8,0000;0,0000
PAN;;5,000;4,0000;1,0000
PEF;;2,000;2,0000;0,0000
PMU;;1,000;1,0000;0,0000
PRI;;10,000;10,0000;0,0000
R02;;1,000;1,0000;0,0000
08032725;Escola Honorable Josep Tarradellas;32,500;29,5000;3,0000
ALL;;0,500;0;0,500
EES;;1,000;1,0000;0,0000
EES;DIV;1,000;1,0000;0,0000
INF;;9,000;8,0000;1,0000
PAN;;4,000;4,0000;0,0000
PEF;;3,000;3,0000;0,0000
PMU;;1,000;1,0000;0,0000
PRI;;10,500;9,0000;1,5000
PRI;IAN;1,000;1,0000;0,0000
PRI;TIC;1,000;1,0000;0,0000
R02;;0,500;0,5000;0,0000
08032750;Escola Pau Casals;30,250;27,7500;2,5000
EES;;3,000;2,0000;1,0000
INF;;8,000;8,0000;0,0000
PAN;;3,000;2,5000;0,5000
PEF;;3,000;3,0000;0,0000
PMU;;1,000;1,0000;0,0000
PRI;;12,000;11,0000;1,0000
R02;;0,250;0,2500;0,0000
08032762;Escola Doctor Trueta;28,000;27,0000;1,0000
EES;;3,000;3,0000;0,0000
INF;;7,500;7,5000;0,0000
PAN;;3,000;3,0000;0,0000
PEF;;2,000;2,0000;0,0000
PMU;;1,000;1,0000;0,0000
PRI;;11,000;10,0000;1,0000
R02;;0,500;0,5000;0,0000
08033468;Escola La Salut;23,500;22,5000;1,0000
EES;;2,000;2,0000;0,0000
INF;;5,000;4,0000;1,0000
PAN;;2,000;2,0000;0,0000
PEF;;2,000;2,0000;0,0000
PMU;;1,000;0;1,000
PRI;;11,000;12,0000;-1,0000
R02;;0,500;0,5000;0,0000
08033535;Escola Joan Maragall ;31,500;29,0000;2,5000
AAP;;1,000;1,0000;0,0000
EES;;2,000;2,5000;-0,5000
INF;;8,000;7,0000;1,0000
PAN;;2,500;2,5000;0,0000
PEF;;2,000;2,0000;0,0000
PMU;;1,000;1,0000;0,0000
PRI;;14,000;13,0000;1,0000
UEE;;1,000;0;1,000
08033900;Institut Joan Miró;41,000;38,0000;3,0000
AL;;1,000;0,5000;0,5000
AN;;5,000;4,5000;0,5000
CLA;;1,000;1,0000;0,0000
CN;;2,000;2,0000;0,0000
DI;;1,000;1,0000;0,0000
ECO;;2,000;1,0000;1,0000
EF;;2,000;2,0000;0,0000
FI;;1,000;1,0000;0,0000
FQ;;2,000;2,0000;0,0000
FQ;TIC;1,000;1,0000;0,0000
FR;;1,000;1,0000;0,0000
GE;;3,500;3,0000;0,5000
LC;;3,500;3,5000;0,0000
LE;;3,000;3,0000;0,0000
LE;TIC;1,000;1,0000;0,0000
MA;;5,000;4,5000;0,5000
MU;;1,000;1,0000;0,0000
PSI;;1,000;1,0000;0,0000
R01;;1,000;1,0000;0,0000
TEC;;3,000;3,0000;0,0000
08033961;Institut Rafael Casanova;60,500;53,5000;7,0000
501;DIV;0;1,0000;-1,0000
ADC;;1,000;1,0000;0,0000
AN;;6,000;5,0000;1,0000
AN;EDP;1,000;1,0000;0,0000
CLA;;1,000;1,0000;0,0000
CN;;2,000;1,0000;1,0000
CN;IAN;2,000;2,0000;0,0000
DI;;2,500;2,0000;0,5000
ECO;;1,000;1,0000;0,0000
ECO;DIV;1,000;0;1,000
EF;;1,500;1,0000;0,5000
EF;IAN;2,000;2,0000;0,0000
FI;;1,000;1,0000;0,0000
FQ;;3,500;3,0000;0,5000
FR;;1,000;1,0000;0,0000
GE;;4,000;4,0000;0,0000
LC;;6,000;6,0000;0,0000
LE;;5,000;4,0000;1,0000
MA;;4,000;3,0000;1,0000
MA;DIV;1,000;1,0000;0,0000
MA;IAN;1,000;1,0000;0,0000
MU;;1,500;1,0000;0,5000
MU;DIV;1,000;1,0000;0,0000
PSI;;1,500;1,0000;0,5000
R01;;0,500;0,5000;0,0000
TEC;;4,000;3,0000;1,0000
UES;;1,500;2,0000;-0,5000
08033973;Institut Jaume Salvador i Pedrol;60,000;53,5000;6,5000
ADC;;1,000;0,5000;0,5000
AN;;5,500;4,5000;1,0000
AN;DIV;1,000;1,0000;0,0000
CLA;;1,500;1,5000;0,0000
CN;;4,000;3,5000;0,5000
DI;;1,500;1,5000;0,0000
ECO;;1,000;1,0000;0,0000
EF;;0,500;0,5000;0,0000
FI;;1,000;1,0000;0,0000
FQ;;5,000;3,5000;1,5000
FR;;1,500;1,0000;0,5000
GE;;6,000;5,0000;1,0000
LC;;7,000;5,5000;1,5000
LE;;6,000;5,0000;1,0000
MA;;3,000;3,0000;0,0000
MA;DIV;0;1,0000;-1,0000
MU;;2,000;2,0000;0,0000
PSI;;1,000;1,5000;-0,5000
R01;;0,500;0,5000;0,0000
TEC;;5,000;4,5000;0,5000
08033985;Institut de Sant Just Desvern;53,000;48,0000;5,0000
ADC;;1,000;0;1,000
AN;;5,500;5,0000;0,5000
CLA;;1,000;1,0000;0,0000
CN;;4,000;4,0000;0,0000
DI;;2,000;2,0000;0,0000
ECO;;1,000;1,0000;0,0000
EF;;1,000;1,0000;0,0000
FI;;1,500;1,5000;0,0000
FQ;;3,000;4,0000;-1,0000
FQ;IAN;1,000;0;1,000
FR;;1,500;1,5000;0,0000
GE;;5,000;4,0000;1,0000
LC;;3,000;3,0000;0,0000
LC;DIV;1,000;1,0000;0,0000
LE;;5,500;5,0000;0,5000
MA;;6,500;6,0000;0,5000
MU;;1,500;1,0000;0,5000
PSI;;1,500;1,0000;0,5000
R01;;0,500;0,5000;0,0000
TEC;;3,000;2,5000;0,5000
08034011;Institut Frederic Mompou;53,000;48,5000;4,5000
AN;;4,000;4,0000;0,0000
AN;EDP;1,000;0;1,000
CLA;;2,000;2,0000;0,0000
CN;;2,000;3,0000;-1,0000
CN;IAN;1,000;0;1,000
DI;;2,000;2,0000;0,0000
ECO;;1,000;0;1,000
EES;;1,000;1,0000;0,0000
EF;;2,000;1,5000;0,5000
FI;;1,000;0,5000;0,5000
FQ;;4,000;4,0000;0,0000
FR;;1,000;1,0000;0,0000
GE;;4,000;5,0000;-1,0000
GE;IAN;1,000;0;1,000
LC;;4,500;4,0000;0,5000
LC;DIV;1,000;1,0000;0,0000
LE;;4,000;4,0000;0,0000
MA;;3,500;4,0000;-0,5000
MA;DIV;1,000;1,0000;0,0000
MA;IAN;1,000;0;1,000
MU;;1,000;1,0000;0,0000
PAN;;1,000;1,0000;0,0000
PSI;;1,000;0,5000;0,5000
R01;;0,500;0,5000;0,0000
TEC;;3,500;3,5000;0,0000
08034084;Escola Can Roca;28,180;27,5000;0,6800
EES;;2,000;2,0000;0,0000
INF;;8,000;8,0000;0,0000
PAN;;2,000;2,0000;0,0000
PEF;;2,000;2,0000;0,0000
PMU;;1,000;1,0000;0,0000
PRI;;12,500;12,0000;0,5000
R02;;0,500;0,5000;0,0000
R03;;0,180;0;0,180
08034096;Escola Antoni Gaudí;29,000;28,0000;1,0000
EES;;2,000;2,0000;0,0000
INF;;7,000;7,0000;0,0000
INF;IAN;1,000;1,0000;0,0000
PAN;;3,500;3,5000;0,0000
PEF;;2,000;2,0000;0,0000
PMU;;1,000;1,0000;0,0000
PRI;;10,000;10,0000;0,0000
PRI;IAN;2,000;1,0000;1,0000
R02;;0,500;0,5000;0,0000
08034102;Escola Josep Maria Madorell;23,375;24,3750;-1,0000
AAP;;0;0,5000;-0,5000
EES;;2,000;2,0000;0,0000
INF;;6,000;6,0000;0,0000
PAN;;2,000;2,5000;-0,5000
PEF;;1,000;1,0000;0,0000
PMU;;1,000;1,0000;0,0000
PRI;;11,000;11,0000;0,0000
R02;;0,375;0,3750;0,0000
08034217;Institut Bernat el Ferrer;85,000;73,5000;11,5000
501;;4,000;3,5000;0,5000
505;;1,500;1,0000;0,5000
507;;6,500;4,0000;2,5000
525;;3,000;2,0000;1,0000
606;;3,500;3,0000;0,5000
622;;6,000;6,0000;0,0000
627;;6,000;5,0000;1,0000
AN;;5,000;4,5000;0,5000
CLA;;1,000;1,0000;0,0000
CN;;3,000;3,0000;0,0000
DI;;3,000;2,0000;1,0000
ECO;;1,000;1,0000;0,0000
EF;;3,000;2,5000;0,5000
FI;;1,000;1,0000;0,0000
FQ;;4,000;4,0000;0,0000
FR;;2,000;0,5000;1,5000
FR;DIV;0;1,0000;-1,0000
GE;;5,000;5,5000;-0,5000
GE;DIV;1,000;0;1,000
LC;;5,000;5,5000;-0,5000
LE;;3,000;3,0000;0,0000
LE;TIC;1,000;1,0000;0,0000
MA;;6,000;4,5000;1,5000
MU;;2,000;1,5000;0,5000
PAN;;1,000;1,0000;0,0000
PSI;;1,000;1,0000;0,0000
R01;;0,500;0,5000;0,0000
TEC;;5,000;3,0000;2,0000
TEC;TIC;0;1,0000;-1,0000
08034278;Escola Vicente Aleixandre ;29,000;27,5000;1,5000
AAP;;0,500;0;0,500
EES;;2,000;2,0000;0,0000
INF;;7,000;7,0000;0,0000
PAN;;2,000;2,0000;0,0000
PEF;;2,000;2,0000;0,0000
PMU;;2,000;1,0000;1,0000
PRI;;13,000;13,0000;0,0000
R02;;0,500;0,5000;0,0000
08034400;Escola Antoni Gaudí;19,500;19,0000;0,5000
EES;;0;0,5000;-0,5000
INF;;4,000;4,0000;0,0000
PAN;;1,000;1,0000;0,0000
PEF;;1,000;1,0000;0,0000
PMU;;1,500;1,0000;0,5000
PRI;;10,000;9,5000;0,5000
PRI;DIV;1,000;1,0000;0,0000
PRI;IAN;1,000;1,0000;0,0000
08034412;Escola Can Massallera;15,375;14,8750;0,5000
EES;;1,000;1,0000;0,0000
INF;;5,000;4,0000;1,0000
PAN;;2,000;2,0000;0,0000
PEF;;1,000;1,5000;-0,5000
PMU;;1,000;1,0000;0,0000
PRI;;5,000;5,0000;0,0000
R02;;0,375;0,3750;0,0000
08034621;Institut de Sales;83,500;79,0000;4,5000
505;;2,500;2,5000;0,0000
517;;2,000;2,0000;0,0000
518;;8,000;8,0000;0,0000
619;;6,000;6,0000;0,0000
620;;16,000;14,5000;1,5000
AN;;5,000;4,0000;1,0000
CLA;;1,000;1,0000;0,0000
CN;;4,000;3,0000;1,0000
DI;;2,000;1,5000;0,5000
ECO;;0,500;0,5000;0,0000
EES;DIV;1,000;1,0000;0,0000
EF;;1,500;1,5000;0,0000
FI;;1,000;1,0000;0,0000
FQ;;3,000;3,0000;0,0000
FR;;1,000;1,0000;0,0000
GE;;5,000;5,0000;0,0000
LC;;4,000;4,0000;0,0000
LE;;4,500;4,0000;0,5000
MA;;4,500;4,0000;0,5000
MU;;1,000;1,0000;0,0000
PSI;;3,000;2,5000;0,5000
R01;;1,000;1,0000;0,0000
TEC;;4,000;4,5000;-0,5000
UES;;1,000;0,5000;0,5000
08034990;Escola Parellada ;29,000;27,0000;2,0000
AAP;;0,500;0;0,500
EES;;3,000;2,0000;1,0000
INF;;9,000;8,0000;1,0000
PAN;;3,000;2,0000;1,0000
PEF;;2,000;2,0000;0,0000
PMU;;1,000;1,0000;0,0000
PRI;;10,500;12,0000;-1,5000
08035143;Institut Miquel Martí i Pol;97,170;91,0000;6,1700
505;;2,500;2,5000;0,0000
517;;6,000;6,0000;0,0000
518;;4,000;3,0000;1,0000
523;;3,000;3,0000;0,0000
525;;3,500;2,0000;1,5000
604;;3,000;3,0000;0,0000
606;;4,000;5,0000;-1,0000
619;;8,000;7,0000;1,0000
620;;6,000;6,0000;0,0000
ADC;;1,000;0,5000;0,5000
ALL;;0,500;0;0,500
AN;;7,500;7,5000;0,0000
AN;EDP;1,000;1,0000;0,0000
AN;EGI;1,000;0;1,000
CLA;;1,000;1,0000;0,0000
CN;;3,000;3,0000;0,0000
DI;;1,000;1,5000;-0,5000
ECO;;2,000;2,0000;0,0000
EF;;2,000;2,5000;-0,5000
EF;IAN;1,000;0;1,000
FI;;1,000;1,0000;0,0000
FQ;;3,000;3,0000;0,0000
FR;;1,000;1,0000;0,0000
GE;;4,500;4,0000;0,5000
LC;;5,000;5,0000;0,0000
LE;;5,000;5,0000;0,0000
MA;;3,000;5,0000;-2,0000
MA;EGI;1,000;0;1,000
MA;IAN;1,000;0;1,000
MU;;1,000;1,0000;0,0000
PFI;;1,670;1,0000;0,6700
PSI;;2,000;2,5000;-0,5000
R01;;0,500;0,5000;0,0000
TEC;;4,500;4,0000;0,5000
UES;;2,000;1,5000;0,5000
08035246;Institut Gelida;39,000;33,5000;5,5000
AN;;3,000;2,5000;0,5000
CLA;;1,000;0,5000;0,5000
CN;;1,000;1,0000;0,0000
DI;;2,000;1,5000;0,5000
ECO;;1,000;0,5000;0,5000
EF;;2,000;1,5000;0,5000
FI;;1,000;1,0000;0,0000
FQ;;3,000;2,0000;1,0000
FR;;1,000;1,0000;0,0000
GE;;3,000;2,5000;0,5000
LC;;2,000;2,0000;0,0000
LC;DIV;1,000;1,0000;0,0000
LE;;3,500;3,0000;0,5000
MA;;3,000;2,0000;1,0000
MA;DIV;1,000;1,0000;0,0000
MU;;1,000;1,0000;0,0000
PAN;;1,000;1,0000;0,0000
PSI;;1,500;1,0000;0,5000
PSI;DIV;1,000;1,0000;0,0000
R01;;0,500;0,5000;0,0000
TEC;;3,500;3,0000;0,5000
08035350;Escola Sant Josep;34,250;27,2500;7,0000
EES;;2,000;2,0000;0,0000
INF;;9,000;8,0000;1,0000
PAN;;4,000;3,0000;1,0000
PEF;;3,000;2,0000;1,0000
PMU;;2,000;1,0000;1,0000
PRI;;13,500;10,5000;3,0000
R02;;0,750;0,7500;0,0000
08035881;Escola L'Areny;27,500;26,0000;1,5000
ALL;;1,500;1,0000;0,5000
EES;;2,000;2,0000;0,0000
INF;;7,000;7,0000;0,0000
PAN;;1,000;1,0000;0,0000
PEF;;2,000;2,0000;0,0000
PEF;IAN;1,000;1,0000;0,0000
PMU;;1,000;1,0000;0,0000
PRI;;12,000;11,0000;1,0000
08035994;Escola Salvador Espriu;27,500;26,5000;1,0000
EES;;2,000;2,0000;0,0000
INF;;7,000;6,0000;1,0000
PAN;;2,500;2,5000;0,0000
PEF;;2,000;2,0000;0,0000
PMU;;1,000;1,0000;0,0000
PRI;;12,000;12,0000;0,0000
PRI;TIC;1,000;1,0000;0,0000
08036007;Escola Pau Vila;17,375;18,3750;-1,0000
EES;;1,000;1,0000;0,0000
INF;;4,000;4,0000;0,0000
PAN;;2,000;2,0000;0,0000
PEF;;2,000;2,0000;0,0000
PMU;;1,000;1,0000;0,0000
PRI;;6,000;8,0000;-2,0000
PRI;IAN;1,000;0;1,000
R02;;0,375;0,3750;0,0000
08036044;Escola Pau Vila;28,500;28,5000;0,0000
EES;;2,000;2,0000;0,0000
INF;;7,000;7,0000;0,0000
INF;IAN;1,000;1,0000;0,0000
PAN;;2,000;2,0000;0,0000
PEF;;1,000;1,0000;0,0000
PEF;TIC;1,000;1,0000;0,0000
PMU;;1,000;1,0000;0,0000
PRI;;11,500;11,5000;0,0000
PRI;IAN;1,000;1,0000;0,0000
UEE;;1,000;1,0000;0,0000
08036056;Escola Folch i Torres;28,500;27,5000;1,0000
EES;;2,000;2,0000;0,0000
INF;;6,500;6,5000;0,0000
INF;DIV;1,000;1,0000;0,0000
PAN;;2,000;2,0000;0,0000
PEF;;2,000;2,0000;0,0000
PMU;;1,000;1,0000;0,0000
PRI;;9,000;10,0000;-1,0000
PRI;EGI;1,000;0;1,000
PRI;IAN;3,000;2,0000;1,0000
UEE;;1,000;1,0000;0,0000
08037152;Institut Joan Oró ;112,000;97,0000;15,0000
501;;1,000;1,0000;0,0000
502;;4,000;4,0000;0,0000
505;;4,000;3,5000;0,5000
510;;4,000;4,5000;-0,5000
511;;5,000;3,0000;2,0000
518;;3,000;3,0000;0,0000
608;;4,000;3,5000;0,5000
609;;12,500;10,5000;2,0000
620;;6,000;5,5000;0,5000
621;;4,000;4,5000;-0,5000
622;;3,000;3,0000;0,0000
ADC;;1,000;0,5000;0,5000
AN;;8,000;7,0000;1,0000
CLA;;1,500;1,0000;0,5000
CN;;3,000;3,5000;-0,5000
DI;;2,500;1,5000;1,0000
EF;;2,000;1,0000;1,0000
FI;;1,000;1,0000;0,0000
FQ;;4,000;3,5000;0,5000
FR;;1,000;1,0000;0,0000
GE;;5,500;4,5000;1,0000
LC;;6,000;5,0000;1,0000
LE;;5,000;4,5000;0,5000
MA;;5,000;4,0000;1,0000
MU;;1,500;1,5000;0,0000
PAN;;1,000;1,0000;0,0000
PSI;;3,000;3,0000;0,0000
R01;;0,500;0,5000;0,0000
TEC;;5,000;4,0000;1,0000
UES;;2,000;0;2,000
08037929;Escola Torre Barona;29,160;28,0000;1,1600
EES;;2,000;2,0000;0,0000
INF;;7,500;7,5000;0,0000
PAN;;4,000;5,0000;-1,0000
PEF;;2,000;2,0000;0,0000
PMU;;1,000;1,0000;0,0000
PRI;;12,000;10,0000;2,0000
R02;;0,500;0,5000;0,0000
R03;;0,160;0;0,160
08037930;Escola Margalló;28,110;26,2500;1,8600
AAP;;1,000;0,5000;0,5000
EES;;3,000;2,0000;1,0000
INF;;6,000;7,0000;-1,0000
PAN;;2,500;2,0000;0,5000
PEF;;2,000;2,0000;0,0000
PMU;;1,000;1,0000;0,0000
PRI;;11,000;11,5000;-0,5000
R02;;0,250;0,2500;0,0000
R03;;0,360;0;0,360
UEE;;1,000;0;1,000
08037966;Escola Ignasi Iglésias;28,750;27,7500;1,0000
ALL;;1,000;1,0000;0,0000
EES;;1,000;1,0000;0,0000
INF;;8,500;8,5000;0,0000
PAN;;2,000;2,0000;0,0000
PEF;;2,000;2,0000;0,0000
PMU;;1,000;1,0000;0,0000
PRI;;12,000;11,0000;1,0000
R02;;0,250;0,2500;0,0000
UEE;;1,000;1,0000;0,0000
08037978;Escola Suris;31,000;29,5000;1,5000
EES;;2,000;2,0000;0,0000
INF;;8,000;8,0000;0,0000
PAN;;2,000;2,0000;0,0000
PEF;;2,000;2,0000;0,0000
PMU;;1,000;1,0000;0,0000
PRI;;14,000;12,5000;1,5000
PRI;IAN;1,000;1,0000;0,0000
UEE;;1,000;1,0000;0,0000
08037991;Escola Marcel·lí Moragas;26,000;25,0000;1,0000
EES;;2,000;2,0000;0,0000
INF;;6,000;6,0000;0,0000
PAN;;2,000;2,0000;0,0000
PEF;;2,000;2,0000;0,0000
PMU;;1,000;1,0000;0,0000
PRI;;11,500;10,5000;1,0000
R02;;0,500;0,5000;0,0000
UEE;;1,000;1,0000;0,0000
08038090;Escola Sant Jaume;30,625;30,6250;0,0000
EES;;2,000;2,0000;0,0000
INF;;9,000;9,0000;0,0000
PAN;;3,000;3,0000;0,0000
PEF;;2,000;2,0000;0,0000
PMU;;2,000;2,0000;0,0000
PRI;;12,000;12,0000;0,0000
R02;;0,625;0,6250;0,0000
08038211;Escola José Juan Ortiz;30,625;29,6250;1,0000
EES;;2,000;2,0000;0,0000
INF;;8,000;8,0000;0,0000
PAN;;3,500;3,5000;0,0000
PEF;;2,500;2,5000;0,0000
PMU;;2,000;2,0000;0,0000
PRI;;12,000;11,0000;1,0000
R02;;0,625;0,6250;0,0000
08038223;Escola Benviure;28,500;27,5000;1,0000
EES;;2,000;2,0000;0,0000
INF;;8,000;8,0000;0,0000
PAN;;2,000;2,0000;0,0000
PAN;EDP;0;1,0000;-1,0000
PEF;;2,500;1,5000;1,0000
PMU;;1,000;1,0000;0,0000
PRI;;11,000;11,0000;0,0000
PRI;IAN;1,000;0;1,000
UEE;;1,000;1,0000;0,0000
08038259;Escola Antoni Tàpies;27,580;26,5800;1,0000
EES;;2,000;2,0000;0,0000
INF;;9,000;9,0000;0,0000
PAN;;2,000;2,0000;0,0000
PEF;;2,000;2,0000;0,0000
PMU;;1,000;1,0000;0,0000
PRI;;11,500;10,5000;1,0000
R03;;0,080;0,0800;0,0000
08038284;Escola La Guàrdia ;16,125;15,3750;0,7500
EES;;1,000;1,0000;0,0000
INF;;3,000;3,0000;0,0000
PAN;;1,000;1,0000;0,0000
PEF;;1,000;1,0000;0,0000
PMU;;1,000;1,0000;0,0000
PRI;;9,000;8,0000;1,0000
R02;;0,125;0,3750;-0,2500
08039343;Escola Josep Ferrà i Esteva;29,000;28,0000;1,0000
EES;;2,000;2,0000;0,0000
INF;;6,000;8,0000;-2,0000
INF;DIV;1,000;0;1,000
INF;IAN;1,000;0;1,000
PAN;;2,500;2,5000;0,0000
PEF;;2,000;2,0000;0,0000
PMU;;1,000;1,0000;0,0000
PRI;;11,000;11,0000;0,0000
PRI;IAN;2,000;1,0000;1,0000
R02;;0,500;0,5000;0,0000
08039355;Escola Ramon Llull;28,500;27,5000;1,0000
EES;;2,000;2,0000;0,0000
INF;;8,000;8,0000;0,0000
PAN;;2,000;2,0000;0,0000
PEF;;2,000;2,0000;0,0000
PMU;;1,000;1,0000;0,0000
PRI;;13,500;12,5000;1,0000
08039367;Escola Josep Pla;29,000;28,5000;0,5000
EES;;2,000;2,0000;0,0000
INF;;7,000;7,0000;0,0000
INF;IAN;1,000;1,0000;0,0000
PAN;;2,500;2,0000;0,5000
PEF;;2,000;2,5000;-0,5000
PMU;;1,000;1,0000;0,0000
PRI;;12,000;11,5000;0,5000
PRI;IAN;1,000;1,0000;0,0000
R02;;0,500;0,5000;0,0000
08039379;Escola Rafael Casanova;29,000;28,0000;1,0000
EES;;2,000;1,5000;0,5000
INF;;7,500;8,0000;-0,5000
PAN;;2,000;2,0000;0,0000
PEF;;2,000;2,0000;0,0000
PMU;;1,000;1,0000;0,0000
PRI;;14,000;13,0000;1,0000
R02;;0,500;0,5000;0,0000
08039380;Escola Germans Amat i Targa;28,000;27,5000;0,5000
EES;;1,500;1,5000;0,0000
INF;;8,000;8,0000;0,0000
PAN;;3,000;2,0000;1,0000
PEF;;2,000;2,5000;-0,5000
PMU;;1,000;1,0000;0,0000
PRI;;11,000;11,0000;0,0000
PRI;DIV;1,000;1,0000;0,0000
R02;;0,500;0,5000;0,0000
08040333;Escola Bernat Metge;16,375;16,3750;0,0000
EES;;1,000;1,5000;-0,5000
INF;;4,000;4,0000;0,0000
PAN;;1,000;2,5000;-1,5000
PEF;;1,000;1,0000;0,0000
PMU;;1,000;1,0000;0,0000
PRI;;5,000;5,0000;0,0000
PRI;DIV;2,000;1,0000;1,0000
PRI;IAN;1,000;0;1,000
R02;;0,375;0,3750;0,0000
08040539;Institut Les Marines;47,000;41,0000;6,0000
ADC;;2,000;1,5000;0,5000
AN;;3,500;3,0000;0,5000
AN;DIV;1,000;1,0000;0,0000
CLA;;1,000;1,0000;0,0000
CN;;3,000;2,5000;0,5000
DI;;2,000;2,0000;0,0000
ECO;;1,000;1,0000;0,0000
EF;;2,000;2,0000;0,0000
FI;;1,000;1,5000;-0,5000
FQ;;3,000;3,0000;0,0000
FR;;1,000;1,0000;0,0000
GE;;3,000;4,0000;-1,0000
GE;IAN;1,000;0;1,000
LC;;5,000;4,0000;1,0000
LE;;3,000;3,0000;0,0000
LE;LBI;1,000;0;1,000
MA;;5,000;4,0000;1,0000
MU;;1,000;1,0000;0,0000
MU;DIV;1,000;1,0000;0,0000
PSI;;2,000;1,0000;1,0000
R01;;0,500;0,5000;0,0000
TEC;;4,000;3,0000;1,0000
08040540;Institut El Cairat;59,000;54,5000;4,5000
AN;;5,500;6,0000;-0,5000
AN;DIV;1,000;0;1,000
CLA;;1,000;1,0000;0,0000
CN;;5,000;5,0000;0,0000
DI;;2,000;2,0000;0,0000
ECO;;1,000;1,0000;0,0000
EES;;1,000;1,0000;0,0000
EF;;3,000;3,0000;0,0000
FI;;2,000;1,0000;1,0000
FQ;;4,000;3,0000;1,0000
FR;;0,500;0,5000;0,0000
GE;;5,000;5,0000;0,0000
LC;;6,500;5,5000;1,0000
LE;;4,500;4,0000;0,5000
MA;;7,000;6,5000;0,5000
MU;;1,000;1,0000;0,0000
PSI;;2,000;2,0000;0,0000
R01;;1,000;1,0000;0,0000
TEC;;4,500;4,5000;0,0000
UES;;1,500;1,5000;0,0000
08040618;Escola Can Vidalet ;16,000;15,5000;0,5000
EES;;1,000;1,0000;0,0000
INF;;4,000;4,0000;0,0000
PAN;;1,000;1,0000;0,0000
PEF;;1,000;1,0000;0,0000
PMU;;2,000;1,0000;1,0000
PMU;IAN;0;1,0000;-1,0000
PRI;;7,000;6,5000;0,5000
08041131;Escola Sant Antoni;15,375;14,8750;0,5000
EES;;0,500;0,5000;0,0000
INF;;4,000;4,0000;0,0000
PAN;;0;1,0000;-1,0000
PAN;TIC;1,000;0;1,000
PEF;;1,000;1,0000;0,0000
PMU;;1,000;1,0000;0,0000
PRI;;5,500;5,0000;0,5000
PRI;DIV;1,000;1,0000;0,0000
PRI;IAN;1,000;1,0000;0,0000
R02;;0,375;0,3750;0,0000
08041374;Institut La Mallola;39,000;35,0000;4,0000
ADC;;1,000;0;1,000
AN;;4,500;4,5000;0,0000
CLA;;1,000;1,0000;0,0000
CN;;3,000;3,0000;0,0000
DI;;1,000;1,0000;0,0000
ECO;;1,500;1,0000;0,5000
EF;;2,500;2,0000;0,5000
FI;;1,000;1,0000;0,0000
FQ;;3,000;2,0000;1,0000
GE;;4,000;3,0000;1,0000
LC;;3,000;3,0000;0,0000
LE;;3,000;3,0000;0,0000
MA;;4,000;3,0000;1,0000
MU;;1,000;1,0000;0,0000
PSI;;2,000;2,0000;0,0000
R01;;0,500;0,5000;0,0000
TEC;;3,000;3,0000;0,0000
08041519;Institut Martí Dot;78,000;69,5000;8,5000
505;;1,000;1,0000;0,0000
506;;3,000;2,5000;0,5000
516;;2,000;2,0000;0,0000
601;;9,000;9,0000;0,0000
614;;0,500;0;0,500
626;;1,000;4,0000;-3,0000
AN;;5,000;4,0000;1,0000
AN;EDP;1,000;1,0000;0,0000
CLA;;1,000;1,0000;0,0000
CN;;2,500;1,5000;1,0000
DI;;1,000;2,0000;-1,0000
DI;IAN;1,000;0;1,000
E10;;5,000;2,0000;3,0000
ECO;;1,000;0,5000;0,5000
EF;;3,000;2,5000;0,5000
FI;;2,000;2,0000;0,0000
FQ;;3,000;3,0000;0,0000
FR;;1,500;1,5000;0,0000
GE;;6,500;5,5000;1,0000
LC;;4,000;3,0000;1,0000
LE;;4,500;4,0000;0,5000
MA;;6,000;6,0000;0,0000
MU;;1,500;1,0000;0,5000
PAN;;1,000;1,0000;0,0000
PSI;;1,500;1,0000;0,5000
R01;;0,500;0,5000;0,0000
TEC;;3,500;3,0000;0,5000
UES;;2,500;2,0000;0,5000
08041556;Escola Montseny;15,500;15,0000;0,5000
EES;;1,000;1,0000;0,0000
INF;;4,000;4,0000;0,0000
PAN;;1,000;1,5000;-0,5000
PEF;;0;1,0000;-1,0000
PEF;IAN;1,000;0;1,000
PMU;;1,000;1,0000;0,0000
PRI;;5,000;5,0000;0,0000
PRI;IAN;1,000;0;1,000
PRI;TIC;1,000;1,0000;0,0000
R02;;0,500;0,5000;0,0000
08041660;Escola Pont de la Cadena;15,625;15,1250;0,5000
EES;;1,000;1,0000;0,0000
INF;;4,500;4,0000;0,5000
PAN;;1,500;1,5000;0,0000
PEF;;1,000;1,0000;0,0000
PMU;;1,000;1,0000;0,0000
PRI;;6,000;6,0000;0,0000
R02;;0,625;0,6250;0,0000
08041684;Escola Espai 3;27,625;26,6250;1,0000
EES;;1,000;1,0000;0,0000
EES;DIV;1,000;1,0000;0,0000
INF;;7,000;7,0000;0,0000
INF;IAN;1,000;1,0000;0,0000
PAN;;2,000;2,0000;0,0000
PEF;;2,000;2,0000;0,0000
PMU;;1,000;1,0000;0,0000
PRI;;9,500;8,5000;1,0000
PRI;IAN;2,000;2,0000;0,0000
PRI;TIC;1,000;1,0000;0,0000
R02;;0,125;0,1250;0,0000
08041866;Institut El Calamot;92,000;80,0000;12,0000
501;;3,500;3,5000;0,0000
505;;2,000;1,0000;1,0000
507;;6,000;3,5000;2,5000
510;;3,000;3,0000;0,0000
512;;2,500;4,5000;-2,0000
525;;1,000;1,0000;0,0000
606;;1,000;1,0000;0,0000
611;;2,500;2,0000;0,5000
621;;4,000;3,0000;1,0000
622;;4,000;4,0000;0,0000
627;;6,000;5,0000;1,0000
ADC;;1,000;1,0000;0,0000
AN;;7,000;6,0000;1,0000
CLA;;1,000;1,0000;0,0000
CN;;4,000;3,5000;0,5000
DI;;1,000;1,0000;0,0000
EF;;2,500;2,0000;0,5000
FI;;1,000;1,0000;0,0000
FQ;;4,000;4,0000;0,0000
FR;;1,000;1,0000;0,0000
GE;;4,000;4,0000;0,0000
GE;TIC;1,000;0;1,000
LC;;5,000;4,0000;1,0000
LE;;5,000;5,0000;0,0000
MA;;5,000;5,0000;0,0000
MA;IAN;1,000;0;1,000
MU;;1,000;1,0000;0,0000
PSI;;3,000;2,0000;1,0000
R01;;0,500;0,5000;0,0000
TEC;;5,000;3,0000;2,0000
TEC;EDP;0;1,0000;-1,0000
TEC;IAN;1,000;0;1,000
UES;;1,500;1,5000;0,0000
08042299;Escola Sant Miquel;27,500;26,5000;1,0000
EES;;1,000;2,0000;-1,0000
EES;DIV;1,000;0;1,000
INF;;7,000;7,5000;-0,5000
PAN;;3,500;3,0000;0,5000
PEF;;2,000;2,0000;0,0000
PMU;;1,000;1,0000;0,0000
PRI;;11,000;11,0000;0,0000
PRI;IAN;1,000;0;1,000
08042809;Escola Galileo Galilei;28,500;27,5000;1,0000
EES;;2,000;2,0000;0,0000
INF;;7,500;7,5000;0,0000
PAN;;4,000;4,0000;0,0000
PEF;;2,000;2,0000;0,0000
PMU;;1,000;1,0000;0,0000
PRI;;12,000;11,0000;1,0000
08042810;Escola Charles Darwin;33,125;31,6250;1,5000
EES;;2,000;2,0000;0,0000
INF;;8,000;9,0000;-1,0000
PAN;;4,000;4,0000;0,0000
PEF;;2,500;2,0000;0,5000
PMU;;2,000;2,0000;0,0000
PRI;;11,000;11,0000;0,0000
PRI;DIV;1,000;0;1,000
PRI;EGI;1,000;0;1,000
R02;;0,625;0,6250;0,0000
UEE;;1,000;1,0000;0,0000
08042834;Escola Can Palmer;27,750;28,2500;-0,5000
AAP;;0,500;0,5000;0,0000
EES;;5,000;5,0000;0,0000
INF;;5,000;6,0000;-1,0000
PAN;;2,000;2,0000;0,0000
PEF;;1,000;1,0000;0,0000
PMU;;1,000;1,0000;0,0000
PRI;;7,000;7,5000;-0,5000
PRI;EGI;1,000;0;1,000
R02;;0,250;0,2500;0,0000
UEE;;4,000;4,0000;0,0000
08042846;CFA Cornellà de Llobregat;13,500;13,0000;0,5000
PAN;;2,000;2,0000;0,0000
PRI;;5,000;5,0000;0,0000
SCO;;3,000;3,0000;0,0000
SCS;;1,000;1,0000;0,0000
SMA;;2,500;2,0000;0,5000
08042861;Escola Lola Anglada;15,000;14,5000;0,5000
EES;;1,000;1,0000;0,0000
INF;;4,000;3,5000;0,5000
INF;EGI;1,000;0;1,000
PAN;;0;1,0000;-1,0000
PAN;TIC;1,000;1,0000;0,0000
PEF;;1,000;1,0000;0,0000
PEF;IAN;1,000;1,0000;0,0000
PMU;;1,000;2,0000;-1,0000
PMU;TIC;1,000;0;1,000
PRI;;3,000;4,0000;-1,0000
PRI;DIV;1,000;0;1,000
08043310;Escola Edumar;28,750;27,7500;1,0000
EES;;2,000;2,0000;0,0000
INF;;8,000;7,0000;1,0000
PAN;;2,000;2,0000;0,0000
PAN;DIV;1,000;0;1,000
PEF;;2,000;2,0000;0,0000
PMU;;2,000;1,0000;1,0000
PRI;;9,500;11,5000;-2,0000
PRI;DIV;1,000;1,0000;0,0000
R02;;0,250;0,2500;0,0000
UEE;;1,000;1,0000;0,0000
08043334;Escola Alexandre Galí ;16,000;17,0000;-1,0000
EES;;1,000;2,0000;-1,0000
INF;;4,000;4,0000;0,0000
PAN;;1,000;1,0000;0,0000
PEF;;1,000;1,0000;0,0000
PMU;;1,000;1,0000;0,0000
PRI;;7,000;8,0000;-1,0000
PRI;TIC;1,000;0;1,000
08043346;Escola Montserrat;16,250;15,7500;0,5000
EES;;1,000;1,0000;0,0000
INF;;4,000;4,0000;0,0000
PAN;;1,000;1,5000;-0,5000
PEF;;1,000;1,0000;0,0000
PMU;;1,000;1,0000;0,0000
PRI;;7,000;7,0000;0,0000
PRI;IAN;1,000;0;1,000
R02;;0,250;0,2500;0,0000
08043401;Escola Barrufet;26,000;25,5000;0,5000
AAP;;0,500;0;0,500
EES;;1,500;1,5000;0,0000
INF;;6,000;7,0000;-1,0000
PAN;;3,000;2,0000;1,0000
PEF;;2,000;2,0000;0,0000
PMU;;1,000;1,0000;0,0000
PRI;;12,000;12,0000;0,0000
08043589;Institut Salvador Dalí;58,500;53,5000;5,0000
524;;1,000;1,0000;0,0000
ALL;;0,500;0,5000;0,0000
AN;;6,000;5,5000;0,5000
CLA;;1,000;1,0000;0,0000
CN;;3,000;3,0000;0,0000
CN;EDP;1,000;1,0000;0,0000
DI;;2,000;2,0000;0,0000
ECO;;1,500;1,0000;0,5000
EF;;3,000;3,0000;0,0000
FI;;2,500;2,0000;0,5000
FQ;;5,000;4,0000;1,0000
FR;;1,000;1,0000;0,0000
GE;;5,000;5,0000;0,0000
LC;;6,000;5,0000;1,0000
LE;;5,000;4,0000;1,0000
MA;;6,000;5,5000;0,5000
MU;;1,000;1,0000;0,0000
PSI;;1,000;1,0000;0,0000
R01;;1,000;1,0000;0,0000
TEC;;4,000;4,0000;0,0000
UES;;2,000;2,0000;0,0000
08043671;Institut El Palau;97,830;91,5000;6,3300
501;;4,000;4,0000;0,0000
505;;1,000;1,0000;0,0000
512;;3,000;2,5000;0,5000
524;;1,000;1,0000;0,0000
525;;2,000;2,0000;0,0000
602;;1,000;1,0000;0,0000
606;;1,500;1,5000;0,0000
611;;3,000;3,0000;0,0000
622;;4,500;4,5000;0,0000
628;;2,000;2,0000;0,0000
AN;;7,000;7,0000;0,0000
CLA;;2,000;2,0000;0,0000
CN;;4,000;4,0000;0,0000
DI;;3,000;2,5000;0,5000
ECO;;1,000;1,0000;0,0000
EF;;4,500;4,0000;0,5000
FI;;1,000;1,0000;0,0000
FQ;;5,000;4,0000;1,0000
FR;;0;1,0000;-1,0000
FR;DIV;1,000;1,0000;0,0000
GE;;7,500;7,0000;0,5000
LC;;4,500;4,5000;0,0000
LC;TIC;1,000;0;1,000
LE;;6,500;6,5000;0,0000
MA;;8,500;8,0000;0,5000
MU;;2,000;2,0000;0,0000
PFI;;3,330;2,0000;1,3300
PSI;;3,000;3,0000;0,0000
R01;;1,000;1,0000;0,0000
TEC;;5,000;4,0000;1,0000
UES;;2,000;1,5000;0,5000
08043681;Institut Marianao;82,500;75,0000;7,5000
505;;1,500;1,5000;0,0000
507;;8,000;8,0000;0,0000
510;;4,000;3,5000;0,5000
512;;5,000;4,0000;1,0000
611;;3,000;3,0000;0,0000
613;;1,000;1,0000;0,0000
621;;3,500;3,0000;0,5000
627;;6,500;5,5000;1,0000
AL;;1,000;1,0000;0,0000
AN;;5,500;5,0000;0,5000
CLA;;2,000;2,0000;0,0000
CN;;2,500;2,5000;0,0000
DI;;2,000;1,5000;0,5000
ECO;;1,000;1,0000;0,0000
EF;;2,000;2,0000;0,0000
FI;;1,000;1,0000;0,0000
FQ;;3,000;3,0000;0,0000
GE;;4,000;4,0000;0,0000
LC;;4,000;3,0000;1,0000
LE;;4,000;3,5000;0,5000
MA;;6,000;5,0000;1,0000
MU;;1,000;1,0000;0,0000
PAN;;1,000;1,0000;0,0000
PSI;;1,500;1,5000;0,0000
R01;;0,500;0,5000;0,0000
TEC;;6,000;5,0000;1,0000
08043760;Escola Colònia Güell;35,250;34,7500;0,5000
EES;;2,000;2,0000;0,0000
EES;DIV;1,000;1,0000;0,0000
INF;;5,000;7,0000;-2,0000
INF;DIV;1,000;1,0000;0,0000
INF;EGI;1,000;0;1,000
PAN;;2,500;2,0000;0,5000
PEF;;2,500;2,0000;0,5000
PMU;;1,000;1,0000;0,0000
PRI;;16,000;15,5000;0,5000
PRI;DIV;2,000;2,0000;0,0000
PRI;LBI;1,000;1,0000;0,0000
R02;;0,250;0,2500;0,0000
08043978;Institut Daniel Blanxart i Pedrals;67,330;56,5000;10,8300
501;;4,000;4,0000;0,0000
505;;2,000;1,5000;0,5000
507;;5,500;5,0000;0,5000
508;;1,000;0;1,000
606;DIV;0;1,0000;-1,0000
620;;1,000;0;1,000
622;;1,000;1,0000;0,0000
627;;2,000;2,0000;0,0000
ADC;;1,000;1,0000;0,0000
AN;;3,500;5,0000;-1,5000
AN;DIV;2,000;0;2,000
CLA;;1,000;1,0000;0,0000
CN;;1,000;2,0000;-1,0000
CN;DIV;1,000;0;1,000
CN;EDP;1,000;0;1,000
DI;;1,500;1,0000;0,5000
E01;;3,000;2,5000;0,5000
ECO;;1,000;1,5000;-0,5000
ECO;EDP;1,000;0;1,000
EES;;1,000;1,0000;0,0000
EF;;3,500;3,5000;0,0000
EF;DIV;1,000;1,0000;0,0000
FI;;0;1,0000;-1,0000
FI;DIV;1,000;0;1,000
FQ;;1,000;2,0000;-1,0000
FQ;DIV;1,000;0;1,000
FR;;1,000;1,0000;0,0000
GE;;1,500;1,0000;0,5000
GE;DIV;1,000;0;1,000
LC;;3,000;3,0000;0,0000
LC;DIV;1,000;0;1,000
LE;;1,500;2,0000;-0,5000
LE;EDP;1,000;0;1,000
MA;;2,000;2,0000;0,0000
MA;ISL;1,000;0;1,000
MU;;1,000;1,0000;0,0000
PFI;;2,330;3,0000;-0,6700
PSI;;1,000;0;1,000
R01;;0,500;0,5000;0,0000
TEC;;2,500;2,0000;0,5000
TEC;DIV;1,000;0;1,000
TEC;EDP;1,000;0;1,000
08044247;Escola Estel;15,000;14,5000;0,5000
EES;;1,000;1,0000;0,0000
EES;DIV;1,000;1,0000;0,0000
INF;;3,000;3,0000;0,0000
INF;EGI;1,000;1,0000;0,0000
PAN;;1,000;1,0000;0,0000
PEF;;1,000;1,0000;0,0000
PMU;;1,000;1,0000;0,0000
PRI;;5,000;4,5000;0,5000
PRI;IAN;1,000;1,0000;0,0000
08044430;Escola La Garalda;30,375;29,1250;1,2500
EES;;1,000;1,0000;0,0000
EES;DIV;1,000;1,0000;0,0000
INF;;7,000;7,0000;0,0000
PAN;;2,000;2,0000;0,0000
PEF;;1,000;1,0000;0,0000
PEF;IAN;1,000;1,0000;0,0000
PMU;;1,000;1,0000;0,0000
PRI;;12,500;12,5000;0,0000
PRI;IAN;2,000;2,0000;0,0000
R02;;0,875;0,6250;0,2500
UEE;;1,000;0;1,000
08044570;Institut Vall d'Arús;61,000;53,0000;8,0000
ADC;;1,000;0;1,000
AN;;7,000;6,5000;0,5000
CLA;;2,000;1,0000;1,0000
CN;;3,000;3,0000;0,0000
DI;;2,000;2,0000;0,0000
ECO;;2,000;1,0000;1,0000
EF;;2,500;2,5000;0,0000
FI;;1,500;1,0000;0,5000
FQ;;4,000;4,0000;0,0000
FR;;1,000;1,0000;0,0000
GE;;4,000;4,0000;0,0000
LC;;6,000;5,5000;0,5000
LC;DIV;1,000;0;1,000
LE;;6,000;6,0000;0,0000
MA;;6,000;6,0000;0,0000
MU;;1,500;1,5000;0,0000
PSI;;3,000;2,0000;1,0000
R01;;0,500;0,5000;0,0000
TEC;;5,000;4,5000;0,5000
TEC;TIC;1,000;0;1,000
08045537;Institut Josep Lluís Sert;55,500;48,0000;7,5000
ADC;;1,000;2,0000;-1,0000
AN;;6,000;5,0000;1,0000
CLA;;1,000;1,0000;0,0000
CN;;3,000;3,0000;0,0000
DI;;1,500;1,0000;0,5000
ECO;;1,500;1,0000;0,5000
EF;;1,500;2,5000;-1,0000
EF;IAN;1,000;0;1,000
FI;;1,000;1,0000;0,0000
FQ;;3,500;2,0000;1,5000
FQ;EDP;1,000;1,0000;0,0000
FQ;IFR;1,000;1,0000;0,0000
FR;;1,500;1,5000;0,0000
GE;;4,000;4,0000;0,0000
GE;IFR;1,000;1,0000;0,0000
LC;;4,500;3,0000;1,5000
LE;;5,000;4,5000;0,5000
MA;;5,500;4,5000;1,0000
MA;TIC;1,000;1,0000;0,0000
MU;;1,000;1,0000;0,0000
PSI;;1,500;1,0000;0,5000
R01;;0,500;0,5000;0,0000
TEC;;4,000;3,5000;0,5000
UES;;2,000;0;2,000
08045689;Institut Voltrera;58,500;54,0000;4,5000
AN;;7,000;6,0000;1,0000
CLA;;1,000;1,0000;0,0000
CN;;3,000;4,5000;-1,5000
DI;;2,000;2,0000;0,0000
ECO;;1,000;1,0000;0,0000
EF;;3,000;3,0000;0,0000
FI;;1,000;1,0000;0,0000
FQ;;4,000;3,0000;1,0000
FR;;1,000;1,0000;0,0000
GE;;5,000;4,0000;1,0000
LC;;4,000;2,5000;1,5000
LC;DIV;0;1,0000;-1,0000
LE;;5,000;4,0000;1,0000
MA;;7,000;6,5000;0,5000
MU;;1,500;1,5000;0,0000
PAN;;1,000;1,0000;0,0000
PSI;;2,000;2,0000;0,0000
R01;;0,500;0,5000;0,0000
TEC;;5,000;4,0000;1,0000
UES;;1,500;1,5000;0,0000
08045859;Institut de Corbera de Llobregat;48,000;44,0000;4,0000
AN;;5,000;4,0000;1,0000
CLA;;1,000;1,0000;0,0000
CN;;2,000;1,5000;0,5000
CN;DIV;0;1,0000;-1,0000
DI;;2,000;2,0000;0,0000
ECO;;1,000;1,0000;0,0000
EF;;2,500;2,0000;0,5000
FI;;1,000;1,0000;0,0000
FQ;;4,000;3,0000;1,0000
FR;;0,500;0,5000;0,0000
GE;;4,500;4,0000;0,5000
LC;;3,000;3,0000;0,0000
LC;DIV;1,000;1,0000;0,0000
LE;;4,000;3,5000;0,5000
MA;;5,500;5,5000;0,0000
MU;;1,000;1,0000;0,0000
PSI;;2,000;1,0000;1,0000
R01;;1,000;1,0000;0,0000
TEC;;3,000;4,0000;-1,0000
UES;;2,000;2,0000;0,0000
08045860;Institut Miramar;53,000;46,5000;6,5000
AL;;2,000;2,0000;0,0000
AN;;7,000;5,0000;2,0000
CLA;;1,000;1,0000;0,0000
CN;;3,000;3,0000;0,0000
DI;;2,000;2,0000;0,0000
ECO;;1,000;1,0000;0,0000
EF;;2,500;2,0000;0,5000
FI;;1,000;1,0000;0,0000
FQ;;2,000;1,0000;1,0000
FQ;DIV;2,000;2,0000;0,0000
GE;;4,500;3,5000;1,0000
GE;IAN;1,000;1,0000;0,0000
LC;;3,000;3,0000;0,0000
LE;;5,000;5,0000;0,0000
MA;;6,500;5,5000;1,0000
MU;;1,000;1,0000;0,0000
PSI;;2,000;2,0000;0,0000
R01;;0,500;0,5000;0,0000
TEC;;4,000;3,0000;1,0000
08046657;Institut Joaquim Blume;25,000;23,5000;1,5000
AN;;1,000;0,5000;0,5000
AN;TIC;1,000;1,0000;0,0000
CLA;;1,000;1,0000;0,0000
CN;;2,000;2,0000;0,0000
DI;;1,000;1,0000;0,0000
ECO;;1,000;1,0000;0,0000
EF;;5,000;5,0000;0,0000
FI;;1,000;1,0000;0,0000
FQ;;2,000;2,0000;0,0000
GE;;2,500;2,0000;0,5000
LC;;1,000;1,0000;0,0000
LC;TIC;1,000;1,0000;0,0000
LE;;1,000;1,0000;0,0000
LE;TIC;1,000;1,0000;0,0000
MA;;3,000;2,5000;0,5000
TEC;;0,500;0,5000;0,0000
08047480;Institut Mediterrània;83,500;79,0000;4,5000
501;;0;1,0000;-1,0000
505;;1,000;1,0000;0,0000
506;;7,000;7,0000;0,0000
507;;2,500;1,0000;1,5000
510;;1,000;1,0000;0,0000
621;;2,500;2,0000;0,5000
622;;0;1,0000;-1,0000
627;;2,000;1,0000;1,0000
AN;;8,000;7,5000;0,5000
CLA;;1,000;1,0000;0,0000
CN;;3,000;3,0000;0,0000
DI;;2,000;2,0000;0,0000
E10;;0,500;0,5000;0,0000
ECO;;1,000;1,0000;0,0000
EF;;2,500;2,5000;0,0000
FI;;1,500;1,0000;0,5000
FQ;;4,000;3,5000;0,5000
FR;;1,500;1,0000;0,5000
GE;;6,000;6,0000;0,0000
LC;;6,000;6,0000;0,0000
LE;;7,000;6,5000;0,5000
MA;;6,500;6,5000;0,0000
MU;;2,000;2,0000;0,0000
PAN;;1,000;1,0000;0,0000
PSI;;1,500;1,0000;0,5000
R01;;0,500;0,5000;0,0000
TEC;;5,000;4,5000;0,5000
UES;;2,000;2,0000;0,0000
08047492;Institut Ribera Baixa;55,000;50,0000;5,0000
ADC;;1,000;0,5000;0,5000
AN;;5,500;5,0000;0,5000
CLA;;1,000;1,0000;0,0000
CN;;3,000;3,0000;0,0000
DI;;2,000;1,5000;0,5000
EF;;2,000;1,5000;0,5000
FI;;1,000;1,0000;0,0000
FQ;;4,000;3,0000;1,0000
FR;;2,000;2,0000;0,0000
GE;;5,500;5,5000;0,0000
LC;;3,000;3,0000;0,0000
LE;;4,000;3,5000;0,5000
MA;;5,000;4,0000;1,0000
MU;;1,500;1,5000;0,0000
PAN;;1,000;1,0000;0,0000
PSI;;3,000;3,0000;0,0000
R01;;0,500;0,5000;0,0000
TEC;;6,000;5,5000;0,5000
08047509;Institut Ítaca;43,500;40,0000;3,5000
ADC;;1,000;1,0000;0,0000
AN;;4,000;3,5000;0,5000
CLA;;1,000;1,0000;0,0000
CN;;3,000;3,0000;0,0000
DI;;1,500;1,0000;0,5000
ECO;;1,000;1,0000;0,0000
EF;;1,500;1,0000;0,5000
FI;;1,000;1,0000;0,0000
FQ;;3,000;3,0000;0,0000
GE;;2,500;2,0000;0,5000
LC;;3,000;3,0000;0,0000
LE;;3,000;2,5000;0,5000
MA;;4,000;4,0000;0,0000
MU;;1,000;1,0000;0,0000
PAN;;1,000;1,0000;0,0000
PSI;DIV;1,000;1,0000;0,0000
R01;;1,000;1,0000;0,0000
TEC;;5,000;4,0000;1,0000
08047820;Institut Guinovarda;68,500;61,0000;7,5000
505;;1,000;0,5000;0,5000
507;;3,000;2,0000;1,0000
508;;1,000;1,0000;0,0000
620;;1,000;1,0000;0,0000
625;;1,000;1,0000;0,0000
627;;1,000;2,0000;-1,0000
AN;;7,000;6,0000;1,0000
CLA;;1,000;1,0000;0,0000
CN;;4,000;4,0000;0,0000
CN;DIV;1,000;1,0000;0,0000
DI;;2,000;2,0000;0,0000
E17;;0,500;0,5000;0,0000
ECO;;1,000;1,5000;-0,5000
EES;;1,000;1,0000;0,0000
EF;;3,000;3,0000;0,0000
FI;;1,000;1,0000;0,0000
FQ;;4,000;3,0000;1,0000
FR;;1,000;1,0000;0,0000
GE;;6,000;4,5000;1,5000
LC;;5,000;4,0000;1,0000
LE;;5,500;4,5000;1,0000
MA;;5,000;4,0000;1,0000
MU;;1,500;1,5000;0,0000
PSI;;3,000;2,0000;1,0000
R01;;0,500;0,5000;0,0000
TEC;;5,500;4,0000;1,5000
TEC;DIV;0;1,0000;-1,0000
UES;;1,000;1,5000;-0,5000
08051240;Escola Mediterrània;29,000;28,0000;1,0000
EES;;2,000;2,0000;0,0000
INF;;7,500;7,5000;0,0000
PAN;;3,000;3,0000;0,0000
PEF;;2,000;2,0000;0,0000
PMU;;1,000;1,0000;0,0000
PRI;;12,000;11,0000;1,0000
R02;;0,500;0,5000;0,0000
UEE;;1,000;1,0000;0,0000
08053285;Institut El Castell;61,500;54,5000;7,0000
AN;;6,000;6,0000;0,0000
CLA;;1,000;1,0000;0,0000
CN;;3,000;3,0000;0,0000
DI;;2,500;2,0000;0,5000
DI;EDP;1,000;0;1,000
ECO;;1,000;1,0000;0,0000
ECO;DIV;1,000;1,0000;0,0000
EF;;3,000;2,0000;1,0000
FI;;1,000;1,0000;0,0000
FQ;;3,000;3,0000;0,0000
FR;;1,000;1,0000;0,0000
GE;;5,500;5,0000;0,5000
LC;;5,000;4,0000;1,0000
LC;DIV;1,000;1,0000;0,0000
LE;;5,500;5,0000;0,5000
MA;;5,000;3,0000;2,0000
MA;DIV;1,000;1,0000;0,0000
MU;;1,500;1,0000;0,5000
MU;IAN;1,000;1,0000;0,0000
PAN;;1,000;1,0000;0,0000
PSI;;2,000;2,0000;0,0000
PSI;DIV;1,000;1,0000;0,0000
R01;;0,500;0,5000;0,0000
TEC;;4,000;3,0000;1,0000
TEC;IAN;1,000;1,0000;0,0000
TEC;TIC;1,000;1,0000;0,0000
08053297;Institut de Pallejà;50,500;44,0000;6,5000
602;DIV;1,000;1,0000;0,0000
AL;;0,500;0,5000;0,0000
AN;;4,000;2,5000;1,5000
CLA;;1,000;1,0000;0,0000
CN;;2,000;2,0000;0,0000
DI;;2,000;1,5000;0,5000
ECO;;1,000;1,0000;0,0000
EF;;2,500;2,0000;0,5000
FI;;1,000;1,0000;0,0000
FQ;;3,000;3,0000;0,0000
FR;;1,000;1,0000;0,0000
GE;;4,500;4,0000;0,5000
LC;;4,500;4,0000;0,5000
LE;;2,000;2,0000;0,0000
MA;;6,000;5,0000;1,0000
MU;;2,000;1,5000;0,5000
PAN;;1,000;1,0000;0,0000
PSI;;1,000;1,0000;0,0000
PSI;DIV;2,000;2,0000;0,0000
R01;;0,500;0,5000;0,0000
TEC;;3,500;3,0000;0,5000
UES;;2,500;1,5000;1,0000
08053315;Institut Montserrat Roig;55,000;50,0000;5,0000
ADC;;1,000;1,0000;0,0000
AN;;5,000;4,0000;1,0000
CLA;;1,000;1,0000;0,0000
CN;;4,000;4,0000;0,0000
DI;;2,000;2,0000;0,0000
DI;DIV;1,000;1,0000;0,0000
ECO;;1,000;1,0000;0,0000
EF;;2,000;1,5000;0,5000
FI;;1,000;1,0000;0,0000
FQ;;3,000;3,0000;0,0000
FR;;0;0,5000;-0,5000
FR;EDP;1,000;0;1,000
GE;;6,000;6,0000;0,0000
LC;;4,000;3,0000;1,0000
LE;;5,000;5,0000;0,0000
MA;;6,000;5,0000;1,0000
MU;;2,000;2,0000;0,0000
PAN;;1,000;1,0000;0,0000
PSI;;2,000;1,0000;1,0000
R01;;1,000;1,0000;0,0000
TEC;;4,000;4,0000;0,0000
08053340;Institut Gabriela Mistral ;72,500;65,7500;6,7500
505;;1,000;1,0000;0,0000
507;;5,000;5,0000;0,0000
508;;4,000;4,0000;0,0000
510;;0,500;0,5000;0,0000
620;;2,000;2,5000;-0,5000
625;;3,000;3,0000;0,0000
627;;2,000;2,0000;0,0000
ADC;;1,000;0;1,000
AN;;6,500;5,5000;1,0000
CLA;;2,000;2,0000;0,0000
CN;;3,000;3,0000;0,0000
DI;;2,000;1,5000;0,5000
E17;;0;0,2500;-0,2500
ECO;;1,000;1,0000;0,0000
EF;;1,500;1,0000;0,5000
FI;;2,000;2,0000;0,0000
FQ;;3,000;3,0000;0,0000
FR;;1,000;1,0000;0,0000
GE;;4,000;3,0000;1,0000
LC;;5,000;4,0000;1,0000
LE;;5,000;4,0000;1,0000
MA;;6,000;5,5000;0,5000
MU;;2,000;1,5000;0,5000
PSI;;3,000;3,0000;0,0000
R01;;0,500;0,5000;0,0000
TEC;;4,500;4,0000;0,5000
08053364;Institut Josep Mestres i Busquets;52,500;46,0000;6,5000
ADC;;1,000;0;1,000
AN;;5,500;4,5000;1,0000
CLA;;1,000;1,0000;0,0000
CN;;2,500;1,0000;1,5000
DI;;4,000;3,0000;1,0000
ECO;;1,000;1,0000;0,0000
EF;;2,000;2,0000;0,0000
FI;;1,000;1,0000;0,0000
FQ;;3,000;4,0000;-1,0000
FR;;1,000;1,0000;0,0000
GE;;5,000;4,5000;0,5000
LC;;3,000;2,5000;0,5000
LE;;4,000;3,5000;0,5000
MA;;4,500;4,0000;0,5000
MU;;1,000;1,0000;0,0000
PSI;;3,000;3,0000;0,0000
R01;;1,000;1,0000;0,0000
TEC;;3,500;4,0000;-0,5000
TEC;EDP;1,000;0;1,000
UES;;3,500;3,0000;0,5000
08053510;Escola Puig d'Agulles;23,500;24,0000;-0,5000
EES;;2,000;2,0000;0,0000
INF;;5,000;5,0000;0,0000
PAN;;2,000;2,0000;0,0000
PEF;;2,000;2,0000;0,0000
PMU;;1,000;1,0000;0,0000
PRI;;11,000;11,5000;-0,5000
R02;;0,500;0,5000;0,0000
08053522;Escola La Ginesta;15,250;14,7500;0,5000
EES;DIV;1,000;1,0000;0,0000
INF;;4,000;4,0000;0,0000
PAN;;1,000;1,0000;0,0000
PEF;;1,000;1,0000;0,0000
PMU;;2,000;1,5000;0,5000
PRI;;6,000;6,0000;0,0000
R02;;0,250;0,2500;0,0000
08053601;Escola Lola Anglada;30,250;28,2500;2,0000
AAP;;0,500;0;0,500
ALL;;1,000;1,0000;0,0000
EES;;1,000;1,0000;0,0000
INF;;7,000;8,0000;-1,0000
INF;EGI;1,000;0;1,000
PAN;;2,500;2,5000;0,0000
PEF;;2,000;2,0000;0,0000
PMU;;1,000;1,0000;0,0000
PRI;;13,000;12,5000;0,5000
R02;;0,250;0,2500;0,0000
UEE;;1,000;0;1,000
08054058;Escola Torre de la Miranda ;35,750;33,2500;2,5000
AAP;;1,000;1,0000;0,0000
ALL;;1,000;1,0000;0,0000
EES;;1,000;1,0000;0,0000
INF;;9,000;8,0000;1,0000
PAN;;2,000;2,0000;0,0000
PEF;;2,000;2,0000;0,0000
PMU;;1,000;1,0000;0,0000
PRI;;17,500;16,0000;1,5000
R02;;0,250;0,2500;0,0000
UEE;;1,000;1,0000;0,0000
08054061;Escola Montbaig ;17,500;16,0000;1,5000
EES;;2,500;2,0000;0,5000
INF;;4,000;4,0000;0,0000
PAN;;2,000;2,0000;0,0000
PEF;;1,000;1,0000;0,0000
PMU;;1,000;1,0000;0,0000
PRI;;7,000;6,0000;1,0000
08054198;Institut Estany de la Ricarda;44,000;38,5000;5,5000
AN;;4,000;3,0000;1,0000
CLA;;1,000;1,0000;0,0000
CN;;1,000;1,0000;0,0000
DI;;2,000;2,0000;0,0000
ECO;;1,000;0,5000;0,5000
EES;;1,000;1,0000;0,0000
EF;;2,500;2,0000;0,5000
FI;;1,000;1,0000;0,0000
FQ;;3,000;2,0000;1,0000
GE;;5,000;3,5000;1,5000
LC;;3,000;3,0000;0,0000
LE;;3,000;3,0000;0,0000
MA;;5,000;4,0000;1,0000
MU;;1,000;1,0000;0,0000
PAN;;1,000;1,0000;0,0000
PSI;;1,000;1,0000;0,0000
R01;;0,500;0,5000;0,0000
TEC;;3,000;3,0000;0,0000
08054344;EOI Esplugues;14,500;14,5000;0,0000
133;;3,000;3,0000;0,0000
135;;2,000;2,0000;0,0000
192;;3,000;3,0000;0,0000
193;;6,500;6,5000;0,0000
08055051;CFA Castelldefels;7,500;7,5000;0,0000
PRI;;2,000;2,0000;0,0000
SCO;;3,500;3,5000;0,0000
SCS;;1,000;1,0000;0,0000
SMA;;1,000;1,0000;0,0000
08055439;CFA Mestre Esteve;8,500;8,0000;0,5000
PAN;;1,500;1,0000;0,5000
PRI;;3,000;3,0000;0,0000
SCO;;2,000;2,0000;0,0000
SCS;;1,000;1,0000;0,0000
SMA;;1,000;1,0000;0,0000
08055440;CFA Garrosa;11,000;11,0000;0,0000
PAN;;1,000;1,0000;0,0000
PRI;;4,000;4,0000;0,0000
SCO;;3,000;3,0000;0,0000
SCS;;1,000;1,0000;0,0000
SMA;;2,000;2,0000;0,0000
08055695;CFA Rafael Farré;6,000;6,0000;0,0000
PAN;;1,000;1,0000;0,0000
PRI;;2,000;2,0000;0,0000
SCO;;1,000;1,0000;0,0000
SCS;;1,000;1,0000;0,0000
SMA;;1,000;1,0000;0,0000
08056572;CFA Terra Baixa;13,000;13,0000;0,0000
PAN;;1,000;1,0000;0,0000
PFR;;1,000;0;1,000
PRI;;5,000;6,0000;-1,0000
SCO;;2,000;2,0000;0,0000
SCS;;1,000;1,0000;0,0000
SMA;;3,000;3,0000;0,0000
08058209;CFA Sant Boi;11,500;11,5000;0,0000
PAN;;1,000;1,0000;0,0000
PRI;;4,000;4,0000;0,0000
SCO;;1,500;1,5000;0,0000
SCS;;1,000;1,0000;0,0000
SMA;;3,000;3,0000;0,0000
08059354;Escola Les Roques Blaves;24,500;25,0000;-0,5000
EES;;2,500;2,0000;0,5000
INF;;5,000;7,0000;-2,0000
PAN;;2,000;2,0000;0,0000
PEF;;1,000;1,0000;0,0000
PMU;;1,000;1,0000;0,0000
PRI;;13,000;12,0000;1,0000
08059688;Institut Maria Aurèlia Capmany ;50,500;47,5000;3,0000
ADC;;1,000;2,0000;-1,0000
AN;;5,000;4,5000;0,5000
CLA;;1,000;1,0000;0,0000
CN;;4,000;3,0000;1,0000
DI;;3,000;3,0000;0,0000
ECO;;1,000;1,0000;0,0000
EF;;3,000;3,0000;0,0000
FI;;1,000;1,0000;0,0000
FQ;;3,000;3,0000;0,0000
FR;;1,000;1,0000;0,0000
GE;;4,000;3,0000;1,0000
LC;;5,000;4,0000;1,0000
LE;;5,000;5,0000;0,0000
MA;;5,500;5,0000;0,5000
MU;;1,000;1,0000;0,0000
PSI;;2,000;2,0000;0,0000
R01;;1,000;1,0000;0,0000
TEC;;3,000;3,0000;0,0000
08059721;Escola Marta Mata;37,500;37,0000;0,5000
ALL;;0,500;0;0,500
EES;;2,500;2,5000;0,0000
INF;;11,000;11,0000;0,0000
PAN;;2,000;2,0000;0,0000
PEF;;2,000;2,0000;0,0000
PMU;;1,000;1,0000;0,0000
PRI;;17,000;18,0000;-1,0000
PRI;IAN;1,000;0;1,000
R02;;0,500;0,5000;0,0000
08059731;CFA Arquitecte Jujol;13,000;13,0000;0,0000
PAN;;1,000;1,0000;0,0000
PRI;;5,000;5,0000;0,0000
SCO;;3,000;3,0000;0,0000
SCS;;2,000;2,0000;0,0000
SMA;;2,000;2,0000;0,0000
08059810;Escola Vinya del Sastret;17,696;18,6960;-1,0000
EES;;1,000;1,0000;0,0000
INF;;4,000;4,0000;0,0000
PAN;;2,000;2,0000;0,0000
PEF;;2,000;2,0000;0,0000
PMU;;1,000;1,0000;0,0000
PRI;;7,000;8,0000;-1,0000
R02;;0,500;0,5000;0,0000
R03;;0,196;0,1960;0,0000
08059822;Escola Ernest Lluch;28,000;27,0000;1,0000
EES;;2,000;2,0000;0,0000
INF;;7,000;7,0000;0,0000
PAN;;3,500;3,5000;0,0000
PEF;;2,000;2,0000;0,0000
PMU;;1,000;1,0000;0,0000
PRI;;12,000;11,0000;1,0000
R02;;0,500;0,5000;0,0000
08060137;CFA Edèlia Hernández;10,500;10,0000;0,5000
PAN;;2,500;1,0000;1,5000
PRI;;3,000;4,0000;-1,0000
SCO;;2,000;2,0000;0,0000
SCS;;1,000;1,0000;0,0000
SMA;;2,000;2,0000;0,0000
08060514;Institut de Masquefa;58,500;50,5000;8,0000
AL;;1,000;1,0000;0,0000
AN;;6,000;5,0000;1,0000
CLA;;2,000;1,5000;0,5000
CN;;2,500;2,5000;0,0000
DI;;2,000;1,5000;0,5000
EF;;2,500;2,0000;0,5000
EF;DIV;1,000;1,0000;0,0000
FQ;;4,000;3,5000;0,5000
GE;;4,000;4,0000;0,0000
LC;;5,000;4,5000;0,5000
LE;;5,000;3,5000;1,5000
LE;DIV;1,000;1,0000;0,0000
MA;;8,000;6,5000;1,5000
MU;;2,000;1,5000;0,5000
PSI;;2,000;1,0000;1,0000
PSI;DIV;2,000;2,0000;0,0000
R01;;0,500;0,5000;0,0000
TEC;;4,500;4,5000;0,0000
UES;;1,500;1,5000;0,0000
08060538;EOI del Prat de Llobregat;10,500;10,5000;0,0000
133;;2,000;2,0000;0,0000
192;;2,500;2,5000;0,0000
193;;6,000;6,0000;0,0000
08060599;Escola Garigot;30,110;28,0000;2,1100
AAP;;1,000;0,5000;0,5000
EES;;2,000;2,0000;0,0000
INF;;8,000;8,0000;0,0000
PAN;;3,000;3,0000;0,0000
PEF;;2,000;2,0000;0,0000
PMU;;1,000;1,0000;0,0000
PRI;;11,500;10,5000;1,0000
R02;;0,250;0;0,250
R03;;0,360;0;0,360
UEE;;1,000;1,0000;0,0000
08060605;Escola Font del Roure;28,750;28,2500;0,5000
EES;;3,000;3,5000;-0,5000
INF;;6,000;6,0000;0,0000
INF;EVP;1,000;1,0000;0,0000
PAN;;1,000;1,0000;0,0000
PEF;;1,000;2,0000;-1,0000
PMU;;1,500;1,5000;0,0000
PRI;;10,000;8,0000;2,0000
PRI;DIV;3,000;3,0000;0,0000
PRI;IAN;1,000;1,0000;0,0000
R02;;0,250;0,2500;0,0000
UEE;;1,000;1,0000;0,0000
08060629;Escola El Corb;22,000;22,0000;0,0000
EES;;1,000;1,0000;0,0000
EES;DIV;1,000;1,0000;0,0000
INF;;4,000;5,0000;-1,0000
PAN;;2,000;2,0000;0,0000
PEF;;1,000;1,0000;0,0000
PMU;;1,000;1,0000;0,0000
PRI;;10,500;9,5000;1,0000
R02;;0,500;0,5000;0,0000
UEE;;1,000;1,0000;0,0000
08060848;Escola de Sant Andreu de la Barca;28,875;29,3750;-0,5000
EES;;1,000;1,0000;0,0000
INF;;9,000;9,0000;0,0000
PAN;;3,000;3,0000;0,0000
PEF;;2,000;2,0000;0,0000
PMU;;1,500;1,0000;0,5000
PRI;;11,000;12,0000;-1,0000
R02;;0,375;0,3750;0,0000
UEE;;1,000;1,0000;0,0000
08060851;Escola L'Olivera;27,375;26,8750;0,5000
ALL;;1,000;1,0000;0,0000
EES;;1,000;1,5000;-0,5000
INF;;7,000;6,0000;1,0000
PAN;;2,000;2,0000;0,0000
PEF;;2,000;2,0000;0,0000
PMU;;1,000;1,0000;0,0000
PRI;;12,000;12,0000;0,0000
R02;;0,375;0,3750;0,0000
UEE;;1,000;1,0000;0,0000
08061129;Institut Montserrat Colomer;47,500;43,5000;4,0000
AN;;5,000;4,0000;1,0000
CLA;;1,000;1,0000;0,0000
CN;;2,000;2,0000;0,0000
DI;;2,000;2,0000;0,0000
ECO;;1,000;1,0000;0,0000
EF;;2,000;2,0000;0,0000
FI;;1,000;1,0000;0,0000
FQ;;4,000;3,5000;0,5000
FR;;1,000;1,0000;0,0000
GE;;3,000;3,0000;0,0000
GE;IFR;1,000;1,0000;0,0000
LC;;4,000;4,0000;0,0000
LE;;4,000;3,5000;0,5000
MA;;4,000;4,0000;0,0000
MU;;2,000;1,0000;1,0000
PSI;;2,500;3,5000;-1,0000
R01;;0,500;0,5000;0,0000
TEC;;4,000;3,5000;0,5000
UES;;1,500;0;1,500
08061361;Institut Torrelles de Llobregat;20,500;19,5000;1,0000
AN;;2,000;2,0000;0,0000
CN;;2,000;2,0000;0,0000
DI;;0,500;0,5000;0,0000
EF;;1,000;1,0000;0,0000
FQ;;1,000;1,0000;0,0000
FR;;0,500;0,5000;0,0000
GE;;2,000;2,0000;0,0000
LC;;2,500;2,0000;0,5000
LE;;3,000;3,0000;0,0000
MA;;2,500;2,0000;0,5000
MU;;0,500;0,5000;0,0000
PSI;;1,000;1,0000;0,0000
TEC;;2,000;2,0000;0,0000
08061609;Escola Mercè Rodoreda;40,000;39,0000;1,0000
EES;;4,000;4,5000;-0,5000
INF;;9,000;11,0000;-2,0000
PAN;;3,000;3,0000;0,0000
PEF;;2,000;2,0000;0,0000
PMU;;1,000;1,0000;0,0000
PRI;;17,500;16,0000;1,5000
PRI;DIV;1,000;0;1,000
PRI;ISL;1,000;1,0000;0,0000
R02;;0,500;0,5000;0,0000
UEE;;1,000;0;1,000
08061610;Escola La Sínia;28,500;28,0000;0,5000
EES;;1,000;1,0000;0,0000
INF;;8,500;8,0000;0,5000
PAN;;2,000;2,0000;0,0000
PEF;;1,000;1,0000;0,0000
PMU;;1,000;1,0000;0,0000
PRI;;11,000;11,0000;0,0000
PRI;EGI;4,000;4,0000;0,0000
08061622;Escola Can Coll;16,125;15,6250;0,5000
EES;;1,000;1,0000;0,0000
INF;;4,500;4,5000;0,0000
PAN;;2,000;2,0000;0,0000
PEF;;1,500;1,0000;0,5000
PMU;;1,000;1,0000;0,0000
PRI;;6,000;6,0000;0,0000
R02;;0,125;0,1250;0,0000
08061993;CFA Eugeni d'Ors;11,000;11,0000;0,0000
PAN;;1,000;1,0000;0,0000
PRI;;4,000;4,0000;0,0000
SCO;;2,000;2,0000;0,0000
SCS;;1,000;1,0000;0,0000
SMA;;3,000;3,0000;0,0000
08062031;CFA Mare de Déu de Montserrat;4,500;4,5000;0,0000
PRI;;1,000;1,0000;0,0000
SCO;;1,500;1,5000;0,0000
SCS;;1,000;1,0000;0,0000
SMA;;1,000;1,0000;0,0000
08062055;CFA Sant Just Desvern;3,000;3,0000;0,0000
PRI;;1,000;1,0000;0,0000
SCO;;1,000;0,5000;0,5000
SCS;;0,500;0,5000;0,0000
SMA;;0,500;1,0000;-0,5000
08062122;CFA Martorell;8,500;8,5000;0,0000
PAN;;1,000;1,0000;0,0000
PRI;;3,000;3,0000;0,0000
SCO;;1,500;1,5000;0,0000
SCS;;1,000;1,0000;0,0000
SMA;;2,000;2,0000;0,0000
08062158;EOI de Martorell;7,500;7,5000;0,0000
133;;2,500;2,5000;0,0000
193;;5,000;5,0000;0,0000
08062471;CFA Gavà;5,500;5,5000;0,0000
PRI;;2,000;3,0000;-1,0000
SCO;;2,000;1,0000;1,0000
SCS;;0,500;0,5000;0,0000
SMA;;1,000;1,0000;0,0000
08062924;Escola Josep Guinovart;18,750;20,2500;-1,5000
EES;;1,000;1,0000;0,0000
INF;;4,000;5,0000;-1,0000
PAN;;1,500;2,0000;-0,5000
PEF;;1,000;1,0000;0,0000
PMU;;1,000;1,0000;0,0000
PRI;;8,000;9,0000;-1,0000
PRI;IAN;2,000;1,0000;1,0000
R02;;0,250;0,2500;0,0000
08062948;Escola Miquel Martí i Pol;43,500;41,5000;2,0000
EES;;2,000;2,0000;0,0000
INF;;11,000;11,0000;0,0000
PAN;;5,000;4,0000;1,0000
PEF;;2,000;2,0000;0,0000
PMU;;2,000;2,0000;0,0000
PRI;;19,000;18,0000;1,0000
R02;;0,500;0,5000;0,0000
UEE;;2,000;2,0000;0,0000
08063229;Institut Montpedrós;47,500;38,0000;9,5000
524;;1,000;1,0000;0,0000
AL;;0;1,0000;-1,0000
AN;;6,500;5,0000;1,5000
AN;EDP;1,000;0;1,000
CN;;2,000;1,0000;1,0000
CN;IAN;1,000;1,0000;0,0000
DI;;1,000;1,0000;0,0000
ECO;;0;1,0000;-1,0000
ECO;EDP;1,000;0;1,000
EF;IAN;2,000;2,0000;0,0000
FI;;1,000;1,0000;0,0000
FQ;;3,000;2,5000;0,5000
GE;;3,000;2,0000;1,0000
GE;EDP;1,000;1,0000;0,0000
GE;IAN;1,000;0;1,000
LC;;5,000;4,0000;1,0000
LE;;4,000;3,0000;1,0000
LE;DIV;1,000;1,0000;0,0000
MA;;5,000;3,0000;2,0000
MU;DIV;1,000;1,0000;0,0000
PSI;;2,000;2,0000;0,0000
R01;;0,500;0,5000;0,0000
TEC;;2,500;2,0000;0,5000
TEC;IAN;2,000;1,0000;1,0000
TEC;TIC;0;1,0000;-1,0000
08063394;Escola Miquel Martí i Pol;28,000;27,0000;1,0000
EES;;2,000;2,0000;0,0000
INF;;8,000;7,0000;1,0000
PAN;;1,500;1,5000;0,0000
PEF;;1,000;1,0000;0,0000
PMU;;1,000;2,0000;-1,0000
PRI;;14,000;13,0000;1,0000
R02;;0,500;0,5000;0,0000
08063618;CFA Esparreguera;4,000;4,0000;0,0000
PRI;;0,500;0,5000;0,0000
SCO;;1,500;1,5000;0,0000
SCS;;1,000;1,0000;0,0000
SMA;;1,000;1,0000;0,0000
08063710;Escola Nova;20,750;21,2500;-0,5000
EES;;1,000;1,0000;0,0000
INF;;4,000;4,0000;0,0000
PAN;;2,000;2,0000;0,0000
PEF;;1,000;1,0000;0,0000
PMU;;1,000;1,0000;0,0000
PRI;;11,500;12,0000;-0,5000
R02;;0,250;0,2500;0,0000
08063734;Escola Puigventós;29,875;29,8750;0,0000
EES;;2,000;2,0000;0,0000
INF;;7,000;7,0000;0,0000
PAN;;3,000;3,0000;0,0000
PEF;;2,000;2,0000;0,0000
PMU;;1,000;1,0000;0,0000
PRI;;11,500;12,5000;-1,0000
PRI;DIV;1,000;0;1,000
PRI;IAN;1,000;1,0000;0,0000
R02;;0,375;0,3750;0,0000
UEE;;1,000;1,0000;0,0000
08063746;Institut Salvador Claramunt;23,000;20,0000;3,0000
AL;;1,000;0,5000;0,5000
AN;;2,000;2,0000;0,0000
CLA;;1,000;1,0000;0,0000
CN;;0;2,0000;-2,0000
CN;IAN;2,000;0;2,000
DI;;1,000;1,0000;0,0000
EF;;1,000;1,0000;0,0000
FQ;;1,000;1,0000;0,0000
GE;;1,000;1,0000;0,0000
LC;;3,000;2,0000;1,0000
LE;;2,000;2,0000;0,0000
MA;;2,500;2,0000;0,5000
MU;;1,000;1,0000;0,0000
PSI;;1,000;1,0000;0,0000
R01;;0,500;0,5000;0,0000
TEC;;1,000;1,0000;0,0000
TEC;TIC;1,000;0;1,000
08063758;Escola Can Salvi;29,875;28,8750;1,0000
EES;;2,000;2,0000;0,0000
INF;;8,000;7,0000;1,0000
PAN;;2,000;2,0000;0,0000
PEF;;2,000;2,0000;0,0000
PMU;;1,000;1,0000;0,0000
PRI;;13,500;13,5000;0,0000
R02;;0,375;0,3750;0,0000
UEE;;1,000;1,0000;0,0000
08063761;Escola Vicente Ferrer;15,500;15,0000;0,5000
EES;;1,000;1,0000;0,0000
INF;;4,000;4,0000;0,0000
PAN;;1,000;2,0000;-1,0000
PEF;;1,000;1,0000;0,0000
PMU;;0,500;0,5000;0,0000
PRI;;6,500;6,0000;0,5000
PRI;IAN;1,000;0;1,000
R02;;0,500;0,5000;0,0000
08063771;Escola Pla de les Vinyes;28,625;27,6250;1,0000
EES;;1,000;1,0000;0,0000
EES;DIV;1,000;1,0000;0,0000
INF;;6,000;6,0000;0,0000
INF;EGI;1,000;1,0000;0,0000
INF;TIC;1,000;1,0000;0,0000
PAN;;1,500;1,5000;0,0000
PEF;;2,000;2,0000;0,0000
PMU;;2,000;1,0000;1,0000
PRI;;13,000;13,0000;0,0000
R02;;0,125;0,1250;0,0000
08063783;Escola Mediterrània;18,750;19,7500;-1,0000
EES;;1,000;1,0000;0,0000
INF;;4,000;4,0000;0,0000
PAN;;1,000;1,0000;0,0000
PEF;;1,000;1,0000;0,0000
PMU;;1,000;1,0000;0,0000
PRI;;10,500;11,5000;-1,0000
R02;;0,250;0,2500;0,0000
08063801;Institut de Collbató;31,500;28,0000;3,5000
AN;;3,500;2,5000;1,0000
CN;;2,000;2,0000;0,0000
DI;;1,000;1,0000;0,0000
EF;;2,000;2,0000;0,0000
FQ;;3,000;2,0000;1,0000
FR;;1,000;1,0000;0,0000
GE;;3,000;2,5000;0,5000
LC;;3,000;3,0000;0,0000
LE;;2,500;2,0000;0,5000
MA;;3,000;3,0000;0,0000
MU;;1,000;1,0000;0,0000
PSI;;2,000;2,0000;0,0000
PSI;DIV;1,000;1,0000;0,0000
R01;;0,500;0,5000;0,0000
TEC;;3,000;2,5000;0,5000
08063813;Institut Creu de Saba;43,500;40,0000;3,5000
AN;;3,000;3,0000;0,0000
AN;DIV;1,000;1,0000;0,0000
CLA;;1,000;1,0000;0,0000
CN;;3,000;2,0000;1,0000
DI;;2,500;2,0000;0,5000
ECO;;0,500;0,5000;0,0000
EF;;1,000;1,0000;0,0000
EF;DIV;1,000;1,0000;0,0000
FI;;1,000;1,0000;0,0000
FQ;;2,000;2,0000;0,0000
FR;;1,000;1,0000;0,0000
GE;;4,000;4,0000;0,0000
LC;;3,500;3,0000;0,5000
LE;;4,000;4,0000;0,0000
MA;;4,500;3,0000;1,5000
MU;;1,500;1,5000;0,0000
PSI;;2,000;2,0000;0,0000
R01;;0,500;0,5000;0,0000
TEC;;4,000;3,0000;1,0000
TEC;DIV;0;1,0000;-1,0000
UES;;1,500;1,5000;0,0000
08063965;Escola Cau de la Guineu;16,000;15,5000;0,5000
EES;;1,000;1,0000;0,0000
INF;;4,000;4,0000;0,0000
PAN;;1,000;1,0000;0,0000
PEF;IAN;1,000;1,0000;0,0000
PMU;;1,000;1,0000;0,0000
PRI;;8,000;7,5000;0,5000
08064003;Institut Can Margarit;31,500;29,0000;2,5000
AN;;4,000;3,5000;0,5000
CN;;2,000;1,5000;0,5000
DI;;1,000;1,0000;0,0000
EF;;1,500;1,5000;0,0000
FQ;;2,000;2,0000;0,0000
FR;;1,000;0,5000;0,5000
GE;;3,500;3,5000;0,0000
LC;;4,000;4,0000;0,0000
LE;;3,000;3,0000;0,0000
MA;;3,500;3,5000;0,0000
MU;;1,000;1,0000;0,0000
PSI;;2,000;1,0000;1,0000
R01;;0,500;0,5000;0,0000
TEC;;2,500;2,5000;0,0000
08064647;CFA Artur Martorell  ;23,000;21,0000;2,0000
PAN;;1,000;1,0000;0,0000
PFR;;1,000;1,0000;0,0000
PRI;;17,000;15,0000;2,0000
SCO;;1,000;1,0000;0,0000
SCS;;1,000;1,0000;0,0000
SMA;;2,000;2,0000;0,0000
08064854;Escola Martinet;28,500;27,5000;1,0000
EES;;1,000;1,0000;0,0000
INF;;7,000;7,0000;0,0000
INF;IAN;2,000;2,0000;0,0000
PAN;;2,000;2,0000;0,0000
PEF;;2,000;2,0000;0,0000
PMU;;1,500;1,5000;0,0000
PRI;;9,000;8,0000;1,0000
PRI;DIV;2,000;2,0000;0,0000
PRI;IAN;2,000;2,0000;0,0000
08064881;Escola Campderrós;24,875;25,3750;-0,5000
EES;;2,000;2,0000;0,0000
INF;;4,500;6,0000;-1,5000
INF;DIV;1,000;0;1,000
PAN;;2,000;2,0000;0,0000
PEF;;2,000;2,0000;0,0000
PMU;;1,000;1,0000;0,0000
PRI;;11,000;12,0000;-1,0000
PRI;LBI;1,000;0;1,000
R02;;0,375;0,3750;0,0000
08064908;Institut Begues;21,000;20,0000;1,0000
AN;;3,000;3,0000;0,0000
CN;;1,000;1,0000;0,0000
DI;;1,000;1,0000;0,0000
EF;;1,000;1,0000;0,0000
FQ;;2,000;2,0000;0,0000
GE;;2,000;2,0000;0,0000
LC;;3,000;2,0000;1,0000
LE;;2,000;2,0000;0,0000
MA;;2,000;2,0000;0,0000
MU;;1,000;1,0000;0,0000
PSI;;1,000;1,0000;0,0000
TEC;;2,000;2,0000;0,0000
08064911;Institut de Castelldefels;32,500;27,0000;5,5000
ADC;;1,000;0;1,000
AN;;4,000;3,0000;1,0000
CLA;;0,500;0,5000;0,0000
CN;;3,000;3,0000;0,0000
DI;;1,000;1,0000;0,0000
EF;;1,000;2,0000;-1,0000
EF;IAN;1,000;0;1,000
FQ;;2,000;2,0000;0,0000
FR;;0,500;0,5000;0,0000
GE;;3,000;2,5000;0,5000
LC;;3,000;2,5000;0,5000
LE;;3,500;2,5000;1,0000
MA;;3,500;3,0000;0,5000
MU;;1,000;1,0000;0,0000
PSI;;1,000;1,0000;0,0000
R01;;0,500;0,5000;0,0000
TEC;;3,000;2,0000;1,0000
08064921;Institut de Sant Andreu;28,500;19,5000;9,0000
AN;;3,500;3,0000;0,5000
CN;;1,500;1,0000;0,5000
DI;;0,500;0;0,500
DI;DIV;1,000;1,0000;0,0000
ECO;;0;0,5000;-0,5000
EF;;1,000;0,5000;0,5000
EF;DIV;1,000;1,0000;0,0000
FI;;0,500;0;0,500
FQ;;2,000;2,0000;0,0000
GE;;3,000;2,0000;1,0000
LC;;3,000;1,5000;1,5000
LE;;3,000;2,0000;1,0000
MA;;2,500;1,5000;1,0000
MA;EDP;1,000;0;1,000
MU;;1,000;0,5000;0,5000
MU;EDP;1,000;1,0000;0,0000
PSI;;1,000;0,5000;0,5000
TEC;;2,000;1,5000;0,5000
08064945;Escola Mansuet;16,000;15,5000;0,5000
EES;;1,000;1,0000;0,0000
INF;;3,000;3,0000;0,0000
PAN;;2,000;1,0000;1,0000
PEF;;1,000;1,0000;0,0000
PMU;;1,000;0,5000;0,5000
PRI;;8,000;9,0000;-1,0000
08066887;EOI de Viladecans;9,500;9,5000;0,0000
133;;2,000;1,5000;0,5000
133;TIC;1,000;1,0000;0,0000
192;;2,000;2,0000;0,0000
193;;3,500;4,0000;-0,5000
193;GPS;1,000;1,0000;0,0000
08067132;Escola Josefina Ibáñez;16,250;15,7500;0,5000
EES;;1,000;1,0000;0,0000
INF;;4,000;4,0000;0,0000
PAN;;2,500;2,5000;0,0000
PEF;;1,000;1,0000;0,0000
PMU;;1,000;1,0000;0,0000
PRI;;6,500;6,0000;0,5000
R02;;0,250;0,2500;0,0000
08067144;Institut de Cervelló;28,500;24,5000;4,0000
AN;;2,500;2,5000;0,0000
CN;;1,000;1,0000;0,0000
DI;;1,000;1,0000;0,0000
EF;;3,500;3,0000;0,5000
FQ;;1,000;1,0000;0,0000
FQ;IAN;1,000;1,0000;0,0000
FR;;1,000;0,5000;0,5000
GE;;2,000;2,5000;-0,5000
LC;;3,000;2,5000;0,5000
LE;;2,000;2,5000;-0,5000
MA;;4,000;3,0000;1,0000
MU;;2,000;1,5000;0,5000
PSI;;2,000;1,0000;1,0000
TEC;;2,500;1,5000;1,0000
08068136;CFA Víctor Català  ;22,500;21,0000;1,5000
PRI;;18,000;17,0000;1,0000
SCO;;1,500;1,0000;0,5000
SCS;;1,000;2,0000;-1,0000
SMA;;2,000;1,0000;1,0000
08068495;Institut de Viladecans;38,500;28,5000;10,0000
ADC;;0,500;0;0,500
AL;;0,500;0,5000;0,0000
AN;;5,000;4,0000;1,0000
CLA;;0,500;0,5000;0,0000
CN;;3,500;3,0000;0,5000
DI;;2,000;0;2,000
DI;IAN;0;1,0000;-1,0000
ECO;;0,500;0;0,500
EF;;0,500;0;0,500
EF;IAN;1,000;1,0000;0,0000
FI;;0,500;0;0,500
FQ;;0,500;0;0,500
FQ;EDP;1,000;1,0000;0,0000
FQ;IAN;1,000;1,0000;0,0000
FR;;0,500;0,5000;0,0000
GE;;2,500;2,0000;0,5000
GE;IAN;1,000;1,0000;0,0000
LC;;4,500;2,5000;2,0000
LC;LBI;0;1,0000;-1,0000
LE;;3,500;2,5000;1,0000
MA;;4,500;3,5000;1,0000
MU;IAN;1,000;1,0000;0,0000
PSI;;1,000;0,5000;0,5000
TEC;;2,000;1,0000;1,0000
TEC;IAN;1,000;1,0000;0,0000
08071020;Escola Enxaneta;21,500;20,0000;1,5000
EES;;2,000;2,0000;0,0000
INF;;4,000;6,0000;-2,0000
PAN;;2,000;1,5000;0,5000
PEF;;1,000;1,0000;0,0000
PMU;;1,000;1,0000;0,0000
PRI;;10,000;7,0000;3,0000
PRI;IAN;1,000;1,0000;0,0000
R02;;0,500;0,5000;0,0000
08071147;Escola Roser Capdevila ;29,500;29,0000;0,5000
AAP;;1,000;1,0000;0,0000
EES;DIV;2,000;1,0000;1,0000
INF;;7,000;8,0000;-1,0000
PAN;;4,000;1,5000;2,5000
PAN;EDP;0;1,0000;-1,0000
PEF;;1,000;2,0000;-1,0000
PMU;;2,000;2,0000;0,0000
PRI;;12,000;12,0000;0,0000
R02;;0,500;0,5000;0,0000
08071691;Institut Escola del Prat ;30,000;29,5000;0,5000
AN;;0;1,0000;-1,0000
CN;;1,000;1,0000;0,0000
EES;;1,000;1,0000;0,0000
EF;;1,000;1,0000;0,0000
GE;;3,000;3,0000;0,0000
INF;;3,000;3,0000;0,0000
LC;;1,000;1,0000;0,0000
MA;;2,000;1,0000;1,0000
PEF;;1,000;1,0000;0,0000
PMU;;1,000;1,0000;0,0000
PRI;;10,000;9,5000;0,5000
PSI;;4,000;3,0000;1,0000
UES;;1,000;2,0000;-1,0000
08072607;EOI de Cornellà de Llobregat;10,000;9,5000;0,5000
133;;1,500;1,0000;0,5000
133;GPS;1,000;1,0000;0,0000
192;;1,000;1,0000;0,0000
192;GPS;1,000;1,0000;0,0000
193;;3,500;3,5000;0,0000
193;TIC;2,000;2,0000;0,0000
08073031;Institut de Cornellà ;19,500;11,5000;8,0000
ADC;;1,000;1,0000;0,0000
AN;;2,000;1,0000;1,0000
CN;;1,000;1,0000;0,0000
DI;;1,000;1,0000;0,0000
EF;;1,500;1,0000;0,5000
FQ;;1,000;1,0000;0,0000
GE;;1,000;0;1,000
GE;EDP;1,000;1,0000;0,0000
LC;;2,000;1,0000;1,0000
LE;;2,000;0,5000;1,5000
MA;;2,000;0;2,000
PSI;;2,000;1,0000;1,0000
TEC;;2,000;2,0000;0,0000
08073077;Institut de Martorell;22,000;19,5000;2,5000
AN;;1,000;1,0000;0,0000
AN;EDP;1,000;1,0000;0,0000
CN;;1,000;1,0000;0,0000
DI;EDP;1,000;1,0000;0,0000
EF;;1,500;1,5000;0,0000
FQ;;2,000;2,0000;0,0000
FR;;0,500;1,0000;-0,5000
GE;;2,000;1,0000;1,0000
LC;;3,000;3,0000;0,0000
LE;;2,000;2,0000;0,0000
MA;;2,000;2,0000;0,0000
PSI;;2,000;0;2,000
PSI;DIV;1,000;1,0000;0,0000
TEC;;2,000;2,0000;0,0000
08074483;Escola Pepa Colomer ;35,500;33,5000;2,0000
AAP;;1,000;1,0000;0,0000
EES;;4,000;4,0000;0,0000
INF;;9,000;8,0000;1,0000
PAN;;2,000;2,0000;0,0000
PEF;;2,000;2,0000;0,0000
PMU;;2,000;2,0000;0,0000
PRI;;14,500;13,5000;1,0000
R02;;1,000;1,0000;0,0000
08074631;Institut Les Salines;66,170;61,0000;5,1700
501;;4,000;3,5000;0,5000
503;;1,000;1,0000;0,0000
505;;3,500;3,5000;0,0000
507;;6,000;5,5000;0,5000
510;;5,000;5,0000;0,0000
515;;2,000;2,0000;0,0000
518;;0;1,0000;-1,0000
616;;5,000;5,0000;0,0000
616;IFE;1,000;0;1,000
618;;2,000;2,0000;0,0000
620;;5,000;4,0000;1,0000
621;;4,500;4,0000;0,5000
622;;3,500;3,5000;0,0000
627;;6,000;5,0000;1,0000
AN;;2,000;1,5000;0,5000
E03;;1,000;1,0000;0,0000
E06;;0,500;0,5000;0,0000
EF;;12,000;12,0000;0,0000
FR;;0,500;0,5000;0,0000
PFI;;0,670;0,5000;0,1700
PSI;IFE;1,000;0;1,000
08075293;Institut Escola Gavà Mar;35,500;0;35,500
AN;;1,000;0;1,000
CN;;1,000;0;1,000
DI;;1,000;0;1,000
EES;;2,000;0;2,000
EF;;1,000;0;1,000
INF;;7,000;0;7,000
INF;EDP;1,000;0;1,000
MA;;0,500;0;0,500
MU;;1,000;0;1,000
PAN;;3,000;0;3,000
PEF;;2,000;0;2,000
PMU;;2,000;0;2,000
PRI;;13,000;0;13,000
08075682;Institut Viladecans VI;8,500;0;8,500
AL;;0,500;0;0,500
AN;;1,000;0;1,000
EF;;1,000;0;1,000
FQ;;1,000;0;1,000
GE;;1,000;0;1,000
LC;;1,000;0;1,000
LE;;0,500;0;0,500
MA;;1,000;0;1,000
MU;;0,500;0;0,500
TEC;;1,000;0;1,000
08900264;EAP B-07 Cornellà;9,000;8,5000;0,5000
PSI;;9,000;8,5000;0,5000
08900265;EAP B-19 Viladecans;10,000;9,5000;0,5000
PSI;;10,000;9,5000;0,5000
08900266;EAP B-26 Martorell;12,000;11,5000;0,5000
PSI;;11,000;10,5000;0,5000
08900279;EAP B-36 EL Prat de Llobregat;6,000;5,5000;0,5000
PSI;;6,000;5,5000;0,5000
08900300;EAP B-37 Sant Boi de Llobregat;8,000;7,5000;0,5000
PSI;;8,000;7,5000;0,5000
08900302;EAP B-39 Sant Vicenç dels Horts;9,000;8,5000;0,5000
PSI;;9,000;8,5000;0,5000
08900303;EAP B-40 Esplugues de Llobregat;4,000;4,0000;0,0000
PSI;;4,000;4,0000;0,0000
08900408;EAP B-46 Sant Feliu de Llobregat;6,000;5,5000;0,5000
PSI;;6,000;5,5000;0,5000
08903081;CRP del Baix Llobregat I;2,000;2,0000;0,0000
SSE;;2,000;2,0000;0,0000
08903083;CRP del Baix Llobregat V;3,000;3,0000;0,0000
SSE;;3,000;3,0000;0,0000
08903084;CRP del Baix Llobregat VI;3,000;2,0000;1,0000
SSE;;3,000;2,0000;1,0000
08903085;CdA de Can Santoi;2,000;2,0000;0,0000
SSE;;2,000;2,0000;0,0000
08905454;EAP B-49 Castelldefels;4,000;3,5000;0,5000
PSI;;4,000;3,5000;0,5000
08910017;CREDA Baix Llobregat (Cornellà) ;5,000;4,0000;1,0000
ALL;;5,000;4,0000;1,0000
08910018;CREDA Baix Llobregat (Gavà) ;5,000;3,0000;2,0000
ALL;;5,000;3,0000;2,0000
08910019;CREDA Baix Llobregat (Martorell) ;3,000;3,0000;0,0000
ALL;;3,000;3,0000;0,0000
08910020;CREDA Baix Llobregat (El Prat de Llobregat) ;3,000;3,0000;0,0000
ALL;;3,000;3,0000;0,0000
08910021;CREDA Baix Llobregat (Sant Boi) ;3,000;3,0000;0,0000
ALL;;3,000;3,0000;0,0000
08910023;CREDA Baix Llobregat (St Vicenç dels Horts) ;3,000;3,0000;0,0000
ALL;;3,000;3,0000;0,0000
08910024;CREDA Baix Llobregat (Esplugues de Llob.) ;2,000;2,0000;0,0000
ALL;;2,000;2,0000;0,0000
08925261;CREDA Baix Llobregat (Seu c: Sant Feliu de Ll.) ;13,500;13,5000;0,0000
ALL;;11,500;11,5000;0,0000
PSI;;2,000;2,0000;0,0000
08930033;CRP del Baix Llobregat III;3,000;2,0000;1,0000
SSE;;3,000;2,0000;1,0000
08930034;CRP del Baix Llobregat IV;3,000;3,0000;0,0000
SSE;;3,000;3,0000;0,0000
08930035;CRP del Baix Llobregat VIII;2,000;2,0000;0,0000
SSE;;2,000;2,0000;0,0000
08930037;CRP de Castelldefels;2,000;2,0000;0,0000
SSE;;2,000;2,0000;0,0000
08930043;CRP del Baix Llobregat II;3,000;2,0000;1,0000
SSE;;3,000;2,0000;1,0000
08930044;CRP del Baix Llobregat VII;3,000;3,0000;0,0000
SSE;;3,000;3,0000;0,0000
08970017;LIC-0308 (Llengua i cohesió social);11,000;11,0000;0,0000
SSE;;11,000;11,0000;0,0000
;TOTALS;8232,201;7644,6860;587,5150