"P","037","Audició i llenguatge","18"
"P","022","Ciències de la naturalesa","39"
"P","021","Ciències socials","25"
"P","027","Educació física","15"
"P","034","Educació física","146"
"P","031","Educació infantil","427"
"P","038","Educació primària","1195"
"P","055","Educació visual i plàstica","3"
"P","024","Llengua castellana i literatura","33"
"P","068","Llengua catalana i literatura","50"
"P","032","Llengua estrangera: anglès","296"
"P","025","Llengua estrangera: anglès","21"
"P","033","Llengua estrangera: francès","10"
"P","023","Matemàtiques","63"
"P","035","Música","203"
"P","028","Música","4"
"P","036","Pedagogia terapèutica","203"
"P","054","Tecnologia","11"
"S","101","Administració d'empreses","55"
"S","001","Alemany","64"
"S","012","Alemany","7"
"S","102","Anàlisi i química industrial","25"
"S","011","Anglès","355"
"S","103","Assessoria i processos d'imatge personal","23"
"S","003","Català","1"
"S","104","Construccions civils i edificació","2"
"S","201","Cuina i pastisseria","39"
"S","803","Cultura clàssica","27"
"S","009","Dibuix","106"
"S","507","Dibuix artístic i color","9"
"S","508","Dibuix tècnic","4"
"S","509","Disseny d'interiors","6"
"S","510","Disseny de moda","1"
"S","511","Disseny de producte","2"
"S","512","Disseny gràfic","16"
"S","061","Economia","44"
"S","017","Educació física","118"
"S","606","Enquadernació artística","1"
"S","202","Equips electrònics","5"
"S","006","Espanyol","353"
"S","203","Estètica","34"
"S","204","Fabricació i instal·lació de fusteria i mobles","2"
"S","007","Física i química","178"
"S","105","Formació i orientació laboral","77"
"S","515","Fotografia","3"
"S","608","Fotografia i processos de reproducció","2"
"S","010","Francès","22"
"S","008","Francès","200"
"S","005","Geografia i història","311"
"S","516","Història de l'art","3"
"S","106","Hoteleria i turisme","24"
"S","107","Informàtica","126"
"S","205","Instal·lació i manteniment d'equips tèrmics i de fluids","4"
"S","206","Instal·lacions electrotècniques","17"
"S","108","Intervenció sociocomunitària","82"
"S","013","Japonès","1"
"S","208","Laboratori","10"
"S","004","Llengua castellana i literatura","317"
"S","051","Llengua catalana i literatura","284"
"S","209","Manteniment de vehicles","56"
"S","520","Materials i tecnologia: disseny","4"
"S","211","Mecanització i manteniment de màquines","43"
"S","521","Mitjans audiovisuals","12"
"S","522","Mitjans informàtics","5"
"S","016","Música","40"
"S","014","Neerlandès","1"
"S","213","Oficina de projectes de fabricació mecànica","1"
"S","215","Operacions de processos","10"
"S","214","Operacions i equips d'elaboració de productes alimentaris","8"
"S","216","Operacions i equips de producció agrària","10"
"S","110","Organització i gestió comercial","61"
"S","111","Organització i processos de manteniment de vehicles","19"
"S","112","Organització i projectes de fabricació mecànica","24"
"S","113","Organització i projectes de sistemes energètics","6"
"S","523","Organització industrial i legislació","3"
"S","018","Orientació educativa","90"
"S","217","Patronatge i confecció","7"
"S","218","Perruqueria","21"
"S","015","Portuguès","2"
"S","219","Procediments de diagnòstic clínic i ortoprotètic","40"
"S","220","Procediments sanitaris i assistencials","122"
"S","221","Processos comercials","61"
"S","114","Processos de cultiu aqüícola","1"
"S","222","Processos de gestió administrativa","55"
"S","115","Processos de producció agrària","11"
"S","117","Processos diagnòstics clínics i productes ortoprotèsics","34"
"S","116","Processos en la indústria alimentària","8"
"S","119","Processos i mitjans de comunicació","8"
"S","122","Processos i productes d'arts gràfiques","8"
"S","123","Processos i productes de fusta i mobles","3"
"S","120","Processos i productes de tèxtil, confecció i pell","6"
"S","118","Processos sanitaris","40"
"S","223","Producció en arts gràfiques","6"
"S","225","Serveis a la comunitat","83"
"S","226","Serveis de restauració","16"
"S","124","Sistemes electrònics","6"
"S","125","Sistemes electrotècnics i automàtics","16"
"S","227","Sistemes i aplicacions informàtiques","100"
"S","228","Soldadures","9"
"S","612","Talla de pedra i fusta","2"
"S","613","Tècniques ceràmiques","2"
"S","615","Tècniques de joieria i bijuteria","1"
"S","617","Tècniques de patronatge i confecció","4"
"S","618","Tècniques del metall","1"
"S","229","Tècniques i procediments d'imatge i so","6"
"S","019","Tecnologia","135"
"S","525","Volum","3"
