<?xml version="1.0" encoding="UTF-8" standalone="no"?>
<svg
   fill="#ffffff"
   width="357.25px"
   height="124px"
   viewBox="0 0 357.25 124"
   version="1.1"
   id="svg14"
   sodipodi:docname="logo.svg"
   inkscape:version="1.2.2 (732a01da63, 2022-12-09)"
   xmlns:inkscape="http://www.inkscape.org/namespaces/inkscape"
   xmlns:sodipodi="http://sodipodi.sourceforge.net/DTD/sodipodi-0.dtd"
   xmlns="http://www.w3.org/2000/svg"
   xmlns:svg="http://www.w3.org/2000/svg">
  <defs
     id="defs18" />
  <sodipodi:namedview
     id="namedview16"
     pagecolor="#ffffff"
     bordercolor="#000000"
     borderopacity="0.25"
     inkscape:showpageshadow="2"
     inkscape:pageopacity="0.0"
     inkscape:pagecheckerboard="0"
     inkscape:deskcolor="#d1d1d1"
     showgrid="false"
     inkscape:zoom="1.3457839"
     inkscape:cx="82.47981"
     inkscape:cy="176.47707"
     inkscape:window-width="1920"
     inkscape:window-height="1137"
     inkscape:window-x="-8"
     inkscape:window-y="-8"
     inkscape:window-maximized="1"
     inkscape:current-layer="svg14"
     inkscape:pageshadow="2" />
  <g
     id="g24243"
     transform="matrix(0.13959159,0,0,0.13959159,283.52786,48.582033)"
     style="stroke:#ffffff">
    <line
       style="fill:none;stroke:#ffffff;stroke-width:15;stroke-linecap:round;stroke-linejoin:round;stroke-miterlimit:10"
       x1="73.363998"
       y1="353.20999"
       x2="73.363998"
       y2="204.75999"
       id="line24209" />
    <path
       style="fill:none;stroke:#ffffff;stroke-width:15;stroke-linecap:round;stroke-linejoin:round;stroke-miterlimit:10"
       d="M 73.364,169.76 V 80.92 c 0,-7.97 3.23,-15.18 8.45,-20.41 5.23,-5.22 12.44,-8.45 20.41,-8.45 15.94,0 28.86,12.92 28.86,28.86 v 98.45 82.42"
       id="path24211" />
    <polyline
       style="fill:none;stroke:#ffffff;stroke-width:15;stroke-linecap:round;stroke-linejoin:round;stroke-miterlimit:10"
       points="   161.852,37.32 161.852,7.5 133.508,7.5  "
       id="polyline24213" />
    <polyline
       style="fill:none;stroke:#ffffff;stroke-width:15;stroke-linecap:round;stroke-linejoin:round;stroke-miterlimit:10"
       points="   132.654,119.733 161.852,119.733 161.852,89.914  "
       id="polyline24215" />
    <polyline
       style="fill:none;stroke:#ffffff;stroke-width:15;stroke-linecap:round;stroke-linejoin:round;stroke-miterlimit:10"
       points="   70.945,7.5 42.601,7.5 42.601,37.32  "
       id="polyline24217" />
    <polyline
       style="fill:none;stroke:#ffffff;stroke-width:15;stroke-linecap:round;stroke-linejoin:round;stroke-miterlimit:10"
       points="   42.601,89.914 42.601,119.733 70.799,119.733  "
       id="polyline24219" />
    <path
       style="fill:none;stroke:#ffffff;stroke-width:15;stroke-linecap:round;stroke-linejoin:round;stroke-miterlimit:10"
       d="m 304.642,366.825 c -2.073,19.435 -8.307,38.257 -18.345,55.159 v 0 c -12.599,21.215 -19.205,45.452 -19.113,70.126 v 12.39"
       id="path24221" />
    <path
       style="fill:none;stroke:#ffffff;stroke-width:15;stroke-linecap:round;stroke-linejoin:round;stroke-miterlimit:10"
       d="m 74.732,504.5 v -23.658 c 0,-25.735 -9.641,-50.537 -27.022,-69.516 v 0 C 33.351,395.647 25.386,375.158 25.386,353.897 v -51.198 c 0,-15.736 7.336,-30.527 19.759,-40.052 0.737,-0.565 1.51,-1.082 2.293,-1.58 l 21.383,-13.586"
       id="path24223" />
    <path
       style="fill:none;stroke:#ffffff;stroke-width:15;stroke-linecap:round;stroke-linejoin:round;stroke-miterlimit:10"
       d="m 190.358,280.666 v -82.42 c 0,-16.368 13.269,-29.636 29.636,-29.636 v 0 c 4.553,0 8.866,1.027 12.72,2.861"
       id="path24225" />
    <path
       style="fill:none;stroke:#ffffff;stroke-width:15;stroke-linecap:round;stroke-linejoin:round;stroke-miterlimit:10"
       d="m 131.085,179.367 c 0,-16.368 13.269,-29.636 29.636,-29.636 v 0 c 16.368,0 29.636,13.269 29.636,29.636 v 18.879"
       id="path24227" />
    <path
       style="fill:none;stroke:#ffffff;stroke-width:15;stroke-linecap:round;stroke-linejoin:round;stroke-miterlimit:10"
       d="m 234.334,332.9 v 20.64 c 0,5.83 4.73,10.56 10.56,10.56 h 143.65"
       id="path24229" />
    <path
       style="fill:none;stroke:#ffffff;stroke-width:15;stroke-linecap:round;stroke-linejoin:round;stroke-miterlimit:10"
       d="M 234.334,297.9 V 93.96 c 0,-5.83 4.73,-10.56 10.56,-10.56 h 231.16 c 5.83,0 10.56,4.73 10.56,10.56 v 20.77"
       id="path24231" />
    <path
       style="fill:none;stroke:#ffffff;stroke-width:15;stroke-linecap:round;stroke-linejoin:round;stroke-miterlimit:10"
       d="m 486.614,149.73 v 203.81 c 0,5.83 -4.73,10.56 -10.56,10.56 h -52.51"
       id="path24233" />
    <path
       style="fill:none;stroke:#ffffff;stroke-width:15;stroke-linecap:round;stroke-linejoin:round;stroke-miterlimit:10"
       d="m 278.97,300.786 c 24.352,24.352 63.72,24.396 88.018,0.098 23.541,-23.541 24.234,-61.227 2.108,-85.699"
       id="path24235" />
    <path
       style="fill:none;stroke:#ffffff;stroke-width:15;stroke-linecap:round;stroke-linejoin:round;stroke-miterlimit:10"
       d="m 436.84,307.388 c 20.195,-45.649 11.522,-100.973 -25.989,-138.483 -24.352,-24.352 -63.72,-24.396 -88.018,-0.098 -24.298,24.298 -24.255,63.666 0.098,88.018"
       id="path24237" />
    <path
       style="fill:none;stroke:#ffffff;stroke-width:15;stroke-linecap:round;stroke-linejoin:round;stroke-miterlimit:10"
       d="m 415.752,267.257 c -2.231,20.333 -11.141,40.063 -26.734,55.656 -1.788,1.788 -3.631,3.489 -5.523,5.101"
       id="path24239" />
    <path
       style="fill:none;stroke:#ffffff;stroke-width:15;stroke-linecap:round;stroke-linejoin:round;stroke-miterlimit:10"
       d="m 432.832,146.924 c -36.529,-36.529 -95.58,-36.594 -132.028,-0.146 -36.448,36.448 -36.382,95.499 0.146,132.028 12.176,12.176 31.86,12.198 44.009,0.049 12.149,-12.149 12.127,-31.833 -0.049,-44.009 -12.176,-12.176 -12.198,-31.86 -0.049,-44.009 12.149,-12.149 31.833,-12.127 44.009,0.049 11.14,11.14 18.888,24.374 23.245,38.423"
       id="path24241" />
  </g>
  <g
     aria-label="Podpisy elektroniczne"
     id="text24247"
     style="font-size:36.0662px;font-family:Bahnschrift;-inkscape-font-specification:'Bahnschrift, Normal';text-align:center;text-anchor:middle;stroke-width:0.546367">
    <path
       d="m 6.5975629,16.20393 h 8.1888591 q 1.162289,0 2.042812,-0.545924 0.880522,-0.545924 1.356005,-1.54972 0.493092,-1.003795 0.493092,-2.306968 v 0 q 0,-1.320784 -0.493092,-2.3245798 Q 17.709756,8.4729426 16.829234,7.9270187 15.948711,7.3634843 14.786422,7.3634843 H 6.5975629 V 3.9470571 h 8.0655861 q 2.289358,0 4.032793,0.9861852 1.743434,0.9685747 2.694398,2.7472301 0.968575,1.7786554 0.968575,4.1208456 v 0 q 0,2.342189 -0.968575,4.120845 -0.950964,1.761045 -2.694398,2.729619 -1.743435,0.968575 -4.032793,0.968575 H 6.5975629 Z M 4.7484657,3.9470571 H 8.3409974 V 29.55265 H 4.7484657 Z"
       id="path331" />
    <path
       d="m 32.273599,29.816807 q -2.377411,0 -4.068014,-0.933354 -1.690603,-0.933353 -2.588736,-2.712009 -0.880522,-1.796266 -0.880522,-4.31456 v -2.976166 q 0,-2.483073 0.880522,-4.244118 0.898133,-1.778656 2.588736,-2.694399 1.690603,-0.933354 4.068014,-0.933354 2.377411,0 4.068014,0.933354 1.690603,0.915743 2.571125,2.694399 0.898133,1.761045 0.898133,4.244118 v 3.028997 q 0,2.500684 -0.898133,4.27934 -0.880522,1.761045 -2.571125,2.694398 -1.690603,0.933354 -4.068014,0.933354 z m 0,-3.416427 q 1.884318,0 2.905724,-1.1799 1.039017,-1.1799 1.039017,-3.310765 v -3.028997 q 0,-2.130864 -1.039017,-3.293154 -1.021406,-1.16229 -2.905724,-1.16229 -1.884318,0 -2.923335,1.16229 -1.021406,1.16229 -1.021406,3.293154 v 3.028997 q 0,2.130865 1.021406,3.310765 1.039017,1.1799 2.923335,1.1799 z"
       id="path333" />
    <path
       d="m 55.308066,3.9470571 h 3.592532 V 29.55265 H 55.308066 Z M 50.711739,29.869639 q -2.007591,0 -3.434037,-0.862912 -1.408836,-0.880523 -2.148475,-2.553516 -0.739639,-1.672992 -0.739639,-4.015182 v -4.032793 q 0,-2.3598 0.722028,-4.032793 0.722029,-1.672993 2.095644,-2.535905 1.391225,-0.880522 3.328375,-0.880522 1.620161,0 2.958555,0.845302 1.356005,0.845301 2.183696,2.37741 l -0.36982,3.733415 q 0,-1.162289 -0.42265,-1.98998 -0.422651,-0.827691 -1.232732,-1.250342 -0.79247,-0.440261 -1.937149,-0.440261 -1.778656,0 -2.764841,1.109458 -0.968574,1.109458 -0.968574,3.117049 v 3.979962 q 0,1.989981 0.968574,3.081829 0.986185,1.074237 2.764841,1.074237 1.144679,0 1.937149,-0.440261 0.810081,-0.457872 1.232732,-1.303174 0.42265,-0.845301 0.42265,-2.025201 l 0.246547,3.856688 q -0.545924,1.356005 -1.796266,2.271748 -1.232732,0.915744 -3.046608,0.915744 z"
       id="path335" />
    <path
       d="m 64.359838,11.273004 h 3.592531 V 36.98426 h -3.592531 z m 8.188859,18.543803 q -1.708214,0 -2.976166,-0.81008 -1.267953,-0.827692 -1.866708,-2.32458 l 0.246546,-3.821467 q 0,1.1799 0.422651,2.007591 0.422651,0.827691 1.215121,1.267952 0.810081,0.440262 1.95476,0.440262 1.778656,0 2.74723,-1.074238 0.986185,-1.091848 0.986185,-3.064218 v -3.962351 q 0,-2.007591 -0.986185,-3.11705 -0.968574,-1.109458 -2.74723,-1.109458 -1.144679,0 -1.95476,0.422651 -0.79247,0.422651 -1.215121,1.250342 -0.422651,0.81008 -0.422651,1.95476 l -0.369819,-3.52209 q 0.827691,-1.602551 2.166085,-2.465463 1.338394,-0.880523 2.976166,-0.880523 1.93715,0 3.310765,0.880523 1.391225,0.862912 2.113254,2.535904 0.722028,1.672993 0.722028,4.032793 v 3.979962 q 0,2.324579 -0.739639,3.979961 -0.739639,1.655383 -2.166085,2.535905 -1.426446,0.862912 -3.416427,0.862912 z"
       id="path337" />
    <path
       d="m 83.977876,3.9470571 h 3.592532 v 3.5925317 h -3.592532 z m 0,7.3259469 h 3.592532 V 29.55265 h -3.592532 z"
       id="path339" />
    <path
       d="m 99.492684,29.816807 q -1.620161,0 -3.046608,-0.316988 -1.408836,-0.316988 -2.641567,-0.950964 -1.232732,-0.633976 -2.271748,-1.584941 v 0 l 2.130864,-2.623957 v 0 q 1.479278,1.127069 2.940945,1.690604 1.461668,0.563534 2.888114,0.563534 2.130866,0 3.187496,-0.651587 1.07423,-0.669197 1.07423,-1.98998 0,-0.880523 -0.58114,-1.320784 -0.58115,-0.440261 -1.44406,-0.581145 -0.86291,-0.158494 -2.430241,-0.281767 -0.140884,0 -0.299378,0 -0.158494,-0.01761 -0.299377,-0.03522 -0.07044,0 -0.140884,0 -0.07044,-0.01761 -0.140883,-0.01761 -1.778656,-0.140883 -3.011387,-0.510703 -1.232732,-0.387429 -2.060423,-1.426446 -0.810081,-1.039016 -0.810081,-2.976166 0,-1.937149 0.792471,-3.222712 0.79247,-1.285563 2.3598,-1.919539 1.56733,-0.651587 3.92713,-0.651587 1.426443,0 2.712013,0.264157 1.30317,0.264157 2.48307,0.79247 1.1799,0.510703 2.27175,1.303174 v 0 l -2.16609,2.623956 v 0 q -1.37361,-0.880522 -2.71201,-1.320783 -1.32078,-0.440261 -2.588733,-0.440261 -1.831487,0 -2.74723,0.633976 -0.915743,0.616365 -0.915743,1.866707 0,0.739639 0.510703,1.109459 0.528313,0.369819 1.320783,0.493092 0.792471,0.123273 2.25414,0.211326 0.10566,0.01761 0.21132,0.01761 0.12328,0 0.24655,0.01761 0.0528,0 0.10566,0 0.0528,0 0.10566,0.01761 1.91954,0.123273 3.25794,0.510703 1.356,0.38743 2.27175,1.532109 0.91574,1.144679 0.91574,3.310765 0,1.97237 -0.8453,3.275543 -0.8453,1.285563 -2.55352,1.93715 -1.6906,0.651586 -4.261726,0.651586 z"
       id="path341" />
    <path
       d="m 125.45048,11.273004 -7.78382,22.558986 q -0.42265,1.250342 -1.10945,1.97237 -0.68681,0.739639 -1.69061,1.056627 -1.00379,0.316988 -2.46546,0.316988 h -0.72203 v -3.451648 h 0.72203 q 1.0038,0 1.58494,-0.40504 0.59876,-0.405041 1.03902,-1.391226 l 6.76241,-20.657057 z m -16.184,0 h 3.66297 l 5.61774,15.884625 -1.98998,3.89191 z"
       id="path343" />
    <path
       d="m 145.79055,29.816807 q -2.53591,0 -4.33217,-0.950964 -1.79627,-0.950964 -2.74723,-2.782451 -0.93336,-1.849097 -0.93336,-4.455444 v -2.060422 q 0,-2.71201 0.89814,-4.631549 0.91574,-1.919538 2.64156,-2.923334 1.72583,-1.003796 4.15607,-1.003796 2.28936,0 3.90952,1.144679 1.62016,1.14468 2.46546,3.310765 0.86292,2.166085 0.86292,5.195083 v 1.19751 H 140.38414 V 18.96877 h 8.91089 v 0 q -0.1585,-2.236527 -1.16229,-3.469258 -0.98619,-1.250342 -2.65918,-1.250342 -2.04281,0 -3.16988,1.338394 -1.10946,1.338394 -1.10946,3.786247 v 2.324579 q 0,2.271748 1.19751,3.486869 1.19751,1.215121 3.39882,1.215121 1.09185,0 2.16608,-0.440261 1.07424,-0.440261 1.91954,-1.232732 v 0 l 2.3598,2.359801 v 0 q -1.356,1.303173 -3.0466,2.025201 -1.69061,0.704418 -3.39882,0.704418 z"
       id="path345" />
    <path
       d="m 161.23491,24.83305 q 0,0.669197 0.28177,1.039017 0.29938,0.352209 0.82769,0.352209 h 1.6906 v 3.416427 h -2.11325 q -2.04281,0 -3.16988,-1.267953 -1.10946,-1.267952 -1.10946,-3.574921 V 3.9470571 h 3.59253 z"
       id="path347" />
    <path
       d="m 175.56983,29.816807 q -2.5359,0 -4.33217,-0.950964 -1.79627,-0.950964 -2.74723,-2.782451 -0.93335,-1.849097 -0.93335,-4.455444 v -2.060422 q 0,-2.71201 0.89813,-4.631549 0.91574,-1.919538 2.64157,-2.923334 1.72582,-1.003796 4.15606,-1.003796 2.28936,0 3.90952,1.144679 1.62016,1.14468 2.46546,3.310765 0.86292,2.166085 0.86292,5.195083 v 1.19751 H 170.16342 V 18.96877 h 8.91089 v 0 q -0.15849,-2.236527 -1.16229,-3.469258 -0.98619,-1.250342 -2.65918,-1.250342 -2.04281,0 -3.16988,1.338394 -1.10946,1.338394 -1.10946,3.786247 v 2.324579 q 0,2.271748 1.19751,3.486869 1.19751,1.215121 3.39882,1.215121 1.09185,0 2.16609,-0.440261 1.07423,-0.440261 1.91953,-1.232732 v 0 l 2.3598,2.359801 v 0 q -1.356,1.303173 -3.0466,2.025201 -1.69061,0.704418 -3.39882,0.704418 z"
       id="path349" />
    <path
       d="m 188.97138,22.614133 9.40398,-11.341129 h 4.22651 L 188.74245,26.875862 Z M 187.42166,3.9470571 h 3.59253 V 29.55265 h -3.59253 z M 193.2155,19.003991 195.52247,16.60897 203.5,29.55265 h -3.90952 z"
       id="path351" />
    <path
       d="m 211.2486,29.640703 q -2.21892,0 -3.25794,-1.215121 -1.0214,-1.232732 -1.0214,-3.627753 V 5.9546483 h 3.59253 V 24.83305 q 0,0.669197 0.26416,1.039017 0.26415,0.352209 0.77486,0.352209 h 1.72582 v 3.416427 z m -6.16366,-18.367699 h 8.24169 v 3.240323 h -8.24169 z"
       id="path353" />
    <path
       d="m 218.25755,11.273004 h 3.59254 V 29.55265 h -3.59254 z m 10.05557,4.332171 q -0.47548,-0.581145 -1.19751,-0.880523 -0.72203,-0.299378 -1.67299,-0.299378 -1.70822,0 -2.65918,0.950965 -0.93335,0.933354 -0.93335,2.606346 l -0.36982,-3.52209 q 0.8453,-1.637771 2.18369,-2.535904 1.3384,-0.915744 2.95856,-0.915744 1.25034,0 2.25414,0.36982 1.0214,0.352209 1.77865,1.056627 z"
       id="path355" />
    <path
       d="m 240.30584,29.816807 q -2.37742,0 -4.06802,-0.933354 -1.6906,-0.933353 -2.58873,-2.712009 -0.88053,-1.796266 -0.88053,-4.31456 v -2.976166 q 0,-2.483073 0.88053,-4.244118 0.89813,-1.778656 2.58873,-2.694399 1.6906,-0.933354 4.06802,-0.933354 2.37741,0 4.06801,0.933354 1.6906,0.915743 2.57112,2.694399 0.89814,1.761045 0.89814,4.244118 v 3.028997 q 0,2.500684 -0.89814,4.27934 -0.88052,1.761045 -2.57112,2.694398 -1.6906,0.933354 -4.06801,0.933354 z m 0,-3.416427 q 1.88431,0 2.90572,-1.1799 1.03902,-1.1799 1.03902,-3.310765 v -3.028997 q 0,-2.130864 -1.03902,-3.293154 -1.02141,-1.16229 -2.90572,-1.16229 -1.88432,0 -2.92334,1.16229 -1.02141,1.16229 -1.02141,3.293154 v 3.028997 q 0,2.130865 1.02141,3.310765 1.03902,1.1799 2.92334,1.1799 z"
       id="path357" />
    <path
       d="m 252.95014,11.273004 h 3.59253 V 29.55265 h -3.59253 z m 11.09458,7.202674 q 0,-1.93715 -1.0038,-2.993777 -1.00379,-1.056627 -2.81767,-1.056627 -1.76104,0 -2.72962,0.933354 -0.95096,0.933354 -0.95096,2.623957 l -0.36982,-3.52209 q 0.8453,-1.655382 2.2013,-2.553515 1.37362,-0.898133 3.029,-0.898133 2.97617,0 4.59633,1.95476 1.63777,1.93715 1.63777,5.49446 V 29.55265 h -3.59253 z"
       id="path359" />
    <path
       d="m 273.09648,3.9470571 h 3.59253 v 3.5925317 h -3.59253 z m 0,7.3259469 h 3.59253 V 29.55265 h -3.59253 z"
       id="path361" />
    <path
       d="m 289.52705,29.816807 q -2.50068,0 -4.27934,-0.933354 -1.76104,-0.933353 -2.6944,-2.712009 -0.93335,-1.778655 -0.93335,-4.296949 v -3.011387 q 0,-2.483074 0.93335,-4.244119 0.93336,-1.761045 2.6944,-2.676788 1.77866,-0.933354 4.27934,-0.933354 1.42645,0 2.67679,0.352209 1.26795,0.334599 2.27175,0.986185 1.00379,0.651587 1.67299,1.584941 v 0 l -2.58874,2.324579 v 0 q -0.77486,-0.880522 -1.81387,-1.356004 -1.03902,-0.475483 -2.16609,-0.475483 -2.07803,0 -3.22271,1.16229 -1.14468,1.16229 -1.14468,3.275544 v 3.011387 q 0,2.166085 1.12707,3.345985 1.14468,1.1799 3.24032,1.1799 1.14468,0 2.1837,-0.510703 1.03901,-0.510703 1.79626,-1.444057 v 0 l 2.58874,2.500684 v 0 q -0.68681,0.915743 -1.69061,1.56733 -1.00379,0.633976 -2.27174,0.968575 -1.25034,0.334598 -2.65918,0.334598 z"
       id="path363" />
    <path
       d="m 312.72,14.302001 -8.78762,11.922275 h 9.2631 V 29.55265 H 299.5826 v -3.099439 l 9.01655,-11.851832 h -8.77 V 11.273004 H 312.72 Z"
       id="path365" />
    <path
       d="m 317.9503,11.273004 h 3.59254 V 29.55265 h -3.59254 z m 11.09459,7.202674 q 0,-1.93715 -1.0038,-2.993777 -1.00379,-1.056627 -2.81767,-1.056627 -1.76105,0 -2.72962,0.933354 -0.95096,0.933354 -0.95096,2.623957 l -0.36982,-3.52209 q 0.8453,-1.655382 2.2013,-2.553515 1.37362,-0.898133 3.029,-0.898133 2.97616,0 4.59633,1.95476 1.63777,1.93715 1.63777,5.49446 V 29.55265 h -3.59253 z"
       id="path367" />
    <path
       d="m 345.58111,29.816807 q -2.53591,0 -4.33217,-0.950964 -1.79627,-0.950964 -2.74723,-2.782451 -0.93336,-1.849097 -0.93336,-4.455444 v -2.060422 q 0,-2.71201 0.89814,-4.631549 0.91574,-1.919538 2.64156,-2.923334 1.72583,-1.003796 4.15607,-1.003796 2.28936,0 3.90952,1.144679 1.62016,1.14468 2.46546,3.310765 0.86291,2.166085 0.86291,5.195083 v 1.19751 H 340.1747 V 18.96877 h 8.91089 v 0 q -0.1585,-2.236527 -1.16229,-3.469258 -0.98619,-1.250342 -2.65918,-1.250342 -2.04281,0 -3.16988,1.338394 -1.10946,1.338394 -1.10946,3.786247 v 2.324579 q 0,2.271748 1.19751,3.486869 1.19751,1.215121 3.39882,1.215121 1.09184,0 2.16608,-0.440261 1.07424,-0.440261 1.91954,-1.232732 v 0 l 2.3598,2.359801 v 0 q -1.356,1.303173 -3.04661,2.025201 -1.6906,0.704418 -3.39881,0.704418 z"
       id="path369" />
  </g>
  <g
     aria-label="ustal.pl"
     id="text24251"
     style="font-size:78.0239px;font-family:Bahnschrift;-inkscape-font-specification:'Bahnschrift, Normal';text-align:center;text-anchor:middle;stroke-width:1.18198">
    <path
       d="M 27.454174,64.430375 H 37.854822 V 103.97569 H 27.454174 Z m -12.26743,24.039591 q 0,2.857321 1.6001,4.45742 1.638197,1.562002 4.571713,1.562002 2.933516,0 4.495518,-1.600099 1.600099,-1.638198 1.600099,-4.647909 l 0.533367,8.648158 q -1.104831,3.238292 -3.695468,5.447962 -2.55254,2.20966 -6.248008,2.20966 -6.362301,0 -9.829183,-4.07645 Q 4.7479996,96.356171 4.7479996,88.850942 V 64.430375 H 15.186744 Z"
       style="font-weight:bold;-inkscape-font-specification:'Bahnschrift Bold'"
       id="path372" />
    <path
       d="m 63.265927,104.54716 q -3.543077,0 -6.895667,-0.60956 -3.352589,-0.64766 -6.286105,-1.86679 -2.933516,-1.21912 -5.181275,-2.933514 v 0 l 6.438496,-8.038595 v 0 q 2.85732,1.828685 5.981324,2.819223 3.124004,0.990538 5.943227,0.990538 3.657371,0 5.676544,-0.80005 2.019173,-0.838147 2.019173,-2.285856 0,-1.333417 -0.876245,-2.019174 -0.876245,-0.685757 -2.247759,-0.95244 -1.371514,-0.304781 -3.847858,-0.533366 -0.685757,-0.0762 -1.409612,-0.152391 -0.685757,-0.07619 -1.409611,-0.15239 -0.152391,-0.0381 -0.342879,-0.0381 -0.15239,-0.0381 -0.304781,-0.0381 -4.419322,-0.571464 -7.086155,-1.409611 -2.666832,-0.838147 -4.533615,-3.200199 -1.828685,-2.40015 -1.828685,-6.933765 0,-3.962151 1.90488,-6.781374 1.90488,-2.819223 5.524153,-4.266933 3.619273,-1.485806 8.76245,-1.485806 3.009711,0 5.981325,0.609561 3.009711,0.609562 5.752739,1.75249 2.743028,1.142929 5.066982,2.743028 v 0 l -6.20991,7.581424 v 0 q -2.590638,-1.447709 -5.409861,-2.247759 -2.819223,-0.800049 -5.40986,-0.800049 -3.162102,0 -4.914592,0.723854 -1.75249,0.723855 -1.75249,2.019174 0,0.990537 0.914343,1.562001 0.95244,0.533367 2.323954,0.80005 1.409611,0.228586 4.076444,0.533367 0.342878,0.0381 0.685757,0.07619 0.342878,0.0381 0.685757,0.07619 0.15239,0.0381 0.342878,0.0381 0.190488,0 0.342879,0.0381 4.609811,0.533367 7.505229,1.371514 2.895418,0.838148 4.914591,3.35259 2.057271,2.514442 2.057271,7.390936 0,4.114542 -1.981075,7.048058 -1.981076,2.933515 -5.790837,4.495515 -3.809761,1.52391 -9.181524,1.52391 z"
       style="font-weight:bold;-inkscape-font-specification:'Bahnschrift Bold'"
       id="path374" />
    <path
       d="m 99.649143,104.16618 q -5.181275,0 -7.619522,-2.62873 -2.400149,-2.666837 -2.400149,-7.848112 V 52.924897 h 10.438748 v 38.173804 q 0,1.447709 0.57146,2.247759 0.57146,0.761952 1.6763,0.761952 h 2.59063 V 104.16618 Z M 85.553027,64.430375 h 19.353583 v 8.91484 H 85.553027 Z"
       style="font-weight:bold;-inkscape-font-specification:'Bahnschrift Bold'"
       id="path376" />
    <path
       d="m 135.80377,78.907466 q 0,-2.743028 -1.82868,-4.228834 -1.82869,-1.485807 -5.18128,-1.485807 -2.20966,0 -4.38122,0.723854 -2.17156,0.723855 -3.84786,2.019174 l -6.47659,-6.362301 q 2.36205,-2.70493 6.24801,-4.190737 3.88595,-1.523904 8.61005,-1.523904 5.18128,0 8.83865,1.75249 3.65737,1.714392 5.56225,5.028884 1.94298,3.276394 1.94298,7.924303 v 25.411102 h -9.48631 z m -11.0102,25.639694 q -6.36231,0 -9.52441,-3.00971 -3.124,-3.047813 -3.124,-9.219626 0,-5.867031 3.50498,-8.800547 3.54308,-2.933516 10.59113,-2.933516 h 9.90538 l 0.53337,7.9624 h -10.40065 q -2.36205,0 -3.54308,0.95244 -1.18102,0.914343 -1.18102,2.819223 0,1.942978 1.48581,2.895419 1.4858,0.914342 4.49551,0.914342 4.19074,0 6.20991,-0.95244 2.05727,-0.95244 2.05727,-2.971613 l 0.80005,5.752739 q -0.22858,2.133469 -1.98107,3.619269 -1.71439,1.48581 -4.34313,2.24776 -2.59064,0.72386 -5.48605,0.72386 z"
       style="font-weight:bold;-inkscape-font-specification:'Bahnschrift Bold'"
       id="path378" />
    <path
       d="m 166.01517,90.908213 q 0,1.447709 0.80005,2.247759 0.83815,0.761952 2.36206,0.761952 h 1.75249 v 10.057766 h -5.33367 q -4.7622,0 -7.39094,-2.74303 -2.62873,-2.743023 -2.62873,-7.73381 V 48.58177 h 10.43874 z"
       style="font-weight:bold;-inkscape-font-specification:'Bahnschrift Bold'"
       id="path380" />
    <path
       d="m 176.45393,93.536948 h 10.43874 v 10.438742 h -10.43874 z"
       style="font-weight:bold;-inkscape-font-specification:'Bahnschrift Bold'"
       id="path382" />
    <path
       d="m 195.84561,64.430375 h 10.43874 v 55.622505 h -10.43874 z m 19.62027,40.116785 q -3.46688,0 -5.98133,-1.75249 -2.51444,-1.79059 -3.73356,-5.028887 l 0.53336,-9.029134 q 0,1.942978 0.68576,3.314492 0.68576,1.371514 1.98108,2.095369 1.33341,0.723854 3.2002,0.723854 2.93351,0 4.53361,-1.942978 1.6382,-1.942978 1.6382,-5.486055 v -6.286106 q 0,-3.619273 -1.6382,-5.600348 -1.6001,-2.019174 -4.53361,-2.019174 -1.86679,0 -3.2002,0.761952 -1.29532,0.723855 -1.98108,2.133467 -0.68576,1.409611 -0.68576,3.428784 l -0.80004,-8.76245 q 1.60009,-3.466882 4.19073,-5.333665 2.62874,-1.90488 5.79084,-1.90488 4.19074,0 7.16235,2.019173 3.00971,2.019173 4.57171,5.905129 1.562,3.885956 1.562,9.333914 v 6.324204 q 0,5.40986 -1.562,9.257718 -1.562,3.809761 -4.57171,5.828931 -2.97161,2.01918 -7.16235,2.01918 z"
       style="font-weight:bold;-inkscape-font-specification:'Bahnschrift Bold'"
       id="path384" />
    <path
       d="m 248.72509,90.908213 q 0,1.447709 0.80005,2.247759 0.83815,0.761952 2.36205,0.761952 h 1.75249 v 10.057766 h -5.33366 q -4.76221,0 -7.39094,-2.74303 -2.62874,-2.743023 -2.62874,-7.73381 V 48.58177 h 10.43875 z"
       style="font-weight:bold;-inkscape-font-specification:'Bahnschrift Bold'"
       id="path386" />
  </g>
</svg>
