<?xml version="1.0" standalone="no"?>
<!DOCTYPE svg PUBLIC "-//W3C//DTD SVG 20010904//EN"
 "http://www.w3.org/TR/2001/REC-SVG-20010904/DTD/svg10.dtd">
<svg version="1.0" xmlns="http://www.w3.org/2000/svg"
 width="489.000000pt" height="500.000000pt" viewBox="0 0 489.000000 500.000000"
 preserveAspectRatio="xMidYMid meet">
<metadata>
Created by potrace 1.15, written by Peter Selinger 2001-2017
</metadata>
<g transform="translate(0.000000,500.000000) scale(0.100000,-0.100000)"
fill="#000000" stroke="none">
<path d="M3111 3982 c-20 -21 -63 -72 -95 -114 -79 -101 -135 -143 -206 -152
-48 -6 -245 -65 -270 -81 -6 -4 -4 -17 4 -33 13 -26 21 -75 17 -115 -1 -14 -5
-16 -20 -7 -11 5 -22 18 -25 27 -4 10 -24 31 -46 46 -22 15 -47 40 -56 55 -25
43 -78 70 -169 89 -71 15 -82 19 -72 32 10 12 -2 13 -94 8 -61 -3 -123 -13
-144 -21 -33 -14 -36 -14 -25 -1 10 12 9 15 -4 15 -37 0 -97 -43 -174 -125
l-82 -87 57 -37 c70 -45 172 -144 193 -186 8 -16 31 -52 51 -80 20 -27 46 -68
57 -90 10 -22 27 -55 37 -73 23 -44 11 -53 -14 -11 -12 19 -37 45 -58 59 -35
24 -62 62 -32 45 8 -5 1 6 -15 23 -29 31 -43 41 -32 23 8 -12 29 -64 32 -78 1
-7 13 -54 27 -105 56 -206 65 -266 46 -285 -8 -8 -9 -25 -4 -50 5 -21 8 -51 7
-68 0 -16 -1 -73 -2 -125 0 -52 -4 -117 -10 -145 -5 -27 -12 -75 -15 -105 -5
-49 -15 -95 -32 -140 -9 -24 -12 -50 -16 -124 -2 -42 -8 -71 -15 -74 -7 -2
-12 3 -12 12 0 9 -4 16 -10 16 -5 0 -10 -13 -10 -29 0 -26 -65 -161 -169 -352
-52 -96 -224 -319 -246 -319 -3 0 23 34 57 76 81 98 121 154 115 160 -3 3 -18
-12 -33 -33 -47 -63 -160 -197 -185 -219 -13 -12 -42 -33 -64 -47 -53 -34 -98
-72 -69 -58 11 5 26 17 34 25 7 9 20 16 29 16 9 0 34 16 55 35 56 51 57 35 1
-17 -49 -46 -194 -128 -225 -128 -10 0 -21 -4 -25 -9 -9 -15 81 -24 154 -17
36 4 73 8 81 8 8 0 21 6 29 12 11 8 13 8 8 -1 -4 -6 -52 -41 -108 -77 -55 -36
-102 -72 -105 -81 -3 -8 -21 -23 -40 -34 -68 -41 -29 -42 105 -5 21 6 22 5 13
-13 -12 -22 1 -43 25 -43 23 0 14 -14 -39 -61 -29 -26 -50 -50 -46 -55 4 -4
61 45 125 109 64 64 119 114 121 112 3 -2 -3 -11 -12 -20 -9 -9 -16 -18 -16
-20 0 -5 122 84 158 115 l23 19 6 -29 c7 -36 11 -37 54 -7 19 13 40 22 46 20
14 -5 6 -33 -9 -33 -6 0 -21 -10 -33 -22 -22 -23 -91 -83 -130 -113 -11 -9 8
-2 42 15 34 16 67 30 73 30 6 0 28 15 48 34 64 59 148 109 127 76 -11 -17 11
-11 28 8 10 10 14 22 10 27 -5 4 2 3 14 -4 14 -7 23 -7 25 -1 2 6 22 12 44 14
23 2 45 6 51 9 5 3 15 1 23 -4 16 -10 12 -14 -37 -46 -10 -6 27 7 82 31 55 23
120 48 145 56 25 8 56 20 70 27 13 7 26 11 28 9 2 -2 -19 -38 -45 -79 -121
-191 -164 -260 -161 -262 5 -5 211 169 295 249 46 44 83 75 83 70 0 -6 -5 -15
-11 -21 -8 -8 -5 -13 10 -18 12 -3 21 -11 21 -16 0 -6 8 -6 20 1 14 8 20 8 20
0 0 -6 -7 -13 -15 -16 -8 -4 -15 -10 -15 -15 0 -13 78 -3 97 13 12 9 15 9 9 1
-24 -41 65 30 200 159 l80 77 75 -39 c218 -114 361 -143 513 -104 86 22 168
71 264 156 122 109 218 250 236 348 4 19 11 44 16 55 20 45 50 165 50 201 0
23 12 62 29 94 44 87 92 169 101 175 5 3 16 -21 25 -52 9 -32 18 -64 21 -72 7
-22 17 -4 16 29 0 16 4 30 10 30 6 0 8 12 4 31 -6 29 -4 31 19 25 17 -4 25 -2
25 6 0 9 3 9 10 -2 6 -9 5 -17 -2 -21 -7 -4 -6 -14 3 -30 l14 -24 3 33 c2 17
8 32 14 32 5 0 8 -7 4 -15 -3 -8 -1 -15 4 -15 6 0 10 -12 10 -26 0 -14 4 -23
10 -19 14 9 12 43 -2 48 -10 3 -10 7 1 20 9 12 11 25 4 44 -4 16 -8 42 -8 60
0 17 -3 31 -8 30 -5 -1 -12 4 -14 11 -3 6 3 12 12 12 13 0 16 6 11 25 -4 15
-2 25 4 25 16 0 2 40 -24 70 -13 14 -37 49 -55 78 -33 51 -61 68 -61 35 0 -13
-3 -14 -12 -5 -7 7 -19 12 -28 12 -8 0 -32 15 -52 33 -45 39 -118 190 -155
322 -53 186 -119 295 -239 396 -44 36 -90 71 -104 78 -23 11 -23 10 4 -12 52
-45 24 -47 -69 -6 -101 45 -205 65 -218 43 -4 -8 -21 -14 -37 -14 -64 0 -134
-22 -164 -53 -17 -16 -59 -40 -95 -53 -36 -13 -69 -30 -73 -38 -5 -8 -24 -20
-42 -26 -19 -6 -40 -18 -47 -26 -10 -12 -9 -13 7 -8 10 3 1 -9 -21 -28 -22
-18 -53 -45 -68 -61 -35 -34 -66 -51 -75 -41 -4 4 -2 9 5 11 7 2 9 11 6 19 -3
7 3 36 12 62 17 46 17 51 1 82 -9 18 -15 34 -14 34 2 1 13 7 25 13 19 11 24 9
42 -13 26 -33 37 -25 46 33 7 49 85 257 113 303 13 20 112 141 132 160 55 54
110 126 110 146 0 13 -4 24 -9 24 -10 0 -3 38 9 55 5 6 13 27 18 48 10 35 9
39 -13 49 -20 9 -29 6 -61 -18 l-37 -29 6 33 c9 43 -6 41 -52 -6z m-935 -551
c-1 -11 6 -15 22 -13 23 3 31 -13 10 -20 -8 -3 -1 -15 17 -34 16 -16 30 -33
30 -39 2 -22 18 -45 31 -45 12 0 12 -5 1 -32 -16 -41 -12 -73 8 -55 7 6 11 15
8 19 -2 4 6 4 19 -1 17 -6 23 -17 25 -40 1 -18 -4 -31 -10 -31 -7 0 -23 -12
-36 -26 -13 -14 -30 -23 -38 -20 -8 3 -11 1 -8 -4 3 -6 2 -10 -4 -10 -18 0
-23 21 -9 37 11 15 11 16 -4 10 -10 -3 -18 -2 -18 4 0 5 7 12 15 15 8 4 12 10
9 16 -3 5 -11 5 -17 1 -11 -8 -28 -9 -65 -4 -7 0 -10 6 -6 12 4 8 0 9 -15 4
-15 -4 -21 -3 -19 6 2 9 -8 13 -29 14 -39 0 -70 29 -76 70 -3 17 -9 29 -14 28
-6 -1 -8 10 -5 24 4 19 2 24 -8 18 -9 -6 -9 -3 0 16 17 33 41 59 50 54 4 -2
17 7 30 20 28 30 108 35 106 6z m1270 -382 c11 -11 25 -19 32 -19 14 0 34 -35
24 -44 -3 -4 0 -11 8 -16 11 -7 12 -10 2 -10 -7 0 -10 -4 -7 -10 3 -5 1 -10
-6 -10 -7 0 2 -12 19 -26 40 -33 41 -48 3 -42 -29 4 -32 -8 -9 -39 11 -13 0
-21 -24 -18 -10 2 -18 -1 -18 -6 0 -6 -4 -7 -10 -4 -5 3 -10 2 -10 -4 0 -5 9
-13 20 -16 28 -9 46 -45 29 -56 -19 -12 -29 -11 -29 3 0 9 -3 9 -12 0 -9 -9
-10 -15 -2 -20 6 -4 13 -15 17 -24 5 -13 1 -18 -13 -18 -17 0 -18 -3 -9 -24 6
-13 20 -27 31 -29 25 -7 18 -32 -8 -33 -47 -3 -55 -5 -50 -13 7 -10 -49 -35
-61 -28 -5 3 -15 2 -22 -2 -9 -6 -10 -11 -2 -15 6 -4 11 -2 11 5 0 7 9 3 20
-9 12 -12 25 -22 30 -22 6 0 10 -6 10 -13 0 -22 -71 -44 -132 -40 -39 2 -58 0
-58 -8 0 -7 -7 -8 -17 -4 -29 11 -123 22 -123 14 0 -9 -81 10 -95 22 -5 5 0 9
13 9 20 0 21 3 12 20 -6 11 -20 20 -30 20 -33 0 -17 49 20 62 11 4 7 9 -12 17
-18 6 -28 18 -28 31 0 16 -7 20 -32 20 l-33 1 29 16 c36 19 58 39 81 76 15 24
16 30 4 37 -14 9 -15 9 37 25 8 3 12 9 9 15 -3 5 -1 10 4 10 6 0 11 6 11 14 0
8 15 17 35 20 22 4 35 13 35 22 0 8 4 13 9 10 5 -3 14 1 21 9 12 15 4 20 -22
16 -5 0 -8 4 -8 9 0 6 7 10 15 10 13 0 19 16 17 41 -1 3 29 11 65 19 38 7 60
16 53 20 -7 4 -10 12 -6 18 3 6 0 13 -6 15 -10 4 -10 8 1 15 22 16 143 2 167
-19z m-551 -568 c22 -5 34 -9 27 -10 -20 -2 -3 -21 18 -21 22 0 39 -22 21 -28
-20 -7 20 -31 54 -32 26 -1 27 -3 10 -10 -11 -5 -33 -11 -48 -15 -15 -3 -25
-10 -22 -15 3 -6 2 -10 -2 -10 -10 0 -9 -92 1 -108 3 -6 -4 -20 -16 -32 -19
-17 -21 -24 -10 -40 17 -27 16 -30 -14 -30 -14 0 -23 -4 -19 -10 4 -6 11 -8
16 -5 5 4 9 2 9 -3 0 -5 -10 -12 -22 -16 -15 -4 -19 -9 -12 -13 6 -5 11 -16
11 -25 0 -12 -9 -16 -31 -16 -41 1 -64 22 -59 52 4 18 0 25 -14 28 -14 3 -18
13 -20 53 -1 28 -5 65 -9 83 -4 21 -2 32 5 32 6 0 11 9 11 21 0 11 5 30 11 42
9 16 9 22 0 25 -6 2 -9 8 -5 13 3 5 -2 9 -11 9 -14 0 -14 2 1 25 9 14 20 22
26 19 5 -3 9 0 7 7 -5 42 7 46 86 30z m745 -102 c0 -5 4 -7 10 -4 18 11 48
-14 48 -40 0 -20 -4 -24 -18 -20 -11 3 -20 -1 -24 -10 -3 -9 0 -15 10 -15 8 0
13 -4 10 -9 -3 -5 -3 -23 0 -40 5 -21 12 -31 25 -31 11 0 19 -4 19 -10 0 -5
-6 -10 -14 -10 -8 0 -25 -14 -37 -32 -18 -25 -19 -30 -6 -25 25 10 29 -9 4
-21 -35 -17 -72 -20 -85 -6 -16 18 -15 24 4 24 10 0 4 10 -17 30 -30 27 -31
30 -13 36 26 10 35 25 28 47 -3 11 2 27 13 39 13 15 15 22 6 25 -7 3 -13 13
-13 23 0 10 -4 21 -10 25 -5 3 -7 12 -3 20 6 17 63 21 63 4z m60 -317 c0 -4
-7 -17 -15 -29 -11 -15 -12 -24 -4 -28 6 -4 8 -18 4 -33 -4 -16 -1 -28 7 -33
10 -7 9 -9 -4 -9 -21 0 -25 -40 -5 -40 7 0 4 -7 -7 -15 -23 -17 -40 -20 -31
-5 3 6 0 10 -7 10 -9 1 -7 5 5 14 17 13 17 14 0 21 -10 5 -21 7 -25 7 -7 -2
-11 24 -5 31 7 10 -35 37 -57 37 -30 0 -32 5 -9 28 33 34 153 68 153 44z"/>
</g>
</svg>
