[gd_scene load_steps=7 format=3 uid="uid://dw1uwrgdbn6ia"]

[ext_resource type="Texture2D" uid="uid://85h2gxw42ple" path="res://plants/plant_base/plants free.png" id="1_5cw0n"]
[ext_resource type="Script" path="res://plants/common_components/plant_save.gd" id="1_v6ueq"]
[ext_resource type="Script" path="res://plants/common_components/ageing_component.gd" id="2_g8e5g"]
[ext_resource type="PackedScene" uid="uid://wo8iydvmxns7" path="res://plants/plant_base/plant_harvestable.tscn" id="3_sb8nw"]

[sub_resource type="AtlasTexture" id="AtlasTexture_1ohs7"]
atlas = ExtResource("1_5cw0n")
region = Rect2(32, 16, 16, 16)

[sub_resource type="RectangleShape2D" id="RectangleShape2D_yfmo8"]
size = Vector2(16, 16)

[node name="PlantSprout" type="Area2D"]
scale = Vector2(4, 4)
collision_layer = 512
collision_mask = 0
script = ExtResource("1_v6ueq")

[node name="Sprite2D" type="Sprite2D" parent="."]
texture = SubResource("AtlasTexture_1ohs7")

[node name="CollisionShape2D" type="CollisionShape2D" parent="."]
shape = SubResource("RectangleShape2D_yfmo8")

[node name="AgeingComponent" type="Node" parent="."]
script = ExtResource("2_g8e5g")
age_threshold = 4.0
next_scene = ExtResource("3_sb8nw")
