[gd_scene load_steps=8 format=3 uid="uid://cwe6eybv2jc6a"]

[ext_resource type="PackedScene" uid="uid://bb16f43p5ycni" path="res://interactables/base/base_interactable.tscn" id="1_to6o6"]
[ext_resource type="Texture2D" uid="uid://co08ubv4itahr" path="res://interactables/sprite/InteractiveTileset.png" id="2_ycgeo"]
[ext_resource type="Script" path="res://interactables/chest/chest_action.gd" id="3_bj4px"]

[sub_resource type="AtlasTexture" id="AtlasTexture_doamj"]
atlas = ExtResource("2_ycgeo")
region = Rect2(32, 60, 16, 16)

[sub_resource type="AtlasTexture" id="AtlasTexture_m738r"]
atlas = ExtResource("2_ycgeo")
region = Rect2(48, 60, 16, 16)

[sub_resource type="SpriteFrames" id="SpriteFrames_sxa31"]
animations = [{
"frames": [{
"duration": 1.0,
"texture": SubResource("AtlasTexture_doamj")
}],
"loop": true,
"name": &"Close",
"speed": 5.0
}, {
"frames": [{
"duration": 1.0,
"texture": SubResource("AtlasTexture_m738r")
}],
"loop": true,
"name": &"Open",
"speed": 5.0
}]

[sub_resource type="RectangleShape2D" id="RectangleShape2D_ag5in"]
size = Vector2(42, 46)

[node name="Chest" instance=ExtResource("1_to6o6")]

[node name="AnimatedSprite2D" parent="." index="0"]
scale = Vector2(3, 3)
sprite_frames = SubResource("SpriteFrames_sxa31")
animation = &"Close"

[node name="CollisionShape2D" parent="InteractableArea" index="0"]
position = Vector2(0, 9)

[node name="action" parent="." index="2" node_paths=PackedStringArray("animated_sprite")]
script = ExtResource("3_bj4px")
animated_sprite = NodePath("../AnimatedSprite2D")

[node name="CollisionShape2D" parent="ClickableArea" index="0"]
position = Vector2(0, 1.5)

[node name="StaticBody2D" type="StaticBody2D" parent="." index="4"]

[node name="CollisionShape2D" type="CollisionShape2D" parent="StaticBody2D" index="0"]
position = Vector2(0, 1)
shape = SubResource("RectangleShape2D_ag5in")
debug_color = Color(1, 0, 0.105882, 0.419608)
