[gd_scene load_steps=4 format=3 uid="uid://b1ppnouc4fsbm"]

[ext_resource type="Script" path="res://HUD/game_over.gd" id="1_s4vuk"]
[ext_resource type="Texture2D" uid="uid://ljyu51hvdege" path="res://HUD/GameOverFodder.png" id="1_tb3x3"]
[ext_resource type="Texture2D" uid="uid://qyiqp635x0su" path="res://HUD/GameOver.png" id="2_rt25d"]

[node name="CanvasLayer" type="CanvasLayer"]
script = ExtResource("1_s4vuk")

[node name="Control" type="Control" parent="."]
layout_mode = 3
anchors_preset = 8
anchor_left = 0.5
anchor_top = 0.5
anchor_right = 0.5
anchor_bottom = 0.5
grow_horizontal = 2
grow_vertical = 2

[node name="TextureRect" type="TextureRect" parent="Control"]
layout_mode = 1
anchors_preset = 8
anchor_left = 0.5
anchor_top = 0.5
anchor_right = 0.5
anchor_bottom = 0.5
offset_left = -1533.0
offset_top = -946.0
offset_right = 1671.0
offset_bottom = 1032.0
grow_horizontal = 2
grow_vertical = 2
texture = ExtResource("1_tb3x3")
expand_mode = 1

[node name="TextureRect2" type="TextureRect" parent="Control"]
layout_mode = 1
anchors_preset = 8
anchor_left = 0.5
anchor_top = 0.5
anchor_right = 0.5
anchor_bottom = 0.5
offset_left = -428.0
offset_top = -323.0
offset_right = 428.0
offset_bottom = 323.0
grow_horizontal = 2
grow_vertical = 2
texture = ExtResource("2_rt25d")
