[gd_scene load_steps=3 format=3 uid="uid://ciy4qwkm4igb6"]

[ext_resource type="PackedScene" uid="uid://iv4hq3g8j4im" path="res://entity/spawner/spawner_base.tscn" id="1_7sfkg"]
[ext_resource type="PackedScene" uid="uid://c2wlp75agcyaf" path="res://entity/enemy_fighter/enemy_fighter_example.tscn" id="2_6b2h3"]

[node name="Spawner" instance=ExtResource("1_7sfkg")]

[node name="Spawn" parent="." index="0"]
spawn_scn = ExtResource("2_6b2h3")

[node name="Timer" parent="." index="1"]
wait_time = 10.0
