[gd_scene load_steps=3 format=3 uid="uid://beu4bhwjn1rcw"]

[ext_resource type="PackedScene" uid="uid://b0tt1a71t80fq" path="res://entity/laser/laser_base.tscn" id="1_er1pr"]
[ext_resource type="AudioStream" uid="uid://ryjjc34inror" path="res://entity/player_ship/laser.ogg" id="2_784vh"]

[node name="Laser" instance=ExtResource("1_er1pr")]

[node name="HitBox" parent="." index="2"]
collision_mask = 2

[node name="Damage" parent="." index="3"]
power = 4

[node name="LaserSFX" type="AudioStreamPlayer2D" parent="." index="7"]
stream = ExtResource("2_784vh")

[connection signal="ready" from="." to="LaserSFX" method="play"]
