[gd_scene load_steps=2 format=3 uid="uid://davjllc3m5tw0"]

[ext_resource type="Texture2D" uid="uid://c35pkvl7lxfvn" path="res://background/star2.png" id="1_oe66t"]

[node name="Constellation" type="Node2D"]
position = Vector2(384, 256)

[node name="Sprite2D" type="Sprite2D" parent="."]
position = Vector2(-126, 165)
texture = ExtResource("1_oe66t")

[node name="Sprite2D4" type="Sprite2D" parent="."]
position = Vector2(12, -76)
texture = ExtResource("1_oe66t")

[node name="Sprite2D5" type="Sprite2D" parent="."]
modulate = Color(0.262745, 0.611765, 0, 1)
position = Vector2(-10, 68)
scale = Vector2(0.5, 0.5)
texture = ExtResource("1_oe66t")

[node name="Sprite2D2" type="Sprite2D" parent="."]
position = Vector2(-119, -34)
texture = ExtResource("1_oe66t")

[node name="Sprite2D3" type="Sprite2D" parent="."]
position = Vector2(74, 43)
texture = ExtResource("1_oe66t")
