[gd_resource type="EventAsset" format=3 uid="uid://bkw4m2pr4xj0l"]

[resource]
is_oneshot = true
min_distance = 1.0
max_distance = 20.0
path = "event:/SFX/Aruna Flinch"
guid = "{663e7d6f-9274-40d3-8a6b-5a9d212b4351}"
name = "Aruna Flinch"
