[gd_scene load_steps=2 format=3 uid="uid://cyry5e13ocxlr"]

[ext_resource type="Script" path="res://scenes/menus/pause.gd" id="1_2niap"]

[node name="PauseHUD" type="CanvasLayer"]

[node name="Pause" type="Control" parent="."]
process_mode = 3
visible = false
z_index = 1
layout_mode = 3
anchors_preset = 15
anchor_right = 1.0
anchor_bottom = 1.0
grow_horizontal = 2
grow_vertical = 2
script = ExtResource("1_2niap")

[node name="ColorRect" type="ColorRect" parent="Pause"]
layout_mode = 1
anchors_preset = 15
anchor_right = 1.0
anchor_bottom = 1.0
grow_horizontal = 2
grow_vertical = 2
color = Color(0, 0, 0, 0.360784)

[node name="Label" type="Label" parent="Pause"]
layout_mode = 1
anchors_preset = 8
anchor_left = 0.5
anchor_top = 0.5
anchor_right = 0.5
anchor_bottom = 0.5
offset_left = -20.0
offset_top = -11.5
offset_right = 20.0
offset_bottom = 11.5
grow_horizontal = 2
grow_vertical = 2
text = "Pausado"
