[gd_scene load_steps=2 format=3 uid="uid://y7amf2s08yr6"]

[ext_resource type="Script" path="res://scenes/collectibles/collectible_item.gd" id="1_2h1iv"]

[node name="CollectibleItem" type="Area2D"]
script = ExtResource("1_2h1iv")

[node name="CollectibleSprite" type="Sprite2D" parent="."]

[node name="CollisionShape2D" type="CollisionShape2D" parent="."]

[connection signal="body_entered" from="." to="." method="_on_body_entered"]
