[gd_scene load_steps=6 format=3 uid="uid://dx04a0ggjfdfx"]

[ext_resource type="Texture2D" uid="uid://dng463l2gts8d" path="res://Sprites/Tile-map/tilemap.png" id="1_sm83q"]

[sub_resource type="TileSetAtlasSource" id="TileSetAtlasSource_jnfk1"]
texture = ExtResource("1_sm83q")
texture_region_size = Vector2i(8, 8)
1:5/0 = 0
1:5/0/physics_layer_0/linear_velocity = Vector2(0, 0)
1:5/0/physics_layer_0/angular_velocity = 0.0
1:5/0/physics_layer_0/polygon_0/points = PackedVector2Array(-2, 1.875, 4, 1.875, 4, 3.0625, -1.875, 3)
3:5/0 = 0
3:5/0/physics_layer_0/linear_velocity = Vector2(0, 0)
3:5/0/physics_layer_0/angular_velocity = 0.0
3:5/0/physics_layer_0/polygon_0/points = PackedVector2Array(4, 1.9375, -4, 2, -4, 3.0625, 4, 3)
5:5/0 = 0
5:5/0/physics_layer_0/linear_velocity = Vector2(0, 0)
5:5/0/physics_layer_0/angular_velocity = 0.0
5:5/0/physics_layer_0/polygon_0/points = PackedVector2Array(1.875, 2, -4, 1.9375, -4, 3.1875, 1.9375, 3.1875)
3:7/next_alternative_id = 5
3:7/0 = 0
3:7/0/physics_layer_0/linear_velocity = Vector2(0, 0)
3:7/0/physics_layer_0/angular_velocity = 0.0
3:7/0/physics_layer_0/polygon_0/points = PackedVector2Array(-3, -1, 2.9375, -0.875, 2.875, 4, -3.0625, 4)
3:7/2 = 2
3:7/2/flip_h = true
3:7/2/transpose = true
3:7/2/physics_layer_0/linear_velocity = Vector2(0, 0)
3:7/2/physics_layer_0/angular_velocity = 0.0
3:7/2/physics_layer_0/polygon_0/points = PackedVector2Array(-4, -4, 1.125, -4, 1.1875, 4, -4, 4)
3:7/3 = 3
3:7/3/transpose = true
3:7/3/physics_layer_0/linear_velocity = Vector2(0, 0)
3:7/3/physics_layer_0/angular_velocity = 0.0
3:7/3/physics_layer_0/polygon_0/points = PackedVector2Array(-0.9375, -4, -1, 4, 4, 4, 4, -4)
3:7/4 = 4
3:7/4/flip_v = true
3:7/4/physics_layer_0/linear_velocity = Vector2(0, 0)
3:7/4/physics_layer_0/angular_velocity = 0.0
3:7/4/physics_layer_0/polygon_0/points = PackedVector2Array(-4, -4, -4, 1.75, 4, 1.8125, 4, -4)

[sub_resource type="TileSet" id="TileSet_pn8ws"]
tile_size = Vector2i(8, 8)
physics_layer_0/collision_layer = 1
custom_data_layer_0/name = "Kill"
custom_data_layer_0/type = 1
sources/1 = SubResource("TileSetAtlasSource_jnfk1")

[sub_resource type="TileSetAtlasSource" id="TileSetAtlasSource_06i0a"]
texture = ExtResource("1_sm83q")
texture_region_size = Vector2i(8, 8)
1:1/0 = 0
1:1/0/physics_layer_0/linear_velocity = Vector2(0, 0)
1:1/0/physics_layer_0/angular_velocity = 0.0
1:1/0/physics_layer_0/polygon_0/points = PackedVector2Array(-4, -4, 4, -4, 4, 4, -4, 4)
3:1/0 = 0
3:1/0/physics_layer_0/linear_velocity = Vector2(0, 0)
3:1/0/physics_layer_0/angular_velocity = 0.0
3:1/0/physics_layer_0/polygon_0/points = PackedVector2Array(-4, -4, 4, -4, 4, 4, -4, 4)
5:1/0 = 0
5:1/0/physics_layer_0/linear_velocity = Vector2(0, 0)
5:1/0/physics_layer_0/angular_velocity = 0.0
5:1/0/physics_layer_0/polygon_0/points = PackedVector2Array(-4, -4, 4, -4, 4, 4, -4, 4)
7:1/0 = 0
7:1/0/physics_layer_0/linear_velocity = Vector2(0, 0)
7:1/0/physics_layer_0/angular_velocity = 0.0
7:1/0/physics_layer_0/polygon_0/points = PackedVector2Array(-4, -4, 4, -4, 4, 4, -4, 4)
9:1/0 = 0
9:1/0/physics_layer_0/linear_velocity = Vector2(0, 0)
9:1/0/physics_layer_0/angular_velocity = 0.0
9:1/0/physics_layer_0/polygon_0/points = PackedVector2Array(-4, -4, 4, -4, 4, 4, -4, 4)
11:1/0 = 0
11:1/0/physics_layer_0/linear_velocity = Vector2(0, 0)
11:1/0/physics_layer_0/angular_velocity = 0.0
11:1/0/physics_layer_0/polygon_0/points = PackedVector2Array(-4, -4, 4, -4, 4, 4, -4, 4)
13:1/0 = 0
13:1/0/physics_layer_0/linear_velocity = Vector2(0, 0)
13:1/0/physics_layer_0/angular_velocity = 0.0
13:1/0/physics_layer_0/polygon_0/points = PackedVector2Array(-4, -4, 4, -4, 4, 4, -4, 4)
15:1/0 = 0
15:1/0/physics_layer_0/linear_velocity = Vector2(0, 0)
15:1/0/physics_layer_0/angular_velocity = 0.0
15:1/0/physics_layer_0/polygon_0/points = PackedVector2Array(-4, -4, 4, -4, 4, 4, -4, 4)
17:1/0 = 0
17:1/0/physics_layer_0/linear_velocity = Vector2(0, 0)
17:1/0/physics_layer_0/angular_velocity = 0.0
17:1/0/physics_layer_0/polygon_0/points = PackedVector2Array(-4, -4, 4, -4, 4, 4, -4, 4)
19:1/0 = 0
19:1/0/physics_layer_0/linear_velocity = Vector2(0, 0)
19:1/0/physics_layer_0/angular_velocity = 0.0
19:1/0/physics_layer_0/polygon_0/points = PackedVector2Array(-4, -4, 4, -4, 4, 4, -4, 4)
21:1/next_alternative_id = 3
21:1/0 = 0
21:1/0/physics_layer_0/linear_velocity = Vector2(0, 0)
21:1/0/physics_layer_0/angular_velocity = 0.0
21:1/0/physics_layer_0/polygon_0/points = PackedVector2Array(-4, -4, 4, -4, 4, 4, -4, 4)
21:1/2 = 2
21:1/2/physics_layer_0/linear_velocity = Vector2(0, 0)
21:1/2/physics_layer_0/angular_velocity = 0.0
1:3/0 = 0
1:3/0/physics_layer_0/linear_velocity = Vector2(0, 0)
1:3/0/physics_layer_0/angular_velocity = 0.0
1:3/0/physics_layer_0/polygon_0/points = PackedVector2Array(-4, -4, 4, -4, 4, 4, -4, 4)
3:3/0 = 0
3:3/0/physics_layer_0/linear_velocity = Vector2(0, 0)
3:3/0/physics_layer_0/angular_velocity = 0.0
3:3/0/physics_layer_0/polygon_0/points = PackedVector2Array(-4, -4, 4, -4, 4, 4, -4, 4)
5:3/0 = 0
5:3/0/physics_layer_0/linear_velocity = Vector2(0, 0)
5:3/0/physics_layer_0/angular_velocity = 0.0
5:3/0/physics_layer_0/polygon_0/points = PackedVector2Array(-4, -4, 4, -4, 4, 4, -4, 4)
7:3/0 = 0
7:3/0/physics_layer_0/linear_velocity = Vector2(0, 0)
7:3/0/physics_layer_0/angular_velocity = 0.0
7:3/0/physics_layer_0/polygon_0/points = PackedVector2Array(-4, -4, 4, -4, 4, 4, -4, 4)
9:3/0 = 0
9:3/0/physics_layer_0/linear_velocity = Vector2(0, 0)
9:3/0/physics_layer_0/angular_velocity = 0.0
9:3/0/physics_layer_0/polygon_0/points = PackedVector2Array(-4, -4, 4, -4, 4, 4, -4, 4)
11:3/0 = 0
11:3/0/physics_layer_0/linear_velocity = Vector2(0, 0)
11:3/0/physics_layer_0/angular_velocity = 0.0
11:3/0/physics_layer_0/polygon_0/points = PackedVector2Array(-4, -4, 4, -4, 4, 4, -4, 4)
13:3/0 = 0
13:3/0/physics_layer_0/linear_velocity = Vector2(0, 0)
13:3/0/physics_layer_0/angular_velocity = 0.0
13:3/0/physics_layer_0/polygon_0/points = PackedVector2Array(-4, -4, 4, -4, 4, 4, -4, 4)
15:3/0 = 0
15:3/0/physics_layer_0/linear_velocity = Vector2(0, 0)
15:3/0/physics_layer_0/angular_velocity = 0.0
15:3/0/physics_layer_0/polygon_0/points = PackedVector2Array(-4, -4, 4, -4, 4, 4, -4, 4)
17:3/0 = 0
17:3/0/physics_layer_0/linear_velocity = Vector2(0, 0)
17:3/0/physics_layer_0/angular_velocity = 0.0
17:3/0/physics_layer_0/polygon_0/points = PackedVector2Array(-4, -4, 4, -4, 4, 4, -4, 4)
19:3/0 = 0
19:3/0/physics_layer_0/linear_velocity = Vector2(0, 0)
19:3/0/physics_layer_0/angular_velocity = 0.0
19:3/0/physics_layer_0/polygon_0/points = PackedVector2Array(-4, -4, 4, -4, 4, 4, -4, 4)
21:3/0 = 0
21:3/0/physics_layer_0/linear_velocity = Vector2(0, 0)
21:3/0/physics_layer_0/angular_velocity = 0.0
21:3/0/physics_layer_0/polygon_0/points = PackedVector2Array(-4, -4, 4, -4, 4, 4, -4, 4)
13:5/0 = 0
13:5/0/physics_layer_0/linear_velocity = Vector2(0, 0)
13:5/0/physics_layer_0/angular_velocity = 0.0
13:5/0/physics_layer_0/polygon_0/points = PackedVector2Array(-4, -4, 4, -4, 4, 4, -4, 4)

[sub_resource type="TileSet" id="TileSet_e6kkr"]
tile_size = Vector2i(8, 8)
physics_layer_0/collision_layer = 1
sources/0 = SubResource("TileSetAtlasSource_06i0a")

[node name="TileMap" type="Node2D"]

[node name="Enemy" type="TileMap" parent="." groups=["Enemy"]]
texture_filter = 1
tile_set = SubResource("TileSet_pn8ws")
rendering_quadrant_size = 8
format = 2

[node name="Enviroment" type="TileMap" parent="." groups=["Wall"]]
texture_filter = 1
tile_set = SubResource("TileSet_e6kkr")
format = 2
