[gd_scene load_steps=22 format=3 uid="uid://c80ngopjgl5uu"]

[ext_resource type="Texture2D" uid="uid://cipqpxsxsagyy" path="res://Sprites/Background/Ceu/bg.png" id="1_2w5u5"]
[ext_resource type="PackedScene" uid="uid://2ye7pmd5h0su" path="res://scenes/cenas-scrpits/player.tscn" id="1_3gxat"]
[ext_resource type="PackedScene" uid="uid://cbqx2onx7cxpk" path="res://scenes/sfx/music/level_background_music.tscn" id="1_fbl0j"]
[ext_resource type="PackedScene" uid="uid://dx04a0ggjfdfx" path="res://Sprites/Tile-map/tile_map.tscn" id="2_feji3"]
[ext_resource type="PackedScene" uid="uid://5eo08pdbtaa6" path="res://scenes/objects/wood_signal_jump.tscn" id="3_m6hg3"]
[ext_resource type="PackedScene" uid="uid://dww74tsgcj8ic" path="res://scenes/objects/wood_signal_cookie.tscn" id="5_6g0if"]
[ext_resource type="PackedScene" uid="uid://dv5s2sn6hwp24" path="res://scenes/cenas-scrpits/dash_item.tscn" id="5_30eur"]
[ext_resource type="PackedScene" uid="uid://ja4g7745rhwm" path="res://scenes/objects/wood_signal_hold.tscn" id="7_04fpc"]
[ext_resource type="PackedScene" uid="uid://dpsvecyr2jvlx" path="res://scenes/objects/wood_signal_jump_higher.tscn" id="7_rwxv6"]
[ext_resource type="PackedScene" uid="uid://bhvg5nu0xmres" path="res://scenes/objects/wood_signal_dash.tscn" id="8_t6c1l"]
[ext_resource type="PackedScene" uid="uid://7alj252tol3l" path="res://scenes/management/checkpoint.tscn" id="11_6ygw3"]
[ext_resource type="PackedScene" uid="uid://coeepecdlof2f" path="res://scenes/management/win_area.tscn" id="12_jheam"]
[ext_resource type="PackedScene" uid="uid://d2g76fdyp1ta0" path="res://scenes/objects/moving_platform_horizontal.tscn" id="12_ovsfh"]
[ext_resource type="PackedScene" uid="uid://bboyvxn3vws7k" path="res://scenes/objects/moving_platform_vertical.tscn" id="13_2pxkb"]
[ext_resource type="PackedScene" uid="uid://b5cq3q4licv8u" path="res://scenes/collectibles/collectible_item_fish.tscn" id="13_fxs0t"]
[ext_resource type="PackedScene" uid="uid://bmb02xld0hp2q" path="res://scenes/cenas-scrpits/mola_item.tscn" id="14_lr5t7"]
[ext_resource type="PackedScene" uid="uid://dqtce61fmi72s" path="res://scenes/objects/wood_signal_spring.tscn" id="15_1t2xg"]
[ext_resource type="PackedScene" uid="uid://b0jfa4vkqycwv" path="res://scenes/management/hud.tscn" id="16_27150"]
[ext_resource type="PackedScene" uid="uid://lq0am3fpocka" path="res://scenes/management/pause_menu.tscn" id="17_j4vpa"]
[ext_resource type="PackedScene" uid="uid://cujwp8shkxn3q" path="res://scenes/objects/button.tscn" id="20_o0tdg"]
[ext_resource type="PackedScene" uid="uid://bv28hpm2u6roj" path="res://scenes/objects/gate.tscn" id="21_gn21q"]

[node name="HowToJump" type="Control" groups=["Level"]]
layout_mode = 3
anchors_preset = 15
anchor_right = 1.0
anchor_bottom = 1.0
offset_left = 41.0
offset_top = 42.0
offset_right = 41.0
offset_bottom = 42.0
grow_horizontal = 2
grow_vertical = 2
metadata/_edit_lock_ = true

[node name="ParallaxBackground" type="ParallaxBackground" parent="."]

[node name="ParallaxLayer" type="ParallaxLayer" parent="ParallaxBackground"]
motion_mirroring = Vector2(648, 0)

[node name="Sprite2D" type="Sprite2D" parent="ParallaxBackground/ParallaxLayer"]
texture_filter = 1
texture = ExtResource("1_2w5u5")
centered = false
offset = Vector2(0, -170)

[node name="LevelBackgroundMusic" parent="." instance=ExtResource("1_fbl0j")]

[node name="TutorialOrganizer" type="Node" parent="."]

[node name="WoodSignalJump" parent="TutorialOrganizer" instance=ExtResource("3_m6hg3")]
position = Vector2(237, 331)

[node name="WoodSignalJumpHigher" parent="TutorialOrganizer" instance=ExtResource("7_rwxv6")]
position = Vector2(710, 315)

[node name="WoodSignalCookie" parent="TutorialOrganizer" instance=ExtResource("5_6g0if")]
position = Vector2(1508, 155)

[node name="WoodSignalDash" parent="TutorialOrganizer" instance=ExtResource("8_t6c1l")]
position = Vector2(1050, 283)

[node name="WoodSignalHold" parent="TutorialOrganizer" instance=ExtResource("7_04fpc")]
position = Vector2(1446, 339)

[node name="WoodSignalSpring" parent="TutorialOrganizer" instance=ExtResource("15_1t2xg")]
position = Vector2(1043, 139)

[node name="TileMap" parent="." instance=ExtResource("2_feji3")]
metadata/_edit_lock_ = true

[node name="Enemy" parent="TileMap" index="0"]
layer_0/tile_data = PackedInt32Array(2359339, 196609, 7, 2359340, 196609, 7, -327639, 196609, 7, -327638, 196609, 7, -327637, 196609, 7, -327636, 196609, 7, -327635, 196609, 7, -327634, 196609, 7, -327633, 196609, 7, -327632, 196609, 7, -327631, 196609, 7, -327630, 196609, 7, -327629, 196609, 7, -327628, 196609, 7, -327627, 196609, 7, -327626, 196609, 7, -327625, 196609, 7, -327624, 196609, 7, -327623, 196609, 7, -327622, 196609, 7, -327621, 196609, 7, -327620, 196609, 7, -327619, 196609, 7, -327618, 196609, 7, -327617, 196609, 7, -327616, 196609, 7, -327615, 196609, 7, -327614, 196609, 7, -327613, 196609, 7, -327612, 196609, 7, -327611, 196609, 7, -327610, 196609, 7, -327609, 196609, 7, -327608, 196609, 7, -327607, 196609, 7, -327606, 196609, 7, -327605, 196609, 7, -327604, 196609, 7, -327603, 196609, 7, -327602, 196609, 7, -327601, 196609, 7, -327600, 196609, 7, -327599, 196609, 7, -327598, 196609, 7, -327597, 196609, 7, -327596, 196609, 7, -327595, 196609, 7, -327594, 196609, 7, -327593, 196609, 7, -327592, 196609, 7, -327591, 196609, 7, -327590, 196609, 7, -327589, 196609, 7, -327588, 196609, 7, -327587, 196609, 7, -327586, 196609, 7, -327585, 196609, 7, -327584, 196609, 7, -327583, 196609, 7, -327582, 196609, 7, -327581, 196609, 7, -327580, 196609, 7, -327579, 196609, 7, -327578, 196609, 7, -327577, 196609, 7, 1048720, 196609, 7, 1048719, 196609, 7, 1048718, 196609, 7, 1048717, 196609, 7, 1048716, 196609, 7, 1048715, 196609, 7, 1048714, 196609, 7, 1048713, 196609, 7, 1048712, 196609, 7, 1048711, 196609, 7, 1048710, 196609, 7, 1048709, 196609, 7, 1048708, 196609, 7, 1048707, 196609, 7, 1048706, 196609, 7, 1048705, 196609, 7, 1048704, 196609, 7, 1048703, 196609, 7, 1048702, 196609, 7, 1048701, 196609, 7, 1048700, 196609, 7, 1048699, 196609, 7, 1048698, 196609, 7, 1048697, 196609, 7, 1048696, 196609, 7, 1048695, 196609, 7, 1048694, 196609, 7, 1048693, 196609, 7, -1572835, 196609, 7, -1572834, 196609, 7, -1572833, 196609, 7, -1245171, 196609, 7, -1245170, 196609, 7, -1245169, 196609, 7, -1245168, 196609, 7, -1245167, 196609, 7, -1245166, 196609, 7, -1245165, 196609, 7, -1245164, 196609, 7, -1245163, 196609, 7, -1245162, 196609, 7, -1245161, 196609, 7, -1245160, 196609, 7, -1507326, 196609, 7, -1507325, 196609, 7, -1507324, 196609, 7, -1507323, 196609, 7, -1507322, 196609, 7, -1507321, 196609, 7, -1507320, 196609, 7, -1507319, 196609, 7, -1507318, 196609, 7, -1245159, 196609, 7, -1245158, 196609, 7, 2621435, 196609, 7, 2621436, 196609, 7, 2621437, 196609, 7, 2621438, 196609, 7, 2621439, 196609, 7, 2555904, 196609, 7, 2555905, 196609, 7, 2555906, 196609, 7, 2555907, 196609, 7, 2555908, 196609, 7, 2555909, 196609, 7, 2555910, 196609, 7, 2555911, 196609, 7, 2555912, 196609, 7, 2555913, 196609, 7, 2555914, 196609, 7, 2555915, 196609, 7, 2555916, 196609, 7, 2555917, 196609, 7, 2555918, 196609, 7, 2555919, 196609, 7, 2555920, 196609, 7, 2555921, 196609, 7, 2555922, 196609, 7, 2555923, 196609, 7, 2555924, 196609, 7, 2555925, 196609, 7, 2555926, 196609, 7, 2555927, 196609, 7, 2555928, 196609, 7, 2555929, 196609, 7, 2555930, 196609, 7, 2555931, 196609, 7, 2555932, 196609, 7, 2555933, 196609, 7, 2555934, 196609, 7, 2555935, 196609, 7, 2555936, 196609, 7, 2555937, 196609, 7, 2555938, 196609, 7, 2555939, 196609, 7, 2555940, 196609, 7, 2555941, 196609, 7, 2555942, 196609, 7, 2555943, 196609, 7, 2555944, 196609, 7, 2555945, 196609, 7, 2555946, 196609, 7, 2555947, 196609, 7, 2555948, 196609, 7, 2555949, 196609, 7, 2555950, 196609, 7, 2555951, 196609, 7, 2555952, 196609, 7, 2555953, 196609, 7, 2555954, 196609, 7, 2555955, 196609, 7, 2555956, 196609, 7, 2555957, 196609, 7, 2555958, 196609, 7, 2555959, 196609, 7, 2555960, 196609, 7, 2555961, 196609, 7, 2555962, 196609, 7, 2555963, 196609, 7, 2555964, 196609, 7, 2555965, 196609, 7, 2555966, 196609, 7, 2555967, 196609, 7, 2555968, 196609, 7, 2555969, 196609, 7, 2555970, 196609, 7, 2555971, 196609, 7, 2555972, 196609, 7, 2555973, 196609, 7, 2555974, 196609, 7, 2555975, 196609, 7, 2555976, 196609, 7, 2555977, 196609, 7, 2555978, 196609, 7, 2555979, 196609, 7, 2555980, 196609, 7, 2555981, 196609, 7, 2555982, 196609, 7, 2555983, 196609, 7, 2555984, 196609, 7, 2555985, 196609, 7, 2555986, 196609, 7, 2555987, 196609, 7, 2555988, 196609, 7, 2555989, 196609, 7, 2555990, 196609, 7, 2555991, 196609, 7, 2555992, 196609, 7, 2555993, 196609, 7, 2555994, 196609, 7, 2555995, 196609, 7, 2555996, 196609, 7, 2555997, 196609, 7, 2555998, 196609, 7, 2555999, 196609, 7, 2556000, 196609, 7, 2556001, 196609, 7, 2556002, 196609, 7, 2556003, 196609, 7, 2556004, 196609, 7, 2556005, 196609, 7, 2556006, 196609, 7, 2556007, 196609, 7, 2556008, 196609, 7, 2556009, 196609, 7, 2556010, 196609, 7, 2556011, 196609, 7, 2556012, 196609, 7, 2556013, 196609, 7, 2556014, 196609, 7, 2556015, 196609, 7, 2556016, 196609, 7, 2556017, 196609, 7, 2556018, 196609, 7, 2556019, 196609, 7, 2556020, 196609, 7, 2556021, 196609, 7, 2556022, 196609, 7, 2556023, 196609, 7, 2556024, 196609, 7, 2556025, 196609, 7, 2556026, 196609, 7, 2556027, 196609, 7, 2556028, 196609, 7, 2556029, 196609, 7, 2556030, 196609, 7, 2556031, 196609, 7, 2556032, 196609, 7, 2556033, 196609, 7, 2556034, 196609, 7, 2556035, 196609, 7, 2556036, 196609, 7, 2556037, 196609, 7, 2556038, 196609, 7, 2556039, 196609, 7, 2556040, 196609, 7, 2556041, 196609, 7, 2556042, 196609, 7, 2556043, 196609, 7, 2556044, 196609, 7, 2556045, 196609, 7, 2556046, 196609, 7, 2556047, 196609, 7, 2556048, 196609, 7, 2556049, 196609, 7, 2556050, 196609, 7, 2556051, 196609, 7, 2556052, 196609, 7, 2556053, 196609, 7, 2556054, 196609, 7, 2556055, 196609, 7, 2556056, 196609, 7, 2556057, 196609, 7, 2556058, 196609, 7, 2556059, 196609, 7, 2556060, 196609, 7, 2556061, 196609, 7, 2556062, 196609, 7, 2556063, 196609, 7, 2556064, 196609, 7, 2556065, 196609, 7, 2556066, 196609, 7, 2556067, 196609, 7, 2556068, 196609, 7, 2556069, 196609, 7, 2556070, 196609, 7, 2556071, 196609, 7, 2556072, 196609, 7, 2556073, 196609, 7, 2556074, 196609, 7, 2556075, 196609, 7, 2556076, 196609, 7, 2556077, 196609, 7, 2556078, 196609, 7, 2556079, 196609, 7, 2556080, 196609, 7, 2556081, 196609, 7, 2556082, 196609, 7, 2556083, 196609, 7, 2556084, 196609, 7, 2556085, 196609, 7, 2556086, 196609, 7, 2556087, 196609, 7, 2556088, 196609, 7, 2556089, 196609, 7, 2556090, 196609, 7, 2556091, 196609, 7, 2556092, 196609, 7, 2556093, 196609, 7, 2556094, 196609, 7, 2556095, 196609, 7, 2556096, 196609, 7, 1573024, 196609, 7, 1573025, 196609, 7, 1966250, 196609, 7, 1966251, 196609, 7, 1966257, 196609, 7, 1966258, 196609, 7, 1966259, 196609, 7, 1966249, 196609, 7, 1638562, 196609, 7, 1638563, 196609, 7, 1638564, 196609, 7, 1638565, 196609, 7, 1638566, 196609, 7, 327861, 196609, 7, 327862, 196609, 7, 327866, 196609, 7, 327867, 196609, 7, 196784, 196609, 7, 196785, 196609, 7, 196786, 196609, 7, 327851, 196609, 7, 327852, 196609, 7, 327853, 196609, 7, 327854, 196609, 7, 327855, 196609, 7, 131242, 196609, 7, 131241, 196609, 7, 917663, 196609, 7, 917664, 196609, 7, 917665, 196609, 7, 917666, 196609, 7, 917667, 196609, 7, 917668, 196609, 7, 917669, 196609, 7, 917670, 196609, 7, 917671, 196609, 7, 917672, 196609, 7, 589942, 196609, 131079, 524406, 196609, 131079, 458870, 196609, 131079, 393334, 196609, 131079, -262026, 196609, 131079, -196490, 196609, 131079, -130954, 196609, 131079, -65418, 196609, 131079, 118, 196609, 131079, 65654, 196609, 131079, 131190, 196609, 131079, 196726, 196609, 131079, 262262, 196609, 131079, 327798, 196609, 131079, 655478, 196609, 131079, 721014, 196609, 131079, 786550, 196609, 131079, -1310571, 196609, 131079, -1245035, 196609, 131079, -1113971, 196609, 131079, -1179507, 196609, 131079, -1245043, 196609, 131079, -1310579, 196609, 131079, -1703791, 196609, 196615, -1638255, 196609, 196615, -1572719, 196609, 196615, -1376115, 196609, 131079, -1507194, 327681, 5, -1507195, 196609, 5, -1507196, 196609, 5, -1507197, 65537, 5, -1441670, 196609, 131079, -1376134, 196609, 131079, -1310598, 196609, 131079, -1376130, 196609, 262151, -1441668, 196609, 196615, -1376131, 196609, 262151, -1703841, 196609, 131079, -1638305, 196609, 131079, -1572769, 196609, 131079, -1507233, 196609, 131079, -1441697, 196609, 131079, -1376161, 196609, 131079, -1310625, 196609, 131079, -982945, 65537, 5, -982944, 196609, 5, -1441692, 196609, 196615, -1376156, 196609, 196615, -1310620, 196609, 196615, -1114006, 196609, 196615, -1048470, 196609, 196615, -982934, 196609, 196615, -917398, 196609, 196615, -851862, 196609, 196615, -786326, 196609, 196615, -1245081, 196609, 262151, -1245080, 196609, 262151, -1245079, 196609, 262151, -1245078, 196609, 262151, -1179542, 196609, 196615, -1245083, 196609, 262151, -1245082, 196609, 262151, -589732, 196609, 5, -589731, 196609, 5, -589730, 196609, 5, -589729, 196609, 5, -589728, 196609, 5, -589727, 327681, 5, -655276, 196609, 131079, -589740, 196609, 131079, -524204, 196609, 131079, -458668, 196609, 131079, -851880, 196609, 196615, -1507246, 196609, 7, -1507245, 196609, 7, -1507244, 196609, 7, -1507243, 196609, 7, -1441706, 196609, 131079, -1441734, 196609, 7, -1441733, 196609, 7, -1441743, 196609, 7, -1441742, 196609, 7, -851908, 196609, 131079, -786372, 196609, 131079, -982999, 196609, 131079, -917463, 196609, 131079, -851927, 196609, 131079, -786391, 196609, 131079, -720855, 196609, 131079, -655319, 196609, 131079, -589783, 196609, 131079, -524247, 196609, 131079, -458711, 196609, 131079, -393175, 196609, 131079, -1507315, 196609, 262151, -1507314, 196609, 262151, -1507313, 196609, 262151, -1507312, 196609, 262151, -1507311, 196609, 262151, -1507310, 196609, 262151, -1507309, 196609, 262151, -1507308, 196609, 262151, -1507307, 196609, 262151, -1245174, 196609, 131079, -524287, 196609, 7, -524286, 196609, 7, 327682, 196609, 196615, 393218, 196609, 196615, 458754, 196609, 196615, 524290, 196609, 196615, 917502, 196609, 131079, 983038, 196609, 131079, 1048574, 196609, 131079, -1245182, 196609, 196615, -655220, 196609, 7, -655219, 196609, 7, -655218, 196609, 7, -655217, 196609, 7, -655216, 196609, 7, -655215, 196609, 7, -982943, 327681, 5, -917501, 65537, 5, -917500, 196609, 5, -917499, 196609, 5, -917498, 196609, 5, -917497, 196609, 5, -917496, 196609, 5, -917495, 196609, 5, -917494, 196609, 5, -917493, 196609, 5, -917492, 327681, 5, -917377, 196609, 131079, -851841, 196609, 131079, -786311, 196609, 196615, -851838, 196609, 196615, -786302, 196609, 196615, -720766, 196609, 196615, -917369, 196609, 262151, -655225, 196609, 7, -589688, 196609, 7, -589685, 196609, 7)

[node name="Enviroment" parent="TileMap" index="1"]
layer_0/tile_data = PackedInt32Array(2424837, 1114112, 1, 2424838, 1114112, 1, 2424839, 851968, 1, 2424840, 1376256, 1, 2424841, 1376256, 1, 2424842, 1245184, 1, 2424843, 851968, 1, 2424844, 1114112, 1, 2424845, 1114112, 1, 2424846, 1245184, 1, 2424847, 983040, 1, 2424848, 851968, 1, 2424849, 1114112, 1, 2424850, 1245184, 1, 2424851, 1114112, 1, 2424852, 851968, 1, 2424853, 1114112, 1, 2424854, 983040, 1, 2424855, 1245184, 1, 2424856, 851968, 1, 2424857, 851968, 1, 2424858, 1114112, 1, 2424859, 1376256, 1, 2424860, 1114112, 1, 2424861, 1114112, 1, 2424862, 983040, 1, 2424863, 1114112, 1, 2424864, 851968, 1, 2424865, 983040, 1, 2424866, 983040, 1, 2424867, 851968, 1, 2424868, 1376256, 1, 2424869, 1114112, 1, 2424870, 983040, 1, 2424871, 1376256, 1, 2424872, 851968, 1, 2424873, 1376256, 1, 2424874, 983040, 1, 2424875, 1245184, 1, 2424876, 983040, 1, 2424877, 1245184, 1, 2424878, 1114112, 1, 2424879, 1245184, 1, 2424880, 1376256, 1, 2424881, 1245184, 1, 2424882, 1114112, 1, 2293838, 1245184, 1, 2293839, 983040, 1, 2293840, 983040, 1, 2293841, 851968, 1, 2293842, 1376256, 1, 2293843, 851968, 1, 2293844, 1114112, 1, 2293845, 1114112, 1, 2293846, 851968, 1, 2293847, 983040, 3, 2293848, 851968, 5, 2031725, 1376256, 1, 2031726, 1245184, 1, 2031727, 983040, 1, 2031728, 851968, 1, 2031729, 1376256, 1, 2031730, 1376256, 1, 2031731, 1114112, 1, 2031732, 851968, 1, 2031733, 1114112, 1, 2031734, 1376256, 1, 2031735, 1114112, 1, 2031736, 1245184, 1, 2031754, 1114112, 1, 2031755, 851968, 1, 2031756, 1114112, 1, 2031757, 851968, 1, 2031737, 1376256, 1, 2031738, 1376256, 1, 2031739, 1376256, 1, 2031740, 1114112, 1, 2031741, 983040, 1, 2031742, 1376256, 1, 2031743, 1376256, 1, 2031744, 983040, 1, 2031769, 1245184, 1, 2031770, 851968, 1, 2031771, 1114112, 1, 2031772, 1245184, 1, 2031773, 851968, 1, 2031774, 1114112, 1, 2031775, 1114112, 1, 2031768, 1114112, 1, 2031767, 1245184, 1, 1245361, 1376256, 3, 1179825, 983040, 3, 1179812, 851968, 3, 983184, 196608, 3, 983185, 589824, 3, 983186, 589824, 3, 983187, 458752, 3, 983188, 196608, 3, 983189, 589824, 3, 983190, 65536, 3, 983191, 589824, 3, 983192, 196608, 3, 983193, 327680, 3, 983194, 458752, 3, 983195, 589824, 3, 983196, 327680, 3, 983197, 720896, 3, 983198, 589824, 3, 983199, 720896, 3, 983200, 327680, 3, 983201, 196608, 3, 983202, 458752, 3, 983203, 720896, 3, 983156, 327680, 1, 983155, 327680, 1, 983154, 327680, 1, 983153, 327680, 1, 983152, 327680, 1, 983151, 327680, 1, 983150, 327680, 1, 983149, 327680, 1, 983148, 327680, 1, 983147, 327680, 1, 983146, 327680, 1, 983145, 327680, 1, 983144, 327680, 1, 983143, 327680, 1, 983142, 327680, 1, 983141, 327680, 1, 983140, 327680, 1, 983139, 327680, 1, 983138, 327680, 1, 983137, 327680, 1, 983136, 327680, 1, 1048671, 327680, 1, 1048670, 327680, 1, 1048669, 327680, 1, 1048668, 327680, 1, 1048667, 327680, 1, 1048666, 327680, 1, 1048665, 327680, 1, 1048664, 327680, 1, 1048663, 327680, 1, 1048662, 327680, 1, 1048661, 327680, 1, 1048660, 327680, 1, 1048659, 327680, 1, 1048658, 327680, 1, 1048657, 327680, 1, 1048656, 327680, 1, 1048655, 327680, 1, 1048654, 327680, 1, 1048653, 327680, 1, 1048652, 327680, 1, 1048651, 327680, 1, 1048650, 327680, 1, 1048649, 327680, 1, 983112, 327680, 1, 983113, 327680, 1, 983114, 327680, 1, 983115, 327680, 1, 983116, 327680, 1, 983117, 327680, 1, 983118, 327680, 1, 983119, 327680, 1, 983120, 327680, 1, 983121, 327680, 1, 983122, 327680, 1, 983123, 327680, 1, 983124, 327680, 1, 983125, 327680, 1, 983126, 327680, 1, 983127, 327680, 1, 983128, 327680, 1, 983129, 327680, 1, 983130, 327680, 1, 983131, 327680, 1, 983132, 327680, 1, 983133, 327680, 1, 983134, 327680, 1, 983135, 327680, 1, 1048588, 327680, 1, 1048589, 327680, 1, 1048590, 327680, 1, 1048591, 327680, 1, 1048592, 327680, 1, 1048593, 327680, 1, 1048594, 327680, 1, 1048595, 327680, 1, 1048596, 327680, 1, 1048597, 327680, 1, 1048598, 327680, 1, 1048599, 327680, 1, 1048600, 327680, 1, 1048601, 327680, 1, 1048602, 327680, 1, 1048603, 327680, 1, 1048604, 327680, 1, 1048605, 327680, 1, 1048606, 327680, 1, 1048607, 327680, 1, 1048608, 327680, 1, 1048609, 327680, 1, 1048610, 327680, 1, 1048611, 327680, 1, 1048612, 327680, 1, 1048613, 327680, 1, 1048614, 327680, 1, 1048615, 327680, 1, 1048616, 327680, 1, 1048617, 327680, 1, 1048618, 327680, 1, 1048619, 327680, 1, 1048620, 327680, 1, 1048621, 327680, 1, 983086, 327680, 1, 983087, 327680, 1, 983088, 327680, 1, 983089, 327680, 1, 983090, 327680, 1, 983091, 327680, 1, 983092, 327680, 1, 983093, 327680, 1, 983094, 327680, 1, 983095, 327680, 1, 983096, 327680, 1, 983097, 327680, 1, 983098, 327680, 1, 983099, 327680, 1, 983100, 327680, 1, 983101, 327680, 1, 983102, 327680, 1, 983103, 327680, 1, 983104, 327680, 1, 983105, 327680, 1, 983106, 327680, 1, 983107, 327680, 1, 983108, 327680, 1, 983109, 327680, 1, 983110, 327680, 1, 983111, 327680, 1, 983047, 196608, 1, 983048, 327680, 1, 983049, 327680, 1, 983050, 327680, 1, 983051, 327680, 1, 983052, 327680, 1, 983053, 327680, 1, 983054, 327680, 1, 983055, 327680, 1, 983056, 327680, 1, 983057, 720896, 1, 983058, 327680, 1, 983059, 327680, 1, 983060, 327680, 1, 983061, 327680, 1, 983062, 327680, 1, 983063, 327680, 1, 983064, 327680, 1, 983065, 327680, 1, 983066, 327680, 1, 983067, 327680, 1, 983068, 327680, 1, 983069, 327680, 1, 983070, 327680, 1, 983071, 327680, 1, 983072, 327680, 1, 983073, 327680, 1, 983074, 327680, 1, 983075, 327680, 1, 983076, 327680, 1, 983077, 327680, 1, 983078, 327680, 1, 983079, 327680, 1, 983080, 327680, 1, 983081, 327680, 1, 983082, 327680, 1, 983083, 327680, 1, 983084, 327680, 1, 983085, 327680, 1, -327503, 327680, 3, -327522, 196608, 3, -327521, 720896, 3, -327520, 458752, 3, -327519, 589824, 3, -327518, 589824, 3, -327517, 720896, 3, -327516, 65536, 3, -327515, 458752, 3, -327514, 196608, 3, -327513, 327680, 3, -327512, 720896, 3, -327511, 65536, 3, -327510, 720896, 3, -327509, 327680, 3, -327508, 196608, 3, -327507, 196608, 3, -327506, 589824, 3, -327505, 196608, 3, -327504, 196608, 3, -327541, 327680, 3, -327540, 589824, 3, -327539, 458752, 3, -327538, 720896, 3, -327537, 196608, 3, -327536, 720896, 3, -327535, 458752, 3, -327534, 327680, 3, -327533, 589824, 3, -327532, 720896, 3, -327531, 589824, 3, -327530, 720896, 3, -327529, 327680, 3, -327528, 196608, 3, -327527, 196608, 3, -327526, 327680, 3, -327525, 589824, 3, -327524, 589824, 3, -327523, 65536, 3, 589960, 458752, 3, 655496, 65536, 3, 721032, 589824, 3, 393352, 458752, 3, 458888, 589824, 3, 524424, 327680, 3, 262280, 65536, 3, 327816, 589824, 3, 852085, 458752, 3, 917621, 458752, 3, 786568, 327680, 3, 852104, 720896, 3, -65409, 589824, 3, -65408, 327680, 3, -65407, 458752, 3, -65406, 589824, 3, -65405, 458752, 3, -65404, 196608, 3, -262012, 327680, 3, -262013, 589824, 3, -262014, 65536, 3, -262015, 196608, 3, -262016, 720896, 3, -262017, 589824, 3, -130945, 196608, 3, -130944, 720896, 3, -130943, 65536, 3, -130942, 65536, 3, -130941, 65536, 3, -130940, 65536, 3, -196476, 720896, 3, -196477, 196608, 3, -196478, 720896, 3, -196479, 589824, 3, -196480, 589824, 3, -196481, 589824, 3, 786549, 589824, 3, -458635, 720896, 1, -393099, 720896, 1, -327563, 65536, 3, -262027, 65536, 3, -196491, 720896, 3, -130955, 589824, 3, -65419, 720896, 3, 117, 196608, 3, 65653, 65536, 3, 131189, 327680, 3, 196725, 589824, 3, 262261, 327680, 3, 327797, 458752, 3, 393333, 720896, 3, 458869, 65536, 3, 524405, 327680, 3, 589941, 720896, 3, 655477, 196608, 3, 721013, 65536, 3, -327548, 589824, 3, -327547, 327680, 3, -327546, 65536, 3, -327545, 589824, 3, -327544, 65536, 3, -327542, 458752, 3, -327543, 720896, 3, -524171, 720896, 1, -589707, 720896, 1, -655243, 720896, 1, -720779, 720896, 1, -786315, 720896, 1, -851851, 720896, 1, -917387, 720896, 1, -982923, 720896, 1, -1048459, 720896, 1, -1113995, 720896, 1, -1179531, 720896, 1, 852086, 720896, 3, 852087, 458752, 3, 852088, 327680, 3, 852089, 196608, 3, 852090, 720896, 3, 852091, 327680, 3, 852092, 458752, 3, 852093, 196608, 3, 852094, 196608, 3, -1769335, 327680, 1, -1441675, 720896, 1, -1376139, 720896, 1, -1310603, 720896, 1, -1245067, 720896, 1, -1769383, 327680, 1, -1703847, 458752, 1, -1638311, 458752, 1, -1572775, 458752, 1, -1507239, 458752, 1, -1441703, 458752, 1, -1376167, 458752, 1, -1310631, 458752, 1, -1245095, 458752, 1, -1179559, 458752, 1, -1114023, 458752, 1, -1769382, 327680, 1, -1703846, 458752, 1, -1638310, 458752, 1, -1572774, 458752, 1, -1507238, 458752, 1, -1441702, 458752, 1, -1376166, 458752, 1, -1310630, 458752, 1, -1245094, 458752, 1, -1179558, 458752, 1, -1114022, 458752, 1, -1769381, 327680, 1, -1703845, 458752, 1, -1638309, 458752, 1, -1572773, 458752, 1, -1507237, 458752, 1, -1441701, 458752, 1, -1376165, 458752, 1, -1310629, 458752, 1, -1245093, 458752, 1, -1179557, 458752, 1, -1114021, 458752, 1, -1769380, 327680, 1, -1703844, 458752, 1, -1638308, 458752, 1, -1572772, 458752, 1, -1507236, 458752, 1, -1441700, 458752, 1, -1376164, 458752, 1, -1310628, 458752, 1, -1245092, 458752, 1, -1179556, 458752, 1, -1114020, 458752, 1, -1769379, 327680, 1, -1703843, 458752, 1, -1638307, 458752, 1, -1572771, 458752, 1, -1507235, 458752, 1, -1441699, 458752, 1, -1376163, 458752, 1, -1310627, 458752, 1, -1245091, 458752, 1, -1179555, 458752, 1, -1114019, 458752, 1, -1769378, 327680, 1, -1703842, 458752, 1, -1638306, 458752, 1, -1572770, 458752, 1, -1507234, 458752, 1, -1441698, 458752, 1, -1376162, 458752, 1, -1310626, 458752, 1, -1245090, 458752, 1, -1179554, 458752, 1, -1114018, 458752, 1, -1441689, 458752, 1, -1376153, 458752, 1, -1310617, 458752, 1, -1441688, 458752, 1, -1376152, 458752, 1, -1310616, 458752, 1, -1441687, 458752, 1, -1376151, 458752, 1, -1310615, 458752, 1, -1441686, 458752, 1, -1376150, 458752, 1, -1310614, 458752, 1, -1441685, 458752, 1, -1376149, 458752, 1, -1310613, 458752, 1, -1245077, 458752, 1, -1179541, 458752, 1, -1114005, 458752, 1, -1048469, 458752, 1, -982933, 458752, 1, -917397, 458752, 1, -851861, 458752, 1, -786325, 458752, 1, -720789, 458752, 1, -655253, 458752, 1, -589717, 458752, 1, -1441684, 458752, 1, -1376148, 458752, 1, -1310612, 458752, 1, -1245076, 458752, 1, -1179540, 458752, 1, -1114004, 458752, 1, -1048468, 458752, 1, -982932, 458752, 1, -917396, 458752, 1, -851860, 458752, 1, -786324, 458752, 1, -720788, 458752, 1, -655252, 458752, 1, -589716, 458752, 1, -524181, 458752, 1, -458645, 458752, 1, -524180, 458752, 1, -458644, 458752, 1, -1441683, 458752, 1, -1376147, 458752, 1, -1310611, 458752, 1, -1245075, 458752, 1, -1179539, 458752, 1, -1114003, 458752, 1, -1048467, 458752, 1, -982931, 458752, 1, -917395, 458752, 1, -851859, 458752, 1, -786323, 458752, 1, -720787, 458752, 1, -655251, 458752, 1, -589715, 458752, 1, -1441682, 458752, 1, -1376146, 458752, 1, -1310610, 458752, 1, -1245074, 458752, 1, -1179538, 458752, 1, -1114002, 458752, 1, -1048466, 458752, 1, -982930, 458752, 1, -917394, 458752, 1, -851858, 458752, 1, -786322, 458752, 1, -720786, 458752, 1, -655250, 458752, 1, -589714, 458752, 1, -1441681, 458752, 1, -1376145, 458752, 1, -1310609, 458752, 1, -1245073, 458752, 1, -1179537, 458752, 1, -1114001, 458752, 1, -1048465, 458752, 1, -982929, 458752, 1, -917393, 458752, 1, -851857, 458752, 1, -786321, 458752, 1, -720785, 458752, 1, -655249, 458752, 1, -589713, 458752, 1, -1441680, 458752, 1, -1376144, 458752, 1, -1310608, 458752, 1, -1245072, 458752, 1, -1179536, 458752, 1, -1114000, 458752, 1, -1048464, 458752, 1, -982928, 458752, 1, -917392, 458752, 1, -851856, 458752, 1, -786320, 458752, 1, -720784, 458752, 1, -655248, 458752, 1, -589712, 458752, 1, -1441679, 458752, 1, -1376143, 458752, 1, -1310607, 458752, 1, -1245071, 458752, 1, -1179535, 458752, 1, -1113999, 458752, 1, -1048463, 458752, 1, -982927, 458752, 1, -917391, 458752, 1, -851855, 458752, 1, -786319, 458752, 1, -720783, 458752, 1, -655247, 458752, 1, -589711, 458752, 1, -1441678, 458752, 1, -1376142, 458752, 1, -1310606, 458752, 1, -1245070, 458752, 1, -1179534, 458752, 1, -1113998, 458752, 1, -1048462, 458752, 1, -982926, 458752, 1, -917390, 458752, 1, -851854, 458752, 1, -786318, 458752, 1, -720782, 458752, 1, -655246, 458752, 1, -589710, 458752, 1, -524179, 458752, 1, -458643, 458752, 1, -524178, 458752, 1, -458642, 458752, 1, -524177, 458752, 1, -458641, 458752, 1, -524176, 458752, 1, -458640, 458752, 1, -524175, 458752, 1, -458639, 458752, 1, -524174, 458752, 1, -458638, 458752, 1, -1441677, 458752, 1, -1376141, 458752, 1, -1310605, 458752, 1, -1245069, 458752, 1, -1179533, 458752, 1, -1113997, 458752, 1, -1048461, 458752, 1, -982925, 458752, 1, -917389, 458752, 1, -851853, 458752, 1, -786317, 458752, 1, -720781, 458752, 1, -655245, 458752, 1, -589709, 458752, 1, -1441676, 458752, 1, -1376140, 458752, 1, -1310604, 458752, 1, -1245068, 458752, 1, -1179532, 458752, 1, -1113996, 458752, 1, -1048460, 458752, 1, -982924, 458752, 1, -917388, 458752, 1, -851852, 458752, 1, -786316, 458752, 1, -720780, 458752, 1, -655244, 458752, 1, -589708, 458752, 1, -524173, 458752, 1, -458637, 458752, 1, -524172, 458752, 1, -458636, 458752, 1, -917429, 720896, 1, -851893, 720896, 1, -786357, 720896, 1, -720821, 720896, 1, -655285, 720896, 1, -589749, 720896, 1, -524213, 720896, 1, -458677, 720896, 1, -393141, 720896, 1, -982964, 720896, 1, -917428, 720896, 1, -851892, 720896, 1, -786356, 720896, 1, -720820, 720896, 1, -655284, 720896, 1, -589748, 720896, 1, -524212, 720896, 1, -458676, 720896, 1, -393140, 720896, 1, -982963, 720896, 1, -917427, 720896, 1, -851891, 720896, 1, -786355, 720896, 1, -720819, 720896, 1, -655283, 720896, 1, -589747, 720896, 1, -524211, 720896, 1, -458675, 720896, 1, -393139, 720896, 1, -982962, 720896, 1, -917426, 720896, 1, -851890, 720896, 1, -786354, 720896, 1, -720818, 720896, 1, -655282, 720896, 1, -589746, 720896, 1, -524210, 720896, 1, -458674, 720896, 1, -393138, 720896, 1, -982961, 720896, 1, -917425, 720896, 1, -851889, 720896, 1, -786353, 720896, 1, -720817, 720896, 1, -655281, 720896, 1, -589745, 720896, 1, -524209, 720896, 1, -458673, 720896, 1, -393137, 720896, 1, -982960, 720896, 1, -917424, 720896, 1, -851888, 720896, 1, -786352, 720896, 1, -720816, 720896, 1, -655280, 720896, 1, -589744, 720896, 1, -524208, 720896, 1, -458672, 720896, 1, -393136, 720896, 1, -982959, 720896, 1, -917423, 720896, 1, -851887, 720896, 1, -786351, 720896, 1, -720815, 720896, 1, -655279, 720896, 1, -589743, 720896, 1, -524207, 720896, 1, -458671, 720896, 1, -393135, 720896, 1, -982958, 720896, 1, -917422, 720896, 1, -851886, 720896, 1, -786350, 720896, 1, -720814, 720896, 1, -655278, 720896, 1, -589742, 720896, 1, -524206, 720896, 1, -458670, 720896, 1, -393134, 720896, 1, -982957, 720896, 1, -917421, 720896, 1, -851885, 720896, 1, -786349, 720896, 1, -720813, 720896, 1, -655277, 720896, 1, -589741, 720896, 1, -524205, 720896, 1, -458669, 720896, 1, -393133, 720896, 1, -1048487, 720896, 1, -982951, 720896, 1, -1048486, 720896, 1, -982950, 720896, 1, -917414, 720896, 1, -1048485, 720896, 1, -982949, 720896, 1, -917413, 720896, 1, -1048484, 720896, 1, -982948, 720896, 1, -917412, 458752, 1, -1048483, 720896, 1, -982947, 720896, 1, -917411, 458752, 1, -1048482, 720896, 1, -982946, 720896, 1, -982971, 720896, 1, -982970, 720896, 1, -982969, 720896, 1, -982968, 720896, 1, -982967, 720896, 1, -982966, 720896, 1, -982965, 720896, 1, -1245126, 327680, 1, -1179590, 327680, 1, -1114054, 720896, 1, -1048518, 720896, 1, -982982, 720896, 1, -917446, 720896, 1, -1376198, 720896, 1, -1310662, 327680, 1, -1376207, 720896, 1, -1310671, 720896, 1, -1245135, 720896, 1, -1179599, 720896, 1, -1114063, 720896, 1, -1048527, 720896, 1, -982991, 720896, 1, -917455, 720896, 1, -983000, 327680, 1, -983001, 327680, 1, -983002, 65536, 1, -983003, 196608, 1, -983004, 196608, 1, -983005, 589824, 1, -983006, 65536, 1, -983007, 65536, 1, -983008, 196608, 1, -983009, 720896, 1, -983010, 327680, 1, -983011, 327680, 1, -983012, 327680, 1, -983014, 327680, 1, -983015, 327680, 1, -983016, 327680, 1, -983017, 327680, 1, -983018, 720896, 1, -983019, 720896, 1, 2555900, 458752, 1, 2490364, 458752, 1, 2424828, 458752, 1, 2359292, 458752, 1, 2293756, 458752, 1, 2228220, 458752, 1, 2162684, 458752, 1, 2097148, 458752, 1, 2031611, 458752, 1, 1966075, 458752, 1, 1900539, 458752, 1, 1835003, 458752, 1, 1769467, 458752, 1, 1703931, 458752, 1, 1638395, 458752, 1, 1572859, 458752, 1, 1507323, 458752, 1, 1441787, 458752, 1, 1376251, 458752, 1, 1310715, 458752, 1, 1245179, 458752, 1, 1179643, 458752, 1, 2490365, 1376256, 3, 2424829, 983040, 3, 2359293, 851968, 3, 2293757, 1376256, 3, 2228221, 983040, 3, 2162685, 851968, 5, 2097149, 983040, 3, 2031613, 851968, 5, 1966077, 1376256, 3, 2555899, 458752, 1, 2555901, 851968, 5, 2555902, 1245184, 3, 2555903, 851968, 3, 2490368, 851968, 3, 2490369, 983040, 3, 2490370, 1114112, 3, 2490371, 1114112, 3, 2490372, 1376256, 3, 2490373, 1245184, 3, 2490374, 851968, 3, 2490375, 1376256, 3, 2490376, 851968, 3, 2490377, 1114112, 3, 2490378, 851968, 3, 2490379, 851968, 3, 2490380, 1245184, 3, 2490381, 1114112, 3, 2490382, 1245184, 3, 2490383, 983040, 3, 2490384, 1245184, 3, 2490385, 1114112, 3, 2490386, 1245184, 3, 2490387, 851968, 3, 2490388, 1114112, 3, 2490389, 983040, 3, 2490390, 1245184, 3, 2490391, 1114112, 3, 2490392, 983040, 3, 2490393, 851968, 3, 2490394, 1114112, 3, 2490395, 1245184, 3, 2490396, 1376256, 3, 2490397, 983040, 3, 2490398, 1245184, 3, 2490399, 1376256, 3, 2490400, 1245184, 3, 2490401, 851968, 3, 2490402, 1245184, 3, 2490403, 1376256, 3, 2490404, 1376256, 3, 2490405, 1114112, 3, 2490406, 1245184, 3, 2490407, 1376256, 3, 2490408, 851968, 3, 2490409, 1114112, 3, 2490410, 851968, 3, 2490411, 1114112, 3, 2490412, 1114112, 3, 2490413, 1245184, 3, 2490414, 983040, 3, 2490415, 1245184, 3, 2490416, 983040, 3, 2490417, 983040, 3, 2490418, 1376256, 3, 2097147, 458752, 1, 2162683, 458752, 1, 2228219, 458752, 1, 2293755, 458752, 1, 2359291, 458752, 1, 2424827, 458752, 1, 2490363, 458752, 1, 1441788, 458752, 1, 1507324, 458752, 1, 1572860, 458752, 1, 1638396, 458752, 1, 1703932, 458752, 1, 1769468, 458752, 1, 1835004, 458752, 1, 1900540, 458752, 1, 1966076, 458752, 1, 2031612, 458752, 1, 1441789, 983040, 3, 1507325, 1376256, 3, 1572861, 851968, 3, 1638397, 1376256, 3, 1703933, 983040, 3, 1769469, 851968, 3, 1835005, 851968, 3, 1900541, 983040, 3, -1703941, 458752, 1, -1638405, 458752, 1, -1572869, 458752, 1, -1507333, 458752, 1, -1441797, 458752, 1, -1376261, 458752, 1, -1310725, 458752, 1, -1245189, 458752, 1, -1179653, 458752, 1, -1114117, 458752, 1, -1048581, 458752, 1, -983045, 458752, 1, -917509, 458752, 1, -851973, 458752, 1, -786437, 458752, 1, -720901, 458752, 1, -655365, 458752, 1, -589829, 458752, 1, -524293, 458752, 1, -458757, 458752, 1, -393221, 458752, 1, -327685, 458752, 1, -262149, 458752, 1, -196613, 458752, 1, -131077, 458752, 1, -65541, 458752, 1, -5, 458752, 1, 65531, 458752, 1, 131067, 458752, 1, 196603, 458752, 1, 327675, 458752, 1, 393211, 458752, 1, 458747, 458752, 1, 524283, 458752, 1, 589819, 458752, 1, -1703940, 458752, 1, -1638404, 458752, 1, -1572868, 458752, 1, -1507332, 458752, 1, -1441796, 458752, 1, -1376260, 458752, 1, -1310724, 458752, 1, -1245188, 458752, 1, -1179652, 458752, 1, -1114116, 458752, 1, -1048580, 458752, 1, -983044, 458752, 1, -917508, 458752, 1, -851972, 458752, 1, -786436, 458752, 1, -720900, 458752, 1, -655364, 458752, 1, -589828, 458752, 1, -524292, 458752, 1, -458756, 458752, 1, -393220, 458752, 1, -327684, 458752, 1, -262148, 458752, 1, -196612, 458752, 1, -131076, 458752, 1, -65540, 458752, 1, -4, 458752, 1, 65532, 458752, 1, 131068, 458752, 1, 196604, 458752, 1, 327676, 458752, 1, 393212, 458752, 1, 458748, 458752, 1, 524284, 458752, 1, 589820, 458752, 1, -1703939, 458752, 1, -1638403, 458752, 1, -1572867, 458752, 1, -1507331, 458752, 1, -1441795, 458752, 1, -1376259, 458752, 1, -1310723, 458752, 1, -1245187, 458752, 1, -1179651, 458752, 1, -1114115, 458752, 1, -1048579, 458752, 1, -983043, 458752, 1, -917507, 458752, 1, -851971, 458752, 1, -786435, 458752, 1, -720899, 458752, 1, -655363, 458752, 1, -589827, 458752, 1, -524291, 458752, 1, -458755, 458752, 1, -393219, 458752, 1, -327683, 458752, 1, -262147, 458752, 1, -196611, 458752, 1, -131075, 458752, 1, -65539, 458752, 1, -3, 458752, 1, 65533, 458752, 1, 131069, 458752, 1, 196605, 458752, 1, 327677, 458752, 1, 393213, 458752, 1, 458749, 458752, 1, 524285, 458752, 1, 589821, 458752, 1, -1703938, 327680, 1, -1638402, 458752, 1, -1572866, 458752, 1, -1507330, 458752, 1, -1441794, 458752, 1, -1376258, 458752, 1, -1310722, 458752, 1, -1245186, 458752, 1, -1179650, 458752, 1, 655355, 458752, 1, 720891, 458752, 1, 786427, 458752, 1, 851963, 458752, 1, 917499, 458752, 1, 983035, 458752, 1, 1048571, 458752, 1, 1114107, 458752, 1, 655356, 458752, 1, 720892, 458752, 1, 786428, 458752, 1, 851964, 458752, 1, 917500, 458752, 1, 983036, 458752, 1, 1048572, 458752, 1, 1114108, 458752, 1, 1179644, 458752, 1, 1245180, 458752, 1, 1310716, 458752, 1, 1376252, 458752, 1, 655357, 458752, 1, 720893, 458752, 1, 786429, 458752, 1, 851965, 458752, 1, 917501, 458752, 1, 983037, 458752, 1, 1048573, 458752, 1, 1114109, 458752, 1, 1179645, 458752, 1, 1245181, 851968, 5, 1310717, 851968, 3, 1376253, 851968, 5, -851951, 327680, 1, -786415, 327680, 1, -720879, 327680, 1, -655343, 327680, 1, -589807, 720896, 1, -524271, 720896, 1, -458735, 720896, 1, -393199, 720896, 1, -327663, 196608, 1, -262127, 589824, 1, -196591, 589824, 1, -131055, 65536, 1, -65519, 196608, 1, 17, 196608, 1, 65553, 196608, 1, 131089, 65536, 1, 196625, 589824, 1, 262161, 327680, 1, 327697, 327680, 1, 393233, 589824, 1, 458769, 589824, 1, 524305, 589824, 1, 589841, 458752, 1, 655377, 65536, 1, 720913, 196608, 1, 786449, 196608, 1, 851985, 196608, 1, 917521, 327680, 1, -917487, 720896, 1, -983023, 458752, 1, -983022, 458752, 1, -983021, 458752, 1, -983020, 458752, 1, 2490437, 851968, 5, 2490438, 1376256, 3, 2490439, 851968, 5, 2490440, 983040, 3, 2490441, 851968, 5, 2359370, 1114112, 1, 2424906, 983040, 3, 2490442, 851968, 5, 2359371, 983040, 1, 2424907, 851968, 3, 2490443, 851968, 5, 2359372, 983040, 1, 2424908, 1376256, 3, 2490444, 851968, 5, 2359373, 1245184, 1, 2424909, 1114112, 3, 2490445, 851968, 5, 2359374, 851968, 3, 2424910, 1376256, 3, 2490446, 851968, 5, 2359375, 983040, 3, 2424911, 983040, 3, 2490447, 851968, 5, 2359376, 1114112, 3, 2424912, 1245184, 3, 2490448, 851968, 5, 2359377, 1376256, 3, 2424913, 1114112, 3, 2490449, 1376256, 3, 2359378, 983040, 3, 2424914, 1245184, 3, 2490450, 851968, 5, 2359379, 1376256, 3, 2424915, 1376256, 3, 2490451, 851968, 5, 2359380, 1114112, 3, 2424916, 983040, 3, 2490452, 851968, 5, 2359381, 1245184, 3, 2424917, 1245184, 3, 2490453, 851968, 5, 2359382, 1376256, 3, 2424918, 1245184, 3, 2490454, 851968, 5, 2359383, 851968, 3, 2424919, 851968, 5, 2490455, 983040, 3, 2359384, 851968, 5, 2424920, 1114112, 3, 2490456, 851968, 5, 2359385, 1114112, 3, 2424921, 851968, 3, 2490457, 851968, 5, 2293849, 851968, 5, 2293850, 851968, 5, 2359386, 851968, 5, 2424922, 851968, 5, 2490458, 851968, 5, 2293851, 851968, 5, 2359387, 851968, 5, 2424923, 851968, 5, 2490459, 851968, 5, 2097261, 851968, 3, 2162797, 1245184, 3, 2228333, 851968, 5, 2293869, 851968, 5, 2359405, 983040, 3, 2424941, 851968, 5, 2490477, 851968, 5, 2097262, 851968, 3, 2162798, 851968, 3, 2228334, 851968, 5, 2293870, 851968, 5, 2359406, 851968, 5, 2424942, 851968, 5, 2490478, 851968, 5, 2097263, 851968, 3, 2162799, 1245184, 3, 2228335, 851968, 5, 2293871, 851968, 5, 2359407, 851968, 5, 2424943, 1114112, 3, 2490479, 851968, 5, 2097264, 1376256, 3, 2162800, 1114112, 3, 2228336, 851968, 5, 2293872, 1245184, 3, 2359408, 851968, 5, 2424944, 851968, 5, 2490480, 851968, 5, 2097265, 983040, 3, 2162801, 851968, 3, 2228337, 851968, 5, 2293873, 851968, 5, 2359409, 851968, 5, 2424945, 851968, 5, 2490481, 851968, 5, 2097266, 1376256, 3, 2162802, 983040, 3, 2228338, 851968, 5, 2293874, 983040, 3, 2359410, 851968, 5, 2424946, 851968, 5, 2490482, 851968, 5, 2097267, 1376256, 3, 2162803, 1114112, 3, 2228339, 851968, 5, 2293875, 851968, 5, 2359411, 851968, 5, 2424947, 1376256, 3, 2490483, 851968, 5, 2097268, 1376256, 3, 2162804, 983040, 3, 2228340, 851968, 5, 2293876, 851968, 5, 2359412, 851968, 5, 2424948, 851968, 5, 2490484, 851968, 5, 2097269, 851968, 3, 2162805, 1376256, 3, 2228341, 851968, 5, 2293877, 983040, 3, 2359413, 851968, 5, 2424949, 983040, 3, 2490485, 851968, 5, 2097270, 1376256, 3, 2162806, 1376256, 3, 2228342, 851968, 5, 2293878, 851968, 5, 2359414, 851968, 5, 2424950, 851968, 5, 2490486, 851968, 5, 2097271, 1245184, 3, 2162807, 1376256, 3, 2228343, 851968, 5, 2293879, 851968, 5, 2359415, 851968, 5, 2424951, 851968, 5, 2490487, 851968, 5, 2097272, 983040, 3, 2162808, 1376256, 3, 2228344, 851968, 5, 2293880, 1376256, 3, 2359416, 851968, 5, 2424952, 851968, 5, 2490488, 851968, 5, 2097273, 1376256, 3, 2162809, 983040, 3, 2228345, 851968, 5, 2293881, 851968, 5, 2359417, 851968, 5, 2424953, 851968, 5, 2490489, 1114112, 3, 2097274, 1245184, 3, 2162810, 983040, 3, 2228346, 851968, 5, 2293882, 851968, 5, 2359418, 851968, 5, 2424954, 851968, 5, 2490490, 851968, 5, 2097275, 851968, 3, 2162811, 851968, 3, 2228347, 851968, 5, 2293883, 851968, 5, 2359419, 1114112, 3, 2424955, 851968, 5, 2490491, 851968, 5, 2097276, 1114112, 3, 2162812, 983040, 3, 2228348, 851968, 5, 2293884, 851968, 5, 2359420, 851968, 5, 2424956, 851968, 5, 2490492, 851968, 5, 2097277, 851968, 3, 2162813, 1114112, 3, 2228349, 851968, 5, 2293885, 851968, 5, 2359421, 851968, 5, 2424957, 851968, 5, 2490493, 851968, 5, 2097278, 1376256, 3, 2162814, 1245184, 3, 2228350, 851968, 3, 2293886, 851968, 5, 2359422, 1245184, 3, 2424958, 851968, 5, 2490494, 851968, 5, 2097279, 1376256, 3, 2162815, 851968, 3, 2228351, 851968, 5, 2293887, 851968, 5, 2359423, 851968, 5, 2424959, 851968, 5, 2490495, 1245184, 3, 2097280, 1245184, 3, 2162816, 1114112, 3, 2228352, 851968, 5, 2293888, 851968, 5, 2359424, 851968, 5, 2424960, 851968, 5, 2490496, 851968, 5, 2097290, 1376256, 3, 2162826, 1376256, 3, 2228362, 1376256, 3, 2293898, 851968, 5, 2359434, 1245184, 3, 2424970, 851968, 5, 2490506, 851968, 5, 2097291, 983040, 3, 2162827, 983040, 3, 2228363, 1245184, 3, 2293899, 851968, 5, 2359435, 851968, 5, 2424971, 851968, 5, 2490507, 851968, 5, 2097292, 1114112, 3, 2162828, 983040, 3, 2228364, 851968, 3, 2293900, 851968, 5, 2359436, 851968, 5, 2424972, 851968, 5, 2490508, 851968, 3, 2097293, 1245184, 3, 2162829, 983040, 3, 2228365, 983040, 3, 2293901, 851968, 5, 2359437, 1376256, 3, 2424973, 851968, 5, 2490509, 851968, 5, 2097303, 851968, 3, 2162839, 1114112, 3, 2228375, 1114112, 3, 2293911, 851968, 5, 2359447, 851968, 3, 2424983, 851968, 5, 2490519, 851968, 5, 2097304, 851968, 3, 2162840, 1376256, 3, 2228376, 1114112, 3, 2293912, 851968, 5, 2359448, 851968, 5, 2424984, 851968, 5, 2490520, 851968, 3, 2097305, 1114112, 3, 2162841, 983040, 3, 2228377, 1114112, 3, 2293913, 851968, 5, 2359449, 851968, 5, 2424985, 851968, 5, 2490521, 851968, 5, 2097306, 1245184, 3, 2162842, 1376256, 3, 2228378, 1376256, 3, 2293914, 851968, 5, 2359450, 851968, 5, 2424986, 983040, 3, 2490522, 851968, 5, 2097307, 1245184, 3, 2162843, 851968, 3, 2228379, 1376256, 3, 2293915, 851968, 5, 2359451, 851968, 5, 2424987, 1376256, 3, 2490523, 851968, 5, 2097308, 1376256, 3, 2162844, 1114112, 3, 2228380, 1114112, 3, 2293916, 851968, 5, 2359452, 1376256, 3, 2424988, 851968, 5, 2490524, 851968, 5, 2097309, 1376256, 3, 2162845, 1376256, 3, 2228381, 983040, 3, 2293917, 851968, 5, 2359453, 851968, 5, 2424989, 851968, 5, 2490525, 851968, 5, 2097310, 983040, 3, 2162846, 1376256, 3, 2228382, 1114112, 3, 2293918, 851968, 5, 2359454, 851968, 5, 2424990, 851968, 5, 2490526, 983040, 3, 2097311, 983040, 3, 2162847, 1376256, 3, 2228383, 851968, 3, 2293919, 1376256, 3, 2359455, 851968, 5, 2424991, 851968, 5, 2490527, 851968, 5, 2490528, 1376256, 1, 2490529, 1245184, 1, 2490530, 1245184, 1, 2490531, 1114112, 1, 2490532, 1376256, 1, 2490533, 1245184, 1, 2490534, 1376256, 1, 2490535, 851968, 1, 2490536, 1376256, 1, 2490537, 1245184, 1, 2490538, 1376256, 1, 2490539, 1245184, 1, 2490540, 1114112, 1, 2490541, 1376256, 1, 2490542, 1245184, 1, 2490543, 1245184, 1, 2490544, 1114112, 1, 2490545, 1114112, 1, -917473, 720896, 1, -786405, 327680, 1, -655333, 327680, 1, -589797, 327680, 1, -524261, 720896, 1, -524285, 327680, 1, -524284, 327680, 1, -524283, 327680, 1, -524282, 327680, 1, -524281, 327680, 1, -524280, 327680, 1, -524279, 327680, 1, -524278, 327680, 1, -524277, 327680, 1, -524276, 720896, 1, -524275, 720896, 1, -524274, 720896, 1, -524273, 720896, 1, -524272, 720896, 1, -524270, 327680, 1, -524269, 327680, 1, -524268, 327680, 1, -524267, 327680, 1, -524266, 327680, 1, -524265, 327680, 1, -524264, 720896, 1, -524263, 720896, 1, -524262, 720896, 1, -524260, 720896, 1, -524259, 720896, 1, -524258, 720896, 1, -524257, 720896, 1, -524256, 65536, 1, -589792, 196608, 1, -655328, 720896, 1, -720864, 65536, 1, -786400, 720896, 1, -851936, 720896, 1, -917472, 458752, 1, -1245152, 720896, 1, -1310688, 720896, 1, -1376224, 720896, 1, -1441760, 720896, 1, -1507296, 720896, 1, -1572832, 720896, 1, -1638368, 720896, 1, -1703904, 720896, 1, -1703905, 720896, 1, -1703906, 720896, 1, -1703907, 720896, 1, -1703908, 720896, 1, -1703909, 720896, 1, -1703910, 720896, 1, -1703911, 720896, 1, -1703912, 720896, 1, -1703913, 720896, 1, -1703914, 720896, 1, -1703915, 720896, 1, -1703916, 720896, 1, -1703917, 458752, 1, -1703918, 458752, 1, -1703919, 458752, 1, -1703920, 458752, 1, -1703921, 458752, 1, -1703922, 458752, 1, -1703923, 720896, 1, -1703924, 720896, 1, -1703925, 720896, 1, -1703926, 720896, 1, -1703927, 720896, 1, -1703928, 720896, 1, -1703929, 720896, 1, -1703930, 720896, 1, -1703931, 720896, 1, -1703932, 720896, 1, -1703933, 720896, 1, -1703934, 720896, 1, -1703935, 720896, 1, -1703936, 720896, 1, -1638401, 720896, 1, -917476, 720896, 1, -851940, 720896, 1, -786404, 720896, 1, -720868, 720896, 1, -655332, 720896, 1, -589796, 720896, 1, -917475, 720896, 1, -851939, 720896, 1, -786403, 720896, 1, -720867, 720896, 1, -655331, 720896, 1, -589795, 720896, 1, -917474, 720896, 1, -851938, 720896, 1, -786402, 720896, 1, -720866, 720896, 1, -655330, 720896, 1, -589794, 720896, 1, -851937, 720896, 1, -786401, 720896, 1, -720865, 720896, 1, -655329, 589824, 1, -589793, 196608, 1, -1048550, 327680, 1, -1114086, 327680, 1, -1179622, 327680, 1, -1114087, 327680, 1, -1048551, 327680, 1, -983013, 327680, 1, -917477, 327680, 1, -851941, 327680, 1, -720869, 327680, 1, -589798, 327680, 1, -589799, 327680, 1, -655335, 327680, 1, -720871, 327680, 1, -786407, 327680, 1, -851943, 327680, 1, -917479, 327680, 1, -917480, 327680, 1, -917481, 327680, 1, -917482, 327680, 1, -917483, 327680, 1, -917484, 327680, 1, -917485, 327680, 1, -917486, 327680, 1, -655342, 327680, 1, -589806, 327680, 1, -589801, 327680, 1, -589800, 327680, 1, -655337, 327680, 1, -655338, 327680, 1, -720874, 327680, 1, -720875, 327680, 1, -720876, 327680, 1, -720877, 327680, 1, -655341, 327680, 1, -589805, 327680, 1, -655340, 327680, 1, -786412, 327680, 1, -786413, 327680, 1, -851949, 327680, 1, -851950, 327680, 1, -786414, 327680, 1, -720878, 327680, 1, -589804, 327680, 1, -589803, 327680, 1, -458731, 327680, 1, -458730, 196608, 1, -589802, 327680, 1, -655339, 327680, 1, -851948, 327680, 1, -851947, 327680, 1, -851946, 327680, 1, -786411, 327680, 1, -786410, 327680, 1, -851945, 327680, 1, -851944, 327680, 1, -786409, 327680, 1, -786408, 327680, 1, -720873, 327680, 1, -786406, 327680, 1, -720872, 327680, 1, -655336, 327680, 1, -655334, 327680, 1, -720870, 327680, 1, -851942, 327680, 1, -917478, 327680, 1, -1048559, 458752, 1, -1638371, 327680, 1, -1638370, 327680, 1, -1638369, 327680, 1, -983027, 458752, 1, -983026, 327680, 1, -983025, 327680, 1, -983024, 327680, 1, -1048556, 327680, 1, -1114092, 327680, 1, -1179628, 458752, 1, -1179629, 458752, 1, -1114093, 458752, 1, -1048557, 458752, 1, -1048558, 458752, 1, -1114094, 458752, 1, -1179630, 458752, 1, -1048561, 458752, 1, -1114097, 458752, 1, -1179633, 458752, 1, -1179635, 458752, 1, -1114099, 458752, 1, -1048563, 458752, 1, -1048562, 458752, 1, -1048560, 458752, 1, -1179634, 458752, 1, -1114098, 458752, 1, -1114096, 458752, 1, -1179631, 458752, 1, -1114095, 458752, 1, -1179632, 458752, 1, -1638380, 458752, 1, -1638381, 458752, 1, -1638386, 458752, 1, -1638387, 458752, 1, -1572851, 458752, 1, -1572849, 458752, 1, -1572850, 458752, 1, -1638385, 458752, 1, -1572846, 458752, 1, -1638382, 458752, 1, -1572845, 458752, 1, -1638383, 458752, 1, -1638384, 458752, 1, -1572848, 458752, 1, -1572847, 458752, 1, -1572844, 458752, 1, -1179627, 327680, 1, -1179626, 327680, 1, -1179625, 327680, 1, -1179624, 327680, 1, -1179623, 327680, 1, -1048552, 327680, 1, -1048553, 327680, 1, -1114090, 327680, 1, -1114091, 327680, 1, -1048555, 327680, 1, -1048554, 327680, 1, -1114089, 327680, 1, -1114088, 327680, 1, -1572843, 327680, 1, -1638379, 327680, 1, -1376246, 458752, 1, -1310710, 458752, 1, -1441782, 458752, 1, -1441790, 458752, 1, -1376254, 458752, 1, -1310718, 458752, 1, -1245181, 458752, 1, -1245180, 458752, 1, -1245179, 458752, 1, -1245175, 458752, 1, -1245176, 458752, 1, -1245177, 458752, 1, -1245178, 458752, 1, -1310716, 458752, 1, -1310715, 458752, 1, -1376251, 458752, 1, -1441788, 458752, 1, -1441789, 458752, 1, -1376253, 458752, 1, -1376252, 458752, 1, -1310714, 458752, 1, -1376249, 458752, 1, -1376248, 458752, 1, -1310711, 458752, 1, -1376247, 458752, 1, -1441783, 458752, 1, -1441784, 458752, 1, -1441785, 458752, 1, -1441786, 458752, 1, -1441787, 458752, 1, -1310717, 458752, 1, -1376250, 458752, 1, -1310713, 458752, 1, -1310712, 458752, 1, -917491, 327680, 1, -851955, 327680, 1, -786419, 327680, 1, -720887, 327680, 1, -720886, 327680, 1, -720885, 327680, 1, -720884, 327680, 1, -720883, 327680, 1, -720882, 327680, 1, -720881, 327680, 1, -720880, 327680, 1, -851952, 327680, 1, -917488, 327680, 1, -917490, 327680, 1, -851954, 327680, 1, -786418, 327680, 1, -786417, 327680, 1, -851953, 327680, 1, -917489, 327680, 1, -786416, 327680, 1, -655344, 327680, 1, -589808, 327680, 1, -589809, 327680, 1, -589810, 327680, 1, -589811, 327680, 1, -589812, 327680, 1, -589813, 327680, 1, -589814, 327680, 1, -655350, 327680, 1, -655349, 327680, 1, -655348, 327680, 1, -655347, 327680, 1, -655346, 327680, 1, -655345, 327680, 1, -851956, 327680, 1, -786420, 327680, 1, -851957, 327680, 1, -851958, 327680, 1, -851959, 327680, 1, -851960, 327680, 1, -851961, 327680, 1, -851962, 327680, 1, -851963, 327680, 1, -851964, 327680, 1, -655351, 327680, 1, -655352, 327680, 1, -655353, 327680, 1, -589817, 327680, 1, -589818, 327680, 1, -589819, 327680, 1, -589820, 327680, 1, -589821, 327680, 1, -589816, 327680, 1, -589815, 327680, 1, -655354, 327680, 1, -720891, 327680, 1, -720892, 327680, 1, -720893, 327680, 1, -786428, 327680, 1, -851965, 327680, 1, -786429, 327680, 1, -655357, 327680, 1, -655356, 327680, 1, -655355, 327680, 1, -720889, 327680, 1, -786425, 327680, 1, -786426, 327680, 1, -720890, 327680, 1, -786427, 327680, 1, -720888, 327680, 1, -786422, 327680, 1, -786423, 327680, 1, -786424, 327680, 1, -786421, 327680, 1, 1376448, 1376256, 3, 1441984, 1376256, 3, 1507520, 1245184, 3, 1573056, 851968, 3, 1638592, 851968, 3, 1704128, 983040, 3, 1769664, 1376256, 3, 1835200, 1114112, 3, 1900736, 1114112, 3, 1966272, 851968, 3, 2031808, 1114112, 3, 2097344, 1114112, 3, 2162880, 983040, 3, 2228416, 1376256, 3, 2293952, 983040, 3, 2359488, 983040, 3, 2425024, 1245184, 3, 2490560, 1376256, 3, 2490559, 1245184, 1, 2490558, 1376256, 1, 2490557, 851968, 1, 2490556, 851968, 1, 2490555, 1245184, 1, 2490554, 983040, 1, 2490553, 1376256, 1, 2490552, 983040, 1, 2490551, 851968, 1, 2490550, 851968, 1, 2490549, 1114112, 1, 2490548, 1376256, 1, 2490547, 1114112, 1, 2490546, 1245184, 1, 1179835, 983040, 3, 1179836, 983040, 3, 1179837, 851968, 3, 1179838, 983040, 3, 1179839, 1376256, 3, 1179840, 1114112, 3, 1245376, 851968, 3, 1310912, 851968, 3, 1179826, 851968, 3, 1179827, 983040, 3, 1179828, 1114112, 3, 1179829, 851968, 3, 1179830, 983040, 3, 1179831, 1245184, 3, 1179832, 851968, 3, 1179833, 1376256, 3, 1179834, 1376256, 3, 1441948, 1114112, 3, 1376412, 1114112, 3, 1310876, 1376256, 3, 1245340, 1114112, 3, 1179804, 983040, 3, 1179805, 851968, 5, 1179806, 983040, 3, 1179807, 851968, 5, 1179808, 851968, 3, 1179809, 851968, 3, 1179810, 851968, 5, 1179811, 983040, 3, 1245341, 1376256, 3, 1310877, 983040, 3, 1376413, 1245184, 3, 1441949, 851968, 3, 1245342, 1245184, 3, 1310878, 1245184, 3, 1376414, 851968, 3, 1441950, 851968, 3, 1245343, 983040, 3, 1310879, 1376256, 3, 1376415, 983040, 3, 1441951, 851968, 3, 1507487, 1376256, 3, 1573023, 1376256, 3, 1638559, 851968, 3, 1638560, 1245184, 3, 1638561, 1376256, 3, 2097339, 1114112, 1, 2097338, 1114112, 1, 2097337, 851968, 1, 2097336, 851968, 1, 2097335, 851968, 5, 2031799, 851968, 5, 1966263, 851968, 5, 1900727, 1376256, 3, 1835191, 851968, 5, 1769655, 851968, 5, 1704119, 1245184, 3, 1638583, 1245184, 3, 1573047, 851968, 3, 1507511, 1245184, 1, 1704123, 1114112, 1, 1704124, 851968, 1, 1704125, 1114112, 1, 1704126, 1245184, 1, 1704127, 1376256, 1, 1507510, 1376256, 1, 1507509, 1376256, 1, 1507508, 1245184, 1, 1441964, 1245184, 1, 1507500, 983040, 3, 1573036, 851968, 3, 1638572, 851968, 5, 1704109, 851968, 5, 1704110, 851968, 5, 1704111, 983040, 3, 1638576, 851968, 5, 1573040, 1245184, 3, 1507503, 983040, 3, 1441967, 1376256, 1, 1441965, 851968, 1, 1507501, 851968, 3, 1573037, 851968, 3, 1638574, 851968, 5, 1573039, 1376256, 3, 1573038, 851968, 3, 1507502, 1114112, 3, 1441966, 1245184, 1, 1638573, 983040, 3, 1638575, 851968, 5, 1507504, 851968, 3, 1441968, 983040, 1, 2031785, 851968, 1, 2031786, 1114112, 1, 2031787, 1245184, 1, 2031793, 1245184, 1, 2031794, 1376256, 1, 2031795, 1114112, 1, 1966248, 1245184, 3, 1900712, 1245184, 3, 1835176, 1376256, 3, 1769640, 851968, 3, 1704104, 851968, 3, 1638568, 1376256, 3, 1573032, 851968, 3, 1507495, 1114112, 1, 1573031, 1376256, 3, 1638567, 983040, 3, 1507496, 851968, 1, 1573044, 851968, 3, 1638580, 1245184, 3, 1704116, 1114112, 3, 1769652, 1376256, 3, 1835188, 851968, 5, 1900724, 1376256, 3, 1966260, 851968, 5, 2031796, 851968, 5, 2031797, 851968, 5, 2031798, 1376256, 3, 1966262, 851968, 5, 1900726, 851968, 5, 1835190, 851968, 5, 1769654, 851968, 5, 1704118, 1376256, 3, 1638582, 1114112, 3, 1573046, 983040, 3, 1573045, 1376256, 3, 1638581, 851968, 3, 1704117, 1245184, 3, 1769653, 851968, 5, 1835189, 851968, 5, 1900725, 851968, 5, 1966261, 851968, 3, 1704098, 851968, 3, 1310897, 1376256, 3, 1179821, 983040, 3, 1179820, 1376256, 3, 1179819, 983040, 3, 1179818, 1376256, 3, 1179817, 851968, 5, 1179816, 983040, 3, 1179815, 983040, 3, 1179814, 1376256, 3, 1179813, 1376256, 3, 1179651, 1376256, 3, 1179652, 983040, 3, 1179653, 983040, 3, 1179654, 851968, 5, 1179655, 851968, 3, 1179656, 851968, 3, 1179657, 851968, 5, 1179658, 983040, 3, 1179659, 1376256, 3, 1179660, 983040, 3, 1179661, 1376256, 3, 1179662, 851968, 5, 1179663, 1376256, 3, 1179664, 1376256, 3, 1179665, 1376256, 3, 1179666, 983040, 3, 1179667, 851968, 5, 1179668, 851968, 3, 1179669, 1376256, 3, 1179670, 851968, 3, 1179671, 851968, 5, 1179672, 851968, 5, 1179673, 851968, 5, 1179674, 1376256, 3, 1179675, 983040, 3, 1179676, 851968, 3, 1179677, 851968, 3, 1179678, 851968, 5, 1179679, 983040, 3, 1179680, 851968, 5, 1179681, 983040, 3, 1179682, 851968, 5, 1179683, 983040, 3, 1179684, 851968, 5, 1179685, 983040, 3, 1179686, 851968, 5, 1179687, 851968, 3, 1179688, 851968, 5, 1179689, 851968, 5, 1179690, 851968, 5, 1179691, 851968, 3, 1179692, 851968, 5, 1179693, 983040, 3, 1179694, 983040, 3, 1179695, 851968, 5, 1179696, 851968, 3, 1179697, 1376256, 3, 1179698, 851968, 5, 1179699, 1376256, 3, 1179700, 983040, 3, 1179701, 851968, 5, 1179702, 1376256, 3, 1179703, 851968, 5, 1179704, 983040, 3, 1179705, 851968, 5, 1179706, 983040, 3, 1179707, 851968, 3, 1179708, 851968, 3, 1179709, 983040, 3, 1179710, 983040, 3, 1179711, 851968, 3, 1179712, 851968, 5, 1179713, 983040, 3, 1179714, 851968, 3, 1179715, 851968, 3, 1179716, 851968, 5, 1179717, 1376256, 3, 1179718, 983040, 3, 1179719, 851968, 3, 1179720, 983040, 3, 1179721, 851968, 3, 1179722, 983040, 3, 1179723, 983040, 3, 1179724, 1376256, 3, 1179725, 1376256, 3, 1179726, 983040, 3, 1179727, 851968, 3, 1179728, 1376256, 3, 1179729, 851968, 5, 1179730, 983040, 3, 1179731, 1376256, 3, 1179732, 983040, 3, 1179733, 1376256, 3, 1179734, 851968, 5, 1179735, 1376256, 3, 1179736, 851968, 3, 1179737, 1376256, 3, 1179738, 1376256, 3, 1179739, 983040, 3, 1179740, 1376256, 3, 1179741, 851968, 3, 1179742, 983040, 3, 1179743, 983040, 3, 1179744, 851968, 5, 1179745, 851968, 3, 1179746, 983040, 3, 1179747, 983040, 3, 1179748, 983040, 3, 1179749, 1376256, 3, 1179750, 851968, 3, 1179751, 851968, 5, 1179752, 1376256, 3, 1179753, 983040, 3, 1179754, 851968, 5, 1179755, 851968, 3, 1179756, 851968, 5, 1179757, 983040, 3, 1179758, 1376256, 3, 1179759, 1376256, 3, 1179760, 851968, 5, 1179761, 851968, 3, 1179762, 1376256, 3, 1179763, 983040, 3, 1179764, 851968, 3, 1179765, 851968, 5, 1179766, 983040, 3, 1179767, 851968, 5, 1179768, 983040, 3, 1179769, 851968, 5, 1179770, 1376256, 3, 1179771, 851968, 3, 1179772, 851968, 3, 1179803, 983040, 3, 1179802, 851968, 3, 1179801, 1376256, 3, 1179800, 851968, 5, 1179799, 851968, 5, 1179798, 851968, 3, 1179797, 1376256, 3, 1179796, 851968, 5, 1179795, 851968, 5, 1179794, 851968, 5, 1179793, 983040, 3, 1179792, 983040, 3, 1179791, 1376256, 3, 1179790, 851968, 3, 1179789, 983040, 3, 1179788, 983040, 3, 1179787, 851968, 3, 1179786, 851968, 5, 1179785, 983040, 3, 1179784, 851968, 5, 1179783, 983040, 3, 1179782, 851968, 3, 1179781, 983040, 3, 1179780, 851968, 3, 1179779, 851968, 3, 1179778, 1376256, 3, 1179777, 851968, 3, 1179776, 983040, 3, 1179775, 983040, 3, 1179774, 851968, 3, 1179773, 1376256, 3, 1704099, 983040, 3, 1704100, 983040, 3, 1704101, 1245184, 3, 1704102, 1114112, 3, 1376433, 1376256, 3, 983232, 65536, 3, 917696, 720896, 3, 852160, 720896, 3, 786624, 327680, 3, 1114304, 589824, 1, 1048768, 720896, 3, -327502, 65536, 3, -327501, 720896, 3, -327500, 589824, 3, -327499, 196608, 3, -327498, 327680, 3, -327497, 589824, 3, -327496, 589824, 3, -327495, 589824, 3, -327494, 720896, 3, -327493, 327680, 3, -327492, 589824, 3, -327491, 327680, 3, -327490, 65536, 3, -327489, 589824, 3, -327488, 458752, 3, 262336, 65536, 3, 327872, 327680, 3, 393408, 65536, 3, 458944, 720896, 3, 524480, 720896, 3, 590016, 589824, 3, 655552, 720896, 3, 721088, 65536, 3, -261952, 458752, 3, -196416, 589824, 3, -130880, 327680, 3, -65344, 458752, 3, 192, 65536, 3, 65728, 327680, 3, 131264, 327680, 3, 196800, 327680, 3, 1048721, 720896, 3, 1114257, 589824, 1, 1048722, 720896, 3, 1114258, 589824, 1, 1048723, 458752, 3, 1114259, 589824, 1, 1048724, 720896, 3, 1114260, 589824, 1, 1048725, 589824, 3, 1114261, 589824, 1, 1048726, 65536, 3, 1114262, 589824, 1, 1048727, 458752, 3, 1114263, 589824, 1, 1048728, 65536, 3, 1114264, 589824, 1, 1048729, 589824, 3, 1114265, 589824, 1, 1048730, 327680, 3, 1114266, 589824, 1, 1048731, 196608, 3, 1114267, 589824, 1, 1048732, 720896, 3, 1114268, 589824, 1, 1048733, 589824, 3, 1114269, 589824, 1, 1048734, 458752, 3, 1114270, 589824, 1, 1048735, 196608, 3, 1114271, 589824, 1, 1048736, 458752, 3, 1114272, 589824, 1, 1048737, 65536, 3, 1114273, 589824, 1, 1048738, 458752, 3, 1114274, 589824, 1, 1048739, 589824, 3, 1114275, 589824, 1, 983204, 458752, 3, 1048740, 458752, 3, 1114276, 589824, 1, 983205, 327680, 3, 1048741, 589824, 3, 1114277, 589824, 1, 983206, 65536, 3, 1048742, 65536, 3, 1114278, 589824, 1, 983207, 196608, 3, 1048743, 720896, 3, 1114279, 589824, 1, 983208, 589824, 3, 1048744, 196608, 3, 1114280, 589824, 1, 983209, 65536, 3, 1048745, 65536, 3, 1114281, 589824, 1, 983210, 196608, 3, 1048746, 720896, 3, 1114282, 589824, 1, 983211, 65536, 3, 1048747, 720896, 3, 1114283, 589824, 1, 983212, 65536, 3, 1048748, 589824, 3, 1114284, 589824, 1, 983213, 65536, 3, 1048749, 458752, 3, 1114285, 589824, 1, 1048753, 458752, 3, 1114289, 589824, 1, 1048754, 458752, 3, 1114290, 589824, 1, 1048755, 65536, 3, 1114291, 589824, 1, 1048756, 458752, 3, 1114292, 589824, 1, 1048757, 458752, 3, 1114293, 589824, 1, 1048758, 458752, 3, 1114294, 589824, 1, 1048759, 458752, 3, 1114295, 589824, 1, 1048760, 589824, 3, 1114296, 589824, 1, 1048761, 327680, 3, 1114297, 589824, 1, 1048762, 196608, 3, 1114298, 589824, 1, 1048763, 65536, 3, 1114299, 589824, 1, 1048764, 196608, 3, 1114300, 589824, 1, 1048765, 589824, 3, 1114301, 589824, 1, 1048766, 196608, 3, 1114302, 589824, 1, 1048767, 589824, 3, 1114303, 589824, 1, 983217, 720896, 3, 983218, 196608, 3, 983219, 458752, 3, 983220, 589824, 3, 983221, 327680, 3, 983222, 589824, 3, 983223, 196608, 3, 983224, 65536, 3, 983225, 327680, 3, 983226, 589824, 3, 983227, 720896, 3, 983228, 196608, 3, 983229, 196608, 3, 983230, 327680, 3, 983231, 458752, 3, 393402, 458752, 3, 458938, 589824, 3, 524474, 65536, 3, 590010, 196608, 3, 655546, 589824, 3, 721082, 589824, 3, 393403, 327680, 3, 458939, 458752, 3, 524475, 458752, 3, 590011, 327680, 3, 655547, 589824, 3, 721083, 458752, 3, 393397, 65536, 3, 393398, 65536, 3, 262320, 720896, 3, 327856, 196608, 3, 393392, 589824, 3, 458928, 327680, 3, 524464, 196608, 3, 590000, 327680, 3, 655536, 65536, 3, 262321, 458752, 3, 327857, 327680, 3, 393393, 327680, 3, 458929, 458752, 3, 524465, 327680, 3, 590001, 720896, 3, 655537, 196608, 3, 262322, 327680, 3, 327858, 458752, 3, 393394, 327680, 3, 458930, 589824, 3, 524466, 720896, 3, 590002, 327680, 3, 655538, 196608, 3, 196777, 458752, 3, 262313, 720896, 3, 327849, 65536, 3, 393385, 589824, 3, 458921, 458752, 3, 524457, 458752, 3, 589993, 720896, 3, 655529, 458752, 3, 721065, 589824, 3, 786601, 720896, 3, 852137, 458752, 3, 917673, 196608, 3, 196778, 196608, 3, 262314, 458752, 3, 327850, 589824, 3, 458922, 589824, 3, 524458, 458752, 3, 589994, 65536, 3, 655530, 65536, 3, 721066, 65536, 3, 786602, 196608, 3, 852138, 458752, 3, 917674, 196608, 3, 262139, 458752, 1, 262140, 458752, 1, 262141, 458752, 1, 393386, 327680, 3, 393387, 327680, 3, 393388, 196608, 3, 393389, 327680, 3, 393390, 458752, 3, 393391, 458752, 3, 458923, 458752, 3, 458924, 458752, 3, 458925, 196608, 3, 458926, 65536, 3, 458927, 720896, 3, -261981, 327680, 3, -196445, 720896, 3, -130909, 196608, 3, -65373, 589824, 3, 163, 196608, 3, 65699, 458752, 3, 131235, 720896, 3, 196771, 65536, 3, 262307, 720896, 3, 327843, 327680, 3, 393379, 65536, 3, 458915, 458752, 3, 524451, 327680, 3, 589987, 327680, 3, 589986, 65536, 3, 524450, 458752, 3, 458914, 65536, 3, 393378, 720896, 3, 327842, 65536, 3, 262306, 720896, 3, 196770, 589824, 3, 131234, 720896, 3, 65698, 720896, 3, 162, 458752, 3, -65374, 589824, 3, -130910, 327680, 3, -196446, 589824, 3, -261982, 589824, 3, 524446, 65536, 3, 589982, 196608, 3, 655518, 196608, 3, 721054, 65536, 3, 786590, 327680, 3, 852126, 327680, 3, 917662, 196608, 3, 458910, 196608, 3, 393374, 589824, 3, 327838, 65536, 3, 262302, 65536, 3, 196766, 589824, 3, 131230, 589824, 3, 65694, 196608, 3, -261980, 458752, 3, -196444, 720896, 3, -130908, 720896, 3, -65372, 720896, 3, 164, 196608, 3, 65700, 720896, 3, 131236, 720896, 3, 196772, 196608, 3, 262308, 589824, 3, 327844, 327680, 3, 393380, 589824, 3, 458916, 196608, 3, 524452, 327680, 3, 589988, 327680, 3, -261979, 327680, 3, -196443, 65536, 3, -130907, 458752, 3, -65371, 196608, 3, 165, 589824, 3, 65701, 589824, 3, 131237, 65536, 3, 196773, 65536, 3, 262309, 720896, 3, 327845, 589824, 3, 393381, 589824, 3, 458917, 327680, 3, 524453, 720896, 3, 589989, 720896, 3, 983166, 458752, 3, 983165, 327680, 3, 983164, 196608, 3, 983163, 589824, 3, 983162, 589824, 3, 983161, 458752, 3, 983160, 458752, 3, 983159, 327680, 3, 983158, 65536, 3, 983157, 589824, 3, 917622, 720896, 3, 917623, 327680, 3, 917624, 589824, 3, 917625, 65536, 3, 917626, 720896, 3, 917627, 589824, 3, 917628, 458752, 3, 917629, 65536, 3, 917630, 458752, 3, -262005, 720896, 3, -262004, 327680, 3, -262003, 196608, 3, -262002, 327680, 3, -196466, 458752, 3, -130930, 720896, 3, -65394, 720896, 3, 142, 65536, 3, 65678, 589824, 3, 131214, 327680, 3, 196750, 327680, 3, 262286, 327680, 3, 327822, 196608, 3, 393358, 196608, 3, 458894, 458752, 3, 524430, 196608, 3, 589966, 196608, 3, -196465, 589824, 3, -130929, 458752, 3, -65393, 720896, 3, 143, 196608, 3, 65679, 327680, 3, 131215, 65536, 3, 196751, 65536, 3, 262287, 65536, 3, 327823, 720896, 3, 393359, 458752, 3, 458895, 196608, 3, 524431, 589824, 3, 589967, 65536, 3, -262001, 65536, 3, -262000, 196608, 3, -261999, 720896, 3, -261998, 589824, 3, -261997, 65536, 3, -261996, 196608, 3, -261995, 327680, 3, -261994, 327680, 3, -261993, 458752, 3, -261992, 65536, 3, -261991, 589824, 3, -261990, 327680, 3, -261989, 327680, 3, -261988, 196608, 3, -261987, 65536, 3, -261986, 196608, 3, -261985, 720896, 3, -261984, 65536, 3, -261983, 196608, 3, 2228311, 851968, 5, 2228312, 851968, 5, 2097243, 1114112, 3, 2097242, 983040, 3, 2097241, 1245184, 3, 2097240, 1245184, 3, 2097239, 1376256, 3, 2162775, 1114112, 3, 2162776, 1376256, 3, 2162777, 851968, 5, 2228313, 851968, 5, 2228314, 851968, 5, 2162778, 1245184, 3, 2228315, 851968, 5, 2162779, 1376256, 3, 2031703, 851968, 1, 2031704, 851968, 1, 2031705, 851968, 1, 2031706, 851968, 1, 2031707, 851968, 1, 2031788, 851968, 3, 2031790, 851968, 3, 2031789, 1114112, 3, 2031791, 1376256, 3, 2031792, 1376256, 3, 1966252, 851968, 1, 1966253, 983040, 1, 1966254, 1114112, 1, 1966255, 1245184, 1, 1966256, 1376256, 1, -458622, 327680, 1, -458621, 327680, 1, -458620, 327680, 1, -458619, 327680, 1, -458618, 327680, 1, -458617, 327680, 1, -458616, 327680, 1, -917352, 720896, 1, -851816, 720896, 1, -786280, 720896, 1, -720744, 720896, 1, -655208, 720896, 1, -589672, 720896, 1, -524136, 720896, 1, -458600, 720896, 1, -1769330, 720896, 1, -1769329, 720896, 1, -1769328, 720896, 1, -1769327, 720896, 1, -1769326, 458752, 1, -1769325, 720896, 1, -1769324, 720896, 1, -1769323, 720896, 1, -1769322, 720896, 1, -1769321, 720896, 1, -1769320, 720896, 1, -1703784, 720896, 1, -1638248, 720896, 1, -1572712, 720896, 1, -1507176, 720896, 1, -1441640, 720896, 1, -1376104, 720896, 1, -1310568, 720896, 1, -1245032, 720896, 1, -1179496, 720896, 1, -1113960, 720896, 1, -1048424, 720896, 1, -982888, 720896, 1, -1769334, 327680, 1, -1769333, 327680, 1, -1769332, 720896, 1, -1769331, 720896, 1, -458615, 327680, 1, -458614, 327680, 1, -458613, 327680, 1, -458612, 327680, 1, -458611, 327680, 1, -458610, 327680, 1, -458609, 327680, 1, -458608, 327680, 1, -458607, 327680, 1, -458606, 327680, 1, -458605, 327680, 1, -458604, 327680, 1, -458603, 327680, 1, -458602, 327680, 1, -458601, 327680, 1, 122, 196608, 3, 123, 196608, 3, 124, 196608, 3, 125, 327680, 3, 126, 327680, 3, 127, 327680, 3, 128, 327680, 3, 129, 327680, 3, 130, 327680, 3, 131, 327680, 3, 132, 327680, 3, -458625, 196608, 1, -655214, 458752, 1, -655213, 196608, 1, -655212, 65536, 1, -655211, 65536, 1, -655210, 458752, 1, -655209, 327680, 1, -589692, 196608, 1, -589691, 196608, 1, -589690, 327680, 1, -589689, 458752, 1, -589684, 65536, 1, -589683, 196608, 1, -589682, 196608, 1, -589681, 327680, 1, -589680, 65536, 1, -589679, 458752, 1, -589678, 196608, 1, -589677, 458752, 1, -589676, 65536, 1, -589675, 65536, 1, -589674, 458752, 1, -589673, 327680, 1, -524156, 65536, 1, -524155, 327680, 1, -524154, 458752, 1, -524153, 458752, 1, -524152, 327680, 1, -524149, 458752, 1, -524148, 196608, 1, -524147, 196608, 1, -524146, 196608, 1, -524145, 458752, 1, -524144, 458752, 1, -524143, 196608, 1, -524142, 458752, 1, -524141, 65536, 1, -524140, 65536, 1, -524139, 458752, 1, -524138, 327680, 1, -524137, 65536, 1, -393089, 65536, 1, -393088, 196608, 1, -393087, 458752, 1, -393086, 458752, 1, -393085, 327680, 1, -393084, 458752, 1, -393083, 458752, 1, -393082, 65536, 1, -393081, 458752, 1, -393080, 458752, 1, -393079, 327680, 1, -393078, 65536, 1, -393077, 327680, 1, -393076, 458752, 1, -393075, 458752, 1, -393074, 196608, 1, -393073, 196608, 1, -393072, 65536, 1, -393071, 458752, 1, -393070, 65536, 1, -393069, 65536, 1, -393068, 327680, 1, -393067, 196608, 1, -393066, 65536, 1, -393065, 65536, 1, -393064, 458752, 1, -327553, 327680, 3, -327552, 327680, 3, -327551, 327680, 3, -327550, 327680, 3, -327549, 327680, 3, -458634, 196608, 1, -458633, 196608, 1, -458632, 196608, 1, -458631, 196608, 1, -393098, 196608, 1, -393097, 196608, 1, -393096, 196608, 1, -393095, 196608, 1, -458623, 196608, 1, -458624, 196608, 1, -1769354, 327680, 1, -1769353, 327680, 1, -1769352, 327680, 1, -1769351, 327680, 1, -1769350, 327680, 1, -1769349, 327680, 1, -1769348, 327680, 1, -1769347, 327680, 1, -1769346, 327680, 1, -1769345, 327680, 1, -1769344, 327680, 1, -1769343, 327680, 1, -1769342, 327680, 1, -1769341, 327680, 1, -1769340, 327680, 1, -1769339, 327680, 1, -1769338, 327680, 1, -1769337, 327680, 1, -1769336, 327680, 1, -1769361, 327680, 1, -1769360, 327680, 1, -1769359, 327680, 1, -1769358, 327680, 1, -1769357, 327680, 1, -1769356, 327680, 1, -1769355, 327680, 1, -1769362, 327680, 1, -1769363, 327680, 1, -1769364, 327680, 1, -1769365, 327680, 1, -1769366, 327680, 1, -1769367, 327680, 1, -1769368, 327680, 1, -1769369, 327680, 1, -1769370, 327680, 1, -1769371, 327680, 1, -1769372, 327680, 1, -1769373, 327680, 1, -1769374, 327680, 1, -1769375, 327680, 1, -1769376, 327680, 1, -1769377, 327680, 1, -1769384, 327680, 1, -1769385, 327680, 1, -1769386, 327680, 1, -1769387, 327680, 1, -1769388, 327680, 1, -1769436, 327680, 1, -1769435, 327680, 1, -1769434, 327680, 1, -1769433, 327680, 1, -1769432, 327680, 1, -1769431, 327680, 1, -1769430, 327680, 1, -1769429, 327680, 1, -1769428, 327680, 1, -1769427, 327680, 1, -1769426, 327680, 1, -1769425, 327680, 1, -1769424, 327680, 1, -1769423, 327680, 1, -1769422, 327680, 1, -1769421, 327680, 1, -1769420, 327680, 1, -1769419, 327680, 1, -1769418, 327680, 1, -1769417, 327680, 1, -1769416, 327680, 1, -1769415, 327680, 1, -1769414, 327680, 1, -1769413, 327680, 1, -1769412, 327680, 1, -1769411, 327680, 1, -1769410, 327680, 1, -1769409, 327680, 1, -1769408, 327680, 1, -1769407, 327680, 1, -1769406, 327680, 1, -1769405, 327680, 1, -1769404, 327680, 1, -1769403, 327680, 1, -1769402, 327680, 1, -1769401, 327680, 1, -1769400, 327680, 1, -1769399, 327680, 1, -1769398, 327680, 1, -1769397, 327680, 1, -1769396, 327680, 1, -1769395, 327680, 1, -1769394, 327680, 1, -1769393, 327680, 1, -1769392, 327680, 1, -1769391, 327680, 1, -1769390, 327680, 1, -1769389, 327680, 1, -1703937, 327680, 1, -1769472, 327680, 1, -1769471, 327680, 1, -1769470, 327680, 1, -1769469, 327680, 1, -1769468, 327680, 1, -1769467, 327680, 1, -1769466, 327680, 1, -1769465, 327680, 1, -1769464, 327680, 1, -1769463, 327680, 1, -1769462, 327680, 1, -1769461, 327680, 1, -1769460, 327680, 1, -1769459, 327680, 1, -1769458, 327680, 1, -1769457, 327680, 1, -1769456, 327680, 1, -1769455, 327680, 1, -1769454, 327680, 1, -1769453, 327680, 1, -1769452, 327680, 1, -1769451, 327680, 1, -1769450, 327680, 1, -1769449, 327680, 1, -1769448, 327680, 1, -1769447, 327680, 1, -1769446, 327680, 1, -1769445, 327680, 1, -1769444, 327680, 1, -1769443, 327680, 1, -1769442, 327680, 1, -1769441, 327680, 1, -1769440, 327680, 1, -1769439, 327680, 1, -1769438, 327680, 1, -1769437, 327680, 1, -917379, 327680, 1, -917378, 327680, 1, -982914, 327680, 1, -1441674, 327680, 1, -1441673, 327680, 1, -1441672, 327680, 1, -1441671, 327680, 1, -1441665, 327680, 1, -1441664, 327680, 1, -1441663, 327680, 1, -1179530, 327680, 1, -1179529, 327680, 1, -1245065, 327680, 1, -1245064, 327680, 1, -1310599, 327680, 1, -1376135, 327680, 1, -1376136, 327680, 1, -1376137, 327680, 1, -1376138, 327680, 1, -1310602, 327680, 1, -1245066, 327680, 1, -1310601, 327680, 1, -1310600, 327680, 1, -1441662, 327680, 1, -1441661, 327680, 1, -1441660, 327680, 1, -1441659, 327680, 1, -1376129, 327680, 1, -1376128, 327680, 1, -1376127, 327680, 1, -1376126, 327680, 1, -1376125, 327680, 1, -1376124, 327680, 1, -1376123, 327680, 1, -1376122, 327680, 1, -1441658, 327680, 1, -1310585, 327680, 1, -1376121, 327680, 1, -1376120, 327680, 1, -1048436, 327680, 1, -1048435, 327680, 1, -1048432, 327680, 1, -1048433, 327680, 1, -1048434, 327680, 1, -720748, 327680, 1, -786283, 327680, 1, -851818, 327680, 1, -851817, 327680, 1, -786281, 327680, 1, -720745, 327680, 1, -720746, 327680, 1, -720747, 327680, 1, -786282, 327680, 1, -1703788, 458752, 1, -1638252, 458752, 1, -1572716, 458752, 1, -1507180, 458752, 1, -1441644, 458752, 1, -1376108, 458752, 1, -1310572, 458752, 1, -1245036, 458752, 1, -1245049, 327680, 1, -1310586, 327680, 1, -1179513, 327680, 1, -1245050, 327680, 1, -1310587, 327680, 1, -1376117, 327680, 1, -1441653, 327680, 1, -1441654, 327680, 1, -1441655, 327680, 1, -1441656, 327680, 1, -1441657, 327680, 1, -1376118, 327680, 1, -1376119, 327680, 1, -1441652, 327680, 1, -1376116, 327680, 1, -1310580, 327680, 1, -1245044, 327680, 1, -1179508, 327680, 1, -1113972, 327680, 1, -1245037, 458752, 1, -1310573, 458752, 1, -1376109, 458752, 1, -1441645, 458752, 1, -1507181, 458752, 1, -1572717, 458752, 1, -1638253, 458752, 1, -1703789, 458752, 1, -1245038, 458752, 1, -1310574, 458752, 1, -1376110, 458752, 1, -1441646, 458752, 1, -1507182, 458752, 1, -1572718, 458752, 1, -1638254, 458752, 1, -1703790, 458752, 1, -1703809, 327680, 1, -1703808, 327680, 1, -1703800, 327680, 1, -1703799, 327680, 1, -1703807, 327680, 1, -1703806, 327680, 1, -1703805, 327680, 1, -1703804, 327680, 1, -1703803, 327680, 1, -1703802, 327680, 1, -1703801, 327680, 1, -1441666, 327680, 1, -1441667, 327680, 1, -917410, 458752, 1, -917409, 458752, 1, -917408, 458752, 1, -917407, 327680, 1, -917406, 327680, 1, -1441691, 458752, 1, -1376155, 458752, 1, -1310619, 458752, 1, -1310618, 458752, 1, -1376154, 458752, 1, -1441690, 458752, 1, -720792, 327680, 1, -720791, 327680, 1, -720790, 327680, 1, -917415, 458752, 1, -851879, 458752, 1, -851870, 458752, 1, -851871, 458752, 1, -851877, 458752, 1, -851878, 458752, 1, -851872, 458752, 1, -851873, 458752, 1, -851874, 458752, 1, -851875, 458752, 1, -851876, 458752, 1, -720793, 327680, 1, -524195, 327680, 1, -524194, 327680, 1, -524193, 327680, 1, -524192, 327680, 1, -524191, 327680, 1, -524196, 327680, 1, -982956, 327680, 1, -1048491, 327680, 1, -1441707, 196608, 1, -1441708, 196608, 1, -1441709, 196608, 1, -1441710, 196608, 1, -1638312, 458752, 1, -1703848, 458752, 1, -1703849, 458752, 1, -1114027, 327680, 1, -1179563, 327680, 1, -1245099, 327680, 1, -1245100, 327680, 1, -1179564, 327680, 1, -1114028, 327680, 1, -1048492, 327680, 1, -1703859, 458752, 1, -1638323, 458752, 1, -1572787, 458752, 1, -1507251, 458752, 1, -1507250, 458752, 1, -1310635, 327680, 1, -1376171, 327680, 1, -1376172, 327680, 1, -1310636, 327680, 1, -1376174, 327680, 1, -1310637, 327680, 1, -1245101, 327680, 1, -1376173, 327680, 1, -1179565, 327680, 1, -1114029, 327680, 1, -1048494, 327680, 1, -1048493, 327680, 1, -917445, 327680, 1, -982981, 327680, 1, -1048517, 327680, 1, -1114053, 327680, 1, -1179589, 327680, 1, -1310661, 327680, 1, -1376197, 327680, 1, -1245125, 327680, 1, -1376206, 327680, 1, -1310670, 327680, 1, -1245134, 327680, 1, -1179598, 327680, 1, -1114062, 327680, 1, -1048526, 327680, 1, -982990, 327680, 1, -917454, 327680, 1, -786383, 458752, 1, -786382, 458752, 1, -851919, 196608, 1, -851918, 196608, 1, -851910, 196608, 1, -851909, 196608, 1, -786374, 458752, 1, -786373, 458752, 1, -917464, 196608, 1, -851928, 196608, 1, -786392, 458752, 1, -720856, 196608, 1, -655320, 327680, 1, -589784, 196608, 1, -524248, 327680, 1, -524249, 196608, 1, -524250, 458752, 1, -524251, 458752, 1, -524252, 196608, 1, -524253, 458752, 1, -524254, 65536, 1, -524255, 327680, 1, -589791, 327680, 1, -589790, 196608, 1, -589789, 65536, 1, -589788, 65536, 1, -589787, 458752, 1, -589786, 327680, 1, -589785, 589824, 1, -655321, 327680, 1, -720857, 65536, 1, -786393, 65536, 1, -851929, 327680, 1, -917465, 458752, 1, -917466, 458752, 1, -917467, 589824, 1, -917468, 458752, 1, -917469, 589824, 1, -917470, 327680, 1, -917471, 458752, 1, -851935, 327680, 1, -786399, 327680, 1, -720863, 327680, 1, -655327, 327680, 1, -655326, 458752, 1, -655325, 589824, 1, -655324, 327680, 1, -655323, 589824, 1, -655322, 327680, 1, -720858, 458752, 1, -786394, 196608, 1, -851930, 589824, 1, -851931, 458752, 1, -851932, 196608, 1, -851933, 327680, 1, -851934, 589824, 1, -786398, 458752, 1, -720862, 196608, 1, -720861, 65536, 1, -720860, 65536, 1, -720859, 65536, 1, -786395, 458752, 1, -786396, 327680, 1, -786397, 196608, 1, -917435, 458752, 1, -917434, 196608, 1, -917433, 458752, 1, -851897, 589824, 1, -851898, 458752, 1, -851899, 65536, 1, -786363, 589824, 1, -720827, 196608, 1, -655291, 589824, 1, -589755, 458752, 1, -524219, 327680, 1, -458683, 196608, 1, -393147, 196608, 1, -393146, 196608, 1, -393145, 196608, 1, -393144, 589824, 1, -393143, 589824, 1, -393142, 196608, 1, -458678, 589824, 1, -458679, 196608, 1, -458680, 458752, 1, -458681, 458752, 1, -458682, 196608, 1, -524218, 196608, 1, -524217, 458752, 1, -524216, 196608, 1, -524215, 589824, 1, -524214, 65536, 1, -589750, 458752, 1, -589751, 65536, 1, -589752, 196608, 1, -589753, 327680, 1, -589754, 196608, 1, -655290, 327680, 1, -655289, 458752, 1, -655288, 327680, 1, -655287, 196608, 1, -655286, 589824, 1, -720822, 65536, 1, -720823, 327680, 1, -720824, 458752, 1, -720825, 65536, 1, -720826, 589824, 1, -786362, 458752, 1, -786361, 458752, 1, -786360, 196608, 1, -786359, 589824, 1, -851895, 196608, 1, -851894, 589824, 1, -917430, 196608, 1, -917431, 458752, 1, -917432, 65536, 1, -851896, 458752, 1, -786358, 458752, 1, -393176, 65536, 1, -458712, 65536, 1, -458713, 458752, 1, -393177, 589824, 1, -393178, 458752, 1, -393179, 196608, 1, -393180, 327680, 1, -393181, 589824, 1, -393182, 589824, 1, -393183, 196608, 1, -393184, 589824, 1, -393185, 196608, 1, -393186, 196608, 1, -393187, 458752, 1, -393188, 327680, 1, -393189, 589824, 1, -393190, 327680, 1, -393191, 65536, 1, -393192, 65536, 1, -393193, 589824, 1, -393194, 458752, 1, -393195, 327680, 1, -393196, 327680, 1, -393197, 196608, 1, -393198, 65536, 1, -458734, 196608, 1, -458733, 196608, 1, -458732, 65536, 1, -458729, 458752, 1, -458728, 589824, 1, -458727, 196608, 1, -458726, 589824, 1, -458725, 65536, 1, -458724, 589824, 1, -458723, 196608, 1, -458722, 458752, 1, -458721, 327680, 1, -458720, 327680, 1, -458719, 65536, 1, -458718, 589824, 1, -458717, 589824, 1, -458716, 589824, 1, -458715, 196608, 1, -458714, 65536, 1, -458749, 196608, 1, -393213, 196608, 1, -327677, 196608, 1, -262141, 196608, 1, -196605, 196608, 1, -131069, 196608, 1, -65533, 196608, 1, 3, 196608, 1, 65539, 196608, 1, 131075, 196608, 1, 196611, 196608, 1, 262147, 196608, 1, 327683, 196608, 1, 393219, 196608, 1, 458755, 196608, 1, 524291, 196608, 1, 589827, 196608, 1, 655363, 196608, 1, 720899, 196608, 1, 786435, 196608, 1, 851971, 196608, 1, 917507, 196608, 1, 983043, 196608, 1, 983044, 196608, 1, 983045, 196608, 1, 983046, 196608, 1, 917511, 196608, 1, 917510, 196608, 1, 917509, 196608, 1, 917508, 196608, 1, 917512, 196608, 1, 917513, 196608, 1, 917514, 196608, 1, 917515, 196608, 1, 917516, 196608, 1, 917517, 196608, 1, 917518, 196608, 1, 917519, 196608, 1, 917520, 65536, 1, 851984, 458752, 1, 851983, 196608, 1, 786447, 196608, 1, 786446, 196608, 1, 786445, 196608, 1, 786444, 196608, 1, 786443, 196608, 1, 786442, 196608, 1, 851978, 196608, 1, 851977, 196608, 1, 851976, 196608, 1, 851975, 196608, 1, 851974, 196608, 1, 851973, 196608, 1, 851972, 196608, 1, 851979, 196608, 1, 851980, 196608, 1, 851981, 196608, 1, 851982, 196608, 1, 786448, 65536, 1, 720912, 458752, 1, 720911, 196608, 1, 655375, 196608, 1, 589839, 196608, 1, 524303, 196608, 1, 458767, 196608, 1, 393231, 196608, 1, 327695, 196608, 1, 262159, 196608, 1, 196623, 196608, 1, 196622, 196608, 1, 131086, 196608, 1, 65550, 196608, 1, 14, 196608, 1, -65522, 196608, 1, -131058, 196608, 1, -196594, 196608, 1, -262131, 196608, 1, -327667, 196608, 1, -393203, 196608, 1, -458739, 196608, 1, -458740, 196608, 1, -458741, 196608, 1, -458742, 196608, 1, -458743, 196608, 1, -458744, 196608, 1, -458745, 196608, 1, -458746, 196608, 1, -458747, 196608, 1, -458748, 196608, 1, -393212, 196608, 1, -327676, 196608, 1, -262140, 196608, 1, -196604, 196608, 1, -196603, 196608, 1, -196602, 196608, 1, -262138, 196608, 1, -131066, 196608, 1, -131065, 196608, 1, -196601, 196608, 1, -196600, 196608, 1, -131064, 196608, 1, -65528, 196608, 1, -131063, 196608, 1, -131068, 196608, 1, -65532, 196608, 1, 4, 196608, 1, 65540, 196608, 1, 131076, 196608, 1, 196612, 196608, 1, 262148, 196608, 1, 327684, 196608, 1, 393220, 196608, 1, 458756, 196608, 1, 524292, 196608, 1, 589828, 196608, 1, 655364, 196608, 1, 720900, 196608, 1, 786436, 196608, 1, -393211, 196608, 1, -327675, 196608, 1, -262139, 196608, 1, -131067, 196608, 1, -65531, 196608, 1, 5, 196608, 1, 65541, 196608, 1, 131077, 196608, 1, 196613, 196608, 1, 262149, 196608, 1, 327685, 196608, 1, 393221, 196608, 1, 458757, 196608, 1, 524293, 196608, 1, 589829, 196608, 1, 655365, 196608, 1, 720901, 196608, 1, 786437, 196608, 1, -393210, 196608, 1, -327674, 196608, 1, -65530, 196608, 1, 6, 196608, 1, 65542, 196608, 1, 131078, 196608, 1, 196614, 196608, 1, 262150, 196608, 1, 327686, 196608, 1, 393222, 196608, 1, 458758, 196608, 1, 524294, 196608, 1, 589830, 196608, 1, 655366, 196608, 1, 720902, 196608, 1, 786438, 196608, 1, -393209, 196608, 1, -327673, 196608, 1, -262137, 196608, 1, -65529, 196608, 1, 7, 196608, 1, 65543, 196608, 1, 131079, 196608, 1, 196615, 196608, 1, 262151, 196608, 1, 327687, 196608, 1, 393223, 196608, 1, 458759, 196608, 1, 524295, 196608, 1, 589831, 196608, 1, 655367, 196608, 1, 720903, 196608, 1, 786439, 196608, 1, -393208, 196608, 1, -327672, 196608, 1, -262136, 196608, 1, 8, 196608, 1, 65544, 196608, 1, 131080, 196608, 1, 196616, 196608, 1, 262152, 196608, 1, 327688, 196608, 1, 393224, 196608, 1, 458760, 196608, 1, 524296, 196608, 1, 589832, 196608, 1, 655368, 196608, 1, 720904, 196608, 1, 786440, 196608, 1, -393207, 196608, 1, -327671, 196608, 1, -262135, 196608, 1, -196599, 196608, 1, -65527, 196608, 1, 9, 196608, 1, 65545, 196608, 1, 131081, 196608, 1, 196617, 196608, 1, 262153, 196608, 1, 327689, 196608, 1, 393225, 196608, 1, 458761, 196608, 1, 524297, 196608, 1, 589833, 196608, 1, 655369, 196608, 1, 720905, 196608, 1, 786441, 196608, 1, -393206, 196608, 1, -327670, 196608, 1, -262134, 196608, 1, -196598, 196608, 1, -131062, 196608, 1, -65526, 196608, 1, 10, 196608, 1, 65546, 196608, 1, 131082, 196608, 1, 196618, 196608, 1, 262154, 196608, 1, 327690, 196608, 1, 393226, 196608, 1, 458762, 196608, 1, 524298, 196608, 1, 589834, 196608, 1, 655370, 196608, 1, 720906, 196608, 1, -393205, 196608, 1, -327669, 196608, 1, -262133, 196608, 1, -196597, 196608, 1, -131061, 196608, 1, -65525, 196608, 1, 11, 196608, 1, 65547, 196608, 1, 131083, 196608, 1, 196619, 196608, 1, 262155, 196608, 1, 327691, 196608, 1, 393227, 196608, 1, 458763, 196608, 1, 524299, 196608, 1, 589835, 196608, 1, 655371, 196608, 1, 720907, 196608, 1, -393204, 196608, 1, -327668, 196608, 1, -262132, 196608, 1, -196596, 196608, 1, -131060, 196608, 1, -65524, 196608, 1, 12, 196608, 1, 65548, 196608, 1, 131084, 196608, 1, 196620, 196608, 1, 262156, 196608, 1, 327692, 196608, 1, 393228, 196608, 1, 458764, 196608, 1, 524300, 196608, 1, 589836, 196608, 1, 655372, 196608, 1, 720908, 196608, 1, -196595, 196608, 1, -131059, 196608, 1, -65523, 196608, 1, 13, 196608, 1, 65549, 196608, 1, 131085, 196608, 1, 196621, 196608, 1, 262157, 196608, 1, 327693, 196608, 1, 393229, 196608, 1, 458765, 196608, 1, 524301, 196608, 1, 589837, 196608, 1, 655373, 196608, 1, 720909, 196608, 1, -458738, 196608, 1, -393202, 196608, 1, -327666, 196608, 1, -262130, 196608, 1, 262158, 196608, 1, 327694, 196608, 1, 393230, 196608, 1, 458766, 196608, 1, 524302, 196608, 1, 589838, 196608, 1, 655374, 196608, 1, 720910, 196608, 1, -458737, 196608, 1, -393201, 196608, 1, -327665, 196608, 1, -262129, 196608, 1, -196593, 196608, 1, -131057, 196608, 1, -65521, 196608, 1, 15, 196608, 1, 65551, 196608, 1, 131087, 196608, 1, -458736, 196608, 1, -393200, 196608, 1, -327664, 65536, 1, -262128, 65536, 1, -196592, 65536, 1, -131056, 458752, 1, -65520, 196608, 1, 16, 589824, 1, 65552, 327680, 1, 131088, 458752, 1, 196624, 458752, 1, 262160, 458752, 1, 327696, 458752, 1, 393232, 327680, 1, 458768, 196608, 1, 524304, 196608, 1, 589840, 589824, 1, 655376, 327680, 1, -458751, 327680, 1, -458750, 327680, 1, -327662, 327680, 1, -262126, 589824, 1, -196590, 589824, 1, -131054, 196608, 1, -65518, 327680, 1, 18, 65536, 1, 65554, 458752, 1, 131090, 196608, 1, 196626, 458752, 1, 262162, 327680, 1, 327698, 458752, 1, 393234, 589824, 1, 458770, 589824, 1, 524306, 458752, 1, 589842, 196608, 1, 655378, 196608, 1, 720914, 589824, 1, 786450, 589824, 1, 851986, 65536, 1, 917522, 458752, 1, -327661, 196608, 1, -262125, 458752, 1, -196589, 458752, 1, -131053, 327680, 1, -65517, 196608, 1, 19, 196608, 1, 65555, 589824, 1, 131091, 65536, 1, 196627, 458752, 1, 262163, 196608, 1, 327699, 458752, 1, 393235, 589824, 1, 458771, 458752, 1, 524307, 327680, 1, 589843, 327680, 1, 655379, 327680, 1, 720915, 196608, 1, 786451, 65536, 1, 851987, 589824, 1, 917523, 196608, 1, -327660, 196608, 1, -262124, 327680, 1, -196588, 327680, 1, -131052, 327680, 1, -65516, 196608, 1, 20, 458752, 1, 65556, 589824, 1, 131092, 65536, 1, 196628, 65536, 1, 262164, 65536, 1, 327700, 65536, 1, 393236, 327680, 1, 458772, 458752, 1, 524308, 196608, 1, 589844, 589824, 1, 655380, 458752, 1, 720916, 327680, 1, 786452, 458752, 1, 851988, 589824, 1, 917524, 458752, 1, -327659, 65536, 1, -262123, 196608, 1, -196587, 458752, 1, -131051, 327680, 1, -65515, 458752, 1, 21, 458752, 1, 65557, 65536, 1, 131093, 589824, 1, 196629, 196608, 1, 262165, 65536, 1, 327701, 589824, 1, 393237, 589824, 1, 458773, 458752, 1, 524309, 65536, 1, 589845, 196608, 1, 655381, 327680, 1, 720917, 327680, 1, 786453, 458752, 1, 851989, 65536, 1, 917525, 589824, 1, -327658, 589824, 1, -262122, 589824, 1, -196586, 458752, 1, -131050, 65536, 1, -65514, 65536, 1, 22, 458752, 1, 65558, 327680, 1, 131094, 458752, 1, 196630, 196608, 1, 262166, 458752, 1, 327702, 65536, 1, 393238, 327680, 1, 458774, 196608, 1, 524310, 589824, 1, 589846, 65536, 1, 655382, 458752, 1, 720918, 65536, 1, 786454, 65536, 1, 851990, 196608, 1, 917526, 196608, 1, -327657, 458752, 1, -262121, 196608, 1, -196585, 196608, 1, -131049, 327680, 1, -65513, 589824, 1, 23, 65536, 1, 65559, 196608, 1, 131095, 196608, 1, 196631, 458752, 1, 262167, 589824, 1, 327703, 196608, 1, 393239, 589824, 1, 458775, 327680, 1, 524311, 589824, 1, 589847, 196608, 1, 655383, 458752, 1, 720919, 589824, 1, 786455, 458752, 1, 851991, 458752, 1, 917527, 589824, 1, -327656, 327680, 1, -262120, 458752, 1, -196584, 327680, 1, -131048, 327680, 1, -65512, 327680, 1, 24, 589824, 1, 65560, 458752, 1, 131096, 196608, 1, 196632, 196608, 1, 262168, 589824, 1, 327704, 589824, 1, 393240, 196608, 1, 458776, 327680, 1, 524312, 196608, 1, 589848, 589824, 1, 655384, 458752, 1, 720920, 196608, 1, 786456, 65536, 1, 851992, 196608, 1, 917528, 458752, 1, -327655, 65536, 1, -262119, 458752, 1, -196583, 589824, 1, -131047, 327680, 1, -65511, 458752, 1, 25, 458752, 1, 65561, 458752, 1, 131097, 196608, 1, 196633, 65536, 1, 262169, 458752, 1, 327705, 458752, 1, 393241, 458752, 1, 458777, 65536, 1, 524313, 458752, 1, 589849, 327680, 1, 655385, 65536, 1, 720921, 589824, 1, 786457, 65536, 1, 851993, 327680, 1, 917529, 327680, 1, -327654, 589824, 1, -262118, 458752, 1, -196582, 327680, 1, -131046, 65536, 1, -65510, 65536, 1, 26, 327680, 1, 65562, 196608, 1, 131098, 327680, 1, 196634, 458752, 1, 262170, 196608, 1, 327706, 65536, 1, 393242, 327680, 1, 458778, 327680, 1, 524314, 65536, 1, 589850, 589824, 1, 655386, 589824, 1, 720922, 196608, 1, 786458, 589824, 1, 851994, 65536, 1, 917530, 327680, 1, -327653, 327680, 1, -262117, 458752, 1, -196581, 327680, 1, -131045, 327680, 1, -65509, 65536, 1, 27, 196608, 1, 65563, 65536, 1, 131099, 196608, 1, 196635, 589824, 1, 262171, 327680, 1, 327707, 327680, 1, 393243, 65536, 1, 458779, 65536, 1, 524315, 589824, 1, 589851, 196608, 1, 655387, 327680, 1, 720923, 458752, 1, 786459, 65536, 1, 851995, 589824, 1, 917531, 327680, 1, -327652, 589824, 1, -262116, 589824, 1, -196580, 458752, 1, -131044, 327680, 1, -65508, 589824, 1, 28, 458752, 1, 65564, 458752, 1, 131100, 327680, 1, 196636, 589824, 1, 262172, 458752, 1, 327708, 589824, 1, 393244, 327680, 1, 458780, 327680, 1, 524316, 327680, 1, 589852, 65536, 1, 655388, 589824, 1, 720924, 589824, 1, 786460, 327680, 1, 851996, 589824, 1, 917532, 65536, 1, -327651, 327680, 1, -262115, 196608, 1, -196579, 327680, 1, -131043, 196608, 1, -65507, 589824, 1, 29, 65536, 1, 65565, 65536, 1, 131101, 196608, 1, 196637, 65536, 1, 262173, 589824, 1, 327709, 196608, 1, 393245, 65536, 1, 458781, 458752, 1, 524317, 458752, 1, 589853, 589824, 1, 655389, 65536, 1, 720925, 65536, 1, 786461, 65536, 1, 851997, 458752, 1, 917533, 196608, 1, -327650, 327680, 1, -262114, 65536, 1, -196578, 196608, 1, -131042, 65536, 1, -65506, 65536, 1, 30, 65536, 1, 65566, 65536, 1, 131102, 196608, 1, 196638, 327680, 1, 262174, 589824, 1, 327710, 458752, 1, 393246, 65536, 1, 458782, 196608, 1, 524318, 589824, 1, 589854, 327680, 1, 655390, 327680, 1, 720926, 327680, 1, 786462, 458752, 1, 851998, 589824, 1, 917534, 327680, 1, -327649, 589824, 1, -262113, 458752, 1, -196577, 196608, 1, -131041, 327680, 1, -65505, 65536, 1, 31, 65536, 1, 65567, 458752, 1, 131103, 65536, 1, 196639, 589824, 1, 262175, 458752, 1, 327711, 65536, 1, 393247, 589824, 1, 458783, 327680, 1, 524319, 458752, 1, 589855, 327680, 1, 655391, 65536, 1, 720927, 589824, 1, 786463, 458752, 1, 851999, 458752, 1, 917535, 327680, 1, -327648, 196608, 1, -262112, 589824, 1, -196576, 327680, 1, -131040, 65536, 1, -65504, 65536, 1, 32, 458752, 1, 65568, 65536, 1, 131104, 65536, 1, 196640, 196608, 1, 262176, 65536, 1, 327712, 589824, 1, 393248, 196608, 1, 458784, 458752, 1, 524320, 458752, 1, 589856, 65536, 1, 655392, 65536, 1, 720928, 196608, 1, 786464, 458752, 1, 852000, 65536, 1, 917536, 327680, 1, -327647, 65536, 1, -262111, 196608, 1, -196575, 458752, 1, -131039, 327680, 1, -65503, 65536, 1, 33, 589824, 1, 65569, 65536, 1, 131105, 196608, 1, 196641, 327680, 1, 262177, 327680, 1, 327713, 458752, 1, 393249, 65536, 1, 458785, 65536, 1, 524321, 327680, 1, 589857, 65536, 1, 655393, 327680, 1, 720929, 458752, 1, 786465, 327680, 1, 852001, 327680, 1, 917537, 196608, 1, -327646, 196608, 1, -262110, 327680, 1, -196574, 196608, 1, -131038, 196608, 1, -65502, 589824, 1, 34, 458752, 1, 65570, 327680, 1, 131106, 458752, 1, 196642, 327680, 1, 262178, 458752, 1, 327714, 458752, 1, 393250, 65536, 1, 458786, 196608, 1, 524322, 65536, 1, 589858, 65536, 1, 655394, 458752, 1, 720930, 589824, 1, 786466, 458752, 1, 852002, 196608, 1, 917538, 589824, 1, -327645, 65536, 1, -262109, 327680, 1, -196573, 458752, 1, -131037, 589824, 1, -65501, 458752, 1, 35, 65536, 1, 65571, 589824, 1, 131107, 458752, 1, 196643, 196608, 1, 262179, 589824, 1, 327715, 65536, 1, 393251, 458752, 1, 458787, 65536, 1, 524323, 589824, 1, 589859, 589824, 1, 655395, 458752, 1, 720931, 65536, 1, 786467, 589824, 1, 852003, 196608, 1, 917539, 65536, 1, -327644, 65536, 1, -262108, 458752, 1, -196572, 589824, 1, -131036, 589824, 1, -65500, 458752, 1, 36, 589824, 1, 65572, 196608, 1, 131108, 65536, 1, 196644, 458752, 1, 262180, 327680, 1, 327716, 458752, 1, 393252, 589824, 1, 458788, 196608, 1, 524324, 458752, 1, 589860, 196608, 1, 655396, 589824, 1, 720932, 196608, 1, 786468, 458752, 1, 852004, 589824, 1, 917540, 65536, 1, 1048579, 327680, 1, 1048580, 196608, 1, 1048581, 589824, 1, 1048582, 458752, 1, 1048583, 196608, 1, 1048584, 196608, 1, 1048585, 65536, 1, 1048586, 589824, 1, 1048587, 458752, 1, 1114115, 851968, 3, 1114116, 1114112, 3, 1114117, 1245184, 3, 1114118, 1245184, 3, 1114119, 983040, 3, 1114120, 851968, 3, 1114121, 851968, 3, 1114122, 1376256, 3, 1114123, 1245184, 3, 1114124, 1376256, 3, 1114125, 851968, 3, 1114126, 1376256, 3, 1114127, 1114112, 3, 1114128, 983040, 3, 1114129, 1245184, 3, 1114130, 1376256, 3, 1114131, 1114112, 3, 1114132, 1245184, 3, 1114133, 1245184, 3, 1114134, 1376256, 3, 1114135, 851968, 3, 1114136, 1245184, 3, 1114137, 1245184, 3, 1114138, 1245184, 3, 1114139, 851968, 3, 1114140, 1376256, 3, 1114141, 983040, 3, 1114142, 1245184, 3, 1114143, 851968, 3, 1114144, 1376256, 3, 1114145, 1245184, 3, 1114146, 983040, 3, 1114147, 1114112, 3, 1114148, 983040, 3, 1507326, 1245184, 1, 1507327, 1376256, 1, 1441792, 1376256, 1, 1441793, 851968, 1, 1441794, 983040, 1, 1441795, 1376256, 1, 1441796, 1245184, 1, 1441797, 1245184, 1, 1441798, 1114112, 1, 1441799, 1376256, 1, 1441800, 1245184, 1, 1441801, 1245184, 1, 1441802, 1245184, 1, 1441803, 1376256, 1, 1441804, 1376256, 1, 1441805, 1245184, 1, 2490366, 983040, 1, 2490367, 851968, 1, 2424832, 1376256, 1, 2424833, 1114112, 1, 2424834, 1114112, 1, 2424835, 851968, 1, 2424836, 851968, 1, -982909, 327680, 1, -1048446, 327680, 1, -1113977, 458752, 1, -1048441, 458752, 1, -982905, 458752, 1, -982895, 196608, 1, -982894, 196608, 1, -1310592, 327680, 1, -1310591, 327680, 1, -982915, 458752, 1, -851843, 458752, 1, -851842, 458752, 1, -786310, 327680, 1, -786309, 327680, 1, -786308, 327680, 1, -786307, 327680, 1, -786306, 327680, 1, -2, 327680, 1, -1, 327680, 1, -917373, 720896, 1, -851837, 720896, 1, -786301, 720896, 1, -720765, 720896, 1, -655229, 720896, 1, -589693, 65536, 1, -524157, 65536, 1, 2424901, 1245184, 1, 2424902, 1114112, 1, 2359367, 851968, 1, 2424903, 851968, 3, 2424904, 851968, 3, 2424905, 1245184, 3, 2359369, 1376256, 1, 2359368, 1114112, 1)

[node name="DashItemOrganizer" type="Node" parent="."]

[node name="Dash_Item" parent="DashItemOrganizer" instance=ExtResource("5_30eur")]
position = Vector2(1007, 58)

[node name="Dash_Item3" parent="DashItemOrganizer" instance=ExtResource("5_30eur")]
position = Vector2(731, -149)

[node name="Dash_Item5" parent="DashItemOrganizer" instance=ExtResource("5_30eur")]
position = Vector2(398, -97)

[node name="Dash_Item6" parent="DashItemOrganizer" instance=ExtResource("5_30eur")]
position = Vector2(476, -93)

[node name="Dash_Item7" parent="DashItemOrganizer" instance=ExtResource("5_30eur")]
position = Vector2(539, -97)

[node name="Dash_Item2" parent="DashItemOrganizer" instance=ExtResource("5_30eur")]
position = Vector2(1100, 125)

[node name="Dash_Item4" parent="DashItemOrganizer" instance=ExtResource("5_30eur")]
position = Vector2(1178, -51)

[node name="Dash_Item8" parent="DashItemOrganizer" instance=ExtResource("5_30eur")]
position = Vector2(227, -118)

[node name="Dash_Item9" parent="DashItemOrganizer" instance=ExtResource("5_30eur")]
position = Vector2(166, -118)

[node name="Dash_Item10" parent="DashItemOrganizer" instance=ExtResource("5_30eur")]
position = Vector2(119, -82)

[node name="Dash_Item11" parent="DashItemOrganizer" instance=ExtResource("5_30eur")]
position = Vector2(78, -83)

[node name="Dash_Item13" parent="DashItemOrganizer" instance=ExtResource("5_30eur")]
position = Vector2(1499, 66)

[node name="Dash_Item14" parent="DashItemOrganizer" instance=ExtResource("5_30eur")]
position = Vector2(1426, 46)

[node name="Dash_Item15" parent="DashItemOrganizer" instance=ExtResource("5_30eur")]
position = Vector2(1352, 141)

[node name="Dash_Item12" parent="DashItemOrganizer" instance=ExtResource("5_30eur")]
position = Vector2(119, -148)

[node name="Dash_Item16" parent="DashItemOrganizer" instance=ExtResource("5_30eur")]
position = Vector2(73, -148)

[node name="CheckpointOrganizer" type="Node" parent="."]

[node name="Checkpoint" parent="CheckpointOrganizer" instance=ExtResource("11_6ygw3")]
position = Vector2(362, 328)

[node name="Checkpoint2" parent="CheckpointOrganizer" instance=ExtResource("11_6ygw3")]
position = Vector2(687, 311)

[node name="Checkpoint3" parent="CheckpointOrganizer" instance=ExtResource("11_6ygw3")]
position = Vector2(1016, 279)

[node name="Checkpoint4" parent="CheckpointOrganizer" instance=ExtResource("11_6ygw3")]
position = Vector2(1339, 335)

[node name="Checkpoint5" parent="CheckpointOrganizer" instance=ExtResource("11_6ygw3")]
position = Vector2(1217, 151)

[node name="Checkpoint6" parent="CheckpointOrganizer" instance=ExtResource("11_6ygw3")]
position = Vector2(1071, -24)

[node name="Checkpoint7" parent="CheckpointOrganizer" instance=ExtResource("11_6ygw3")]
position = Vector2(873, -145)

[node name="Checkpoint8" parent="CheckpointOrganizer" instance=ExtResource("11_6ygw3")]
position = Vector2(605, -90)

[node name="Checkpoint9" parent="CheckpointOrganizer" instance=ExtResource("11_6ygw3")]
position = Vector2(279, -88)

[node name="Checkpoint10" parent="CheckpointOrganizer" instance=ExtResource("11_6ygw3")]
position = Vector2(1476, 151)

[node name="Checkpoint11" parent="CheckpointOrganizer" instance=ExtResource("11_6ygw3")]
position = Vector2(33, 24)

[node name="CollectiblesOrganizer" type="Node" parent="."]

[node name="CollectibleItemFish" parent="CollectiblesOrganizer" instance=ExtResource("13_fxs0t")]
position = Vector2(201, 238)

[node name="CollectibleItemFish2" parent="CollectiblesOrganizer" instance=ExtResource("13_fxs0t")]
position = Vector2(1338, 212)

[node name="CollectibleItemFish3" parent="CollectiblesOrganizer" instance=ExtResource("13_fxs0t")]
position = Vector2(475, -45)

[node name="CollectibleItemFish4" parent="CollectiblesOrganizer" instance=ExtResource("13_fxs0t")]
position = Vector2(1246, -155)

[node name="CollectibleItemFish5" parent="CollectiblesOrganizer" instance=ExtResource("13_fxs0t")]
position = Vector2(673, -155)

[node name="CollectibleItemFish6" parent="CollectiblesOrganizer" instance=ExtResource("13_fxs0t")]
position = Vector2(46, -145)

[node name="CollectibleItemFish7" parent="CollectiblesOrganizer" instance=ExtResource("13_fxs0t")]
position = Vector2(1144, -103)

[node name="PlatformOrganizer" type="Node" parent="."]

[node name="MovingPlatformVertical" parent="PlatformOrganizer" instance=ExtResource("13_2pxkb")]
position = Vector2(840, 247)
_ver_distance = 30

[node name="MovingPlatformHorizontal" parent="PlatformOrganizer" instance=ExtResource("12_ovsfh")]
position = Vector2(519, 344)
_hor_distance = 15

[node name="MovingPlatformHorizontal2" parent="PlatformOrganizer" instance=ExtResource("12_ovsfh")]
position = Vector2(799, -9)
_hor_distance = 35

[node name="WinArea" parent="." instance=ExtResource("12_jheam")]
position = Vector2(38, 289)

[node name="Player" parent="." instance=ExtResource("1_3gxat")]
z_index = 5
position = Vector2(86, 290)

[node name="Mola_Item" parent="." instance=ExtResource("14_lr5t7")]
position = Vector2(965, 100)

[node name="Mola_Item3" parent="." instance=ExtResource("14_lr5t7")]
position = Vector2(952, -60)

[node name="Mola_Item2" parent="." instance=ExtResource("14_lr5t7")]
position = Vector2(1001, -5)

[node name="Mola_Item4" parent="." instance=ExtResource("14_lr5t7")]
position = Vector2(947, -122)
rotation = 1.5708

[node name="Mola_Item5" parent="." instance=ExtResource("14_lr5t7")]
position = Vector2(1032, -148)
rotation = 3.14159

[node name="Mola_Item7" parent="." instance=ExtResource("14_lr5t7")]
position = Vector2(1064, -197)
rotation = 3.14159

[node name="HUD" parent="." instance=ExtResource("16_27150")]

[node name="CanvasLayer" type="CanvasLayer" parent="."]

[node name="PauseMenu" parent="CanvasLayer" instance=ExtResource("17_j4vpa")]
offset_left = 41.0
offset_top = 42.0
offset_right = 41.0
offset_bottom = 42.0
metadata/_edit_lock_ = true

[node name="Button" parent="." instance=ExtResource("20_o0tdg")]
position = Vector2(89, 171)

[node name="Gate" parent="." instance=ExtResource("21_gn21q")]
position = Vector2(39, 276)

[node name="Mola_Item8" parent="." instance=ExtResource("14_lr5t7")]
position = Vector2(1104, -60)

[connection signal="button_pressed" from="Button" to="Gate" method="_on_button_button_pressed"]

[editable path="TileMap"]
