[gd_scene load_steps=7 format=3 uid="uid://dpsvecyr2jvlx"]

[ext_resource type="PackedScene" uid="uid://heyeek2fm4rx" path="res://scenes/objects/wood_signal.tscn" id="1_ojsgj"]
[ext_resource type="Texture2D" uid="uid://bv66uytat1tv0" path="res://Sprites/Objetos/jump_higher_dialogue.png" id="2_3gtl3"]

[sub_resource type="Animation" id="Animation_5oww5"]
length = 0.001
tracks/0/type = "value"
tracks/0/imported = false
tracks/0/enabled = true
tracks/0/path = NodePath("JumpHigherBaloonMessage:scale")
tracks/0/interp = 1
tracks/0/loop_wrap = true
tracks/0/keys = {
"times": PackedFloat32Array(0),
"transitions": PackedFloat32Array(1),
"update": 0,
"values": [Vector2(1e-05, 1e-05)]
}

[sub_resource type="Animation" id="Animation_wyb2w"]
resource_name = "fade_in"
length = 0.3
tracks/0/type = "value"
tracks/0/imported = false
tracks/0/enabled = true
tracks/0/path = NodePath("JumpHigherBaloonMessage:scale")
tracks/0/interp = 1
tracks/0/loop_wrap = true
tracks/0/keys = {
"times": PackedFloat32Array(0, 0.3),
"transitions": PackedFloat32Array(1, 1),
"update": 0,
"values": [Vector2(1e-05, 1e-05), Vector2(1, 1)]
}

[sub_resource type="Animation" id="Animation_rcg7o"]
resource_name = "fade_out"
length = 0.3
tracks/0/type = "value"
tracks/0/imported = false
tracks/0/enabled = true
tracks/0/path = NodePath("JumpHigherBaloonMessage:scale")
tracks/0/interp = 1
tracks/0/loop_wrap = true
tracks/0/keys = {
"times": PackedFloat32Array(0, 0.3),
"transitions": PackedFloat32Array(1, 1),
"update": 0,
"values": [Vector2(1, 1), Vector2(0, 0)]
}

[sub_resource type="AnimationLibrary" id="AnimationLibrary_xi2uf"]
_data = {
"RESET": SubResource("Animation_5oww5"),
"fade_in": SubResource("Animation_wyb2w"),
"fade_out": SubResource("Animation_rcg7o")
}

[node name="WoodSignalJumpHigher" node_paths=PackedStringArray("_message_baloon", "_animation") instance=ExtResource("1_ojsgj")]
_message_baloon = NodePath("JumpHigherBaloonMessage")
_animation = NodePath("Animation")

[node name="Sprite2D" parent="." index="0"]
texture_filter = 1

[node name="JumpHigherBaloonMessage" type="Sprite2D" parent="." index="2"]
texture_filter = 1
position = Vector2(-2, -72)
scale = Vector2(1e-05, 1e-05)
texture = ExtResource("2_3gtl3")

[node name="Animation" parent="." index="3"]
libraries = {
"": SubResource("AnimationLibrary_xi2uf")
}
