[gd_scene load_steps=7 format=3 uid="uid://clx3os71q74o3"]

[ext_resource type="Script" path="res://scenes/objects/tutorial_jump.gd" id="1_47hpm"]
[ext_resource type="Texture2D" uid="uid://dwgdirk5lpk7c" path="res://Sprites/Objetos/jump_higher.png" id="2_ik7ia"]
[ext_resource type="Texture2D" uid="uid://clpxwx06aafc" path="res://Sprites/Luzes/circle.png" id="3_n6g52"]

[sub_resource type="RectangleShape2D" id="RectangleShape2D_skxrp"]
size = Vector2(24, 63)

[sub_resource type="OccluderPolygon2D" id="OccluderPolygon2D_6kmp4"]
polygon = PackedVector2Array(-28, 11, -23, 16, 2, 16, 21, 16, 25, 11, 18, 11, 4, 11, -6, 11, -19, 11)

[sub_resource type="OccluderPolygon2D" id="OccluderPolygon2D_f82mj"]
polygon = PackedVector2Array(-16, -84, -11, -84, -4, -84, 10, -84, 15, -84, 17, -82, 19, -82, 19, -80, 18, -80, 15, -80, 2, -80, -14, -80, -26, -80, -27, -81, -26, -83, -24, -83, -22, -84)

[node name="TutorialJump" type="Area2D"]
script = ExtResource("1_47hpm")

[node name="Sprite2D" type="Sprite2D" parent="."]
position = Vector2(-1, -23)
texture = ExtResource("2_ik7ia")

[node name="CollisionShape2D" type="CollisionShape2D" parent="."]
position = Vector2(0, 6)
shape = SubResource("RectangleShape2D_skxrp")

[node name="PointLight2D" type="PointLight2D" parent="."]
visible = false
position = Vector2(0, -51)
color = Color(0.996078, 1, 0.301961, 1)
energy = 6.0
shadow_enabled = true
texture = ExtResource("3_n6g52")
offset = Vector2(0, -200)

[node name="LightOccluder2D" type="LightOccluder2D" parent="."]
occluder = SubResource("OccluderPolygon2D_6kmp4")

[node name="LightOccluder2D2" type="LightOccluder2D" parent="."]
position = Vector2(2, 0)
occluder = SubResource("OccluderPolygon2D_f82mj")

[connection signal="body_entered" from="." to="." method="_on_body_entered"]
