[gd_scene load_steps=7 format=3 uid="uid://cujwp8shkxn3q"]

[ext_resource type="Script" path="res://scenes/objects/button.gd" id="1_k0yha"]
[ext_resource type="Texture2D" uid="uid://b18l6nwplt4rg" path="res://Sprites/Objetos/button_sheet.png" id="2_a56nr"]

[sub_resource type="AtlasTexture" id="AtlasTexture_ugcd6"]
atlas = ExtResource("2_a56nr")
region = Rect2(0, 1, 42, 26)

[sub_resource type="AtlasTexture" id="AtlasTexture_mhrky"]
atlas = ExtResource("2_a56nr")
region = Rect2(42, 1, 42, 26)

[sub_resource type="SpriteFrames" id="SpriteFrames_fquqb"]
animations = [{
"frames": [{
"duration": 1.0,
"texture": SubResource("AtlasTexture_ugcd6")
}, {
"duration": 1.0,
"texture": SubResource("AtlasTexture_mhrky")
}],
"loop": true,
"name": &"default",
"speed": 5.0
}]

[sub_resource type="RectangleShape2D" id="RectangleShape2D_ehtpj"]
size = Vector2(33, 19)

[node name="Button" type="Area2D" node_paths=PackedStringArray("_cur_sprite")]
scale = Vector2(0.5, 0.5)
script = ExtResource("1_k0yha")
_cur_sprite = NodePath("AnimatedSprite2D")

[node name="AnimatedSprite2D" type="AnimatedSprite2D" parent="."]
texture_filter = 1
sprite_frames = SubResource("SpriteFrames_fquqb")

[node name="CollisionShape2D" type="CollisionShape2D" parent="."]
shape = SubResource("RectangleShape2D_ehtpj")

[connection signal="body_entered" from="." to="." method="_on_body_entered"]
