[gd_scene load_steps=5 format=3 uid="uid://bboyvxn3vws7k"]

[ext_resource type="PackedScene" uid="uid://bjbm0x8bvs0rg" path="res://scenes/objects/moving_platform.tscn" id="1_h8mh7"]
[ext_resource type="Texture2D" uid="uid://cjhjbulnfpnl8" path="res://Sprites/Objetos/platform.png" id="2_33vps"]

[sub_resource type="RectangleShape2D" id="RectangleShape2D_tkhmv"]
size = Vector2(163, 13)

[sub_resource type="RectangleShape2D" id="RectangleShape2D_2eanc"]
size = Vector2(170, 14)

[node name="MovingPlatformVertical" instance=ExtResource("1_h8mh7")]
scale = Vector2(0.5, 0.5)
_platform_type = "Vertical"

[node name="Sprite2D" parent="." index="0"]
texture = ExtResource("2_33vps")

[node name="CollisionShape2D" parent="." index="1"]
visible = false
position = Vector2(1.5, -0.5)
shape = SubResource("RectangleShape2D_tkhmv")

[node name="CollisionShape2D" parent="DetectionArea" index="0"]
position = Vector2(3, -1)
shape = SubResource("RectangleShape2D_2eanc")
