[gd_scene load_steps=7 format=3 uid="uid://dqtce61fmi72s"]

[ext_resource type="PackedScene" uid="uid://heyeek2fm4rx" path="res://scenes/objects/wood_signal.tscn" id="1_e771y"]
[ext_resource type="Texture2D" uid="uid://bj3lcnw80mouh" path="res://Sprites/Objetos/spring_dialogue.png" id="2_qwnj4"]

[sub_resource type="Animation" id="Animation_an8wi"]
length = 0.001
tracks/0/type = "value"
tracks/0/imported = false
tracks/0/enabled = true
tracks/0/path = NodePath("Spring:scale")
tracks/0/interp = 1
tracks/0/loop_wrap = true
tracks/0/keys = {
"times": PackedFloat32Array(0),
"transitions": PackedFloat32Array(1),
"update": 0,
"values": [Vector2(1e-05, 1e-05)]
}

[sub_resource type="Animation" id="Animation_r27us"]
resource_name = "fade_in"
length = 0.3
tracks/0/type = "value"
tracks/0/imported = false
tracks/0/enabled = true
tracks/0/path = NodePath("Spring:scale")
tracks/0/interp = 1
tracks/0/loop_wrap = true
tracks/0/keys = {
"times": PackedFloat32Array(0, 0.3),
"transitions": PackedFloat32Array(1, 1),
"update": 0,
"values": [Vector2(1e-05, 1e-05), Vector2(1, 1)]
}

[sub_resource type="Animation" id="Animation_gsih5"]
resource_name = "fade_out"
length = 0.3
tracks/0/type = "value"
tracks/0/imported = false
tracks/0/enabled = true
tracks/0/path = NodePath("Spring:scale")
tracks/0/interp = 1
tracks/0/loop_wrap = true
tracks/0/keys = {
"times": PackedFloat32Array(0, 0.3),
"transitions": PackedFloat32Array(1, 1),
"update": 0,
"values": [Vector2(1, 1), Vector2(0, 0)]
}

[sub_resource type="AnimationLibrary" id="AnimationLibrary_8gmpk"]
_data = {
"RESET": SubResource("Animation_an8wi"),
"fade_in": SubResource("Animation_r27us"),
"fade_out": SubResource("Animation_gsih5")
}

[node name="WoodSignalSpring" node_paths=PackedStringArray("_message_baloon", "_animation") instance=ExtResource("1_e771y")]
_message_baloon = NodePath("Spring")
_animation = NodePath("Animation")

[node name="Sprite2D" parent="." index="0"]
texture_filter = 1

[node name="Spring" type="Sprite2D" parent="." index="2"]
texture_filter = 1
position = Vector2(0, -52)
scale = Vector2(1e-05, 1e-05)
texture = ExtResource("2_qwnj4")

[node name="Animation" parent="." index="3"]
libraries = {
"": SubResource("AnimationLibrary_8gmpk")
}
