[gd_scene load_steps=2 format=3 uid="uid://b0jfa4vkqycwv"]

[ext_resource type="Script" path="res://scenes/management/hud.gd" id="1_a7xtg"]

[node name="HUD" type="CanvasLayer" node_paths=PackedStringArray("_label_text")]
script = ExtResource("1_a7xtg")
_label_text = NodePath("Control/Label")

[node name="Control" type="Control" parent="."]
layout_mode = 3
anchors_preset = 15
anchor_right = 1.0
anchor_bottom = 1.0
grow_horizontal = 2
grow_vertical = 2

[node name="Label" type="Label" parent="Control"]
layout_mode = 1
anchors_preset = 1
anchor_left = 1.0
anchor_right = 1.0
offset_left = -152.0
offset_top = 30.0
offset_right = -26.0
offset_bottom = 75.0
grow_horizontal = 0
theme_override_font_sizes/font_size = 32
text = "00:00:00"
