; Engine configuration file.
; It's best edited using the editor UI and not directly,
; since the parameters that go here are not all obvious.
;
; Format:
;   [section] ; section goes between []
;   param=value ; assign values to parameters

config_version=5

[application]

config/name="The Tale of Princess"
run/main_scene="res://Modules/RoomTransition/TestStage/Stage.tscn"
config/features=PackedStringArray("4.0", "Forward Plus")
config/icon="res://Assets/HUD/Icon.png"
config/macos_native_icon="res://Assets/HUD/Icon.icns"
config/windows_native_icon="res://Assets/HUD/IconSmall.ico"

[display]

window/size/viewport_width=272
window/size/viewport_height=208
window/size/window_width_override=1088
window/size/window_height_override=832
window/stretch/mode="viewport"

[input]

dash={
"deadzone": 0.5,
"events": [Object(InputEventKey,"resource_local_to_scene":false,"resource_name":"","device":0,"window_id":0,"alt_pressed":false,"shift_pressed":false,"ctrl_pressed":false,"meta_pressed":false,"pressed":false,"keycode":0,"physical_keycode":90,"key_label":0,"unicode":0,"echo":false,"script":null)
]
}

[rendering]

textures/canvas_textures/default_texture_filter=0
renderer/rendering_method="gl_compatibility"
