[gd_scene load_steps=4 format=3 uid="uid://brpvnekh7sat5"]

[ext_resource type="Texture2D" uid="uid://dkcu8mfbsb4vi" path="res://Assets/Tilesets/Key.png" id="1_7o1m3"]
[ext_resource type="Script" path="res://Scenes/Puzzles/Key.gd" id="1_72jlv"]
[ext_resource type="AudioStream" uid="uid://cmevf3qp28hel" path="res://Assets/Audio/ItemGet.wav" id="3_32tw4"]

[node name="Key" type="Node2D"]
script = ExtResource("1_72jlv")

[node name="Sprite2D" type="Sprite2D" parent="."]
texture = ExtResource("1_7o1m3")

[node name="AudioStreamPlayer" type="AudioStreamPlayer" parent="."]
stream = ExtResource("3_32tw4")
volume_db = -30.0
