[gd_scene load_steps=6 format=3 uid="uid://ct71ceiwfxwoh"]

[ext_resource type="Script" path="res://Scenes/Skelly/ShadowPlayer.gd" id="1_nyq6g"]
[ext_resource type="Texture2D" uid="uid://eff2mp5m6xg0" path="res://icon.svg" id="1_r52gd"]
[ext_resource type="PackedScene" uid="uid://d4m43n8ndkprl" path="res://Scenes/Player/Sword.tscn" id="3_322g6"]
[ext_resource type="Script" path="res://Scenes/Skelly/ShadowSword.gd" id="4_rmg8y"]

[sub_resource type="RectangleShape2D" id="RectangleShape2D_5akjy"]
size = Vector2(56, 56)

[node name="Player" type="CharacterBody2D" groups=["Enemy"]]
script = ExtResource("1_nyq6g")

[node name="Icon" type="Sprite2D" parent="."]
texture = ExtResource("1_r52gd")

[node name="VisibleOnScreenNotifier2D" type="VisibleOnScreenNotifier2D" parent="."]
scale = Vector2(4, 4)

[node name="Sprite2D" type="Sprite2D" parent="."]

[node name="Sword" parent="." instance=ExtResource("3_322g6")]
script = ExtResource("4_rmg8y")

[node name="CollisionShape2D" type="CollisionShape2D" parent="."]
shape = SubResource("RectangleShape2D_5akjy")

[node name="Timer" type="Timer" parent="."]

[connection signal="timeout" from="Timer" to="." method="_on_timer_timeout"]
