[gd_scene load_steps=3 format=3 uid="uid://d1y6gel5en86v"]

[ext_resource type="PackedScene" uid="uid://4bu03w8pmjg2" path="res://UI/options_menu.tscn" id="1_gk687"]
[ext_resource type="Script" path="res://UI/main_menu_options.gd" id="2_kw2d4"]

[node name="Options" instance=ExtResource("1_gk687")]
script = ExtResource("2_kw2d4")
