[gd_resource type="Resource" script_class="CardSpec" load_steps=4 format=3 uid="uid://cgulyqsimweib"]

[ext_resource type="Texture2D" uid="uid://bqmaeqocbtbmb" path="res://assets/card_arts/cardia8.png" id="1_8yciy"]
[ext_resource type="AudioStream" uid="uid://dqsjaspmthhv" path="res://assets/audio/music/yodel-sounds_piccolo_session.ogg" id="2_xta2u"]
[ext_resource type="Script" path="res://model/card_spec.gd" id="3_4srw5"]

[resource]
script = ExtResource("3_4srw5")
art_texture = ExtResource("1_8yciy")
musical_phrase = ExtResource("2_xta2u")
symbol = "C"
