[gd_scene load_steps=6 format=3 uid="uid://88ce2fphqj7e"]

[ext_resource type="Texture2D" uid="uid://xo1f84hlbba0" path="res://assets/backgrounds/transition_tree.png" id="1_0xl0o"]
[ext_resource type="Script" path="res://game/world/transition/night_transition.gd" id="1_0xton"]
[ext_resource type="PackedScene" uid="uid://by4hi2aq8r176" path="res://game/world/paralax/parallax_background.tscn" id="2_paeej"]

[sub_resource type="Animation" id="Animation_uh53k"]
resource_name = "transition"
tracks/0/type = "value"
tracks/0/imported = false
tracks/0/enabled = true
tracks/0/path = NodePath("Night_scene/TransitionBarrier:position")
tracks/0/interp = 1
tracks/0/loop_wrap = true
tracks/0/keys = {
"times": PackedFloat32Array(0, 0.8),
"transitions": PackedFloat32Array(1, 1),
"update": 0,
"values": [Vector2(-1799, 0), Vector2(6911, 0)]
}
tracks/1/type = "value"
tracks/1/imported = false
tracks/1/enabled = true
tracks/1/path = NodePath("Night_scene/ParallaxBackground:offset")
tracks/1/interp = 1
tracks/1/loop_wrap = true
tracks/1/keys = {
"times": PackedFloat32Array(0, 0.8),
"transitions": PackedFloat32Array(1, 1),
"update": 0,
"values": [Vector2(-8710, 0), Vector2(0, 0)]
}
tracks/2/type = "value"
tracks/2/imported = false
tracks/2/enabled = true
tracks/2/path = NodePath("Night_scene/TransitionBarrier:visible")
tracks/2/interp = 1
tracks/2/loop_wrap = true
tracks/2/keys = {
"times": PackedFloat32Array(0, 1),
"transitions": PackedFloat32Array(1, 1),
"update": 1,
"values": [true, false]
}
tracks/3/type = "value"
tracks/3/imported = false
tracks/3/enabled = true
tracks/3/path = NodePath("Night_scene/ParallaxBackground:visible")
tracks/3/interp = 1
tracks/3/loop_wrap = true
tracks/3/keys = {
"times": PackedFloat32Array(0),
"transitions": PackedFloat32Array(1),
"update": 1,
"values": [true]
}

[sub_resource type="AnimationLibrary" id="AnimationLibrary_tf8rk"]
_data = {
"transition": SubResource("Animation_uh53k")
}

[node name="Night_scene" type="AnimationPlayer" node_paths=PackedStringArray("parallax_background")]
libraries = {
"": SubResource("AnimationLibrary_tf8rk")
}
script = ExtResource("1_0xton")
parallax_background = NodePath("ParallaxBackground")

[node name="TransitionBarrier" type="Sprite2D" parent="."]
position = Vector2(-1799, 0)
texture = ExtResource("1_0xl0o")
centered = false

[node name="ParallaxBackground" parent="." instance=ExtResource("2_paeej")]
offset = Vector2(-8710, 0)
transform = Transform2D(1, 0, 0, 1, -8710, 0)

[node name="Clouds" parent="ParallaxBackground" index="1"]
visible = false

[editable path="ParallaxBackground"]
