[gd_resource type="Resource" script_class="CreatureSpec" load_steps=3 format=3 uid="uid://cpopeisxrh0u0"]

[ext_resource type="Script" path="res://model/creature_spec.gd" id="1_26tv6"]
[ext_resource type="SpriteFrames" uid="uid://cucv315iweryx" path="res://assets/sheep/pink_sheep_frames.tres" id="2_t5opp"]

[resource]
script = ExtResource("1_26tv6")
sprites = ExtResource("2_t5opp")
musical_taste = "ACF"
musical_distaste = "B"
score = 20
score_to_unlock = 150
type = 0
