[gd_scene load_steps=10 format=3 uid="uid://c51ak730tkova"]

[ext_resource type="PackedScene" uid="uid://bipdprsbkeqcp" path="res://entity.tscn" id="1_fmsy2"]
[ext_resource type="PackedScene" uid="uid://dmjydi7k7ot57" path="res://entity_sprite.tscn" id="2_jfxh0"]
[ext_resource type="Texture2D" uid="uid://dqoncg1i8wtqc" path="res://assets/creatures/cocatricius-verdus-shiny.png" id="3_mia3x"]
[ext_resource type="PackedScene" uid="uid://bfd6kbmrgphws" path="res://stats.tscn" id="4_6r4sp"]
[ext_resource type="Script" path="res://ai/navigator.gd" id="4_c4khb"]
[ext_resource type="PackedScene" uid="uid://b5v6riocbbrvr" path="res://carnivore.tscn" id="6_v6clq"]
[ext_resource type="Script" path="res://game/reproduction.gd" id="7_cj2m3"]
[ext_resource type="Script" path="res://game/creature.gd" id="7_cn4oq"]
[ext_resource type="Script" path="res://game/size.gd" id="8_bogl0"]

[node name="Bird" instance=ExtResource("1_fmsy2")]
species_name = "[i]Cocatricius verdus[/i]"
speed = 0.5

[node name="Sprite3D" parent="." index="0" instance=ExtResource("2_jfxh0")]
transform = Transform3D(0.00984808, 0.00173648, 0, -0.00173648, 0.00984808, 0, 0, 0, 0.01, 0, 0.07, 0)
shiny_texture = ExtResource("3_mia3x")

[node name="Navigator" type="Node" parent="." index="1"]
script = ExtResource("4_c4khb")
movement_types = 5

[node name="Stats" parent="." index="2" instance=ExtResource("4_6r4sp")]
hunger_rate = 0.06

[node name="Reproduction" type="Node" parent="." index="3"]
script = ExtResource("7_cj2m3")
cooldown = 9.0

[node name="Carnivore" parent="." index="4" instance=ExtResource("6_v6clq")]
max_fed_to_hunt = 0.8

[node name="Creature" type="Node" parent="." index="5"]
script = ExtResource("7_cn4oq")
prey_level = 2
nutrition_level = 1

[node name="Size" type="Node" parent="." index="6"]
script = ExtResource("8_bogl0")
size = 2

[node name="Area3D" parent="." index="7"]
visible = false
