[gd_scene load_steps=3 format=3 uid="uid://dvvd1gdyustrr"]

[ext_resource type="PackedScene" uid="uid://bipdprsbkeqcp" path="res://entity.tscn" id="1_vs8hb"]
[ext_resource type="Texture2D" uid="uid://0ejy27r71bai" path="res://assets/planet/árvore.png" id="2_c7jpg"]

[node name="Tree" instance=ExtResource("1_vs8hb")]

[node name="Sprite" type="Sprite3D" parent="." index="0"]
transform = Transform3D(0.01, 0, 0, 0, 0.01, 0, 0, 0, 0.01, 0, 0.0296712, 0)
texture = ExtResource("2_c7jpg")
