[gd_scene load_steps=4 format=3 uid="uid://bml5ep0b77xae"]

[ext_resource type="Script" path="res://ui/stats_bar.gd" id="1_w4e1o"]
[ext_resource type="Texture2D" uid="uid://ba5y7kwuggm1d" path="res://assets/ui/barra-fome.png" id="2_5prmx"]

[sub_resource type="Theme" id="Theme_87bko"]

[node name="StatsBar" type="Control"]
custom_minimum_size = Vector2(0, 25)
layout_mode = 3
anchor_right = 0.165
anchor_bottom = 0.042
grow_horizontal = 2
grow_vertical = 2
size_flags_horizontal = 3
size_flags_vertical = 3
script = ExtResource("1_w4e1o")

[node name="HBoxContainer" type="HBoxContainer" parent="."]
layout_mode = 1
anchors_preset = -1
anchor_left = 0.02
anchor_right = 0.928
anchor_bottom = 1.0
grow_horizontal = 2
grow_vertical = 2
theme_override_constants/separation = 0

[node name="Min" type="Label" parent="HBoxContainer"]
unique_name_in_owner = true
custom_minimum_size = Vector2(16, 0)
layout_mode = 2
theme_override_colors/font_color = Color(1, 1, 1, 1)
theme_override_colors/font_outline_color = Color(0, 0, 0, 1)
theme_override_constants/outline_size = 10
text = "0
"
horizontal_alignment = 1

[node name="StatsBar" type="TextureProgressBar" parent="HBoxContainer"]
unique_name_in_owner = true
custom_minimum_size = Vector2(0, 25)
layout_mode = 2
size_flags_horizontal = 3
theme = SubResource("Theme_87bko")
value = 100.0
nine_patch_stretch = true
texture_progress = ExtResource("2_5prmx")

[node name="StatsIcon" type="TextureRect" parent="HBoxContainer/StatsBar"]
unique_name_in_owner = true
custom_minimum_size = Vector2(30, 0)
layout_mode = 1
anchors_preset = -1
anchor_left = 1.0
anchor_right = 1.0
anchor_bottom = 1.0
offset_left = -11.0
offset_right = 19.0
grow_horizontal = 0
grow_vertical = 2
size_flags_vertical = 3
expand_mode = 4
stretch_mode = 5

[node name="Max" type="Label" parent="HBoxContainer"]
unique_name_in_owner = true
custom_minimum_size = Vector2(50, 0)
layout_mode = 2
theme_override_colors/font_color = Color(1, 1, 1, 1)
theme_override_colors/font_outline_color = Color(0, 0, 0, 1)
theme_override_constants/outline_size = 10
text = "100"
horizontal_alignment = 2
