[gd_resource type="Resource" script_class="TileType" load_steps=4 format=3 uid="uid://dc46qo8lmwr2m"]

[ext_resource type="Script" path="res://planet/tile_type.gd" id="1_wqrx4"]
[ext_resource type="PackedScene" uid="uid://bxu5wt14qajms" path="res://game/props/mountain.tscn" id="1_x1g3v"]
[ext_resource type="Texture2D" uid="uid://b5eqn2muerj5" path="res://assets/planet/tundra.png" id="2_4qlta"]

[resource]
script = ExtResource("1_wqrx4")
tile_name = "Tundra"
texture = ExtResource("2_4qlta")
props = Array[PackedScene]([ExtResource("1_x1g3v")])
props_num = 1
movement = 1
vegetation_max = 2.0
vegetation_growth_rate = 0.05
capacity = 10
