[gd_scene load_steps=4 format=3 uid="uid://vwk54qs4dny1"]

[ext_resource type="Script" path="res://gameplay/bg/bg.gd" id="1_5pgh1"]
[ext_resource type="PackedScene" uid="uid://cl6ktmi7ijnw0" path="res://gameplay/bg/dynamic_texture.tscn" id="1_miodl"]
[ext_resource type="Script" path="res://gameplay/bg/tap_produces_pollen_rule.gd" id="2_5grds"]

[node name="BG" type="HBoxContainer"]
anchors_preset = -1
anchor_right = 100.0
anchor_bottom = 1.0
grow_horizontal = 2
grow_vertical = 2
theme_override_constants/separation = 0
script = ExtResource("1_5pgh1")
bg_tile_scn = ExtResource("1_miodl")
scroll_cooldown = 0.1

[node name="TapProducesPollenRule" type="Node" parent="."]
script = ExtResource("2_5grds")

[node name="DynamicTexture" parent="." instance=ExtResource("1_miodl")]
layout_mode = 2
