[gd_scene load_steps=4 format=3 uid="uid://duj2wiwwok7np"]

[ext_resource type="Script" path="res://gameplay/threat/threat.gd" id="1_lhlw4"]

[sub_resource type="StyleBoxFlat" id="StyleBoxFlat_3bckc"]
bg_color = Color(0, 0, 0, 1)

[sub_resource type="StyleBoxFlat" id="StyleBoxFlat_tpmqa"]
bg_color = Color(0.6, 0.101961, 0.0745098, 1)

[node name="Threat" type="Node2D" groups=["THREAT"]]
script = ExtResource("1_lhlw4")

[node name="Timer" type="Timer" parent="."]
one_shot = true

[node name="Hurtbux" type="Control" parent="."]
layout_mode = 3
anchors_preset = 8
anchor_left = 0.5
anchor_top = 0.5
anchor_right = 0.5
anchor_bottom = 0.5
offset_left = -20.0
offset_top = -20.0
offset_right = 20.0
offset_bottom = 20.0
grow_horizontal = 2
grow_vertical = 2

[node name="HPBar" type="ProgressBar" parent="."]
custom_minimum_size = Vector2(200, 24)
anchors_preset = 10
anchor_right = 1.0
offset_top = 40.0
offset_bottom = 24.0
grow_horizontal = 2
theme_override_styles/background = SubResource("StyleBoxFlat_3bckc")
theme_override_styles/fill = SubResource("StyleBoxFlat_tpmqa")
value = 50.0
show_percentage = false

[connection signal="gui_input" from="Hurtbux" to="." method="_on_input"]
