[gd_resource type="Resource" script_class="FighterData" load_steps=5 format=3 uid="uid://c3drwa453qq2n"]

[ext_resource type="PackedScene" uid="uid://x0xftbly7tq1" path="res://fighter/goofer/goofer_avatar.tscn" id="1_s3bv7"]
[ext_resource type="PackedScene" uid="uid://flp61i442d4y" path="res://fighter/goofer/Goofer.tscn" id="2_ndy0m"]
[ext_resource type="Texture2D" uid="uid://csa2guotcm6jo" path="res://assets/characters/fighter_1/icon.png" id="3_o3d8x"]
[ext_resource type="Script" path="res://fighter/common/fighter_data.gd" id="4_g0kyg"]

[resource]
script = ExtResource("4_g0kyg")
fighter_scene = ExtResource("2_ndy0m")
avatar_scene = ExtResource("1_s3bv7")
portrait_texture = ExtResource("3_o3d8x")
