[gd_scene load_steps=3 format=3 uid="uid://bb8id0so6nqe8"]

[ext_resource type="Texture2D" uid="uid://csa2guotcm6jo" path="res://assets/characters/fighter_1/icon.png" id="1_y3far"]
[ext_resource type="Script" path="res://roster_picker/selection_box/selection_box.gd" id="2_pj8a0"]

[node name="SelectionBox" type="TextureRect"]
custom_minimum_size = Vector2(128, 128)
texture = ExtResource("1_y3far")
expand_mode = 1
script = ExtResource("2_pj8a0")
