[gd_resource type="StyleBoxTexture" load_steps=2 format=3 uid="uid://bj5jtnpdvjguq"]

[ext_resource type="Texture2D" uid="uid://bu4s6vw4votsb" path="res://assets/ui/normal.png" id="1_4qfsp"]

[resource]
texture = ExtResource("1_4qfsp")
texture_margin_left = 32.0
texture_margin_top = 32.0
texture_margin_right = 40.0
texture_margin_bottom = 40.0
