[gd_scene load_steps=13 format=2]

[ext_resource path="res://gameplay/common/MovementProfile.gd" type="Script" id=1]
[ext_resource path="res://gameplay/entity/rune-slab/RuneSlab.tscn" type="PackedScene" id=2]
[ext_resource path="res://battle/Battle.tscn" type="PackedScene" id=3]
[ext_resource path="res://gameplay/entity/creature/zombie/Zombie.tscn" type="PackedScene" id=4]
[ext_resource path="res://campaign/alpha/biomes/Swamp.tres" type="Resource" id=5]
[ext_resource path="res://gameplay/spell/sprout-rock/SproutRock.tscn" type="PackedScene" id=6]

[sub_resource type="Resource" id=1]
resource_local_to_scene = true
resource_name = "MovementProfile"
script = ExtResource( 1 )
mask = 17
operation = 0

[sub_resource type="Resource" id=2]
resource_local_to_scene = true
resource_name = "MovementProfile"
script = ExtResource( 1 )
mask = 17
operation = 0

[sub_resource type="Resource" id=3]
resource_local_to_scene = true
resource_name = "MovementProfile"
script = ExtResource( 1 )
mask = 17
operation = 0

[sub_resource type="Resource" id=4]
resource_local_to_scene = true
resource_name = "MovementProfile"
script = ExtResource( 1 )
mask = 17
operation = 0

[sub_resource type="Resource" id=5]
resource_local_to_scene = true
resource_name = "MovementProfile"
script = ExtResource( 1 )
mask = 17
operation = 0

[sub_resource type="Resource" id=6]
resource_local_to_scene = true
resource_name = "MovementProfile"
script = ExtResource( 1 )
mask = 33
operation = 0

[node name="Battle" instance=ExtResource( 3 )]

[node name="Map" parent="." index="2"]
tile_data = PoolIntArray( -65532, 0, 0, -65531, 0, 0, -65530, 0, 0, -65529, 0, 0, 0, 0, 0, 1, 0, 0, 2, 0, 0, 3, 1610612749, 0, 4, 2, 0, 5, 2, 0, 6, 2, 0, 7, 13, 0, 8, 0, 0, 9, 0, 0, 10, 0, 0, 11, 0, 0, 12, 0, 0, 13, 0, 0, 14, 0, 0, 15, 0, 0, 16, 0, 0, 17, 0, 0, 18, 0, 0, 19, 0, 0, 20, 0, 0, 65536, 0, 0, 65537, 0, 0, 65538, 0, 0, 65539, 1610612749, 0, 65540, 2, 0, 65541, 2, 0, 65542, 2, 0, 65543, -1073741810, 0, 65544, -1073741811, 0, 65545, -1073741811, 0, 65546, -1073741811, 0, 65547, -1073741811, 0, 65548, -1073741811, 0, 65549, -1073741811, 0, 65550, -1073741811, 0, 65551, -1073741811, 0, 65552, -1073741811, 0, 65553, -1073741811, 0, 65554, -1073741811, 0, 65555, 15, 0, 65556, 0, 0, 131072, 0, 0, 131073, 0, 0, 131074, -1610612736, 0, 131075, 1610612749, 0, 131076, 2, 0, 131077, 2, 0, 131078, 2, 0, 131079, 6, 0, 131080, -1610612732, 0, 131081, -1610612732, 0, 131082, -1610612732, 0, 131083, -1610612732, 0, 131084, -1610612732, 0, 131085, -1610612732, 0, 131086, -1610612732, 0, 131087, -1610612732, 0, 131088, -1610612732, 0, 131089, -1610612732, 0, 131090, -1610612732, 0, 131091, -1073741810, 0, 131092, -1073741811, 0, 196608, 0, 0, 196609, 0, 0, 196610, -1610612736, 0, 196611, 1610612749, 0, 196612, 2, 0, 196613, 2, 0, 196614, 2, 0, 196615, -1073741817, 0, 196616, -1610612732, 0, 196617, -1610612732, 0, 196618, -1610612732, 0, 196619, -1610612732, 0, 196620, -1610612732, 0, 196621, -1610612732, 0, 196622, -1610612732, 0, 196623, -1610612732, 0, 196624, -1610612732, 0, 196625, -1610612732, 0, 196626, -1610612732, 0, 196627, 4, 0, 196628, 4, 0, 262144, 0, 0, 262145, 0, 0, 262146, -1610612736, 0, 262147, 1610612749, 0, 262148, 2, 0, 262149, 2, 0, 262150, 2, 0, 262151, 2, 0, 262152, 6, 0, 262153, -1610612732, 0, 262154, -1610612732, 0, 262155, -1610612732, 0, 262156, -1610612732, 0, 262157, -1610612732, 0, 262158, -1610612732, 0, 262159, -1610612732, 0, 262160, -1610612732, 0, 262161, -1610612732, 0, 262162, -1610612732, 0, 262163, 4, 0, 262164, 4, 0, 327680, 0, 0, 327681, -1610612736, 0, 327682, -1610612736, 0, 327683, 1610612749, 0, 327684, -1610612734, 0, 327685, -1610612734, 0, 327686, 2, 0, 327687, 2, 0, 327688, -1073741817, 0, 327689, -1610612732, 0, 327690, -1610612732, 0, 327691, -1610612732, 0, 327692, -1610612732, 0, 327693, -1610612732, 0, 327694, -1610612732, 0, 327695, -1610612732, 0, 327696, -1610612732, 0, 327697, -1610612732, 0, 327698, -1610612732, 0, 327699, 4, 0, 327700, 4, 0, 393216, 0, 0, 393217, -1610612736, 0, 393218, -1073741809, 0, 393219, 1610612750, 0, 393220, -1610612734, 0, 393221, -1610612734, 0, 393222, -1610612734, 0, 393223, -1610612734, 0, 393224, 2, 0, 393225, 6, 0, 393226, -1610612732, 0, 393227, -1610612732, 0, 393228, -1610612732, 0, 393229, -1610612732, 0, 393230, -1610612732, 0, 393231, -1610612732, 0, 393232, -1610612732, 0, 393233, -1073741820, 0, 393234, -1073741820, 0, 393235, -1073741818, 0, 393236, -1073741818, 0, 458752, -1610612736, 0, 458753, -1073741809, 0, 458754, 1610612750, 0, 458755, -1610612734, 0, 458756, -1610612734, 0, 458757, -1610612734, 0, 458758, -1610612734, 0, 458759, -1610612734, 0, 458760, -1610612734, 0, 458761, -1073741817, 0, 458762, -1610612732, 0, 458763, -1610612732, 0, 458764, -1610612732, 0, 458765, -1610612732, 0, 458766, -1610612732, 0, 458767, -1610612732, 0, 458768, -1610612732, 0, 458769, -1073741820, 0, 458770, 1610612743, 0, 458771, 1, 0, 458772, 1, 0, 524288, -1610612736, 0, 524289, 1610612749, 0, 524290, -1610612734, 0, 524291, -1610612734, 0, 524292, -1610612734, 0, 524293, -1610612734, 0, 524294, -1610612734, 0, 524295, -1610612734, 0, 524296, -1610612734, 0, 524297, -1610612734, 0, 524298, -1073741817, 0, 524299, -1610612732, 0, 524300, -1610612732, 0, 524301, -1610612732, 0, 524302, -1610612732, 0, 524303, -1610612732, 0, 524304, -1610612732, 0, 524305, 1610612742, 0, 524306, 1, 0, 524307, 1, 0, 524308, 1, 0, 589824, -1610612736, 0, 589825, 1610612749, 0, 589826, -1610612734, 0, 589827, -1610612734, 0, 589828, -1610612734, 0, 589829, -1610612734, 0, 589830, -1610612734, 0, 589831, -1610612734, 0, 589832, -1610612734, 0, 589833, -1610612734, 0, 589834, -1610612734, 0, 589835, -1073741817, 0, 589836, -1073741820, 0, 589837, -1073741820, 0, 589838, -1610612732, 0, 589839, -1610612732, 0, 589840, -1610612732, 0, 589841, 1610612742, 0, 589842, 1, 0, 589843, 1, 0, 589844, 1, 0, 655360, 0, 0, 655361, 1610612749, 0, 655362, -1610612734, 0, 655363, -1610612734, 0, 655364, -1610612734, 0, 655365, -1610612734, 0, 655366, -1610612734, 0, 655367, -1610612734, 0, 655368, -1610612734, 0, 655369, -1610612734, 0, 655370, -1610612734, 0, 655371, -1610612734, 0, 655372, -1073741817, 0, 655373, -1073741820, 0, 655374, -1073741820, 0, 655375, -1073741820, 0, 655376, -1073741820, 0, 655377, 1610612743, 0, 655378, 1, 0, 655379, 1, 0, 655380, 1, 0, 720896, 0, 0, 720897, 1610612749, 0, 720898, -1610612734, 0, 720899, -1610612734, 0, 720900, -1610612734, 0, 720901, -1610612734, 0, 720902, -1610612734, 0, 720903, -1610612734, 0, 720904, -1610612734, 0, 720905, 2, 0, 720906, -1610612734, 0, 720907, -1610612734, 0, 720908, -1610612734, 0, 720909, 6, 0, 720910, -1073741820, 0, 720911, -1073741820, 0, 720912, 1610612742, 0, 720913, 1, 0, 720914, 1, 0, 720915, 1, 0, 720916, 1, 0, 786432, 0, 0, 786433, 1610612749, 0, 786434, 2, 0, 786435, 2, 0, 786436, -1610612734, 0, 786437, -1610612734, 0, 786438, -1610612734, 0, 786439, -1610612734, 0, 786440, -1610612734, 0, 786441, 2, 0, 786442, 2, 0, 786443, -1610612734, 0, 786444, 2, 0, 786445, -1073741815, 0, 786446, -1073741815, 0, 786447, -1073741815, 0, 786448, -1073741815, 0, 786449, 1, 0, 786450, 1, 0, 786451, 1, 0, 786452, 1, 0, 851968, 0, 0, 851969, 1610612749, 0, 851970, 2, 0, 851971, -1610612734, 0, 851972, -1610612734, 0, 851973, -1610612734, 0, 851974, -1610612734, 0, 851975, -1610612734, 0, 851976, -1610612734, 0, 851977, -1610612734, 0, 851978, 2, 0, 851979, 2, 0, 851980, 2, 0, 851981, -1073741815, 0, 851982, -1073741815, 0, 851983, -1073741815, 0, 851984, -1073741815, 0, 851985, 1, 0, 851986, 1, 0, 851987, 1, 0, 851988, 1, 0, 917504, 0, 0, 917505, 1610612749, 0, 917506, 2, 0, 917507, 2, 0, 917508, -1610612734, 0, 917509, -1610612734, 0, 917510, -1610612734, 0, 917511, 7, 0, 917512, -1610612730, 0, 917513, -1610612730, 0, 917514, -1610612730, 0, 917515, -1610612729, 0, 917516, 2, 0, 917517, 6, 0, 917518, 1610612740, 0, 917519, 4, 0, 917520, -1073741820, 0, 917521, -1610612730, 0, 917522, -1610612730, 0, 917523, -1610612730, 0, 917524, -1610612730, 0, 983040, 0, 0, 983041, 1610612751, 0, 983042, -1610612722, 0, 983043, 2, 0, 983044, 2, 0, 983045, -1610612734, 0, 983046, -1610612734, 0, 983047, -1073741817, 0, 983048, -1610612732, 0, 983049, -1073741820, 0, 983050, -1073741820, 0, 983051, -1073741820, 0, 983052, -1610612730, 0, 983053, 1610612740, 0, 983054, 4, 0, 983055, -1073741820, 0, 983056, -1073741820, 0, 983057, -1073741820, 0, 983058, -1610612732, 0, 983059, 4, 0, 983060, 4, 0, 1048576, 0, 0, 1048577, -1610612736, 0, 1048578, 1610612751, 0, 1048579, -1610612722, 0, 1048580, 2, 0, 1048581, 2, 0, 1048582, -1610612734, 0, 1048583, -1610612734, 0, 1048584, -1073741817, 0, 1048585, -1073741818, 0, 1048586, -1073741818, 0, 1048587, -1073741820, 0, 1048588, -1073741820, 0, 1048589, -1073741820, 0, 1048590, -1073741820, 0, 1048591, -1610612732, 0, 1048592, -1610612732, 0, 1048593, -1610612732, 0, 1048594, 14, 0, 1048595, -1610612723, 0, 1048596, -1610612723, 0, 1114112, 0, 0, 1114113, 0, 0, 1114114, -1610612736, 0, 1114115, 1610612749, 0, 1114116, -1610612734, 0, 1114117, 2, 0, 1114118, 2, 0, 1114119, 2, 0, 1114120, 2, 0, 1114121, 1, 0, 1114122, 10, 0, 1114123, -1073741817, 0, 1114124, -1610612732, 0, 1114125, -1610612732, 0, 1114126, -1610612732, 0, 1114127, -1610612732, 0, 1114128, 14, 0, 1114129, -1610612723, 0, 1114130, -1610612721, 0, 1114131, 0, 0, 1114132, 0, 0, 1179648, 0, 0, 1179649, 0, 0, 1179650, -1610612736, 0, 1179651, 1610612751, 0, 1179652, -1610612723, 0, 1179653, -1610612722, 0, 1179654, 2, 0, 1179655, 2, 0, 1179656, 1, 0, 1179657, 10, 0, 1179658, 10, 0, 1179659, 10, 0, 1179660, 6, 0, 1179661, -1610612732, 0, 1179662, -1610612732, 0, 1179663, 14, 0, 1179664, -1610612721, 0, 1179665, -1610612736, 0, 1179666, -1610612736, 0, 1179667, 0, 0, 1179668, 0, 0, 1245184, 0, 0, 1245185, 0, 0, 1245186, 0, 0, 1245187, 0, 0, 1245188, 0, 0, 1245189, 1610612751, 0, 1245190, -1610612723, 0, 1245191, -1610612723, 0, 1245192, -1610612723, 0, 1245193, -1610612723, 0, 1245194, -1610612723, 0, 1245195, -1610612723, 0, 1245196, -1610612723, 0, 1245197, -1610612723, 0, 1245198, -1610612723, 0, 1245199, -1610612721, 0, 1245200, 0, 0, 1245201, 0, 0, 1245202, 0, 0, 1245203, 0, 0, 1245204, 0, 0, 1310720, 0, 0, 1310721, 0, 0, 1310722, 0, 0, 1310723, 0, 0, 1310724, 0, 0, 1310725, 0, 0, 1310726, 0, 0, 1310727, 0, 0, 1310728, 0, 0, 1310729, 0, 0, 1310730, 0, 0, 1310731, 0, 0, 1310732, 0, 0, 1310733, 0, 0, 1310734, 0, 0, 1310735, 0, 0, 1310736, 0, 0, 1310737, 0, 0, 1310738, 0, 0, 1310739, 0, 0, 1310740, 0, 0, 1376262, 0, 0, 1376263, 0, 0, 1376264, 0, 0, 1376265, 0, 0, 1376266, 0, 0, 1376267, 0, 0, 1376268, 0, 0 )
biome = ExtResource( 5 )

[node name="Zombie" parent="Map" index="4" instance=ExtResource( 4 )]
position = Vector2( 96, 228 )
tile = Vector2( 6, 14 )
movement_profile = SubResource( 1 )

[node name="Zombie2" parent="Map" index="5" instance=ExtResource( 4 )]
position = Vector2( 192, 192 )
tile = Vector2( 12, 12 )
movement_profile = SubResource( 2 )

[node name="Zombie3" parent="Map" index="6" instance=ExtResource( 4 )]
position = Vector2( 112, 68 )
tile = Vector2( 7, 4 )
movement_profile = SubResource( 3 )

[node name="Zombie4" parent="Map" index="7" instance=ExtResource( 4 )]
position = Vector2( 48, 112 )
tile = Vector2( 3, 7 )
movement_profile = SubResource( 4 )

[node name="Zombie5" parent="Map" index="8" instance=ExtResource( 4 )]
position = Vector2( 96, 144 )
tile = Vector2( 6, 9 )
movement_profile = SubResource( 5 )

[node name="RuneSlab" parent="Map" index="9" instance=ExtResource( 2 )]
position = Vector2( 176, 288 )
tile = Vector2( 11, 18 )
movement_profile = SubResource( 6 )

[node name="LoreProvider" parent="Map/RuneSlab" index="2"]
spell_scn = ExtResource( 6 )

[editable path="Map/RuneSlab"]
