[gd_scene load_steps=12 format=2]

[ext_resource path="res://battle/Battle.tscn" type="PackedScene" id=1]
[ext_resource path="res://campaign/alpha/biomes/Overland.tres" type="Resource" id=2]
[ext_resource path="res://gameplay/common/MovementProfile.gd" type="Script" id=3]
[ext_resource path="res://gameplay/entity/rune-slab/RuneSlab.tscn" type="PackedScene" id=4]
[ext_resource path="res://gameplay/spell/focused-shield/FocusedShield.tscn" type="PackedScene" id=5]
[ext_resource path="res://gameplay/spell/bonfire/Bonfire.tscn" type="PackedScene" id=6]
[ext_resource path="res://gameplay/entity/creature/spider/Spider.tscn" type="PackedScene" id=7]
[ext_resource path="res://gameplay/entity/creature/zombie/Zombie.tscn" type="PackedScene" id=8]

[sub_resource type="Resource" id=1]
resource_local_to_scene = true
resource_name = "MovementProfile"
script = ExtResource( 3 )
mask = 33
operation = 0

[sub_resource type="Resource" id=2]
resource_local_to_scene = true
resource_name = "MovementProfile"
script = ExtResource( 3 )
mask = 17
operation = 0

[sub_resource type="Resource" id=3]
resource_local_to_scene = true
resource_name = "MovementProfile"
script = ExtResource( 3 )
mask = 17
operation = 0

[node name="Battle" instance=ExtResource( 1 )]

[node name="Map" parent="." index="2"]
tile_data = PoolIntArray( 0, 0, 0, 1, 0, 0, 2, 0, 0, 3, 0, 0, 4, 0, 0, 5, 0, 0, 6, 0, 0, 7, 0, 0, 8, 0, 0, 9, 0, 0, 10, 0, 0, 11, 0, 0, 12, 0, 0, 13, 0, 0, 14, 0, 0, 15, 0, 0, 16, 0, 0, 17, 0, 0, 18, 0, 0, 19, 0, 0, 20, 0, 0, 65536, 0, 0, 65537, 0, 0, 65538, 0, 0, 65539, 0, 0, 65540, 0, 0, 65541, -1610612736, 0, 65542, 0, 0, 65543, -1073741809, 0, 65544, -1073741811, 0, 65545, -1073741811, 0, 65546, -1073741811, 0, 65547, -1073741811, 0, 65548, -1073741811, 0, 65549, -1073741811, 0, 65550, -1073741811, 0, 65551, -1073741811, 0, 65552, -1073741811, 0, 65553, -1073741811, 0, 65554, -1073741811, 0, 65555, 15, 0, 65556, 0, 0, 131072, 0, 0, 131073, 0, 0, 131074, -1073741809, 0, 131075, -1073741811, 0, 131076, -1073741811, 0, 131077, -1073741811, 0, 131078, -1073741811, 0, 131079, 1610612750, 0, 131080, 1, 0, 131081, 1, 0, 131082, 1, 0, 131083, 1, 0, 131084, 1, 0, 131085, 2, 0, 131086, 2, 0, 131087, 2, 0, 131088, 2, 0, 131089, 2, 0, 131090, 1, 0, 131091, -1073741810, 0, 131092, -1073741811, 0, 196608, 0, 0, 196609, -1073741809, 0, 196610, 1610612750, 0, 196611, 2, 0, 196612, 2, 0, 196613, 2, 0, 196614, 1, 0, 196615, 1, 0, 196616, 1, 0, 196617, 1, 0, 196618, 1, 0, 196619, 1, 0, 196620, 2, 0, 196621, 2, 0, 196622, 2, 0, 196623, 2, 0, 196624, 2, 0, 196625, 1, 0, 196626, 1, 0, 196627, 1, 0, 196628, 1, 0, 262144, 0, 0, 262145, 1610612749, 0, 262146, 2, 0, 262147, 2, 0, 262148, 2, 0, 262149, 2, 0, 262150, 1, 0, 262151, 1, 0, 262152, 1, 0, 262153, 1, 0, 262154, 2, 0, 262155, 2, 0, 262156, 2, 0, 262157, 2, 0, 262158, 2, 0, 262159, 2, 0, 262160, 2, 0, 262161, 2, 0, 262162, 1, 0, 262163, 1, 0, 262164, 1, 0, 327680, 0, 0, 327681, 1610612749, 0, 327682, -1610612730, 0, 327683, -1610612730, 0, 327684, -1610612729, 0, 327685, 2, 0, 327686, 2, 0, 327687, 1, 0, 327688, 1, 0, 327689, 1, 0, 327690, 2, 0, 327691, 2, 0, 327692, 2, 0, 327693, 2, 0, 327694, 2, 0, 327695, 2, 0, 327696, 2, 0, 327697, 2, 0, 327698, 2, 0, 327699, 2, 0, 327700, 1, 0, 393216, 0, 0, 393217, 1610612749, 0, 393218, 4, 0, 393219, 4, 0, 393220, 4, 0, 393221, -1610612729, 0, 393222, 2, 0, 393223, 2, 0, 393224, 14, 0, 393225, -1610612723, 0, 393226, -1610612723, 0, 393227, -1610612722, 0, 393228, 2, 0, 393229, 2, 0, 393230, 2, 0, 393231, 2, 0, 393232, 2, 0, 393233, 2, 0, 393234, 2, 0, 393235, 14, 0, 393236, -1610612723, 0, 458752, 0, 0, 458753, 1610612749, 0, 458754, 4, 0, 458755, 4, 0, 458756, 4, 0, 458757, 4, 0, 458758, -1610612730, 0, 458759, -1610612730, 0, 458760, 13, 0, 458761, -1610612736, 0, 458762, -1610612736, 0, 458763, 1610612751, 0, 458764, -1610612723, 0, 458765, -1610612723, 0, 458766, -1610612723, 0, 458767, -1610612723, 0, 458768, -1610612723, 0, 458769, -1610612723, 0, 458770, -1610612723, 0, 458771, -1610612721, 0, 458772, 0, 0, 524288, 0, 0, 524289, 1610612749, 0, 524290, 4, 0, 524291, 4, 0, 524292, 4, 0, 524293, 4, 0, 524294, 4, 0, 524295, 4, 0, 524296, -1073741810, 0, 524297, -1073741811, 0, 524298, -1073741811, 0, 524299, -1073741811, 0, 524300, 15, 0, 524301, -1610612736, 0, 524302, -1610612736, 0, 524303, -1610612736, 0, 524304, -1610612736, 0, 524305, -1610612736, 0, 524306, -1610612736, 0, 524307, 0, 0, 524308, 0, 0, 589824, 0, 0, 589825, 1610612749, 0, 589826, 4, 0, 589827, 4, 0, 589828, 4, 0, 589829, 4, 0, 589830, 4, 0, 589831, 4, 0, 589832, 4, 0, 589833, 4, 0, 589834, 4, 0, 589835, 4, 0, 589836, -1073741810, 0, 589837, -1073741811, 0, 589838, -1073741811, 0, 589839, 15, 0, 589840, -1610612736, 0, 589841, -1610612736, 0, 589842, -1610612736, 0, 589843, 0, 0, 589844, 0, 0, 655360, 0, 0, 655361, 1610612749, 0, 655362, 4, 0, 655363, 4, 0, 655364, 4, 0, 655365, 4, 0, 655366, 4, 0, 655367, 4, 0, 655368, 4, 0, 655369, 4, 0, 655370, 4, 0, 655371, -1073741818, 0, 655372, 1610612743, 0, 655373, 2, 0, 655374, 2, 0, 655375, -1073741810, 0, 655376, -1073741811, 0, 655377, 15, 0, 655378, -1610612736, 0, 655379, 0, 0, 655380, 0, 0, 720896, 0, 0, 720897, 1610612749, 0, 720898, 4, 0, 720899, 4, 0, 720900, 4, 0, 720901, 4, 0, 720902, 4, 0, 720903, 4, 0, 720904, 4, 0, 720905, 4, 0, 720906, 1610612742, 0, 720907, 2, 0, 720908, 2, 0, 720909, 2, 0, 720910, 2, 0, 720911, 2, 0, 720912, 2, 0, 720913, 13, 0, 720914, -1610612736, 0, 720915, 0, 0, 720916, 0, 0, 786432, 0, 0, 786433, 1610612749, 0, 786434, 4, 0, 786435, 4, 0, 786436, 4, 0, 786437, 4, 0, 786438, 4, 0, 786439, 4, 0, 786440, 4, 0, 786441, -1073741818, 0, 786442, 1610612743, 0, 786443, 2, 0, 786444, 2, 0, 786445, 2, 0, 786446, 2, 0, 786447, 2, 0, 786448, 2, 0, 786449, 13, 0, 786450, -1610612736, 0, 786451, 0, 0, 786452, 0, 0, 851968, 0, 0, 851969, 1610612751, 0, 851970, -1610612722, 0, 851971, 4, 0, 851972, 4, 0, 851973, 4, 0, 851974, 4, 0, 851975, 4, 0, 851976, 1610612742, 0, 851977, 2, 0, 851978, 2, 0, 851979, 2, 0, 851980, 2, 0, 851981, 2, 0, 851982, 2, 0, 851983, 2, 0, 851984, 2, 0, 851985, 13, 0, 851986, -1610612736, 0, 851987, 0, 0, 851988, 0, 0, 917504, 0, 0, 917505, 0, 0, 917506, 1610612749, 0, 917507, 4, 0, 917508, 4, 0, 917509, 4, 0, 917510, 4, 0, 917511, 4, 0, 917512, 1610612743, 0, 917513, 1, 0, 917514, 1, 0, 917515, 1, 0, 917516, 2, 0, 917517, 2, 0, 917518, 2, 0, 917519, 2, 0, 917520, 2, 0, 917521, 13, 0, 917522, -1610612736, 0, 917523, 0, 0, 917524, 0, 0, 983040, 0, 0, 983041, 0, 0, 983042, 1610612749, 0, 983043, 4, 0, 983044, 4, 0, 983045, 4, 0, 983046, 4, 0, 983047, 1610612743, 0, 983048, 1, 0, 983049, 1, 0, 983050, 1, 0, 983051, 1, 0, 983052, 1, 0, 983053, 1, 0, 983054, 1, 0, 983055, 2, 0, 983056, 2, 0, 983057, 13, 0, 983058, -1610612736, 0, 983059, 0, 0, 983060, 0, 0, 1048576, 0, 0, 1048577, -1610612736, 0, 1048578, 1610612751, 0, 1048579, -1610612722, 0, 1048580, 4, 0, 1048581, 4, 0, 1048582, 1610612743, 0, 1048583, 1, 0, 1048584, 1, 0, 1048585, 1, 0, 1048586, 1, 0, 1048587, 1, 0, 1048588, 1, 0, 1048589, 1, 0, 1048590, 1, 0, 1048591, 1, 0, 1048592, 14, 0, 1048593, -1610612721, 0, 1048594, -1610612736, 0, 1048595, 0, 0, 1048596, 0, 0, 1114112, 0, 0, 1114113, -1610612736, 0, 1114114, -1610612736, 0, 1114115, 1610612751, 0, 1114116, -1610612722, 0, 1114117, 1610612742, 0, 1114118, 1, 0, 1114119, 1, 0, 1114120, 1, 0, 1114121, 1, 0, 1114122, 1, 0, 1114123, 1, 0, 1114124, 1, 0, 1114125, 1, 0, 1114126, 1, 0, 1114127, 14, 0, 1114128, -1610612721, 0, 1114129, -1610612736, 0, 1114130, -1610612736, 0, 1114131, 0, 0, 1114132, 0, 0, 1179648, 0, 0, 1179649, 0, 0, 1179650, -1610612736, 0, 1179651, -1610612736, 0, 1179652, 1610612751, 0, 1179653, -1610612722, 0, 1179654, 1, 0, 1179655, 1, 0, 1179656, 1, 0, 1179657, 1, 0, 1179658, 1, 0, 1179659, 1, 0, 1179660, 1, 0, 1179661, 1, 0, 1179662, 1, 0, 1179663, 13, 0, 1179664, -1610612736, 0, 1179665, -1610612736, 0, 1179666, -1610612736, 0, 1179667, 0, 0, 1179668, 0, 0, 1245184, 0, 0, 1245185, 0, 0, 1245186, 0, 0, 1245187, 0, 0, 1245188, -1610612736, 0, 1245189, 1610612749, 0, 1245190, 1, 0, 1245191, 1, 0, 1245192, 1, 0, 1245193, 14, 0, 1245194, -1610612723, 0, 1245195, -1610612723, 0, 1245196, -1610612723, 0, 1245197, -1610612723, 0, 1245198, -1610612723, 0, 1245199, -1610612721, 0, 1245200, 0, 0, 1245201, 0, 0, 1245202, 0, 0, 1245203, 0, 0, 1245204, 0, 0, 1310720, 0, 0, 1310721, 0, 0, 1310722, 0, 0, 1310723, 0, 0, 1310724, 0, 0, 1310725, 1610612749, 0, 1310726, 1, 0, 1310727, 1, 0, 1310728, 1, 0, 1310729, 13, 0, 1310730, 0, 0, 1310731, 0, 0, 1310732, 0, 0, 1310733, 0, 0, 1310734, 0, 0, 1310735, 0, 0, 1310736, 0, 0, 1310737, 0, 0, 1310738, 0, 0, 1310739, 0, 0, 1310740, 0, 0 )
biome = ExtResource( 2 )

[node name="RuneSlab" parent="Map" index="4" instance=ExtResource( 4 )]
position = Vector2( 60, 48 )
tile = Vector2( 3, 3 )
movement_profile = SubResource( 1 )

[node name="LoreProvider" parent="Map/RuneSlab" index="2"]
spell_scn = ExtResource( 5 )

[node name="RuneSlab2" parent="Map" index="5" instance=ExtResource( 4 )]
position = Vector2( 236, 192 )
tile = Vector2( 14, 12 )
movement_profile = SubResource( 1 )

[node name="LoreProvider" parent="Map/RuneSlab2" index="2"]
spell_scn = ExtResource( 6 )

[node name="Spider" parent="Map" index="6" instance=ExtResource( 7 )]
position = Vector2( 156, 32 )
tile = Vector2( 9, 2 )
movement_profile = SubResource( 2 )

[node name="Spider2" parent="Map" index="7" instance=ExtResource( 7 )]
position = Vector2( 140, 80 )
tile = Vector2( 8, 5 )
movement_profile = SubResource( 2 )

[node name="Spider3" parent="Map" index="8" instance=ExtResource( 7 )]
position = Vector2( 108, 64 )
tile = Vector2( 6, 4 )
movement_profile = SubResource( 2 )

[node name="Zombie" parent="Map" index="9" instance=ExtResource( 8 )]
position = Vector2( 188, 224 )
tile = Vector2( 11, 14 )
movement_profile = SubResource( 3 )

[node name="Zombie2" parent="Map" index="10" instance=ExtResource( 8 )]
position = Vector2( 140, 240 )
tile = Vector2( 8, 15 )
movement_profile = SubResource( 3 )

[node name="Zombie3" parent="Map" index="11" instance=ExtResource( 8 )]
position = Vector2( 204, 256 )
tile = Vector2( 12, 16 )
movement_profile = SubResource( 3 )

[editable path="Map/RuneSlab"]
[editable path="Map/RuneSlab2"]
