[gd_scene load_steps=5 format=2]

[ext_resource path="res://campaign/Chunk.gd" type="Script" id=1]
[ext_resource path="res://asset/sprite/colored_transparent_packed.png" type="Texture" id=2]



[sub_resource type="AtlasTexture" id=3]
atlas = ExtResource( 2 )
region = Rect2( 640, 208, 16, 16 )

[sub_resource type="AtlasTexture" id=2]
atlas = ExtResource( 2 )
region = Rect2( 624, 208, 16, 16 )

[node name="Chunk" type="TextureRect"]
margin_right = 64.0
margin_bottom = 64.0
rect_min_size = Vector2( 64, 64 )
texture = SubResource( 3 )
expand = true
script = ExtResource( 1 )
empty_tex = SubResource( 3 )
filled_tex = SubResource( 2 )
