{
    "name":"Omar",
    "race":"Dwarf",
    "ability-scores":{
        "STR": 15, "DEX": 14, "CON": 13,
        "INT": 12, "WIS": 10, "CHA": 8
    },
    "class-levels":[
        "Fighter", "Fighter", "Fighter", "Fighter", "Fighter",
        "Fighter", "Fighter", "Fighter", "Fighter", "Fighter",
        "Fighter", "Fighter", "Fighter", "Fighter", "Fighter",
        "Fighter", "Fighter", "Fighter", "Fighter", "Fighter"
    ],
    "inventory":[
        "Longsword", "Plate"
    ],
    "equipped":[0,1]
}