{
    "name":"Longsword",
    "category":"Weapon",
    "type":"Martial Melee",
    "cost": { "gp":15 },
    "damage": { "type":"slashing", "formula": {"d8":1} },
    "weight":3,
    "properties":[
        { "type":"versatile", "formula":{"d10":1} }
    ]
}