{
    "defaultSeverity": "error",
    "extends": [
        "tslint:recommended"
    ],
    "linterOptions": {
        "exclude": [
            "node_modules/**",
            "templates/**"
        ]
    },
    "rules": {
        "no-var-requires": false,
        "variable-name": false,
        "no-console": false,
        "no-duplicate-variable": true,
        "no-var-keyword": true,
        "triple-equals": true,
        "no-duplicate-imports": true,
        "prefer-const": true,
        "array-type": [true, "array"],
        "arrow-return-shorthand": true,
        "import-spacing": true,
        "no-consecutive-blank-lines": true,
        "newline-per-chained-call": true,
        "quotemark": [true, "single"],
        "indent": [true, "spaces", 2],
        "interface-name": false,
        "ordered-imports": true,
        "no-boolean-literal-compare": true,
        "object-literal-sort-keys": false,
        "no-trailing-whitespace": true,
        "return-undefined": false,
        "prefer-method-signature": true,
        "typedef": [
            true,
            "call-signature",
            "arrow-call-signature",
            "parameter", 
            "arrow-parameter",
            "property-declaration",
            "variable-declaration",
            "member-variable-declaration",
            "object-destructuring",
            "array-destructuring"
        ]
    }
}