{
  "QA_lstPexPain[C8]": {
    "red_x_points": [
      [0.00635, 0],
      [-0.00448, 2],
      [-0.00391, 2],
      [0.0058, 0],
      [-0.00443, 2],
      [-0.00574, 1],
      [-0.00959, 1],
      [-0.00946, 1],
      [-0.00676, 2],
      [-0.0056, 2],
      [-0.00878, 2],
      [-0.00456, 2],
      [-0.00839, 1],
      [0.00575, 0],
      [-0.00714, 1],
      [-0.00697, 1],
      [-0.00415, 2],
      [-0.00724, 2],
      [-0.00838, 2],
      [-0.00508, 2],
      [-0.01104, 1],
      [-0.0045, 1],
      [-0.0111, 1]
    ],
    "red_o_points": [],
    "y_categories": ["NORM", "NPV", "nan"],
    "blue_o_points": [],
    "blue_x_points": [
      [-0.00596, 1],
      [-0.00553, 1],
      [0.00855, 0],
      [0.00013, 1],
      [0.01421, 0],
      [0.01263, 0],
      [0.01151, 0],
      [0.00973, 0],
      [-0.00477, 2],
      [-0.00039, 2],
      [-0.00336, 2],
      [-0.00133, 1],
      [-0.00394, 2],
      [0.01123, 0],
      [0.01151, 0],
      [0.01148, 0],
      [-0.00392, 2],
      [0.01175, 0],
      [0.01184, 0],
      [0.0171, 0],
      [0.01694, 0]
    ]
  },
  "QA_lstPexPain[C7]": {
    "red_x_points": [
      [-0.00885, 1],
      [-0.00823, 2],
      [-0.00826, 2],
      [-0.00798, 1],
      [-0.00791, 2],
      [-0.00635, 1],
      [-0.00734, 1],
      [-0.00858, 1],
      [-0.00906, 2],
      [-0.00903, 2],
      [-0.01109, 2],
      [-0.00769, 2],
      [-0.00826, 1],
      [0.01276, 0],
      [-0.00819, 1],
      [-0.00695, 1],
      [-0.00701, 2],
      [-0.01077, 2],
      [-0.01067, 2],
      [-0.00815, 2],
      [-0.00901, 1],
      [-0.00566, 1],
      [-0.00824, 1]
    ],
    "red_o_points": [],
    "y_categories": ["NORM", "NPV", "nan"],
    "blue_o_points": [],
    "blue_x_points": [
      [-0.00623, 1],
      [-0.00637, 1],
      [0.01939, 0],
      [-0.0028, 1],
      [0.025, 0],
      [-0.004, 1],
      [0.02446, 0],
      [0.02348, 0],
      [-0.00815, 2],
      [-0.00453, 2],
      [-0.00759, 2],
      [-0.0044, 1],
      [-0.00696, 2],
      [0.02158, 0],
      [0.02205, 0],
      [0.02216, 0],
      [-0.0066, 2],
      [0.02184, 0],
      [0.02607, 0],
      [-0.00696, 1],
      [0.02909, 0]
    ]
  },
  "QA_lstPexTouch[C6]": {
    "red_x_points": [
      [-0.0059, 1],
      [-0.00255, 2],
      [-0.00336, 1],
      [-0.00314, 1],
      [-0.0023, 2],
      [-0.0025, 1],
      [-0.00259, 1],
      [-0.00518, 1],
      [-0.00294, 2],
      [-0.00255, 2],
      [-0.00435, 1],
      [-0.00196, 2],
      [-0.00411, 1],
      [-0.00413, 1],
      [-0.00595, 1],
      [-0.00258, 1],
      [-0.00174, 2],
      [-0.00531, 1],
      [-0.00315, 1],
      [-0.00391, 2],
      [-0.00512, 1],
      [-0.00176, 1],
      [-0.00486, 1]
    ],
    "red_o_points": [],
    "y_categories": ["NORM", "NPV", "nan"],
    "blue_o_points": [],
    "blue_x_points": [
      [-0.00332, 1],
      [-0.00353, 1],
      [0.01519, 0],
      [-0.00237, 1],
      [0.02651, 0],
      [-0.0027, 1],
      [-0.00221, 1],
      [-0.00254, 1],
      [-0.00069, 2],
      [0.00289, 2],
      [-0.00039, 2],
      [-0.00307, 1],
      [0.00069, 2],
      [-0.00287, 1],
      [-0.00244, 1],
      [0.0196, 0],
      [0.00044, 2],
      [0.01942, 0],
      [0.02927, 0],
      [-0.00289, 1],
      [-0.00306, 1]
    ]
  },
  "QS_equBpsurgTime": {
    "red_x_points": [
      [0.00068, 3],
      [-0.0112, 0],
      [-0.00024, 2],
      [-0.01279, 0],
      [-0.00843, 0],
      [-0.00165, 1],
      [-0.00071, 3],
      [-0.00088, 3],
      [0.0023, 3],
      [-0.00872, 1],
      [0.00023, 3],
      [0.00045, 2],
      [0.00044, 3],
      [-0.01302, 2],
      [-1e-5, 3],
      [-1e-5, 3],
      [-0.00544, 0],
      [0.00162, 3],
      [-0.01331, 0],
      [-0.00919, 0],
      [0.00022, 3],
      [-0.00163, 2],
      [0.0002, 3]
    ],
    "red_o_points": [],
    "y_categories": [
      "0 TO 6 MONTHS",
      "13 TO 24 MONTHS",
      "7 TO 12 MONTHS",
      "nan"
    ],
    "blue_o_points": [],
    "blue_x_points": [
      [0.00122, 3],
      [0.00115, 3],
      [0.00093, 0],
      [0.01404, 1],
      [0.00203, 3],
      [0.00942, 1],
      [0.00291, 0],
      [0.00611, 2],
      [0.00292, 3],
      [0.00232, 3],
      [0.01196, 2],
      [0.00953, 2],
      [0.00305, 3],
      [0.00169, 3],
      [0.00115, 3],
      [0.00093, 3],
      [0.00323, 3],
      [0.00136, 3],
      [0.0018, 3],
      [0.00162, 3],
      [0.00171, 3]
    ]
  },
  "QA_equInjTbpiTime": {
    "red_x_points": [
      [-0.01268, 0],
      [-0.01179, 0],
      [0.00179, 3],
      [0.00101, 3],
      [-0.00998, 0],
      [-0.0093, 0],
      [-0.00926, 0],
      [-0.01073, 0],
      [0.002, 3],
      [-0.0117, 0],
      [-0.01146, 0],
      [-0.01071, 0],
      [0.00047, 3],
      [0.00013, 3],
      [-0.01094, 0],
      [-0.00797, 0],
      [-0.01352, 2],
      [-0.02335, 2],
      [-0.01109, 0],
      [-0.01782, 2],
      [-0.01184, 0],
      [0.00164, 3],
      [0.01083, 1]
    ],
    "red_o_points": [],
    "y_categories": [
      "0 TO 6 MONTHS",
      "13 TO 24 MONTHS",
      "25 MONTHS OR MORE",
      "7 TO 12 MONTHS",
      "nan"
    ],
    "blue_o_points": [],
    "blue_x_points": [
      [-0.00666, 0],
      [0.02448, 1],
      [-0.00626, 0],
      [0.02711, 1],
      [0.00543, 3],
      [-0.00838, 0],
      [-0.0055, 0],
      [0.00426, 3],
      [-0.00716, 0],
      [-0.00245, 2],
      [0.03057, 1],
      [0.00711, 3],
      [0.02661, 1],
      [0.00405, 3],
      [0.02116, 1],
      [0.02273, 1],
      [0.00696, 3],
      [0.0218, 1],
      [0.00923, 3],
      [0.00677, 3],
      [-0.00559, 0]
    ]
  },
  "QA_lstPexInspectio[ScapulaAlata]": {
    "red_x_points": [
      [-0.0022, 1],
      [-0.00022, 1],
      [-0.00029, 1],
      [-0.0004, 1],
      [-0.00031, 1],
      [-0.00021, 1],
      [-0.00099, 1],
      [-0.00292, 1],
      [-0.0004, 1],
      [-0.00018, 1],
      [-0.00049, 1],
      [-0.00016, 1],
      [-0.00051, 1],
      [-0.00156, 1],
      [-0.00185, 1],
      [-0.0012, 1],
      [-0.00017, 1],
      [-0.00076, 1],
      [-0.00042, 1],
      [-0.00035, 1],
      [-0.00124, 1],
      [-0.00064, 1],
      [-0.00032, 1]
    ],
    "red_o_points": [],
    "y_categories": ["ABS", "NAIA", "PT", "nan"],
    "blue_o_points": [],
    "blue_x_points": [
      [-0.00064, 1],
      [-0.0004, 1],
      [-0.00025, 1],
      [-0.00031, 1],
      [-0.00049, 1],
      [-0.00043, 1],
      [-0.00031, 1],
      [-0.0004, 1],
      [-0.00022, 1],
      [-0.00083, 1],
      [-0.00016, 1],
      [-0.00033, 1],
      [-0.00022, 1],
      [0.00937, 0],
      [-0.00038, 1],
      [-0.00027, 1],
      [-0.00035, 1],
      [-0.00013, 1],
      [0.01515, 2],
      [-0.00041, 1],
      [-0.00019, 1]
    ]
  },
  "QA_yonInjFracture": {
    "red_x_points": [
      [0.00463, 0],
      [-0.00392, 2],
      [0.00307, 0],
      [-0.00584, 2],
      [-0.0098, 1],
      [-0.0125, 1],
      [0.00124, 0],
      [0.00248, 0],
      [-0.01427, 1],
      [-0.01097, 1],
      [0.00411, 0],
      [-0.00981, 1],
      [-0.01315, 1],
      [-0.00293, 0],
      [-0.01463, 1],
      [-0.01086, 1],
      [-0.00773, 1],
      [0.00289, 0],
      [0.0028, 0],
      [0.0046, 0],
      [-0.00927, 1],
      [-0.00688, 1],
      [-0.01963, 1]
    ],
    "red_o_points": [],
    "y_categories": ["N", "Y", "nan"],
    "blue_o_points": [],
    "blue_x_points": [
      [0.01097, 0],
      [0.01137, 0],
      [0.00255, 0],
      [0.00592, 0],
      [0.00929, 2],
      [0.00876, 0],
      [0.00295, 1],
      [0.00293, 1],
      [-0.00706, 1],
      [0.00908, 0],
      [0.01142, 0],
      [0.01013, 0],
      [0.00952, 0],
      [0.00262, 0],
      [0.00416, 0],
      [0.00589, 2],
      [0.01034, 0],
      [0.00488, 0],
      [0.00458, 0],
      [-0.003, 1],
      [0.00906, 2]
    ]
  },
  "QS_mulNeuromadSite[C8]": {
    "red_x_points": [
      [-0.00344, 1],
      [-0.00243, 0],
      [-0.00034, 0],
      [0.0006, 0],
      [-0.00145, 0],
      [0.00059, 0],
      [9e-5, 2],
      [-0.00433, 1],
      [0.00129, 2],
      [-0.00174, 0],
      [0.00063, 2],
      [-0.00246, 0],
      [8e-5, 2],
      [-0.00039, 0],
      [-0.00607, 1],
      [-6e-5, 2],
      [-0.00134, 0],
      [0.00019, 2],
      [-0.00042, 0],
      [-0.00246, 0],
      [-0.0048, 1],
      [0.00021, 0],
      [0.00014, 2]
    ],
    "red_o_points": [],
    "y_categories": ["N", "NOT APPLICABLE", "nan"],
    "blue_o_points": [],
    "blue_x_points": [
      [0.00133, 2],
      [0.00068, 2],
      [0.00087, 0],
      [0.00192, 0],
      [0.00051, 2],
      [0.00174, 0],
      [0.00072, 0],
      [0.00111, 0],
      [0.00215, 2],
      [0.00538, 1],
      [-0.00127, 0],
      [0.00249, 0],
      [0.00204, 2],
      [0.00077, 2],
      [0.00099, 2],
      [0.0007, 2],
      [0.00224, 2],
      [0.00076, 2],
      [0.00129, 1],
      [0.00092, 2],
      [0.00057, 2]
    ]
  },
  "QS_mulGraftNerve[Ph]": {
    "red_x_points": [
      [-0.00154, 1],
      [-0.00071, 0],
      [-0.00026, 0],
      [0.00044, 0],
      [-0.00039, 0],
      [0.00024, 0],
      [-0.00011, 2],
      [-0.00085, 1],
      [0.00052, 2],
      [-0.00054, 0],
      [0.00019, 2],
      [-0.00076, 0],
      [-8e-5, 2],
      [-7e-5, 0],
      [-0.00136, 1],
      [-6e-5, 2],
      [-0.00059, 0],
      [0.00016, 2],
      [-0.00012, 0],
      [-0.00078, 0],
      [-0.00087, 1],
      [0.0001, 0],
      [7e-5, 2]
    ],
    "red_o_points": [],
    "y_categories": ["N", "NOT APPLICABLE", "nan"],
    "blue_o_points": [],
    "blue_x_points": [
      [0.00017, 2],
      [4e-5, 2],
      [0.00016, 0],
      [0.00054, 0],
      [9e-5, 2],
      [0.00072, 0],
      [0.00012, 0],
      [0.00047, 0],
      [0.00054, 2],
      [0.00205, 1],
      [-0.0005, 0],
      [0.00064, 0],
      [0.00064, 2],
      [0.00017, 2],
      [0.00021, 2],
      [3e-5, 2],
      [0.00074, 2],
      [0.00016, 2],
      [0.00011, 1],
      [0.00019, 2],
      [0.00012, 2]
    ]
  },
  "QA_lstPexMuscstrength[FingersFlex]": {
    "red_x_points": [
      [0.00252, 2],
      [0.00231, 2],
      [-0.03006, 1],
      [0.00858, 0],
      [-0.02783, 1],
      [-0.03075, 1],
      [-0.03136, 1],
      [0.00888, 0],
      [0.00262, 2],
      [0.00217, 2],
      [0.00935, 0],
      [0.00247, 2],
      [-0.03245, 1],
      [0.00861, 0],
      [0.00889, 0],
      [-0.03063, 1],
      [-0.02707, 1],
      [0.00261, 2],
      [0.00868, 0],
      [0.00805, 0],
      [0.00228, 2],
      [-0.0268, 1],
      [0.00215, 2]
    ],
    "red_o_points": [],
    "y_categories": ["GREATER THAN OR EQUALS TO 3", "LESS THAN 3", "nan"],
    "blue_o_points": [],
    "blue_x_points": [
      [0.01197, 0],
      [0.01169, 0],
      [0.00882, 0],
      [0.00979, 0],
      [0.01085, 0],
      [0.0104, 0],
      [0.01028, 0],
      [0.00927, 0],
      [0.00329, 2],
      [0.00378, 2],
      [0.00404, 2],
      [0.00457, 2],
      [0.00359, 2],
      [0.00981, 0],
      [0.00982, 0],
      [0.0101, 0],
      [0.00401, 2],
      [0.0037, 2],
      [0.01013, 0],
      [0.00344, 2],
      [0.0034, 2]
    ]
  },
  "QA_lstPexPalle[Elbow]": {
    "red_x_points": [
      [-0.00133, 4],
      [-0.00136, 4],
      [-0.00131, 4],
      [0.01104, 3],
      [-0.00127, 4],
      [-0.00121, 4],
      [-0.01866, 1],
      [-0.01373, 1],
      [-0.00146, 4],
      [-0.00126, 4],
      [-0.00173, 4],
      [-0.00108, 4],
      [-0.00119, 4],
      [-0.01968, 1],
      [-0.00144, 4],
      [-0.02495, 0],
      [-0.02117, 2],
      [-0.00161, 4],
      [-0.00189, 4],
      [-0.00138, 4],
      [0.01092, 3],
      [-0.01996, 0],
      [-0.00142, 4]
    ],
    "red_o_points": [],
    "y_categories": ["ABS", "HYPO", "NAIA", "PT", "nan"],
    "blue_o_points": [],
    "blue_x_points": [
      [-0.00112, 4],
      [-0.00119, 4],
      [0.01536, 3],
      [0.01695, 3],
      [-0.00057, 4],
      [-0.00118, 4],
      [-0.00556, 1],
      [0.0172, 3],
      [-0.0012, 4],
      [-0.00099, 4],
      [-0.00115, 4],
      [-0.00082, 4],
      [-0.00123, 4],
      [0.01789, 3],
      [0.0169, 3],
      [0.01625, 3],
      [-0.00129, 4],
      [0.01677, 3],
      [-0.00064, 4],
      [0.01776, 3],
      [-0.00101, 4]
    ]
  },
  "QA_lstPexPain[T1]": {
    "red_x_points": [
      [-0.00711, 1],
      [-0.00314, 2],
      [-0.00377, 2],
      [0.00152, 0],
      [-0.003, 2],
      [-0.00127, 1],
      [-0.00152, 0],
      [0.00065, 0],
      [-0.00502, 2],
      [-0.00473, 2],
      [-0.00602, 2],
      [-0.00294, 2],
      [-0.00661, 1],
      [-0.01184, 1],
      [-0.00382, 1],
      [-0.0025, 1],
      [-0.00323, 2],
      [-0.00906, 2],
      [-0.00712, 2],
      [-0.00219, 2],
      [-0.00723, 1],
      [-0.00231, 1],
      [-0.00663, 1]
    ],
    "red_o_points": [],
    "y_categories": ["NORM", "NPV", "nan"],
    "blue_o_points": [],
    "blue_x_points": [
      [0.00183, 1],
      [-0.0008, 1],
      [0.00579, 0],
      [0.00313, 1],
      [0.0144, 0],
      [0.00102, 1],
      [0.01119, 0],
      [0.01137, 0],
      [-0.00158, 2],
      [0.00096, 2],
      [-0.00204, 2],
      [0.00076, 1],
      [-0.00171, 2],
      [0.00588, 0],
      [0.00573, 0],
      [0.0078, 0],
      [-0.00173, 2],
      [-0.0038, 1],
      [0.01125, 0],
      [0.01456, 0],
      [0.01487, 0]
    ]
  },
  "QA_lstPexMuscstrength[ScapulaAbducSuprot]": {
    "red_x_points": [
      [-0.00174, 2],
      [-0.00102, 2],
      [-0.00567, 1],
      [-0.00191, 2],
      [-0.00622, 1],
      [-0.00905, 1],
      [-0.01017, 1],
      [0.00328, 0],
      [-0.0014, 2],
      [-0.00161, 2],
      [-0.00499, 2],
      [-0.00017, 2],
      [-0.01177, 1],
      [-0.00272, 0],
      [0.00482, 0],
      [-0.01012, 1],
      [-0.00293, 1],
      [-0.00169, 2],
      [-0.00877, 1],
      [0.00232, 0],
      [-0.00137, 2],
      [-0.00375, 1],
      [-0.00718, 2]
    ],
    "red_o_points": [],
    "y_categories": ["GREATER THAN OR EQUALS TO 3", "LESS THAN 3", "nan"],
    "blue_o_points": [],
    "blue_x_points": [
      [0.02439, 0],
      [0.02055, 0],
      [0.00436, 0],
      [-0.00137, 1],
      [-0.00195, 1],
      [0.01165, 0],
      [0.00691, 0],
      [0.00079, 1],
      [-8e-5, 2],
      [0.00042, 2],
      [0.00107, 2],
      [0.00266, 2],
      [-0.00017, 2],
      [0.0064, 0],
      [0.00595, 0],
      [-0.00091, 2],
      [1e-5, 2],
      [0.00611, 0],
      [0.00075, 2],
      [-0.00264, 1],
      [-0.00105, 2]
    ]
  },
  "QA_lstPexMuscstrength[ElbowExte]": {
    "red_x_points": [
      [-0.00362, 2],
      [-0.00477, 2],
      [-0.004, 1],
      [-0.00342, 1],
      [-0.00658, 1],
      [-0.00295, 1],
      [-0.00361, 1],
      [0.00099, 0],
      [-0.0034, 2],
      [-0.0082, 2],
      [-0.00507, 1],
      [-0.00386, 2],
      [-0.00053, 1],
      [-0.00877, 1],
      [-0.00082, 0],
      [-0.00226, 1],
      [-0.00585, 1],
      [-0.00489, 0],
      [-0.00736, 1],
      [-0.00391, 2],
      [-0.00254, 2],
      [-0.00175, 1],
      [-0.00613, 2]
    ],
    "red_o_points": [],
    "y_categories": ["GREATER THAN OR EQUALS TO 3", "LESS THAN 3", "nan"],
    "blue_o_points": [],
    "blue_x_points": [
      [0.00013, 1],
      [0.00048, 1],
      [0.00802, 0],
      [-0.00273, 1],
      [-7e-5, 1],
      [0.01505, 0],
      [0.01524, 0],
      [-0.00213, 1],
      [0.00082, 2],
      [3e-5, 2],
      [0.02123, 0],
      [0.00105, 1],
      [0.00155, 2],
      [0.00719, 0],
      [0.00519, 0],
      [0.00792, 0],
      [0.00078, 2],
      [0.00427, 0],
      [0.00426, 0],
      [0.00237, 1],
      [0.00264, 1]
    ]
  },
  "QS_mulNeuromadSite[T2]": {
    "red_x_points": [
      [-0.00294, 1],
      [-0.00154, 0],
      [-0.00044, 0],
      [0.00023, 0],
      [-0.0012, 0],
      [0.00032, 0],
      [-0.00013, 2],
      [-0.00218, 1],
      [0.00101, 2],
      [-0.00101, 0],
      [0.00017, 2],
      [-0.00116, 0],
      [0.00013, 2],
      [9e-5, 0],
      [-0.0035, 1],
      [1e-5, 2],
      [-0.00127, 0],
      [5e-5, 2],
      [-0.00059, 0],
      [-0.00145, 0],
      [-0.00202, 1],
      [0.00023, 0],
      [8e-5, 2]
    ],
    "red_o_points": [],
    "y_categories": ["N", "NOT APPLICABLE", "nan"],
    "blue_o_points": [],
    "blue_x_points": [
      [0.00045, 2],
      [0.00031, 2],
      [0.00049, 0],
      [0.00124, 0],
      [0.00013, 2],
      [0.00126, 0],
      [0.00065, 0],
      [0.00063, 0],
      [0.00103, 2],
      [0.00448, 1],
      [-0.00047, 0],
      [0.00181, 0],
      [0.00125, 2],
      [0.00042, 2],
      [0.00042, 2],
      [0.00027, 2],
      [0.0012, 2],
      [0.0005, 2],
      [0.0001, 1],
      [0.00069, 2],
      [0.00026, 2]
    ]
  },
  "QA_mulInjOrthesisType[ArmSling]": {
    "red_x_points": [
      [-0.00708, 2],
      [-0.00814, 2],
      [-0.00409, 2],
      [-0.00273, 2],
      [-0.00502, 2],
      [-0.00253, 2],
      [-0.00161, 2],
      [-0.00211, 1],
      [-0.00929, 2],
      [-0.00784, 2],
      [-0.00516, 2],
      [-0.02394, 0],
      [-0.00658, 3],
      [-0.00194, 2],
      [-0.00029, 1],
      [-0.00171, 2],
      [-0.01307, 3],
      [-0.00789, 2],
      [-0.00485, 2],
      [-0.0058, 2],
      [-0.00869, 3],
      [-0.00156, 2],
      [-0.00533, 2]
    ],
    "red_o_points": [],
    "y_categories": ["N", "NOT APPLICABLE", "Y", "nan"],
    "blue_o_points": [],
    "blue_x_points": [
      [-0.0013, 2],
      [-0.0012, 2],
      [7e-5, 2],
      [-0.0004, 2],
      [-0.00198, 2],
      [-0.00109, 2],
      [-0.0005, 2],
      [-0.00096, 2],
      [0.04058, 1],
      [0.03115, 1],
      [-0.00627, 2],
      [0.02529, 1],
      [0.03129, 1],
      [-0.00059, 2],
      [0.00632, 0],
      [-0.0013, 2],
      [-0.00726, 2],
      [0.01108, 1],
      [0.0139, 1],
      [-0.00295, 2],
      [0.00339, 3]
    ]
  },
  "QS_mulGraftNerve[Ssr]": {
    "red_x_points": [
      [-0.00113, 1],
      [-0.00026, 0],
      [-5e-5, 0],
      [0.00025, 0],
      [-0.00013, 0],
      [5e-5, 0],
      [6e-5, 2],
      [-0.00068, 1],
      [0.00022, 2],
      [-0.00014, 0],
      [7e-5, 2],
      [-0.00021, 0],
      [5e-5, 2],
      [-0.00044, 0],
      [-0.00101, 1],
      [2e-5, 2],
      [-0.00024, 0],
      [-3e-5, 2],
      [3e-5, 0],
      [-0.00053, 0],
      [-0.00043, 1],
      [0.00015, 0],
      [-4e-5, 2]
    ],
    "red_o_points": [],
    "y_categories": ["N", "NOT APPLICABLE", "nan"],
    "blue_o_points": [],
    "blue_x_points": [
      [0.00016, 2],
      [4e-5, 2],
      [0.00023, 0],
      [0.00019, 0],
      [9e-5, 2],
      [0.00041, 0],
      [0.00025, 0],
      [0.00023, 0],
      [0.00022, 2],
      [0.00109, 1],
      [-1e-5, 0],
      [0.00037, 0],
      [0.00013, 2],
      [0.00024, 2],
      [9e-5, 2],
      [1e-5, 2],
      [0.00023, 2],
      [8e-5, 2],
      [0.00018, 1],
      [9e-5, 2],
      [9e-5, 2]
    ]
  },
  "QA_lstPexKine[Shoulder]": {
    "red_x_points": [
      [0.00154, 1],
      [-0.00109, 2],
      [-0.00363, 2],
      [0.00216, 1],
      [-0.0019, 2],
      [-0.01273, 0],
      [0.00127, 1],
      [0.00101, 1],
      [-0.00123, 2],
      [0.00254, 1],
      [-0.00202, 2],
      [-0.00077, 2],
      [-0.00162, 2],
      [-0.03071, 0],
      [0.00128, 1],
      [0.00112, 1],
      [-0.00123, 2],
      [-0.00222, 2],
      [-0.00701, 2],
      [-0.00118, 2],
      [-0.00107, 2],
      [0.00147, 1],
      [-0.00207, 2]
    ],
    "red_o_points": [],
    "y_categories": ["NPV", "PV", "nan"],
    "blue_o_points": [],
    "blue_x_points": [
      [0.00419, 1],
      [-0.00098, 2],
      [0.00494, 1],
      [0.00787, 1],
      [-0.00011, 2],
      [0.00746, 1],
      [0.00776, 1],
      [0.00703, 1],
      [-0.00041, 2],
      [-0.00028, 2],
      [-0.00139, 2],
      [0.00788, 1],
      [-0.0005, 2],
      [0.00378, 1],
      [0.00317, 1],
      [0.00061, 0],
      [-0.0004, 2],
      [0.0022, 1],
      [-0.00042, 2],
      [0.00327, 1],
      [0.00241, 1]
    ]
  },
  "participant_code": {
    "red_x_points": [
      [-0.04312, 0],
      [-0.04205, 2],
      [-0.04283, 3],
      [-0.0406, 4],
      [-0.04069, 5],
      [-0.04332, 9],
      [-0.04196, 14],
      [-0.04303, 17],
      [-0.04108, 19],
      [-0.04089, 20],
      [-0.0439, 22],
      [-0.04361, 23],
      [-0.04419, 24],
      [-0.04205, 26],
      [-0.04312, 28],
      [-0.04176, 29],
      [-0.04099, 31],
      [-0.04235, 35],
      [-0.04215, 37],
      [-0.04322, 39],
      [-0.04186, 41],
      [-0.04244, 42],
      [-0.04254, 43]
    ],
    "red_o_points": [],
    "y_categories": [
      "P16554",
      "P18297",
      "P19283",
      "P19287",
      "P23172",
      "P23391",
      "P30595",
      "P31645",
      "P31691",
      "P34778",
      "P35046",
      "P36328",
      "P43633",
      "P4544",
      "P46417",
      "P48965",
      "P53068",
      "P5497",
      "P58556",
      "P59529",
      "P62483",
      "P64658",
      "P65202",
      "P66816",
      "P67052",
      "P6751",
      "P7408",
      "P75566",
      "P76226",
      "P79971",
      "P82621",
      "P82990",
      "P84549",
      "P84932",
      "P85825",
      "P86989",
      "P8770",
      "P87791",
      "P90550",
      "P93159",
      "P94969",
      "P96710",
      "P9744",
      "P98500",
      "nan"
    ],
    "blue_o_points": [],
    "blue_x_points": [
      [0.04545, 1],
      [0.04566, 6],
      [0.04802, 7],
      [0.04648, 8],
      [0.04587, 10],
      [0.04648, 11],
      [0.04638, 12],
      [0.04597, 13],
      [0.0473, 15],
      [0.04597, 16],
      [0.04648, 18],
      [0.04689, 21],
      [0.0473, 25],
      [0.04617, 27],
      [0.04504, 30],
      [0.04628, 32],
      [0.04648, 33],
      [0.04792, 34],
      [0.04576, 36],
      [0.04617, 38],
      [0.04566, 40]
    ]
  },
  "QA_mulInjOrthesisType[ShoulderSupport]": {
    "red_x_points": [
      [-0.00648, 0],
      [-0.0077, 0],
      [-0.00397, 0],
      [-0.01559, 2],
      [-0.00474, 0],
      [-0.0023, 0],
      [-0.00227, 0],
      [-0.0009, 1],
      [-0.0092, 0],
      [-0.00655, 0],
      [-0.00545, 0],
      [-0.01635, 2],
      [-0.00967, 3],
      [-0.00167, 0],
      [-0.00121, 1],
      [-0.0022, 0],
      [-0.01017, 3],
      [-0.00879, 0],
      [-0.00406, 0],
      [-0.0057, 0],
      [-0.0079, 3],
      [-0.00108, 0],
      [-0.00541, 0]
    ],
    "red_o_points": [],
    "y_categories": ["N", "NOT APPLICABLE", "Y", "nan"],
    "blue_o_points": [],
    "blue_x_points": [
      [-0.00249, 0],
      [-0.00153, 0],
      [0.00082, 0],
      [0.00122, 0],
      [0.0132, 2],
      [-2e-5, 0],
      [0.0002, 0],
      [0.00137, 0],
      [0.03644, 1],
      [0.02752, 1],
      [-0.00537, 0],
      [0.02266, 1],
      [0.02528, 1],
      [-0.0009, 0],
      [0.00554, 2],
      [-0.00063, 0],
      [-0.00718, 0],
      [0.0104, 1],
      [0.0103, 1],
      [-0.00139, 0],
      [0.00392, 3]
    ]
  },
  "QA_lstPexPain[C6]": {
    "red_x_points": [
      [-0.00071, 1],
      [-0.00355, 2],
      [-0.00359, 2],
      [-0.00092, 1],
      [-0.00292, 2],
      [-0.00036, 1],
      [-0.0009, 1],
      [-0.00071, 1],
      [-0.00576, 2],
      [-0.00332, 2],
      [-0.00628, 2],
      [-0.00258, 2],
      [-0.0015, 1],
      [-0.00279, 1],
      [-0.00038, 1],
      [-0.00109, 1],
      [-0.00281, 2],
      [-0.00697, 2],
      [-0.00509, 2],
      [-0.00339, 2],
      [-0.00109, 1],
      [-0.00042, 1],
      [-0.00143, 1]
    ],
    "red_o_points": [],
    "y_categories": ["NORM", "NPV", "nan"],
    "blue_o_points": [],
    "blue_x_points": [
      [7e-5, 1],
      [8e-5, 1],
      [0.01113, 0],
      [-0.00013, 1],
      [0.01998, 0],
      [0.00018, 1],
      [3e-5, 1],
      [-0.00015, 1],
      [-0.00313, 2],
      [-0.00248, 2],
      [-0.00253, 2],
      [-0.00029, 1],
      [-0.00276, 2],
      [0.01476, 0],
      [-0.00044, 1],
      [0.01483, 0],
      [-0.00298, 2],
      [0.01327, 0],
      [-0.00027, 1],
      [-0.00058, 1],
      [-5e-5, 1]
    ]
  },
  "QA_lstPexArthre[Shoulder]": {
    "red_x_points": [
      [0.00495, 2],
      [-0.00238, 3],
      [-0.00358, 3],
      [0.00616, 2],
      [-0.01414, 0],
      [-0.01831, 1],
      [0.00678, 2],
      [0.00607, 2],
      [-0.00232, 3],
      [0.00452, 2],
      [-0.0028, 3],
      [-0.00202, 3],
      [-0.00352, 3],
      [-0.03027, 1],
      [0.00534, 2],
      [-0.01658, 1],
      [-0.00206, 3],
      [-0.00341, 3],
      [-0.0061, 3],
      [-0.00195, 3],
      [-0.00302, 3],
      [-0.01314, 1],
      [-0.00364, 3]
    ],
    "red_o_points": [],
    "y_categories": ["NAIA", "NPV", "PV", "nan"],
    "blue_o_points": [],
    "blue_x_points": [
      [0.01114, 2],
      [-0.00236, 3],
      [0.00769, 2],
      [0.01003, 2],
      [-0.00089, 3],
      [0.01162, 2],
      [0.01058, 2],
      [0.00966, 2],
      [-0.00151, 3],
      [-0.00112, 3],
      [-0.00112, 3],
      [0.01202, 2],
      [-0.00127, 3],
      [0.00766, 2],
      [0.00636, 2],
      [-0.00196, 1],
      [-0.00103, 3],
      [0.00547, 2],
      [-0.00073, 3],
      [0.00862, 2],
      [0.00657, 2]
    ]
  },
  "QS_mulGraftTrunk[UpperTrunk]": {
    "red_x_points": [
      [-0.00909, 1],
      [-0.00485, 0],
      [-0.00172, 0],
      [0.00061, 0],
      [-0.00346, 0],
      [0.00091, 0],
      [0.00066, 3],
      [-0.00833, 1],
      [0.00416, 3],
      [-0.02456, 2],
      [0.00116, 3],
      [-0.00442, 0],
      [0.0006, 3],
      [-0.00024, 0],
      [-0.01049, 1],
      [0.0007, 3],
      [-0.00359, 0],
      [0.00199, 3],
      [-0.00147, 0],
      [-0.00465, 0],
      [-0.00744, 1],
      [0.00053, 0],
      [0.00085, 3]
    ],
    "red_o_points": [],
    "y_categories": ["N", "NOT APPLICABLE", "Y", "nan"],
    "blue_o_points": [],
    "blue_x_points": [
      [0.00279, 3],
      [0.00152, 3],
      [0.00193, 0],
      [0.00299, 0],
      [0.00121, 3],
      [0.00484, 0],
      [0.00339, 0],
      [0.00184, 0],
      [0.00604, 3],
      [0.01384, 1],
      [-0.00141, 0],
      [0.00601, 0],
      [0.0055, 3],
      [0.00213, 3],
      [0.00213, 3],
      [0.00103, 3],
      [0.00597, 3],
      [0.00199, 3],
      [0.00174, 1],
      [0.00348, 3],
      [0.00318, 3]
    ]
  },
  "QS_mulTransfSite[PhMc]": {
    "red_x_points": [
      [-0.00735, 1],
      [-0.00401, 0],
      [-0.00045, 0],
      [0.0019, 0],
      [-0.00283, 0],
      [-0.01448, 2],
      [0.00068, 3],
      [-0.00841, 1],
      [0.00283, 3],
      [-0.00332, 0],
      [0.00157, 3],
      [-0.0028, 0],
      [0.00145, 3],
      [0.00049, 0],
      [-0.01073, 1],
      [0.00086, 3],
      [-0.00801, 2],
      [0.00162, 3],
      [-0.00111, 0],
      [-0.00387, 0],
      [-0.00873, 1],
      [0.0021, 0],
      [0.00132, 3]
    ],
    "red_o_points": [],
    "y_categories": ["N", "NOT APPLICABLE", "Y", "nan"],
    "blue_o_points": [],
    "blue_x_points": [
      [0.00321, 3],
      [0.00216, 3],
      [0.00111, 0],
      [0.00454, 0],
      [0.00138, 3],
      [0.00582, 0],
      [0.00219, 0],
      [0.00262, 0],
      [0.00426, 3],
      [0.00985, 1],
      [-0.00134, 0],
      [0.00594, 0],
      [0.00393, 3],
      [0.00132, 3],
      [0.0018, 3],
      [0.00103, 3],
      [0.00422, 3],
      [0.00152, 3],
      [0.00113, 1],
      [0.00269, 3],
      [0.00191, 3]
    ]
  },
  "QA_yonPexPain": {
    "red_x_points": [
      [-0.01485, 1],
      [-0.01466, 1],
      [-0.01355, 1],
      [-0.01387, 1],
      [-0.01432, 1],
      [-0.01322, 1],
      [-0.01304, 1],
      [-0.01275, 1],
      [-0.01547, 1],
      [-0.01481, 1],
      [0.01773, 0],
      [-0.014, 1],
      [-0.01396, 1],
      [-0.01403, 1],
      [0.01786, 0],
      [-0.01323, 1],
      [-0.0138, 1],
      [-0.01531, 1],
      [-0.01515, 1],
      [-0.01468, 1],
      [-0.01424, 1],
      [-0.01279, 1],
      [-0.01612, 1]
    ],
    "red_o_points": [],
    "y_categories": ["N", "Y", "nan"],
    "blue_o_points": [],
    "blue_x_points": [
      [-0.01312, 1],
      [0.02688, 0],
      [0.02306, 0],
      [0.02541, 0],
      [-0.01266, 1],
      [0.02648, 0],
      [-0.01311, 1],
      [-0.01282, 1],
      [-0.0137, 1],
      [0.03801, 2],
      [0.02965, 0],
      [-0.01393, 1],
      [0.02725, 0],
      [0.02391, 0],
      [0.02324, 0],
      [0.02383, 0],
      [0.0402, 2],
      [0.02523, 0],
      [-0.01166, 1],
      [-0.0139, 1],
      [0.03401, 2]
    ]
  },
  "QS_mulGraftLevel[Trunk]": {
    "red_x_points": [
      [-0.00601, 1],
      [-0.00379, 0],
      [-0.001, 0],
      [0.00101, 0],
      [-0.00304, 0],
      [0.00066, 0],
      [0.00039, 3],
      [-0.00748, 1],
      [0.00289, 3],
      [-0.01612, 2],
      [0.00126, 3],
      [-0.00406, 0],
      [0.00042, 3],
      [-0.00031, 0],
      [-0.00862, 1],
      [0.00037, 3],
      [-0.00293, 0],
      [0.00086, 3],
      [-0.0007, 0],
      [-0.00457, 0],
      [-0.00604, 1],
      [0.00056, 0],
      [0.00065, 3]
    ],
    "red_o_points": [],
    "y_categories": ["N", "NOT APPLICABLE", "Y", "nan"],
    "blue_o_points": [],
    "blue_x_points": [
      [0.00262, 3],
      [0.00109, 3],
      [0.00161, 0],
      [0.00289, 0],
      [0.00089, 3],
      [0.00379, 0],
      [0.00269, 0],
      [0.00198, 0],
      [0.00481, 3],
      [0.01235, 1],
      [-0.00119, 0],
      [0.00379, 0],
      [0.00443, 3],
      [0.00139, 3],
      [0.00162, 3],
      [0.0006, 3],
      [0.00429, 3],
      [0.00107, 3],
      [0.00127, 1],
      [0.00201, 3],
      [0.00161, 3]
    ]
  },
  "QS_mulGraftNerve[FI]": {
    "red_x_points": [
      [-0.0009, 1],
      [-0.00025, 0],
      [5e-5, 0],
      [-2e-5, 0],
      [0.00012, 0],
      [-2e-5, 2],
      [-0.00117, 1],
      [0.00016, 2],
      [-8e-5, 0],
      [-2e-5, 2],
      [-0.00038, 0],
      [-4e-5, 2],
      [3e-5, 0],
      [-0.0014, 1],
      [-6e-5, 2],
      [-0.0002, 0],
      [0.0, 2],
      [-1e-5, 0],
      [-0.00042, 0],
      [-0.00049, 1],
      [7e-5, 0],
      [-5e-5, 2]
    ],
    "red_o_points": [],
    "y_categories": ["N", "NOT APPLICABLE", "nan"],
    "blue_o_points": [],
    "blue_x_points": [
      [0.00039, 2],
      [0.00019, 2],
      [6e-5, 0],
      [0.00024, 0],
      [0.00016, 2],
      [0.00053, 0],
      [0.00024, 0],
      [0.00028, 0],
      [0.00016, 2],
      [0.00063, 1],
      [-9e-5, 0],
      [0.00041, 0],
      [9e-5, 2],
      [0.00028, 2],
      [0.00029, 2],
      [2e-5, 2],
      [8e-5, 2],
      [0.00023, 2],
      [0.00039, 1],
      [0.00027, 2],
      [0.00023, 2]
    ]
  },
  "QS_mulGraftNerve[other]": {
    "red_x_points": [
      [-0.00234, 1],
      [-0.00178, 0],
      [-0.00057, 0],
      [0.00015, 0],
      [-0.00138, 0],
      [0.00016, 0],
      [-0.00021, 2],
      [-0.00346, 1],
      [0.00084, 2],
      [-0.00147, 0],
      [0.00044, 2],
      [-0.00113, 0],
      [0.00017, 2],
      [0.00026, 0],
      [-0.00491, 1],
      [6e-5, 2],
      [-0.00102, 0],
      [0.00046, 2],
      [-0.00053, 0],
      [-0.00132, 0],
      [-0.00315, 1],
      [0.00022, 0],
      [0.00016, 2]
    ],
    "red_o_points": [],
    "y_categories": ["N", "NOT APPLICABLE", "nan"],
    "blue_o_points": [],
    "blue_x_points": [
      [0.00079, 2],
      [0.00053, 2],
      [0.00059, 0],
      [0.00114, 0],
      [0.00013, 2],
      [0.00152, 0],
      [0.00074, 0],
      [0.00056, 0],
      [0.00134, 2],
      [0.00456, 1],
      [-0.00089, 0],
      [0.00192, 0],
      [0.00135, 2],
      [0.00086, 2],
      [0.00084, 2],
      [0.00038, 2],
      [0.00158, 2],
      [0.00076, 2],
      [0.0003, 1],
      [0.0009, 2],
      [0.00046, 2]
    ]
  },
  "QS_mulBpsurgeryType[Graft]": {
    "red_x_points": [
      [-0.0032, 1],
      [-0.00233, 0],
      [-0.00113, 0],
      [0.0002, 0],
      [-0.00148, 0],
      [0.0001, 0],
      [0.00025, 3],
      [-0.00282, 1],
      [0.00166, 3],
      [-0.01559, 2],
      [0.00091, 3],
      [-0.0017, 0],
      [0.00025, 3],
      [0.00042, 0],
      [-0.00397, 1],
      [0.00022, 3],
      [-0.00162, 0],
      [0.00093, 3],
      [-0.00053, 0],
      [-0.00205, 0],
      [-0.00245, 1],
      [0.00013, 0],
      [0.00069, 3]
    ],
    "red_o_points": [],
    "y_categories": ["N", "NOT APPLICABLE", "Y", "nan"],
    "blue_o_points": [],
    "blue_x_points": [
      [0.00099, 3],
      [0.00048, 3],
      [0.001, 0],
      [0.00156, 0],
      [0.00037, 3],
      [0.00218, 0],
      [0.00202, 0],
      [0.00121, 0],
      [0.0029, 3],
      [0.00613, 1],
      [-9e-5, 0],
      [0.00279, 0],
      [0.00275, 3],
      [0.00038, 3],
      [0.00054, 3],
      [0.00032, 3],
      [0.00275, 3],
      [0.00118, 3],
      [0.00082, 1],
      [0.0011, 3],
      [0.00173, 3]
    ]
  },
  "QS_mulGraftNerve[Ax]": {
    "red_x_points": [
      [-0.00116, 1],
      [-0.00091, 0],
      [-0.00029, 0],
      [-0.00012, 0],
      [-0.00031, 0],
      [0.00027, 0],
      [-3e-5, 2],
      [-0.00134, 1],
      [0.00057, 2],
      [-0.00054, 0],
      [0.00023, 2],
      [-0.001, 0],
      [8e-5, 2],
      [-0.00013, 0],
      [-0.00272, 1],
      [0.00013, 2],
      [-0.00056, 0],
      [0.0, 2],
      [-0.00023, 0],
      [-0.00105, 0],
      [-0.00225, 1],
      [-7e-5, 0],
      [-0.00015, 2]
    ],
    "red_o_points": [],
    "y_categories": ["N", "NOT APPLICABLE", "nan"],
    "blue_o_points": [],
    "blue_x_points": [
      [0.00055, 2],
      [0.0004, 2],
      [0.00032, 0],
      [0.00055, 0],
      [0.00019, 2],
      [0.00088, 0],
      [0.00037, 0],
      [0.00026, 0],
      [0.00074, 2],
      [0.00234, 1],
      [-0.0004, 0],
      [0.00114, 0],
      [0.00068, 2],
      [0.00057, 2],
      [0.00042, 2],
      [0.00027, 2],
      [0.00093, 2],
      [0.00018, 2],
      [0.00031, 1],
      [0.0005, 2],
      [0.00035, 2]
    ]
  },
  "QA_lstPexMuscstrength[WristFlex]": {
    "red_x_points": [
      [-0.00106, 0],
      [-0.00205, 2],
      [-0.01028, 1],
      [0.00112, 0],
      [-0.00641, 1],
      [-0.01191, 1],
      [-0.00196, 0],
      [-0.00036, 0],
      [-0.0017, 2],
      [-0.00368, 2],
      [-0.00123, 0],
      [-0.00245, 2],
      [-0.00669, 1],
      [0.00122, 0],
      [0.00057, 0],
      [-0.00245, 1],
      [-0.00607, 1],
      [-0.00382, 0],
      [0.00227, 0],
      [0.00124, 0],
      [-0.00213, 2],
      [-0.00784, 1],
      [-0.00444, 2]
    ],
    "red_o_points": [],
    "y_categories": ["GREATER THAN OR EQUALS TO 3", "LESS THAN 3", "nan"],
    "blue_o_points": [],
    "blue_x_points": [
      [0.00528, 1],
      [0.00594, 0],
      [0.00174, 0],
      [0.0056, 0],
      [0.00316, 0],
      [0.00518, 0],
      [0.00374, 0],
      [0.00361, 0],
      [0.00159, 2],
      [0.00063, 2],
      [0.0062, 0],
      [0.00778, 0],
      [0.0013, 2],
      [0.00059, 0],
      [0.00067, 0],
      [0.00204, 0],
      [0.0023, 2],
      [0.00407, 1],
      [0.00077, 0],
      [0.00691, 1],
      [0.001, 2]
    ]
  },
  "QS_mulNeuromadSite[C5]": {
    "red_x_points": [
      [-0.0025, 1],
      [-0.00182, 0],
      [-0.00013, 0],
      [0.00034, 0],
      [-0.00073, 0],
      [0.0001, 0],
      [1e-5, 2],
      [-0.00206, 1],
      [0.00075, 2],
      [-0.00076, 0],
      [0.00026, 2],
      [-0.00122, 0],
      [-5e-5, 2],
      [-0.00012, 0],
      [-0.00241, 1],
      [-6e-5, 2],
      [-0.00109, 0],
      [-4e-5, 2],
      [-0.00054, 0],
      [-0.00154, 0],
      [-0.00137, 1],
      [6e-5, 0],
      [-6e-5, 2]
    ],
    "red_o_points": [],
    "y_categories": ["N", "NOT APPLICABLE", "nan"],
    "blue_o_points": [],
    "blue_x_points": [
      [0.00065, 2],
      [0.00012, 2],
      [0.00069, 0],
      [0.00076, 0],
      [7e-5, 2],
      [0.00081, 0],
      [0.00052, 0],
      [0.00039, 0],
      [0.00113, 2],
      [0.00408, 1],
      [-0.00047, 0],
      [0.00098, 0],
      [0.00118, 2],
      [0.00046, 2],
      [0.00048, 2],
      [0.00016, 2],
      [0.00118, 2],
      [0.00042, 2],
      [0.00023, 1],
      [0.00048, 2],
      [0.00066, 2]
    ]
  },
  "QS_mulNeuromadSite[C7]": {
    "red_x_points": [
      [-0.00787, 1],
      [-0.0043, 0],
      [-0.00184, 0],
      [0.00021, 0],
      [-0.00357, 0],
      [0.00088, 0],
      [-5e-5, 2],
      [-0.01068, 1],
      [0.00241, 2],
      [-0.00319, 0],
      [0.0009, 2],
      [-0.00383, 0],
      [0.00052, 2],
      [-0.00015, 0],
      [-0.01234, 1],
      [0.00032, 2],
      [-0.00328, 0],
      [0.00056, 2],
      [-0.00115, 0],
      [-0.00476, 0],
      [-0.00903, 1],
      [0.00051, 0],
      [0.00022, 2]
    ],
    "red_o_points": [],
    "y_categories": ["N", "NOT APPLICABLE", "nan"],
    "blue_o_points": [],
    "blue_x_points": [
      [0.0026, 2],
      [0.00179, 2],
      [0.00222, 0],
      [0.00337, 0],
      [0.00082, 2],
      [0.00447, 0],
      [0.00206, 0],
      [0.00161, 0],
      [0.00407, 2],
      [0.01263, 1],
      [-0.00127, 0],
      [0.00365, 0],
      [0.00364, 2],
      [0.00213, 2],
      [0.00245, 2],
      [0.00132, 2],
      [0.00416, 2],
      [0.00256, 2],
      [0.00139, 1],
      [0.00264, 2],
      [0.00123, 2]
    ]
  },
  "QS_mulGraftNerve[TD]": {
    "red_x_points": [
      [-0.00087, 1],
      [-0.00042, 0],
      [-5e-5, 0],
      [7e-5, 0],
      [-0.00016, 0],
      [2e-5, 0],
      [4e-5, 2],
      [-0.00051, 1],
      [0.00038, 2],
      [-0.00058, 0],
      [3e-5, 2],
      [-0.0005, 0],
      [-1e-5, 2],
      [0.00012, 0],
      [-0.00113, 1],
      [8e-5, 2],
      [-0.00031, 0],
      [0.00012, 2],
      [-0.00023, 0],
      [-0.00049, 0],
      [-0.00082, 1],
      [0.00013, 0],
      [-0.00012, 2]
    ],
    "red_o_points": [],
    "y_categories": ["N", "NOT APPLICABLE", "nan"],
    "blue_o_points": [],
    "blue_x_points": [
      [0.0003, 2],
      [9e-5, 2],
      [0.00015, 0],
      [0.00032, 0],
      [0.0001, 2],
      [0.00024, 0],
      [7e-5, 0],
      [0.00011, 0],
      [0.00036, 2],
      [0.00117, 1],
      [-0.00028, 0],
      [0.00065, 0],
      [0.00047, 2],
      [0.00016, 2],
      [8e-5, 2],
      [0.00015, 2],
      [0.00043, 2],
      [9e-5, 2],
      [0.00015, 1],
      [0.00034, 2],
      [4e-5, 2]
    ]
  },
  "QA_intPexForearmSupin": {
    "red_x_points": [
      [-0.00041, 2],
      [-0.00804, 0],
      [-0.00102, 2],
      [-0.00068, 2],
      [-0.00086, 2],
      [-0.0007, 2],
      [-0.02195, 0],
      [-0.01558, 0],
      [-0.0006, 2],
      [-0.00032, 2],
      [-0.00112, 2],
      [-0.00011, 2],
      [-0.00128, 2],
      [0.00582, 1],
      [-0.00077, 2],
      [-0.01692, 0],
      [0.00063, 1],
      [-0.00093, 2],
      [-0.00109, 2],
      [-0.00045, 2],
      [0.00478, 1],
      [-0.0117, 0],
      [-0.00122, 2]
    ],
    "red_o_points": [],
    "y_categories": ["GREATER THAN OR EQUALS TO 80", "LESS THAN 80", "nan"],
    "blue_o_points": [],
    "blue_x_points": [
      [-4e-5, 2],
      [0.01626, 1],
      [0.0054, 1],
      [0.01295, 1],
      [0.01009, 1],
      [-0.00015, 2],
      [-0.00013, 2],
      [-0.00023, 2],
      [-0.00014, 2],
      [-8e-5, 2],
      [0.00212, 0],
      [-3e-5, 2],
      [-0.00016, 2],
      [0.00861, 1],
      [0.00833, 1],
      [-0.00017, 2],
      [-0.00037, 2],
      [-0.00015, 2],
      [9e-5, 2],
      [0.01236, 1],
      [-3e-5, 2]
    ]
  },
  "QA_lstPexTinel[TinelSign]": {
    "red_x_points": [
      [0.00084, 1],
      [0.00015, 1],
      [-0.00978, 2],
      [0.00153, 1],
      [0.00045, 1],
      [0.00119, 1],
      [-0.01443, 2],
      [-0.01253, 2],
      [-0.00361, 1],
      [-0.00019, 1],
      [-0.01617, 2],
      [-0.00809, 2],
      [-0.00034, 1],
      [-0.01535, 2],
      [0.002, 1],
      [-0.01213, 2],
      [0.00056, 1],
      [-0.00153, 1],
      [-0.01288, 2],
      [-0.00938, 2],
      [-0.00041, 1],
      [-0.00766, 2],
      [-0.00161, 1]
    ],
    "red_o_points": [],
    "y_categories": ["ABS", "NAIA", "PT", "nan"],
    "blue_o_points": [],
    "blue_x_points": [
      [0.00677, 1],
      [0.03686, 0],
      [0.01687, 0],
      [-0.00737, 2],
      [0.00424, 1],
      [0.00488, 1],
      [-0.0075, 2],
      [0.00526, 1],
      [0.00419, 2],
      [0.00145, 1],
      [0.00559, 1],
      [0.00454, 1],
      [0.00127, 1],
      [0.022, 0],
      [0.00447, 1],
      [0.00365, 1],
      [0.00048, 2],
      [0.00239, 1],
      [0.00513, 1],
      [0.00221, 1],
      [0.00196, 1]
    ]
  },
  "QA_lstPexTouch[C5]": {
    "red_x_points": [
      [-0.00206, 0],
      [-0.00073, 2],
      [-0.00162, 1],
      [-0.00096, 1],
      [-0.00097, 2],
      [-0.00047, 1],
      [-0.00151, 1],
      [-0.00388, 1],
      [-0.00043, 2],
      [-0.00091, 2],
      [-0.0028, 1],
      [-0.00031, 2],
      [-0.00317, 1],
      [-0.00151, 1],
      [-0.00382, 1],
      [-0.00127, 1],
      [-0.00101, 2],
      [-0.0041, 1],
      [-0.00168, 1],
      [-0.00095, 2],
      [-0.00198, 1],
      [-0.0003, 1],
      [-0.00336, 1]
    ],
    "red_o_points": [],
    "y_categories": ["NORM", "NPV", "nan"],
    "blue_o_points": [],
    "blue_x_points": [
      [-0.00123, 1],
      [-0.00221, 1],
      [-0.00041, 1],
      [-0.00053, 1],
      [0.016, 0],
      [-0.00043, 1],
      [-0.00045, 1],
      [-0.00037, 1],
      [0.00178, 2],
      [0.00316, 2],
      [0.00027, 2],
      [-0.00093, 1],
      [0.00211, 2],
      [-0.00117, 1],
      [0.00736, 0],
      [-0.00076, 1],
      [0.00187, 2],
      [0.0057, 0],
      [0.01159, 0],
      [-0.00063, 1],
      [-0.00091, 1]
    ]
  },
  "QS_mulLysisSite[Nerve]": {
    "red_x_points": [
      [-0.0059, 1],
      [-0.00151, 0],
      [-0.01126, 2],
      [-0.02164, 2],
      [-0.00066, 0],
      [0.00231, 0],
      [0.00076, 3],
      [-0.00607, 1],
      [0.00161, 3],
      [-0.00075, 0],
      [0.00128, 3],
      [-0.00107, 0],
      [0.00112, 3],
      [0.0006, 0],
      [-0.00585, 1],
      [0.00069, 3],
      [-0.00094, 0],
      [0.0014, 3],
      [0.001, 0],
      [-0.00125, 0],
      [-0.00779, 1],
      [0.00212, 0],
      [0.00124, 3]
    ],
    "red_o_points": [],
    "y_categories": ["N", "NOT APPLICABLE", "Y", "nan"],
    "blue_o_points": [],
    "blue_x_points": [
      [0.00249, 3],
      [0.00189, 3],
      [0.00181, 0],
      [0.00451, 0],
      [0.00172, 3],
      [0.00427, 0],
      [0.00205, 0],
      [0.0048, 0],
      [0.00155, 3],
      [0.00306, 1],
      [-0.00078, 0],
      [0.00436, 0],
      [0.00182, 3],
      [0.00209, 3],
      [0.00251, 3],
      [0.0018, 3],
      [0.00226, 3],
      [0.00192, 3],
      [0.00175, 1],
      [0.00301, 3],
      [0.00169, 3]
    ]
  },
  "QS_mulTransfSite[IMc]": {
    "red_x_points": [
      [-0.01178, 1],
      [-0.02312, 2],
      [0.00043, 0],
      [-0.02818, 2],
      [-0.00235, 0],
      [0.00397, 0],
      [0.00243, 3],
      [-0.01499, 1],
      [0.00735, 3],
      [-0.00159, 0],
      [0.00438, 3],
      [-0.02173, 2],
      [0.00332, 3],
      [0.00112, 0],
      [-0.01797, 1],
      [0.0029, 3],
      [-0.00283, 0],
      [0.00408, 3],
      [0.00146, 0],
      [-0.02282, 2],
      [-0.01721, 1],
      [-0.01209, 2],
      [0.00449, 3]
    ],
    "red_o_points": [],
    "y_categories": ["N", "NOT APPLICABLE", "Y", "nan"],
    "blue_o_points": [],
    "blue_x_points": [
      [0.00744, 3],
      [0.00542, 3],
      [0.00469, 0],
      [0.00823, 0],
      [0.00541, 3],
      [0.00745, 0],
      [0.00522, 0],
      [0.00769, 0],
      [0.00973, 3],
      [0.01329, 1],
      [0.00274, 0],
      [0.00912, 0],
      [0.00844, 3],
      [0.00593, 3],
      [0.00636, 3],
      [0.00525, 3],
      [0.00962, 3],
      [0.00573, 3],
      [-0.00039, 1],
      [0.00766, 3],
      [0.00574, 3]
    ]
  },
  "QA_lstPexMuscstrength[FingersAddu]": {
    "red_x_points": [
      [0.00011, 2],
      [4e-5, 2],
      [-0.01858, 1],
      [-0.00049, 2],
      [-0.01887, 1],
      [-0.02169, 1],
      [0.00734, 0],
      [0.00654, 0],
      [-0.0002, 2],
      [9e-5, 2],
      [0.00343, 0],
      [0.00047, 2],
      [-0.01918, 1],
      [0.00879, 0],
      [0.00678, 0],
      [-0.01783, 1],
      [-0.01534, 1],
      [0.00071, 2],
      [-0.00101, 2],
      [-0.01708, 1],
      [0.00026, 2],
      [-0.01719, 1],
      [-0.00143, 2]
    ],
    "red_o_points": [],
    "y_categories": ["GREATER THAN OR EQUALS TO 3", "LESS THAN 3", "nan"],
    "blue_o_points": [],
    "blue_x_points": [
      [0.01392, 0],
      [-0.00404, 1],
      [0.0071, 0],
      [0.0098, 0],
      [0.0117, 0],
      [0.01308, 0],
      [0.00201, 2],
      [0.01282, 0],
      [0.0011, 2],
      [0.00172, 2],
      [0.00177, 2],
      [0.00259, 2],
      [0.00151, 2],
      [0.0083, 0],
      [0.00716, 0],
      [0.00793, 0],
      [0.00205, 2],
      [0.00173, 2],
      [0.01005, 0],
      [0.0016, 2],
      [0.00044, 2]
    ]
  },
  "QA_lstPexTouch[T1]": {
    "red_x_points": [
      [-0.00887, 1],
      [-0.00212, 2],
      [-0.0058, 1],
      [0.00497, 0],
      [-0.00258, 2],
      [-0.00692, 1],
      [0.005, 0],
      [-0.01005, 1],
      [-0.00199, 2],
      [-0.00456, 2],
      [-0.00974, 1],
      [-0.0024, 2],
      [-0.00732, 1],
      [-0.01463, 1],
      [-0.00949, 1],
      [-0.00637, 1],
      [-0.00221, 2],
      [0.0027, 0],
      [-0.00858, 1],
      [-0.00355, 2],
      [-0.00957, 1],
      [-0.00481, 1],
      [-0.00847, 1]
    ],
    "red_o_points": [],
    "y_categories": ["NORM", "NPV", "nan"],
    "blue_o_points": [],
    "blue_x_points": [
      [-0.00541, 1],
      [-0.00428, 1],
      [0.01278, 0],
      [-0.0046, 1],
      [-0.00456, 1],
      [0.01788, 0],
      [0.0172, 0],
      [0.01489, 0],
      [0.00121, 2],
      [0.00239, 2],
      [-0.0008, 2],
      [-0.00416, 1],
      [0.00142, 2],
      [0.0113, 0],
      [0.01074, 0],
      [0.01114, 0],
      [0.00198, 2],
      [-0.00504, 1],
      [0.01512, 0],
      [0.01291, 0],
      [0.01528, 0]
    ]
  },
  "QA_lstPexArthre[Elbow]": {
    "red_x_points": [
      [-2e-5, 2],
      [-0.001, 3],
      [-0.00244, 3],
      [0.00068, 2],
      [-0.00853, 0],
      [-0.00761, 1],
      [-0.00278, 2],
      [-0.00016, 2],
      [-0.00079, 3],
      [0.00089, 2],
      [-0.00214, 3],
      [-0.00105, 3],
      [-0.002, 3],
      [0.00018, 2],
      [-0.00029, 2],
      [-0.00309, 2],
      [-0.00106, 3],
      [-0.00102, 3],
      [-0.00349, 3],
      [-0.00104, 3],
      [-0.00065, 3],
      [0.00064, 2],
      [-0.00194, 3]
    ],
    "red_o_points": [],
    "y_categories": ["NAIA", "NPV", "PV", "nan"],
    "blue_o_points": [],
    "blue_x_points": [
      [0.01736, 1],
      [-0.00091, 3],
      [0.00146, 2],
      [0.00198, 2],
      [-8e-5, 3],
      [0.00479, 2],
      [0.0027, 2],
      [0.00172, 2],
      [-0.00021, 3],
      [-0.0002, 3],
      [-0.00035, 3],
      [0.00465, 2],
      [-0.00033, 3],
      [0.00025, 2],
      [0.00027, 2],
      [0.0038, 1],
      [-0.00034, 3],
      [0.00066, 2],
      [0.0, 3],
      [0.0006, 2],
      [0.00087, 2]
    ]
  },
  "QS_mulTransfSite[AcMc]": {
    "red_x_points": [
      [-0.01018, 1],
      [-0.00588, 0],
      [-0.00291, 0],
      [-0.00516, 0],
      [-0.00431, 0],
      [-0.0004, 0],
      [0.00106, 3],
      [-0.01186, 1],
      [0.00346, 3],
      [-0.00442, 0],
      [0.00127, 3],
      [-0.00429, 0],
      [0.00216, 3],
      [-0.0038, 0],
      [-0.01408, 1],
      [0.00138, 3],
      [-0.00434, 0],
      [0.00129, 3],
      [-0.00261, 0],
      [-0.00585, 0],
      [-0.01262, 1],
      [-0.00077, 0],
      [0.0014, 3]
    ],
    "red_o_points": [],
    "y_categories": ["N", "NOT APPLICABLE", "Y", "nan"],
    "blue_o_points": [],
    "blue_x_points": [
      [0.00432, 3],
      [0.00259, 3],
      [0.00123, 0],
      [0.00246, 0],
      [0.00263, 3],
      [0.00358, 0],
      [0.00049, 0],
      [0.01968, 2],
      [0.00466, 3],
      [0.0108, 1],
      [-0.00214, 0],
      [0.00299, 0],
      [0.00388, 3],
      [0.00319, 3],
      [0.0025, 3],
      [0.00219, 3],
      [0.00438, 3],
      [0.00246, 3],
      [0.00215, 1],
      [0.00469, 3],
      [0.00274, 3]
    ]
  },
  "QS_mulTransfSite[Other]": {
    "red_x_points": [
      [-0.00551, 1],
      [-0.00261, 0],
      [-0.00011, 0],
      [0.00079, 0],
      [-0.00145, 0],
      [0.00089, 0],
      [5e-5, 3],
      [-0.00857, 1],
      [0.00169, 3],
      [-0.00159, 0],
      [0.00065, 3],
      [-0.00218, 0],
      [0.00033, 3],
      [-0.03218, 2],
      [-0.00789, 1],
      [0.00035, 3],
      [-0.0014, 0],
      [0.00091, 3],
      [0.00035, 0],
      [-0.00249, 0],
      [-0.00602, 1],
      [0.00082, 0],
      [0.0003, 3]
    ],
    "red_o_points": [],
    "y_categories": ["N", "NOT APPLICABLE", "Y", "nan"],
    "blue_o_points": [],
    "blue_x_points": [
      [0.00178, 3],
      [0.00124, 3],
      [0.0046, 0],
      [0.00509, 0],
      [0.00255, 3],
      [0.00481, 0],
      [0.00573, 0],
      [0.00458, 0],
      [0.00211, 3],
      [0.00601, 1],
      [-0.00027, 0],
      [0.00447, 0],
      [0.00202, 3],
      [0.00387, 3],
      [0.00346, 3],
      [0.00238, 3],
      [0.0024, 3],
      [0.00252, 3],
      [0.00118, 1],
      [0.00273, 3],
      [0.0016, 3]
    ]
  },
  "QA_yonInjBpsurg": {
    "red_x_points": [
      [-0.00881, 0],
      [0.00015, 1],
      [0.00033, 1],
      [0.00116, 1],
      [0.00012, 1],
      [0.00095, 1],
      [0.00075, 1],
      [-0.00887, 0],
      [4e-5, 1],
      [0.00056, 1],
      [0.00056, 1],
      [0.00022, 1],
      [0.00064, 1],
      [0.00131, 1],
      [-0.0118, 0],
      [0.00062, 1],
      [-0.00092, 1],
      [-0.00124, 1],
      [0.00071, 1],
      [-0.0009, 1],
      [-0.0137, 0],
      [0.00051, 1],
      [0.00063, 1]
    ],
    "red_o_points": [],
    "y_categories": ["N", "Y", "nan"],
    "blue_o_points": [],
    "blue_x_points": [
      [0.00258, 1],
      [0.00174, 1],
      [0.00198, 1],
      [0.002, 1],
      [0.00081, 1],
      [0.00274, 1],
      [0.00205, 1],
      [0.00229, 1],
      [0.00062, 1],
      [0.00401, 0],
      [0.00029, 1],
      [0.00235, 1],
      [0.00018, 1],
      [0.00161, 1],
      [0.00205, 1],
      [0.00128, 1],
      [0.00018, 1],
      [0.0028, 1],
      [-0.00013, 0],
      [0.00262, 1],
      [0.00294, 1]
    ]
  },
  "QA_lstPexTouch[C8]": {
    "red_x_points": [
      [0.0094, 0],
      [-0.0033, 2],
      [-0.00952, 1],
      [-0.0153, 1],
      [-0.00318, 2],
      [-0.00912, 1],
      [-0.01187, 1],
      [-0.01226, 1],
      [-0.00345, 2],
      [-0.00422, 2],
      [-0.01374, 1],
      [-0.00318, 2],
      [-0.01362, 1],
      [0.01122, 0],
      [-0.01099, 1],
      [-0.01053, 1],
      [-0.00349, 2],
      [0.00918, 0],
      [-0.0109, 1],
      [-0.00411, 2],
      [-0.01503, 1],
      [-0.00855, 1],
      [-0.01532, 1]
    ],
    "red_o_points": [],
    "y_categories": ["NORM", "NPV", "nan"],
    "blue_o_points": [],
    "blue_x_points": [
      [-0.01083, 1],
      [-0.01012, 1],
      [0.0139, 0],
      [-0.00902, 1],
      [0.01969, 0],
      [-0.00779, 1],
      [0.01805, 0],
      [0.01937, 0],
      [0.00059, 2],
      [0.00162, 2],
      [-0.00076, 2],
      [-0.00756, 1],
      [0.00133, 2],
      [0.01624, 0],
      [0.01598, 0],
      [0.01747, 0],
      [0.00178, 2],
      [0.01443, 0],
      [0.0174, 0],
      [0.02086, 0],
      [0.01926, 0]
    ]
  },
  "QA_lstPexPalle[Clavicle]": {
    "red_x_points": [
      [-0.00089, 3],
      [-0.0007, 3],
      [-0.00083, 3],
      [0.00763, 2],
      [-0.00063, 3],
      [-0.00073, 3],
      [-0.01831, 0],
      [-0.01728, 0],
      [-0.00093, 3],
      [-0.00109, 3],
      [-0.00119, 3],
      [-0.00073, 3],
      [-0.00079, 3],
      [-0.02421, 0],
      [-0.00093, 3],
      [-0.0163, 0],
      [-0.00535, 1],
      [-0.00121, 3],
      [-0.00161, 3],
      [-0.00084, 3],
      [0.00767, 2],
      [-0.01391, 0],
      [-0.00062, 3]
    ],
    "red_o_points": [],
    "y_categories": ["HYPO", "NAIA", "PT", "nan"],
    "blue_o_points": [],
    "blue_x_points": [
      [-0.00025, 3],
      [-0.00052, 3],
      [0.01277, 2],
      [0.01679, 2],
      [-0.00088, 3],
      [-0.00057, 3],
      [0.01924, 2],
      [0.0149, 2],
      [-0.00062, 3],
      [-0.00063, 3],
      [-0.0009, 3],
      [-0.00031, 3],
      [-0.00058, 3],
      [-0.00857, 0],
      [0.01234, 2],
      [0.00777, 1],
      [-0.00077, 3],
      [0.01137, 2],
      [-0.00051, 3],
      [0.0142, 2],
      [-0.00046, 3]
    ]
  },
  "QS_mulTransfSite[AcSsAA]": {
    "red_x_points": [
      [-0.00826, 1],
      [-0.01597, 2],
      [-0.00158, 0],
      [3e-5, 0],
      [-0.01102, 2],
      [0.00133, 0],
      [-0.00033, 3],
      [-0.01185, 1],
      [0.00616, 3],
      [-0.01659, 2],
      [0.00279, 3],
      [-0.00151, 0],
      [0.00167, 3],
      [-0.00679, 0],
      [-0.01372, 1],
      [0.00063, 3],
      [-0.00969, 2],
      [0.00228, 3],
      [-0.00304, 0],
      [-0.0126, 2],
      [-0.01023, 1],
      [0.00042, 0],
      [0.0026, 3]
    ],
    "red_o_points": [],
    "y_categories": ["N", "NOT APPLICABLE", "Y", "nan"],
    "blue_o_points": [],
    "blue_x_points": [
      [0.00505, 3],
      [0.00306, 3],
      [0.00535, 2],
      [0.00308, 0],
      [0.00285, 3],
      [0.00454, 0],
      [0.01057, 2],
      [0.00094, 0],
      [0.00701, 3],
      [0.01446, 1],
      [0.00694, 0],
      [0.00543, 0],
      [0.00695, 3],
      [0.00286, 3],
      [0.00295, 3],
      [0.00231, 3],
      [0.00715, 3],
      [0.00335, 3],
      [0.00273, 1],
      [0.00372, 3],
      [0.00399, 3]
    ]
  },
  "QS_mulLysisRoot[C5]": {
    "red_x_points": [
      [-0.0044, 1],
      [-0.00105, 0],
      [-0.00957, 2],
      [0.00217, 0],
      [-0.00052, 0],
      [0.00258, 0],
      [0.00027, 3],
      [-0.00455, 1],
      [0.0007, 3],
      [-0.0005, 0],
      [0.00073, 3],
      [-0.00077, 0],
      [0.0007, 3],
      [0.00039, 0],
      [-0.00578, 1],
      [0.00041, 3],
      [-0.00053, 0],
      [0.00126, 3],
      [0.00118, 0],
      [-0.00096, 0],
      [-0.00475, 1],
      [-0.00746, 2],
      [0.00056, 3]
    ],
    "red_o_points": [],
    "y_categories": ["N", "NOT APPLICABLE", "Y", "nan"],
    "blue_o_points": [],
    "blue_x_points": [
      [0.00117, 3],
      [0.00124, 3],
      [0.00026, 0],
      [0.00422, 0],
      [0.00074, 3],
      [0.00307, 0],
      [0.0008, 0],
      [0.00251, 0],
      [0.00088, 3],
      [0.00279, 1],
      [-8e-5, 0],
      [0.00484, 0],
      [0.0008, 3],
      [0.00074, 3],
      [0.0006, 3],
      [0.00015, 3],
      [0.00148, 3],
      [0.0004, 3],
      [0.00178, 1],
      [0.00093, 3],
      [0.00057, 3]
    ]
  },
  "QS_mulNeuromadSite[C6]": {
    "red_x_points": [
      [-0.00337, 1],
      [-0.00244, 0],
      [-0.00097, 0],
      [0.00046, 0],
      [-0.00184, 0],
      [0.00054, 0],
      [-0.00014, 2],
      [-0.00496, 1],
      [0.00126, 2],
      [-0.00163, 0],
      [0.00054, 2],
      [-0.00178, 0],
      [0.00021, 2],
      [-0.00063, 0],
      [-0.00688, 1],
      [0.00022, 2],
      [-0.00158, 0],
      [0.00039, 2],
      [-0.00094, 0],
      [-0.00253, 0],
      [-0.00485, 1],
      [0.00018, 0],
      [0.00023, 2]
    ],
    "red_o_points": [],
    "y_categories": ["N", "NOT APPLICABLE", "nan"],
    "blue_o_points": [],
    "blue_x_points": [
      [0.0015, 2],
      [0.00085, 2],
      [0.0008, 0],
      [0.00232, 0],
      [0.00055, 2],
      [0.00175, 0],
      [0.00066, 0],
      [0.00072, 0],
      [0.00183, 2],
      [0.00627, 1],
      [-0.0008, 0],
      [0.00226, 0],
      [0.002, 2],
      [0.00119, 2],
      [0.00145, 2],
      [0.00071, 2],
      [0.0019, 2],
      [0.00115, 2],
      [0.00115, 1],
      [0.00146, 2],
      [0.00075, 2]
    ]
  },
  "QS_mulNeuromadSite[T1]": {
    "red_x_points": [
      [-0.00194, 1],
      [-0.00111, 0],
      [-0.00021, 0],
      [0.00028, 0],
      [-0.00077, 0],
      [0.00047, 0],
      [0.00011, 2],
      [-0.00227, 1],
      [0.00081, 2],
      [-0.00089, 0],
      [-0.00014, 2],
      [-0.00122, 0],
      [6e-5, 2],
      [8e-5, 0],
      [-0.00364, 1],
      [0.0001, 2],
      [-0.00084, 0],
      [0.00029, 2],
      [-0.00023, 0],
      [-0.00133, 0],
      [-0.0018, 1],
      [8e-5, 0],
      [0.00013, 2]
    ],
    "red_o_points": [],
    "y_categories": ["N", "NOT APPLICABLE", "nan"],
    "blue_o_points": [],
    "blue_x_points": [
      [0.00054, 2],
      [0.0002, 2],
      [0.00066, 0],
      [0.00087, 0],
      [0.00014, 2],
      [0.00157, 0],
      [0.00083, 0],
      [0.00038, 0],
      [0.00128, 2],
      [0.00303, 1],
      [-0.00065, 0],
      [0.00104, 0],
      [0.00106, 2],
      [0.00018, 2],
      [0.00031, 2],
      [0.00014, 2],
      [0.00115, 2],
      [0.00038, 2],
      [0.0002, 1],
      [0.00031, 2],
      [0.00032, 2]
    ]
  },
  "QA_lstPexMuscstrength[ThumbOppo]": {
    "red_x_points": [
      [0.00028, 2],
      [-0.00026, 2],
      [-0.01202, 1],
      [-0.02559, 1],
      [-0.0085, 1],
      [-0.01175, 1],
      [-0.00197, 0],
      [0.0013, 0],
      [0.00046, 2],
      [-3e-5, 2],
      [-0.00349, 0],
      [0.00033, 2],
      [-0.00938, 1],
      [0.00361, 0],
      [0.0015, 0],
      [-0.0059, 1],
      [-0.00799, 1],
      [0.00021, 2],
      [0.00327, 0],
      [-0.00817, 1],
      [-7e-5, 2],
      [-0.01025, 1],
      [-0.00079, 2]
    ],
    "red_o_points": [],
    "y_categories": ["GREATER THAN OR EQUALS TO 3", "LESS THAN 3", "nan"],
    "blue_o_points": [],
    "blue_x_points": [
      [0.00172, 1],
      [0.00176, 1],
      [0.00458, 0],
      [0.00679, 0],
      [0.00823, 0],
      [0.00876, 0],
      [0.00764, 0],
      [0.01105, 0],
      [0.00144, 2],
      [0.00147, 2],
      [0.00217, 2],
      [0.00781, 2],
      [0.00144, 2],
      [0.00456, 0],
      [0.00435, 0],
      [0.0062, 0],
      [0.00275, 2],
      [0.0013, 2],
      [0.00566, 0],
      [0.00342, 2],
      [0.0021, 2]
    ]
  },
  "QA_lstPexMuscstrength[ShoulderAbduc]": {
    "red_x_points": [
      [-0.00119, 2],
      [0.0002, 1],
      [0.00019, 1],
      [0.00054, 1],
      [6e-5, 1],
      [0.00053, 1],
      [0.0008, 1],
      [-0.01405, 0],
      [-0.0003, 2],
      [-0.00087, 2],
      [-0.00387, 2],
      [-0.00038, 2],
      [0.00034, 1],
      [0.00097, 1],
      [-0.02303, 0],
      [0.00022, 1],
      [0.00022, 1],
      [0.0002, 1],
      [0.00057, 1],
      [0.00051, 1],
      [-0.0008, 2],
      [0.00022, 1],
      [-0.00061, 2]
    ],
    "red_o_points": [],
    "y_categories": ["GREATER THAN OR EQUALS TO 3", "LESS THAN 3", "nan"],
    "blue_o_points": [],
    "blue_x_points": [
      [0.00268, 1],
      [0.0026, 1],
      [0.00272, 1],
      [0.00241, 1],
      [0.00182, 1],
      [0.00423, 1],
      [0.00164, 1],
      [0.00149, 1],
      [0.00026, 2],
      [0.00075, 2],
      [0.00153, 1],
      [0.0006, 2],
      [0.0006, 2],
      [0.00233, 1],
      [0.00274, 1],
      [-0.00042, 2],
      [0.00062, 2],
      [0.00221, 1],
      [0.0067, 1],
      [0.00079, 1],
      [0.00122, 1]
    ]
  },
  "QA_lstPexTouch[C7]": {
    "red_x_points": [
      [-0.01321, 1],
      [-0.00432, 2],
      [-0.00909, 1],
      [-0.01154, 1],
      [-0.00399, 2],
      [-0.00895, 1],
      [-0.01197, 1],
      [-0.01192, 1],
      [-0.00345, 2],
      [-0.00537, 2],
      [-0.01383, 1],
      [-0.0036, 2],
      [-0.0128, 1],
      [0.01111, 0],
      [-0.01235, 1],
      [-0.01027, 1],
      [-0.00338, 2],
      [0.01142, 0],
      [-0.01022, 1],
      [-0.0039, 2],
      [-0.01541, 1],
      [-0.00865, 1],
      [-0.01306, 1]
    ],
    "red_o_points": [],
    "y_categories": ["NORM", "NPV", "nan"],
    "blue_o_points": [],
    "blue_x_points": [
      [-0.00979, 1],
      [-0.01081, 1],
      [0.01999, 0],
      [-0.00715, 1],
      [0.023, 0],
      [-0.00762, 1],
      [0.02333, 0],
      [-0.00836, 1],
      [-0.00046, 2],
      [0.0016, 2],
      [-0.00105, 2],
      [-0.00838, 1],
      [0.00049, 2],
      [0.01956, 0],
      [0.01828, 0],
      [0.01928, 0],
      [0.00175, 2],
      [0.01879, 0],
      [0.0259, 0],
      [0.02511, 0],
      [0.02527, 0]
    ]
  },
  "QA_lstPexMuscstrength[ShoulderExrot]": {
    "red_x_points": [
      [-0.00106, 2],
      [-0.00036, 2],
      [-0.01449, 0],
      [-0.00087, 2],
      [0.00317, 1],
      [-0.00065, 2],
      [0.00229, 1],
      [-0.02086, 0],
      [-0.00038, 2],
      [-0.00049, 2],
      [-0.00137, 2],
      [-0.00029, 2],
      [-0.00045, 2],
      [0.00363, 1],
      [-0.02746, 0],
      [0.00283, 1],
      [5e-5, 2],
      [-0.00012, 2],
      [0.00463, 1],
      [-0.01498, 0],
      [-0.0008, 2],
      [0.00234, 1],
      [-0.00073, 2]
    ],
    "red_o_points": [],
    "y_categories": ["GREATER THAN OR EQUALS TO 3", "LESS THAN 3", "nan"],
    "blue_o_points": [],
    "blue_x_points": [
      [0.01001, 1],
      [0.00015, 2],
      [0.00464, 1],
      [0.00549, 1],
      [0.00647, 1],
      [0.00882, 1],
      [0.00541, 1],
      [7e-5, 2],
      [0.00023, 2],
      [0.00059, 2],
      [0.00057, 2],
      [0.00085, 2],
      [0.001, 2],
      [0.00482, 1],
      [0.00514, 1],
      [0.00015, 2],
      [0.00033, 2],
      [0.00113, 2],
      [0.01088, 1],
      [-9e-5, 2],
      [-0.00024, 2]
    ]
  },
  "QA_txtInjMedicatioListNer": {
    "red_x_points": [
      [-0.00687, 1],
      [-0.00635, 1],
      [-0.00567, 1],
      [-0.00453, 1],
      [-0.00722, 1],
      [-0.00069, 2],
      [-0.00665, 1],
      [0.00386, 0],
      [-0.00943, 2],
      [-0.00271, 2],
      [-0.00398, 2],
      [-0.00342, 2],
      [-0.00934, 1],
      [-0.00796, 1],
      [-0.00049, 2],
      [-0.00648, 1],
      [-0.00258, 2],
      [-0.00869, 1],
      [-0.00812, 1],
      [-0.00686, 1],
      [-0.00454, 1],
      [-3e-5, 2],
      [-0.00257, 2]
    ],
    "red_o_points": [],
    "y_categories": ["N", "Y", "nan"],
    "blue_o_points": [],
    "blue_x_points": [
      [0.02962, 0],
      [0.00155, 2],
      [0.01047, 0],
      [-0.00387, 1],
      [0.00247, 2],
      [0.00156, 2],
      [0.00276, 2],
      [-0.00423, 1],
      [-0.00179, 1],
      [-0.00438, 1],
      [0.02899, 0],
      [-9e-5, 2],
      [0.02529, 0],
      [-0.00425, 1],
      [0.00198, 2],
      [0.00057, 2],
      [-0.00286, 1],
      [0.01368, 0],
      [0.01888, 0],
      [-0.00506, 1],
      [2e-5, 2]
    ]
  },
  "QA_lstPexKine[Elbow]": {
    "red_x_points": [
      [-2e-5, 1],
      [-0.00057, 2],
      [-0.002, 2],
      [0.00112, 1],
      [-0.00164, 2],
      [-0.00821, 0],
      [-0.00077, 1],
      [-0.00065, 1],
      [-0.00066, 2],
      [0.00056, 1],
      [-0.00175, 2],
      [-0.00082, 2],
      [-0.00134, 2],
      [-0.00019, 1],
      [-0.00042, 1],
      [-0.00233, 0],
      [-0.00037, 2],
      [-0.00118, 2],
      [-0.0037, 2],
      [-0.00086, 2],
      [-0.00023, 2],
      [-0.00431, 0],
      [-0.00133, 2]
    ],
    "red_o_points": [],
    "y_categories": ["NPV", "PV", "nan"],
    "blue_o_points": [],
    "blue_x_points": [
      [0.00548, 0],
      [-0.00066, 2],
      [0.00086, 1],
      [0.00335, 1],
      [-0.00011, 2],
      [0.00571, 1],
      [0.00192, 1],
      [0.00232, 1],
      [-0.00019, 2],
      [-0.00012, 2],
      [-0.00056, 2],
      [0.00523, 1],
      [-0.00026, 2],
      [0.00092, 1],
      [0.00074, 1],
      [0.00255, 0],
      [-0.00024, 2],
      [0.00095, 1],
      [0.00022, 2],
      [0.00258, 1],
      [0.00095, 1]
    ]
  },
  "QS_mulNeuromadSite[C4]": {
    "red_x_points": [
      [-0.00649, 1],
      [-0.00425, 0],
      [-0.00124, 0],
      [-0.00028, 0],
      [-0.00268, 0],
      [0.00072, 0],
      [0.00023, 2],
      [-0.0072, 1],
      [0.00221, 2],
      [-0.00313, 0],
      [0.00049, 2],
      [-0.00367, 0],
      [0.00059, 2],
      [-0.00074, 0],
      [-0.01188, 1],
      [0.00056, 2],
      [-0.00249, 0],
      [0.00059, 2],
      [-0.00192, 0],
      [-0.00454, 0],
      [-0.00677, 1],
      [0.00039, 0],
      [0.00051, 2]
    ],
    "red_o_points": [],
    "y_categories": ["N", "NOT APPLICABLE", "nan"],
    "blue_o_points": [],
    "blue_x_points": [
      [0.00215, 2],
      [0.00147, 2],
      [0.00127, 0],
      [0.00316, 0],
      [0.001, 2],
      [0.00358, 0],
      [0.00136, 0],
      [0.00154, 0],
      [0.00389, 2],
      [0.00965, 1],
      [-0.00139, 0],
      [0.00386, 0],
      [0.00355, 2],
      [0.00186, 2],
      [0.00197, 2],
      [0.00125, 2],
      [0.00382, 2],
      [0.00226, 2],
      [0.00172, 1],
      [0.00193, 2],
      [0.00109, 2]
    ]
  },
  "QS_mulTransfSite[Oberlin]": {
    "red_x_points": [
      [-0.01248, 1],
      [-0.03573, 0],
      [-0.03458, 0],
      [-0.03852, 0],
      [-0.03555, 0],
      [-0.03522, 0],
      [0.0095, 3],
      [-0.01457, 1],
      [0.01114, 3],
      [0.01501, 2],
      [0.01014, 3],
      [-0.03738, 0],
      [0.00999, 3],
      [0.01435, 2],
      [-0.01545, 1],
      [0.00984, 3],
      [-0.03479, 0],
      [0.01106, 3],
      [0.01513, 2],
      [-0.03605, 0],
      [-0.0144, 1],
      [-0.03332, 0],
      [0.00968, 3]
    ],
    "red_o_points": [],
    "y_categories": ["N", "NOT APPLICABLE", "Y", "nan"],
    "blue_o_points": [],
    "blue_x_points": [
      [0.01176, 3],
      [0.01108, 3],
      [0.0181, 2],
      [0.02109, 2],
      [0.01143, 3],
      [0.02014, 2],
      [0.01785, 2],
      [0.01904, 2],
      [0.01281, 3],
      [-0.00375, 1],
      [0.0185, 2],
      [0.02057, 2],
      [0.0117, 3],
      [0.01167, 3],
      [0.01096, 3],
      [0.01087, 3],
      [0.0119, 3],
      [0.01091, 3],
      [-0.00699, 1],
      [0.01139, 3],
      [0.01118, 3]
    ]
  },
  "QA_lstPexArthre[Index]": {
    "red_x_points": [
      [-0.00759, 0],
      [-0.00185, 2],
      [-0.00292, 2],
      [-0.01087, 0],
      [-0.00325, 0],
      [-0.00995, 0],
      [0.00029, 1],
      [0.00019, 1],
      [-0.00169, 2],
      [0.00309, 1],
      [-0.00179, 2],
      [-0.00146, 2],
      [-0.00216, 2],
      [-0.00041, 1],
      [0.00057, 1],
      [-0.00334, 0],
      [-0.00087, 2],
      [-0.00269, 2],
      [-0.0048, 2],
      [-0.00147, 2],
      [-0.00284, 2],
      [-0.00699, 0],
      [-0.00319, 2]
    ],
    "red_o_points": [],
    "y_categories": ["NPV", "PV", "nan"],
    "blue_o_points": [],
    "blue_x_points": [
      [0.00279, 0],
      [-0.00111, 2],
      [0.00266, 1],
      [0.00754, 1],
      [0.0003, 2],
      [0.00998, 1],
      [0.00683, 1],
      [0.00063, 0],
      [-0.00098, 2],
      [-0.00042, 2],
      [-0.00043, 2],
      [0.01374, 1],
      [-0.00084, 2],
      [0.00218, 1],
      [0.00216, 1],
      [0.00132, 0],
      [-0.00068, 2],
      [0.00395, 1],
      [0.00065, 2],
      [0.00889, 1],
      [0.00683, 1]
    ]
  },
  "QA_yonPreFracture": {
    "red_x_points": [
      [-0.02995, 1],
      [0.00189, 2],
      [0.00507, 0],
      [0.0017, 2],
      [0.00541, 0],
      [0.00568, 0],
      [-0.02592, 1],
      [0.00562, 0],
      [0.00142, 2],
      [-0.03299, 1],
      [-0.03384, 1],
      [-0.02928, 1],
      [0.00221, 2],
      [0.00607, 0],
      [0.00603, 0],
      [0.00532, 0],
      [0.00486, 0],
      [0.00784, 0],
      [-0.03266, 1],
      [0.00545, 0],
      [0.00113, 2],
      [-0.02257, 1],
      [0.00136, 2]
    ],
    "red_o_points": [],
    "y_categories": ["N", "Y", "nan"],
    "blue_o_points": [],
    "blue_x_points": [
      [0.00849, 0],
      [0.00443, 2],
      [0.00687, 0],
      [0.00766, 0],
      [0.00418, 2],
      [0.00823, 0],
      [0.00802, 0],
      [0.00517, 2],
      [0.00337, 2],
      [0.00881, 0],
      [0.00965, 0],
      [0.01036, 0],
      [0.00948, 0],
      [0.00669, 0],
      [0.00631, 0],
      [0.00369, 2],
      [0.00885, 0],
      [0.00775, 0],
      [0.00645, 0],
      [0.00227, 2],
      [0.00341, 2]
    ]
  },
  "QA_lstPexKine[Index]": {
    "red_x_points": [
      [-0.00042, 1],
      [-0.00055, 2],
      [-0.00219, 2],
      [0.00043, 1],
      [-0.00118, 2],
      [-0.00836, 0],
      [-0.00031, 1],
      [-0.00011, 1],
      [-0.00053, 2],
      [0.00028, 1],
      [-0.00147, 2],
      [-0.00049, 2],
      [-0.00169, 2],
      [0.00113, 1],
      [-0.00018, 1],
      [-0.0027, 0],
      [-0.00081, 2],
      [-0.00145, 2],
      [-0.00388, 2],
      [-0.00039, 2],
      [-0.00034, 2],
      [-0.00565, 0],
      [-0.00133, 2]
    ],
    "red_o_points": [],
    "y_categories": ["NPV", "PV", "nan"],
    "blue_o_points": [],
    "blue_x_points": [
      [0.00523, 0],
      [-0.00037, 2],
      [0.0006, 1],
      [0.00355, 1],
      [-0.00012, 2],
      [0.00407, 1],
      [0.00206, 1],
      [0.00323, 1],
      [-0.00019, 2],
      [-0.00013, 2],
      [-0.00049, 2],
      [0.00541, 1],
      [-0.00021, 2],
      [0.00113, 1],
      [0.00042, 1],
      [0.00326, 0],
      [-0.00023, 2],
      [0.00066, 1],
      [0.00021, 2],
      [0.00279, 1],
      [0.00132, 1]
    ]
  },
  "QA_lstPexPalle[Ulna]": {
    "red_x_points": [
      [-0.00103, 4],
      [-0.00136, 4],
      [-0.00103, 4],
      [-0.03123, 2],
      [-0.00136, 4],
      [-0.00102, 4],
      [-0.01151, 1],
      [0.00733, 3],
      [-0.00128, 4],
      [-0.00139, 4],
      [-0.00163, 4],
      [-0.00108, 4],
      [-0.0012, 4],
      [0.00639, 3],
      [-0.00123, 4],
      [-0.02347, 0],
      [-0.01864, 0],
      [-0.00155, 4],
      [-0.00186, 4],
      [-0.00144, 4],
      [0.00775, 3],
      [-0.01979, 0],
      [-0.00143, 4]
    ],
    "red_o_points": [],
    "y_categories": ["ABS", "HYPO", "NAIA", "PT", "nan"],
    "blue_o_points": [],
    "blue_x_points": [
      [-0.00072, 4],
      [-0.00085, 4],
      [0.01015, 3],
      [0.01298, 1],
      [-0.00075, 4],
      [-0.00074, 4],
      [0.012, 3],
      [0.01357, 3],
      [-0.00122, 4],
      [-0.00104, 4],
      [-0.00093, 4],
      [-0.0003, 4],
      [-0.00114, 4],
      [0.01238, 3],
      [0.01171, 3],
      [0.01343, 3],
      [-0.00114, 4],
      [0.01107, 3],
      [-0.00048, 4],
      [0.01623, 3],
      [-0.00116, 4]
    ]
  }
}
