{
  "QA_mulInjOrthesisType[ArmSling]": {
    "red_x_points": [
      [-0.04377, 2],
      [-0.04301, 2],
      [-0.04273, 2],
      [-0.04327, 2],
      [-0.04275, 2],
      [-0.04371, 2],
      [-0.04398, 2],
      [-0.04354, 2],
      [-0.04298, 2],
      [-0.04296, 2],
      [-0.04329, 2],
      [-0.04242, 2],
      [-0.04316, 2],
      [-0.04293, 2],
      [-0.13526, 0],
      [-0.04367, 2],
      [-0.04337, 2],
      [-0.13533, 0],
      [-0.13821, 3],
      [-0.04214, 2],
      [-0.04321, 2],
      [-0.04359, 2],
      [-0.04403, 2],
      [-0.04389, 2],
      [-0.13787, 3],
      [-0.13753, 3],
      [-0.13622, 3],
      [-0.04373, 2],
      [-0.04274, 2]
    ],
    "red_o_points": [],
    "y_categories": ["N", "NOT APPLICABLE", "Y", "nan"],
    "blue_o_points": [],
    "blue_x_points": [
      [-0.04268, 2],
      [-0.04239, 2],
      [-0.04233, 2],
      [-0.0421, 2],
      [0.2632, 1],
      [0.26057, 1],
      [0.26175, 1],
      [0.2657, 1],
      [-0.04205, 2],
      [0.26438, 1],
      [-0.04198, 2],
      [0.26294, 1],
      [0.26412, 1],
      [0.26819, 1],
      [-0.04203, 2]
    ]
  },
  "QA_mulInjOrthesisType[ShoulderSupport]": {
    "red_x_points": [
      [-0.03722, 0],
      [-0.03637, 0],
      [-0.0358, 0],
      [-0.13574, 2],
      [-0.03674, 0],
      [-0.03603, 0],
      [-0.03635, 0],
      [-0.13465, 2],
      [-0.03593, 0],
      [-0.03625, 0],
      [-0.03563, 0],
      [-0.03639, 0],
      [-0.03654, 0],
      [-0.03632, 0],
      [-0.13396, 2],
      [-0.03676, 0],
      [-0.03652, 0],
      [-0.1352, 2],
      [-0.1343, 3],
      [-0.03602, 0],
      [-0.03554, 0],
      [-0.03567, 0],
      [-0.03677, 0],
      [-0.035, 0],
      [-0.13458, 3],
      [-0.13403, 3],
      [-0.13478, 3],
      [-0.03661, 0],
      [-0.03596, 0]
    ],
    "red_o_points": [],
    "y_categories": ["N", "NOT APPLICABLE", "Y", "nan"],
    "blue_o_points": [],
    "blue_x_points": [
      [-0.03497, 0],
      [-0.03446, 0],
      [-0.03493, 0],
      [-0.0348, 0],
      [0.2628, 1],
      [0.26202, 1],
      [0.25926, 1],
      [0.25886, 1],
      [-0.03502, 0],
      [0.2611, 1],
      [-0.03478, 0],
      [0.25781, 1],
      [0.26123, 1],
      [0.25794, 1],
      [-0.03443, 0]
    ]
  }
}
