{
  "QA_lstPexMuscstrength[ElbowFlex]": {
    "red_x_points": [
      [-0.01895, 1],
      [-0.00259, 2],
      [-0.01802, 1],
      [-0.01649, 1],
      [-0.01799, 1],
      [-0.01909, 1],
      [-0.01815, 1],
      [-0.01724, 1],
      [-0.01882, 1],
      [-0.01894, 1],
      [-0.01942, 1],
      [-0.01912, 1],
      [-0.00453, 2],
      [-0.00754, 2],
      [0.00273, 2],
      [-0.01955, 1],
      [-0.01913, 1],
      [-0.01553, 1],
      [-0.01646, 1],
      [-0.01894, 1],
      [-0.00503, 2],
      [-0.01809, 1],
      [-0.01887, 1],
      [-0.01859, 1],
      [-0.01579, 1],
      [-0.00025, 2],
      [-0.01638, 1],
      [-0.01897, 1],
      [-0.00502, 2]
    ],
    "red_o_points": [],
    "y_categories": ["GREATER THAN OR EQUALS TO 3", "LESS THAN 3", "nan"],
    "blue_o_points": [],
    "blue_x_points": [
      [-0.00058, 2],
      [-0.01758, 1],
      [0.10764, 0],
      [-0.01747, 1],
      [0.00538, 2],
      [0.00466, 2],
      [0.06163, 0],
      [-0.01396, 1],
      [-0.01737, 1],
      [0.00352, 2],
      [0.10775, 0],
      [0.06907, 0],
      [0.07513, 0],
      [0.07001, 0],
      [-0.0171, 1]
    ]
  },
  "participant_code": {
    "red_x_points": [
      [-0.07, 1],
      [-0.07, 2],
      [-0.06808, 3],
      [-0.06876, 4],
      [-0.07171, 5],
      [-0.06753, 8],
      [-0.06931, 9],
      [-0.07027, 10],
      [-0.0678, 11],
      [-0.06739, 13],
      [-0.07013, 14],
      [-0.06897, 18],
      [-0.07068, 19],
      [-0.06869, 20],
      [-0.06931, 23],
      [-0.06993, 26],
      [-0.07068, 28],
      [-0.06952, 29],
      [-0.0678, 30],
      [-0.06972, 31],
      [-0.06869, 32],
      [-0.06726, 34],
      [-0.06842, 36],
      [-0.06739, 38],
      [-0.07048, 39],
      [-0.0665, 40],
      [-0.06876, 41],
      [-0.06965, 42],
      [-0.06911, 43]
    ],
    "red_o_points": [],
    "y_categories": [
      "P16554",
      "P18297",
      "P19283",
      "P19287",
      "P23172",
      "P23391",
      "P30595",
      "P31645",
      "P31691",
      "P34778",
      "P35046",
      "P36328",
      "P43633",
      "P4544",
      "P46417",
      "P48965",
      "P53068",
      "P5497",
      "P58556",
      "P59529",
      "P62483",
      "P64658",
      "P65202",
      "P66816",
      "P6751",
      "P7408",
      "P75566",
      "P76226",
      "P79971",
      "P82621",
      "P82990",
      "P84549",
      "P84932",
      "P85825",
      "P86989",
      "P8770",
      "P87791",
      "P90550",
      "P93159",
      "P94969",
      "P96710",
      "P97130",
      "P9744",
      "P98500",
      "nan"
    ],
    "blue_o_points": [],
    "blue_x_points": [
      [0.13705, 0],
      [0.13403, 6],
      [0.13324, 7],
      [0.13377, 12],
      [0.13232, 15],
      [0.13193, 16],
      [0.13416, 17],
      [0.13456, 21],
      [0.13245, 22],
      [0.13495, 24],
      [0.13574, 25],
      [0.13245, 27],
      [0.1335, 33],
      [0.12956, 35],
      [0.13285, 37]
    ]
  },
  "QA_mulInjOrthesisType[ArmSling]": {
    "red_x_points": [
      [-0.01537, 2],
      [-0.01562, 2],
      [-0.01501, 2],
      [-0.01478, 2],
      [-0.01505, 2],
      [-0.01537, 2],
      [-0.01447, 2],
      [-0.01502, 2],
      [-0.01488, 2],
      [-0.01485, 2],
      [-0.01449, 2],
      [-0.01488, 2],
      [-0.01556, 2],
      [-0.01498, 2],
      [-0.04771, 0],
      [-0.01479, 2],
      [-0.01544, 2],
      [-0.04757, 0],
      [-0.04575, 3],
      [-0.01509, 2],
      [-0.0149, 2],
      [-0.01506, 2],
      [-0.01501, 2],
      [-0.0148, 2],
      [-0.0473, 3],
      [-0.04831, 3],
      [-0.04751, 3],
      [-0.01483, 2],
      [-0.01498, 2]
    ],
    "red_o_points": [],
    "y_categories": ["N", "NOT APPLICABLE", "Y", "nan"],
    "blue_o_points": [],
    "blue_x_points": [
      [-0.015, 2],
      [-0.01437, 2],
      [-0.0142, 2],
      [-0.01428, 2],
      [0.0944, 1],
      [0.09242, 1],
      [0.08765, 1],
      [0.09041, 1],
      [-0.01413, 2],
      [0.08853, 1],
      [-0.01417, 2],
      [0.09153, 1],
      [0.09281, 1],
      [0.09192, 1],
      [-0.01413, 2]
    ]
  },
  "QS_mulBpsurgeryType[Lysis]": {
    "red_x_points": [
      [-0.00093, 3],
      [-0.01067, 0],
      [-0.02973, 2],
      [-0.02316, 2],
      [-0.00385, 0],
      [-0.0275, 2],
      [-0.00415, 0],
      [-0.00317, 3],
      [-0.00406, 0],
      [-0.00428, 0],
      [-0.00126, 3],
      [-0.00442, 0],
      [-0.00403, 3],
      [-0.01043, 0],
      [-0.02106, 2],
      [-0.00074, 3],
      [-0.00104, 3],
      [-0.00012, 3],
      [-0.0048, 0],
      [-0.00076, 3],
      [-0.0042, 3],
      [-0.00373, 3],
      [-0.00497, 0],
      [-0.0046, 0],
      [-0.00278, 3],
      [0.02641, 1],
      [-0.00266, 3],
      [-0.02566, 2],
      [-0.00393, 3]
    ],
    "red_o_points": [],
    "y_categories": ["N", "NOT APPLICABLE", "Y", "nan"],
    "blue_o_points": [],
    "blue_x_points": [
      [0.08249, 1],
      [-0.00219, 3],
      [-0.00073, 0],
      [-0.00177, 0],
      [0.00092, 3],
      [0.04156, 1],
      [0.01672, 1],
      [-0.00149, 0],
      [-0.00243, 3],
      [-0.00016, 3],
      [-0.00033, 0],
      [0.02664, 1],
      [0.00047, 3],
      [0.0275, 1],
      [-0.00091, 3]
    ]
  },
  "QA_yonInjUnconscio": {
    "red_x_points": [
      [-0.03212, 1],
      [-0.02855, 1],
      [-0.001, 2],
      [-0.00259, 2],
      [-0.00131, 2],
      [-0.03587, 1],
      [-0.00134, 2],
      [-0.00405, 2],
      [-0.00212, 2],
      [-0.03644, 1],
      [-0.03137, 1],
      [-0.03578, 1],
      [-0.00527, 2],
      [-0.00495, 2],
      [-0.01552, 1],
      [-0.03119, 1],
      [-0.03175, 1],
      [-0.01928, 1],
      [-0.02006, 1],
      [-0.03189, 1],
      [-0.00506, 2],
      [-0.00248, 2],
      [-0.0362, 1],
      [-0.0316, 1],
      [-0.0045, 2],
      [-0.00633, 2],
      [-0.00466, 2],
      [-0.03072, 1],
      [-0.00513, 2]
    ],
    "red_o_points": [],
    "y_categories": ["N", "Y", "nan"],
    "blue_o_points": [],
    "blue_x_points": [
      [-0.00242, 2],
      [-0.00118, 2],
      [0.1079, 0],
      [0.0004, 2],
      [-0.01454, 1],
      [-0.01284, 1],
      [0.06031, 0],
      [0.08031, 0],
      [-0.00133, 2],
      [0.07606, 0],
      [0.10857, 0],
      [-0.00294, 2],
      [-0.015, 1],
      [-0.00296, 2],
      [0.11879, 0]
    ]
  },
  "QS_mulTransfSite[Oberlin]": {
    "red_x_points": [
      [-0.00196, 3],
      [-0.04274, 0],
      [-0.04099, 0],
      [-0.03583, 0],
      [-0.04281, 0],
      [0.00426, 2],
      [-0.04268, 0],
      [-0.00382, 3],
      [0.00704, 2],
      [0.00469, 2],
      [-0.002, 3],
      [0.0047, 2],
      [-0.00415, 3],
      [0.00188, 2],
      [-0.03339, 0],
      [-0.00208, 3],
      [-0.00223, 3],
      [-0.00159, 3],
      [-0.02927, 0],
      [-0.00186, 3],
      [-0.00434, 3],
      [-0.00393, 3],
      [0.00474, 2],
      [-0.03979, 0],
      [-0.00349, 3],
      [0.043, 1],
      [-0.00343, 3],
      [-0.03903, 0],
      [-0.00405, 3]
    ],
    "red_o_points": [],
    "y_categories": ["N", "NOT APPLICABLE", "Y", "nan"],
    "blue_o_points": [],
    "blue_x_points": [
      [0.09196, 1],
      [-0.00252, 3],
      [0.00987, 2],
      [0.01118, 2],
      [-0.00029, 3],
      [0.05987, 1],
      [0.03915, 1],
      [0.00582, 2],
      [-0.00262, 3],
      [-0.00071, 3],
      [0.00986, 2],
      [0.04735, 1],
      [-0.00082, 3],
      [0.0485, 1],
      [-0.00148, 3]
    ]
  },
  "QA_lstPexTouch[C7]": {
    "red_x_points": [
      [-0.00181, 1],
      [-0.0147, 2],
      [-0.00126, 1],
      [-0.00024, 1],
      [-0.01568, 2],
      [-0.00783, 1],
      [-0.00356, 1],
      [0.00182, 0],
      [-0.00965, 1],
      [-0.00976, 1],
      [-0.00185, 1],
      [-0.02592, 2],
      [-0.00768, 2],
      [-0.02587, 2],
      [0.0, 2],
      [0.00721, 0],
      [-0.00175, 1],
      [-0.00074, 0],
      [-0.00779, 2],
      [0.0066, 0],
      [-0.00791, 2],
      [0.00762, 0],
      [-0.0101, 1],
      [-0.01377, 2],
      [-0.00022, 0],
      [0.00028, 1],
      [-0.00067, 2],
      [-0.0016, 1],
      [-0.00155, 1]
    ],
    "red_o_points": [],
    "y_categories": ["NORM", "NPV", "nan"],
    "blue_o_points": [],
    "blue_x_points": [
      [-0.00071, 1],
      [-0.00042, 1],
      [0.04851, 0],
      [0.0462, 0],
      [0.00208, 2],
      [0.0, 2],
      [-0.00671, 1],
      [-0.00065, 1],
      [0.00208, 2],
      [0.04688, 0],
      [0.00053, 1],
      [-0.00044, 0],
      [0.00068, 0],
      [0.01035, 0]
    ]
  },
  "QA_mulInjOrthesisType[ShoulderSupport]": {
    "red_x_points": [
      [-0.01609, 0],
      [-0.01599, 0],
      [-0.01497, 0],
      [-0.05976, 2],
      [-0.01545, 0],
      [-0.01566, 0],
      [-0.01535, 0],
      [-0.05926, 2],
      [-0.01524, 0],
      [-0.01558, 0],
      [-0.0155, 0],
      [-0.01553, 0],
      [-0.01544, 0],
      [-0.01567, 0],
      [-0.05809, 2],
      [-0.01563, 0],
      [-0.0159, 0],
      [-0.05729, 2],
      [-0.05741, 3],
      [-0.01554, 0],
      [-0.01543, 0],
      [-0.01538, 0],
      [-0.01579, 0],
      [-0.01577, 0],
      [-0.05882, 3],
      [-0.05987, 3],
      [-0.05922, 3],
      [-0.01528, 0],
      [-0.01567, 0]
    ],
    "red_o_points": [],
    "y_categories": ["N", "NOT APPLICABLE", "Y", "nan"],
    "blue_o_points": [],
    "blue_x_points": [
      [-0.01449, 0],
      [-0.01433, 0],
      [-0.01544, 0],
      [-0.01486, 0],
      [0.11341, 1],
      [0.11303, 1],
      [0.1087, 1],
      [0.11212, 1],
      [-0.01459, 0],
      [0.10998, 1],
      [-0.01485, 0],
      [0.11234, 1],
      [0.11615, 1],
      [0.1139, 1],
      [-0.01448, 0]
    ]
  }
}
