{
  "QS_mulNeuromadSite[T2]": {
    "red_x_points": [
      [-0.00638, 2],
      [-0.01442, 0],
      [-0.01416, 0],
      [-0.01375, 0],
      [-0.01479, 0],
      [-0.01463, 0],
      [-0.01443, 0],
      [-0.00492, 2],
      [-0.0146, 0],
      [-0.01438, 0],
      [-0.01507, 0],
      [-0.00585, 2],
      [0.02902, 1],
      [-0.0055, 2],
      [-0.01462, 0],
      [-0.00535, 2],
      [-0.01243, 0],
      [-0.0141, 0],
      [-0.00631, 2],
      [-0.00602, 2],
      [-0.00443, 2],
      [-0.01264, 0],
      [-0.00612, 2],
      [-0.00586, 2],
      [-0.00592, 2],
      [-0.01435, 0],
      [-0.00607, 2],
      [-0.01433, 0],
      [-0.00414, 2],
      [0.02543, 1],
      [-0.0147, 0]
    ],
    "red_o_points": [],
    "y_categories": ["N", "NOT APPLICABLE", "nan"],
    "blue_o_points": [],
    "blue_x_points": [
      [0.06654, 1],
      [-0.0013, 2],
      [0.0303, 1],
      [-0.00378, 0],
      [-0.00107, 2],
      [0.02941, 1],
      [0.0391, 1]
    ]
  },
  "participant_code": {
    "red_x_points": [
      [-0.04395, 1],
      [-0.04376, 2],
      [-0.04484, 3],
      [-0.04353, 4],
      [-0.04521, 5],
      [-0.04372, 6],
      [-0.0426, 7],
      [-0.04297, 8],
      [-0.04316, 9],
      [-0.04302, 10],
      [-0.04311, 11],
      [-0.04376, 12],
      [-0.04269, 14],
      [-0.04428, 16],
      [-0.04465, 17],
      [-0.04376, 19],
      [-0.04306, 20],
      [-0.04502, 22],
      [-0.04367, 23],
      [-0.04507, 25],
      [-0.04428, 26],
      [-0.0453, 27],
      [-0.04414, 28],
      [-0.04344, 29],
      [-0.04451, 30],
      [-0.04376, 32],
      [-0.04372, 33],
      [-0.04395, 34],
      [-0.04297, 35],
      [-0.04386, 36],
      [-0.04493, 37]
    ],
    "red_o_points": [],
    "y_categories": [
      "P16554",
      "P18297",
      "P19283",
      "P19287",
      "P23391",
      "P31645",
      "P31691",
      "P34778",
      "P35046",
      "P36328",
      "P43633",
      "P4544",
      "P46417",
      "P48965",
      "P53068",
      "P5497",
      "P59529",
      "P62483",
      "P64658",
      "P65202",
      "P66816",
      "P6751",
      "P7408",
      "P75566",
      "P76226",
      "P79971",
      "P82621",
      "P82990",
      "P84932",
      "P85825",
      "P86989",
      "P8770",
      "P87791",
      "P90550",
      "P93159",
      "P94969",
      "P96710",
      "P9744",
      "nan"
    ],
    "blue_o_points": [],
    "blue_x_points": [
      [0.12586, 0],
      [0.12525, 13],
      [0.12877, 15],
      [0.12785, 18],
      [0.12969, 21],
      [0.12831, 24],
      [0.13031, 31]
    ]
  },
  "QA_mulInjOrthesisType[ArmSling]": {
    "red_x_points": [
      [-0.02337, 2],
      [-0.02175, 2],
      [-0.0218, 2],
      [-0.02088, 2],
      [-0.02231, 2],
      [-0.02189, 2],
      [-0.02259, 2],
      [-0.02115, 2],
      [-0.02188, 2],
      [-0.02082, 2],
      [-0.02162, 2],
      [-0.02263, 2],
      [0.06112, 1],
      [-0.02317, 2],
      [-0.02265, 2],
      [-0.02276, 2],
      [-0.02799, 0],
      [-0.02174, 2],
      [-0.02281, 2],
      [-0.02301, 2],
      [-0.02656, 0],
      [-0.02687, 3],
      [-0.02316, 2],
      [0.06523, 1],
      [-0.0219, 2],
      [-0.02171, 2],
      [-0.02189, 2],
      [-0.02173, 2],
      [-0.02726, 3],
      [-0.03795, 3],
      [-0.02144, 2]
    ],
    "red_o_points": [],
    "y_categories": ["N", "NOT APPLICABLE", "Y", "nan"],
    "blue_o_points": [],
    "blue_x_points": [
      [-0.01237, 2],
      [0.06671, 1],
      [0.05983, 1],
      [0.0665, 1],
      [0.06529, 1],
      [0.05629, 1],
      [0.06008, 1]
    ]
  },
  "QS_lstBpsurgSide": {
    "red_x_points": [
      [-0.00812, 3],
      [-0.01031, 0],
      [-0.01086, 0],
      [-0.0108, 0],
      [-0.02082, 2],
      [-0.01069, 0],
      [-0.01087, 0],
      [-0.00731, 3],
      [-0.01132, 0],
      [-0.02047, 2],
      [-0.02072, 2],
      [-0.00814, 3],
      [0.03002, 1],
      [-0.008, 3],
      [-0.02491, 2],
      [-0.00797, 3],
      [-0.02484, 2],
      [-0.01914, 2],
      [-0.00854, 3],
      [-0.00813, 3],
      [-0.00583, 3],
      [-0.00871, 0],
      [-0.00823, 3],
      [-0.00798, 3],
      [-0.0086, 3],
      [-0.02102, 2],
      [-0.00828, 3],
      [-0.02042, 2],
      [-0.00633, 3],
      [0.03329, 1],
      [-0.01081, 0]
    ],
    "red_o_points": [],
    "y_categories": ["L", "NOT APPLICABLE", "R", "nan"],
    "blue_o_points": [],
    "blue_x_points": [
      [0.07515, 1],
      [-0.00241, 3],
      [0.03547, 1],
      [0.00591, 0],
      [-0.00254, 3],
      [0.03603, 1],
      [0.04393, 1]
    ]
  },
  "QA_mulInjOrthesisType[ShoulderSupport]": {
    "red_x_points": [
      [-0.02788, 0],
      [-0.02637, 0],
      [-0.0262, 0],
      [-0.02702, 0],
      [-0.02662, 0],
      [-0.02775, 0],
      [-0.02764, 0],
      [-0.03218, 2],
      [-0.02674, 0],
      [-0.02734, 0],
      [-0.02654, 0],
      [-0.02746, 0],
      [0.07703, 1],
      [-0.02719, 0],
      [-0.02692, 0],
      [-0.02639, 0],
      [-0.03351, 2],
      [-0.02589, 0],
      [-0.0281, 0],
      [-0.02737, 0],
      [-0.03262, 2],
      [-0.03268, 3],
      [-0.0275, 0],
      [0.07935, 1],
      [-0.02733, 0],
      [-0.02627, 0],
      [-0.02675, 0],
      [-0.02571, 0],
      [-0.03327, 3],
      [-0.04541, 3],
      [-0.02725, 0]
    ],
    "red_o_points": [],
    "y_categories": ["N", "NOT APPLICABLE", "Y", "nan"],
    "blue_o_points": [],
    "blue_x_points": [
      [-0.01604, 0],
      [0.08161, 1],
      [0.06773, 1],
      [0.08065, 1],
      [0.07844, 1],
      [0.07157, 1],
      [0.07379, 1]
    ]
  },
  "QA_lstPexMuscstrength[ShoulderAbduc]": {
    "red_x_points": [
      [-0.01506, 1],
      [-0.01442, 1],
      [-0.01402, 1],
      [-0.0148, 1],
      [-0.01453, 1],
      [-0.0143, 1],
      [-0.01379, 1],
      [-0.01391, 1],
      [-0.01463, 1],
      [-0.01397, 1],
      [-0.01429, 1],
      [-0.01526, 1],
      [0.01173, 2],
      [0.01335, 2],
      [0.0125, 2],
      [0.01224, 2],
      [0.0139, 2],
      [-0.01522, 1],
      [-0.01423, 1],
      [-0.01452, 1],
      [-0.01487, 1],
      [-0.01416, 1],
      [0.01285, 2],
      [-0.02127, 1],
      [-0.01411, 1],
      [-0.01375, 1],
      [-0.01507, 1],
      [-0.01447, 1],
      [-0.01418, 1],
      [0.01136, 2],
      [-0.01391, 1]
    ],
    "red_o_points": [],
    "y_categories": ["GREATER THAN OR EQUALS TO 3", "LESS THAN 3", "nan"],
    "blue_o_points": [],
    "blue_x_points": [
      [0.01286, 2],
      [0.01407, 2],
      [0.05728, 0],
      [0.01381, 2],
      [0.01472, 2],
      [0.05848, 0],
      [-0.00592, 1]
    ]
  },
  "QA_mulInjTbpiCause[Motorcycle]": {
    "red_x_points": [
      [0.00758, 0],
      [-0.00307, 1],
      [-0.00307, 1],
      [-0.00296, 1],
      [-0.00321, 1],
      [-0.00303, 1],
      [-0.00311, 1],
      [-0.00319, 1],
      [-0.00301, 1],
      [-0.0032, 1],
      [-0.00298, 1],
      [0.00641, 0],
      [-0.04879, 1],
      [-0.00432, 1],
      [-0.00406, 1],
      [-0.00407, 1],
      [-0.00401, 1],
      [-0.00318, 1],
      [0.00659, 0],
      [-0.00323, 1],
      [-0.00313, 1],
      [-0.00338, 1],
      [-0.00428, 1],
      [-0.00435, 1],
      [0.00638, 0],
      [-0.00308, 1],
      [-0.00313, 1],
      [-0.0032, 1],
      [-0.00296, 1],
      [-0.04651, 1],
      [-0.003, 1]
    ],
    "red_o_points": [],
    "y_categories": ["N", "Y", "nan"],
    "blue_o_points": [],
    "blue_x_points": [
      [0.03396, 0],
      [-0.00265, 1],
      [0.02274, 0],
      [-0.0032, 1],
      [-0.00299, 1],
      [0.02347, 0],
      [0.02466, 0]
    ]
  },
  "QA_yonInjBpsurg": {
    "red_x_points": [
      [-0.01261, 1],
      [-0.01067, 1],
      [-0.01035, 1],
      [-0.01084, 1],
      [-0.01035, 1],
      [-0.01075, 1],
      [-0.01053, 1],
      [-0.01012, 1],
      [-0.01055, 1],
      [-0.01057, 1],
      [-0.01018, 1],
      [-0.0124, 1],
      [0.0285, 0],
      [-0.00999, 1],
      [-0.0099, 1],
      [-0.00977, 1],
      [-0.00836, 1],
      [-0.01038, 1],
      [-0.01239, 1],
      [-0.01054, 1],
      [-0.00907, 1],
      [-0.00917, 1],
      [-0.01017, 1],
      [-0.00945, 1],
      [-0.01224, 1],
      [-0.01046, 1],
      [-0.01035, 1],
      [-0.01029, 1],
      [-0.00889, 1],
      [0.02771, 0],
      [-0.01037, 1]
    ],
    "red_o_points": [],
    "y_categories": ["N", "Y", "nan"],
    "blue_o_points": [],
    "blue_x_points": [
      [0.06678, 0],
      [-0.00566, 1],
      [0.03084, 0],
      [-0.00667, 1],
      [-0.00537, 1],
      [0.03341, 0],
      [0.04333, 0]
    ]
  }
}
