{
  "QA_lstPexPain[C8]": {
    "red_x_points": [
      [0.00697, 0],
      [-0.00574, 2],
      [-0.00581, 2],
      [0.0047, 0],
      [-0.00591, 2],
      [-0.00668, 1],
      [-0.01267, 1],
      [-0.01407, 1],
      [-0.00818, 2],
      [-0.00711, 2],
      [-0.01211, 2],
      [-0.00521, 2],
      [-0.01211, 1],
      [0.00478, 0],
      [-0.01197, 1],
      [-0.01023, 1],
      [-0.00425, 2],
      [-0.00874, 2],
      [-0.0119, 2],
      [-0.00615, 2],
      [-0.01474, 1],
      [-0.00474, 1],
      [-0.01561, 1]
    ],
    "red_o_points": [],
    "y_categories": ["NORM", "NPV", "nan"],
    "blue_o_points": [],
    "blue_x_points": [
      [-0.00652, 1],
      [-0.00645, 1],
      [0.01275, 0],
      [0.0007, 1],
      [0.01964, 0],
      [0.01816, 0],
      [0.01645, 0],
      [0.01202, 0],
      [-0.00573, 2],
      [-0.00036, 2],
      [-0.00407, 2],
      [0.00084, 1],
      [-0.00402, 2],
      [0.01422, 0],
      [0.0144, 0],
      [0.01475, 0],
      [-0.00463, 2],
      [0.01588, 0],
      [0.01488, 0],
      [0.02267, 0],
      [0.02191, 0]
    ]
  },
  "QA_txtInjMedicatioListNer": {
    "red_x_points": [
      [-0.00852, 1],
      [-0.00643, 1],
      [-0.00602, 1],
      [-0.00562, 1],
      [-0.00729, 1],
      [-0.00092, 2],
      [-0.00888, 1],
      [0.00231, 0],
      [-0.01175, 2],
      [-0.00581, 2],
      [-0.00424, 2],
      [-0.00517, 2],
      [-0.00813, 1],
      [-0.00866, 1],
      [-0.00055, 2],
      [-0.00817, 1],
      [-0.00282, 2],
      [-0.00809, 1],
      [-0.0108, 1],
      [-0.00644, 1],
      [-0.00498, 1],
      [-0.00013, 2],
      [-0.00297, 2]
    ],
    "red_o_points": [],
    "y_categories": ["N", "Y", "nan"],
    "blue_o_points": [],
    "blue_x_points": [
      [0.03913, 0],
      [0.00157, 2],
      [0.0132, 0],
      [-0.00402, 1],
      [0.00233, 2],
      [0.0029, 2],
      [0.00397, 2],
      [-0.00455, 1],
      [-0.00159, 1],
      [-0.00312, 1],
      [0.03181, 0],
      [0.00096, 2],
      [0.02506, 0],
      [-0.00412, 1],
      [0.0018, 2],
      [0.00103, 2],
      [-0.00186, 1],
      [0.01272, 0],
      [0.01707, 0],
      [-0.00451, 1],
      [0.00033, 2]
    ]
  },
  "QA_lstPexMuscstrength[FingersFlex]": {
    "red_x_points": [
      [0.00311, 2],
      [0.00375, 2],
      [-0.04119, 1],
      [0.01245, 0],
      [-0.03926, 1],
      [-0.04071, 1],
      [-0.0451, 1],
      [0.01277, 0],
      [0.00355, 2],
      [0.00321, 2],
      [0.01312, 0],
      [0.00334, 2],
      [-0.04418, 1],
      [0.01206, 0],
      [0.01254, 0],
      [-0.04318, 1],
      [-0.03741, 1],
      [0.00415, 2],
      [0.01185, 0],
      [0.01047, 0],
      [0.0027, 2],
      [-0.03735, 1],
      [0.00301, 2]
    ],
    "red_o_points": [],
    "y_categories": ["GREATER THAN OR EQUALS TO 3", "LESS THAN 3", "nan"],
    "blue_o_points": [],
    "blue_x_points": [
      [0.01737, 0],
      [0.01654, 0],
      [0.0123, 0],
      [0.01384, 0],
      [0.01539, 0],
      [0.01427, 0],
      [0.01382, 0],
      [0.01339, 0],
      [0.00503, 2],
      [0.00492, 2],
      [0.00506, 2],
      [0.00582, 2],
      [0.00511, 2],
      [0.01385, 0],
      [0.01324, 0],
      [0.01295, 0],
      [0.00559, 2],
      [0.0048, 2],
      [0.01312, 0],
      [0.005, 2],
      [0.00491, 2]
    ]
  },
  "QA_lstPexTouch[C7]": {
    "red_x_points": [
      [-0.01546, 1],
      [-0.00537, 2],
      [-0.00995, 1],
      [-0.01404, 1],
      [-0.00392, 2],
      [-0.00959, 1],
      [-0.01365, 1],
      [-0.01508, 1],
      [-0.00448, 2],
      [-0.00736, 2],
      [-0.01544, 1],
      [-0.00453, 2],
      [-0.01575, 1],
      [0.00772, 0],
      [-0.01424, 1],
      [-0.01215, 1],
      [-0.0038, 2],
      [0.01205, 0],
      [-0.01078, 1],
      [-0.00422, 2],
      [-0.0189, 1],
      [-0.00892, 1],
      [-0.01745, 1]
    ],
    "red_o_points": [],
    "y_categories": ["NORM", "NPV", "nan"],
    "blue_o_points": [],
    "blue_x_points": [
      [-0.01153, 1],
      [-0.01213, 1],
      [0.02092, 0],
      [-0.00544, 1],
      [0.0271, 0],
      [-0.00687, 1],
      [0.02753, 0],
      [-0.00791, 1],
      [0.00014, 2],
      [0.00398, 2],
      [-0.00068, 2],
      [-0.00824, 1],
      [0.0011, 2],
      [0.02031, 0],
      [0.02107, 0],
      [0.0214, 0],
      [0.00244, 2],
      [0.02043, 0],
      [0.02914, 0],
      [0.03088, 0],
      [0.03169, 0]
    ]
  },
  "QA_lstPexMuscstrength[WristFlex]": {
    "red_x_points": [
      [-0.00153, 0],
      [-0.00158, 2],
      [-0.00844, 1],
      [0.00071, 0],
      [-0.00517, 1],
      [-0.00937, 1],
      [-0.00364, 0],
      [-0.00147, 0],
      [-0.00207, 2],
      [-0.00308, 2],
      [-0.00178, 0],
      [-0.00114, 2],
      [-0.00806, 1],
      [0.00068, 0],
      [-0.00043, 0],
      [-0.00269, 1],
      [-0.00446, 1],
      [-0.0048, 0],
      [0.00151, 0],
      [0.00017, 0],
      [-0.00329, 2],
      [-0.00635, 1],
      [-0.00736, 2]
    ],
    "red_o_points": [],
    "y_categories": ["GREATER THAN OR EQUALS TO 3", "LESS THAN 3", "nan"],
    "blue_o_points": [],
    "blue_x_points": [
      [0.00832, 1],
      [0.00948, 0],
      [0.00085, 0],
      [0.00359, 0],
      [0.00309, 0],
      [0.00424, 0],
      [0.00239, 0],
      [0.00324, 0],
      [0.00078, 2],
      [0.00114, 2],
      [0.00375, 0],
      [0.00668, 0],
      [0.00154, 2],
      [0.00032, 0],
      [0.00058, 0],
      [0.001, 0],
      [0.00291, 2],
      [0.00553, 1],
      [0.00098, 0],
      [0.01196, 1],
      [0.00128, 2]
    ]
  },
  "QS_mulTransfSite[Oberlin]": {
    "red_x_points": [
      [-0.01626, 1],
      [-0.04706, 0],
      [-0.04285, 0],
      [-0.04932, 0],
      [-0.04558, 0],
      [-0.04583, 0],
      [0.013, 3],
      [-0.01863, 1],
      [0.0134, 3],
      [0.01656, 2],
      [0.01301, 3],
      [-0.04444, 0],
      [0.0129, 3],
      [0.01894, 2],
      [-0.01996, 1],
      [0.01303, 3],
      [-0.04316, 0],
      [0.01295, 3],
      [0.01981, 2],
      [-0.04663, 0],
      [-0.01789, 1],
      [-0.04164, 0],
      [0.01358, 3]
    ],
    "red_o_points": [],
    "y_categories": ["N", "NOT APPLICABLE", "Y", "nan"],
    "blue_o_points": [],
    "blue_x_points": [
      [0.01526, 3],
      [0.01458, 3],
      [0.02243, 2],
      [0.0238, 2],
      [0.01454, 3],
      [0.02542, 2],
      [0.02377, 2],
      [0.02321, 2],
      [0.01743, 3],
      [-0.00532, 1],
      [0.02224, 2],
      [0.02648, 2],
      [0.01506, 3],
      [0.01461, 3],
      [0.01402, 3],
      [0.01454, 3],
      [0.0156, 3],
      [0.01392, 3],
      [-0.00884, 1],
      [0.01451, 3],
      [0.01479, 3]
    ]
  },
  "QS_mulNeuromadSite[C7]": {
    "red_x_points": [
      [-0.01059, 1],
      [-0.00556, 0],
      [-0.00206, 0],
      [0.00169, 0],
      [-0.00398, 0],
      [0.00128, 0],
      [-0.00053, 2],
      [-0.01596, 1],
      [0.0034, 2],
      [-0.00435, 0],
      [0.00149, 2],
      [-0.00475, 0],
      [0.00119, 2],
      [0.00011, 0],
      [-0.02007, 1],
      [0.00048, 2],
      [-0.00409, 0],
      [0.00096, 2],
      [-0.00196, 0],
      [-0.00661, 0],
      [-0.00949, 1],
      [0.00124, 0],
      [0.00052, 2]
    ],
    "red_o_points": [],
    "y_categories": ["N", "NOT APPLICABLE", "nan"],
    "blue_o_points": [],
    "blue_x_points": [
      [0.00399, 2],
      [0.00208, 2],
      [0.00234, 0],
      [0.00546, 0],
      [0.00125, 2],
      [0.00654, 0],
      [0.00419, 0],
      [0.00284, 0],
      [0.00498, 2],
      [0.01629, 1],
      [-0.0021, 0],
      [0.00579, 0],
      [0.00465, 2],
      [0.00226, 2],
      [0.00223, 2],
      [0.00169, 2],
      [0.00511, 2],
      [0.00199, 2],
      [0.00175, 1],
      [0.00243, 2],
      [0.0019, 2]
    ]
  },
  "QA_lstPexMuscstrength[ElbowExte]": {
    "red_x_points": [
      [-0.00615, 2],
      [-0.00353, 2],
      [-0.00459, 1],
      [-0.00212, 1],
      [-0.00861, 1],
      [-0.00253, 1],
      [-0.00262, 1],
      [-0.00163, 0],
      [-0.0025, 2],
      [-0.00666, 2],
      [-0.00459, 1],
      [-0.00222, 2],
      [0.0, 1],
      [-0.01089, 1],
      [-0.00429, 0],
      [-0.00154, 1],
      [-0.00654, 1],
      [-0.00635, 0],
      [-0.00738, 1],
      [-0.00293, 2],
      [-0.00219, 2],
      [-0.00128, 1],
      [-0.00569, 2]
    ],
    "red_o_points": [],
    "y_categories": ["GREATER THAN OR EQUALS TO 3", "LESS THAN 3", "nan"],
    "blue_o_points": [],
    "blue_x_points": [
      [0.00128, 1],
      [0.00142, 1],
      [0.00682, 0],
      [-0.00104, 1],
      [-0.00052, 1],
      [0.01256, 0],
      [0.01422, 0],
      [-0.00117, 1],
      [0.00047, 2],
      [0.00083, 2],
      [0.02166, 0],
      [0.00455, 1],
      [0.00181, 2],
      [0.00685, 0],
      [0.00395, 0],
      [0.00551, 0],
      [0.00157, 2],
      [0.00271, 0],
      [0.00468, 0],
      [0.0054, 1],
      [0.00327, 1]
    ]
  },
  "QA_lstPexTinel[TinelSign]": {
    "red_x_points": [
      [0.00093, 1],
      [-0.00247, 1],
      [-0.01042, 2],
      [0.00151, 1],
      [-2e-5, 1],
      [0.00054, 1],
      [-0.01686, 2],
      [-0.01653, 2],
      [-0.00779, 1],
      [-0.00127, 1],
      [-0.02122, 2],
      [-0.00698, 2],
      [-0.00063, 1],
      [-0.02221, 2],
      [0.00231, 1],
      [-0.01295, 2],
      [0.00058, 1],
      [-0.00239, 1],
      [-0.01698, 2],
      [-0.00938, 2],
      [-0.00023, 1],
      [-0.00768, 2],
      [-0.00302, 1]
    ],
    "red_o_points": [],
    "y_categories": ["ABS", "NAIA", "PT", "nan"],
    "blue_o_points": [],
    "blue_x_points": [
      [0.01044, 1],
      [0.0469, 0],
      [0.01985, 0],
      [-0.00991, 2],
      [0.00626, 1],
      [0.00745, 1],
      [-0.00844, 2],
      [0.00708, 1],
      [0.00843, 2],
      [0.00175, 1],
      [0.00585, 1],
      [0.00473, 1],
      [0.00128, 1],
      [0.02207, 0],
      [0.00565, 1],
      [0.00466, 1],
      [0.00544, 2],
      [0.00252, 1],
      [0.00695, 1],
      [0.00232, 1],
      [0.00191, 1]
    ]
  },
  "QA_yonInjFracture": {
    "red_x_points": [
      [0.00457, 0],
      [-0.00711, 2],
      [0.00509, 0],
      [-0.00869, 2],
      [-0.01266, 1],
      [-0.01631, 1],
      [0.0027, 0],
      [0.0032, 0],
      [-0.0181, 1],
      [-0.01614, 1],
      [0.00479, 0],
      [-0.01208, 1],
      [-0.01793, 1],
      [-0.00449, 0],
      [-0.02343, 1],
      [-0.01357, 1],
      [-0.01055, 1],
      [0.00149, 0],
      [0.00281, 0],
      [0.00653, 0],
      [-0.01232, 1],
      [-0.00876, 1],
      [-0.02516, 1]
    ],
    "red_o_points": [],
    "y_categories": ["N", "Y", "nan"],
    "blue_o_points": [],
    "blue_x_points": [
      [0.01513, 0],
      [0.01737, 0],
      [0.0027, 0],
      [0.00742, 0],
      [0.01152, 2],
      [0.01019, 0],
      [0.00896, 1],
      [0.0059, 1],
      [-0.0073, 1],
      [0.01258, 0],
      [0.01717, 0],
      [0.01415, 0],
      [0.01231, 0],
      [0.00251, 0],
      [0.00439, 0],
      [0.00537, 2],
      [0.01559, 0],
      [0.00578, 0],
      [0.00484, 0],
      [-0.00015, 1],
      [0.0097, 2]
    ]
  },
  "QA_lstPexPain[C7]": {
    "red_x_points": [
      [-0.01177, 1],
      [-0.00944, 2],
      [-0.00798, 2],
      [-0.0114, 1],
      [-0.00842, 2],
      [-0.00731, 1],
      [-0.01037, 1],
      [-0.01317, 1],
      [-0.01184, 2],
      [-0.0123, 2],
      [-0.01396, 2],
      [-0.00907, 2],
      [-0.01086, 1],
      [0.01126, 0],
      [-0.01195, 1],
      [-0.00892, 1],
      [-0.0079, 2],
      [-0.01087, 2],
      [-0.01346, 2],
      [-0.00905, 2],
      [-0.0142, 1],
      [-0.0072, 1],
      [-0.01115, 1]
    ],
    "red_o_points": [],
    "y_categories": ["NORM", "NPV", "nan"],
    "blue_o_points": [],
    "blue_x_points": [
      [-0.00834, 1],
      [-0.00758, 1],
      [0.02295, 0],
      [-0.00175, 1],
      [0.03135, 0],
      [-0.00455, 1],
      [0.03038, 0],
      [0.02875, 0],
      [-0.00871, 2],
      [-0.0019, 2],
      [-0.00743, 2],
      [-0.0032, 1],
      [-0.00806, 2],
      [0.02551, 0],
      [0.02633, 0],
      [0.02804, 0],
      [-0.00776, 2],
      [0.02718, 0],
      [0.03231, 0],
      [-0.00929, 1],
      [0.03709, 0]
    ]
  },
  "QA_lstPexArthre[Index]": {
    "red_x_points": [
      [-0.01269, 0],
      [-0.00149, 2],
      [-0.00345, 2],
      [-0.01224, 0],
      [-0.00327, 0],
      [-0.01023, 0],
      [-0.00159, 1],
      [-0.00058, 1],
      [-0.00153, 2],
      [0.00255, 1],
      [-0.00281, 2],
      [-0.00123, 2],
      [-0.00305, 2],
      [-0.00166, 1],
      [1e-5, 1],
      [-0.00343, 0],
      [-0.00052, 2],
      [-0.00238, 2],
      [-0.00539, 2],
      [-0.00033, 2],
      [-0.00359, 2],
      [-0.00531, 0],
      [-0.00376, 2]
    ],
    "red_o_points": [],
    "y_categories": ["NPV", "PV", "nan"],
    "blue_o_points": [],
    "blue_x_points": [
      [0.00673, 0],
      [-0.00073, 2],
      [0.00133, 1],
      [0.00795, 1],
      [0.0006, 2],
      [0.0104, 1],
      [0.00558, 1],
      [0.00253, 0],
      [-0.00072, 2],
      [-0.00048, 2],
      [-0.00041, 2],
      [0.01665, 1],
      [-0.00057, 2],
      [0.00269, 1],
      [0.00206, 1],
      [0.00101, 0],
      [-0.00072, 2],
      [0.0046, 1],
      [0.00111, 2],
      [0.01118, 1],
      [0.00722, 1]
    ]
  },
  "QS_mulTransfSite[IMc]": {
    "red_x_points": [
      [-0.01597, 1],
      [-0.02281, 2],
      [0.00086, 0],
      [-0.03435, 2],
      [-0.00227, 0],
      [0.00611, 0],
      [0.00217, 3],
      [-0.02054, 1],
      [0.00706, 3],
      [-0.00153, 0],
      [0.00463, 3],
      [-0.02001, 2],
      [0.00305, 3],
      [0.00207, 0],
      [-0.02581, 1],
      [0.00215, 3],
      [-0.00371, 0],
      [0.00375, 3],
      [0.00246, 0],
      [-0.02509, 2],
      [-0.01888, 1],
      [-0.01327, 2],
      [0.00373, 3]
    ],
    "red_o_points": [],
    "y_categories": ["N", "NOT APPLICABLE", "Y", "nan"],
    "blue_o_points": [],
    "blue_x_points": [
      [0.00879, 3],
      [0.00629, 3],
      [0.00641, 0],
      [0.01161, 0],
      [0.006, 3],
      [0.0116, 0],
      [0.0064, 0],
      [0.00963, 0],
      [0.00919, 3],
      [0.01653, 1],
      [0.00345, 0],
      [0.01379, 0],
      [0.00829, 3],
      [0.00649, 3],
      [0.00609, 3],
      [0.00508, 3],
      [0.00962, 3],
      [0.00539, 3],
      [0.00259, 1],
      [0.00728, 3],
      [0.00568, 3]
    ]
  },
  "QA_lstPexMuscstrength[FingersAddu]": {
    "red_x_points": [
      [6e-5, 2],
      [0.00018, 2],
      [-0.02131, 1],
      [-0.001, 2],
      [-0.01888, 1],
      [-0.0214, 1],
      [0.00677, 0],
      [0.00682, 0],
      [-3e-5, 2],
      [0.00014, 2],
      [0.00362, 0],
      [0.00047, 2],
      [-0.0199, 1],
      [0.00873, 0],
      [0.00665, 0],
      [-0.02048, 1],
      [-0.01733, 1],
      [0.00163, 2],
      [-0.00195, 2],
      [-0.01928, 1],
      [-8e-5, 2],
      [-0.01635, 1],
      [-0.00173, 2]
    ],
    "red_o_points": [],
    "y_categories": ["GREATER THAN OR EQUALS TO 3", "LESS THAN 3", "nan"],
    "blue_o_points": [],
    "blue_x_points": [
      [0.01537, 0],
      [-0.00094, 1],
      [0.00735, 0],
      [0.01167, 0],
      [0.01223, 0],
      [0.01267, 0],
      [0.00285, 2],
      [0.01198, 0],
      [0.00095, 2],
      [0.00221, 2],
      [0.00208, 2],
      [0.0037, 2],
      [0.00242, 2],
      [0.00821, 0],
      [0.00738, 0],
      [0.00694, 0],
      [0.00261, 2],
      [0.00234, 2],
      [0.01088, 0],
      [0.00112, 2],
      [0.0006, 2]
    ]
  },
  "QA_lstPexPain[T1]": {
    "red_x_points": [
      [-0.00964, 1],
      [-0.00372, 2],
      [-0.00445, 2],
      [-0.00044, 0],
      [-0.00262, 2],
      [-0.00198, 1],
      [-0.00566, 0],
      [-0.00301, 0],
      [-0.00693, 2],
      [-0.00504, 2],
      [-0.00739, 2],
      [-0.00295, 2],
      [-0.00759, 1],
      [-0.02015, 1],
      [-0.00224, 1],
      [-0.00293, 1],
      [-0.00231, 2],
      [-0.01064, 2],
      [-0.00828, 2],
      [-0.0036, 2],
      [-0.01028, 1],
      [-0.00225, 1],
      [-0.00884, 1]
    ],
    "red_o_points": [],
    "y_categories": ["NORM", "NPV", "nan"],
    "blue_o_points": [],
    "blue_x_points": [
      [0.00388, 1],
      [0.00024, 1],
      [0.0071, 0],
      [0.00541, 1],
      [0.0169, 0],
      [0.00199, 1],
      [0.01593, 0],
      [0.01384, 0],
      [-0.00216, 2],
      [-8e-5, 2],
      [-0.00206, 2],
      [0.00215, 1],
      [-0.0022, 2],
      [0.00774, 0],
      [0.00728, 0],
      [0.00924, 0],
      [-0.00198, 2],
      [-0.00618, 1],
      [0.01372, 0],
      [0.02179, 0],
      [0.02039, 0]
    ]
  },
  "QS_mulTransfSite[AcMc]": {
    "red_x_points": [
      [-0.01257, 1],
      [-0.00835, 0],
      [-0.00342, 0],
      [-0.00784, 0],
      [-0.00413, 0],
      [0.00035, 0],
      [0.00098, 3],
      [-0.01719, 1],
      [0.00455, 3],
      [-0.00546, 0],
      [0.00191, 3],
      [-0.0049, 0],
      [0.00175, 3],
      [-0.00459, 0],
      [-0.02063, 1],
      [0.00107, 3],
      [-0.00521, 0],
      [0.00157, 3],
      [-0.00218, 0],
      [-0.00667, 0],
      [-0.0141, 1],
      [-0.0007, 0],
      [0.00173, 3]
    ],
    "red_o_points": [],
    "y_categories": ["N", "NOT APPLICABLE", "Y", "nan"],
    "blue_o_points": [],
    "blue_x_points": [
      [0.0051, 3],
      [0.00329, 3],
      [0.00146, 0],
      [0.00453, 0],
      [0.00308, 3],
      [0.00509, 0],
      [0.00105, 0],
      [0.02538, 2],
      [0.00571, 3],
      [0.01509, 1],
      [-0.00296, 0],
      [0.00447, 0],
      [0.00493, 3],
      [0.00385, 3],
      [0.00367, 3],
      [0.00271, 3],
      [0.0052, 3],
      [0.00254, 3],
      [0.00218, 1],
      [0.00503, 3],
      [0.00268, 3]
    ]
  },
  "QA_lstPexKine[Shoulder]": {
    "red_x_points": [
      [0.00148, 1],
      [-0.00078, 2],
      [-0.00444, 2],
      [0.00168, 1],
      [-0.00206, 2],
      [-0.01555, 0],
      [0.00141, 1],
      [0.00212, 1],
      [-0.00097, 2],
      [0.00207, 1],
      [-0.00284, 2],
      [-0.00086, 2],
      [-0.00188, 2],
      [-0.04189, 0],
      [0.00212, 1],
      [0.00168, 1],
      [-0.00107, 2],
      [-0.00251, 2],
      [-0.009, 2],
      [-0.00149, 2],
      [-0.00131, 2],
      [0.00177, 1],
      [-0.0023, 2]
    ],
    "red_o_points": [],
    "y_categories": ["NPV", "PV", "nan"],
    "blue_o_points": [],
    "blue_x_points": [
      [0.00526, 1],
      [-0.00137, 2],
      [0.00582, 1],
      [0.01018, 1],
      [-5e-5, 2],
      [0.01026, 1],
      [0.01118, 1],
      [0.00838, 1],
      [-0.00027, 2],
      [-0.00031, 2],
      [-0.00085, 2],
      [0.01009, 1],
      [-0.00032, 2],
      [0.00481, 1],
      [0.00339, 1],
      [-0.00027, 0],
      [-0.00061, 2],
      [0.00325, 1],
      [0.00072, 2],
      [0.00315, 1],
      [0.0022, 1]
    ]
  },
  "QA_mulInjOrthesisType[ShoulderSupport]": {
    "red_x_points": [
      [-0.00857, 0],
      [-0.01145, 0],
      [-0.00453, 0],
      [-0.02023, 2],
      [-0.00592, 0],
      [-0.00309, 0],
      [-0.00177, 0],
      [-0.00685, 1],
      [-0.01201, 0],
      [-0.00837, 0],
      [-0.00567, 0],
      [-0.01781, 2],
      [-0.01076, 3],
      [-0.00327, 0],
      [-0.00639, 1],
      [-0.00237, 0],
      [-0.01151, 3],
      [-0.01232, 0],
      [-0.00577, 0],
      [-0.00716, 0],
      [-0.01075, 3],
      [-0.00141, 0],
      [-0.00844, 0]
    ],
    "red_o_points": [],
    "y_categories": ["N", "NOT APPLICABLE", "Y", "nan"],
    "blue_o_points": [],
    "blue_x_points": [
      [0.00012, 0],
      [-0.00064, 0],
      [0.00129, 0],
      [0.00306, 0],
      [0.01636, 2],
      [0.00257, 0],
      [0.00092, 0],
      [0.00234, 0],
      [0.04821, 1],
      [0.03354, 1],
      [-0.00709, 0],
      [0.02899, 1],
      [0.03311, 1],
      [0.00012, 0],
      [0.00547, 2],
      [-0.0001, 0],
      [-0.00968, 0],
      [0.01264, 1],
      [0.0125, 1],
      [-0.00239, 0],
      [0.0051, 3]
    ]
  },
  "QA_lstPexTouch[C8]": {
    "red_x_points": [
      [0.00819, 0],
      [-0.00463, 2],
      [-0.01013, 1],
      [-0.0177, 1],
      [-0.0033, 2],
      [-0.0088, 1],
      [-0.01328, 1],
      [-0.01249, 1],
      [-0.00514, 2],
      [-0.0058, 2],
      [-0.0142, 1],
      [-0.00365, 2],
      [-0.01712, 1],
      [0.00957, 0],
      [-0.01194, 1],
      [-0.0111, 1],
      [-0.00325, 2],
      [0.00699, 0],
      [-0.01166, 1],
      [-0.00448, 2],
      [-0.01756, 1],
      [-0.00966, 1],
      [-0.01662, 1]
    ],
    "red_o_points": [],
    "y_categories": ["NORM", "NPV", "nan"],
    "blue_o_points": [],
    "blue_x_points": [
      [-0.00963, 1],
      [-0.01191, 1],
      [0.01313, 0],
      [-0.00651, 1],
      [0.0233, 0],
      [-0.00745, 1],
      [0.02006, 0],
      [0.02305, 0],
      [0.00076, 2],
      [0.0027, 2],
      [0.00058, 2],
      [-0.00598, 1],
      [0.00236, 2],
      [0.01676, 0],
      [0.01441, 0],
      [0.01908, 0],
      [0.0024, 2],
      [0.01393, 0],
      [0.01728, 0],
      [0.0268, 0],
      [0.02265, 0]
    ]
  },
  "QA_lstPexPain[C6]": {
    "red_x_points": [
      [-0.00032, 1],
      [-0.003, 2],
      [-0.00282, 2],
      [-0.00148, 1],
      [-0.0024, 2],
      [2e-5, 1],
      [-0.00087, 1],
      [-0.00071, 1],
      [-0.00496, 2],
      [-0.003, 2],
      [-0.00638, 2],
      [-0.00209, 2],
      [-0.002, 1],
      [-0.00302, 1],
      [-0.00066, 1],
      [-0.0008, 1],
      [-0.00181, 2],
      [-0.00527, 2],
      [-0.00475, 2],
      [-0.00271, 2],
      [-0.00095, 1],
      [-0.00029, 1],
      [-0.00171, 1]
    ],
    "red_o_points": [],
    "y_categories": ["NORM", "NPV", "nan"],
    "blue_o_points": [],
    "blue_x_points": [
      [-0.00058, 1],
      [-0.00052, 1],
      [0.00896, 0],
      [-0.0001, 1],
      [0.0189, 0],
      [0.00012, 1],
      [2e-5, 1],
      [-0.00041, 1],
      [-0.0022, 2],
      [-0.00153, 2],
      [-0.00169, 2],
      [-1e-5, 1],
      [-0.00181, 2],
      [0.01288, 0],
      [-0.00073, 1],
      [0.01369, 0],
      [-0.0023, 2],
      [0.01052, 0],
      [-0.00031, 1],
      [-0.00062, 1],
      [-0.00029, 1]
    ]
  },
  "QS_mulTransfSite[AcSsAA]": {
    "red_x_points": [
      [-0.01434, 1],
      [-0.01897, 2],
      [-0.00115, 0],
      [0.00052, 0],
      [-0.01404, 2],
      [0.00258, 0],
      [-0.00044, 3],
      [-0.02091, 1],
      [0.00695, 3],
      [-0.02128, 2],
      [0.00285, 3],
      [-0.0021, 0],
      [0.00203, 3],
      [-0.0126, 0],
      [-0.02346, 1],
      [0.00093, 3],
      [-0.01215, 2],
      [0.00286, 3],
      [-0.00191, 0],
      [-0.01772, 2],
      [-0.01307, 1],
      [0.00078, 0],
      [0.00225, 3]
    ],
    "red_o_points": [],
    "y_categories": ["N", "NOT APPLICABLE", "Y", "nan"],
    "blue_o_points": [],
    "blue_x_points": [
      [0.00654, 3],
      [0.0032, 3],
      [0.00741, 2],
      [0.0057, 0],
      [0.00336, 3],
      [0.00788, 0],
      [0.01715, 2],
      [0.00128, 0],
      [0.00861, 3],
      [0.02105, 1],
      [0.01217, 0],
      [0.0089, 0],
      [0.00894, 3],
      [0.00465, 3],
      [0.00437, 3],
      [0.00381, 3],
      [0.0104, 3],
      [0.00478, 3],
      [0.00304, 1],
      [0.00518, 3],
      [0.00397, 3]
    ]
  },
  "QA_lstPexTouch[T1]": {
    "red_x_points": [
      [-0.01293, 1],
      [-0.00298, 2],
      [-0.00582, 1],
      [0.00489, 0],
      [-0.00273, 2],
      [-0.00739, 1],
      [0.00226, 0],
      [-0.01419, 1],
      [-0.00357, 2],
      [-0.00627, 2],
      [-0.01217, 1],
      [-0.00273, 2],
      [-0.0089, 1],
      [-0.02119, 1],
      [-0.01153, 1],
      [-0.00643, 1],
      [-0.00245, 2],
      [-0.00076, 0],
      [-0.01078, 1],
      [-0.00589, 2],
      [-0.01473, 1],
      [-0.00525, 1],
      [-0.01036, 1]
    ],
    "red_o_points": [],
    "y_categories": ["NORM", "NPV", "nan"],
    "blue_o_points": [],
    "blue_x_points": [
      [-0.00566, 1],
      [-0.00604, 1],
      [0.01774, 0],
      [-0.00504, 1],
      [-0.00566, 1],
      [0.02229, 0],
      [0.02393, 0],
      [0.02073, 0],
      [0.00066, 2],
      [0.00436, 2],
      [-0.00054, 2],
      [-0.00522, 1],
      [0.00266, 2],
      [0.01311, 0],
      [0.0134, 0],
      [0.01496, 0],
      [0.00247, 2],
      [-0.00539, 1],
      [0.0213, 0],
      [0.01925, 0],
      [0.01858, 0]
    ]
  },
  "QA_mulInjOrthesisType[ArmSling]": {
    "red_x_points": [
      [-0.0088, 2],
      [-0.01262, 2],
      [-0.00477, 2],
      [-0.00259, 2],
      [-0.00709, 2],
      [-0.00248, 2],
      [-0.00187, 2],
      [-0.00846, 1],
      [-0.01365, 2],
      [-0.01108, 2],
      [-0.00561, 2],
      [-0.02828, 0],
      [-0.008, 3],
      [-0.00164, 2],
      [-0.01052, 1],
      [-0.00177, 2],
      [-0.01768, 3],
      [-0.01241, 2],
      [-0.00531, 2],
      [-0.00822, 2],
      [-0.00929, 3],
      [-0.00107, 2],
      [-0.00765, 2]
    ],
    "red_o_points": [],
    "y_categories": ["N", "NOT APPLICABLE", "Y", "nan"],
    "blue_o_points": [],
    "blue_x_points": [
      [0.00134, 2],
      [-0.0001, 2],
      [0.00122, 2],
      [0.00165, 2],
      [-0.00138, 2],
      [0.00213, 2],
      [0.00067, 2],
      [-0.00047, 2],
      [0.05979, 1],
      [0.04268, 1],
      [-0.00829, 2],
      [0.03155, 1],
      [0.03758, 1],
      [0.0003, 2],
      [0.00814, 0],
      [-0.00033, 2],
      [-0.00993, 2],
      [0.01227, 1],
      [0.01189, 1],
      [-0.00459, 2],
      [0.00476, 3]
    ]
  },
  "QA_lstPexTouch[C5]": {
    "red_x_points": [
      [-0.00609, 0],
      [-0.00067, 2],
      [-0.00109, 1],
      [-0.00185, 1],
      [-0.0009, 2],
      [-0.00017, 1],
      [-0.00081, 1],
      [-0.00392, 1],
      [-0.00141, 2],
      [-0.00097, 2],
      [-0.00213, 1],
      [-0.00047, 2],
      [-0.00176, 1],
      [-0.00206, 1],
      [-0.00368, 1],
      [-0.00067, 1],
      [-0.0003, 2],
      [-0.00377, 1],
      [-0.00116, 1],
      [-0.00248, 2],
      [-0.00227, 1],
      [-0.00022, 1],
      [-0.00194, 1]
    ],
    "red_o_points": [],
    "y_categories": ["NORM", "NPV", "nan"],
    "blue_o_points": [],
    "blue_x_points": [
      [-0.00087, 1],
      [-0.00103, 1],
      [-0.00011, 1],
      [-0.00046, 1],
      [0.01476, 0],
      [0.00025, 1],
      [-5e-5, 1],
      [-0.00011, 1],
      [0.00084, 2],
      [0.00305, 2],
      [0.00062, 2],
      [-1e-5, 1],
      [0.00172, 2],
      [-0.00066, 1],
      [0.00568, 0],
      [-0.00064, 1],
      [0.00101, 2],
      [0.00534, 0],
      [0.01103, 0],
      [0.00012, 1],
      [0.00027, 1]
    ]
  },
  "QA_lstPexMuscstrength[ThumbOppo]": {
    "red_x_points": [
      [-8e-5, 2],
      [-0.00013, 2],
      [-0.01219, 1],
      [-0.02398, 1],
      [-0.00705, 1],
      [-0.01056, 1],
      [-0.00174, 0],
      [0.00056, 0],
      [0.00042, 2],
      [9e-5, 2],
      [-0.00546, 0],
      [0.00035, 2],
      [-0.00911, 1],
      [0.00346, 0],
      [0.00023, 0],
      [-0.00445, 1],
      [-0.00596, 1],
      [0.00025, 2],
      [0.0016, 0],
      [-0.00663, 1],
      [-0.00092, 2],
      [-0.00887, 1],
      [-0.00177, 2]
    ],
    "red_o_points": [],
    "y_categories": ["GREATER THAN OR EQUALS TO 3", "LESS THAN 3", "nan"],
    "blue_o_points": [],
    "blue_x_points": [
      [0.00409, 1],
      [0.00463, 1],
      [0.00353, 0],
      [0.00667, 0],
      [0.00804, 0],
      [0.00737, 0],
      [0.00536, 0],
      [0.0107, 0],
      [0.00107, 2],
      [0.00128, 2],
      [0.00189, 2],
      [0.00851, 2],
      [0.00158, 2],
      [0.00445, 0],
      [0.00384, 0],
      [0.00511, 0],
      [0.00346, 2],
      [0.00127, 2],
      [0.00621, 0],
      [0.00222, 2],
      [0.00065, 2]
    ]
  },
  "QA_lstPexPalle[Elbow]": {
    "red_x_points": [
      [-0.00117, 4],
      [-0.00113, 4],
      [-0.00115, 4],
      [0.01168, 3],
      [-0.00115, 4],
      [-0.00094, 4],
      [-0.02606, 1],
      [-0.01928, 1],
      [-0.00162, 4],
      [-0.00147, 4],
      [-0.00194, 4],
      [-0.00096, 4],
      [-0.00153, 4],
      [-0.02689, 1],
      [-0.00103, 4],
      [-0.03272, 0],
      [-0.02382, 2],
      [-0.00233, 4],
      [-0.0022, 4],
      [-0.00146, 4],
      [0.01113, 3],
      [-0.02328, 0],
      [-0.00148, 4]
    ],
    "red_o_points": [],
    "y_categories": ["ABS", "HYPO", "NAIA", "PT", "nan"],
    "blue_o_points": [],
    "blue_x_points": [
      [-0.00054, 4],
      [-0.0012, 4],
      [0.01839, 3],
      [0.02519, 3],
      [-0.00019, 4],
      [-0.00064, 4],
      [-0.00924, 1],
      [0.0213, 3],
      [-0.00135, 4],
      [-0.00091, 4],
      [-0.00105, 4],
      [-0.0007, 4],
      [-0.00131, 4],
      [0.02267, 3],
      [0.02104, 3],
      [0.01831, 3],
      [-0.00119, 4],
      [0.0211, 3],
      [-0.00037, 4],
      [0.02287, 3],
      [-0.0014, 4]
    ]
  },
  "participant_code": {
    "red_x_points": [
      [-0.05555, 0],
      [-0.05526, 2],
      [-0.05332, 3],
      [-0.05342, 4],
      [-0.05565, 5],
      [-0.054, 9],
      [-0.05429, 14],
      [-0.05429, 17],
      [-0.05352, 19],
      [-0.05148, 20],
      [-0.05361, 22],
      [-0.05682, 23],
      [-0.0539, 24],
      [-0.05322, 26],
      [-0.0541, 28],
      [-0.05468, 29],
      [-0.0541, 31],
      [-0.05536, 35],
      [-0.05575, 37],
      [-0.05585, 39],
      [-0.05623, 41],
      [-0.054, 42],
      [-0.05507, 43]
    ],
    "red_o_points": [],
    "y_categories": [
      "P16554",
      "P18297",
      "P19283",
      "P19287",
      "P23172",
      "P23391",
      "P30595",
      "P31645",
      "P31691",
      "P34778",
      "P35046",
      "P36328",
      "P43633",
      "P4544",
      "P46417",
      "P48965",
      "P53068",
      "P5497",
      "P58556",
      "P59529",
      "P62483",
      "P64658",
      "P65202",
      "P66816",
      "P67052",
      "P6751",
      "P7408",
      "P75566",
      "P76226",
      "P79971",
      "P82621",
      "P82990",
      "P84549",
      "P84932",
      "P85825",
      "P86989",
      "P8770",
      "P87791",
      "P90550",
      "P93159",
      "P94969",
      "P96710",
      "P9744",
      "P98500",
      "nan"
    ],
    "blue_o_points": [],
    "blue_x_points": [
      [0.06252, 1],
      [0.05934, 6],
      [0.05965, 7],
      [0.06037, 8],
      [0.05862, 10],
      [0.05985, 11],
      [0.05851, 12],
      [0.05913, 13],
      [0.05923, 15],
      [0.05965, 16],
      [0.05954, 18],
      [0.06037, 21],
      [0.05841, 25],
      [0.06088, 27],
      [0.05903, 30],
      [0.06006, 32],
      [0.05872, 33],
      [0.06016, 34],
      [0.06026, 36],
      [0.05965, 38],
      [0.05954, 40]
    ]
  },
  "QA_lstPexArthre[Shoulder]": {
    "red_x_points": [
      [0.00713, 2],
      [-0.00185, 3],
      [-0.00514, 3],
      [0.00766, 2],
      [-0.01545, 0],
      [-0.02556, 1],
      [0.00889, 2],
      [0.00876, 2],
      [-0.00221, 3],
      [0.00506, 2],
      [-0.00505, 3],
      [-0.00162, 3],
      [-0.00515, 3],
      [-0.04387, 1],
      [0.00769, 2],
      [-0.02413, 1],
      [-0.00194, 3],
      [-0.00525, 3],
      [-0.01025, 3],
      [-0.00201, 3],
      [-0.00509, 3],
      [-0.0177, 1],
      [-0.00589, 3]
    ],
    "red_o_points": [],
    "y_categories": ["NAIA", "NPV", "PV", "nan"],
    "blue_o_points": [],
    "blue_x_points": [
      [0.01688, 2],
      [-0.00364, 3],
      [0.00927, 2],
      [0.01604, 2],
      [-0.00109, 3],
      [0.01563, 2],
      [0.01501, 2],
      [0.01271, 2],
      [-0.00156, 3],
      [-0.00076, 3],
      [-0.00181, 3],
      [0.01752, 2],
      [-0.00102, 3],
      [0.00956, 2],
      [0.00798, 2],
      [-0.00178, 1],
      [-0.00111, 3],
      [0.00717, 2],
      [-0.00104, 3],
      [0.01111, 2],
      [0.00789, 2]
    ]
  },
  "QA_lstPexMuscstrength[ShoulderExrot]": {
    "red_x_points": [
      [-0.00123, 2],
      [-0.00045, 2],
      [-0.01813, 0],
      [-0.00099, 2],
      [0.00349, 1],
      [-0.00106, 2],
      [0.00366, 1],
      [-0.0324, 0],
      [-0.00042, 2],
      [-0.0007, 2],
      [-0.00158, 2],
      [-0.00037, 2],
      [-0.0008, 2],
      [0.00487, 1],
      [-0.0388, 0],
      [0.00333, 1],
      [0.00025, 2],
      [0.0001, 2],
      [0.00571, 1],
      [-0.01963, 0],
      [-0.00156, 2],
      [0.00213, 1],
      [-0.001, 2]
    ],
    "red_o_points": [],
    "y_categories": ["GREATER THAN OR EQUALS TO 3", "LESS THAN 3", "nan"],
    "blue_o_points": [],
    "blue_x_points": [
      [0.01406, 1],
      [0.0003, 2],
      [0.00705, 1],
      [0.00829, 1],
      [0.00878, 1],
      [0.01455, 1],
      [0.00604, 1],
      [7e-5, 2],
      [0.00031, 2],
      [0.00122, 2],
      [0.00118, 2],
      [0.00204, 2],
      [0.00144, 2],
      [0.0063, 1],
      [0.00696, 1],
      [-9e-5, 2],
      [0.00104, 2],
      [0.00157, 2],
      [0.01459, 1],
      [-1e-5, 2],
      [-0.00012, 2]
    ]
  },
  "QA_equInjTbpiTime": {
    "red_x_points": [
      [-0.01761, 0],
      [-0.01517, 0],
      [0.00246, 3],
      [0.00207, 3],
      [-0.01297, 0],
      [-0.01162, 0],
      [-0.01302, 0],
      [-0.01554, 0],
      [0.00345, 3],
      [-0.01663, 0],
      [-0.0184, 0],
      [-0.01368, 0],
      [0.00078, 3],
      [-0.00059, 3],
      [-0.01633, 0],
      [-0.01134, 0],
      [-0.01631, 2],
      [-0.03367, 2],
      [-0.01557, 0],
      [-0.02309, 2],
      [-0.01725, 0],
      [0.00187, 3],
      [0.01382, 1]
    ],
    "red_o_points": [],
    "y_categories": [
      "0 TO 6 MONTHS",
      "13 TO 24 MONTHS",
      "25 MONTHS OR MORE",
      "7 TO 12 MONTHS",
      "nan"
    ],
    "blue_o_points": [],
    "blue_x_points": [
      [-0.01078, 0],
      [0.03363, 1],
      [-0.00926, 0],
      [0.03771, 1],
      [0.00763, 3],
      [-0.01062, 0],
      [-0.00715, 0],
      [0.00695, 3],
      [-0.01081, 0],
      [-0.00054, 2],
      [0.0389, 1],
      [0.01067, 3],
      [0.03569, 1],
      [0.00678, 3],
      [0.02958, 1],
      [0.0288, 1],
      [0.01122, 3],
      [0.0286, 1],
      [0.01307, 3],
      [0.0105, 3],
      [-0.00626, 0]
    ]
  },
  "QA_lstPexKine[Elbow]": {
    "red_x_points": [
      [-0.00028, 1],
      [-0.00026, 2],
      [-0.0022, 2],
      [0.00053, 1],
      [-0.00087, 2],
      [-0.00678, 0],
      [-0.00066, 1],
      [-0.00089, 1],
      [-0.00056, 2],
      [0.00019, 1],
      [-0.00151, 2],
      [-0.00037, 2],
      [-0.00117, 2],
      [5e-5, 1],
      [-0.00018, 1],
      [-0.00211, 0],
      [-0.00065, 2],
      [-0.00089, 2],
      [-0.00285, 2],
      [-0.00048, 2],
      [-0.00035, 2],
      [-0.00477, 0],
      [-0.00107, 2]
    ],
    "red_o_points": [],
    "y_categories": ["NPV", "PV", "nan"],
    "blue_o_points": [],
    "blue_x_points": [
      [0.00725, 0],
      [-0.00016, 2],
      [0.00018, 1],
      [0.00294, 1],
      [0.00022, 2],
      [0.00293, 1],
      [0.00133, 1],
      [0.00154, 1],
      [3e-5, 2],
      [3e-5, 2],
      [-1e-5, 2],
      [0.00582, 1],
      [4e-5, 2],
      [0.00098, 1],
      [0.00029, 1],
      [0.0013, 0],
      [-0.00017, 2],
      [0.00044, 1],
      [0.00065, 2],
      [0.00222, 1],
      [0.0003, 1]
    ]
  },
  "QS_mulNeuromadSite[C4]": {
    "red_x_points": [
      [-0.00999, 1],
      [-0.00379, 0],
      [-0.00116, 0],
      [0.00117, 0],
      [-0.00294, 0],
      [0.00206, 0],
      [3e-5, 2],
      [-0.01188, 1],
      [0.00182, 2],
      [-0.00231, 0],
      [0.00069, 2],
      [-0.00278, 0],
      [0.00064, 2],
      [0.0004, 0],
      [-0.01658, 1],
      [0.00027, 2],
      [-0.00259, 0],
      [0.00056, 2],
      [-0.00102, 0],
      [-0.00495, 0],
      [-0.00737, 1],
      [0.00132, 0],
      [2e-5, 2]
    ],
    "red_o_points": [],
    "y_categories": ["N", "NOT APPLICABLE", "nan"],
    "blue_o_points": [],
    "blue_x_points": [
      [0.00387, 2],
      [0.00132, 2],
      [0.00185, 0],
      [0.00469, 0],
      [0.00058, 2],
      [0.00609, 0],
      [0.00205, 0],
      [0.00182, 0],
      [0.00372, 2],
      [0.01101, 1],
      [-0.00088, 0],
      [0.0065, 0],
      [0.00295, 2],
      [0.00145, 2],
      [0.00155, 2],
      [0.00106, 2],
      [0.00333, 2],
      [0.00106, 2],
      [0.00129, 1],
      [0.00176, 2],
      [0.0013, 2]
    ]
  },
  "QS_mulGraftTrunk[UpperTrunk]": {
    "red_x_points": [
      [-0.00938, 1],
      [-0.0038, 0],
      [-0.00108, 0],
      [0.00118, 0],
      [-0.00249, 0],
      [0.00126, 0],
      [0.00051, 3],
      [-0.01134, 1],
      [0.00256, 3],
      [-0.0236, 2],
      [0.00091, 3],
      [-0.00338, 0],
      [0.00024, 3],
      [0.00053, 0],
      [-0.01362, 1],
      [0.00042, 3],
      [-0.00255, 0],
      [0.0014, 3],
      [-0.00055, 0],
      [-0.00424, 0],
      [-0.00728, 1],
      [0.00081, 0],
      [0.00055, 3]
    ],
    "red_o_points": [],
    "y_categories": ["N", "NOT APPLICABLE", "Y", "nan"],
    "blue_o_points": [],
    "blue_x_points": [
      [0.00336, 3],
      [0.00139, 3],
      [0.00258, 0],
      [0.00466, 0],
      [0.00092, 3],
      [0.00559, 0],
      [0.00373, 0],
      [0.00355, 0],
      [0.00466, 3],
      [0.0116, 1],
      [0.00027, 0],
      [0.00836, 0],
      [0.00361, 3],
      [0.00196, 3],
      [0.00226, 3],
      [0.0009, 3],
      [0.00465, 3],
      [0.00233, 3],
      [0.00128, 1],
      [0.00296, 3],
      [0.00231, 3]
    ]
  },
  "QA_lstPexTouch[C6]": {
    "red_x_points": [
      [-0.00708, 1],
      [-0.00308, 2],
      [-0.00413, 1],
      [-0.00366, 1],
      [-0.00288, 2],
      [-0.00254, 1],
      [-0.00335, 1],
      [-0.00785, 1],
      [-0.00368, 2],
      [-0.00317, 2],
      [-0.00527, 1],
      [-0.00222, 2],
      [-0.00496, 1],
      [-0.0067, 1],
      [-0.00768, 1],
      [-0.00302, 1],
      [-0.00223, 2],
      [-0.00749, 1],
      [-0.00386, 1],
      [-0.00432, 2],
      [-0.00698, 1],
      [-0.00229, 1],
      [-0.00499, 1]
    ],
    "red_o_points": [],
    "y_categories": ["NORM", "NPV", "nan"],
    "blue_o_points": [],
    "blue_x_points": [
      [-0.00447, 1],
      [-0.00365, 1],
      [0.0183, 0],
      [-0.0029, 1],
      [0.03436, 0],
      [-0.0035, 1],
      [-0.00269, 1],
      [-0.00305, 1],
      [-0.00065, 2],
      [0.00557, 2],
      [-0.00026, 2],
      [-0.00349, 1],
      [0.0007, 2],
      [-0.00309, 1],
      [-0.00309, 1],
      [0.02252, 0],
      [0.00093, 2],
      [0.02134, 0],
      [0.03679, 0],
      [-0.00303, 1],
      [-0.0032, 1]
    ]
  },
  "QA_lstPexMuscstrength[ScapulaAbducSuprot]": {
    "red_x_points": [
      [-0.00289, 2],
      [-0.00059, 2],
      [-0.00604, 1],
      [-0.00368, 2],
      [-0.00528, 1],
      [-0.00972, 1],
      [-0.01159, 1],
      [0.00421, 0],
      [-0.00115, 2],
      [-0.00115, 2],
      [-0.00724, 2],
      [-0.0002, 2],
      [-0.01191, 1],
      [-0.00481, 0],
      [0.0046, 0],
      [-0.01176, 1],
      [-0.0017, 1],
      [-0.00231, 2],
      [-0.01075, 1],
      [0.00114, 0],
      [-0.002, 2],
      [-0.00314, 1],
      [-0.00761, 2]
    ],
    "red_o_points": [],
    "y_categories": ["GREATER THAN OR EQUALS TO 3", "LESS THAN 3", "nan"],
    "blue_o_points": [],
    "blue_x_points": [
      [0.02539, 0],
      [0.02483, 0],
      [0.00309, 0],
      [0.00148, 1],
      [-1e-5, 1],
      [0.01151, 0],
      [0.00695, 0],
      [0.00355, 1],
      [-0.00051, 2],
      [0.00086, 2],
      [0.00133, 2],
      [0.00258, 2],
      [0.00024, 2],
      [0.00436, 0],
      [0.00492, 0],
      [-0.00086, 2],
      [0.00052, 2],
      [0.00428, 0],
      [0.00152, 2],
      [0.0004, 1],
      [-0.00087, 2]
    ]
  },
  "QA_yonPexPain": {
    "red_x_points": [
      [-0.01646, 1],
      [-0.0207, 1],
      [-0.01652, 1],
      [-0.01798, 1],
      [-0.01727, 1],
      [-0.01684, 1],
      [-0.01616, 1],
      [-0.01535, 1],
      [-0.02224, 1],
      [-0.02046, 1],
      [0.02139, 0],
      [-0.01849, 1],
      [-0.01612, 1],
      [-0.01864, 1],
      [0.02062, 0],
      [-0.01602, 1],
      [-0.0167, 1],
      [-0.02074, 1],
      [-0.01893, 1],
      [-0.01987, 1],
      [-0.0178, 1],
      [-0.01487, 1],
      [-0.02313, 1]
    ],
    "red_o_points": [],
    "y_categories": ["N", "Y", "nan"],
    "blue_o_points": [],
    "blue_x_points": [
      [-0.01526, 1],
      [0.0355, 0],
      [0.02777, 0],
      [0.0344, 0],
      [-0.01479, 1],
      [0.0348, 0],
      [-0.01614, 1],
      [-0.01565, 1],
      [-0.0181, 1],
      [0.04694, 2],
      [0.04029, 0],
      [-0.01726, 1],
      [0.03687, 0],
      [0.02901, 0],
      [0.02794, 0],
      [0.02953, 0],
      [0.05377, 2],
      [0.03155, 0],
      [-0.01454, 1],
      [-0.01778, 1],
      [0.04043, 2]
    ]
  },
  "QA_yonPreFracture": {
    "red_x_points": [
      [-0.03872, 1],
      [0.00153, 2],
      [0.00623, 0],
      [0.00272, 2],
      [0.00601, 0],
      [0.00705, 0],
      [-0.03301, 1],
      [0.00715, 0],
      [0.00129, 2],
      [-0.04331, 1],
      [-0.04591, 1],
      [-0.0326, 1],
      [0.00213, 2],
      [0.00761, 0],
      [0.00758, 0],
      [0.00661, 0],
      [0.0053, 0],
      [0.01014, 0],
      [-0.04415, 1],
      [0.00619, 0],
      [0.00055, 2],
      [-0.02738, 1],
      [0.00177, 2]
    ],
    "red_o_points": [],
    "y_categories": ["N", "Y", "nan"],
    "blue_o_points": [],
    "blue_x_points": [
      [0.01054, 0],
      [0.00661, 2],
      [0.00873, 0],
      [0.01056, 0],
      [0.00585, 2],
      [0.01138, 0],
      [0.01006, 0],
      [0.00841, 2],
      [0.00456, 2],
      [0.0115, 0],
      [0.01309, 0],
      [0.01309, 0],
      [0.01128, 0],
      [0.00792, 0],
      [0.00784, 0],
      [0.00556, 2],
      [0.0122, 0],
      [0.0099, 0],
      [0.00804, 0],
      [0.00369, 2],
      [0.00441, 2]
    ]
  },
  "QA_lstPexKine[Index]": {
    "red_x_points": [
      [-3e-5, 1],
      [-0.00069, 2],
      [-0.00324, 2],
      [0.00099, 1],
      [-0.00106, 2],
      [-0.00743, 0],
      [-0.00107, 1],
      [-0.00085, 1],
      [-0.00051, 2],
      [0.00033, 1],
      [-0.00112, 2],
      [-0.00035, 2],
      [-0.00184, 2],
      [-0.00023, 1],
      [-0.00063, 1],
      [-0.00231, 0],
      [-0.00055, 2],
      [-0.00105, 2],
      [-0.00354, 2],
      [-0.00043, 2],
      [-0.00076, 2],
      [-0.00523, 0],
      [-0.00181, 2]
    ],
    "red_o_points": [],
    "y_categories": ["NPV", "PV", "nan"],
    "blue_o_points": [],
    "blue_x_points": [
      [0.00783, 0],
      [1e-5, 2],
      [0.00034, 1],
      [0.00466, 1],
      [5e-5, 2],
      [0.00339, 1],
      [0.00148, 1],
      [0.00245, 1],
      [-6e-5, 2],
      [-7e-5, 2],
      [-4e-5, 2],
      [0.00639, 1],
      [-4e-5, 2],
      [0.00061, 1],
      [0.00032, 1],
      [0.00271, 0],
      [-0.00027, 2],
      [0.0003, 1],
      [0.0002, 2],
      [0.00247, 1],
      [0.00069, 1]
    ]
  },
  "QA_lstPexPalle[Ulna]": {
    "red_x_points": [
      [-0.00123, 4],
      [-0.0013, 4],
      [-0.00121, 4],
      [-0.03362, 2],
      [-0.00117, 4],
      [-0.00096, 4],
      [-0.01376, 1],
      [0.00475, 3],
      [-0.00158, 4],
      [-0.00124, 4],
      [-0.00207, 4],
      [-0.00103, 4],
      [-0.0012, 4],
      [0.00672, 3],
      [-0.00075, 4],
      [-0.02613, 0],
      [-0.01802, 0],
      [-0.00181, 4],
      [-0.00169, 4],
      [-0.00127, 4],
      [0.00663, 3],
      [-0.02055, 0],
      [-0.00134, 4]
    ],
    "red_o_points": [],
    "y_categories": ["ABS", "HYPO", "NAIA", "PT", "nan"],
    "blue_o_points": [],
    "blue_x_points": [
      [-0.00046, 4],
      [-0.00115, 4],
      [0.01015, 3],
      [0.01559, 1],
      [-0.00088, 4],
      [-1e-5, 4],
      [0.01223, 3],
      [0.01437, 3],
      [-0.00127, 4],
      [-0.0009, 4],
      [-0.00099, 4],
      [0.00039, 4],
      [-0.00111, 4],
      [0.01393, 3],
      [0.01313, 3],
      [0.0135, 3],
      [-0.00121, 4],
      [0.01195, 3],
      [-0.00036, 4],
      [0.01811, 3],
      [-0.00117, 4]
    ]
  }
}
