{
  "QA_lstPexPain[C8]": {
    "red_x_points": [
      [0.00684, 0],
      [-0.00502, 2],
      [-0.00546, 2],
      [0.00527, 0],
      [-0.00549, 2],
      [-0.00641, 1],
      [-0.00907, 1],
      [-0.00989, 1],
      [-0.0075, 2],
      [-0.00611, 2],
      [-0.00864, 2],
      [-0.00508, 2],
      [-0.00989, 1],
      [0.00656, 0],
      [-0.00918, 1],
      [-0.0083, 1],
      [-0.00472, 2],
      [-0.00753, 2],
      [-0.00861, 2],
      [-0.00483, 2],
      [-0.01052, 1],
      [-0.00451, 1],
      [-0.01044, 1]
    ],
    "red_o_points": [],
    "y_categories": ["NORM", "NPV", "nan"],
    "blue_o_points": [],
    "blue_x_points": [
      [-0.00572, 1],
      [-0.00504, 1],
      [0.00988, 0],
      [-0.00049, 1],
      [0.01566, 0],
      [0.01374, 0],
      [0.01364, 0],
      [0.01107, 0],
      [-0.0051, 2],
      [-0.00111, 2],
      [-0.00371, 2],
      [-0.00055, 1],
      [-0.00396, 2],
      [0.01171, 0],
      [0.01219, 0],
      [0.01222, 0],
      [-0.00408, 2],
      [0.01067, 0],
      [0.01147, 0],
      [0.01785, 0],
      [0.01816, 0]
    ]
  },
  "QA_lstPexPain[C7]": {
    "red_x_points": [
      [-0.00968, 1],
      [-0.00958, 2],
      [-0.00784, 2],
      [-0.01001, 1],
      [-0.00839, 2],
      [-0.0071, 1],
      [-0.00793, 1],
      [-0.00982, 1],
      [-0.00993, 2],
      [-0.00995, 2],
      [-0.0107, 2],
      [-0.00837, 2],
      [-0.01008, 1],
      [0.01456, 0],
      [-0.00941, 1],
      [-0.00768, 1],
      [-0.00784, 2],
      [-0.01088, 2],
      [-0.01147, 2],
      [-0.00903, 2],
      [-0.01139, 1],
      [-0.00651, 1],
      [-0.01035, 1]
    ],
    "red_o_points": [],
    "y_categories": ["NORM", "NPV", "nan"],
    "blue_o_points": [],
    "blue_x_points": [
      [-0.00749, 1],
      [-0.00677, 1],
      [0.02116, 0],
      [-0.00378, 1],
      [0.02822, 0],
      [-0.00483, 1],
      [0.02593, 0],
      [0.02912, 0],
      [-0.00907, 2],
      [-0.00389, 2],
      [-0.0074, 2],
      [-0.00514, 1],
      [-0.00793, 2],
      [0.02412, 0],
      [0.02232, 0],
      [0.02536, 0],
      [-0.00716, 2],
      [0.0234, 0],
      [0.0289, 0],
      [-0.00761, 1],
      [0.03193, 0]
    ]
  },
  "QA_lstPexTouch[C7]": {
    "red_x_points": [
      [-0.0138, 1],
      [-0.00446, 2],
      [-0.00882, 1],
      [-0.01125, 1],
      [-0.00356, 2],
      [-0.00886, 1],
      [-0.01234, 1],
      [-0.01321, 1],
      [-0.00473, 2],
      [-0.00645, 2],
      [-0.01394, 1],
      [-0.00447, 2],
      [-0.01447, 1],
      [0.01016, 0],
      [-0.01285, 1],
      [-0.01104, 1],
      [-0.00392, 2],
      [0.01208, 0],
      [-0.00969, 1],
      [-0.00485, 2],
      [-0.01529, 1],
      [-0.00831, 1],
      [-0.01551, 1]
    ],
    "red_o_points": [],
    "y_categories": ["NORM", "NPV", "nan"],
    "blue_o_points": [],
    "blue_x_points": [
      [-0.01061, 1],
      [-0.01059, 1],
      [0.01944, 0],
      [-0.00677, 1],
      [0.02546, 0],
      [-0.00793, 1],
      [0.02366, 0],
      [-0.0079, 1],
      [0.00057, 2],
      [0.00202, 2],
      [-0.00149, 2],
      [-0.00739, 1],
      [0.00116, 2],
      [0.02056, 0],
      [0.01842, 0],
      [0.02093, 0],
      [0.00228, 2],
      [0.01837, 0],
      [0.02626, 0],
      [0.02543, 0],
      [0.02769, 0]
    ]
  },
  "QA_lstPexTouch[C6]": {
    "red_x_points": [
      [-0.00605, 1],
      [-0.00329, 2],
      [-0.00366, 1],
      [-0.00296, 1],
      [-0.00235, 2],
      [-0.00281, 1],
      [-0.00262, 1],
      [-0.00521, 1],
      [-0.00255, 2],
      [-0.0022, 2],
      [-0.00517, 1],
      [-0.00162, 2],
      [-0.00425, 1],
      [-0.00417, 1],
      [-0.00568, 1],
      [-0.00278, 1],
      [-0.00172, 2],
      [-0.00621, 1],
      [-0.00336, 1],
      [-0.00362, 2],
      [-0.00441, 1],
      [-0.00205, 1],
      [-0.00476, 1]
    ],
    "red_o_points": [],
    "y_categories": ["NORM", "NPV", "nan"],
    "blue_o_points": [],
    "blue_x_points": [
      [-0.00366, 1],
      [-0.00339, 1],
      [0.0166, 0],
      [-0.00238, 1],
      [0.02751, 0],
      [-0.00287, 1],
      [-0.00239, 1],
      [-0.00268, 1],
      [-0.00051, 2],
      [0.00312, 2],
      [-0.00037, 2],
      [-0.0031, 1],
      [0.0005, 2],
      [-0.00258, 1],
      [-0.00253, 1],
      [0.02094, 0],
      [0.00014, 2],
      [0.01793, 0],
      [0.02894, 0],
      [-0.0029, 1],
      [-0.00283, 1]
    ]
  },
  "participant_code": {
    "red_x_points": [
      [-0.04341, 0],
      [-0.04312, 2],
      [-0.04186, 3],
      [-0.04137, 4],
      [-0.04254, 5],
      [-0.04341, 9],
      [-0.04351, 14],
      [-0.04186, 17],
      [-0.04293, 19],
      [-0.04225, 20],
      [-0.04351, 22],
      [-0.04167, 23],
      [-0.04361, 24],
      [-0.0438, 26],
      [-0.04312, 28],
      [-0.04167, 29],
      [-0.04167, 31],
      [-0.04312, 35],
      [-0.04293, 37],
      [-0.04293, 39],
      [-0.04244, 41],
      [-0.04293, 42],
      [-0.04283, 43]
    ],
    "red_o_points": [],
    "y_categories": [
      "P16554",
      "P18297",
      "P19283",
      "P19287",
      "P23172",
      "P23391",
      "P30595",
      "P31645",
      "P31691",
      "P34778",
      "P35046",
      "P36328",
      "P43633",
      "P4544",
      "P46417",
      "P48965",
      "P53068",
      "P5497",
      "P58556",
      "P59529",
      "P62483",
      "P64658",
      "P65202",
      "P66816",
      "P67052",
      "P6751",
      "P7408",
      "P75566",
      "P76226",
      "P79971",
      "P82621",
      "P82990",
      "P84549",
      "P84932",
      "P85825",
      "P86989",
      "P8770",
      "P87791",
      "P90550",
      "P93159",
      "P94969",
      "P96710",
      "P9744",
      "P98500",
      "nan"
    ],
    "blue_o_points": [],
    "blue_x_points": [
      [0.04597, 1],
      [0.04751, 6],
      [0.04844, 7],
      [0.04576, 8],
      [0.04905, 10],
      [0.04772, 11],
      [0.04617, 12],
      [0.04587, 13],
      [0.04761, 15],
      [0.04741, 16],
      [0.04833, 18],
      [0.04772, 21],
      [0.04617, 25],
      [0.04648, 27],
      [0.04607, 30],
      [0.04607, 32],
      [0.04473, 33],
      [0.047, 34],
      [0.04689, 36],
      [0.04638, 38],
      [0.04515, 40]
    ]
  },
  "QA_equInjTbpiTime": {
    "red_x_points": [
      [-0.01345, 0],
      [-0.01161, 0],
      [0.0022, 3],
      [0.0019, 3],
      [-0.01052, 0],
      [-0.00995, 0],
      [-0.0094, 0],
      [-0.01134, 0],
      [0.00213, 3],
      [-0.01209, 0],
      [-0.01184, 0],
      [-0.01124, 0],
      [-0.00048, 3],
      [-0.00147, 3],
      [-0.01332, 0],
      [-0.00969, 0],
      [-0.01484, 2],
      [-0.02611, 2],
      [-0.0115, 0],
      [-0.01855, 2],
      [-0.01367, 0],
      [0.00147, 3],
      [0.0119, 1]
    ],
    "red_o_points": [],
    "y_categories": [
      "0 TO 6 MONTHS",
      "13 TO 24 MONTHS",
      "25 MONTHS OR MORE",
      "7 TO 12 MONTHS",
      "nan"
    ],
    "blue_o_points": [],
    "blue_x_points": [
      [-0.00654, 0],
      [0.02684, 1],
      [-0.00772, 0],
      [0.02976, 1],
      [0.00482, 3],
      [-0.0083, 0],
      [-0.0067, 0],
      [0.00473, 3],
      [-0.00684, 0],
      [-0.00125, 2],
      [0.03163, 1],
      [0.00767, 3],
      [0.0292, 1],
      [0.00478, 3],
      [0.02466, 1],
      [0.02282, 1],
      [0.00746, 3],
      [0.02332, 1],
      [0.01025, 3],
      [0.0066, 3],
      [-0.00572, 0]
    ]
  },
  "QA_lstPexInspectio[ScapulaAlata]": {
    "red_x_points": [
      [-0.00207, 1],
      [-0.00015, 1],
      [-0.00034, 1],
      [-0.00038, 1],
      [-0.00019, 1],
      [-0.00014, 1],
      [-0.00099, 1],
      [-0.00252, 1],
      [-0.00037, 1],
      [-0.00015, 1],
      [-0.0003, 1],
      [-0.00012, 1],
      [-0.00043, 1],
      [-0.00177, 1],
      [-0.00212, 1],
      [-0.00084, 1],
      [-0.0001, 1],
      [-0.00093, 1],
      [-0.00024, 1],
      [-0.00029, 1],
      [-0.00102, 1],
      [-0.00052, 1],
      [-0.00034, 1]
    ],
    "red_o_points": [],
    "y_categories": ["ABS", "NAIA", "PT", "nan"],
    "blue_o_points": [],
    "blue_x_points": [
      [-0.00041, 1],
      [-0.00027, 1],
      [-0.00018, 1],
      [-0.00026, 1],
      [-0.00044, 1],
      [-0.00025, 1],
      [-0.00029, 1],
      [-0.00046, 1],
      [-0.00012, 1],
      [-0.00064, 1],
      [-0.0001, 1],
      [-0.00039, 1],
      [-9e-5, 1],
      [0.00825, 0],
      [-0.00024, 1],
      [-0.00017, 1],
      [-0.00028, 1],
      [-8e-5, 1],
      [0.01338, 2],
      [-0.00042, 1],
      [-0.00019, 1]
    ]
  },
  "QA_yonInjFracture": {
    "red_x_points": [
      [0.00541, 0],
      [-0.00397, 2],
      [0.00345, 0],
      [-0.00532, 2],
      [-0.01132, 1],
      [-0.01222, 1],
      [0.00224, 0],
      [0.00202, 0],
      [-0.01616, 1],
      [-0.014, 1],
      [0.00506, 0],
      [-0.01256, 1],
      [-0.01344, 1],
      [-0.00251, 0],
      [-0.01526, 1],
      [-0.01036, 1],
      [-0.0084, 1],
      [0.00356, 0],
      [0.00233, 0],
      [0.00539, 0],
      [-0.01018, 1],
      [-0.00693, 1],
      [-0.02097, 1]
    ],
    "red_o_points": [],
    "y_categories": ["N", "Y", "nan"],
    "blue_o_points": [],
    "blue_x_points": [
      [0.01055, 0],
      [0.01147, 0],
      [0.00216, 0],
      [0.00591, 0],
      [0.01043, 2],
      [0.00868, 0],
      [0.00322, 1],
      [0.00243, 1],
      [-0.00835, 1],
      [0.01012, 0],
      [0.01261, 0],
      [0.01223, 0],
      [0.01138, 0],
      [0.00296, 0],
      [0.00401, 0],
      [0.00504, 2],
      [0.01287, 0],
      [0.00485, 0],
      [0.00457, 0],
      [-0.00255, 1],
      [0.00953, 2]
    ]
  },
  "QA_lstPexArthre[Shoulder]": {
    "red_x_points": [
      [0.00592, 2],
      [-0.00233, 3],
      [-0.00456, 3],
      [0.00593, 2],
      [-0.01727, 0],
      [-0.02133, 1],
      [0.00676, 2],
      [0.00656, 2],
      [-0.00254, 3],
      [0.00538, 2],
      [-0.00386, 3],
      [-0.00194, 3],
      [-0.00449, 3],
      [-0.03239, 1],
      [0.0067, 2],
      [-0.01732, 1],
      [-0.00189, 3],
      [-0.00438, 3],
      [-0.00695, 3],
      [-0.00218, 3],
      [-0.00312, 3],
      [-0.01272, 1],
      [-0.00432, 3]
    ],
    "red_o_points": [],
    "y_categories": ["NAIA", "NPV", "PV", "nan"],
    "blue_o_points": [],
    "blue_x_points": [
      [0.01323, 2],
      [-0.00258, 3],
      [0.00801, 2],
      [0.01171, 2],
      [-0.00095, 3],
      [0.01304, 2],
      [0.01227, 2],
      [0.01005, 2],
      [-0.00136, 3],
      [-0.00085, 3],
      [-0.00155, 3],
      [0.01271, 2],
      [-0.00108, 3],
      [0.00872, 2],
      [0.00689, 2],
      [-0.00186, 1],
      [-0.00139, 3],
      [0.00568, 2],
      [-0.00032, 3],
      [0.00923, 2],
      [0.00674, 2]
    ]
  },
  "QS_mulNeuromadSite[C8]": {
    "red_x_points": [
      [-0.00303, 1],
      [-0.00192, 0],
      [-0.0008, 0],
      [0.00038, 0],
      [-0.00132, 0],
      [0.00045, 0],
      [-0.00043, 2],
      [-0.00336, 1],
      [0.00115, 2],
      [-0.0011, 0],
      [7e-5, 2],
      [-0.00206, 0],
      [0.00031, 2],
      [1e-5, 0],
      [-0.00604, 1],
      [0.00011, 2],
      [-0.00143, 0],
      [0.00029, 2],
      [-0.0007, 0],
      [-0.00268, 0],
      [-0.00425, 1],
      [0.00044, 0],
      [0.00026, 2]
    ],
    "red_o_points": [],
    "y_categories": ["N", "NOT APPLICABLE", "nan"],
    "blue_o_points": [],
    "blue_x_points": [
      [0.00114, 2],
      [0.00082, 2],
      [0.0009, 0],
      [0.00148, 0],
      [0.00041, 2],
      [0.00251, 0],
      [0.00125, 0],
      [0.00088, 0],
      [0.00154, 2],
      [0.00627, 1],
      [-0.00096, 0],
      [0.00206, 0],
      [0.00149, 2],
      [0.00057, 2],
      [0.00057, 2],
      [0.00023, 2],
      [0.00143, 2],
      [0.00051, 2],
      [0.00097, 1],
      [0.00099, 2],
      [0.00056, 2]
    ]
  },
  "QS_mulGraftNerve[Ph]": {
    "red_x_points": [
      [-0.00072, 1],
      [-0.00056, 0],
      [-0.00025, 0],
      [6e-5, 0],
      [-0.00026, 0],
      [0.0001, 0],
      [4e-5, 2],
      [-0.00148, 1],
      [0.00032, 2],
      [-0.00028, 0],
      [0.00023, 2],
      [-0.00042, 0],
      [0.00012, 2],
      [6e-5, 0],
      [-0.00152, 1],
      [8e-5, 2],
      [-0.0006, 0],
      [1e-5, 2],
      [-0.00017, 0],
      [-0.00074, 0],
      [-0.00087, 1],
      [0.00012, 0],
      [3e-5, 2]
    ],
    "red_o_points": [],
    "y_categories": ["N", "NOT APPLICABLE", "nan"],
    "blue_o_points": [],
    "blue_x_points": [
      [0.00032, 2],
      [0.00022, 2],
      [0.00028, 0],
      [0.00045, 0],
      [1e-5, 2],
      [0.0004, 0],
      [0.00036, 0],
      [0.00015, 0],
      [0.00038, 2],
      [0.00192, 1],
      [-0.00033, 0],
      [0.00034, 0],
      [0.00051, 2],
      [0.00014, 2],
      [0.00021, 2],
      [0.00012, 2],
      [0.00051, 2],
      [0.00019, 2],
      [0.00017, 1],
      [0.00022, 2],
      [9e-5, 2]
    ]
  },
  "QA_lstPexMuscstrength[FingersFlex]": {
    "red_x_points": [
      [0.00237, 2],
      [0.00247, 2],
      [-0.03156, 1],
      [0.01053, 0],
      [-0.03117, 1],
      [-0.03309, 1],
      [-0.03392, 1],
      [0.01002, 0],
      [0.00281, 2],
      [0.00262, 2],
      [0.01044, 0],
      [0.00227, 2],
      [-0.03474, 1],
      [0.00947, 0],
      [0.00904, 0],
      [-0.03458, 1],
      [-0.03034, 1],
      [0.00285, 2],
      [0.00967, 0],
      [0.00906, 0],
      [0.00196, 2],
      [-0.02912, 1],
      [0.00205, 2]
    ],
    "red_o_points": [],
    "y_categories": ["GREATER THAN OR EQUALS TO 3", "LESS THAN 3", "nan"],
    "blue_o_points": [],
    "blue_x_points": [
      [0.01417, 0],
      [0.01295, 0],
      [0.00974, 0],
      [0.01102, 0],
      [0.0123, 0],
      [0.0105, 0],
      [0.01106, 0],
      [0.01096, 0],
      [0.00372, 2],
      [0.00372, 2],
      [0.004, 2],
      [0.0047, 2],
      [0.00372, 2],
      [0.01095, 0],
      [0.01056, 0],
      [0.01095, 0],
      [0.0048, 2],
      [0.00358, 2],
      [0.01063, 0],
      [0.00354, 2],
      [0.00332, 2]
    ]
  },
  "QA_lstPexPalle[Elbow]": {
    "red_x_points": [
      [-0.00147, 4],
      [-0.00144, 4],
      [-0.0018, 4],
      [0.01055, 3],
      [-0.00171, 4],
      [-0.00159, 4],
      [-0.01922, 1],
      [-0.01481, 1],
      [-0.00161, 4],
      [-0.00177, 4],
      [-0.00179, 4],
      [-0.00135, 4],
      [-0.0016, 4],
      [-0.01722, 1],
      [-0.00153, 4],
      [-0.02648, 0],
      [-0.01929, 2],
      [-0.00205, 4],
      [-0.00232, 4],
      [-0.00152, 4],
      [0.01118, 3],
      [-0.02129, 0],
      [-0.00154, 4]
    ],
    "red_o_points": [],
    "y_categories": ["ABS", "HYPO", "NAIA", "PT", "nan"],
    "blue_o_points": [],
    "blue_x_points": [
      [-0.00108, 4],
      [-0.00117, 4],
      [0.01566, 3],
      [0.02032, 3],
      [-0.00076, 4],
      [-0.00107, 4],
      [-0.00522, 1],
      [0.01653, 3],
      [-0.00142, 4],
      [-0.00115, 4],
      [-0.00115, 4],
      [-0.00111, 4],
      [-0.00122, 4],
      [0.0184, 3],
      [0.01797, 3],
      [0.01652, 3],
      [-0.00136, 4],
      [0.01593, 3],
      [-0.00091, 4],
      [0.01937, 3],
      [-0.00142, 4]
    ]
  },
  "QA_lstPexPain[T1]": {
    "red_x_points": [
      [-0.00758, 1],
      [-0.00314, 2],
      [-0.00426, 2],
      [0.00034, 0],
      [-0.00262, 2],
      [-0.0016, 1],
      [-0.00037, 0],
      [-5e-5, 0],
      [-0.00498, 2],
      [-0.00463, 2],
      [-0.00587, 2],
      [-0.00324, 2],
      [-0.0063, 1],
      [-0.01412, 1],
      [-0.00324, 1],
      [-0.00252, 1],
      [-0.00392, 2],
      [-0.00889, 2],
      [-0.00707, 2],
      [-0.00344, 2],
      [-0.00756, 1],
      [-0.00175, 1],
      [-0.00684, 1]
    ],
    "red_o_points": [],
    "y_categories": ["NORM", "NPV", "nan"],
    "blue_o_points": [],
    "blue_x_points": [
      [0.00153, 1],
      [-0.00042, 1],
      [0.00672, 0],
      [0.00218, 1],
      [0.01417, 0],
      [0.00108, 1],
      [0.012, 0],
      [0.01166, 0],
      [-0.00246, 2],
      [0.00165, 2],
      [-0.00236, 2],
      [0.00117, 1],
      [-0.00164, 2],
      [0.00723, 0],
      [0.00637, 0],
      [0.00927, 0],
      [-0.00242, 2],
      [-0.00444, 1],
      [0.01082, 0],
      [0.01484, 0],
      [0.01671, 0]
    ]
  },
  "QA_lstPexMuscstrength[ScapulaAbducSuprot]": {
    "red_x_points": [
      [-0.00089, 2],
      [-0.00078, 2],
      [-0.00609, 1],
      [-0.00294, 2],
      [-0.00548, 1],
      [-0.00951, 1],
      [-0.01047, 1],
      [0.00237, 0],
      [-0.00138, 2],
      [-0.00094, 2],
      [-0.00502, 2],
      [-4e-5, 2],
      [-0.01166, 1],
      [-0.00186, 0],
      [0.0042, 0],
      [-0.00993, 1],
      [-0.00248, 1],
      [-0.00139, 2],
      [-0.0095, 1],
      [0.00196, 0],
      [-0.00184, 2],
      [-0.00318, 1],
      [-0.00652, 2]
    ],
    "red_o_points": [],
    "y_categories": ["GREATER THAN OR EQUALS TO 3", "LESS THAN 3", "nan"],
    "blue_o_points": [],
    "blue_x_points": [
      [0.02505, 0],
      [0.02073, 0],
      [0.00376, 0],
      [-0.00111, 1],
      [-0.00155, 1],
      [0.01064, 0],
      [0.00701, 0],
      [0.00077, 1],
      [-0.00021, 2],
      [0.00055, 2],
      [0.00104, 2],
      [0.00224, 2],
      [0.00018, 2],
      [0.00539, 0],
      [0.00521, 0],
      [-0.00081, 2],
      [0.00039, 2],
      [0.00571, 0],
      [0.0011, 2],
      [-0.00213, 1],
      [-0.00062, 2]
    ]
  },
  "QA_lstPexMuscstrength[ElbowExte]": {
    "red_x_points": [
      [-0.00432, 2],
      [-0.00482, 2],
      [-0.00394, 1],
      [-0.00302, 1],
      [-0.00817, 1],
      [-0.00315, 1],
      [-0.00367, 1],
      [0.00118, 0],
      [-0.00275, 2],
      [-0.00684, 2],
      [-0.0052, 1],
      [-0.00373, 2],
      [-0.0005, 1],
      [-0.00784, 1],
      [-0.00047, 0],
      [-0.00265, 1],
      [-0.00594, 1],
      [-0.00728, 0],
      [-0.00574, 1],
      [-0.00488, 2],
      [-0.00266, 2],
      [-0.00225, 1],
      [-0.0047, 2]
    ],
    "red_o_points": [],
    "y_categories": ["GREATER THAN OR EQUALS TO 3", "LESS THAN 3", "nan"],
    "blue_o_points": [],
    "blue_x_points": [
      [0.00062, 1],
      [0.00035, 1],
      [0.00675, 0],
      [-0.00264, 1],
      [0.00052, 1],
      [0.01437, 0],
      [0.01418, 0],
      [-0.00172, 1],
      [0.00024, 2],
      [-0.00045, 2],
      [0.02294, 0],
      [0.00115, 1],
      [0.00082, 2],
      [0.00841, 0],
      [0.0055, 0],
      [0.00737, 0],
      [0.0009, 2],
      [0.00435, 0],
      [0.00614, 0],
      [0.00255, 1],
      [0.001, 1]
    ]
  },
  "QS_mulNeuromadSite[T2]": {
    "red_x_points": [
      [-0.00313, 1],
      [-0.00181, 0],
      [-0.00035, 0],
      [0.00047, 0],
      [-0.00089, 0],
      [0.0006, 0],
      [-0.00025, 2],
      [-0.00297, 1],
      [0.00105, 2],
      [-0.00109, 0],
      [0.00019, 2],
      [-0.00131, 0],
      [0.00015, 2],
      [-0.00018, 0],
      [-0.00374, 1],
      [-1e-5, 2],
      [-0.00139, 0],
      [0.00012, 2],
      [-0.00022, 0],
      [-0.0019, 0],
      [-0.00265, 1],
      [0.00052, 0],
      [1e-5, 2]
    ],
    "red_o_points": [],
    "y_categories": ["N", "NOT APPLICABLE", "nan"],
    "blue_o_points": [],
    "blue_x_points": [
      [0.00078, 2],
      [0.00036, 2],
      [0.00029, 0],
      [0.00132, 0],
      [0.00015, 2],
      [0.00118, 0],
      [0.00095, 0],
      [0.00078, 0],
      [0.00147, 2],
      [0.00478, 1],
      [-0.00059, 0],
      [0.0015, 0],
      [0.00125, 2],
      [0.00033, 2],
      [0.00065, 2],
      [0.00033, 2],
      [0.00132, 2],
      [0.00028, 2],
      [0.00031, 1],
      [0.00077, 2],
      [0.00056, 2]
    ]
  },
  "QA_mulInjOrthesisType[ArmSling]": {
    "red_x_points": [
      [-0.00728, 2],
      [-0.0091, 2],
      [-0.00377, 2],
      [-0.00306, 2],
      [-0.00517, 2],
      [-0.0031, 2],
      [-0.00145, 2],
      [-0.00291, 1],
      [-0.01014, 2],
      [-0.00761, 2],
      [-0.00507, 2],
      [-0.02225, 0],
      [-0.00704, 3],
      [-0.00122, 2],
      [-0.00064, 1],
      [-0.00185, 2],
      [-0.01212, 3],
      [-0.00932, 2],
      [-0.00429, 2],
      [-0.00585, 2],
      [-0.00758, 3],
      [-0.00116, 2],
      [-0.00601, 2]
    ],
    "red_o_points": [],
    "y_categories": ["N", "NOT APPLICABLE", "Y", "nan"],
    "blue_o_points": [],
    "blue_x_points": [
      [-0.00132, 2],
      [-0.00169, 2],
      [0.00036, 2],
      [-0.00049, 2],
      [-0.00153, 2],
      [-0.00069, 2],
      [-0.00028, 2],
      [-0.00074, 2],
      [0.04104, 1],
      [0.03309, 1],
      [-0.00616, 2],
      [0.02499, 1],
      [0.03008, 1],
      [-0.00027, 2],
      [0.00647, 0],
      [-0.00111, 2],
      [-0.0078, 2],
      [0.0117, 1],
      [0.0122, 1],
      [-0.00307, 2],
      [0.00319, 3]
    ]
  },
  "QA_lstPexPain[C6]": {
    "red_x_points": [
      [-0.00055, 1],
      [-0.0041, 2],
      [-0.00343, 2],
      [-0.00095, 1],
      [-0.00347, 2],
      [-0.0003, 1],
      [-0.00073, 1],
      [-0.00073, 1],
      [-0.00473, 2],
      [-0.00349, 2],
      [-0.00649, 2],
      [-0.00258, 2],
      [-0.00165, 1],
      [-0.00264, 1],
      [-0.00055, 1],
      [-0.00087, 1],
      [-0.00283, 2],
      [-0.00629, 2],
      [-0.00592, 2],
      [-0.00457, 2],
      [-0.0007, 1],
      [-0.00036, 1],
      [-0.00148, 1]
    ],
    "red_o_points": [],
    "y_categories": ["NORM", "NPV", "nan"],
    "blue_o_points": [],
    "blue_x_points": [
      [-0.00034, 1],
      [-0.00017, 1],
      [0.01132, 0],
      [-7e-5, 1],
      [0.01978, 0],
      [0.00022, 1],
      [0.00025, 1],
      [-0.00021, 1],
      [-0.003, 2],
      [-0.00237, 2],
      [-0.0022, 2],
      [5e-5, 1],
      [-0.0021, 2],
      [0.01427, 0],
      [-0.00037, 1],
      [0.01441, 0],
      [-0.00293, 2],
      [0.01361, 0],
      [-0.00015, 1],
      [-0.00035, 1],
      [-0.00024, 1]
    ]
  },
  "QA_lstPexKine[Shoulder]": {
    "red_x_points": [
      [0.00159, 1],
      [-0.00084, 2],
      [-0.00295, 2],
      [0.00132, 1],
      [-0.00192, 2],
      [-0.01386, 0],
      [0.00127, 1],
      [0.00099, 1],
      [-0.00092, 2],
      [0.00229, 1],
      [-0.00219, 2],
      [-0.00087, 2],
      [-0.00154, 2],
      [-0.02886, 0],
      [0.00156, 1],
      [0.00118, 1],
      [-0.00131, 2],
      [-0.00225, 2],
      [-0.00624, 2],
      [-0.00167, 2],
      [-0.00144, 2],
      [0.00198, 1],
      [-0.00211, 2]
    ],
    "red_o_points": [],
    "y_categories": ["NPV", "PV", "nan"],
    "blue_o_points": [],
    "blue_x_points": [
      [0.00482, 1],
      [-0.00133, 2],
      [0.00475, 1],
      [0.00636, 1],
      [-3e-5, 2],
      [0.00813, 1],
      [0.00734, 1],
      [0.00606, 1],
      [-0.00051, 2],
      [-0.00028, 2],
      [-0.00137, 2],
      [0.00863, 1],
      [-0.00053, 2],
      [0.00394, 1],
      [0.00249, 1],
      [0.00141, 0],
      [-0.00081, 2],
      [0.00223, 1],
      [0.00014, 2],
      [0.0027, 1],
      [0.00267, 1]
    ]
  },
  "QA_mulInjOrthesisType[ShoulderSupport]": {
    "red_x_points": [
      [-0.00662, 0],
      [-0.00896, 0],
      [-0.00508, 0],
      [-0.01985, 2],
      [-0.00616, 0],
      [-0.00372, 0],
      [-0.00221, 0],
      [-0.00102, 1],
      [-0.01046, 0],
      [-0.00719, 0],
      [-0.00523, 0],
      [-0.01666, 2],
      [-0.00992, 3],
      [-0.00259, 0],
      [-0.00061, 1],
      [-0.00199, 0],
      [-0.01192, 3],
      [-0.00879, 0],
      [-0.00612, 0],
      [-0.00642, 0],
      [-0.00978, 3],
      [-0.0019, 0],
      [-0.00604, 0]
    ],
    "red_o_points": [],
    "y_categories": ["N", "NOT APPLICABLE", "Y", "nan"],
    "blue_o_points": [],
    "blue_x_points": [
      [-0.00254, 0],
      [-0.00172, 0],
      [0.00069, 0],
      [0.00129, 0],
      [0.01457, 2],
      [-0.00042, 0],
      [-0.00016, 0],
      [0.0015, 0],
      [0.04266, 1],
      [0.02985, 1],
      [-0.00659, 0],
      [0.02728, 1],
      [0.02766, 1],
      [-0.00011, 0],
      [0.00556, 2],
      [-0.00076, 0],
      [-0.00715, 0],
      [0.01266, 1],
      [0.01205, 1],
      [-0.00121, 0],
      [0.00407, 3]
    ]
  },
  "QS_mulTransfSite[IMc]": {
    "red_x_points": [
      [-0.01244, 1],
      [-0.02269, 2],
      [0.00023, 0],
      [-0.02805, 2],
      [-0.00233, 0],
      [0.00371, 0],
      [0.00253, 3],
      [-0.01494, 1],
      [0.00742, 3],
      [-0.00108, 0],
      [0.00542, 3],
      [-0.02131, 2],
      [0.0036, 3],
      [0.0007, 0],
      [-0.01824, 1],
      [0.00294, 3],
      [-0.00285, 0],
      [0.00476, 3],
      [0.00098, 0],
      [-0.02433, 2],
      [-0.0169, 1],
      [-0.01301, 2],
      [0.00459, 3]
    ],
    "red_o_points": [],
    "y_categories": ["N", "NOT APPLICABLE", "Y", "nan"],
    "blue_o_points": [],
    "blue_x_points": [
      [0.00786, 3],
      [0.00605, 3],
      [0.00473, 0],
      [0.00833, 0],
      [0.00605, 3],
      [0.00681, 0],
      [0.00518, 0],
      [0.00664, 0],
      [0.01024, 3],
      [0.01286, 1],
      [0.00258, 0],
      [0.00828, 0],
      [0.00882, 3],
      [0.00611, 3],
      [0.00621, 3],
      [0.00533, 3],
      [0.00942, 3],
      [0.00585, 3],
      [0.00061, 1],
      [0.00736, 3],
      [0.00598, 3]
    ]
  },
  "QS_mulGraftTrunk[UpperTrunk]": {
    "red_x_points": [
      [-0.00805, 1],
      [-0.00542, 0],
      [-0.00112, 0],
      [0.00022, 0],
      [-0.00334, 0],
      [0.00081, 0],
      [0.00021, 3],
      [-0.00841, 1],
      [0.00378, 3],
      [-0.02542, 2],
      [0.00143, 3],
      [-0.0047, 0],
      [0.00025, 3],
      [9e-5, 0],
      [-0.01276, 1],
      [0.0006, 3],
      [-0.00339, 0],
      [0.00181, 3],
      [-0.00119, 0],
      [-0.00531, 0],
      [-0.00836, 1],
      [0.00073, 0],
      [0.00101, 3]
    ],
    "red_o_points": [],
    "y_categories": ["N", "NOT APPLICABLE", "Y", "nan"],
    "blue_o_points": [],
    "blue_x_points": [
      [0.00316, 3],
      [0.00188, 3],
      [0.00231, 0],
      [0.00391, 0],
      [0.00116, 3],
      [0.00516, 0],
      [0.00347, 0],
      [0.00233, 0],
      [0.00562, 3],
      [0.01282, 1],
      [-0.00084, 0],
      [0.0061, 0],
      [0.0059, 3],
      [0.002, 3],
      [0.00203, 3],
      [0.0014, 3],
      [0.00689, 3],
      [0.00257, 3],
      [0.0021, 1],
      [0.00326, 3],
      [0.00327, 3]
    ]
  },
  "QS_mulTransfSite[PhMc]": {
    "red_x_points": [
      [-0.00653, 1],
      [-0.00314, 0],
      [-0.00019, 0],
      [0.00172, 0],
      [-0.00198, 0],
      [-0.01053, 2],
      [6e-5, 3],
      [-0.00829, 1],
      [0.00242, 3],
      [-0.00203, 0],
      [0.00166, 3],
      [-0.00268, 0],
      [0.00109, 3],
      [0.00029, 0],
      [-0.01107, 1],
      [0.00071, 3],
      [-0.00781, 2],
      [0.0014, 3],
      [-0.00048, 0],
      [-0.00303, 0],
      [-0.00836, 1],
      [0.00165, 0],
      [0.00119, 3]
    ],
    "red_o_points": [],
    "y_categories": ["N", "NOT APPLICABLE", "Y", "nan"],
    "blue_o_points": [],
    "blue_x_points": [
      [0.00328, 3],
      [0.00245, 3],
      [0.00127, 0],
      [0.00496, 0],
      [0.00175, 3],
      [0.00448, 0],
      [0.00256, 0],
      [0.00163, 0],
      [0.0033, 3],
      [0.00787, 1],
      [-0.00184, 0],
      [0.00521, 0],
      [0.00344, 3],
      [0.00134, 3],
      [0.00158, 3],
      [0.00094, 3],
      [0.00361, 3],
      [0.00185, 3],
      [0.0009, 1],
      [0.00159, 3],
      [0.00174, 3]
    ]
  },
  "QA_yonPexPain": {
    "red_x_points": [
      [-0.0146, 1],
      [-0.01624, 1],
      [-0.01434, 1],
      [-0.01425, 1],
      [-0.01502, 1],
      [-0.01478, 1],
      [-0.01427, 1],
      [-0.01281, 1],
      [-0.01736, 1],
      [-0.01627, 1],
      [0.01773, 0],
      [-0.01534, 1],
      [-0.01395, 1],
      [-0.01538, 1],
      [0.0168, 0],
      [-0.01436, 1],
      [-0.01454, 1],
      [-0.01653, 1],
      [-0.01557, 1],
      [-0.01658, 1],
      [-0.01468, 1],
      [-0.0126, 1],
      [-0.01619, 1]
    ],
    "red_o_points": [],
    "y_categories": ["N", "Y", "nan"],
    "blue_o_points": [],
    "blue_x_points": [
      [-0.01318, 1],
      [0.02803, 0],
      [0.02464, 0],
      [0.02831, 0],
      [-0.01317, 1],
      [0.02806, 0],
      [-0.01329, 1],
      [-0.01233, 1],
      [-0.01541, 1],
      [0.03883, 2],
      [0.03353, 0],
      [-0.01404, 1],
      [0.03064, 0],
      [0.02463, 0],
      [0.02411, 0],
      [0.02421, 0],
      [0.0419, 2],
      [0.02617, 0],
      [-0.01269, 1],
      [-0.01439, 1],
      [0.03654, 2]
    ]
  },
  "QS_mulGraftLevel[Trunk]": {
    "red_x_points": [
      [-0.00692, 1],
      [-0.00399, 0],
      [-0.00097, 0],
      [0.00046, 0],
      [-0.00309, 0],
      [0.0003, 0],
      [-0.00012, 3],
      [-0.00687, 1],
      [0.00303, 3],
      [-0.02001, 2],
      [0.00129, 3],
      [-0.00403, 0],
      [0.00032, 3],
      [0.00023, 0],
      [-0.00879, 1],
      [-1e-5, 3],
      [-0.00321, 0],
      [0.00135, 3],
      [-0.00092, 0],
      [-0.00482, 0],
      [-0.00592, 1],
      [0.00063, 0],
      [0.00035, 3]
    ],
    "red_o_points": [],
    "y_categories": ["N", "NOT APPLICABLE", "Y", "nan"],
    "blue_o_points": [],
    "blue_x_points": [
      [0.00264, 3],
      [0.00155, 3],
      [0.00235, 0],
      [0.00312, 0],
      [0.0009, 3],
      [0.00422, 0],
      [0.00309, 0],
      [0.00209, 0],
      [0.0047, 3],
      [0.01185, 1],
      [-0.00127, 0],
      [0.0046, 0],
      [0.00488, 3],
      [0.0014, 3],
      [0.00175, 3],
      [0.00127, 3],
      [0.00507, 3],
      [0.00152, 3],
      [0.00162, 1],
      [0.00225, 3],
      [0.0021, 3]
    ]
  },
  "QS_mulGraftNerve[FI]": {
    "red_x_points": [
      [-0.00051, 1],
      [-0.00019, 0],
      [-0.00013, 0],
      [8e-5, 0],
      [-0.00023, 0],
      [1e-5, 0],
      [-1e-5, 2],
      [-0.00067, 1],
      [0.00021, 2],
      [-0.00019, 0],
      [4e-5, 2],
      [-0.00019, 0],
      [6e-5, 2],
      [2e-5, 0],
      [-0.00178, 1],
      [2e-5, 2],
      [-0.00034, 0],
      [-8e-5, 2],
      [-4e-5, 0],
      [-0.00041, 0],
      [-0.00073, 1],
      [9e-5, 0],
      [2e-5, 2]
    ],
    "red_o_points": [],
    "y_categories": ["N", "NOT APPLICABLE", "nan"],
    "blue_o_points": [],
    "blue_x_points": [
      [0.00035, 2],
      [0.00013, 2],
      [0.00024, 0],
      [0.00013, 0],
      [6e-5, 2],
      [0.00059, 0],
      [0.0002, 0],
      [7e-5, 0],
      [0.00021, 2],
      [0.001, 1],
      [-3e-5, 0],
      [0.00054, 0],
      [0.00019, 2],
      [0.00022, 2],
      [0.0002, 2],
      [0.00011, 2],
      [0.00019, 2],
      [0.00015, 2],
      [0.00012, 1],
      [0.00023, 2],
      [3e-5, 2]
    ]
  },
  "QS_mulGraftNerve[other]": {
    "red_x_points": [
      [-0.00298, 1],
      [-0.00171, 0],
      [-0.00053, 0],
      [0.00032, 0],
      [-0.00115, 0],
      [0.00058, 0],
      [-9e-5, 2],
      [-0.00367, 1],
      [0.00093, 2],
      [-0.00127, 0],
      [0.0004, 2],
      [-0.0013, 0],
      [0.00022, 2],
      [0.00014, 0],
      [-0.00474, 1],
      [0.00011, 2],
      [-0.00097, 0],
      [0.00033, 2],
      [-0.00087, 0],
      [-0.00227, 0],
      [-0.00331, 1],
      [0.00015, 0],
      [0.00032, 2]
    ],
    "red_o_points": [],
    "y_categories": ["N", "NOT APPLICABLE", "nan"],
    "blue_o_points": [],
    "blue_x_points": [
      [0.00152, 2],
      [0.00067, 2],
      [0.00052, 0],
      [0.00133, 0],
      [0.00042, 2],
      [0.0019, 0],
      [0.00096, 0],
      [0.00089, 0],
      [0.00159, 2],
      [0.00461, 1],
      [-0.00076, 0],
      [0.00139, 0],
      [0.00141, 2],
      [0.0006, 2],
      [0.00045, 2],
      [0.00042, 2],
      [0.00107, 2],
      [0.00044, 2],
      [0.00063, 1],
      [0.00099, 2],
      [0.00034, 2]
    ]
  },
  "QS_mulBpsurgeryType[Graft]": {
    "red_x_points": [
      [-0.00279, 1],
      [-0.00161, 0],
      [-0.00076, 0],
      [0.00026, 0],
      [-0.00174, 0],
      [4e-5, 0],
      [0.00042, 3],
      [-0.00322, 1],
      [0.00207, 3],
      [-0.01412, 2],
      [0.00108, 3],
      [-0.00193, 0],
      [0.00039, 3],
      [6e-5, 0],
      [-0.00503, 1],
      [0.00035, 3],
      [-0.00148, 0],
      [0.00094, 3],
      [-0.00036, 0],
      [-0.00234, 0],
      [-0.00253, 1],
      [0.00023, 0],
      [0.0008, 3]
    ],
    "red_o_points": [],
    "y_categories": ["N", "NOT APPLICABLE", "Y", "nan"],
    "blue_o_points": [],
    "blue_x_points": [
      [0.00148, 3],
      [0.00072, 3],
      [0.00114, 0],
      [0.00089, 0],
      [0.00035, 3],
      [0.00174, 0],
      [0.00185, 0],
      [0.00089, 0],
      [0.00278, 3],
      [0.00609, 1],
      [-0.00032, 0],
      [0.00213, 0],
      [0.00271, 3],
      [0.00058, 3],
      [0.00054, 3],
      [0.0004, 3],
      [0.00296, 3],
      [0.00085, 3],
      [0.00066, 1],
      [0.00104, 3],
      [0.00178, 3]
    ]
  },
  "QS_mulGraftNerve[Ax]": {
    "red_x_points": [
      [-0.00156, 1],
      [-0.00081, 0],
      [-0.00034, 0],
      [0.00026, 0],
      [-0.00045, 0],
      [0.00032, 0],
      [1e-5, 2],
      [-0.00116, 1],
      [0.0005, 2],
      [-0.00056, 0],
      [0.00012, 2],
      [-0.00078, 0],
      [5e-5, 2],
      [-0.00031, 0],
      [-0.00227, 1],
      [4e-5, 2],
      [-0.00067, 0],
      [4e-5, 2],
      [-0.00026, 0],
      [-0.00106, 0],
      [-0.00195, 1],
      [0.00018, 0],
      [-2e-5, 2]
    ],
    "red_o_points": [],
    "y_categories": ["N", "NOT APPLICABLE", "nan"],
    "blue_o_points": [],
    "blue_x_points": [
      [0.00042, 2],
      [0.00028, 2],
      [0.00012, 0],
      [0.00067, 0],
      [8e-5, 2],
      [0.00131, 0],
      [0.00016, 0],
      [0.00031, 0],
      [0.00053, 2],
      [0.00282, 1],
      [-0.00018, 0],
      [0.00112, 0],
      [0.00058, 2],
      [0.0003, 2],
      [0.00022, 2],
      [6e-5, 2],
      [0.00074, 2],
      [0.00017, 2],
      [0.00027, 1],
      [0.00059, 2],
      [0.00012, 2]
    ]
  },
  "QA_lstPexMuscstrength[WristFlex]": {
    "red_x_points": [
      [-0.00059, 0],
      [-0.00132, 2],
      [-0.00762, 1],
      [0.00135, 0],
      [-0.00591, 1],
      [-0.01162, 1],
      [-0.00226, 0],
      [0.00025, 0],
      [-0.00181, 2],
      [-0.00279, 2],
      [-0.00039, 0],
      [-0.00167, 2],
      [-0.00586, 1],
      [0.00081, 0],
      [0.00105, 0],
      [-0.00269, 1],
      [-0.0068, 1],
      [-0.00364, 0],
      [0.00214, 0],
      [0.00098, 0],
      [-0.00169, 2],
      [-0.0082, 1],
      [-0.00439, 2]
    ],
    "red_o_points": [],
    "y_categories": ["GREATER THAN OR EQUALS TO 3", "LESS THAN 3", "nan"],
    "blue_o_points": [],
    "blue_x_points": [
      [0.00349, 1],
      [0.00589, 0],
      [0.00148, 0],
      [0.00457, 0],
      [0.0032, 0],
      [0.00596, 0],
      [0.00351, 0],
      [0.00377, 0],
      [0.00061, 2],
      [0.00076, 2],
      [0.00368, 0],
      [0.00697, 0],
      [0.00153, 2],
      [-0.00011, 0],
      [0.00085, 0],
      [0.00155, 0],
      [0.00288, 2],
      [0.00354, 1],
      [0.00139, 0],
      [0.00665, 1],
      [0.00053, 2]
    ]
  },
  "QS_mulNeuromadSite[C5]": {
    "red_x_points": [
      [-0.00287, 1],
      [-0.0007, 0],
      [-0.00027, 0],
      [0.00022, 0],
      [-0.00073, 0],
      [0.00056, 0],
      [5e-5, 2],
      [-0.00308, 1],
      [0.00067, 2],
      [-0.00076, 0],
      [0.00016, 2],
      [-0.00092, 0],
      [6e-5, 2],
      [1e-5, 0],
      [-0.00458, 1],
      [0.00012, 2],
      [-0.00091, 0],
      [1e-5, 2],
      [-0.00033, 0],
      [-0.00141, 0],
      [-0.00212, 1],
      [0.00036, 0],
      [8e-5, 2]
    ],
    "red_o_points": [],
    "y_categories": ["N", "NOT APPLICABLE", "nan"],
    "blue_o_points": [],
    "blue_x_points": [
      [0.00102, 2],
      [0.00025, 2],
      [0.0009, 0],
      [0.00105, 0],
      [0.0003, 2],
      [0.00158, 0],
      [0.00063, 0],
      [0.00042, 0],
      [0.00084, 2],
      [0.00341, 1],
      [-0.00034, 0],
      [0.00172, 0],
      [0.00081, 2],
      [0.00047, 2],
      [0.00053, 2],
      [0.00029, 2],
      [0.00072, 2],
      [0.00042, 2],
      [0.0004, 1],
      [0.00044, 2],
      [0.00053, 2]
    ]
  },
  "QS_mulNeuromadSite[C7]": {
    "red_x_points": [
      [-0.00896, 1],
      [-0.0052, 0],
      [-0.00149, 0],
      [0.00109, 0],
      [-0.0036, 0],
      [0.00119, 0],
      [-0.00027, 2],
      [-0.01025, 1],
      [0.0029, 2],
      [-0.00362, 0],
      [0.0004, 2],
      [-0.00431, 0],
      [0.00053, 2],
      [1e-5, 0],
      [-0.01297, 1],
      [0.00036, 2],
      [-0.00395, 0],
      [0.0006, 2],
      [-0.00269, 0],
      [-0.00573, 0],
      [-0.00823, 1],
      [0.00102, 0],
      [0.00046, 2]
    ],
    "red_o_points": [],
    "y_categories": ["N", "NOT APPLICABLE", "nan"],
    "blue_o_points": [],
    "blue_x_points": [
      [0.00197, 2],
      [0.00138, 2],
      [0.00178, 0],
      [0.00448, 0],
      [0.00114, 2],
      [0.00455, 0],
      [0.00253, 0],
      [0.00239, 0],
      [0.00444, 2],
      [0.01427, 1],
      [-0.00169, 0],
      [0.00514, 0],
      [0.00388, 2],
      [0.00179, 2],
      [0.00173, 2],
      [0.00091, 2],
      [0.00418, 2],
      [0.00172, 2],
      [0.00205, 1],
      [0.00233, 2],
      [0.00172, 2]
    ]
  },
  "QS_mulGraftNerve[TD]": {
    "red_x_points": [
      [-0.00047, 1],
      [-0.00037, 0],
      [-0.00018, 0],
      [2e-5, 0],
      [-0.00031, 0],
      [6e-5, 0],
      [-2e-5, 2],
      [-0.0003, 1],
      [0.0002, 2],
      [-0.00038, 0],
      [4e-5, 2],
      [-0.00026, 0],
      [2e-5, 2],
      [1e-5, 0],
      [-0.00102, 1],
      [3e-5, 2],
      [-0.0001, 0],
      [0.00013, 2],
      [-0.00033, 0],
      [-0.00028, 0],
      [-0.0009, 1],
      [0.0001, 0],
      [-9e-5, 2]
    ],
    "red_o_points": [],
    "y_categories": ["N", "NOT APPLICABLE", "nan"],
    "blue_o_points": [],
    "blue_x_points": [
      [0.0001, 2],
      [0.00018, 2],
      [9e-5, 0],
      [0.00047, 0],
      [5e-5, 2],
      [0.00045, 0],
      [0.00023, 0],
      [3e-5, 0],
      [0.00031, 2],
      [0.00102, 1],
      [-0.00013, 0],
      [0.00032, 0],
      [0.00027, 2],
      [0.00015, 2],
      [0.00014, 2],
      [1e-5, 2],
      [0.0003, 2],
      [0.0001, 2],
      [9e-5, 1],
      [0.00014, 2],
      [5e-5, 2]
    ]
  },
  "QA_intPexForearmSupin": {
    "red_x_points": [
      [-0.00077, 2],
      [-0.00963, 0],
      [-0.00118, 2],
      [-0.00073, 2],
      [-0.0009, 2],
      [-0.00102, 2],
      [-0.02427, 0],
      [-0.01712, 0],
      [-0.0009, 2],
      [-0.0006, 2],
      [-0.00127, 2],
      [-0.00047, 2],
      [-0.00168, 2],
      [0.00593, 1],
      [-0.00069, 2],
      [-0.01871, 0],
      [0.00163, 1],
      [-0.00109, 2],
      [-0.00144, 2],
      [-0.00092, 2],
      [0.00687, 1],
      [-0.01359, 0],
      [-0.00172, 2]
    ],
    "red_o_points": [],
    "y_categories": ["GREATER THAN OR EQUALS TO 80", "LESS THAN 80", "nan"],
    "blue_o_points": [],
    "blue_x_points": [
      [-0.00046, 2],
      [0.01855, 1],
      [0.00538, 1],
      [0.01532, 1],
      [0.01133, 1],
      [0.00015, 2],
      [8e-5, 2],
      [0.00016, 2],
      [-0.00047, 2],
      [-0.00012, 2],
      [0.00283, 0],
      [0.00016, 2],
      [-0.00053, 2],
      [0.01033, 1],
      [0.00912, 1],
      [-0.00012, 2],
      [-0.00073, 2],
      [-0.0002, 2],
      [0.00026, 2],
      [0.01331, 1],
      [-6e-5, 2]
    ]
  },
  "QA_lstPexTinel[TinelSign]": {
    "red_x_points": [
      [0.0008, 1],
      [-0.00082, 1],
      [-0.00836, 2],
      [0.00058, 1],
      [0.00059, 1],
      [0.00114, 1],
      [-0.01242, 2],
      [-0.00974, 2],
      [-0.00529, 1],
      [0.0005, 1],
      [-0.01463, 2],
      [-0.00584, 2],
      [-0.00085, 1],
      [-0.01368, 2],
      [0.00215, 1],
      [-0.00938, 2],
      [0.00051, 1],
      [-0.00162, 1],
      [-0.01218, 2],
      [-0.00742, 2],
      [7e-5, 1],
      [-0.00678, 2],
      [-0.00188, 1]
    ],
    "red_o_points": [],
    "y_categories": ["ABS", "NAIA", "PT", "nan"],
    "blue_o_points": [],
    "blue_x_points": [
      [0.00665, 1],
      [0.0327, 0],
      [0.01341, 0],
      [-0.00697, 2],
      [0.00367, 1],
      [0.00485, 1],
      [-0.0062, 2],
      [0.00427, 1],
      [0.00569, 2],
      [0.00105, 1],
      [0.00324, 1],
      [0.0046, 1],
      [0.0007, 1],
      [0.01612, 0],
      [0.00389, 1],
      [0.00347, 1],
      [0.0036, 2],
      [0.00214, 1],
      [0.00398, 1],
      [0.00205, 1],
      [0.00164, 1]
    ]
  },
  "QS_mulLysisSite[Nerve]": {
    "red_x_points": [
      [-0.00676, 1],
      [-0.00063, 0],
      [-0.01275, 2],
      [-0.02206, 2],
      [-0.001, 0],
      [0.00252, 0],
      [0.00083, 3],
      [-0.00749, 1],
      [0.00107, 3],
      [-0.00043, 0],
      [0.00141, 3],
      [-0.00095, 0],
      [0.00083, 3],
      [0.00066, 0],
      [-0.00686, 1],
      [0.00091, 3],
      [-0.00109, 0],
      [0.0014, 3],
      [0.00103, 0],
      [-0.0015, 0],
      [-0.00723, 1],
      [0.00225, 0],
      [0.00081, 3]
    ],
    "red_o_points": [],
    "y_categories": ["N", "NOT APPLICABLE", "Y", "nan"],
    "blue_o_points": [],
    "blue_x_points": [
      [0.00331, 3],
      [0.00197, 3],
      [0.00205, 0],
      [0.0049, 0],
      [0.00164, 3],
      [0.00483, 0],
      [0.00248, 0],
      [0.00568, 0],
      [0.00136, 3],
      [0.00329, 1],
      [-0.00032, 0],
      [0.0044, 0],
      [0.00133, 3],
      [0.00282, 3],
      [0.00246, 3],
      [0.00153, 3],
      [0.00263, 3],
      [0.00181, 3],
      [0.00199, 1],
      [0.0034, 3],
      [0.00148, 3]
    ]
  },
  "QA_lstPexMuscstrength[FingersAddu]": {
    "red_x_points": [
      [1e-5, 2],
      [-0.00014, 2],
      [-0.01788, 1],
      [-0.00043, 2],
      [-0.01648, 1],
      [-0.01876, 1],
      [0.00556, 0],
      [0.00623, 0],
      [-0.00014, 2],
      [0.00021, 2],
      [0.00368, 0],
      [0.00041, 2],
      [-0.01868, 1],
      [0.00699, 0],
      [0.00637, 0],
      [-0.01631, 1],
      [-0.01497, 1],
      [0.00044, 2],
      [-0.00073, 2],
      [-0.01467, 1],
      [-5e-5, 2],
      [-0.01573, 1],
      [-0.00132, 2]
    ],
    "red_o_points": [],
    "y_categories": ["GREATER THAN OR EQUALS TO 3", "LESS THAN 3", "nan"],
    "blue_o_points": [],
    "blue_x_points": [
      [0.01416, 0],
      [-0.00547, 1],
      [0.00612, 0],
      [0.01038, 0],
      [0.01125, 0],
      [0.0142, 0],
      [0.00155, 2],
      [0.01084, 0],
      [0.00068, 2],
      [0.00159, 2],
      [0.00169, 2],
      [0.00252, 2],
      [0.0014, 2],
      [0.00696, 0],
      [0.00645, 0],
      [0.00759, 0],
      [0.00213, 2],
      [0.00148, 2],
      [0.00944, 0],
      [0.00086, 2],
      [0.00053, 2]
    ]
  },
  "QA_lstPexTouch[T1]": {
    "red_x_points": [
      [-0.01107, 1],
      [-0.00244, 2],
      [-0.00566, 1],
      [0.00555, 0],
      [-0.00238, 2],
      [-0.00667, 1],
      [0.00407, 0],
      [-0.01006, 1],
      [-0.00265, 2],
      [-0.00531, 2],
      [-0.00945, 1],
      [-0.00276, 2],
      [-0.00758, 1],
      [-0.0139, 1],
      [-0.0101, 1],
      [-0.00574, 1],
      [-0.00157, 2],
      [0.00115, 0],
      [-0.00941, 1],
      [-0.00304, 2],
      [-0.01056, 1],
      [-0.00504, 1],
      [-0.00874, 1]
    ],
    "red_o_points": [],
    "y_categories": ["NORM", "NPV", "nan"],
    "blue_o_points": [],
    "blue_x_points": [
      [-0.00575, 1],
      [-0.00482, 1],
      [0.01274, 0],
      [-0.00376, 1],
      [-0.005, 1],
      [0.0195, 0],
      [0.01736, 0],
      [0.01396, 0],
      [0.00083, 2],
      [0.00376, 2],
      [-0.00034, 2],
      [-0.00404, 1],
      [0.00163, 2],
      [0.0114, 0],
      [0.01056, 0],
      [0.01121, 0],
      [0.00247, 2],
      [-0.00521, 1],
      [0.01715, 0],
      [0.0137, 0],
      [0.01599, 0]
    ]
  },
  "QA_lstPexArthre[Elbow]": {
    "red_x_points": [
      [0.00025, 2],
      [-0.00097, 3],
      [-0.00239, 3],
      [0.0002, 2],
      [-0.00659, 0],
      [-0.00496, 1],
      [-0.00201, 2],
      [-0.00016, 2],
      [-0.00072, 3],
      [0.00058, 2],
      [-0.00221, 3],
      [-0.00058, 3],
      [-0.00155, 3],
      [0.0003, 2],
      [-0.0005, 2],
      [-0.00384, 2],
      [-0.0007, 3],
      [-0.00135, 3],
      [-0.00301, 3],
      [-0.00063, 3],
      [-0.00043, 3],
      [0.00037, 2],
      [-0.00133, 3]
    ],
    "red_o_points": [],
    "y_categories": ["NAIA", "NPV", "PV", "nan"],
    "blue_o_points": [],
    "blue_x_points": [
      [0.01596, 1],
      [-0.0007, 3],
      [0.00061, 2],
      [0.00166, 2],
      [0.00013, 3],
      [0.00352, 2],
      [0.00164, 2],
      [0.00156, 2],
      [-0.00029, 3],
      [-0.00016, 3],
      [-0.00032, 3],
      [0.0034, 2],
      [-0.00017, 3],
      [0.00014, 2],
      [0.0001, 2],
      [0.00354, 1],
      [-0.00036, 3],
      [0.00028, 2],
      [7e-5, 3],
      [0.00062, 2],
      [0.001, 2]
    ]
  },
  "QS_mulTransfSite[AcMc]": {
    "red_x_points": [
      [-0.00943, 1],
      [-0.00675, 0],
      [-0.00378, 0],
      [-0.00584, 0],
      [-0.00487, 0],
      [-0.00033, 0],
      [0.00058, 3],
      [-0.01344, 1],
      [0.00414, 3],
      [-0.00542, 0],
      [0.00218, 3],
      [-0.0057, 0],
      [0.00191, 3],
      [-0.00384, 0],
      [-0.01557, 1],
      [0.00149, 3],
      [-0.00407, 0],
      [0.0021, 3],
      [-0.0045, 0],
      [-0.00743, 0],
      [-0.01086, 1],
      [-0.00107, 0],
      [0.00171, 3]
    ],
    "red_o_points": [],
    "y_categories": ["N", "NOT APPLICABLE", "Y", "nan"],
    "blue_o_points": [],
    "blue_x_points": [
      [0.00433, 3],
      [0.00281, 3],
      [0.001, 0],
      [0.00182, 0],
      [0.00325, 3],
      [0.00348, 0],
      [0.00062, 0],
      [0.02143, 2],
      [0.00546, 3],
      [0.01358, 1],
      [-0.00286, 0],
      [0.00258, 0],
      [0.00441, 3],
      [0.00394, 3],
      [0.00309, 3],
      [0.00229, 3],
      [0.00497, 3],
      [0.0027, 3],
      [0.00249, 1],
      [0.00461, 3],
      [0.00279, 3]
    ]
  },
  "QS_mulTransfSite[Other]": {
    "red_x_points": [
      [-0.00444, 1],
      [-0.00175, 0],
      [-0.00027, 0],
      [0.00049, 0],
      [-0.00078, 0],
      [0.00026, 0],
      [-0.00039, 3],
      [-0.00715, 1],
      [0.00097, 3],
      [-0.001, 0],
      [0.0012, 3],
      [-0.00127, 0],
      [0.00058, 3],
      [-0.0343, 2],
      [-0.00655, 1],
      [0.00044, 3],
      [-0.00089, 0],
      [0.00114, 3],
      [0.00032, 0],
      [-0.00158, 0],
      [-0.00532, 1],
      [0.00039, 0],
      [0.00048, 3]
    ],
    "red_o_points": [],
    "y_categories": ["N", "NOT APPLICABLE", "Y", "nan"],
    "blue_o_points": [],
    "blue_x_points": [
      [0.00238, 3],
      [0.00169, 3],
      [0.0044, 0],
      [0.00425, 0],
      [0.00315, 3],
      [0.00377, 0],
      [0.00646, 0],
      [0.00468, 0],
      [0.00145, 3],
      [0.00325, 1],
      [-0.00041, 0],
      [0.00257, 0],
      [0.0009, 3],
      [0.00442, 3],
      [0.00384, 3],
      [0.00264, 3],
      [0.00195, 3],
      [0.00258, 3],
      [0.00088, 1],
      [0.00292, 3],
      [0.00161, 3]
    ]
  },
  "QA_yonInjBpsurg": {
    "red_x_points": [
      [-0.00752, 0],
      [0.00023, 1],
      [0.0001, 1],
      [0.00147, 1],
      [0.00016, 1],
      [0.00091, 1],
      [0.00084, 1],
      [-0.00996, 0],
      [7e-5, 1],
      [0.00049, 1],
      [0.00035, 1],
      [0.00024, 1],
      [0.0006, 1],
      [0.00099, 1],
      [-0.01138, 0],
      [0.00058, 1],
      [-0.00099, 1],
      [-0.00193, 1],
      [0.00044, 1],
      [-0.00079, 1],
      [-0.01164, 0],
      [0.00043, 1],
      [0.00058, 1]
    ],
    "red_o_points": [],
    "y_categories": ["N", "Y", "nan"],
    "blue_o_points": [],
    "blue_x_points": [
      [0.00276, 1],
      [0.00178, 1],
      [0.00177, 1],
      [0.0022, 1],
      [0.00077, 1],
      [0.00295, 1],
      [0.00211, 1],
      [0.00183, 1],
      [0.00063, 1],
      [0.00429, 0],
      [0.00038, 1],
      [0.00237, 1],
      [0.00049, 1],
      [0.00187, 1],
      [0.00187, 1],
      [0.00118, 1],
      [0.00012, 1],
      [0.00237, 1],
      [-0.00089, 0],
      [0.00236, 1],
      [0.00252, 1]
    ]
  },
  "QA_lstPexTouch[C8]": {
    "red_x_points": [
      [0.00962, 0],
      [-0.00387, 2],
      [-0.00902, 1],
      [-0.01259, 1],
      [-0.00327, 2],
      [-0.00836, 1],
      [-0.01108, 1],
      [-0.01186, 1],
      [-0.00445, 2],
      [-0.00485, 2],
      [-0.01338, 1],
      [-0.00362, 2],
      [-0.01379, 1],
      [0.01025, 0],
      [-0.01053, 1],
      [-0.01024, 1],
      [-0.00304, 2],
      [0.00752, 0],
      [-0.00915, 1],
      [-0.00382, 2],
      [-0.01373, 1],
      [-0.00801, 1],
      [-0.0132, 1]
    ],
    "red_o_points": [],
    "y_categories": ["NORM", "NPV", "nan"],
    "blue_o_points": [],
    "blue_x_points": [
      [-0.00954, 1],
      [-0.00982, 1],
      [0.01263, 0],
      [-0.00682, 1],
      [0.01966, 0],
      [-0.00711, 1],
      [0.01706, 0],
      [0.01891, 0],
      [0.00029, 2],
      [0.00144, 2],
      [-0.00081, 2],
      [-0.00673, 1],
      [0.00091, 2],
      [0.0151, 0],
      [0.0139, 0],
      [0.01559, 0],
      [0.00144, 2],
      [0.01237, 0],
      [0.01672, 0],
      [0.02053, 0],
      [0.01878, 0]
    ]
  },
  "QS_mulNeuromadSite[T1]": {
    "red_x_points": [
      [-0.00217, 1],
      [-0.00076, 0],
      [-0.00033, 0],
      [0.00023, 0],
      [-0.0008, 0],
      [0.0005, 0],
      [-8e-5, 2],
      [-0.00175, 1],
      [0.00055, 2],
      [-0.00066, 0],
      [0.00027, 2],
      [-0.00082, 0],
      [-1e-5, 2],
      [-7e-5, 0],
      [-0.00298, 1],
      [5e-5, 2],
      [-0.00082, 0],
      [8e-5, 2],
      [-0.00031, 0],
      [-0.00118, 0],
      [-0.00224, 1],
      [0.0002, 0],
      [0.00013, 2]
    ],
    "red_o_points": [],
    "y_categories": ["N", "NOT APPLICABLE", "nan"],
    "blue_o_points": [],
    "blue_x_points": [
      [0.00069, 2],
      [0.00032, 2],
      [0.00037, 0],
      [0.00129, 0],
      [0.0002, 2],
      [0.00098, 0],
      [0.00045, 0],
      [0.00054, 0],
      [0.00066, 2],
      [0.00299, 1],
      [-0.00016, 0],
      [0.00068, 0],
      [0.00072, 2],
      [0.00031, 2],
      [0.00027, 2],
      [0.00031, 2],
      [0.00085, 2],
      [0.00028, 2],
      [0.00036, 1],
      [0.00065, 2],
      [0.0002, 2]
    ]
  },
  "QS_mulTransfSite[AcSsAA]": {
    "red_x_points": [
      [-0.00974, 1],
      [-0.01602, 2],
      [-0.00099, 0],
      [-0.00067, 0],
      [-0.01195, 2],
      [0.00138, 0],
      [-0.00059, 3],
      [-0.01314, 1],
      [0.0057, 3],
      [-0.01772, 2],
      [0.00224, 3],
      [-0.0018, 0],
      [0.00177, 3],
      [-0.00887, 0],
      [-0.01586, 1],
      [0.0005, 3],
      [-0.01013, 2],
      [0.0031, 3],
      [-0.00154, 0],
      [-0.0139, 2],
      [-0.01009, 1],
      [0.00023, 0],
      [0.00216, 3]
    ],
    "red_o_points": [],
    "y_categories": ["N", "NOT APPLICABLE", "Y", "nan"],
    "blue_o_points": [],
    "blue_x_points": [
      [0.0051, 3],
      [0.00302, 3],
      [0.00514, 2],
      [0.00355, 0],
      [0.00333, 3],
      [0.00546, 0],
      [0.01068, 2],
      [0.00168, 0],
      [0.00791, 3],
      [0.01393, 1],
      [0.00989, 0],
      [0.00685, 0],
      [0.007, 3],
      [0.00352, 3],
      [0.00382, 3],
      [0.00254, 3],
      [0.00786, 3],
      [0.00354, 3],
      [0.00266, 1],
      [0.00473, 3],
      [0.00376, 3]
    ]
  },
  "QS_mulNeuromadSite[C6]": {
    "red_x_points": [
      [-0.00522, 1],
      [-0.00242, 0],
      [-0.00109, 0],
      [0.00079, 0],
      [-0.00163, 0],
      [0.00069, 0],
      [0.00014, 2],
      [-0.0052, 1],
      [0.00121, 2],
      [-0.00162, 0],
      [0.00035, 2],
      [-0.00188, 0],
      [0.00027, 2],
      [-5e-5, 0],
      [-0.00704, 1],
      [0.00011, 2],
      [-0.00188, 0],
      [0.00032, 2],
      [-0.00115, 0],
      [-0.0022, 0],
      [-0.00485, 1],
      [0.00053, 0],
      [0.00038, 2]
    ],
    "red_o_points": [],
    "y_categories": ["N", "NOT APPLICABLE", "nan"],
    "blue_o_points": [],
    "blue_x_points": [
      [0.00226, 2],
      [0.00132, 2],
      [0.00098, 0],
      [0.00212, 0],
      [0.00079, 2],
      [0.00227, 0],
      [0.0014, 0],
      [0.00107, 0],
      [0.00191, 2],
      [0.00619, 1],
      [-0.00113, 0],
      [0.00287, 0],
      [0.00188, 2],
      [0.00076, 2],
      [0.00092, 2],
      [0.00041, 2],
      [0.00174, 2],
      [0.00083, 2],
      [0.00118, 1],
      [0.00121, 2],
      [0.00048, 2]
    ]
  },
  "QA_lstPexTouch[C5]": {
    "red_x_points": [
      [-0.00173, 0],
      [1e-5, 2],
      [-0.00198, 1],
      [-0.001, 1],
      [-0.00066, 2],
      [-0.00064, 1],
      [-0.00104, 1],
      [-0.00337, 1],
      [-0.00023, 2],
      [-0.00039, 2],
      [-0.00294, 1],
      [2e-5, 2],
      [-0.00291, 1],
      [-0.00147, 1],
      [-0.00414, 1],
      [-0.00077, 1],
      [-0.00024, 2],
      [-0.00478, 1],
      [-0.0019, 1],
      [-0.00101, 2],
      [-0.00278, 1],
      [-0.00038, 1],
      [-0.00338, 1]
    ],
    "red_o_points": [],
    "y_categories": ["NORM", "NPV", "nan"],
    "blue_o_points": [],
    "blue_x_points": [
      [-0.00145, 1],
      [-0.00241, 1],
      [-0.00049, 1],
      [-0.00049, 1],
      [0.01391, 0],
      [-0.00037, 1],
      [-0.00045, 1],
      [-0.00041, 1],
      [0.00151, 2],
      [0.0039, 2],
      [0.00094, 2],
      [-0.00125, 1],
      [0.00215, 2],
      [-0.00104, 1],
      [0.006, 0],
      [-0.00088, 1],
      [0.00246, 2],
      [0.00545, 0],
      [0.01265, 0],
      [-0.001, 1],
      [-0.00102, 1]
    ]
  },
  "QA_lstPexPalle[Clavicle]": {
    "red_x_points": [
      [-0.00075, 3],
      [-0.00068, 3],
      [-0.00068, 3],
      [0.00768, 2],
      [-0.00077, 3],
      [-0.00101, 3],
      [-0.0165, 0],
      [-0.01668, 0],
      [-0.0008, 3],
      [-0.00109, 3],
      [-0.00097, 3],
      [-0.00067, 3],
      [-0.00062, 3],
      [-0.02593, 0],
      [-0.00055, 3],
      [-0.01686, 0],
      [-0.00762, 1],
      [-0.00106, 3],
      [-0.00159, 3],
      [-0.00085, 3],
      [0.00772, 2],
      [-0.01235, 0],
      [-0.00075, 3]
    ],
    "red_o_points": [],
    "y_categories": ["HYPO", "NAIA", "PT", "nan"],
    "blue_o_points": [],
    "blue_x_points": [
      [-0.00031, 3],
      [-0.00033, 3],
      [0.01202, 2],
      [0.01692, 2],
      [-0.00027, 3],
      [-0.00042, 3],
      [0.01815, 2],
      [0.01474, 2],
      [-0.00053, 3],
      [-0.00052, 3],
      [-0.00064, 3],
      [-0.00011, 3],
      [-0.00048, 3],
      [-0.00842, 0],
      [0.01142, 2],
      [0.00733, 1],
      [-0.00068, 3],
      [0.01113, 2],
      [-0.0004, 3],
      [0.01538, 2],
      [-0.0006, 3]
    ]
  },
  "QA_lstPexMuscstrength[ShoulderAbduc]": {
    "red_x_points": [
      [-0.00068, 2],
      [0.00015, 1],
      [5e-5, 1],
      [0.00062, 1],
      [1e-5, 1],
      [0.00078, 1],
      [0.00069, 1],
      [-0.01459, 0],
      [-0.00026, 2],
      [-0.00068, 2],
      [-0.00318, 2],
      [-0.00033, 2],
      [0.00015, 1],
      [0.00113, 1],
      [-0.02348, 0],
      [0.00022, 1],
      [8e-5, 1],
      [7e-5, 1],
      [0.00087, 1],
      [0.00041, 1],
      [-0.0005, 2],
      [0.00021, 1],
      [-0.00039, 2]
    ],
    "red_o_points": [],
    "y_categories": ["GREATER THAN OR EQUALS TO 3", "LESS THAN 3", "nan"],
    "blue_o_points": [],
    "blue_x_points": [
      [0.00269, 1],
      [0.00199, 1],
      [0.0026, 1],
      [0.00197, 1],
      [0.00173, 1],
      [0.00386, 1],
      [0.00215, 1],
      [0.00128, 1],
      [0.00068, 2],
      [0.00173, 2],
      [0.00075, 1],
      [0.00165, 2],
      [0.0008, 2],
      [0.00221, 1],
      [0.00242, 1],
      [-0.00032, 2],
      [0.00066, 2],
      [0.00158, 1],
      [0.00679, 1],
      [0.00031, 1],
      [0.0011, 1]
    ]
  },
  "QA_lstPexMuscstrength[ThumbOppo]": {
    "red_x_points": [
      [0.00034, 2],
      [3e-5, 2],
      [-0.01249, 1],
      [-0.02471, 1],
      [-0.00811, 1],
      [-0.01303, 1],
      [-0.00279, 0],
      [0.00157, 0],
      [-0.0, 2],
      [0.0001, 2],
      [-0.004, 0],
      [0.0002, 2],
      [-0.00881, 1],
      [0.00396, 0],
      [0.00143, 0],
      [-0.00684, 1],
      [-0.00795, 1],
      [0.00044, 2],
      [0.0029, 0],
      [-0.0076, 1],
      [-9e-5, 2],
      [-0.01137, 1],
      [-0.00238, 2]
    ],
    "red_o_points": [],
    "y_categories": ["GREATER THAN OR EQUALS TO 3", "LESS THAN 3", "nan"],
    "blue_o_points": [],
    "blue_x_points": [
      [0.00225, 1],
      [0.00329, 1],
      [0.00451, 0],
      [0.00831, 0],
      [0.00803, 0],
      [0.0096, 0],
      [0.00641, 0],
      [0.01098, 0],
      [0.00139, 2],
      [0.00128, 2],
      [0.00234, 2],
      [0.00909, 2],
      [0.00131, 2],
      [0.00499, 0],
      [0.00434, 0],
      [0.00638, 0],
      [0.00273, 2],
      [0.00162, 2],
      [0.00575, 0],
      [0.00313, 2],
      [0.00148, 2]
    ]
  },
  "QA_lstPexMuscstrength[ShoulderExrot]": {
    "red_x_points": [
      [-0.00057, 2],
      [-1e-5, 2],
      [-0.01554, 0],
      [-0.00061, 2],
      [0.00317, 1],
      [-0.0004, 2],
      [0.00212, 1],
      [-0.02176, 0],
      [-0.00026, 2],
      [-0.00026, 2],
      [-0.00073, 2],
      [-0.00027, 2],
      [-0.00025, 2],
      [0.0033, 1],
      [-0.02776, 0],
      [0.00236, 1],
      [0.00029, 2],
      [0.00042, 2],
      [0.00445, 1],
      [-0.01774, 0],
      [-0.00057, 2],
      [0.00149, 1],
      [-0.00057, 2]
    ],
    "red_o_points": [],
    "y_categories": ["GREATER THAN OR EQUALS TO 3", "LESS THAN 3", "nan"],
    "blue_o_points": [],
    "blue_x_points": [
      [0.00948, 1],
      [0.00022, 2],
      [0.00502, 1],
      [0.00552, 1],
      [0.00632, 1],
      [0.00948, 1],
      [0.00494, 1],
      [0.00015, 2],
      [0.00061, 2],
      [0.00128, 2],
      [0.00094, 2],
      [0.00102, 2],
      [0.0011, 2],
      [0.00476, 1],
      [0.00475, 1],
      [-6e-5, 2],
      [0.00094, 2],
      [0.00113, 2],
      [0.01192, 1],
      [0.0002, 2],
      [-0.0, 2]
    ]
  },
  "QA_txtInjMedicatioListNer": {
    "red_x_points": [
      [-0.00807, 1],
      [-0.00636, 1],
      [-0.00617, 1],
      [-0.005, 1],
      [-0.00701, 1],
      [-0.00054, 2],
      [-0.00749, 1],
      [0.00382, 0],
      [-0.00834, 2],
      [-0.0035, 2],
      [-0.0028, 2],
      [-0.00323, 2],
      [-0.00902, 1],
      [-0.00823, 1],
      [-0.00048, 2],
      [-0.00785, 1],
      [-0.00224, 2],
      [-0.00768, 1],
      [-0.00948, 1],
      [-0.00706, 1],
      [-0.0046, 1],
      [-0.00024, 2],
      [-0.0025, 2]
    ],
    "red_o_points": [],
    "y_categories": ["N", "Y", "nan"],
    "blue_o_points": [],
    "blue_x_points": [
      [0.03275, 0],
      [0.00137, 2],
      [0.01178, 0],
      [-0.00372, 1],
      [0.00154, 2],
      [0.00223, 2],
      [0.00194, 2],
      [-0.00349, 1],
      [-0.00279, 1],
      [-0.00464, 1],
      [0.03043, 0],
      [0.00081, 2],
      [0.02403, 0],
      [-0.00397, 1],
      [0.00127, 2],
      [0.0006, 2],
      [-0.00303, 1],
      [0.01397, 0],
      [0.01719, 0],
      [-0.00407, 1],
      [-0.00012, 2]
    ]
  },
  "QA_lstPexKine[Elbow]": {
    "red_x_points": [
      [-0.00033, 1],
      [-0.00057, 2],
      [-0.00202, 2],
      [0.00102, 1],
      [-0.00085, 2],
      [-0.00807, 0],
      [-0.00077, 1],
      [6e-5, 1],
      [-0.00061, 2],
      [0.00088, 1],
      [-0.00157, 2],
      [-0.00058, 2],
      [-0.00166, 2],
      [4e-5, 1],
      [0.0003, 1],
      [-0.0025, 0],
      [-0.00063, 2],
      [-0.0015, 2],
      [-0.00316, 2],
      [-0.00046, 2],
      [-0.00029, 2],
      [-0.00609, 0],
      [-0.00135, 2]
    ],
    "red_o_points": [],
    "y_categories": ["NPV", "PV", "nan"],
    "blue_o_points": [],
    "blue_x_points": [
      [0.0046, 0],
      [-0.00082, 2],
      [0.00055, 1],
      [0.00368, 1],
      [-0.00051, 2],
      [0.00411, 1],
      [0.00159, 1],
      [0.00209, 1],
      [-0.00039, 2],
      [-0.00016, 2],
      [-0.00037, 2],
      [0.00668, 1],
      [-0.00012, 2],
      [0.00082, 1],
      [0.00067, 1],
      [0.00331, 0],
      [-0.00035, 2],
      [0.00068, 1],
      [0.0001, 2],
      [0.00281, 1],
      [0.00175, 1]
    ]
  },
  "QS_mulNeuromadSite[C4]": {
    "red_x_points": [
      [-0.00741, 1],
      [-0.00447, 0],
      [-0.00163, 0],
      [0.00021, 0],
      [-0.00266, 0],
      [0.00148, 0],
      [-0.00037, 2],
      [-0.00834, 1],
      [0.00227, 2],
      [-0.00343, 0],
      [0.00056, 2],
      [-0.00402, 0],
      [0.00043, 2],
      [-0.00021, 0],
      [-0.01574, 1],
      [0.00033, 2],
      [-0.00282, 0],
      [0.00013, 2],
      [-0.00183, 0],
      [-0.00505, 0],
      [-0.00887, 1],
      [0.00052, 0],
      [0.00053, 2]
    ],
    "red_o_points": [],
    "y_categories": ["N", "NOT APPLICABLE", "nan"],
    "blue_o_points": [],
    "blue_x_points": [
      [0.00298, 2],
      [0.00137, 2],
      [0.00192, 0],
      [0.0045, 0],
      [0.00081, 2],
      [0.00446, 0],
      [0.00175, 0],
      [0.00195, 0],
      [0.00388, 2],
      [0.01214, 1],
      [-0.00157, 0],
      [0.0047, 0],
      [0.0035, 2],
      [0.00179, 2],
      [0.0024, 2],
      [0.00159, 2],
      [0.00383, 2],
      [0.002, 2],
      [0.00234, 1],
      [0.00245, 2],
      [0.0016, 2]
    ]
  },
  "QS_mulTransfSite[Oberlin]": {
    "red_x_points": [
      [-0.01248, 1],
      [-0.0384, 0],
      [-0.03518, 0],
      [-0.03902, 0],
      [-0.03842, 0],
      [-0.03758, 0],
      [0.0099, 3],
      [-0.01399, 1],
      [0.0117, 3],
      [0.01407, 2],
      [0.01011, 3],
      [-0.03811, 0],
      [0.01094, 3],
      [0.01505, 2],
      [-0.01445, 1],
      [0.01065, 3],
      [-0.03435, 0],
      [0.01096, 3],
      [0.01639, 2],
      [-0.04021, 0],
      [-0.01479, 1],
      [-0.03429, 0],
      [0.0112, 3]
    ],
    "red_o_points": [],
    "y_categories": ["N", "NOT APPLICABLE", "Y", "nan"],
    "blue_o_points": [],
    "blue_x_points": [
      [0.0125, 3],
      [0.01221, 3],
      [0.01804, 2],
      [0.02064, 2],
      [0.01176, 3],
      [0.02054, 2],
      [0.01875, 2],
      [0.01891, 2],
      [0.01337, 3],
      [-0.0053, 1],
      [0.0179, 2],
      [0.02089, 2],
      [0.01292, 3],
      [0.01187, 3],
      [0.01159, 3],
      [0.01178, 3],
      [0.01363, 3],
      [0.01146, 3],
      [-0.00717, 1],
      [0.01218, 3],
      [0.01183, 3]
    ]
  },
  "QA_lstPexArthre[Index]": {
    "red_x_points": [
      [-0.01209, 0],
      [-0.00202, 2],
      [-0.00346, 2],
      [-0.00983, 0],
      [-0.00416, 0],
      [-0.01041, 0],
      [0.0004, 1],
      [0.00068, 1],
      [-0.0017, 2],
      [0.00379, 1],
      [-0.00252, 2],
      [-0.00183, 2],
      [-0.00258, 2],
      [0.00053, 1],
      [0.0011, 1],
      [-0.00316, 0],
      [-0.0012, 2],
      [-0.00326, 2],
      [-0.0075, 2],
      [-0.00191, 2],
      [-0.00288, 2],
      [-0.00591, 0],
      [-0.00319, 2]
    ],
    "red_o_points": [],
    "y_categories": ["NPV", "PV", "nan"],
    "blue_o_points": [],
    "blue_x_points": [
      [0.00431, 0],
      [-0.00143, 2],
      [0.00379, 1],
      [0.00826, 1],
      [-0.00011, 2],
      [0.01063, 1],
      [0.00652, 1],
      [0.0005, 0],
      [-0.0008, 2],
      [-0.00087, 2],
      [-0.00137, 2],
      [0.01662, 1],
      [-0.00088, 2],
      [0.00248, 1],
      [0.00258, 1],
      [0.00138, 0],
      [-0.00092, 2],
      [0.00564, 1],
      [-0.00016, 2],
      [0.01003, 1],
      [0.0069, 1]
    ]
  },
  "QA_yonPreFracture": {
    "red_x_points": [
      [-0.03192, 1],
      [0.00169, 2],
      [0.0054, 0],
      [0.00147, 2],
      [0.005, 0],
      [0.00539, 0],
      [-0.02776, 1],
      [0.00598, 0],
      [0.00163, 2],
      [-0.03215, 1],
      [-0.03424, 1],
      [-0.02878, 1],
      [0.00243, 2],
      [0.00574, 0],
      [0.00626, 0],
      [0.0054, 0],
      [0.00512, 0],
      [0.00831, 0],
      [-0.03528, 1],
      [0.00523, 0],
      [0.00108, 2],
      [-0.0224, 1],
      [0.00139, 2]
    ],
    "red_o_points": [],
    "y_categories": ["N", "Y", "nan"],
    "blue_o_points": [],
    "blue_x_points": [
      [0.00825, 0],
      [0.00485, 2],
      [0.00681, 0],
      [0.00785, 0],
      [0.00483, 2],
      [0.00894, 0],
      [0.00808, 0],
      [0.00599, 2],
      [0.00439, 2],
      [0.00867, 0],
      [0.00989, 0],
      [0.01083, 0],
      [0.00901, 0],
      [0.0063, 0],
      [0.00624, 0],
      [0.00404, 2],
      [0.00945, 0],
      [0.00823, 0],
      [0.00633, 0],
      [0.00271, 2],
      [0.00332, 2]
    ]
  },
  "QA_lstPexKine[Index]": {
    "red_x_points": [
      [9e-5, 1],
      [-0.00059, 2],
      [-0.00407, 2],
      [0.00206, 1],
      [-0.0017, 2],
      [-0.01085, 0],
      [-0.0, 1],
      [4e-5, 1],
      [-0.00075, 2],
      [0.00093, 1],
      [-0.00183, 2],
      [-0.00095, 2],
      [-0.00143, 2],
      [0.00114, 1],
      [-6e-5, 1],
      [-0.00235, 0],
      [-0.00078, 2],
      [-0.00163, 2],
      [-0.00504, 2],
      [-0.0011, 2],
      [-0.00046, 2],
      [-0.0074, 0],
      [-0.00153, 2]
    ],
    "red_o_points": [],
    "y_categories": ["NPV", "PV", "nan"],
    "blue_o_points": [],
    "blue_x_points": [
      [0.00448, 0],
      [-0.0011, 2],
      [0.00157, 1],
      [0.00541, 1],
      [-0.00017, 2],
      [0.00749, 1],
      [0.00263, 1],
      [0.0042, 1],
      [-0.00019, 2],
      [-2e-5, 2],
      [-0.0007, 2],
      [0.00764, 1],
      [-0.00011, 2],
      [0.00115, 1],
      [0.00093, 1],
      [0.00216, 0],
      [-0.00022, 2],
      [0.00043, 1],
      [-0.00027, 2],
      [0.002, 1],
      [0.001, 1]
    ]
  },
  "QA_lstPexPalle[Ulna]": {
    "red_x_points": [
      [-0.00127, 4],
      [-0.00149, 4],
      [-0.00142, 4],
      [-0.03254, 2],
      [-0.00126, 4],
      [-0.00124, 4],
      [-0.01064, 1],
      [0.00769, 3],
      [-0.00154, 4],
      [-0.00146, 4],
      [-0.00159, 4],
      [-0.00105, 4],
      [-0.00158, 4],
      [0.00792, 3],
      [-0.00125, 4],
      [-0.02467, 0],
      [-0.02078, 0],
      [-0.00172, 4],
      [-0.00218, 4],
      [-0.00146, 4],
      [0.0082, 3],
      [-0.0194, 0],
      [-0.00144, 4]
    ],
    "red_o_points": [],
    "y_categories": ["ABS", "HYPO", "NAIA", "PT", "nan"],
    "blue_o_points": [],
    "blue_x_points": [
      [-0.0009, 4],
      [-0.00085, 4],
      [0.01002, 3],
      [0.01274, 1],
      [-0.00104, 4],
      [-0.00073, 4],
      [0.01285, 3],
      [0.01437, 3],
      [-0.00126, 4],
      [-0.00103, 4],
      [-0.00094, 4],
      [-0.00066, 4],
      [-0.00112, 4],
      [0.01296, 3],
      [0.0129, 3],
      [0.01387, 3],
      [-0.00122, 4],
      [0.01183, 3],
      [-0.00094, 4],
      [0.01628, 3],
      [-0.00097, 4]
    ]
  }
}
