{
  "QA_lstPexPain[C8]": {
    "red_x_points": [
      [-0.00915, 1],
      [-0.00194, 2],
      [-0.00302, 2],
      [-0.00222, 2],
      [-0.00893, 1],
      [0.00087, 0],
      [-0.00069, 1],
      [-0.00178, 1],
      [0.00669, 0],
      [0.00086, 0],
      [0.001, 0],
      [0.00051, 0],
      [-0.00932, 1],
      [-0.01371, 2],
      [-0.00562, 2],
      [-0.00286, 2],
      [-0.00469, 2],
      [-0.00188, 2],
      [-0.00632, 2],
      [0.00726, 0],
      [-0.01075, 1],
      [0.00716, 0],
      [-0.0025, 2],
      [-0.00506, 2],
      [0.00644, 0],
      [-0.00515, 2],
      [-0.00468, 2],
      [-0.00223, 2],
      [-0.00718, 1],
      [-0.01062, 1],
      [-0.00128, 1],
      [-0.00988, 1]
    ],
    "red_o_points": [],
    "y_categories": ["NORM", "NPV", "nan"],
    "blue_o_points": [],
    "blue_x_points": [
      [0.00994, 0],
      [-0.00103, 2],
      [0.0007, 1],
      [0.00663, 1],
      [0.00388, 0],
      [0.00032, 1],
      [0.01078, 0],
      [0.00532, 0],
      [0.01184, 0],
      [0.01361, 0]
    ]
  },
  "QS_mulLysisSite[Root]": {
    "red_x_points": [
      [-0.0008, 3],
      [-0.00107, 0],
      [-0.00491, 2],
      [-0.00135, 0],
      [-0.0009, 3],
      [-0.00133, 0],
      [-0.00082, 0],
      [-0.00123, 0],
      [-0.00081, 3],
      [-0.00118, 0],
      [-0.00163, 0],
      [-0.00063, 0],
      [-0.00073, 3],
      [0.00387, 1],
      [-0.00074, 3],
      [-0.00152, 0],
      [-0.00073, 3],
      [-0.0011, 0],
      [-0.00056, 3],
      [-0.00086, 3],
      [-0.00066, 3],
      [-0.00058, 3],
      [-0.00139, 0],
      [-0.00064, 3],
      [-0.00067, 3],
      [-0.00051, 3],
      [-0.00125, 0],
      [-0.00112, 0],
      [0.00274, 1],
      [-0.00062, 3],
      [-0.00431, 2],
      [-0.00073, 3]
    ],
    "red_o_points": [],
    "y_categories": ["N", "NOT APPLICABLE", "Y", "nan"],
    "blue_o_points": [],
    "blue_x_points": [
      [0.00477, 1],
      [-0.00024, 3],
      [0.00415, 1],
      [0.00046, 0],
      [-0.0002, 0],
      [0.00412, 1],
      [-0.00038, 3],
      [0.00439, 1],
      [-0.00037, 3],
      [-0.0004, 3]
    ]
  },
  "QS_mulLysisTrunk[Upper]": {
    "red_x_points": [
      [-0.0012, 3],
      [-0.00409, 0],
      [-0.00417, 0],
      [-0.00493, 0],
      [-0.00122, 3],
      [-0.00499, 0],
      [-0.00981, 2],
      [-0.00434, 0],
      [-0.00178, 3],
      [-0.00475, 0],
      [-0.00502, 0],
      [-0.00442, 0],
      [-0.00161, 3],
      [0.00923, 1],
      [-0.00131, 3],
      [-0.00437, 0],
      [-0.00102, 3],
      [-0.00908, 2],
      [-0.0011, 3],
      [-0.0018, 3],
      [-0.00117, 3],
      [-0.00133, 3],
      [-0.00432, 0],
      [-0.00134, 3],
      [-0.00153, 3],
      [-0.00108, 3],
      [-0.00414, 0],
      [-0.00417, 0],
      [0.00985, 1],
      [-0.00109, 3],
      [-0.0098, 2],
      [-0.00134, 3]
    ],
    "red_o_points": [],
    "y_categories": ["N", "NOT APPLICABLE", "Y", "nan"],
    "blue_o_points": [],
    "blue_x_points": [
      [0.01382, 1],
      [-0.0001, 3],
      [0.01239, 1],
      [0.0009, 0],
      [-0.00122, 0],
      [0.01234, 1],
      [-0.00055, 3],
      [0.0124, 1],
      [-0.00055, 3],
      [0.00023, 3]
    ]
  },
  "QS_mulBpsurgeryType[Lysis]": {
    "red_x_points": [
      [-0.00188, 3],
      [-0.00531, 0],
      [-0.014, 2],
      [-0.00578, 0],
      [-0.0016, 3],
      [-0.0059, 0],
      [-0.01405, 2],
      [-0.00489, 0],
      [-0.00242, 3],
      [-0.00576, 0],
      [-0.00586, 0],
      [-0.00389, 0],
      [-0.0018, 3],
      [0.01315, 1],
      [-0.00222, 3],
      [-0.00592, 0],
      [-0.00164, 3],
      [-0.01305, 2],
      [-0.00221, 3],
      [-0.00239, 3],
      [-0.00183, 3],
      [-0.00206, 3],
      [-0.00521, 0],
      [-0.00193, 3],
      [-0.00269, 3],
      [-0.00126, 3],
      [-0.00533, 0],
      [-0.0049, 0],
      [0.01355, 1],
      [-0.00168, 3],
      [-0.01398, 2],
      [-0.00189, 3]
    ],
    "red_o_points": [],
    "y_categories": ["N", "NOT APPLICABLE", "Y", "nan"],
    "blue_o_points": [],
    "blue_x_points": [
      [0.02022, 1],
      [-0.00039, 3],
      [0.01678, 1],
      [0.00178, 0],
      [0.00039, 0],
      [0.01674, 1],
      [-0.00068, 3],
      [0.01681, 1],
      [-0.00096, 3],
      [-0.00023, 3]
    ]
  },
  "QS_mulBpsurgeryType[Transf]": {
    "red_x_points": [
      [-5e-5, 3],
      [-0.00025, 2],
      [-0.00267, 0],
      [-0.00033, 2],
      [-0.00011, 3],
      [-0.00033, 2],
      [-0.0003, 2],
      [-0.00031, 2],
      [-0.00029, 3],
      [-0.00027, 2],
      [-0.00028, 2],
      [-0.00037, 2],
      [-0.0001, 3],
      [0.00082, 1],
      [-0.00024, 3],
      [-0.00032, 2],
      [-0.00015, 3],
      [-0.00024, 2],
      [-0.00018, 3],
      [-0.00027, 3],
      [-0.00017, 3],
      [-0.00017, 3],
      [-0.00035, 2],
      [-0.0002, 3],
      [-0.00016, 3],
      [-0.00011, 3],
      [-0.00012, 2],
      [-0.00028, 2],
      [0.00082, 1],
      [-0.00018, 3],
      [-0.00027, 2],
      [-0.00017, 3]
    ],
    "red_o_points": [],
    "y_categories": ["N", "NOT APPLICABLE", "Y", "nan"],
    "blue_o_points": [],
    "blue_x_points": [
      [0.00125, 1],
      [-0.0001, 3],
      [0.00103, 1],
      [0.00052, 2],
      [0.0001, 2],
      [0.0011, 1],
      [-0.00012, 3],
      [0.00097, 1],
      [-0.00018, 3],
      [-6e-5, 3]
    ]
  },
  "QS_equBpsurgTime": {
    "red_x_points": [
      [0.00067, 3],
      [-0.00709, 0],
      [0.00656, 2],
      [-0.00688, 0],
      [0.0007, 3],
      [-0.01235, 0],
      [-0.0081, 1],
      [-0.00833, 1],
      [0.00077, 3],
      [-0.00963, 1],
      [-0.00982, 0],
      [0.00888, 2],
      [0.00075, 3],
      [0.00078, 3],
      [0.00061, 3],
      [-0.0082, 1],
      [0.00066, 3],
      [0.00515, 2],
      [0.00064, 3],
      [0.00063, 3],
      [0.00063, 3],
      [0.00084, 3],
      [-0.00697, 0],
      [0.00056, 3],
      [0.00077, 3],
      [0.00067, 3],
      [-0.00833, 0],
      [-0.00679, 0],
      [0.00066, 3],
      [0.00074, 3],
      [0.00551, 2],
      [0.00055, 3]
    ],
    "red_o_points": [],
    "y_categories": [
      "0 TO 6 MONTHS",
      "13 TO 24 MONTHS",
      "7 TO 12 MONTHS",
      "nan"
    ],
    "blue_o_points": [],
    "blue_x_points": [
      [0.00051, 3],
      [0.00072, 3],
      [0.00064, 3],
      [0.01383, 2],
      [0.01544, 2],
      [0.00045, 3],
      [0.00098, 3],
      [0.0006, 3],
      [0.00086, 3],
      [0.00069, 3]
    ]
  },
  "QA_lstPexPain[C5]": {
    "red_x_points": [
      [-0.00252, 1],
      [-0.006, 2],
      [-0.0064, 2],
      [-0.00599, 2],
      [-0.00261, 1],
      [-0.00123, 1],
      [-0.0012, 1],
      [-0.00148, 1],
      [-0.00307, 1],
      [-0.00151, 1],
      [-0.00147, 1],
      [-0.00116, 1],
      [-0.00265, 1],
      [-0.01832, 2],
      [-0.00708, 2],
      [-0.00634, 2],
      [-0.00726, 2],
      [-0.00568, 2],
      [-0.00717, 2],
      [-0.00238, 1],
      [-0.00228, 1],
      [-0.00246, 1],
      [-0.00675, 2],
      [-0.0079, 2],
      [-0.00258, 1],
      [-0.0083, 2],
      [-0.00595, 2],
      [-0.00586, 2],
      [-0.00461, 1],
      [-0.00433, 1],
      [-0.00116, 1],
      [-0.00242, 1]
    ],
    "red_o_points": [],
    "y_categories": ["NORM", "NPV", "nan"],
    "blue_o_points": [],
    "blue_x_points": [
      [0.02669, 0],
      [-0.00416, 2],
      [6e-5, 1],
      [-0.00056, 1],
      [-0.00078, 1],
      [4e-5, 1],
      [-0.00118, 1],
      [0.02392, 0],
      [-0.00125, 1],
      [0.0457, 0]
    ]
  },
  "QA_yonInjFracture": {
    "red_x_points": [
      [-0.01098, 0],
      [-0.00082, 2],
      [0.00062, 0],
      [-0.00146, 1],
      [-0.00974, 0],
      [0.0005, 0],
      [0.00094, 0],
      [-0.00354, 1],
      [0.00735, 2],
      [0.00091, 0],
      [-0.00294, 1],
      [-0.00652, 1],
      [-0.01157, 0],
      [-0.00078, 0],
      [0.00629, 1],
      [-0.00241, 1],
      [-0.01147, 0],
      [-0.00198, 1],
      [-0.01312, 0],
      [-0.01287, 0],
      [0.00671, 1],
      [-0.01257, 0],
      [-0.00135, 1],
      [-0.01106, 0],
      [-0.01249, 0],
      [-0.01253, 0],
      [0.00107, 0],
      [0.00049, 0],
      [-0.01049, 1],
      [0.00627, 2],
      [-0.00263, 1],
      [0.00589, 1]
    ],
    "red_o_points": [],
    "y_categories": ["N", "Y", "nan"],
    "blue_o_points": [],
    "blue_x_points": [
      [0.00242, 0],
      [0.0146, 1],
      [0.00144, 0],
      [0.00522, 0],
      [0.00425, 0],
      [0.0016, 1],
      [0.014, 2],
      [0.00142, 0],
      [0.01607, 1],
      [0.01197, 2]
    ]
  },
  "QS_mulGraftNerve[Ac]": {
    "red_x_points": [
      [-8e-5, 2],
      [-0.00023, 0],
      [-0.00017, 0],
      [-0.00025, 0],
      [-8e-5, 2],
      [-0.00038, 0],
      [-0.00013, 0],
      [-0.00028, 0],
      [1e-5, 2],
      [-0.00038, 0],
      [-0.00038, 0],
      [-0.00033, 0],
      [-3e-5, 2],
      [0.00027, 1],
      [-9e-5, 2],
      [-0.00039, 0],
      [-6e-5, 2],
      [-0.00035, 0],
      [-8e-5, 2],
      [1e-5, 2],
      [-8e-5, 2],
      [-0.0, 2],
      [-0.00013, 0],
      [-4e-5, 2],
      [-0.0, 2],
      [-4e-5, 2],
      [-0.00037, 0],
      [-0.00025, 0],
      [0.00054, 1],
      [-5e-5, 2],
      [-0.00019, 0],
      [-7e-5, 2]
    ],
    "red_o_points": [],
    "y_categories": ["N", "NOT APPLICABLE", "nan"],
    "blue_o_points": [],
    "blue_x_points": [
      [0.00092, 1],
      [-0.0, 2],
      [0.00077, 1],
      [6e-5, 0],
      [-7e-5, 0],
      [0.00085, 1],
      [2e-5, 2],
      [0.00047, 1],
      [1e-5, 2],
      [-3e-5, 2]
    ]
  },
  "QA_lstPexMuscstrength[FingersAbdu]": {
    "red_x_points": [
      [0.00079, 2],
      [0.00014, 2],
      [-0.00363, 1],
      [-0.00189, 1],
      [-0.00039, 1],
      [0.00091, 0],
      [0.00049, 0],
      [-0.00298, 1],
      [-0.00702, 0],
      [0.00098, 0],
      [-0.00051, 2],
      [-0.00516, 1],
      [-0.00496, 0],
      [9e-5, 2],
      [0.00031, 2],
      [0.00017, 2],
      [-0.00295, 0],
      [-0.00023, 2],
      [0.0003, 2],
      [-0.00861, 0],
      [-3e-5, 1],
      [-0.00895, 0],
      [-0.00182, 1],
      [0.0003, 2],
      [0.00034, 2],
      [0.00055, 2],
      [-0.0042, 1],
      [-0.00211, 1],
      [9e-5, 2],
      [-0.00054, 1],
      [-0.00261, 1],
      [0.0002, 2]
    ],
    "red_o_points": [],
    "y_categories": ["GREATER THAN OR EQUALS TO 3", "LESS THAN 3", "nan"],
    "blue_o_points": [],
    "blue_x_points": [
      [6e-5, 2],
      [0.00051, 2],
      [0.00077, 0],
      [0.00338, 2],
      [0.00629, 0],
      [0.0008, 0],
      [0.01307, 1],
      [0.00062, 0],
      [0.00319, 2],
      [0.00352, 2]
    ]
  },
  "QS_mulNeuromadSite[C8]": {
    "red_x_points": [
      [-0.0002, 2],
      [-0.00269, 0],
      [-0.00181, 0],
      [-0.00234, 0],
      [-0.00018, 2],
      [-0.00285, 0],
      [-0.00156, 0],
      [-0.00203, 0],
      [-0.00039, 2],
      [-0.00242, 0],
      [-0.00272, 0],
      [-0.00214, 0],
      [-0.00042, 2],
      [0.00244, 1],
      [-0.00033, 2],
      [-0.00284, 0],
      [-0.00051, 2],
      [-0.00195, 0],
      [-0.00089, 2],
      [-0.00066, 2],
      [-0.00015, 2],
      [-0.00035, 2],
      [-0.00202, 0],
      [-0.00014, 2],
      [-0.00236, 2],
      [-0.00037, 2],
      [-0.00209, 0],
      [-0.00164, 0],
      [0.00337, 1],
      [-6e-5, 2],
      [-0.00151, 0],
      [-0.00045, 2]
    ],
    "red_o_points": [],
    "y_categories": ["N", "NOT APPLICABLE", "nan"],
    "blue_o_points": [],
    "blue_x_points": [
      [0.00647, 1],
      [1e-5, 2],
      [0.00451, 1],
      [0.00125, 0],
      [-0.00035, 0],
      [0.00436, 1],
      [-0.00014, 2],
      [0.00423, 1],
      [-0.0001, 2],
      [0.0004, 2]
    ]
  },
  "QS_mulGraftNerve[Ph]": {
    "red_x_points": [
      [-7e-5, 2],
      [-0.00018, 0],
      [-0.00018, 0],
      [-0.0002, 0],
      [-1e-5, 2],
      [-0.00028, 0],
      [-0.00014, 0],
      [-0.00014, 0],
      [-9e-5, 2],
      [-0.0001, 0],
      [-0.00032, 0],
      [-9e-5, 0],
      [1e-5, 2],
      [0.00018, 1],
      [-3e-5, 2],
      [-0.0001, 0],
      [-4e-5, 2],
      [-0.00012, 0],
      [-6e-5, 2],
      [-9e-5, 2],
      [-0.0, 2],
      [-1e-5, 2],
      [-0.00012, 0],
      [-2e-5, 2],
      [-9e-5, 2],
      [-9e-5, 2],
      [-0.00013, 0],
      [-9e-5, 0],
      [0.00028, 1],
      [-1e-5, 2],
      [-0.00014, 0],
      [-2e-5, 2]
    ],
    "red_o_points": [],
    "y_categories": ["N", "NOT APPLICABLE", "nan"],
    "blue_o_points": [],
    "blue_x_points": [
      [0.00064, 1],
      [-1e-5, 2],
      [0.00031, 1],
      [-4e-5, 0],
      [4e-5, 0],
      [0.00037, 1],
      [2e-5, 2],
      [0.00054, 1],
      [-9e-5, 2],
      [1e-5, 2]
    ]
  },
  "QS_mulTransfSite[AcSsPA]": {
    "red_x_points": [
      [-0.00032, 3],
      [-0.00144, 0],
      [-0.00154, 0],
      [-0.00139, 0],
      [-0.00044, 3],
      [-0.00161, 0],
      [-0.0013, 0],
      [-0.00155, 0],
      [-0.00034, 3],
      [-0.00137, 0],
      [-0.00153, 0],
      [-0.00138, 0],
      [-0.00036, 3],
      [0.00332, 1],
      [-0.00036, 3],
      [-0.00104, 0],
      [-0.00048, 3],
      [-0.0035, 2],
      [-0.0005, 3],
      [-0.00039, 3],
      [-0.00029, 3],
      [-0.00038, 3],
      [-0.00149, 0],
      [-0.00049, 3],
      [-0.00027, 3],
      [-0.00035, 3],
      [-0.00134, 0],
      [-0.0014, 0],
      [0.00319, 1],
      [-0.00036, 3],
      [-0.00132, 0],
      [-0.00055, 3]
    ],
    "red_o_points": [],
    "y_categories": ["N", "NOT APPLICABLE", "Y", "nan"],
    "blue_o_points": [],
    "blue_x_points": [
      [0.00404, 1],
      [-5e-5, 3],
      [0.0037, 1],
      [-0.00051, 0],
      [-0.0007, 0],
      [0.00381, 1],
      [-0.00024, 3],
      [0.00358, 1],
      [-2e-5, 3],
      [-0.00019, 3]
    ]
  },
  "participant_code": {
    "red_x_points": [
      [-0.02699, 1],
      [-0.02582, 2],
      [-0.02682, 3],
      [-0.02635, 4],
      [-0.0267, 5],
      [-0.02635, 6],
      [-0.02647, 7],
      [-0.02611, 8],
      [-0.02711, 9],
      [-0.02729, 10],
      [-0.0267, 11],
      [-0.02717, 12],
      [-0.02658, 13],
      [-0.02564, 15],
      [-0.02605, 17],
      [-0.02688, 18],
      [-0.02682, 20],
      [-0.02505, 21],
      [-0.02588, 22],
      [-0.02541, 24],
      [-0.02635, 26],
      [-0.02594, 27],
      [-0.02623, 28],
      [-0.02564, 30],
      [-0.02723, 31],
      [-0.02741, 32],
      [-0.02682, 34],
      [-0.02629, 36],
      [-0.02641, 38],
      [-0.02523, 39],
      [-0.02705, 40],
      [-0.0267, 41]
    ],
    "red_o_points": [],
    "y_categories": [
      "P16554",
      "P18297",
      "P19283",
      "P19287",
      "P23391",
      "P30595",
      "P31645",
      "P31691",
      "P34778",
      "P35046",
      "P36328",
      "P43633",
      "P4544",
      "P46417",
      "P48965",
      "P53068",
      "P5497",
      "P59529",
      "P62483",
      "P64658",
      "P65202",
      "P66816",
      "P6751",
      "P7408",
      "P75566",
      "P76226",
      "P79971",
      "P82621",
      "P82990",
      "P84549",
      "P84932",
      "P85825",
      "P86989",
      "P8770",
      "P87791",
      "P90550",
      "P93159",
      "P94969",
      "P96710",
      "P97130",
      "P9744",
      "P98500",
      "nan"
    ],
    "blue_o_points": [],
    "blue_x_points": [
      [0.05618, 0],
      [0.05674, 14],
      [0.05378, 16],
      [0.0542, 19],
      [0.05166, 23],
      [0.05378, 25],
      [0.05688, 29],
      [0.05448, 33],
      [0.05575, 35],
      [0.05589, 37]
    ]
  },
  "QA_lstPexTouch[T1]": {
    "red_x_points": [
      [-0.00911, 1],
      [-0.00208, 2],
      [0.00207, 1],
      [-0.00237, 2],
      [-0.0094, 1],
      [-0.00807, 0],
      [0.00131, 1],
      [0.00164, 1],
      [-0.01083, 1],
      [-0.00577, 0],
      [-0.00436, 0],
      [-0.00741, 0],
      [0.00651, 0],
      [-0.00868, 2],
      [-0.00375, 2],
      [-0.00351, 2],
      [-0.00957, 1],
      [-0.00172, 2],
      [-0.00395, 2],
      [0.00649, 0],
      [-0.01025, 1],
      [0.00692, 0],
      [-0.00316, 2],
      [-0.00415, 2],
      [-0.0094, 1],
      [0.00711, 0],
      [0.00362, 1],
      [-0.0024, 2],
      [-0.00173, 1],
      [-0.00422, 2],
      [0.00034, 1],
      [-0.00996, 1]
    ],
    "red_o_points": [],
    "y_categories": ["NORM", "NPV", "nan"],
    "blue_o_points": [],
    "blue_x_points": [
      [0.00056, 1],
      [0.00054, 2],
      [0.00111, 1],
      [0.00716, 1],
      [0.01089, 1],
      [0.00062, 1],
      [0.01193, 0],
      [0.00447, 0],
      [0.01145, 0],
      [0.01251, 0]
    ]
  },
  "QA_mulInjOrthesisType[ArmSling]": {
    "red_x_points": [
      [-0.00606, 2],
      [-0.00599, 2],
      [-0.00568, 2],
      [-0.00586, 2],
      [-0.00523, 2],
      [-0.00632, 2],
      [-0.00638, 2],
      [-0.00583, 2],
      [-0.00503, 2],
      [-0.00659, 2],
      [-0.00634, 2],
      [-0.00623, 2],
      [-0.00603, 2],
      [0.01112, 1],
      [-0.00771, 2],
      [-0.00639, 2],
      [-0.0067, 2],
      [-0.01136, 0],
      [0.01127, 1],
      [-0.00532, 2],
      [-0.00616, 2],
      [-0.01494, 0],
      [-0.0033, 3],
      [-0.00847, 2],
      [0.0068, 1],
      [-0.0059, 2],
      [-0.00598, 2],
      [-0.00539, 2],
      [-0.0139, 3],
      [-0.00161, 3],
      [-0.00559, 2],
      [-0.00617, 2]
    ],
    "red_o_points": [],
    "y_categories": ["N", "NOT APPLICABLE", "Y", "nan"],
    "blue_o_points": [],
    "blue_x_points": [
      [0.0034, 2],
      [0.02117, 1],
      [0.01365, 1],
      [0.03446, 1],
      [-0.00442, 2],
      [0.0162, 1],
      [-0.00187, 2],
      [0.01234, 1],
      [-0.00295, 2],
      [0.01155, 3]
    ]
  },
  "QS_mulGraftNerve[Ul]": {
    "red_x_points": [
      [1e-5, 2],
      [-0.00015, 0],
      [-2e-5, 0],
      [-2e-5, 0],
      [1e-5, 2],
      [-3e-5, 0],
      [-3e-5, 0],
      [-2e-5, 0],
      [0.0, 2],
      [-3e-5, 0],
      [-3e-5, 0],
      [0.0, 2],
      [-2e-5, 0],
      [-1e-5, 2],
      [-0.00013, 0],
      [-1e-5, 2],
      [-1e-5, 2],
      [1e-5, 2],
      [-3e-5, 0],
      [-2e-5, 0],
      [1e-5, 2]
    ],
    "red_o_points": [],
    "y_categories": ["N", "NOT APPLICABLE", "nan"],
    "blue_o_points": [],
    "blue_x_points": [
      [0.00023, 1],
      [7e-5, 2],
      [0.00013, 1],
      [-3e-5, 0],
      [0.0, 2],
      [1e-5, 2],
      [7e-5, 2]
    ]
  },
  "QA_mulInjOrthesisType[ShoulderSupport]": {
    "red_x_points": [
      [-0.00606, 0],
      [-0.00585, 0],
      [-0.00607, 0],
      [-0.00638, 0],
      [-0.00628, 0],
      [-0.0063, 0],
      [-0.00591, 0],
      [-0.00608, 0],
      [-0.01904, 2],
      [-0.00674, 0],
      [-0.00572, 0],
      [-0.00615, 0],
      [-0.00624, 0],
      [0.01252, 1],
      [-0.00754, 0],
      [-0.00645, 0],
      [-0.00694, 0],
      [-0.01176, 2],
      [0.01398, 1],
      [-0.00546, 0],
      [-0.00627, 0],
      [-0.01883, 2],
      [-0.0029, 3],
      [-0.00759, 0],
      [0.00991, 1],
      [-0.0069, 0],
      [-0.00633, 0],
      [-0.00541, 0],
      [-0.01301, 3],
      [-0.00172, 3],
      [-0.00554, 0],
      [-0.00676, 0]
    ],
    "red_o_points": [],
    "y_categories": ["N", "NOT APPLICABLE", "Y", "nan"],
    "blue_o_points": [],
    "blue_x_points": [
      [0.00263, 0],
      [0.02035, 1],
      [0.01698, 1],
      [0.03017, 1],
      [-0.00341, 0],
      [0.0176, 1],
      [-0.00196, 0],
      [0.01601, 1],
      [-0.00273, 0],
      [0.01356, 3]
    ]
  },
  "QA_yonInjUnconscio": {
    "red_x_points": [
      [-0.00704, 1],
      [-0.0072, 1],
      [-0.00409, 2],
      [-0.00382, 2],
      [-0.00446, 2],
      [0.0192, 0],
      [-0.00811, 1],
      [-0.00437, 2],
      [-0.00461, 2],
      [-0.00548, 2],
      [-0.00508, 2],
      [-0.01079, 1],
      [-0.00719, 1],
      [-0.02144, 1],
      [-0.00671, 2],
      [-0.0044, 2],
      [-0.00522, 2],
      [-0.00706, 1],
      [0.00531, 0],
      [-0.00831, 1],
      [-0.00703, 1],
      [-0.00738, 1],
      [-0.00733, 1],
      [-0.00693, 2],
      [-0.00748, 1],
      [-0.00623, 2],
      [-0.00853, 1],
      [-0.00694, 1],
      [-0.00187, 2],
      [-0.00522, 2],
      [-0.00787, 1],
      [-0.00589, 2]
    ],
    "red_o_points": [],
    "y_categories": ["N", "Y", "nan"],
    "blue_o_points": [],
    "blue_x_points": [
      [0.00036, 2],
      [0.00942, 1],
      [0.01911, 0],
      [0.02998, 0],
      [0.02581, 0],
      [0.00097, 2],
      [-0.00184, 1],
      [0.00083, 2],
      [0.03088, 0],
      [-0.00125, 2]
    ]
  },
  "QS_mulTransfSite[Other]": {
    "red_x_points": [
      [-0.00217, 3],
      [-0.013, 0],
      [-0.01367, 0],
      [-0.0135, 0],
      [-0.00243, 3],
      [-0.01415, 0],
      [-0.01382, 0],
      [-0.01395, 0],
      [-0.00249, 3],
      [-0.01441, 0],
      [-0.01408, 0],
      [-0.01354, 0],
      [-0.00251, 3],
      [0.02116, 1],
      [-0.00222, 3],
      [-0.01412, 0],
      [-0.0025, 3],
      [-0.01329, 0],
      [-0.00245, 3],
      [-0.00235, 3],
      [-0.00212, 3],
      [-0.00235, 3],
      [-0.01275, 0],
      [-0.00246, 3],
      [-0.00283, 3],
      [-0.00207, 3],
      [-0.0134, 0],
      [-0.01288, 0],
      [0.0207, 1],
      [-0.00251, 3],
      [-0.01319, 0],
      [-0.00253, 3]
    ],
    "red_o_points": [],
    "y_categories": ["N", "NOT APPLICABLE", "Y", "nan"],
    "blue_o_points": [],
    "blue_x_points": [
      [0.02423, 1],
      [-0.00094, 3],
      [0.02118, 1],
      [-0.00692, 0],
      [0.04652, 2],
      [0.02191, 1],
      [-0.00072, 3],
      [0.02193, 1],
      [-0.00096, 3],
      [-0.00099, 3]
    ]
  },
  "QA_lstInjTpbiSide": {
    "red_x_points": [
      [-0.00296, 1],
      [0.00056, 0],
      [-0.00017, 0],
      [6e-5, 0],
      [-0.00033, 0],
      [-0.00118, 1],
      [-0.00149, 0],
      [-0.00182, 0],
      [-0.00352, 1],
      [-0.00132, 0],
      [-0.00169, 1],
      [-0.0011, 1],
      [-0.0033, 1],
      [-0.01395, 0],
      [-0.00742, 1],
      [-0.00205, 1],
      [0.0008, 0],
      [-0.00215, 1],
      [-0.00783, 1],
      [-0.0, 0],
      [0.00064, 0],
      [-0.00066, 0],
      [0.0002, 0],
      [0.00258, 0],
      [-0.00552, 1],
      [-0.00525, 1],
      [-0.0006, 1],
      [-0.00055, 1],
      [-0.01415, 0],
      [-0.00479, 1],
      [-0.00011, 0],
      [0.00144, 0]
    ],
    "red_o_points": [],
    "y_categories": ["L", "R", "nan"],
    "blue_o_points": [],
    "blue_x_points": [
      [-0.0053, 0],
      [0.00799, 0],
      [0.00835, 1],
      [0.00372, 0],
      [0.00275, 1],
      [0.00965, 1],
      [0.00267, 1],
      [0.00714, 1],
      [0.00484, 0],
      [0.00653, 0]
    ]
  },
  "QS_mulGraftNerve[Me]": {
    "red_x_points": [
      [-3e-5, 2],
      [-4e-5, 0],
      [-3e-5, 2],
      [-4e-5, 0],
      [-4e-5, 0],
      [-3e-5, 2],
      [-4e-5, 0],
      [-4e-5, 0],
      [-4e-5, 0],
      [-3e-5, 2],
      [0.0001, 1],
      [-4e-5, 0],
      [-3e-5, 2],
      [-4e-5, 0],
      [-3e-5, 2],
      [-3e-5, 2],
      [-3e-5, 2],
      [-3e-5, 2],
      [-4e-5, 0],
      [-4e-5, 0],
      [0.0001, 1],
      [-3e-5, 2],
      [-4e-5, 0],
      [-3e-5, 2]
    ],
    "red_o_points": [],
    "y_categories": ["N", "NOT APPLICABLE", "nan"],
    "blue_o_points": [],
    "blue_x_points": [
      [0.0001, 1],
      [-3e-5, 2],
      [0.0001, 1],
      [-4e-5, 0],
      [0.0001, 1],
      [0.0001, 1],
      [-3e-5, 2]
    ]
  },
  "QS_mulGraftNerve[MC]": {
    "red_x_points": [
      [-1e-5, 2],
      [-6e-5, 0],
      [-1e-5, 2],
      [-6e-5, 0],
      [-6e-5, 0],
      [-6e-5, 0],
      [-6e-5, 0],
      [-1e-5, 2],
      [9e-5, 1],
      [-1e-5, 2],
      [-6e-5, 0],
      [-1e-5, 2],
      [-1e-5, 2],
      [-1e-5, 2],
      [-6e-5, 0],
      [-1e-5, 2],
      [-1e-5, 2],
      [-1e-5, 2],
      [-6e-5, 0],
      [-6e-5, 0],
      [9e-5, 1],
      [-1e-5, 2],
      [-6e-5, 0],
      [-1e-5, 2]
    ],
    "red_o_points": [],
    "y_categories": ["N", "NOT APPLICABLE", "nan"],
    "blue_o_points": [],
    "blue_x_points": [[9e-5, 1], [9e-5, 1], [9e-5, 1], [-1e-5, 2], [-1e-5, 2]]
  },
  "QS_mulLysisSite[Trunk]": {
    "red_x_points": [
      [-0.00106, 3],
      [-0.00298, 0],
      [-0.00309, 0],
      [-0.0032, 0],
      [-0.00084, 3],
      [-0.00348, 0],
      [-0.00822, 2],
      [-0.00296, 0],
      [-0.00148, 3],
      [-0.00344, 0],
      [-0.00346, 0],
      [-0.00336, 0],
      [-0.00112, 3],
      [0.00615, 1],
      [-0.00108, 3],
      [-0.00369, 0],
      [-0.0011, 3],
      [-0.00633, 2],
      [-0.00124, 3],
      [-0.0015, 3],
      [-0.00094, 3],
      [-0.00108, 3],
      [-0.00296, 0],
      [-0.0011, 3],
      [-0.0013, 3],
      [-0.00085, 3],
      [-0.00303, 0],
      [-0.00303, 0],
      [0.00717, 1],
      [-0.00105, 3],
      [-0.0074, 2],
      [-0.00096, 3]
    ],
    "red_o_points": [],
    "y_categories": ["N", "NOT APPLICABLE", "Y", "nan"],
    "blue_o_points": [],
    "blue_x_points": [
      [0.01126, 1],
      [-0.00015, 3],
      [0.00955, 1],
      [0.00036, 0],
      [-0.0009, 0],
      [0.00966, 1],
      [-0.00048, 3],
      [0.00916, 1],
      [-0.00051, 3],
      [-0.0002, 3]
    ]
  },
  "QS_mulGraftTrunk[UpperTrunk]": {
    "red_x_points": [
      [-0.00013, 3],
      [-0.00122, 0],
      [-0.00123, 0],
      [-0.00142, 0],
      [-0.00018, 3],
      [-0.0012, 0],
      [-0.00134, 0],
      [-0.00125, 0],
      [-0.00015, 3],
      [-0.00146, 0],
      [-0.00119, 0],
      [-0.00149, 0],
      [-0.00027, 3],
      [0.00226, 1],
      [-0.00027, 3],
      [-0.00379, 2],
      [-0.00024, 3],
      [-0.00087, 0],
      [-0.00016, 3],
      [-0.00019, 3],
      [-0.0001, 3],
      [-0.00031, 3],
      [-0.00102, 0],
      [-0.00028, 3],
      [-0.00014, 3],
      [-0.0002, 3],
      [-0.00129, 0],
      [-0.00123, 0],
      [0.00242, 1],
      [-0.00017, 3],
      [-0.00117, 0],
      [-0.00028, 3]
    ],
    "red_o_points": [],
    "y_categories": ["N", "NOT APPLICABLE", "Y", "nan"],
    "blue_o_points": [],
    "blue_x_points": [
      [0.00365, 1],
      [2e-5, 3],
      [0.00282, 1],
      [0.00046, 0],
      [-0.00061, 0],
      [0.00275, 1],
      [0.0, 3],
      [0.0032, 1],
      [-4e-5, 3],
      [-0.00012, 3]
    ]
  },
  "QS_mulTransfSite[PhMc]": {
    "red_x_points": [
      [-0.00088, 3],
      [-0.00281, 0],
      [-0.00264, 0],
      [-0.00326, 0],
      [-0.00098, 3],
      [-0.00283, 0],
      [-0.00253, 0],
      [-0.00815, 2],
      [-0.0012, 3],
      [-0.00287, 0],
      [-0.0039, 0],
      [-0.00311, 0],
      [-0.00089, 3],
      [0.00684, 1],
      [-0.00094, 3],
      [-0.00314, 0],
      [-0.00089, 3],
      [-0.00303, 0],
      [-0.00116, 3],
      [-0.0009, 3],
      [-0.001, 3],
      [-0.00106, 3],
      [-0.00584, 2],
      [-0.00094, 3],
      [-0.00158, 3],
      [-0.0011, 3],
      [-0.00283, 0],
      [-0.00259, 0],
      [0.00689, 1],
      [-0.00097, 3],
      [-0.002, 0],
      [-0.00123, 3]
    ],
    "red_o_points": [],
    "y_categories": ["N", "NOT APPLICABLE", "Y", "nan"],
    "blue_o_points": [],
    "blue_x_points": [
      [0.00974, 1],
      [-0.00021, 3],
      [0.00745, 1],
      [-0.0001, 0],
      [-0.00125, 0],
      [0.00804, 1],
      [-0.00048, 3],
      [0.00895, 1],
      [-0.0004, 3],
      [0.0001, 3]
    ]
  },
  "QA_mulInjTbpiCause[Motorcycle]": {
    "red_x_points": [
      [-0.00221, 0],
      [-0.00033, 1],
      [-0.00062, 1],
      [-0.00058, 1],
      [-0.00023, 1],
      [-0.00047, 1],
      [-0.00021, 1],
      [-0.0005, 1],
      [0.00041, 1],
      [-0.00039, 1],
      [-0.00051, 1],
      [-0.00027, 1],
      [-0.00557, 0],
      [-0.03805, 1],
      [-0.0005, 1],
      [-0.00077, 1],
      [-0.00028, 1],
      [-0.00047, 1],
      [-0.00113, 1],
      [-0.01103, 0],
      [0.00013, 1],
      [0.00191, 1],
      [-0.00025, 1],
      [-0.0004, 1],
      [-0.00025, 1],
      [-0.00681, 0],
      [-0.00028, 1],
      [-0.0002, 1],
      [-0.04112, 1],
      [4e-5, 1],
      [-0.00026, 1],
      [-0.00044, 1]
    ],
    "red_o_points": [],
    "y_categories": ["N", "Y", "nan"],
    "blue_o_points": [],
    "blue_x_points": [
      [0.01684, 0],
      [-0.00031, 1],
      [0.0151, 0],
      [-0.00134, 1],
      [-0.00022, 1],
      [0.01658, 0],
      [0.00338, 1],
      [0.01537, 0],
      [0.00455, 1],
      [0.00305, 1]
    ]
  },
  "QS_mulLysisRoot[C6]": {
    "red_x_points": [
      [-0.00054, 3],
      [-0.00229, 0],
      [-0.00438, 2],
      [-0.00223, 0],
      [-0.00053, 3],
      [-0.00194, 0],
      [-0.00184, 0],
      [-0.00194, 0],
      [-0.00073, 3],
      [-0.00178, 0],
      [-0.00207, 0],
      [-0.00179, 0],
      [-0.00059, 3],
      [0.00469, 1],
      [-0.0006, 3],
      [-0.00223, 0],
      [-0.00089, 3],
      [-0.00192, 0],
      [-0.00081, 3],
      [-0.00061, 3],
      [-0.00051, 3],
      [-0.00065, 3],
      [-0.00204, 0],
      [-0.00063, 3],
      [-0.00107, 3],
      [-0.00064, 3],
      [-0.00202, 0],
      [-0.00197, 0],
      [0.00422, 1],
      [-0.00054, 3],
      [-0.005, 2],
      [-0.00059, 3]
    ],
    "red_o_points": [],
    "y_categories": ["N", "NOT APPLICABLE", "Y", "nan"],
    "blue_o_points": [],
    "blue_x_points": [
      [0.00619, 1],
      [-0.00023, 3],
      [0.00564, 1],
      [-0.00019, 0],
      [-0.00062, 0],
      [0.00545, 1],
      [-0.00022, 3],
      [0.00494, 1],
      [-0.00019, 3],
      [-0.00015, 3]
    ]
  },
  "QS_mulGraftLevel[Trunk]": {
    "red_x_points": [
      [-0.00034, 3],
      [-0.00101, 0],
      [-0.00102, 0],
      [-0.00129, 0],
      [-0.00015, 3],
      [-0.00107, 0],
      [-0.0012, 0],
      [-0.00127, 0],
      [-0.00026, 3],
      [-0.00123, 0],
      [-0.00118, 0],
      [-0.00098, 0],
      [-0.00028, 3],
      [0.00205, 1],
      [-0.00022, 3],
      [-0.00399, 2],
      [-0.00021, 3],
      [-0.00097, 0],
      [-0.00016, 3],
      [-0.00022, 3],
      [-0.00015, 3],
      [-0.00019, 3],
      [-0.00113, 0],
      [-0.00023, 3],
      [-0.00019, 3],
      [-0.00024, 3],
      [-0.00114, 0],
      [-0.00097, 0],
      [0.0031, 1],
      [-0.00022, 3],
      [-0.00099, 0],
      [-0.00021, 3]
    ],
    "red_o_points": [],
    "y_categories": ["N", "NOT APPLICABLE", "Y", "nan"],
    "blue_o_points": [],
    "blue_x_points": [
      [0.00398, 1],
      [-8e-5, 3],
      [0.00314, 1],
      [-8e-5, 0],
      [-0.00077, 0],
      [0.0026, 1],
      [-6e-5, 3],
      [0.00248, 1],
      [-8e-5, 3],
      [-0.0002, 3]
    ]
  },
  "QS_mulGraftNerve[other]": {
    "red_x_points": [
      [-3e-5, 2],
      [-0.00014, 0],
      [-4e-5, 0],
      [-0.00023, 0],
      [-1e-5, 2],
      [-0.00018, 0],
      [-0.00014, 0],
      [-0.0001, 0],
      [1e-5, 2],
      [-0.00018, 0],
      [-0.00014, 0],
      [-0.00014, 0],
      [-3e-5, 2],
      [0.00012, 1],
      [3e-5, 2],
      [-0.00019, 0],
      [-0.00016, 2],
      [-0.00019, 0],
      [1e-5, 2],
      [1e-5, 2],
      [-3e-5, 2],
      [1e-5, 2],
      [-0.00015, 0],
      [9e-5, 2],
      [3e-5, 2],
      [-1e-5, 2],
      [-8e-5, 0],
      [-0.00019, 0],
      [0.0003, 1],
      [-5e-5, 2],
      [-0.0001, 0],
      [1e-5, 2]
    ],
    "red_o_points": [],
    "y_categories": ["N", "NOT APPLICABLE", "nan"],
    "blue_o_points": [],
    "blue_x_points": [
      [0.0004, 1],
      [0.00012, 2],
      [0.0002, 1],
      [-4e-5, 0],
      [-4e-5, 0],
      [0.00031, 1],
      [3e-5, 2],
      [0.00019, 1],
      [-2e-5, 2],
      [1e-5, 2]
    ]
  },
  "QS_mulTransfSite[AcSsAA]": {
    "red_x_points": [
      [-0.00204, 3],
      [-0.01623, 2],
      [-0.00455, 0],
      [-0.01634, 2],
      [-0.00203, 3],
      [-0.02109, 2],
      [-0.00365, 0],
      [-0.00444, 0],
      [-0.0023, 3],
      [-0.00427, 0],
      [-0.01726, 2],
      [-0.00402, 0],
      [-0.00212, 3],
      [0.01838, 1],
      [-0.00235, 3],
      [-0.01628, 2],
      [-0.00241, 3],
      [-0.00402, 0],
      [-0.00273, 3],
      [-0.00245, 3],
      [-0.00183, 3],
      [-0.00221, 3],
      [-0.01556, 2],
      [-0.00213, 3],
      [-0.00338, 3],
      [-0.00217, 3],
      [-0.00458, 0],
      [-0.01533, 2],
      [0.02072, 1],
      [-0.00155, 3],
      [-0.00427, 0],
      [-0.00238, 3]
    ],
    "red_o_points": [],
    "y_categories": ["N", "NOT APPLICABLE", "Y", "nan"],
    "blue_o_points": [],
    "blue_x_points": [
      [0.02519, 1],
      [-0.00087, 3],
      [0.02031, 1],
      [0.00119, 0],
      [0.00087, 0],
      [0.02158, 1],
      [-0.00079, 3],
      [0.02254, 1],
      [-0.0007, 3],
      [-0.00038, 3]
    ]
  },
  "QS_mulNeuromadSite[C5]": {
    "red_x_points": [
      [-4e-5, 2],
      [-0.00072, 0],
      [-0.00038, 0],
      [-0.00061, 0],
      [0.0, 2],
      [-0.00108, 0],
      [-0.00068, 0],
      [-0.00053, 0],
      [0.0, 2],
      [-0.00079, 0],
      [-0.00087, 0],
      [-0.00065, 0],
      [1e-5, 2],
      [0.00025, 1],
      [2e-5, 2],
      [-0.00064, 0],
      [0.00016, 2],
      [-0.00061, 0],
      [-5e-5, 2],
      [-1e-5, 2],
      [-1e-5, 2],
      [-0.0001, 2],
      [-0.00062, 0],
      [9e-5, 2],
      [-0.0002, 2],
      [3e-5, 2],
      [-0.00078, 0],
      [-0.00042, 0],
      [0.00044, 1],
      [-4e-5, 2],
      [-0.00042, 0],
      [-1e-5, 2]
    ],
    "red_o_points": [],
    "y_categories": ["N", "NOT APPLICABLE", "nan"],
    "blue_o_points": [],
    "blue_x_points": [
      [0.00168, 1],
      [0.00021, 2],
      [0.00135, 1],
      [0.0002, 0],
      [-0.00025, 0],
      [0.00147, 1],
      [8e-5, 2],
      [0.00138, 1],
      [3e-5, 2],
      [0.00014, 2]
    ]
  },
  "QS_mulNeuromadSite[C7]": {
    "red_x_points": [
      [-0.00017, 2],
      [-0.00091, 0],
      [-0.00048, 0],
      [-0.00059, 0],
      [-8e-5, 2],
      [-0.00084, 0],
      [-0.0006, 0],
      [-0.00059, 0],
      [-0.00027, 2],
      [-0.00082, 0],
      [-0.00068, 0],
      [-0.00048, 0],
      [-0.00029, 2],
      [0.00058, 1],
      [0.0, 2],
      [-0.0007, 0],
      [-0.00031, 2],
      [-0.00073, 0],
      [-0.0002, 2],
      [-0.00014, 2],
      [0.0, 2],
      [-7e-5, 2],
      [-0.00069, 0],
      [-0.00011, 2],
      [-0.00036, 2],
      [-4e-5, 2],
      [-0.00073, 0],
      [-0.00073, 0],
      [0.00109, 1],
      [-0.00012, 2],
      [-0.0005, 0],
      [-0.00016, 2]
    ],
    "red_o_points": [],
    "y_categories": ["N", "NOT APPLICABLE", "nan"],
    "blue_o_points": [],
    "blue_x_points": [
      [0.00172, 1],
      [0.00036, 2],
      [0.00155, 1],
      [0.0002, 0],
      [-0.00015, 0],
      [0.00154, 1],
      [0.0, 2],
      [0.00145, 1],
      [8e-5, 2],
      [0.00017, 2]
    ]
  },
  "QA_lstPexMuscstrength[WristExte]": {
    "red_x_points": [
      [0.00056, 1],
      [-0.00172, 2],
      [-0.00418, 1],
      [-0.00185, 1],
      [0.00084, 1],
      [0.00069, 0],
      [-0.00382, 1],
      [-0.00326, 1],
      [-0.01102, 0],
      [0.00281, 0],
      [0.00063, 0],
      [-0.00648, 1],
      [-0.00652, 0],
      [-0.00152, 2],
      [-0.00104, 2],
      [-0.00173, 2],
      [-0.0045, 0],
      [-0.00273, 2],
      [-0.00072, 2],
      [-0.0126, 0],
      [0.00164, 1],
      [-0.01307, 0],
      [-0.0019, 1],
      [-0.00125, 2],
      [-0.00881, 0],
      [0.00229, 1],
      [0.00206, 0],
      [0.00115, 0],
      [-0.00156, 2],
      [0.00091, 1],
      [-0.00373, 1],
      [-0.00039, 2]
    ],
    "red_o_points": [],
    "y_categories": ["GREATER THAN OR EQUALS TO 3", "LESS THAN 3", "nan"],
    "blue_o_points": [],
    "blue_x_points": [
      [0.00106, 0],
      [0.00145, 2],
      [0.00064, 0],
      [0.00835, 0],
      [0.00563, 0],
      [0.00056, 1],
      [0.01144, 1],
      [0.00048, 0],
      [0.01018, 1],
      [0.00945, 2]
    ]
  },
  "QS_mulGraftNerve[TD]": {
    "red_x_points": [
      [1e-5, 2],
      [-4e-5, 0],
      [-7e-5, 0],
      [-2e-5, 2],
      [-4e-5, 0],
      [-4e-5, 0],
      [-0.00011, 0],
      [1e-5, 2],
      [-0.00011, 0],
      [-0.00011, 0],
      [-4e-5, 0],
      [1e-5, 2],
      [6e-5, 1],
      [-2e-5, 2],
      [-7e-5, 0],
      [-2e-5, 2],
      [-4e-5, 0],
      [1e-5, 2],
      [1e-5, 2],
      [1e-5, 2],
      [-2e-5, 2],
      [-2e-5, 2],
      [-4e-5, 0],
      [0.00015, 1],
      [1e-5, 2],
      [-4e-5, 0],
      [-2e-5, 2]
    ],
    "red_o_points": [],
    "y_categories": ["N", "NOT APPLICABLE", "nan"],
    "blue_o_points": [],
    "blue_x_points": [
      [9e-5, 1],
      [1e-5, 2],
      [6e-5, 1],
      [-4e-5, 0],
      [9e-5, 1],
      [9e-5, 1],
      [-2e-5, 2]
    ]
  },
  "QS_mulLysisSite[Nerve]": {
    "red_x_points": [
      [-9e-5, 3],
      [-0.00048, 0],
      [-0.00316, 2],
      [-0.00053, 0],
      [-0.00018, 3],
      [-0.00064, 0],
      [-0.00063, 0],
      [-0.00054, 0],
      [-0.0003, 3],
      [-0.0005, 0],
      [-0.00036, 0],
      [-0.00035, 0],
      [-0.00023, 3],
      [0.0007, 1],
      [-0.00026, 3],
      [-0.00043, 0],
      [-0.00021, 3],
      [-0.00056, 0],
      [-0.00013, 3],
      [-0.00025, 3],
      [-0.00015, 3],
      [-0.00016, 3],
      [-0.00055, 0],
      [-0.00022, 3],
      [-0.00012, 3],
      [-0.00017, 3],
      [-0.00055, 0],
      [-0.00059, 0],
      [0.00136, 1],
      [-9e-5, 3],
      [-0.00053, 0],
      [-0.00019, 3]
    ],
    "red_o_points": [],
    "y_categories": ["N", "NOT APPLICABLE", "Y", "nan"],
    "blue_o_points": [],
    "blue_x_points": [
      [0.00261, 1],
      [-9e-5, 3],
      [0.00139, 1],
      [0.00031, 0],
      [0.00028, 0],
      [0.00147, 1],
      [-0.00013, 3],
      [0.00166, 1],
      [-8e-5, 3],
      [-2e-5, 3]
    ]
  },
  "QS_mulTransfSite[IMc]": {
    "red_x_points": [
      [-0.00143, 3],
      [-0.00991, 2],
      [-0.00418, 0],
      [-0.0049, 0],
      [-0.00178, 3],
      [-0.00523, 0],
      [-0.00359, 0],
      [-0.00455, 0],
      [-0.00215, 3],
      [-0.0045, 0],
      [-0.0045, 0],
      [-0.00413, 0],
      [-0.00164, 3],
      [0.01081, 1],
      [-0.00168, 3],
      [-0.00432, 0],
      [-0.002, 3],
      [-0.01078, 2],
      [-0.00182, 3],
      [-0.00165, 3],
      [-0.00168, 3],
      [-0.00168, 3],
      [-0.00411, 0],
      [-0.00173, 3],
      [-0.00186, 3],
      [-0.0016, 3],
      [-0.00459, 0],
      [-0.00989, 2],
      [0.01289, 1],
      [-0.00175, 3],
      [-0.01121, 2],
      [-0.00174, 3]
    ],
    "red_o_points": [],
    "y_categories": ["N", "NOT APPLICABLE", "Y", "nan"],
    "blue_o_points": [],
    "blue_x_points": [
      [0.01622, 1],
      [-0.00061, 3],
      [0.01488, 1],
      [4e-5, 0],
      [-0.00155, 0],
      [0.01554, 1],
      [-0.00071, 3],
      [0.01508, 1],
      [-0.00054, 3],
      [-0.00067, 3]
    ]
  },
  "QS_mulLysisRoot[C7]": {
    "red_x_points": [
      [-0.00052, 3],
      [-0.00076, 0],
      [-0.0042, 2],
      [-0.00074, 0],
      [-0.00056, 3],
      [-0.00082, 0],
      [-0.00059, 0],
      [-0.00064, 0],
      [-0.00046, 3],
      [-0.00059, 0],
      [-0.00085, 0],
      [-0.00076, 0],
      [-0.00059, 3],
      [0.00209, 1],
      [-0.00035, 3],
      [-0.00073, 0],
      [-0.00045, 3],
      [-0.00073, 0],
      [-0.00036, 3],
      [-0.00064, 3],
      [-0.00046, 3],
      [-0.0005, 3],
      [-0.0007, 0],
      [-0.00059, 3],
      [-0.00073, 3],
      [-0.00032, 3],
      [-0.00056, 0],
      [-0.00085, 0],
      [0.00183, 1],
      [-0.00036, 3],
      [-0.00059, 0],
      [-0.00037, 3]
    ],
    "red_o_points": [],
    "y_categories": ["N", "NOT APPLICABLE", "Y", "nan"],
    "blue_o_points": [],
    "blue_x_points": [
      [0.00311, 1],
      [-0.0001, 3],
      [0.00236, 1],
      [-6e-5, 0],
      [7e-5, 0],
      [0.00232, 1],
      [-0.00011, 3],
      [0.00287, 1],
      [-0.0002, 3],
      [-0.0001, 3]
    ]
  },
  "QS_lstBpsurgSide": {
    "red_x_points": [
      [-0.00095, 3],
      [-0.00626, 0],
      [-0.0075, 0],
      [-0.00712, 0],
      [-0.00127, 3],
      [-0.00762, 2],
      [-0.00811, 0],
      [-0.00767, 0],
      [-0.00142, 3],
      [-0.00789, 0],
      [-0.00717, 2],
      [-0.00723, 2],
      [-0.00145, 3],
      [0.01064, 1],
      [-0.001, 3],
      [-0.0082, 2],
      [-0.00121, 3],
      [-0.00731, 2],
      [-0.00221, 3],
      [-0.00142, 3],
      [-0.0013, 3],
      [-0.00129, 3],
      [-0.00665, 0],
      [-0.00114, 3],
      [-0.00169, 3],
      [-0.00137, 3],
      [-0.00667, 2],
      [-0.00598, 2],
      [0.01216, 1],
      [-0.00109, 3],
      [-0.00722, 0],
      [-0.0012, 3]
    ],
    "red_o_points": [],
    "y_categories": ["L", "NOT APPLICABLE", "R", "nan"],
    "blue_o_points": [],
    "blue_x_points": [
      [0.01669, 1],
      [-0.00017, 3],
      [0.01414, 1],
      [0.00377, 0],
      [-0.0004, 2],
      [0.01444, 1],
      [-7e-5, 3],
      [0.0152, 1],
      [-0.0004, 3],
      [-0.00011, 3]
    ]
  },
  "QA_lstPexPain[T1]": {
    "red_x_points": [
      [-0.00751, 1],
      [-0.00197, 2],
      [-0.00337, 2],
      [-0.00207, 2],
      [-0.00963, 1],
      [-0.00597, 0],
      [0.0004, 1],
      [0.00131, 1],
      [0.00632, 0],
      [0.00286, 1],
      [-0.00282, 0],
      [-0.0072, 0],
      [0.00656, 0],
      [-0.01438, 2],
      [-0.00512, 2],
      [-0.0033, 2],
      [-0.00511, 2],
      [-0.00188, 2],
      [-0.00517, 2],
      [0.00648, 0],
      [-0.01026, 1],
      [0.00765, 0],
      [-0.00291, 2],
      [-0.00451, 2],
      [-0.00918, 1],
      [-0.00575, 2],
      [-0.00446, 2],
      [-0.00295, 2],
      [-0.00538, 1],
      [-0.01155, 1],
      [0.00013, 1],
      [-0.00982, 1]
    ],
    "red_o_points": [],
    "y_categories": ["NORM", "NPV", "nan"],
    "blue_o_points": [],
    "blue_x_points": [
      [0.00014, 1],
      [-0.00107, 2],
      [0.00597, 0],
      [0.00731, 1],
      [0.01234, 1],
      [-5e-5, 1],
      [0.01135, 0],
      [0.00658, 0],
      [0.01187, 0],
      [0.01349, 0]
    ]
  },
  "QS_mulTransfSite[AcMc]": {
    "red_x_points": [
      [-0.00028, 3],
      [-0.00071, 0],
      [-0.0005, 0],
      [-0.00082, 0],
      [-0.00026, 3],
      [-0.00109, 0],
      [-0.00071, 0],
      [-0.00064, 0],
      [-0.00043, 3],
      [-0.00079, 0],
      [-0.00109, 0],
      [-0.00639, 2],
      [-0.00044, 3],
      [0.00192, 1],
      [-0.00022, 3],
      [-0.00068, 0],
      [-0.00034, 3],
      [-0.00066, 0],
      [-0.00025, 3],
      [-0.00039, 3],
      [-0.00022, 3],
      [-0.00031, 3],
      [-0.00083, 0],
      [-0.00035, 3],
      [-0.00024, 3],
      [-0.00021, 3],
      [-0.00074, 0],
      [-0.00077, 0],
      [0.00197, 1],
      [-0.0002, 3],
      [-0.00064, 0],
      [-0.00021, 3]
    ],
    "red_o_points": [],
    "y_categories": ["N", "NOT APPLICABLE", "Y", "nan"],
    "blue_o_points": [],
    "blue_x_points": [
      [0.00288, 1],
      [-4e-5, 3],
      [0.00226, 1],
      [9e-5, 0],
      [0.00046, 0],
      [0.00268, 1],
      [-0.00021, 3],
      [0.00279, 1],
      [-0.00014, 3],
      [-5e-5, 3]
    ]
  },
  "QA_lstPexKine[Shoulder]": {
    "red_x_points": [
      [-0.00136, 1],
      [-0.00245, 2],
      [-0.00424, 2],
      [-0.003, 2],
      [-0.00589, 2],
      [-0.00469, 1],
      [-0.00231, 1],
      [0.0047, 0],
      [-0.00837, 2],
      [-0.00259, 1],
      [-0.00279, 1],
      [-0.00368, 1],
      [-0.00219, 1],
      [-0.001, 2],
      [-0.00465, 2],
      [-0.00209, 1],
      [-0.00498, 2],
      [-0.00237, 2],
      [-0.0045, 2],
      [-0.00281, 1],
      [-0.00115, 1],
      [-0.00257, 1],
      [-0.00218, 2],
      [-0.00448, 2],
      [-0.00223, 1],
      [-0.00695, 2],
      [-0.00553, 2],
      [-0.00285, 2],
      [-0.00156, 2],
      [-0.00482, 2],
      [-0.00104, 1],
      [-0.00471, 2]
    ],
    "red_o_points": [],
    "y_categories": ["NPV", "PV", "nan"],
    "blue_o_points": [],
    "blue_x_points": [
      [-0.00014, 1],
      [-0.00197, 2],
      [-0.00049, 1],
      [0.00137, 1],
      [0.02572, 0],
      [-0.00014, 1],
      [0.03664, 0],
      [-0.00039, 2],
      [2e-5, 1],
      [0.00059, 1]
    ]
  },
  "QA_yonInjBpsurg": {
    "red_x_points": [
      [-0.0016, 1],
      [-0.00136, 1],
      [-0.00156, 1],
      [-0.00159, 1],
      [-0.00194, 1],
      [-0.00189, 1],
      [-0.00165, 1],
      [-0.00168, 1],
      [-0.00186, 1],
      [-0.00176, 1],
      [-0.00164, 1],
      [-0.00145, 1],
      [-0.00171, 1],
      [0.00383, 0],
      [-0.00197, 1],
      [-0.00178, 1],
      [-0.00185, 1],
      [-0.00106, 1],
      [-0.00157, 1],
      [-0.0017, 1],
      [-0.00157, 1],
      [-0.00169, 1],
      [-0.00128, 1],
      [-0.00179, 1],
      [-0.00219, 1],
      [-0.00225, 1],
      [-0.00147, 1],
      [-0.00132, 1],
      [0.00572, 0],
      [-0.00177, 1],
      [-0.00133, 1],
      [-0.00168, 1]
    ],
    "red_o_points": [],
    "y_categories": ["N", "Y", "nan"],
    "blue_o_points": [],
    "blue_x_points": [
      [0.00776, 0],
      [-0.00042, 1],
      [0.00686, 0],
      [-0.00141, 1],
      [-0.00173, 1],
      [0.00702, 0],
      [-0.00089, 1],
      [0.00759, 0],
      [-0.00061, 1],
      [-0.00103, 1]
    ]
  },
  "QA_lstPexTouch[C8]": {
    "red_x_points": [
      [-0.00706, 1],
      [-0.00242, 2],
      [-0.00317, 1],
      [-0.00256, 2],
      [-0.00714, 1],
      [0.00308, 0],
      [-0.00292, 1],
      [-0.0038, 1],
      [0.00543, 0],
      [-0.00369, 1],
      [0.00347, 0],
      [0.0036, 0],
      [-0.00902, 1],
      [-0.01321, 2],
      [-0.0047, 2],
      [-0.00316, 2],
      [-0.0071, 1],
      [-0.0028, 2],
      [-0.00422, 2],
      [0.00577, 0],
      [-0.00909, 1],
      [0.00514, 0],
      [-0.00256, 2],
      [-0.00435, 2],
      [0.00435, 0],
      [0.00607, 0],
      [-0.00344, 1],
      [-0.00218, 2],
      [-0.00668, 1],
      [-0.0049, 2],
      [-0.00303, 1],
      [-0.00773, 1]
    ],
    "red_o_points": [],
    "y_categories": ["NORM", "NPV", "nan"],
    "blue_o_points": [],
    "blue_x_points": [
      [0.0096, 0],
      [-0.00012, 2],
      [0.00032, 1],
      [0.00118, 1],
      [0.00799, 0],
      [-0.00014, 1],
      [0.00897, 0],
      [0.00582, 0],
      [0.00863, 0],
      [0.00986, 0]
    ]
  },
  "QS_mulLysisNerve[Ssr]": {
    "red_x_points": [
      [-0.00033, 3],
      [-0.0006, 0],
      [-0.00271, 2],
      [-0.00065, 0],
      [-0.00031, 3],
      [-0.00059, 0],
      [-0.00054, 0],
      [-0.00058, 0],
      [-0.00048, 3],
      [-0.00051, 0],
      [-0.0006, 0],
      [-0.00049, 0],
      [-0.00025, 3],
      [0.00151, 1],
      [-0.0003, 3],
      [-0.00047, 0],
      [-0.00024, 3],
      [-0.00053, 0],
      [-0.00027, 3],
      [-0.00037, 3],
      [-0.00034, 3],
      [-0.00027, 3],
      [-0.00065, 0],
      [-0.00045, 3],
      [-0.00025, 3],
      [-0.00024, 3],
      [-0.00055, 0],
      [-0.00068, 0],
      [0.00151, 1],
      [-0.00029, 3],
      [-0.00029, 0],
      [-0.00018, 3]
    ],
    "red_o_points": [],
    "y_categories": ["N", "NOT APPLICABLE", "Y", "nan"],
    "blue_o_points": [],
    "blue_x_points": [
      [0.00257, 1],
      [-0.00013, 3],
      [0.00193, 1],
      [8e-5, 0],
      [-0.00019, 0],
      [0.00167, 1],
      [-0.00018, 3],
      [0.00203, 1],
      [-0.00027, 3],
      [-0.00012, 3]
    ]
  },
  "QS_mulBpsurgeryType[Graft]": {
    "red_x_points": [
      [-0.00022, 3],
      [-0.00039, 0],
      [-0.00038, 0],
      [-0.00039, 0],
      [-0.00024, 3],
      [-0.00036, 0],
      [-0.00047, 0],
      [-0.00046, 0],
      [-0.00023, 3],
      [-0.00049, 0],
      [-0.00051, 0],
      [-0.00043, 0],
      [-0.00029, 3],
      [0.00127, 1],
      [-0.00029, 3],
      [-0.00183, 2],
      [-0.00029, 3],
      [-0.00025, 0],
      [-0.0003, 3],
      [-0.00018, 3],
      [-0.00026, 3],
      [-0.00028, 3],
      [-0.0005, 0],
      [-0.00037, 3],
      [-0.00031, 3],
      [-0.00031, 3],
      [-0.00037, 0],
      [-0.00036, 0],
      [0.00106, 1],
      [-0.00017, 3],
      [-0.00045, 0],
      [-0.00029, 3]
    ],
    "red_o_points": [],
    "y_categories": ["N", "NOT APPLICABLE", "Y", "nan"],
    "blue_o_points": [],
    "blue_x_points": [
      [0.00191, 1],
      [-0.00015, 3],
      [0.0016, 1],
      [1e-5, 0],
      [-0.00032, 0],
      [0.00115, 1],
      [-0.00019, 3],
      [0.00172, 1],
      [-0.00011, 3],
      [-0.0002, 3]
    ]
  },
  "QS_mulLysisRoot[C5]": {
    "red_x_points": [
      [-0.00085, 3],
      [-0.00277, 0],
      [-0.00833, 2],
      [-0.00309, 0],
      [-0.0008, 3],
      [-0.00297, 0],
      [-0.00237, 0],
      [-0.00242, 0],
      [-0.00093, 3],
      [-0.00311, 0],
      [-0.00307, 0],
      [-0.00202, 0],
      [-0.00067, 3],
      [0.00625, 1],
      [-0.00122, 3],
      [-0.00289, 0],
      [-0.00072, 3],
      [-0.00263, 0],
      [-0.00091, 3],
      [-0.00105, 3],
      [-0.00081, 3],
      [-0.0006, 3],
      [-0.00239, 0],
      [-0.00089, 3],
      [-0.00092, 3],
      [-0.00084, 3],
      [-0.00247, 0],
      [-0.0026, 0],
      [0.00718, 1],
      [-0.00077, 3],
      [-0.00766, 2],
      [-0.00102, 3]
    ],
    "red_o_points": [],
    "y_categories": ["N", "NOT APPLICABLE", "Y", "nan"],
    "blue_o_points": [],
    "blue_x_points": [
      [0.00814, 1],
      [-1e-5, 3],
      [0.00744, 1],
      [0.00054, 0],
      [-0.00022, 0],
      [0.00661, 1],
      [-0.00041, 3],
      [0.00747, 1],
      [-0.00032, 3],
      [-0.0002, 3]
    ]
  },
  "QS_mulNeuromadSite[C6]": {
    "red_x_points": [
      [-5e-5, 2],
      [-0.00063, 0],
      [-0.0004, 0],
      [-0.00069, 0],
      [3e-5, 2],
      [-0.00065, 0],
      [-0.00046, 0],
      [-0.00059, 0],
      [-5e-5, 2],
      [-0.00049, 0],
      [-0.00097, 0],
      [-0.00063, 0],
      [-9e-5, 2],
      [0.00051, 1],
      [-8e-5, 2],
      [-0.00048, 0],
      [-1e-5, 2],
      [-0.00039, 0],
      [-0.00025, 2],
      [-5e-5, 2],
      [-1e-5, 2],
      [0.0, 2],
      [-0.00048, 0],
      [-3e-5, 2],
      [-0.00011, 2],
      [-6e-5, 2],
      [-0.0004, 0],
      [-0.00045, 0],
      [0.00094, 1],
      [-7e-5, 2],
      [-0.00026, 0],
      [2e-5, 2]
    ],
    "red_o_points": [],
    "y_categories": ["N", "NOT APPLICABLE", "nan"],
    "blue_o_points": [],
    "blue_x_points": [
      [0.00137, 1],
      [5e-5, 2],
      [0.00086, 1],
      [0.00031, 0],
      [-0.00016, 0],
      [0.00101, 1],
      [0.0, 2],
      [0.00134, 1],
      [6e-5, 2],
      [0.00014, 2]
    ]
  },
  "QS_mulNeuromadSite[T1]": {
    "red_x_points": [
      [-5e-5, 2],
      [-0.00078, 0],
      [-0.00086, 0],
      [-0.00084, 0],
      [-0.00021, 2],
      [-0.00092, 0],
      [-0.00089, 0],
      [-0.00111, 0],
      [-0.00039, 2],
      [-0.00125, 0],
      [-0.00123, 0],
      [-0.00095, 0],
      [-0.00014, 2],
      [0.00086, 1],
      [-0.0003, 2],
      [-0.00118, 0],
      [-0.00037, 2],
      [-0.00089, 0],
      [-0.00062, 2],
      [-0.00024, 2],
      [-2e-5, 2],
      [-0.00011, 2],
      [-0.00086, 0],
      [-9e-5, 2],
      [-8e-5, 2],
      [-0.00018, 2],
      [-0.00077, 0],
      [-0.00081, 0],
      [0.00165, 1],
      [-0.0002, 2],
      [-0.00103, 0],
      [-0.00018, 2]
    ],
    "red_o_points": [],
    "y_categories": ["N", "NOT APPLICABLE", "nan"],
    "blue_o_points": [],
    "blue_x_points": [
      [0.00256, 1],
      [2e-5, 2],
      [0.00219, 1],
      [0.00018, 0],
      [-0.00012, 0],
      [0.0018, 1],
      [-3e-5, 2],
      [0.00203, 1],
      [3e-5, 2],
      [0.00014, 2]
    ]
  },
  "QA_lstPexTouch[C7]": {
    "red_x_points": [
      [-0.00833, 1],
      [-0.0019, 2],
      [-0.00224, 1],
      [-0.00189, 2],
      [-0.00768, 1],
      [0.00284, 0],
      [-0.00267, 1],
      [-0.00278, 1],
      [0.00556, 0],
      [-0.00227, 1],
      [0.00196, 0],
      [-0.00344, 1],
      [-0.00838, 1],
      [-0.0091, 2],
      [-0.0034, 2],
      [-0.00179, 2],
      [-0.00854, 1],
      [-0.00171, 2],
      [-0.00364, 2],
      [0.00623, 0],
      [-0.00901, 1],
      [0.00527, 0],
      [-0.00255, 2],
      [-0.0038, 2],
      [0.00244, 0],
      [0.00594, 0],
      [-0.00275, 1],
      [-0.00267, 2],
      [-0.00218, 1],
      [-0.00454, 2],
      [-0.00269, 1],
      [-0.00806, 1]
    ],
    "red_o_points": [],
    "y_categories": ["NORM", "NPV", "nan"],
    "blue_o_points": [],
    "blue_x_points": [
      [-0.00012, 1],
      [0.00037, 2],
      [0.00144, 1],
      [0.00089, 1],
      [0.0098, 0],
      [0.00111, 1],
      [0.00944, 0],
      [0.00423, 0],
      [0.00921, 0],
      [0.01011, 0]
    ]
  },
  "QA_lstPexMuscstrength[ShoulderAbduc]": {
    "red_x_points": [
      [-0.00338, 1],
      [-0.00284, 1],
      [-0.00298, 1],
      [-0.00308, 1],
      [-0.00348, 1],
      [-0.00338, 1],
      [-0.00346, 1],
      [-0.0029, 1],
      [-0.0033, 1],
      [-0.00289, 1],
      [-0.00333, 1],
      [-0.00329, 1],
      [-0.00345, 1],
      [0.00038, 2],
      [0.0012, 2],
      [0.00129, 2],
      [0.0009, 2],
      [0.00117, 2],
      [0.00121, 2],
      [-0.00333, 1],
      [-0.00326, 1],
      [-0.00341, 1],
      [-0.00283, 1],
      [0.00125, 2],
      [-0.00494, 1],
      [-0.00285, 1],
      [-0.0027, 1],
      [-0.00257, 1],
      [0.00138, 2],
      [-0.00352, 1],
      [-0.00331, 1],
      [0.0019, 2]
    ],
    "red_o_points": [],
    "y_categories": ["GREATER THAN OR EQUALS TO 3", "LESS THAN 3", "nan"],
    "blue_o_points": [],
    "blue_x_points": [
      [0.00103, 2],
      [0.00172, 2],
      [0.01816, 0],
      [0.00269, 2],
      [-0.00213, 1],
      [0.01658, 0],
      [0.0022, 2],
      [-0.00116, 1],
      [-0.00228, 1],
      [-0.00185, 1]
    ]
  },
  "QA_lstPexMuscstrength[ThumbOppo]": {
    "red_x_points": [
      [-0.00662, 1],
      [0.00063, 2],
      [-0.00611, 1],
      [-0.005, 1],
      [-0.00832, 1],
      [0.00138, 0],
      [0.00147, 0],
      [-0.00583, 1],
      [0.0013, 0],
      [0.00118, 0],
      [0.00144, 0],
      [0.00097, 0],
      [0.00105, 0],
      [0.00079, 2],
      [0.00119, 2],
      [0.00086, 2],
      [0.00105, 0],
      [0.00033, 2],
      [0.00124, 2],
      [0.00077, 0],
      [-0.00797, 1],
      [0.00097, 0],
      [-0.00478, 1],
      [0.0015, 2],
      [0.00156, 2],
      [0.00095, 2],
      [0.00147, 0],
      [-0.00475, 1],
      [0.00067, 2],
      [-0.00806, 1],
      [-0.00646, 1],
      [0.00132, 2]
    ],
    "red_o_points": [],
    "y_categories": ["GREATER THAN OR EQUALS TO 3", "LESS THAN 3", "nan"],
    "blue_o_points": [],
    "blue_x_points": [
      [0.00071, 2],
      [0.00147, 2],
      [0.00176, 0],
      [0.00359, 2],
      [0.0029, 0],
      [0.0016, 0],
      [0.00398, 0],
      [0.00166, 0],
      [0.00288, 2],
      [0.00253, 2]
    ]
  },
  "QS_mulNeuromadSite[T2]": {
    "red_x_points": [
      [-0.00042, 2],
      [-0.00169, 0],
      [-0.00147, 0],
      [-0.00176, 0],
      [-0.00043, 2],
      [-0.00239, 0],
      [-0.00129, 0],
      [-0.00183, 0],
      [-0.00084, 2],
      [-0.0023, 0],
      [-0.00221, 0],
      [-0.00157, 0],
      [-0.00042, 2],
      [0.0013, 1],
      [-0.00039, 2],
      [-0.00169, 0],
      [-0.00095, 2],
      [-0.00152, 0],
      [-0.00055, 2],
      [-0.00048, 2],
      [-0.0002, 2],
      [-0.00046, 2],
      [-0.00136, 0],
      [-0.00028, 2],
      [-0.0007, 2],
      [-0.00051, 2],
      [-0.00159, 0],
      [-0.00131, 0],
      [0.00298, 1],
      [-0.00041, 2],
      [-0.00144, 0],
      [-0.00099, 2]
    ],
    "red_o_points": [],
    "y_categories": ["N", "NOT APPLICABLE", "nan"],
    "blue_o_points": [],
    "blue_x_points": [
      [0.00566, 1],
      [-0.00023, 2],
      [0.00349, 1],
      [0.00101, 0],
      [-0.00061, 0],
      [0.00436, 1],
      [-0.00018, 2],
      [0.00433, 1],
      [-8e-5, 2],
      [-0.00021, 2]
    ]
  },
  "QA_equInjTbpiTime": {
    "red_x_points": [
      [-0.00027, 0],
      [-0.00253, 0],
      [0.00603, 3],
      [-0.00349, 0],
      [-0.00436, 1],
      [-0.00718, 0],
      [-0.00645, 1],
      [-0.00436, 0],
      [0.00062, 3],
      [-0.0065, 0],
      [-0.00645, 0],
      [0.01088, 3],
      [-0.00074, 0],
      [-0.03266, 2],
      [-0.00118, 3],
      [-0.00457, 0],
      [0.00052, 0],
      [-0.00307, 0],
      [-0.01175, 1],
      [0.00111, 3],
      [-0.00069, 0],
      [-0.00498, 1],
      [-0.00769, 2],
      [-0.0013, 3],
      [-0.01075, 1],
      [-0.01309, 2],
      [-0.00564, 0],
      [-0.00757, 2],
      [0.00067, 0],
      [-0.00101, 0],
      [0.00573, 3],
      [-0.00584, 1]
    ],
    "red_o_points": [],
    "y_categories": [
      "0 TO 6 MONTHS",
      "13 TO 24 MONTHS",
      "25 MONTHS OR MORE",
      "7 TO 12 MONTHS",
      "nan"
    ],
    "blue_o_points": [],
    "blue_x_points": [
      [0.00319, 0],
      [0.00838, 0],
      [0.00384, 0],
      [0.01682, 3],
      [0.01568, 3],
      [0.00375, 0],
      [0.00345, 1],
      [0.01063, 3],
      [0.00651, 3],
      [0.00648, 0]
    ]
  },
  "QS_mulNeuromadSite[C4]": {
    "red_x_points": [
      [-0.00023, 2],
      [-0.00134, 0],
      [-0.00103, 0],
      [-0.00117, 0],
      [-0.00021, 2],
      [-0.00102, 0],
      [-0.0011, 0],
      [-0.0011, 0],
      [-0.00035, 2],
      [-0.00146, 0],
      [-0.00126, 0],
      [-0.00107, 0],
      [-0.0001, 2],
      [0.00161, 1],
      [-0.00032, 2],
      [-0.00116, 0],
      [-0.00031, 2],
      [-0.00092, 0],
      [-0.00045, 2],
      [-0.00018, 2],
      [-0.0001, 2],
      [-7e-5, 2],
      [-0.00118, 0],
      [-0.00042, 2],
      [-0.00046, 2],
      [-0.0003, 2],
      [-0.00114, 0],
      [-0.00099, 0],
      [0.0019, 1],
      [-0.00031, 2],
      [-0.00097, 0],
      [-0.00028, 2]
    ],
    "red_o_points": [],
    "y_categories": ["N", "NOT APPLICABLE", "nan"],
    "blue_o_points": [],
    "blue_x_points": [
      [0.00407, 1],
      [-0.00012, 2],
      [0.00209, 1],
      [0.00023, 0],
      [-0.00061, 0],
      [0.00238, 1],
      [3e-5, 2],
      [0.00259, 1],
      [1e-5, 2],
      [0.00014, 2]
    ]
  },
  "QS_mulTransfSite[Oberlin]": {
    "red_x_points": [
      [-0.00226, 3],
      [-0.01635, 0],
      [-0.01749, 0],
      [-0.0171, 0],
      [-0.00253, 3],
      [-0.00305, 2],
      [-0.00215, 2],
      [-0.01708, 0],
      [-0.00237, 3],
      [-0.00275, 2],
      [-0.00238, 2],
      [-0.0027, 2],
      [-0.00259, 3],
      [0.02135, 1],
      [-0.00237, 3],
      [-0.00298, 2],
      [-0.00236, 3],
      [-0.01761, 0],
      [-0.00278, 3],
      [-0.00272, 3],
      [-0.00211, 3],
      [-0.00254, 3],
      [-0.017, 0],
      [-0.00252, 3],
      [-0.00314, 3],
      [-0.00226, 3],
      [-0.00279, 2],
      [-0.01591, 0],
      [0.0196, 1],
      [-0.00241, 3],
      [-0.01817, 0],
      [-0.00234, 3]
    ],
    "red_o_points": [],
    "y_categories": ["N", "NOT APPLICABLE", "Y", "nan"],
    "blue_o_points": [],
    "blue_x_points": [
      [0.02366, 1],
      [-0.00096, 3],
      [0.02312, 1],
      [0.00219, 2],
      [0.00158, 2],
      [0.0228, 1],
      [-0.00109, 3],
      [0.02272, 1],
      [-0.00087, 3],
      [-0.00078, 3]
    ]
  },
  "QA_lstPexMuscstrength[ElbowFlex]": {
    "red_x_points": [
      [-0.00281, 1],
      [-0.0024, 2],
      [-0.0039, 1],
      [-0.00277, 1],
      [-0.0033, 1],
      [0.00792, 0],
      [-0.00381, 1],
      [-0.00352, 1],
      [-0.00336, 1],
      [-0.00406, 1],
      [-0.00407, 1],
      [-0.00454, 1],
      [-0.00315, 1],
      [-0.00232, 2],
      [-0.00271, 2],
      [-0.00274, 2],
      [-0.00311, 1],
      [-0.00258, 2],
      [-0.00305, 2],
      [-0.00333, 1],
      [-0.003, 1],
      [-0.00267, 1],
      [-0.00279, 1],
      [-0.00289, 2],
      [0.00089, 0],
      [-0.00244, 1],
      [-0.00402, 1],
      [-0.00294, 1],
      [-0.00236, 2],
      [-0.0027, 1],
      [-0.00347, 1],
      [-0.00295, 2]
    ],
    "red_o_points": [],
    "y_categories": ["GREATER THAN OR EQUALS TO 3", "LESS THAN 3", "nan"],
    "blue_o_points": [],
    "blue_x_points": [
      [-0.00036, 2],
      [-0.00074, 2],
      [0.01144, 0],
      [-0.00046, 1],
      [0.02193, 0],
      [0.00997, 0],
      [-0.00147, 1],
      [0.01159, 0],
      [0.00038, 1],
      [-0.00046, 1]
    ]
  },
  "QS_mulGraftNerve[FI]": {
    "red_x_points": [
      [-0.0001, 2],
      [-0.00048, 0],
      [-0.00039, 0],
      [-0.00038, 0],
      [-0.00013, 2],
      [-0.00045, 0],
      [-0.00049, 0],
      [-0.00055, 0],
      [-5e-5, 2],
      [-0.00043, 0],
      [-0.00052, 0],
      [-0.00049, 0],
      [-9e-5, 2],
      [0.00055, 1],
      [-0.00011, 2],
      [-0.00035, 0],
      [-0.0001, 2],
      [-0.00021, 0],
      [-0.00019, 2],
      [-8e-5, 2],
      [-9e-5, 2],
      [-8e-5, 2],
      [-0.00031, 0],
      [-8e-5, 2],
      [-0.00023, 2],
      [-8e-5, 2],
      [-0.00042, 0],
      [-0.00045, 0],
      [0.00095, 1],
      [-7e-5, 2],
      [-0.00036, 0],
      [-0.00012, 2]
    ],
    "red_o_points": [],
    "y_categories": ["N", "NOT APPLICABLE", "nan"],
    "blue_o_points": [],
    "blue_x_points": [
      [0.00222, 1],
      [-3e-5, 2],
      [0.00063, 1],
      [6e-5, 0],
      [-6e-5, 0],
      [0.00092, 1],
      [-5e-5, 2],
      [0.00064, 1],
      [-8e-5, 2],
      [6e-5, 2]
    ]
  }
}
