{
  "QA_lstPexPain[C8]": {
    "red_x_points": [
      [-0.00958, 1],
      [-0.00277, 2],
      [-0.003, 2],
      [-0.00252, 2],
      [-0.01, 1],
      [9e-5, 0],
      [-0.00063, 1],
      [-0.00095, 1],
      [0.00709, 0],
      [-0.00054, 0],
      [0.00063, 0],
      [-0.00146, 0],
      [-0.00999, 1],
      [-0.01657, 2],
      [-0.00551, 2],
      [-0.00363, 2],
      [-0.00497, 2],
      [-0.00232, 2],
      [-0.00638, 2],
      [0.00875, 0],
      [-0.01084, 1],
      [0.00745, 0],
      [-0.00331, 2],
      [-0.0052, 2],
      [0.00545, 0],
      [-0.00624, 2],
      [-0.00398, 2],
      [-0.00274, 2],
      [-0.00743, 1],
      [-0.01226, 1],
      [-0.00144, 1],
      [-0.01086, 1]
    ],
    "red_o_points": [],
    "y_categories": ["NORM", "NPV", "nan"],
    "blue_o_points": [],
    "blue_x_points": [
      [0.01182, 0],
      [-0.00133, 2],
      [0.00072, 1],
      [0.0119, 1],
      [0.00331, 0],
      [0.00068, 1],
      [0.01222, 0],
      [0.00565, 0],
      [0.01218, 0],
      [0.01621, 0]
    ]
  },
  "QS_mulLysisSite[Root]": {
    "red_x_points": [
      [-0.00043, 3],
      [-0.00146, 0],
      [-0.00497, 2],
      [-0.00133, 0],
      [-0.00058, 3],
      [-0.00156, 0],
      [-0.00131, 0],
      [-0.00139, 0],
      [-0.00049, 3],
      [-0.00126, 0],
      [-0.0013, 0],
      [-0.00078, 0],
      [-0.00077, 3],
      [0.00284, 1],
      [-0.00059, 3],
      [-0.00136, 0],
      [-0.0006, 3],
      [-0.00137, 0],
      [-0.00061, 3],
      [-0.00078, 3],
      [-0.00049, 3],
      [-0.00047, 3],
      [-0.00125, 0],
      [-0.00066, 3],
      [-0.00042, 3],
      [-0.00046, 3],
      [-0.0011, 0],
      [-0.00144, 0],
      [0.00368, 1],
      [-0.00044, 3],
      [-0.00516, 2],
      [-0.00048, 3]
    ],
    "red_o_points": [],
    "y_categories": ["N", "NOT APPLICABLE", "Y", "nan"],
    "blue_o_points": [],
    "blue_x_points": [
      [0.00491, 1],
      [-0.00029, 3],
      [0.00456, 1],
      [-0.00023, 0],
      [9e-5, 0],
      [0.00391, 1],
      [-0.00022, 3],
      [0.00465, 1],
      [-0.00045, 3],
      [-0.00025, 3]
    ]
  },
  "QS_mulLysisTrunk[Upper]": {
    "red_x_points": [
      [-0.0015, 3],
      [-0.00402, 0],
      [-0.00429, 0],
      [-0.00465, 0],
      [-0.00145, 3],
      [-0.00483, 0],
      [-0.01025, 2],
      [-0.00409, 0],
      [-0.00208, 3],
      [-0.0046, 0],
      [-0.00456, 0],
      [-0.00447, 0],
      [-0.00194, 3],
      [0.00917, 1],
      [-0.00128, 3],
      [-0.00468, 0],
      [-0.00216, 3],
      [-0.00941, 2],
      [-0.00224, 3],
      [-0.00172, 3],
      [-0.00113, 3],
      [-0.00175, 3],
      [-0.0045, 0],
      [-0.00119, 3],
      [-0.00179, 3],
      [-0.0011, 3],
      [-0.00467, 0],
      [-0.00406, 0],
      [0.00833, 1],
      [-0.00105, 3],
      [-0.0098, 2],
      [-0.00145, 3]
    ],
    "red_o_points": [],
    "y_categories": ["N", "NOT APPLICABLE", "Y", "nan"],
    "blue_o_points": [],
    "blue_x_points": [
      [0.0166, 1],
      [-0.00051, 3],
      [0.01252, 1],
      [0.00156, 0],
      [-0.00112, 0],
      [0.01248, 1],
      [-0.00041, 3],
      [0.01314, 1],
      [-0.00023, 3],
      [-0.00033, 3]
    ]
  },
  "QS_mulBpsurgeryType[Transf]": {
    "red_x_points": [
      [-0.00014, 3],
      [-0.00029, 2],
      [-0.00152, 0],
      [-0.0004, 2],
      [-0.00024, 3],
      [-0.00026, 2],
      [-0.00035, 2],
      [-0.00033, 2],
      [-0.00015, 3],
      [-0.00028, 2],
      [-0.00034, 2],
      [-0.00026, 2],
      [-0.00019, 3],
      [0.00115, 1],
      [-0.00017, 3],
      [-0.00023, 2],
      [-0.00012, 3],
      [-0.00047, 2],
      [-0.0002, 3],
      [-8e-5, 3],
      [-0.00015, 3],
      [-0.00017, 3],
      [-0.0003, 2],
      [-0.0002, 3],
      [-0.00019, 3],
      [-0.0002, 3],
      [-0.00039, 2],
      [-0.00035, 2],
      [0.0007, 1],
      [-0.00012, 3],
      [-0.00024, 2],
      [-0.00013, 3]
    ],
    "red_o_points": [],
    "y_categories": ["N", "NOT APPLICABLE", "Y", "nan"],
    "blue_o_points": [],
    "blue_x_points": [
      [0.0012, 1],
      [-8e-5, 3],
      [0.00113, 1],
      [-8e-5, 2],
      [-2e-5, 2],
      [0.001, 1],
      [-7e-5, 3],
      [0.00111, 1],
      [-7e-5, 3],
      [-5e-5, 3]
    ]
  },
  "QS_equBpsurgTime": {
    "red_x_points": [
      [0.00063, 3],
      [-0.00718, 0],
      [0.00692, 2],
      [-0.00747, 0],
      [0.0006, 3],
      [-0.01307, 0],
      [-0.00896, 1],
      [-0.00837, 1],
      [0.00056, 3],
      [-0.00982, 1],
      [-0.00987, 0],
      [0.01135, 2],
      [0.00072, 3],
      [0.00074, 3],
      [0.00074, 3],
      [-0.0084, 1],
      [0.00084, 3],
      [0.00547, 2],
      [0.00081, 3],
      [0.00066, 3],
      [0.00062, 3],
      [0.00062, 3],
      [-0.00747, 0],
      [0.00068, 3],
      [0.00056, 3],
      [0.00069, 3],
      [-0.00988, 0],
      [-0.00733, 0],
      [0.00071, 3],
      [0.00072, 3],
      [0.00635, 2],
      [0.00062, 3]
    ],
    "red_o_points": [],
    "y_categories": [
      "0 TO 6 MONTHS",
      "13 TO 24 MONTHS",
      "7 TO 12 MONTHS",
      "nan"
    ],
    "blue_o_points": [],
    "blue_x_points": [
      [0.00059, 3],
      [0.00061, 3],
      [0.00065, 3],
      [0.01449, 2],
      [0.01541, 2],
      [0.00045, 3],
      [0.00094, 3],
      [0.00054, 3],
      [0.00094, 3],
      [0.00077, 3]
    ]
  },
  "QA_equInjTbpiTime": {
    "red_x_points": [
      [-0.00083, 0],
      [-0.00318, 0],
      [0.00597, 3],
      [-0.00358, 0],
      [-0.00477, 1],
      [-0.00843, 0],
      [-0.00643, 1],
      [-0.00429, 0],
      [-0.00224, 3],
      [-0.00565, 0],
      [-0.00597, 0],
      [0.01176, 3],
      [-0.00125, 0],
      [-0.03712, 2],
      [-0.00253, 3],
      [-0.00469, 0],
      [0.001, 0],
      [-0.00226, 0],
      [-0.01475, 1],
      [-0.00056, 3],
      [-0.00147, 0],
      [-0.00611, 1],
      [-0.00859, 2],
      [-0.0022, 3],
      [-0.01353, 1],
      [-0.01468, 2],
      [-0.0059, 0],
      [-0.00727, 2],
      [0.00045, 0],
      [0.00062, 0],
      [0.00542, 3],
      [-0.00852, 1]
    ],
    "red_o_points": [],
    "y_categories": [
      "0 TO 6 MONTHS",
      "13 TO 24 MONTHS",
      "25 MONTHS OR MORE",
      "7 TO 12 MONTHS",
      "nan"
    ],
    "blue_o_points": [],
    "blue_x_points": [
      [0.00356, 0],
      [0.01077, 0],
      [0.00439, 0],
      [0.01923, 3],
      [0.01768, 3],
      [0.00476, 0],
      [0.00484, 1],
      [0.01138, 3],
      [0.01104, 3],
      [0.00863, 0]
    ]
  },
  "QA_lstPexPain[C5]": {
    "red_x_points": [
      [-0.00271, 1],
      [-0.00508, 2],
      [-0.0054, 2],
      [-0.0054, 2],
      [-0.00253, 1],
      [-0.00079, 1],
      [-0.00079, 1],
      [-0.00101, 1],
      [-0.00284, 1],
      [-0.00117, 1],
      [-0.00106, 1],
      [-0.00076, 1],
      [-0.00222, 1],
      [-0.01867, 2],
      [-0.00732, 2],
      [-0.00553, 2],
      [-0.00705, 2],
      [-0.00498, 2],
      [-0.00705, 2],
      [-0.00203, 1],
      [-0.0023, 1],
      [-0.00205, 1],
      [-0.00572, 2],
      [-0.00743, 2],
      [-0.00246, 1],
      [-0.00871, 2],
      [-0.00484, 2],
      [-0.0045, 2],
      [-0.00434, 1],
      [-0.00552, 1],
      [-0.00084, 1],
      [-0.0029, 1]
    ],
    "red_o_points": [],
    "y_categories": ["NORM", "NPV", "nan"],
    "blue_o_points": [],
    "blue_x_points": [
      [0.02387, 0],
      [-0.0036, 2],
      [0.00036, 1],
      [-0.00026, 1],
      [-0.00033, 1],
      [0.00032, 1],
      [-0.00105, 1],
      [0.02063, 0],
      [-0.00107, 1],
      [0.04549, 0]
    ]
  },
  "QA_yonInjFracture": {
    "red_x_points": [
      [-0.00944, 0],
      [-0.00036, 2],
      [0.00098, 0],
      [-0.00089, 1],
      [-0.00967, 0],
      [0.00016, 0],
      [0.00034, 0],
      [-0.00313, 1],
      [0.00631, 2],
      [0.0005, 0],
      [-0.00218, 1],
      [-0.00651, 1],
      [-0.01023, 0],
      [-0.00141, 0],
      [0.00586, 1],
      [-0.00133, 1],
      [-0.00996, 0],
      [-0.00268, 1],
      [-0.01172, 0],
      [-0.01282, 0],
      [0.00564, 1],
      [-0.01252, 0],
      [-0.00093, 1],
      [-0.01122, 0],
      [-0.01241, 0],
      [-0.01304, 0],
      [0.00069, 0],
      [-2e-5, 0],
      [-0.00924, 1],
      [0.00597, 2],
      [-0.0031, 1],
      [0.00533, 1]
    ],
    "red_o_points": [],
    "y_categories": ["N", "Y", "nan"],
    "blue_o_points": [],
    "blue_x_points": [
      [0.00261, 0],
      [0.01381, 1],
      [0.00162, 0],
      [0.0048, 0],
      [0.00407, 0],
      [0.00123, 1],
      [0.01284, 2],
      [0.00108, 0],
      [0.01611, 1],
      [0.01274, 2]
    ]
  },
  "QS_mulGraftNerve[Ac]": {
    "red_x_points": [
      [5e-5, 2],
      [-0.00017, 0],
      [-0.00011, 0],
      [-0.00022, 0],
      [-9e-5, 2],
      [-0.00018, 0],
      [-3e-5, 0],
      [-0.00031, 0],
      [-0.00015, 2],
      [-0.00031, 0],
      [-0.00035, 0],
      [-3e-5, 0],
      [-1e-5, 2],
      [5e-5, 1],
      [-0.00011, 2],
      [-0.00031, 0],
      [-9e-5, 2],
      [-0.00016, 0],
      [-3e-5, 2],
      [-1e-5, 2],
      [2e-5, 2],
      [-1e-5, 2],
      [-4e-5, 2],
      [-3e-5, 2],
      [-0.00014, 2],
      [-9e-5, 0],
      [-3e-5, 0],
      [0.00048, 1],
      [-6e-5, 2],
      [-3e-5, 0],
      [-9e-5, 2]
    ],
    "red_o_points": [],
    "y_categories": ["N", "NOT APPLICABLE", "nan"],
    "blue_o_points": [],
    "blue_x_points": [
      [0.00039, 1],
      [5e-5, 2],
      [0.00027, 1],
      [-0.0, 0],
      [0.0004, 1],
      [-1e-5, 2],
      [0.00032, 1],
      [-3e-5, 2],
      [6e-5, 2]
    ]
  },
  "QS_mulNeuromadSite[C8]": {
    "red_x_points": [
      [-0.00021, 2],
      [-0.00236, 0],
      [-0.00232, 0],
      [-0.00302, 0],
      [-0.00032, 2],
      [-0.00297, 0],
      [-0.00202, 0],
      [-0.00255, 0],
      [-0.00054, 2],
      [-0.00265, 0],
      [-0.00307, 0],
      [-0.00214, 0],
      [-0.0006, 2],
      [0.00202, 1],
      [-0.00021, 2],
      [-0.00274, 0],
      [-0.00027, 2],
      [-0.00225, 0],
      [-0.00101, 2],
      [-0.00041, 2],
      [7e-5, 2],
      [-0.00031, 2],
      [-0.00227, 0],
      [-0.00025, 2],
      [-0.00126, 2],
      [-0.00038, 2],
      [-0.00216, 0],
      [-0.00203, 0],
      [0.00318, 1],
      [-0.0003, 2],
      [-0.00212, 0],
      [-0.00025, 2]
    ],
    "red_o_points": [],
    "y_categories": ["N", "NOT APPLICABLE", "nan"],
    "blue_o_points": [],
    "blue_x_points": [
      [0.00631, 1],
      [0.00025, 2],
      [0.00426, 1],
      [0.00123, 0],
      [-0.00049, 0],
      [0.00567, 1],
      [-0.00011, 2],
      [0.0055, 1],
      [0.00015, 2],
      [0.00029, 2]
    ]
  },
  "QS_mulGraftNerve[Ph]": {
    "red_x_points": [
      [1e-5, 2],
      [-0.00012, 0],
      [-0.00028, 0],
      [-0.00034, 0],
      [-4e-5, 2],
      [-0.00027, 0],
      [-0.00018, 0],
      [-0.00037, 0],
      [-1e-5, 2],
      [-0.00047, 0],
      [-0.00022, 0],
      [-6e-5, 0],
      [1e-5, 2],
      [0.00031, 1],
      [-1e-5, 2],
      [-0.00034, 0],
      [-1e-5, 2],
      [-0.00012, 0],
      [-0.00013, 2],
      [1e-5, 2],
      [-1e-5, 2],
      [1e-5, 2],
      [-0.00018, 0],
      [1e-5, 2],
      [-0.00016, 2],
      [-2e-5, 2],
      [-0.00012, 0],
      [-0.00018, 0],
      [0.00044, 1],
      [-3e-5, 2],
      [-0.00012, 0],
      [-6e-5, 2]
    ],
    "red_o_points": [],
    "y_categories": ["N", "NOT APPLICABLE", "nan"],
    "blue_o_points": [],
    "blue_x_points": [
      [0.00048, 1],
      [1e-5, 2],
      [0.00039, 1],
      [5e-5, 0],
      [0.00075, 1],
      [0.0, 2],
      [0.00041, 1],
      [1e-5, 2],
      [1e-5, 2]
    ]
  },
  "QS_mulTransfSite[AcSsPA]": {
    "red_x_points": [
      [-0.00035, 3],
      [-0.00094, 0],
      [-0.00109, 0],
      [-0.00144, 0],
      [-0.00037, 3],
      [-0.00124, 0],
      [-0.00116, 0],
      [-0.00116, 0],
      [-0.00042, 3],
      [-0.00136, 0],
      [-0.00132, 0],
      [-0.00126, 0],
      [-0.00035, 3],
      [0.00252, 1],
      [-0.00034, 3],
      [-0.00104, 0],
      [-0.00042, 3],
      [-0.00444, 2],
      [-0.00048, 3],
      [-0.00043, 3],
      [-0.00036, 3],
      [-0.00046, 3],
      [-0.00102, 0],
      [-0.00032, 3],
      [-0.00027, 3],
      [-0.00018, 3],
      [-0.00143, 0],
      [-0.00117, 0],
      [0.00205, 1],
      [-0.00037, 3],
      [-0.00131, 0],
      [-0.00029, 3]
    ],
    "red_o_points": [],
    "y_categories": ["N", "NOT APPLICABLE", "Y", "nan"],
    "blue_o_points": [],
    "blue_x_points": [
      [0.0047, 1],
      [2e-5, 3],
      [0.00363, 1],
      [4e-5, 0],
      [-0.00089, 0],
      [0.00329, 1],
      [-9e-5, 3],
      [0.0031, 1],
      [-0.00014, 3],
      [6e-5, 3]
    ]
  },
  "QA_lstPexMuscstrength[FingersFlex]": {
    "red_x_points": [
      [0.00029, 0],
      [0.0003, 2],
      [-0.00337, 1],
      [-0.00189, 1],
      [0.00015, 0],
      [0.00036, 0],
      [0.00032, 0],
      [-0.00347, 1],
      [0.0001, 0],
      [0.00024, 0],
      [0.00039, 0],
      [0.00045, 0],
      [-0.00472, 1],
      [0.00021, 2],
      [0.00055, 2],
      [0.00029, 2],
      [0.00016, 0],
      [0.00042, 2],
      [0.00059, 2],
      [0.00028, 0],
      [-0.00394, 1],
      [0.0001, 0],
      [-0.00193, 1],
      [0.00042, 2],
      [0.00055, 2],
      [0.0009, 2],
      [0.00039, 0],
      [0.00027, 0],
      [0.00038, 2],
      [-0.00507, 1],
      [-0.00269, 1],
      [0.00051, 2]
    ],
    "red_o_points": [],
    "y_categories": ["GREATER THAN OR EQUALS TO 3", "LESS THAN 3", "nan"],
    "blue_o_points": [],
    "blue_x_points": [
      [5e-5, 2],
      [0.00068, 2],
      [0.00062, 0],
      [0.00222, 2],
      [0.00144, 0],
      [0.00068, 0],
      [0.00167, 0],
      [0.00041, 0],
      [0.00195, 2],
      [0.00175, 2]
    ]
  },
  "participant_code": {
    "red_x_points": [
      [-0.02817, 1],
      [-0.02676, 2],
      [-0.02652, 3],
      [-0.02711, 4],
      [-0.02717, 5],
      [-0.02741, 6],
      [-0.02776, 7],
      [-0.02835, 8],
      [-0.02682, 9],
      [-0.0277, 10],
      [-0.02723, 11],
      [-0.02699, 12],
      [-0.02764, 13],
      [-0.02535, 15],
      [-0.02629, 17],
      [-0.02741, 18],
      [-0.02623, 20],
      [-0.02717, 21],
      [-0.02705, 22],
      [-0.0277, 24],
      [-0.02682, 26],
      [-0.02723, 27],
      [-0.02758, 28],
      [-0.02741, 30],
      [-0.02652, 31],
      [-0.02623, 32],
      [-0.02717, 34],
      [-0.02688, 36],
      [-0.0277, 38],
      [-0.02764, 39],
      [-0.02711, 40],
      [-0.02694, 41]
    ],
    "red_o_points": [],
    "y_categories": [
      "P16554",
      "P18297",
      "P19283",
      "P19287",
      "P23391",
      "P30595",
      "P31645",
      "P31691",
      "P34778",
      "P35046",
      "P36328",
      "P43633",
      "P4544",
      "P46417",
      "P48965",
      "P53068",
      "P5497",
      "P59529",
      "P62483",
      "P64658",
      "P65202",
      "P66816",
      "P6751",
      "P7408",
      "P75566",
      "P76226",
      "P79971",
      "P82621",
      "P82990",
      "P84549",
      "P84932",
      "P85825",
      "P86989",
      "P8770",
      "P87791",
      "P90550",
      "P93159",
      "P94969",
      "P96710",
      "P97130",
      "P9744",
      "P98500",
      "nan"
    ],
    "blue_o_points": [],
    "blue_x_points": [
      [0.05731, 0],
      [0.05561, 14],
      [0.05434, 16],
      [0.05646, 19],
      [0.05618, 23],
      [0.05702, 25],
      [0.05942, 29],
      [0.05434, 33],
      [0.05745, 35],
      [0.05731, 37]
    ]
  },
  "QA_lstPexTouch[T1]": {
    "red_x_points": [
      [-0.00985, 1],
      [-0.00158, 2],
      [0.00056, 1],
      [-0.00158, 2],
      [-0.01014, 1],
      [-0.00779, 0],
      [0.0008, 1],
      [0.00138, 1],
      [-0.01117, 1],
      [-0.00378, 0],
      [-0.003, 0],
      [-0.0064, 0],
      [0.00685, 0],
      [-0.0068, 2],
      [-0.00535, 2],
      [-0.00256, 2],
      [-0.01048, 1],
      [-0.00155, 2],
      [-0.00632, 2],
      [0.00679, 0],
      [-0.01066, 1],
      [0.00851, 0],
      [-0.00252, 2],
      [-0.00457, 2],
      [-0.01047, 1],
      [0.00854, 0],
      [0.00204, 1],
      [-0.00213, 2],
      [-0.00295, 1],
      [-0.0073, 2],
      [0.00033, 1],
      [-0.01142, 1]
    ],
    "red_o_points": [],
    "y_categories": ["NORM", "NPV", "nan"],
    "blue_o_points": [],
    "blue_x_points": [
      [0.0003, 1],
      [0.00031, 2],
      [0.00143, 1],
      [0.00621, 1],
      [0.01053, 1],
      [0.00026, 1],
      [0.01247, 0],
      [0.00415, 0],
      [0.01195, 0],
      [0.01675, 0]
    ]
  },
  "QA_mulInjOrthesisType[ArmSling]": {
    "red_x_points": [
      [-0.00655, 2],
      [-0.006, 2],
      [-0.0066, 2],
      [-0.00626, 2],
      [-0.00666, 2],
      [-0.00637, 2],
      [-0.00611, 2],
      [-0.00637, 2],
      [-0.00609, 2],
      [-0.00682, 2],
      [-0.00648, 2],
      [-0.0063, 2],
      [-0.00596, 2],
      [0.01268, 1],
      [-0.00812, 2],
      [-0.00724, 2],
      [-0.00721, 2],
      [-0.01159, 0],
      [0.01292, 1],
      [-0.00567, 2],
      [-0.00644, 2],
      [-0.01922, 0],
      [-0.00343, 3],
      [-0.0083, 2],
      [0.00911, 1],
      [-0.00681, 2],
      [-0.00664, 2],
      [-0.00615, 2],
      [-0.01389, 3],
      [-0.00224, 3],
      [-0.00595, 2],
      [-0.00727, 2]
    ],
    "red_o_points": [],
    "y_categories": ["N", "NOT APPLICABLE", "Y", "nan"],
    "blue_o_points": [],
    "blue_x_points": [
      [0.00312, 2],
      [0.02301, 1],
      [0.01508, 1],
      [0.03295, 1],
      [-0.00446, 2],
      [0.01556, 1],
      [-0.00278, 2],
      [0.01498, 1],
      [-0.00142, 2],
      [0.0109, 3]
    ]
  },
  "QS_mulGraftNerve[Ul]": {
    "red_x_points": [
      [-0.0, 2],
      [-6e-5, 0],
      [-6e-5, 0],
      [-6e-5, 0],
      [-0.0, 2],
      [-6e-5, 0],
      [-6e-5, 0],
      [-0.0, 2],
      [-6e-5, 0],
      [-6e-5, 0],
      [-6e-5, 0],
      [9e-5, 1],
      [-0.0, 2],
      [-0.0, 2],
      [-6e-5, 0],
      [-0.0, 2],
      [-0.0, 2],
      [-6e-5, 0],
      [-0.0, 2],
      [-0.0, 2],
      [-0.0, 2],
      [-6e-5, 0],
      [9e-5, 1],
      [-6e-5, 0]
    ],
    "red_o_points": [],
    "y_categories": ["N", "NOT APPLICABLE", "nan"],
    "blue_o_points": [],
    "blue_x_points": [
      [9e-5, 1],
      [9e-5, 1],
      [-0.0, 2],
      [9e-5, 1],
      [-0.0, 2],
      [-0.0, 2]
    ]
  },
  "QA_mulInjOrthesisType[ShoulderSupport]": {
    "red_x_points": [
      [-0.0061, 0],
      [-0.00647, 0],
      [-0.00649, 0],
      [-0.00643, 0],
      [-0.00616, 0],
      [-0.00635, 0],
      [-0.00612, 0],
      [-0.00622, 0],
      [-0.01942, 2],
      [-0.00626, 0],
      [-0.00626, 0],
      [-0.00637, 0],
      [-0.00601, 0],
      [0.01398, 1],
      [-0.00742, 0],
      [-0.00642, 0],
      [-0.00683, 0],
      [-0.01225, 2],
      [0.01392, 1],
      [-0.00484, 0],
      [-0.00561, 0],
      [-0.02032, 2],
      [-0.00345, 3],
      [-0.00753, 0],
      [0.00889, 1],
      [-0.0064, 0],
      [-0.00619, 0],
      [-0.00563, 0],
      [-0.01183, 3],
      [-0.00241, 3],
      [-0.00601, 0],
      [-0.00753, 0]
    ],
    "red_o_points": [],
    "y_categories": ["N", "NOT APPLICABLE", "Y", "nan"],
    "blue_o_points": [],
    "blue_x_points": [
      [0.00194, 0],
      [0.02178, 1],
      [0.01588, 1],
      [0.03432, 1],
      [-0.00423, 0],
      [0.01625, 1],
      [-0.00079, 0],
      [0.01541, 1],
      [-0.00174, 0],
      [0.01387, 3]
    ]
  },
  "QA_yonInjUnconscio": {
    "red_x_points": [
      [-0.00698, 1],
      [-0.00806, 1],
      [-0.0058, 2],
      [-0.00444, 2],
      [-0.00369, 2],
      [0.02121, 0],
      [-0.00935, 1],
      [-0.00535, 2],
      [-0.00412, 2],
      [-0.00683, 2],
      [-0.00539, 2],
      [-0.013, 1],
      [-0.00724, 1],
      [-0.01968, 1],
      [-0.00669, 2],
      [-0.00455, 2],
      [-0.00441, 2],
      [-0.0087, 1],
      [0.00759, 0],
      [-0.0094, 1],
      [-0.00654, 1],
      [-0.00798, 1],
      [-0.00778, 1],
      [-0.00647, 2],
      [-0.0091, 1],
      [-0.00479, 2],
      [-0.01014, 1],
      [-0.00765, 1],
      [-0.00198, 2],
      [-0.00427, 2],
      [-0.00903, 1],
      [-0.00455, 2]
    ],
    "red_o_points": [],
    "y_categories": ["N", "Y", "nan"],
    "blue_o_points": [],
    "blue_x_points": [
      [0.00049, 2],
      [0.00843, 1],
      [0.01827, 0],
      [0.03282, 0],
      [0.03067, 0],
      [0.0009, 2],
      [-0.00302, 1],
      [0.00026, 2],
      [0.02987, 0],
      [-0.00103, 2]
    ]
  },
  "QS_mulTransfSite[Other]": {
    "red_x_points": [
      [-0.0015, 3],
      [-0.01486, 0],
      [-0.01523, 0],
      [-0.01495, 0],
      [-0.00177, 3],
      [-0.0165, 0],
      [-0.01613, 0],
      [-0.01512, 0],
      [-0.00201, 3],
      [-0.01555, 0],
      [-0.01517, 0],
      [-0.01578, 0],
      [-0.00177, 3],
      [0.0225, 1],
      [-0.00152, 3],
      [-0.0155, 0],
      [-0.00161, 3],
      [-0.01502, 0],
      [-0.00205, 3],
      [-0.00185, 3],
      [-0.00197, 3],
      [-0.00152, 3],
      [-0.01457, 0],
      [-0.002, 3],
      [-0.00265, 3],
      [-0.00169, 3],
      [-0.0163, 0],
      [-0.01418, 0],
      [0.0216, 1],
      [-0.00148, 3],
      [-0.01512, 0],
      [-0.00183, 3]
    ],
    "red_o_points": [],
    "y_categories": ["N", "NOT APPLICABLE", "Y", "nan"],
    "blue_o_points": [],
    "blue_x_points": [
      [0.02725, 1],
      [-0.00039, 3],
      [0.02281, 1],
      [-0.00624, 0],
      [0.0485, 2],
      [0.02277, 1],
      [-0.00041, 3],
      [0.02188, 1],
      [-0.00027, 3],
      [-0.00057, 3]
    ]
  },
  "QA_lstInjTpbiSide": {
    "red_x_points": [
      [-0.00434, 1],
      [0.00088, 0],
      [-9e-5, 0],
      [0.00034, 0],
      [0.0007, 0],
      [-0.00179, 1],
      [-0.00033, 0],
      [-0.00146, 0],
      [-0.00491, 1],
      [-0.00102, 0],
      [-0.00205, 1],
      [-0.00215, 1],
      [-0.0038, 1],
      [-0.01587, 0],
      [-0.00894, 1],
      [-0.00316, 1],
      [0.0019, 0],
      [-0.00268, 1],
      [-0.01011, 1],
      [0.00108, 0],
      [0.00064, 0],
      [-3e-5, 0],
      [7e-5, 0],
      [0.00356, 0],
      [-0.00696, 1],
      [-0.0059, 1],
      [-0.00142, 1],
      [-0.00094, 1],
      [-0.0148, 0],
      [-0.00753, 1],
      [-0.00061, 0],
      [0.00237, 0]
    ],
    "red_o_points": [],
    "y_categories": ["L", "R", "nan"],
    "blue_o_points": [],
    "blue_x_points": [
      [-0.00542, 0],
      [0.00969, 0],
      [0.00957, 1],
      [0.0051, 0],
      [0.00334, 1],
      [0.00959, 1],
      [0.00198, 1],
      [0.00772, 1],
      [0.00646, 0],
      [0.00725, 0]
    ]
  },
  "QS_mulGraftNerve[Me]": {
    "red_x_points": [
      [-1e-5, 2],
      [-4e-5, 0],
      [-4e-5, 0],
      [-4e-5, 0],
      [-1e-5, 2],
      [-4e-5, 0],
      [-4e-5, 0],
      [-1e-5, 2],
      [-4e-5, 0],
      [-1e-5, 2],
      [-1e-5, 2],
      [-4e-5, 0],
      [-4e-5, 0],
      [-1e-5, 2],
      [-1e-5, 2],
      [-1e-5, 2],
      [-4e-5, 0],
      [-1e-5, 2],
      [-1e-5, 2],
      [-1e-5, 2],
      [-4e-5, 0],
      [-4e-5, 0],
      [-1e-5, 2],
      [-4e-5, 0]
    ],
    "red_o_points": [],
    "y_categories": ["N", "NOT APPLICABLE", "nan"],
    "blue_o_points": [],
    "blue_x_points": [
      [0.00014, 1],
      [0.00014, 1],
      [-4e-5, 0],
      [0.00014, 1],
      [-1e-5, 2],
      [0.00014, 1],
      [-1e-5, 2],
      [-1e-5, 2]
    ]
  },
  "QS_mulBpsurgeryType[Lysis]": {
    "red_x_points": [
      [-0.00185, 3],
      [-0.00578, 0],
      [-0.01424, 2],
      [-0.00604, 0],
      [-0.0022, 3],
      [-0.00624, 0],
      [-0.01318, 2],
      [-0.00533, 0],
      [-0.00251, 3],
      [-0.00571, 0],
      [-0.00613, 0],
      [-0.00465, 0],
      [-0.00247, 3],
      [0.01367, 1],
      [-0.00197, 3],
      [-0.00597, 0],
      [-0.00223, 3],
      [-0.01313, 2],
      [-0.00208, 3],
      [-0.00259, 3],
      [-0.00214, 3],
      [-0.00206, 3],
      [-0.00497, 0],
      [-0.00218, 3],
      [-0.00264, 3],
      [-0.0017, 3],
      [-0.00537, 0],
      [-0.00504, 0],
      [0.01321, 1],
      [-0.00161, 3],
      [-0.01376, 2],
      [-0.00221, 3]
    ],
    "red_o_points": [],
    "y_categories": ["N", "NOT APPLICABLE", "Y", "nan"],
    "blue_o_points": [],
    "blue_x_points": [
      [0.02148, 1],
      [0.00017, 3],
      [0.01661, 1],
      [0.00128, 0],
      [-0.00022, 0],
      [0.01708, 1],
      [-0.00069, 3],
      [0.01776, 1],
      [-0.0006, 3],
      [-0.00015, 3]
    ]
  },
  "QS_mulLysisSite[Trunk]": {
    "red_x_points": [
      [-0.00075, 3],
      [-0.00253, 0],
      [-0.00313, 0],
      [-0.00326, 0],
      [-0.00088, 3],
      [-0.00327, 0],
      [-0.00683, 2],
      [-0.00297, 0],
      [-0.00103, 3],
      [-0.00295, 0],
      [-0.00337, 0],
      [-0.00274, 0],
      [-0.0012, 3],
      [0.00583, 1],
      [-0.00078, 3],
      [-0.003, 0],
      [-0.00085, 3],
      [-0.00702, 2],
      [-0.00084, 3],
      [-0.00108, 3],
      [-0.00082, 3],
      [-0.00086, 3],
      [-0.00286, 0],
      [-0.00059, 3],
      [-0.00105, 3],
      [-0.00084, 3],
      [-0.0026, 0],
      [-0.00275, 0],
      [0.00679, 1],
      [-0.00064, 3],
      [-0.00707, 2],
      [-0.00085, 3]
    ],
    "red_o_points": [],
    "y_categories": ["N", "NOT APPLICABLE", "Y", "nan"],
    "blue_o_points": [],
    "blue_x_points": [
      [0.01059, 1],
      [-0.0001, 3],
      [0.00779, 1],
      [0.00043, 0],
      [-0.00048, 0],
      [0.00926, 1],
      [-0.00049, 3],
      [0.00839, 1],
      [-0.00013, 3],
      [-0.00032, 3]
    ]
  },
  "QS_mulGraftTrunk[UpperTrunk]": {
    "red_x_points": [
      [-0.00033, 3],
      [-0.0005, 0],
      [-0.00074, 0],
      [-0.00053, 0],
      [-0.00027, 3],
      [-0.0008, 0],
      [-0.00064, 0],
      [-0.00066, 0],
      [-0.0003, 3],
      [-0.00066, 0],
      [-0.00074, 0],
      [-0.00076, 0],
      [-0.00038, 3],
      [0.00099, 1],
      [-0.00034, 3],
      [-0.00259, 2],
      [-0.00049, 3],
      [-0.0005, 0],
      [-0.00038, 3],
      [-0.00037, 3],
      [-0.00023, 3],
      [-0.00035, 3],
      [-0.00065, 0],
      [-0.0003, 3],
      [-0.00029, 3],
      [-0.00025, 3],
      [-0.0006, 0],
      [-0.00066, 0],
      [0.00171, 1],
      [-0.00023, 3],
      [-0.00063, 0],
      [-0.0004, 3]
    ],
    "red_o_points": [],
    "y_categories": ["N", "NOT APPLICABLE", "Y", "nan"],
    "blue_o_points": [],
    "blue_x_points": [
      [0.00247, 1],
      [-0.00027, 3],
      [0.00142, 1],
      [0.00038, 0],
      [-0.00037, 0],
      [0.00236, 1],
      [-0.00012, 3],
      [0.0023, 1],
      [-0.00015, 3],
      [-0.00014, 3]
    ]
  },
  "QS_mulTransfSite[PhMc]": {
    "red_x_points": [
      [-0.00073, 3],
      [-0.00299, 0],
      [-0.00278, 0],
      [-0.00345, 0],
      [-0.00094, 3],
      [-0.00338, 0],
      [-0.00245, 0],
      [-0.00802, 2],
      [-0.0011, 3],
      [-0.00347, 0],
      [-0.00308, 0],
      [-0.00342, 0],
      [-0.00089, 3],
      [0.00651, 1],
      [-0.00074, 3],
      [-0.00352, 0],
      [-0.00091, 3],
      [-0.00306, 0],
      [-0.00112, 3],
      [-0.00078, 3],
      [-0.00066, 3],
      [-0.0008, 3],
      [-0.00544, 2],
      [-0.00086, 3],
      [-0.00127, 3],
      [-0.00078, 3],
      [-0.00292, 0],
      [-0.00316, 0],
      [0.00645, 1],
      [-0.00065, 3],
      [-0.00258, 0],
      [-0.0006, 3]
    ],
    "red_o_points": [],
    "y_categories": ["N", "NOT APPLICABLE", "Y", "nan"],
    "blue_o_points": [],
    "blue_x_points": [
      [0.00967, 1],
      [-0.00021, 3],
      [0.00749, 1],
      [-6e-5, 0],
      [-0.00095, 0],
      [0.00797, 1],
      [-0.00031, 3],
      [0.00923, 1],
      [-0.00026, 3],
      [-0.00011, 3]
    ]
  },
  "QA_mulInjTbpiCause[Motorcycle]": {
    "red_x_points": [
      [-0.00104, 0],
      [-0.00071, 1],
      [-0.00069, 1],
      [-0.00069, 1],
      [-0.00039, 1],
      [-0.00078, 1],
      [-0.00029, 1],
      [-0.00065, 1],
      [0.00016, 1],
      [-0.00083, 1],
      [-0.00045, 1],
      [-0.00027, 1],
      [-0.00406, 0],
      [-0.03725, 1],
      [-0.00114, 1],
      [-0.00119, 1],
      [-0.00059, 1],
      [-0.00069, 1],
      [-0.00133, 1],
      [-0.00913, 0],
      [2e-5, 1],
      [0.0017, 1],
      [-0.00045, 1],
      [-0.00126, 1],
      [-0.0009, 1],
      [-0.00653, 0],
      [-0.00054, 1],
      [-0.0003, 1],
      [-0.0381, 1],
      [-0.00051, 1],
      [-0.00037, 1],
      [-0.00099, 1]
    ],
    "red_o_points": [],
    "y_categories": ["N", "Y", "nan"],
    "blue_o_points": [],
    "blue_x_points": [
      [0.01884, 0],
      [-0.00062, 1],
      [0.01461, 0],
      [-0.00122, 1],
      [8e-5, 1],
      [0.01648, 0],
      [0.0029, 1],
      [0.01587, 0],
      [0.00329, 1],
      [0.00251, 1]
    ]
  },
  "QS_mulLysisRoot[C6]": {
    "red_x_points": [
      [-0.00091, 3],
      [-0.00215, 0],
      [-0.00616, 2],
      [-0.00204, 0],
      [-0.00081, 3],
      [-0.00191, 0],
      [-0.00198, 0],
      [-0.00225, 0],
      [-0.00123, 3],
      [-0.00223, 0],
      [-0.00209, 0],
      [-0.00163, 0],
      [-0.00097, 3],
      [0.00452, 1],
      [-0.00106, 3],
      [-0.00232, 0],
      [-0.00084, 3],
      [-0.00208, 0],
      [-0.00093, 3],
      [-0.00105, 3],
      [-0.00081, 3],
      [-0.00069, 3],
      [-0.00189, 0],
      [-0.00098, 3],
      [-0.00077, 3],
      [-0.00079, 3],
      [-0.00187, 0],
      [-0.00219, 0],
      [0.00513, 1],
      [-0.00077, 3],
      [-0.00663, 2],
      [-0.00079, 3]
    ],
    "red_o_points": [],
    "y_categories": ["N", "NOT APPLICABLE", "Y", "nan"],
    "blue_o_points": [],
    "blue_x_points": [
      [0.00834, 1],
      [-0.00038, 3],
      [0.00605, 1],
      [0.00011, 0],
      [-0.00045, 0],
      [0.00572, 1],
      [-0.00053, 3],
      [0.0068, 1],
      [-0.00065, 3],
      [-0.00038, 3]
    ]
  },
  "QA_lstPexMuscstrength[ThumbOppo]": {
    "red_x_points": [
      [-0.00722, 1],
      [0.0008, 2],
      [-0.00525, 1],
      [-0.0045, 1],
      [-0.00806, 1],
      [0.00106, 0],
      [0.00128, 0],
      [-0.00672, 1],
      [0.00104, 0],
      [0.00153, 0],
      [0.00133, 0],
      [0.00164, 0],
      [0.00155, 0],
      [0.00072, 2],
      [0.00105, 2],
      [0.00098, 2],
      [0.00116, 0],
      [0.00092, 2],
      [0.00121, 2],
      [0.00135, 0],
      [-0.00748, 1],
      [0.00103, 0],
      [-0.00511, 1],
      [0.00141, 2],
      [0.0015, 2],
      [0.00136, 2],
      [0.00123, 0],
      [-0.00502, 1],
      [0.00118, 2],
      [-0.00938, 1],
      [-0.00748, 1],
      [0.00119, 2]
    ],
    "red_o_points": [],
    "y_categories": ["GREATER THAN OR EQUALS TO 3", "LESS THAN 3", "nan"],
    "blue_o_points": [],
    "blue_x_points": [
      [0.00054, 2],
      [0.00169, 2],
      [0.0013, 0],
      [0.00354, 2],
      [0.00347, 0],
      [0.00133, 0],
      [0.00539, 0],
      [0.00161, 0],
      [0.00282, 2],
      [0.00257, 2]
    ]
  },
  "QS_mulGraftLevel[Trunk]": {
    "red_x_points": [
      [-0.00023, 3],
      [-0.00076, 0],
      [-0.00082, 0],
      [-0.00097, 0],
      [-0.00017, 3],
      [-0.00108, 0],
      [-0.00085, 0],
      [-0.00088, 0],
      [-0.00023, 3],
      [-0.00105, 0],
      [-0.00084, 0],
      [-0.00089, 0],
      [-0.00013, 3],
      [0.00183, 1],
      [-0.00025, 3],
      [-0.0034, 2],
      [-0.00011, 3],
      [-0.00087, 0],
      [-0.00013, 3],
      [-0.00031, 3],
      [-0.00023, 3],
      [-0.00025, 3],
      [-0.00086, 0],
      [-0.00011, 3],
      [-0.00012, 3],
      [-0.00023, 3],
      [-0.0009, 0],
      [-0.00057, 0],
      [0.00165, 1],
      [-0.00015, 3],
      [-0.00092, 0],
      [-0.00035, 3]
    ],
    "red_o_points": [],
    "y_categories": ["N", "NOT APPLICABLE", "Y", "nan"],
    "blue_o_points": [],
    "blue_x_points": [
      [0.00338, 1],
      [3e-5, 3],
      [0.00223, 1],
      [-8e-5, 0],
      [-0.00061, 0],
      [0.00221, 1],
      [-7e-5, 3],
      [0.002, 1],
      [-5e-5, 3],
      [-4e-5, 3]
    ]
  },
  "QS_mulGraftNerve[other]": {
    "red_x_points": [
      [2e-5, 2],
      [-0.00041, 0],
      [-0.00035, 0],
      [-0.00032, 0],
      [0.0, 2],
      [-0.00051, 0],
      [-0.00014, 0],
      [-0.00032, 0],
      [1e-5, 2],
      [-0.00042, 0],
      [-0.00046, 0],
      [-0.00029, 0],
      [1e-5, 2],
      [0.00042, 1],
      [3e-5, 2],
      [-0.00025, 0],
      [-7e-5, 2],
      [-0.00033, 0],
      [-0.00026, 2],
      [-2e-5, 2],
      [-0.0, 2],
      [-2e-5, 2],
      [-0.00022, 0],
      [-9e-5, 2],
      [-0.0, 2],
      [1e-5, 2],
      [-0.00041, 0],
      [-0.00025, 0],
      [0.00046, 1],
      [4e-5, 2],
      [-0.00041, 0],
      [1e-5, 2]
    ],
    "red_o_points": [],
    "y_categories": ["N", "NOT APPLICABLE", "nan"],
    "blue_o_points": [],
    "blue_x_points": [
      [0.00045, 1],
      [5e-5, 2],
      [0.00048, 1],
      [0.00026, 0],
      [-8e-5, 0],
      [0.00054, 1],
      [2e-5, 2],
      [0.00076, 1],
      [-1e-5, 2],
      [-3e-5, 2]
    ]
  },
  "QS_mulTransfSite[AcSsAA]": {
    "red_x_points": [
      [-0.00219, 3],
      [-0.01477, 2],
      [-0.00432, 0],
      [-0.01443, 2],
      [-0.0022, 3],
      [-0.01914, 2],
      [-0.00342, 0],
      [-0.00414, 0],
      [-0.00266, 3],
      [-0.0043, 0],
      [-0.01721, 2],
      [-0.00348, 0],
      [-0.00216, 3],
      [0.01784, 1],
      [-0.00235, 3],
      [-0.01538, 2],
      [-0.00217, 3],
      [-0.004, 0],
      [-0.00218, 3],
      [-0.0025, 3],
      [-0.00216, 3],
      [-0.00251, 3],
      [-0.01483, 2],
      [-0.00233, 3],
      [-0.00232, 3],
      [-0.00236, 3],
      [-0.00402, 0],
      [-0.01486, 2],
      [0.01761, 1],
      [-0.00207, 3],
      [-0.00382, 0],
      [-0.00259, 3]
    ],
    "red_o_points": [],
    "y_categories": ["N", "NOT APPLICABLE", "Y", "nan"],
    "blue_o_points": [],
    "blue_x_points": [
      [0.02508, 1],
      [-0.00052, 3],
      [0.02042, 1],
      [0.00167, 0],
      [0.0013, 0],
      [0.02016, 1],
      [-0.00071, 3],
      [0.01964, 1],
      [-0.00115, 3],
      [-0.00045, 3]
    ]
  },
  "QS_mulGraftNerve[Ax]": {
    "red_x_points": [
      [-6e-5, 0],
      [-6e-5, 0],
      [1e-5, 2],
      [-6e-5, 0],
      [-0.00012, 0],
      [-6e-5, 0],
      [-9e-5, 2],
      [-0.00015, 0],
      [-0.00012, 0],
      [-0.00012, 0],
      [-4e-5, 2],
      [0.00011, 1],
      [1e-5, 2],
      [-6e-5, 0],
      [1e-5, 2],
      [-6e-5, 0],
      [-4e-5, 2],
      [1e-5, 2],
      [-4e-5, 2],
      [-6e-5, 0],
      [1e-5, 2],
      [-0.00015, 0],
      [-9e-5, 0],
      [1e-5, 2],
      [1e-5, 2]
    ],
    "red_o_points": [],
    "y_categories": ["N", "NOT APPLICABLE", "nan"],
    "blue_o_points": [],
    "blue_x_points": [
      [0.00022, 1],
      [1e-5, 2],
      [0.00021, 1],
      [-4e-5, 0],
      [-6e-5, 0],
      [0.00021, 1],
      [-4e-5, 2],
      [0.00011, 1]
    ]
  },
  "QS_mulNeuromadSite[C5]": {
    "red_x_points": [
      [-9e-5, 2],
      [-0.00041, 0],
      [-0.00037, 0],
      [-0.00047, 0],
      [-8e-5, 2],
      [-0.0006, 0],
      [-0.00044, 0],
      [-0.00055, 0],
      [-0.00014, 2],
      [-0.00047, 0],
      [-0.00072, 0],
      [-0.00064, 0],
      [-0.00013, 2],
      [0.0004, 1],
      [-0.00011, 2],
      [-0.00045, 0],
      [-0.00017, 2],
      [-0.00033, 0],
      [-0.0002, 2],
      [-0.0001, 2],
      [-3e-5, 2],
      [-2e-5, 2],
      [-0.00028, 0],
      [-0.00014, 2],
      [-0.00017, 2],
      [-0.00013, 2],
      [-0.00018, 0],
      [-0.00035, 0],
      [0.00066, 1],
      [-0.00011, 2],
      [-0.00044, 0],
      [-0.00013, 2]
    ],
    "red_o_points": [],
    "y_categories": ["N", "NOT APPLICABLE", "nan"],
    "blue_o_points": [],
    "blue_x_points": [
      [0.00109, 1],
      [2e-5, 2],
      [0.00071, 1],
      [0.00036, 0],
      [-0.00022, 0],
      [0.00117, 1],
      [-1e-5, 2],
      [0.00123, 1],
      [-0.00011, 2],
      [-2e-5, 2]
    ]
  },
  "QS_mulNeuromadSite[C7]": {
    "red_x_points": [
      [-9e-5, 2],
      [-0.00081, 0],
      [-0.0005, 0],
      [-0.00042, 0],
      [-7e-5, 2],
      [-0.00083, 0],
      [-0.0005, 0],
      [-0.00063, 0],
      [-0.00024, 2],
      [-0.00061, 0],
      [-0.00077, 0],
      [-0.00057, 0],
      [-4e-5, 2],
      [0.00032, 1],
      [0.0, 2],
      [-0.00082, 0],
      [-0.00031, 2],
      [-0.00081, 0],
      [-0.00018, 2],
      [-4e-5, 2],
      [-7e-5, 2],
      [-4e-5, 2],
      [-0.00061, 0],
      [-0.00014, 2],
      [-6e-5, 2],
      [-4e-5, 2],
      [-0.00052, 0],
      [-0.0005, 0],
      [0.00062, 1],
      [-7e-5, 2],
      [-0.00035, 0],
      [-7e-5, 2]
    ],
    "red_o_points": [],
    "y_categories": ["N", "NOT APPLICABLE", "nan"],
    "blue_o_points": [],
    "blue_x_points": [
      [0.00169, 1],
      [0.00036, 2],
      [0.00083, 1],
      [0.00011, 0],
      [-5e-5, 0],
      [0.00106, 1],
      [5e-5, 2],
      [0.00133, 1],
      [9e-5, 2],
      [0.00028, 2]
    ]
  },
  "QA_lstPexMuscstrength[WristExte]": {
    "red_x_points": [
      [3e-5, 1],
      [-0.00135, 2],
      [-0.00476, 1],
      [-0.00226, 1],
      [0.00051, 1],
      [0.00013, 0],
      [-0.00384, 1],
      [-0.00556, 1],
      [-0.01149, 0],
      [0.00313, 0],
      [0.00014, 0],
      [-0.00651, 1],
      [-0.00894, 0],
      [-0.00061, 2],
      [-0.00051, 2],
      [-0.00128, 2],
      [-0.00552, 0],
      [-0.0028, 2],
      [0.00015, 2],
      [-0.01396, 0],
      [0.00094, 1],
      [-0.01473, 0],
      [-0.00208, 1],
      [-9e-5, 2],
      [-0.00917, 0],
      [0.00195, 1],
      [0.0025, 0],
      [0.00098, 0],
      [-0.00097, 2],
      [-0.00011, 1],
      [-0.00459, 1],
      [-4e-5, 2]
    ],
    "red_o_points": [],
    "y_categories": ["GREATER THAN OR EQUALS TO 3", "LESS THAN 3", "nan"],
    "blue_o_points": [],
    "blue_x_points": [
      [0.00121, 0],
      [0.00232, 2],
      [0.00057, 0],
      [0.00968, 0],
      [0.00687, 0],
      [0.00068, 1],
      [0.01189, 1],
      [0.00063, 0],
      [0.01354, 1],
      [0.01049, 2]
    ]
  },
  "QS_mulGraftNerve[TD]": {
    "red_x_points": [
      [-2e-5, 2],
      [-0.0001, 0],
      [-4e-5, 0],
      [-0.0001, 0],
      [-2e-5, 2],
      [-0.0001, 0],
      [-0.0001, 0],
      [-0.0001, 0],
      [-2e-5, 2],
      [-0.0001, 0],
      [-6e-5, 0],
      [9e-5, 1],
      [-2e-5, 2],
      [-6e-5, 0],
      [-6e-5, 0],
      [-2e-5, 2],
      [-1e-5, 2],
      [-2e-5, 2],
      [-2e-5, 2],
      [-0.0001, 0],
      [-2e-5, 2],
      [-2e-5, 2],
      [-2e-5, 2],
      [-0.0001, 0],
      [-4e-5, 0],
      [0.0002, 1],
      [-2e-5, 2],
      [-4e-5, 0],
      [-2e-5, 2]
    ],
    "red_o_points": [],
    "y_categories": ["N", "NOT APPLICABLE", "nan"],
    "blue_o_points": [],
    "blue_x_points": [
      [0.0002, 1],
      [0.0002, 1],
      [-4e-5, 0],
      [0.0002, 1],
      [-2e-5, 2],
      [0.0002, 1],
      [-1e-5, 2]
    ]
  },
  "QS_mulLysisSite[Nerve]": {
    "red_x_points": [
      [-7e-5, 3],
      [-0.00046, 0],
      [-0.00258, 2],
      [-0.00031, 0],
      [-8e-5, 3],
      [-0.00047, 0],
      [-0.00031, 0],
      [-0.00037, 0],
      [-0.0002, 3],
      [-0.00037, 0],
      [-0.00033, 0],
      [-0.00022, 0],
      [-6e-5, 3],
      [0.00108, 1],
      [-0.0001, 3],
      [-0.00032, 0],
      [-5e-5, 3],
      [-0.00035, 0],
      [-1e-5, 3],
      [-0.00022, 3],
      [-3e-5, 3],
      [-6e-5, 3],
      [-0.00032, 0],
      [-0.00013, 3],
      [-5e-5, 3],
      [-3e-5, 3],
      [-0.00041, 0],
      [-0.00036, 0],
      [0.00096, 1],
      [-7e-5, 3],
      [-0.00038, 0],
      [-8e-5, 3]
    ],
    "red_o_points": [],
    "y_categories": ["N", "NOT APPLICABLE", "Y", "nan"],
    "blue_o_points": [],
    "blue_x_points": [
      [0.00113, 1],
      [-8e-5, 3],
      [0.00087, 1],
      [0.00036, 0],
      [5e-5, 0],
      [0.00107, 1],
      [-5e-5, 3],
      [0.00115, 1],
      [-0.00014, 3],
      [-1e-5, 3]
    ]
  },
  "QS_mulTransfSite[IMc]": {
    "red_x_points": [
      [-0.00166, 3],
      [-0.008, 2],
      [-0.0041, 0],
      [-0.00446, 0],
      [-0.00156, 3],
      [-0.00445, 0],
      [-0.00355, 0],
      [-0.00439, 0],
      [-0.00192, 3],
      [-0.00431, 0],
      [-0.00492, 0],
      [-0.00364, 0],
      [-0.00156, 3],
      [0.00931, 1],
      [-0.00146, 3],
      [-0.00409, 0],
      [-0.00191, 3],
      [-0.00808, 2],
      [-0.00236, 3],
      [-0.00174, 3],
      [-0.00156, 3],
      [-0.00149, 3],
      [-0.00398, 0],
      [-0.00154, 3],
      [-0.00213, 3],
      [-0.00153, 3],
      [-0.00385, 0],
      [-0.00833, 2],
      [0.01008, 1],
      [-0.00162, 3],
      [-0.00902, 2],
      [-0.00157, 3]
    ],
    "red_o_points": [],
    "y_categories": ["N", "NOT APPLICABLE", "Y", "nan"],
    "blue_o_points": [],
    "blue_x_points": [
      [0.01396, 1],
      [-0.00072, 3],
      [0.01295, 1],
      [0.00055, 0],
      [-0.00095, 0],
      [0.01227, 1],
      [-0.0007, 3],
      [0.01245, 1],
      [-0.00082, 3],
      [-0.00024, 3]
    ]
  },
  "QS_mulLysisRoot[C7]": {
    "red_x_points": [
      [-6e-5, 3],
      [-0.00105, 0],
      [-0.00508, 2],
      [-0.00122, 0],
      [-0.0003, 3],
      [-0.00126, 0],
      [-0.00104, 0],
      [-0.00125, 0],
      [-0.00044, 3],
      [-0.00126, 0],
      [-0.00134, 0],
      [-0.00079, 0],
      [-0.00021, 3],
      [0.00256, 1],
      [-0.00041, 3],
      [-0.00113, 0],
      [-0.00025, 3],
      [-0.00104, 0],
      [-0.0001, 3],
      [-0.00041, 3],
      [-0.0001, 3],
      [-0.00027, 3],
      [-0.00118, 0],
      [-0.00019, 3],
      [-0.00018, 3],
      [-0.00015, 3],
      [-0.00128, 0],
      [-0.00106, 0],
      [0.00237, 1],
      [-0.00022, 3],
      [-0.00103, 0],
      [-0.00022, 3]
    ],
    "red_o_points": [],
    "y_categories": ["N", "NOT APPLICABLE", "Y", "nan"],
    "blue_o_points": [],
    "blue_x_points": [
      [0.00329, 1],
      [9e-5, 3],
      [0.00225, 1],
      [0.00032, 0],
      [-0.00012, 0],
      [0.00309, 1],
      [-9e-5, 3],
      [0.00272, 1],
      [-8e-5, 3],
      [0.00013, 3]
    ]
  },
  "QS_lstBpsurgSide": {
    "red_x_points": [
      [-0.00159, 3],
      [-0.00699, 0],
      [-0.0072, 0],
      [-0.00738, 0],
      [-0.00135, 3],
      [-0.00738, 2],
      [-0.00724, 0],
      [-0.00813, 0],
      [-0.00155, 3],
      [-0.00884, 0],
      [-0.00748, 2],
      [-0.00702, 2],
      [-0.00179, 3],
      [0.01182, 1],
      [-0.00118, 3],
      [-0.00769, 2],
      [-0.00188, 3],
      [-0.00741, 2],
      [-0.0016, 3],
      [-0.00223, 3],
      [-0.00138, 3],
      [-0.00168, 3],
      [-0.00647, 0],
      [-0.00126, 3],
      [-0.00172, 3],
      [-0.00128, 3],
      [-0.00697, 2],
      [-0.00592, 2],
      [0.01127, 1],
      [-0.00113, 3],
      [-0.0072, 0],
      [-0.00136, 3]
    ],
    "red_o_points": [],
    "y_categories": ["L", "NOT APPLICABLE", "R", "nan"],
    "blue_o_points": [],
    "blue_x_points": [
      [0.01706, 1],
      [0.00035, 3],
      [0.01522, 1],
      [0.00201, 0],
      [0.00033, 2],
      [0.01537, 1],
      [-0.00079, 3],
      [0.01622, 1],
      [-0.00044, 3],
      [-0.00026, 3]
    ]
  },
  "QA_lstPexPain[T1]": {
    "red_x_points": [
      [-0.00759, 1],
      [-0.00175, 2],
      [-0.00308, 2],
      [-0.00205, 2],
      [-0.00771, 1],
      [-0.00647, 0],
      [0.00081, 1],
      [0.00187, 1],
      [0.00583, 0],
      [0.00181, 1],
      [-0.00258, 0],
      [-0.00636, 0],
      [0.00591, 0],
      [-0.01053, 2],
      [-0.00431, 2],
      [-0.00344, 2],
      [-0.00417, 2],
      [-0.00147, 2],
      [-0.00453, 2],
      [0.00471, 0],
      [-0.00917, 1],
      [0.00618, 0],
      [-0.00282, 2],
      [-0.00487, 2],
      [-0.00897, 1],
      [-0.00498, 2],
      [-0.00416, 2],
      [-0.00222, 2],
      [-0.00565, 1],
      [-0.00992, 1],
      [4e-5, 1],
      [-0.00829, 1]
    ],
    "red_o_points": [],
    "y_categories": ["NORM", "NPV", "nan"],
    "blue_o_points": [],
    "blue_x_points": [
      [-0.0001, 1],
      [-0.00041, 2],
      [0.00542, 0],
      [0.00659, 1],
      [0.01087, 1],
      [-1e-5, 1],
      [0.00906, 0],
      [0.00585, 0],
      [0.01067, 0],
      [0.01237, 0]
    ]
  },
  "QS_mulTransfSite[AcMc]": {
    "red_x_points": [
      [-0.00033, 3],
      [-0.00068, 0],
      [-0.00054, 0],
      [-0.00073, 0],
      [-0.0002, 3],
      [-0.00109, 0],
      [-0.0008, 0],
      [-0.00061, 0],
      [-0.0005, 3],
      [-0.00083, 0],
      [-0.00097, 0],
      [-0.00653, 2],
      [-0.00023, 3],
      [0.00146, 1],
      [-8e-5, 3],
      [-0.00069, 0],
      [-0.00031, 3],
      [-0.00045, 0],
      [-0.0001, 3],
      [-0.00061, 3],
      [-0.00019, 3],
      [-0.00041, 3],
      [-0.00064, 0],
      [-0.0002, 3],
      [-0.00029, 3],
      [-0.00019, 3],
      [-0.00067, 0],
      [-0.00071, 0],
      [0.00151, 1],
      [-0.00017, 3],
      [-0.00078, 0],
      [-0.00017, 3]
    ],
    "red_o_points": [],
    "y_categories": ["N", "NOT APPLICABLE", "Y", "nan"],
    "blue_o_points": [],
    "blue_x_points": [
      [0.00195, 1],
      [-9e-5, 3],
      [0.00258, 1],
      [0.00035, 0],
      [0.00047, 0],
      [0.00248, 1],
      [-5e-5, 3],
      [0.00313, 1],
      [-0.00013, 3],
      [-0.00015, 3]
    ]
  },
  "QA_lstPexKine[Shoulder]": {
    "red_x_points": [
      [-0.00178, 1],
      [-0.0029, 2],
      [-0.00361, 2],
      [-0.00293, 2],
      [-0.00524, 2],
      [-0.00373, 1],
      [-0.00226, 1],
      [0.00462, 0],
      [-0.00722, 2],
      [-0.00237, 1],
      [-0.00295, 1],
      [-0.00379, 1],
      [-0.00201, 1],
      [-0.00119, 2],
      [-0.00402, 2],
      [-0.00205, 1],
      [-0.00463, 2],
      [-0.0025, 2],
      [-0.00439, 2],
      [-0.00277, 1],
      [-0.00148, 1],
      [-0.00296, 1],
      [-0.00254, 2],
      [-0.00416, 2],
      [-0.00222, 1],
      [-0.00566, 2],
      [-0.00547, 2],
      [-0.00367, 2],
      [-0.00128, 2],
      [-0.00409, 2],
      [-0.00134, 1],
      [-0.00481, 2]
    ],
    "red_o_points": [],
    "y_categories": ["NPV", "PV", "nan"],
    "blue_o_points": [],
    "blue_x_points": [
      [-0.00022, 1],
      [-0.00207, 2],
      [-0.00031, 1],
      [0.00058, 1],
      [0.02724, 0],
      [-0.00036, 1],
      [0.03534, 0],
      [-0.0007, 2],
      [-0.00021, 1],
      [6e-5, 1]
    ]
  },
  "QA_yonInjBpsurg": {
    "red_x_points": [
      [-0.00199, 1],
      [-0.00158, 1],
      [-0.00189, 1],
      [-0.00181, 1],
      [-0.00214, 1],
      [-0.00213, 1],
      [-0.00153, 1],
      [-0.00139, 1],
      [-0.00237, 1],
      [-0.00195, 1],
      [-0.00162, 1],
      [-0.00142, 1],
      [-0.00232, 1],
      [0.00366, 0],
      [-0.00191, 1],
      [-0.00181, 1],
      [-0.00228, 1],
      [-0.00136, 1],
      [-0.00183, 1],
      [-0.0023, 1],
      [-0.00206, 1],
      [-0.00205, 1],
      [-0.00138, 1],
      [-0.00205, 1],
      [-0.00276, 1],
      [-0.00191, 1],
      [-0.00186, 1],
      [-0.00149, 1],
      [0.00394, 0],
      [-0.00168, 1],
      [-0.00131, 1],
      [-0.00183, 1]
    ],
    "red_o_points": [],
    "y_categories": ["N", "Y", "nan"],
    "blue_o_points": [],
    "blue_x_points": [
      [0.0081, 0],
      [-0.00016, 1],
      [0.00788, 0],
      [-0.00162, 1],
      [-0.00173, 1],
      [0.00814, 0],
      [-0.0009, 1],
      [0.00924, 0],
      [-0.0007, 1],
      [-0.00058, 1]
    ]
  },
  "QA_lstPexTouch[C8]": {
    "red_x_points": [
      [-0.00725, 1],
      [-0.00227, 2],
      [-0.00283, 1],
      [-0.00201, 2],
      [-0.0078, 1],
      [0.00186, 0],
      [-0.00306, 1],
      [-0.00286, 1],
      [0.00511, 0],
      [-0.00342, 1],
      [0.00313, 0],
      [0.00225, 0],
      [-0.00838, 1],
      [-0.012, 2],
      [-0.00446, 2],
      [-0.00248, 2],
      [-0.00853, 1],
      [-0.00217, 2],
      [-0.00415, 2],
      [0.00578, 0],
      [-0.00969, 1],
      [0.00534, 0],
      [-0.00247, 2],
      [-0.00369, 2],
      [0.00297, 0],
      [0.00536, 0],
      [-0.00231, 1],
      [-0.00175, 2],
      [-0.00732, 1],
      [-0.00436, 2],
      [-0.0028, 1],
      [-0.00876, 1]
    ],
    "red_o_points": [],
    "y_categories": ["NORM", "NPV", "nan"],
    "blue_o_points": [],
    "blue_x_points": [
      [0.00988, 0],
      [-0.00061, 2],
      [0.00062, 1],
      [0.00198, 1],
      [0.00652, 0],
      [3e-5, 1],
      [0.00854, 0],
      [0.00495, 0],
      [0.00884, 0],
      [0.01126, 0]
    ]
  },
  "QA_lstPexMuscstrength[FingersAbdu]": {
    "red_x_points": [
      [-0.00017, 2],
      [0.00024, 2],
      [-0.00311, 1],
      [-0.00191, 1],
      [-0.00036, 1],
      [0.0012, 0],
      [0.00053, 0],
      [-0.00275, 1],
      [-0.00836, 0],
      [0.00101, 0],
      [-0.00037, 2],
      [-0.00442, 1],
      [-0.00468, 0],
      [0.00013, 2],
      [-0.0001, 2],
      [-5e-5, 2],
      [-0.00191, 0],
      [-0.00041, 2],
      [7e-5, 2],
      [-0.00878, 0],
      [-0.0001, 1],
      [-0.00914, 0],
      [-0.00197, 1],
      [1e-5, 2],
      [-3e-5, 2],
      [0.00026, 2],
      [-0.00397, 1],
      [-0.00206, 1],
      [0.00021, 2],
      [-0.00062, 1],
      [-0.00303, 1],
      [-0.00014, 2]
    ],
    "red_o_points": [],
    "y_categories": ["GREATER THAN OR EQUALS TO 3", "LESS THAN 3", "nan"],
    "blue_o_points": [],
    "blue_x_points": [
      [5e-5, 2],
      [0.00066, 2],
      [0.00057, 0],
      [0.00272, 2],
      [0.00512, 0],
      [0.00101, 0],
      [0.0144, 1],
      [0.0008, 0],
      [0.00372, 2],
      [0.00365, 2]
    ]
  },
  "QS_mulBpsurgeryType[Graft]": {
    "red_x_points": [
      [-0.00012, 3],
      [-0.00021, 0],
      [-0.00032, 0],
      [-0.00032, 0],
      [-0.00011, 3],
      [-0.00038, 0],
      [-0.00034, 0],
      [-0.00026, 0],
      [-9e-5, 3],
      [-0.0004, 0],
      [-0.00021, 0],
      [-0.00024, 0],
      [-8e-5, 3],
      [0.00032, 1],
      [-0.00016, 3],
      [-0.00267, 2],
      [-0.00018, 3],
      [-4e-5, 0],
      [-0.00011, 3],
      [-0.00011, 3],
      [-6e-5, 3],
      [-8e-5, 3],
      [-0.00023, 0],
      [-0.00015, 3],
      [-0.00017, 3],
      [-0.0001, 3],
      [-0.00034, 0],
      [-0.00025, 0],
      [0.00035, 1],
      [-0.00014, 3],
      [-0.00033, 0],
      [-7e-5, 3]
    ],
    "red_o_points": [],
    "y_categories": ["N", "NOT APPLICABLE", "Y", "nan"],
    "blue_o_points": [],
    "blue_x_points": [
      [0.00122, 1],
      [-4e-5, 3],
      [0.0009, 1],
      [0.00123, 0],
      [-0.0003, 0],
      [0.001, 1],
      [-8e-5, 3],
      [0.00084, 1],
      [-5e-5, 3],
      [-0.00011, 3]
    ]
  },
  "QS_mulLysisRoot[C5]": {
    "red_x_points": [
      [-0.00111, 3],
      [-0.00265, 0],
      [-0.00815, 2],
      [-0.00281, 0],
      [-0.00098, 3],
      [-0.00294, 0],
      [-0.00244, 0],
      [-0.00307, 0],
      [-0.00159, 3],
      [-0.003, 0],
      [-0.00302, 0],
      [-0.00198, 0],
      [-0.00109, 3],
      [0.00622, 1],
      [-0.00125, 3],
      [-0.00298, 0],
      [-0.00121, 3],
      [-0.00271, 0],
      [-0.00109, 3],
      [-0.00169, 3],
      [-0.00078, 3],
      [-0.00077, 3],
      [-0.00253, 0],
      [-0.00115, 3],
      [-0.00152, 3],
      [-0.00085, 3],
      [-0.00292, 0],
      [-0.00261, 0],
      [0.00661, 1],
      [-0.00096, 3],
      [-0.00723, 2],
      [-0.00121, 3]
    ],
    "red_o_points": [],
    "y_categories": ["N", "NOT APPLICABLE", "Y", "nan"],
    "blue_o_points": [],
    "blue_x_points": [
      [0.0094, 1],
      [-0.00031, 3],
      [0.00851, 1],
      [0.00082, 0],
      [-3e-5, 0],
      [0.00824, 1],
      [-0.00036, 3],
      [0.00992, 1],
      [-0.00055, 3],
      [-0.0006, 3]
    ]
  },
  "QS_mulNeuromadSite[C6]": {
    "red_x_points": [
      [-0.00015, 2],
      [-0.0009, 0],
      [-0.00061, 0],
      [-0.00092, 0],
      [-0.00013, 2],
      [-0.00066, 0],
      [-0.00067, 0],
      [-0.00081, 0],
      [-0.00024, 2],
      [-0.00085, 0],
      [-0.00073, 0],
      [-0.0004, 0],
      [-0.00017, 2],
      [0.00112, 1],
      [-9e-5, 2],
      [-0.00071, 0],
      [-8e-5, 2],
      [-0.00059, 0],
      [-0.00019, 2],
      [-0.0001, 2],
      [-0.0001, 2],
      [-0.00024, 2],
      [-0.00043, 0],
      [-5e-5, 2],
      [-0.00023, 2],
      [-0.00016, 2],
      [-0.00065, 0],
      [-0.00072, 0],
      [0.00098, 1],
      [-0.00021, 2],
      [-0.00043, 0],
      [-0.00014, 2]
    ],
    "red_o_points": [],
    "y_categories": ["N", "NOT APPLICABLE", "nan"],
    "blue_o_points": [],
    "blue_x_points": [
      [0.00195, 1],
      [1e-5, 2],
      [0.00143, 1],
      [5e-5, 0],
      [2e-5, 0],
      [0.00166, 1],
      [-0.0001, 2],
      [0.00131, 1],
      [0.0, 2],
      [2e-5, 2]
    ]
  },
  "QS_mulNeuromadSite[T1]": {
    "red_x_points": [
      [-0.00023, 2],
      [-0.00135, 0],
      [-0.00112, 0],
      [-0.00129, 0],
      [-0.00013, 2],
      [-0.00133, 0],
      [-0.00106, 0],
      [-0.00107, 0],
      [-0.00035, 2],
      [-0.0011, 0],
      [-0.00148, 0],
      [-0.00118, 0],
      [-0.00029, 2],
      [0.00139, 1],
      [-0.00026, 2],
      [-0.00112, 0],
      [-0.00039, 2],
      [-0.00117, 0],
      [-0.00031, 2],
      [-0.00021, 2],
      [-0.00027, 2],
      [-0.00046, 2],
      [-0.00118, 0],
      [-0.00024, 2],
      [-0.00014, 2],
      [-0.00022, 2],
      [-0.0011, 0],
      [-0.00081, 0],
      [0.00223, 1],
      [-0.00013, 2],
      [-0.00105, 0],
      [-0.00019, 2]
    ],
    "red_o_points": [],
    "y_categories": ["N", "NOT APPLICABLE", "nan"],
    "blue_o_points": [],
    "blue_x_points": [
      [0.00356, 1],
      [-5e-5, 2],
      [0.00215, 1],
      [-0.00021, 0],
      [-0.0004, 0],
      [0.00211, 1],
      [-0.0001, 2],
      [0.00321, 1],
      [-2e-5, 2],
      [0.00011, 2]
    ]
  },
  "QA_lstPexPalle[Clavicle]": {
    "red_x_points": [
      [-0.0036, 3],
      [-0.00116, 3],
      [-0.00115, 3],
      [-0.00151, 3],
      [-0.0041, 3],
      [-0.009, 2],
      [-0.00588, 2],
      [-0.00156, 3],
      [-0.0034, 3],
      [-0.00262, 3],
      [-0.00723, 2],
      [-0.00863, 2],
      [-0.0093, 0],
      [0.0, 3],
      [-0.0036, 3],
      [-0.0019, 3],
      [-0.00387, 3],
      [-0.00089, 3],
      [-0.00301, 3],
      [-0.01122, 0],
      [-0.01058, 0],
      [-0.003, 2],
      [0.0007, 1],
      [-0.00341, 3],
      [-0.00643, 2],
      [-0.00339, 3],
      [-0.00234, 3],
      [-0.00162, 3],
      [-0.01937, 2],
      [-0.00285, 3],
      [0.00077, 0],
      [-0.00371, 3]
    ],
    "red_o_points": [],
    "y_categories": ["HYPO", "NAIA", "PT", "nan"],
    "blue_o_points": [],
    "blue_x_points": [
      [0.00176, 3],
      [-0.00126, 3],
      [0.00932, 0],
      [0.00067, 3],
      [0.02253, 0],
      [0.00152, 3],
      [0.04284, 1],
      [0.00173, 3],
      [0.01062, 2],
      [3e-5, 3]
    ]
  },
  "QA_lstPexMuscstrength[ShoulderAbduc]": {
    "red_x_points": [
      [-0.00362, 1],
      [-0.00322, 1],
      [-0.00329, 1],
      [-0.00346, 1],
      [-0.00364, 1],
      [-0.00411, 1],
      [-0.00343, 1],
      [-0.00348, 1],
      [-0.00342, 1],
      [-0.00382, 1],
      [-0.00357, 1],
      [-0.00339, 1],
      [-0.00381, 1],
      [0.0009, 2],
      [0.00159, 2],
      [0.00115, 2],
      [0.00102, 2],
      [0.00129, 2],
      [0.00125, 2],
      [-0.00336, 1],
      [-0.00357, 1],
      [-0.00349, 1],
      [-0.00309, 1],
      [0.00133, 2],
      [-0.00441, 1],
      [-0.00326, 1],
      [-0.0032, 1],
      [-0.00342, 1],
      [0.00192, 2],
      [-0.0033, 1],
      [-0.00323, 1],
      [0.00138, 2]
    ],
    "red_o_points": [],
    "y_categories": ["GREATER THAN OR EQUALS TO 3", "LESS THAN 3", "nan"],
    "blue_o_points": [],
    "blue_x_points": [
      [0.00157, 2],
      [0.00181, 2],
      [0.01817, 0],
      [0.00212, 2],
      [-0.0022, 1],
      [0.01974, 0],
      [0.00204, 2],
      [-0.00144, 1],
      [-0.00238, 1],
      [-0.00182, 1]
    ]
  },
  "QA_lstPexTouch[C7]": {
    "red_x_points": [
      [-0.00775, 1],
      [-0.00201, 2],
      [-0.0031, 1],
      [-0.00212, 2],
      [-0.00949, 1],
      [0.00197, 0],
      [-0.0032, 1],
      [-0.00297, 1],
      [0.00645, 0],
      [-0.00327, 1],
      [0.0035, 0],
      [-0.00458, 1],
      [-0.01037, 1],
      [-0.00848, 2],
      [-0.00387, 2],
      [-0.00237, 2],
      [-0.00958, 1],
      [-0.00195, 2],
      [-0.00476, 2],
      [0.00672, 0],
      [-0.01048, 1],
      [0.00636, 0],
      [-0.00248, 2],
      [-0.00424, 2],
      [0.00384, 0],
      [0.00704, 0],
      [-0.0035, 1],
      [-0.00211, 2],
      [-0.00266, 1],
      [-0.00485, 2],
      [-0.00279, 1],
      [-0.00956, 1]
    ],
    "red_o_points": [],
    "y_categories": ["NORM", "NPV", "nan"],
    "blue_o_points": [],
    "blue_x_points": [
      [0.00041, 1],
      [-0.00011, 2],
      [0.00128, 1],
      [0.00165, 1],
      [0.01188, 0],
      [0.00084, 1],
      [0.01063, 0],
      [0.00457, 0],
      [0.01074, 0],
      [0.01208, 0]
    ]
  },
  "QS_mulNeuromadSite[T2]": {
    "red_x_points": [
      [-1e-5, 2],
      [-0.00141, 0],
      [-0.00103, 0],
      [-0.00139, 0],
      [-0.00013, 2],
      [-0.00176, 0],
      [-0.00114, 0],
      [-0.00128, 0],
      [-0.0002, 2],
      [-0.00163, 0],
      [-0.00165, 0],
      [-0.00107, 0],
      [-0.00039, 2],
      [0.00132, 1],
      [-0.00023, 2],
      [-0.00152, 0],
      [-0.00018, 2],
      [-0.00118, 0],
      [-0.00093, 2],
      [-0.00055, 2],
      [-0.00017, 2],
      [-0.00033, 2],
      [-0.00127, 0],
      [-0.00026, 2],
      [-0.00053, 2],
      [-0.00017, 2],
      [-0.00159, 0],
      [-0.00116, 0],
      [0.00186, 1],
      [-0.0001, 2],
      [-0.00097, 0],
      [-0.00024, 2]
    ],
    "red_o_points": [],
    "y_categories": ["N", "NOT APPLICABLE", "nan"],
    "blue_o_points": [],
    "blue_x_points": [
      [0.00363, 1],
      [0.00015, 2],
      [0.0035, 1],
      [0.00034, 0],
      [-0.00037, 0],
      [0.00329, 1],
      [1e-5, 2],
      [0.003, 1],
      [-0.00011, 2],
      [0.00041, 2]
    ]
  },
  "QS_mulGraftNerve[MC]": {
    "red_x_points": [
      [-4e-5, 0],
      [-4e-5, 0],
      [-4e-5, 0],
      [0.0, 2],
      [-4e-5, 0],
      [0.0, 2],
      [-0.00017, 0],
      [-4e-5, 0],
      [0.0, 2],
      [0.0, 2],
      [-4e-5, 0],
      [0.0, 2],
      [-4e-5, 0],
      [0.0, 2],
      [0.0, 2],
      [0.0, 2],
      [0.0, 2],
      [-4e-5, 0],
      [0.0, 2],
      [0.0, 2],
      [0.0, 2],
      [0.0, 2],
      [-4e-5, 0],
      [0.0, 2]
    ],
    "red_o_points": [],
    "y_categories": ["N", "NOT APPLICABLE", "nan"],
    "blue_o_points": [],
    "blue_x_points": [
      [7e-5, 1],
      [0.0, 2],
      [0.00014, 1],
      [-4e-5, 0],
      [0.00014, 1],
      [0.0, 2],
      [7e-5, 2]
    ]
  },
  "QS_mulNeuromadSite[C4]": {
    "red_x_points": [
      [-0.00032, 2],
      [-0.00125, 0],
      [-0.00108, 0],
      [-0.0012, 0],
      [-0.00019, 2],
      [-0.00171, 0],
      [-0.00103, 0],
      [-0.00122, 0],
      [-0.00028, 2],
      [-0.00145, 0],
      [-0.00141, 0],
      [-0.00131, 0],
      [-0.00037, 2],
      [0.00081, 1],
      [-0.00035, 2],
      [-0.00136, 0],
      [-0.00034, 2],
      [-0.00115, 0],
      [-0.00024, 2],
      [-0.00018, 2],
      [-0.00016, 2],
      [-0.00021, 2],
      [-0.00126, 0],
      [-0.00011, 2],
      [-0.00043, 2],
      [-7e-5, 2],
      [-0.00118, 0],
      [-0.001, 0],
      [0.00201, 1],
      [-0.00018, 2],
      [-0.00077, 0],
      [-0.0003, 2]
    ],
    "red_o_points": [],
    "y_categories": ["N", "NOT APPLICABLE", "nan"],
    "blue_o_points": [],
    "blue_x_points": [
      [0.00299, 1],
      [0.00061, 2],
      [0.00241, 1],
      [0.00026, 0],
      [-0.00024, 0],
      [0.00314, 1],
      [-0.00015, 2],
      [0.00274, 1],
      [1e-5, 2],
      [0.00015, 2]
    ]
  },
  "QS_mulLysisNerve[Ssr]": {
    "red_x_points": [
      [-0.00014, 3],
      [-0.00049, 0],
      [-0.00211, 2],
      [-0.00048, 0],
      [-0.00016, 3],
      [-0.00035, 0],
      [-0.00035, 0],
      [-0.00038, 0],
      [-9e-5, 3],
      [-0.00054, 0],
      [-0.0005, 0],
      [-0.00024, 0],
      [-0.00015, 3],
      [0.00088, 1],
      [-0.00018, 3],
      [-0.00044, 0],
      [-0.0002, 3],
      [-0.00037, 0],
      [-0.00016, 3],
      [-0.0002, 3],
      [-0.00019, 3],
      [-0.00014, 3],
      [-0.00031, 0],
      [-0.00016, 3],
      [-0.00011, 3],
      [-0.0002, 3],
      [-0.00048, 0],
      [-0.00037, 0],
      [0.00116, 1],
      [-0.00013, 3],
      [-0.00034, 0],
      [-0.00019, 3]
    ],
    "red_o_points": [],
    "y_categories": ["N", "NOT APPLICABLE", "Y", "nan"],
    "blue_o_points": [],
    "blue_x_points": [
      [0.00193, 1],
      [-0.0001, 3],
      [0.00101, 1],
      [-0.00016, 0],
      [-0.00016, 0],
      [0.00071, 1],
      [-5e-5, 3],
      [0.00157, 1],
      [-8e-5, 3],
      [-0.00011, 3]
    ]
  },
  "QS_mulTransfSite[Oberlin]": {
    "red_x_points": [
      [-0.00224, 3],
      [-0.01633, 0],
      [-0.01692, 0],
      [-0.01643, 0],
      [-0.00252, 3],
      [-0.0032, 2],
      [-0.00235, 2],
      [-0.01719, 0],
      [-0.00239, 3],
      [-0.0029, 2],
      [-0.00359, 2],
      [-0.00284, 2],
      [-0.00237, 3],
      [0.01914, 1],
      [-0.00235, 3],
      [-0.00249, 2],
      [-0.00241, 3],
      [-0.01642, 0],
      [-0.00247, 3],
      [-0.00247, 3],
      [-0.00243, 3],
      [-0.00248, 3],
      [-0.01611, 0],
      [-0.00257, 3],
      [-0.00313, 3],
      [-0.00261, 3],
      [-0.00297, 2],
      [-0.01591, 0],
      [0.01913, 1],
      [-0.00244, 3],
      [-0.01706, 0],
      [-0.0026, 3]
    ],
    "red_o_points": [],
    "y_categories": ["N", "NOT APPLICABLE", "Y", "nan"],
    "blue_o_points": [],
    "blue_x_points": [
      [0.02777, 1],
      [-0.00081, 3],
      [0.02188, 1],
      [0.00276, 2],
      [0.00148, 2],
      [0.0212, 1],
      [-0.00113, 3],
      [0.02328, 1],
      [-0.00106, 3],
      [-0.001, 3]
    ]
  },
  "QA_lstPexMuscstrength[ElbowFlex]": {
    "red_x_points": [
      [-0.00299, 1],
      [-0.00255, 2],
      [-0.00376, 1],
      [-0.00328, 1],
      [-0.00316, 1],
      [0.00777, 0],
      [-0.00382, 1],
      [-0.00346, 1],
      [-0.00312, 1],
      [-0.00402, 1],
      [-0.00404, 1],
      [-0.0052, 1],
      [-0.00426, 1],
      [-0.00286, 2],
      [-0.00318, 2],
      [-0.00301, 2],
      [-0.00341, 1],
      [-0.00303, 2],
      [-0.00363, 2],
      [-0.00392, 1],
      [-0.00344, 1],
      [-0.00286, 1],
      [-0.00298, 1],
      [-0.00308, 2],
      [0.00284, 0],
      [-0.00224, 1],
      [-0.00405, 1],
      [-0.0032, 1],
      [-0.00295, 2],
      [-0.00305, 1],
      [-0.00469, 1],
      [-0.00312, 2]
    ],
    "red_o_points": [],
    "y_categories": ["GREATER THAN OR EQUALS TO 3", "LESS THAN 3", "nan"],
    "blue_o_points": [],
    "blue_x_points": [
      [-0.00052, 2],
      [-0.00081, 2],
      [0.01091, 0],
      [-0.00111, 1],
      [0.02414, 0],
      [0.01249, 0],
      [-0.00147, 1],
      [0.01262, 0],
      [-0.00028, 1],
      [-0.00025, 1]
    ]
  },
  "QS_mulGraftNerve[FI]": {
    "red_x_points": [
      [-0.00012, 2],
      [-0.0004, 0],
      [-0.00027, 0],
      [-0.00035, 0],
      [-5e-5, 2],
      [-0.00038, 0],
      [-0.0003, 0],
      [-0.0003, 0],
      [-0.00014, 2],
      [-0.00033, 0],
      [-0.00037, 0],
      [-0.00032, 0],
      [1e-5, 2],
      [0.00025, 1],
      [-0.00013, 2],
      [-0.00029, 0],
      [-0.00014, 2],
      [-0.00031, 0],
      [-0.00017, 2],
      [-2e-5, 2],
      [0.0, 2],
      [-0.00013, 2],
      [-0.00026, 0],
      [-6e-5, 2],
      [-9e-5, 2],
      [-1e-5, 2],
      [-0.0002, 0],
      [-0.00027, 0],
      [0.00047, 1],
      [-8e-5, 2],
      [-0.00032, 0],
      [-0.00014, 2]
    ],
    "red_o_points": [],
    "y_categories": ["N", "NOT APPLICABLE", "nan"],
    "blue_o_points": [],
    "blue_x_points": [
      [0.00072, 1],
      [-0.00014, 2],
      [0.00092, 1],
      [0.0002, 0],
      [-0.00015, 0],
      [0.00094, 1],
      [1e-5, 2],
      [0.00079, 1],
      [-2e-5, 2],
      [-4e-5, 2]
    ]
  }
}
