{
  "QA_lstPexMuscstrength[ElbowFlex]": {
    "red_x_points": [
      [-0.01106, 1],
      [0.00012, 2],
      [-0.0107, 1],
      [-0.00998, 1],
      [-0.01074, 1],
      [-0.01107, 1],
      [-0.01078, 1],
      [-0.0102, 1],
      [-0.01087, 1],
      [-0.01139, 1],
      [-0.01108, 1],
      [-0.01134, 1],
      [-0.00022, 2],
      [-0.00185, 2],
      [0.00136, 2],
      [-0.01087, 1],
      [-0.01096, 1],
      [-0.0103, 1],
      [-0.01013, 1],
      [-0.01106, 1],
      [-3e-5, 2],
      [-0.01042, 1],
      [-0.01073, 1],
      [-0.01064, 1],
      [-0.00996, 1],
      [0.00095, 2],
      [-0.01022, 1],
      [-0.01061, 1],
      [-4e-5, 2]
    ],
    "red_o_points": [],
    "y_categories": ["GREATER THAN OR EQUALS TO 3", "LESS THAN 3", "nan"],
    "blue_o_points": [],
    "blue_x_points": [
      [0.00182, 2],
      [-0.00971, 1],
      [0.04941, 0],
      [-0.01091, 1],
      [0.00291, 2],
      [0.00268, 2],
      [0.04047, 0],
      [-0.0092, 1],
      [-0.00998, 1],
      [0.0023, 2],
      [0.05331, 0],
      [0.04119, 0],
      [0.04764, 0],
      [0.04272, 0],
      [-0.00987, 1]
    ]
  },
  "QS_mulGraftNerve[other]": {
    "red_x_points": [
      [3e-5, 2],
      [-9e-5, 0],
      [-6e-5, 0],
      [-3e-5, 0],
      [-0.00012, 0],
      [-8e-5, 0],
      [-0.00012, 0],
      [-0.0, 2],
      [-9e-5, 0],
      [-6e-5, 0],
      [0.0, 2],
      [-0.00012, 0],
      [2e-5, 2],
      [-9e-5, 0],
      [-6e-5, 0],
      [-0.0, 2],
      [0.0, 2],
      [-0.0, 2],
      [-3e-5, 0],
      [1e-5, 2],
      [3e-5, 2],
      [1e-5, 2],
      [-9e-5, 0],
      [-0.00012, 0],
      [-0.0, 2],
      [0.00018, 1],
      [-0.0, 2],
      [-8e-5, 0],
      [3e-5, 2]
    ],
    "red_o_points": [],
    "y_categories": ["N", "NOT APPLICABLE", "nan"],
    "blue_o_points": [],
    "blue_x_points": [
      [0.00049, 1],
      [3e-5, 2],
      [-8e-5, 0],
      [-3e-5, 0],
      [-0.0, 2],
      [9e-5, 1],
      [0.00018, 1],
      [-3e-5, 0],
      [3e-5, 2],
      [-0.0, 2],
      [-8e-5, 0],
      [0.00018, 1],
      [-0.0, 2],
      [9e-5, 1],
      [0.0, 2]
    ]
  },
  "QS_mulLysisTrunk[Upper]": {
    "red_x_points": [
      [-0.00065, 3],
      [-0.00463, 0],
      [-0.00356, 0],
      [-0.00294, 0],
      [-0.00386, 0],
      [-0.01409, 2],
      [-0.00386, 0],
      [-0.00086, 3],
      [-0.00385, 0],
      [-0.00343, 0],
      [-0.00081, 3],
      [-0.00347, 0],
      [-0.00102, 3],
      [-0.00487, 0],
      [-0.01268, 2],
      [-0.00092, 3],
      [-0.00071, 3],
      [-0.00068, 3],
      [-0.00341, 0],
      [-0.00059, 3],
      [-0.00094, 3],
      [-0.00076, 3],
      [-0.00385, 0],
      [-0.00361, 0],
      [-0.00099, 3],
      [0.01423, 1],
      [-0.0007, 3],
      [-0.01214, 2],
      [-0.00079, 3]
    ],
    "red_o_points": [],
    "y_categories": ["N", "NOT APPLICABLE", "Y", "nan"],
    "blue_o_points": [],
    "blue_x_points": [
      [0.02281, 1],
      [-0.00046, 3],
      [-0.00206, 0],
      [-0.0015, 0],
      [-4e-5, 3],
      [0.02016, 1],
      [0.01607, 1],
      [-0.00205, 0],
      [-0.00043, 3],
      [-0.0003, 3],
      [-0.00194, 0],
      [0.016, 1],
      [-0.0004, 3],
      [0.01531, 1],
      [-0.00075, 3]
    ]
  },
  "QS_mulBpsurgeryType[Transf]": {
    "red_x_points": [
      [-0.00014, 3],
      [-0.00052, 2],
      [-0.00329, 0],
      [-0.00053, 2],
      [-0.00057, 2],
      [-0.00047, 2],
      [-0.00064, 2],
      [-0.00018, 3],
      [-0.00049, 2],
      [-0.00045, 2],
      [-0.00022, 3],
      [-0.00049, 2],
      [-0.0002, 3],
      [-0.00058, 2],
      [-0.00047, 2],
      [-0.00016, 3],
      [-0.00019, 3],
      [-0.00016, 3],
      [-0.00043, 2],
      [-0.00022, 3],
      [-0.00033, 3],
      [-0.0002, 3],
      [-0.00045, 2],
      [-0.00042, 2],
      [-0.0002, 3],
      [0.0019, 1],
      [-0.00023, 3],
      [-0.00039, 2],
      [-0.00014, 3]
    ],
    "red_o_points": [],
    "y_categories": ["N", "NOT APPLICABLE", "Y", "nan"],
    "blue_o_points": [],
    "blue_x_points": [
      [0.00363, 1],
      [-0.00016, 3],
      [-2e-5, 2],
      [-0.00042, 2],
      [-0.00016, 3],
      [0.00193, 1],
      [0.00223, 1],
      [-0.00044, 2],
      [-0.00017, 3],
      [-0.0001, 3],
      [-1e-5, 2],
      [0.00242, 1],
      [-0.00011, 3],
      [0.00235, 1],
      [-9e-5, 3]
    ]
  },
  "QS_mulGraftNerve[Ac]": {
    "red_x_points": [
      [-0.0, 2],
      [-0.00025, 0],
      [-3e-5, 0],
      [-3e-5, 0],
      [-3e-5, 0],
      [-3e-5, 0],
      [-5e-5, 0],
      [-0.0, 2],
      [-5e-5, 0],
      [-5e-5, 0],
      [-2e-5, 2],
      [-3e-5, 0],
      [0.0, 2],
      [-0.00025, 0],
      [-3e-5, 0],
      [-2e-5, 2],
      [-2e-5, 2],
      [-2e-5, 2],
      [-3e-5, 0],
      [-2e-5, 2],
      [-2e-5, 2],
      [-0.0, 2],
      [-3e-5, 0],
      [-3e-5, 0],
      [-2e-5, 2],
      [0.00017, 1],
      [-3e-5, 0],
      [-0.0, 2]
    ],
    "red_o_points": [],
    "y_categories": ["N", "NOT APPLICABLE", "nan"],
    "blue_o_points": [],
    "blue_x_points": [
      [0.00034, 1],
      [-3e-5, 0],
      [-3e-5, 0],
      [7e-5, 2],
      [0.00017, 1],
      [0.0001, 1],
      [-3e-5, 0],
      [1e-5, 2],
      [7e-5, 2],
      [0.0001, 1],
      [-2e-5, 2],
      [0.0001, 1],
      [-2e-5, 2]
    ]
  },
  "QS_mulNeuromadSite[C8]": {
    "red_x_points": [
      [-1e-5, 2],
      [-0.00062, 0],
      [-0.00058, 0],
      [-0.00031, 0],
      [-0.00055, 0],
      [-0.00031, 0],
      [-0.00047, 0],
      [-3e-5, 2],
      [-0.0005, 0],
      [-0.0003, 0],
      [-2e-5, 2],
      [-0.00047, 0],
      [6e-5, 2],
      [-0.00076, 0],
      [-0.00063, 0],
      [-9e-5, 2],
      [-2e-5, 2],
      [-8e-5, 2],
      [-0.00047, 0],
      [-6e-5, 2],
      [3e-5, 2],
      [1e-5, 2],
      [-0.00051, 0],
      [-0.00042, 0],
      [-7e-5, 2],
      [0.0009, 1],
      [4e-5, 2],
      [-0.00024, 0],
      [-1e-5, 2]
    ],
    "red_o_points": [],
    "y_categories": ["N", "NOT APPLICABLE", "nan"],
    "blue_o_points": [],
    "blue_x_points": [
      [0.00212, 1],
      [8e-5, 2],
      [-9e-5, 0],
      [-0.00014, 0],
      [6e-5, 2],
      [0.00169, 1],
      [0.00067, 1],
      [-0.00024, 0],
      [0.00018, 2],
      [4e-5, 2],
      [-9e-5, 0],
      [0.00143, 1],
      [-8e-5, 2],
      [0.00098, 1],
      [-0.0001, 2]
    ]
  },
  "QS_mulGraftNerve[Ph]": {
    "red_x_points": [
      [-3e-5, 2],
      [-0.00013, 0],
      [-0.0001, 0],
      [-7e-5, 0],
      [-0.0001, 0],
      [-7e-5, 0],
      [-1e-5, 0],
      [-3e-5, 2],
      [-9e-5, 0],
      [-0.0001, 0],
      [-3e-5, 2],
      [-0.0001, 0],
      [-1e-5, 2],
      [-0.00016, 0],
      [-0.00016, 0],
      [-2e-5, 2],
      [-3e-5, 2],
      [-0.0, 2],
      [-3e-5, 0],
      [-3e-5, 2],
      [-3e-5, 2],
      [-3e-5, 2],
      [-9e-5, 0],
      [-0.0001, 0],
      [-3e-5, 2],
      [0.00015, 1],
      [-3e-5, 2],
      [-0.0001, 0],
      [-1e-5, 2]
    ],
    "red_o_points": [],
    "y_categories": ["N", "NOT APPLICABLE", "nan"],
    "blue_o_points": [],
    "blue_x_points": [
      [0.00055, 1],
      [-1e-5, 2],
      [-1e-5, 0],
      [-0.0001, 0],
      [-3e-5, 2],
      [0.00041, 1],
      [0.00035, 1],
      [-9e-5, 0],
      [-2e-5, 2],
      [1e-5, 2],
      [-0.0001, 0],
      [0.00026, 1],
      [-3e-5, 2],
      [0.00035, 1],
      [-3e-5, 2]
    ]
  },
  "QS_mulTransfSite[AcSsPA]": {
    "red_x_points": [
      [-6e-5, 3],
      [-0.00105, 0],
      [-0.00095, 0],
      [-0.00077, 0],
      [-0.0009, 0],
      [-0.00082, 0],
      [-0.00089, 0],
      [-0.00013, 3],
      [-0.001, 0],
      [-0.00069, 0],
      [-0.00015, 3],
      [-0.00086, 0],
      [-0.00013, 3],
      [-0.00103, 0],
      [-0.0034, 2],
      [-0.00015, 3],
      [-0.00012, 3],
      [-0.00012, 3],
      [-0.00078, 0],
      [-0.00018, 3],
      [-0.00013, 3],
      [-9e-5, 3],
      [-0.00094, 0],
      [-0.00091, 0],
      [-0.00015, 3],
      [0.00261, 1],
      [-0.00015, 3],
      [-0.00074, 0],
      [-0.00011, 3]
    ],
    "red_o_points": [],
    "y_categories": ["N", "NOT APPLICABLE", "Y", "nan"],
    "blue_o_points": [],
    "blue_x_points": [
      [0.00405, 1],
      [-0.0001, 3],
      [-0.00046, 0],
      [-0.00047, 0],
      [-1e-5, 3],
      [0.00387, 1],
      [0.00287, 1],
      [-0.0006, 0],
      [-0.0001, 3],
      [-0.00012, 3],
      [-0.00049, 0],
      [0.00322, 1],
      [-4e-5, 3],
      [0.0033, 1],
      [-0.00011, 3]
    ]
  },
  "QA_lstPexPalle[Elbow]": {
    "red_x_points": [
      [-0.00043, 4],
      [-0.00383, 4],
      [-0.0025, 4],
      [-0.00142, 3],
      [-0.00408, 4],
      [-0.00147, 3],
      [-0.00378, 4],
      [-0.00039, 4],
      [-0.00502, 4],
      [-0.00139, 3],
      [-0.00392, 1],
      [-0.00485, 4],
      [-0.00075, 4],
      [-0.00488, 4],
      [-0.00167, 4],
      [0.00038, 3],
      [-0.01039, 0],
      [0.00017, 3],
      [-0.00888, 2],
      [0.00034, 3],
      [-0.00051, 4],
      [-0.00048, 4],
      [-0.00483, 4],
      [-0.00456, 4],
      [-0.00045, 4],
      [-0.02966, 3],
      [-0.00026, 4],
      [-0.00808, 0],
      [-0.00043, 4]
    ],
    "red_o_points": [],
    "y_categories": ["ABS", "HYPO", "NAIA", "PT", "nan"],
    "blue_o_points": [],
    "blue_x_points": [
      [0.00505, 4],
      [0.0003, 4],
      [0.00482, 3],
      [0.0362, 1],
      [9e-5, 4],
      [0.00556, 4],
      [0.01123, 1],
      [-0.00331, 4],
      [0.00125, 4],
      [0.00042, 4],
      [0.02918, 1],
      [0.00517, 4],
      [0.00175, 3],
      [0.00539, 4],
      [0.00493, 3]
    ]
  },
  "participant_code": {
    "red_x_points": [
      [-0.03298, 1],
      [-0.03263, 2],
      [-0.03222, 3],
      [-0.03256, 4],
      [-0.03318, 5],
      [-0.03209, 8],
      [-0.0327, 9],
      [-0.03236, 10],
      [-0.03311, 11],
      [-0.03332, 13],
      [-0.03352, 14],
      [-0.03263, 18],
      [-0.03298, 19],
      [-0.03298, 20],
      [-0.03332, 23],
      [-0.03167, 26],
      [-0.03161, 28],
      [-0.03154, 29],
      [-0.03256, 30],
      [-0.03202, 31],
      [-0.03202, 32],
      [-0.03304, 34],
      [-0.03154, 36],
      [-0.03325, 38],
      [-0.03346, 39],
      [-0.0338, 40],
      [-0.03174, 41],
      [-0.03113, 42],
      [-0.03256, 43]
    ],
    "red_o_points": [],
    "y_categories": [
      "P16554",
      "P18297",
      "P19283",
      "P19287",
      "P23172",
      "P23391",
      "P30595",
      "P31645",
      "P31691",
      "P34778",
      "P35046",
      "P36328",
      "P43633",
      "P4544",
      "P46417",
      "P48965",
      "P53068",
      "P5497",
      "P58556",
      "P59529",
      "P62483",
      "P64658",
      "P65202",
      "P66816",
      "P6751",
      "P7408",
      "P75566",
      "P76226",
      "P79971",
      "P82621",
      "P82990",
      "P84549",
      "P84932",
      "P85825",
      "P86989",
      "P8770",
      "P87791",
      "P90550",
      "P93159",
      "P94969",
      "P96710",
      "P97130",
      "P9744",
      "P98500",
      "nan"
    ],
    "blue_o_points": [],
    "blue_x_points": [
      [0.06281, 0],
      [0.06373, 6],
      [0.06189, 7],
      [0.06255, 12],
      [0.06281, 15],
      [0.06386, 16],
      [0.0636, 17],
      [0.06045, 21],
      [0.06491, 22],
      [0.05939, 24],
      [0.06373, 25],
      [0.06386, 27],
      [0.06531, 33],
      [0.06215, 35],
      [0.06347, 37]
    ]
  },
  "QA_yonInjTbi": {
    "red_x_points": [
      [0.00923, 0],
      [-0.00187, 2],
      [-0.00254, 0],
      [-0.00168, 0],
      [-0.00256, 2],
      [0.00101, 1],
      [-0.00277, 0],
      [-0.00985, 2],
      [-0.00422, 2],
      [0.00122, 1],
      [-0.00573, 1],
      [-0.00427, 0],
      [0.00793, 0],
      [0.00131, 1],
      [4e-5, 1],
      [-0.00659, 1],
      [-0.00495, 1],
      [-0.00586, 1],
      [0.00093, 1],
      [-0.00612, 1],
      [0.00794, 0],
      [-0.00708, 1],
      [0.00146, 1],
      [0.00056, 1],
      [-0.00532, 1],
      [-0.00052, 2],
      [-0.01095, 2],
      [0.00025, 1],
      [-0.0075, 1]
    ],
    "red_o_points": [],
    "y_categories": ["N", "Y", "nan"],
    "blue_o_points": [],
    "blue_x_points": [
      [0.00035, 0],
      [-0.00343, 1],
      [0.00221, 1],
      [0.00282, 1],
      [0.0136, 0],
      [0.0001, 1],
      [1e-5, 1],
      [0.00364, 1],
      [0.01498, 0],
      [0.01184, 0],
      [0.00202, 1],
      [3e-5, 2],
      [-0.00466, 1],
      [5e-5, 2],
      [0.01495, 0]
    ]
  },
  "QA_yonInjChesttube": {
    "red_x_points": [
      [-0.003, 2],
      [-0.0039, 2],
      [0.00203, 0],
      [-0.00172, 2],
      [-0.00406, 2],
      [0.00206, 0],
      [-0.00526, 1],
      [-0.00189, 2],
      [-0.0045, 2],
      [-0.00439, 2],
      [0.00175, 0],
      [0.0044, 0],
      [-0.00346, 2],
      [-0.00424, 2],
      [0.00079, 0],
      [0.00151, 0],
      [0.00146, 0],
      [0.00187, 0],
      [-0.00522, 1],
      [-0.00228, 2],
      [-0.01811, 1],
      [-0.0031, 2],
      [-0.00445, 2],
      [0.00321, 0],
      [-0.00261, 2],
      [-0.00011, 2],
      [-0.00311, 2],
      [0.00084, 0],
      [-0.00348, 2]
    ],
    "red_o_points": [],
    "y_categories": ["N", "Y", "nan"],
    "blue_o_points": [],
    "blue_x_points": [
      [0.0, 1],
      [-0.00109, 2],
      [0.00566, 0],
      [0.0069, 0],
      [-0.00239, 2],
      [-5e-5, 2],
      [4e-5, 0],
      [0.00793, 0],
      [0.01705, 0],
      [0.01477, 0],
      [0.00433, 0],
      [-4e-5, 2],
      [0.00599, 0],
      [-4e-5, 2],
      [-8e-5, 2]
    ]
  },
  "QS_mulGraftNerve[Ul]": {
    "red_x_points": [
      [0.0, 2],
      [-3e-5, 0],
      [-3e-5, 0],
      [-3e-5, 0],
      [-3e-5, 0],
      [0.0, 2],
      [-3e-5, 0],
      [-3e-5, 0],
      [0.0, 2],
      [-3e-5, 0],
      [0.0, 2],
      [0.0, 2]
    ],
    "red_o_points": [],
    "y_categories": ["N", "NOT APPLICABLE", "nan"],
    "blue_o_points": [],
    "blue_x_points": [[0.00017, 1], [0.0, 2]]
  },
  "QA_mulInjOrthesisType[ShoulderSupport]": {
    "red_x_points": [
      [-0.00793, 0],
      [-0.00813, 0],
      [-0.00799, 0],
      [-0.02899, 2],
      [-0.00836, 0],
      [-0.00821, 0],
      [-0.00807, 0],
      [-0.02926, 2],
      [-0.00811, 0],
      [-0.00821, 0],
      [-0.00799, 0],
      [-0.00818, 0],
      [-0.00846, 0],
      [-0.0082, 0],
      [-0.03004, 2],
      [-0.00811, 0],
      [-0.00813, 0],
      [-0.02884, 2],
      [-0.02796, 3],
      [-0.00817, 0],
      [-0.0079, 0],
      [-0.00764, 0],
      [-0.00841, 0],
      [-0.00804, 0],
      [-0.03097, 3],
      [-0.0297, 3],
      [-0.02852, 3],
      [-0.00807, 0],
      [-0.00808, 0]
    ],
    "red_o_points": [],
    "y_categories": ["N", "NOT APPLICABLE", "Y", "nan"],
    "blue_o_points": [],
    "blue_x_points": [
      [-0.0078, 0],
      [-0.00767, 0],
      [-0.00764, 0],
      [-0.0075, 0],
      [0.05738, 1],
      [0.05753, 1],
      [0.05545, 1],
      [0.05837, 1],
      [-0.00747, 0],
      [0.05775, 1],
      [-0.0079, 0],
      [0.05664, 1],
      [0.05682, 1],
      [0.05861, 1],
      [-0.00788, 0]
    ]
  },
  "QA_yonInjUnconscio": {
    "red_x_points": [
      [-0.01453, 1],
      [-0.01388, 1],
      [-0.00169, 2],
      [-0.00213, 2],
      [-0.002, 2],
      [-0.0155, 1],
      [-0.00189, 2],
      [-0.00261, 2],
      [-0.0021, 2],
      [-0.01588, 1],
      [-0.01479, 1],
      [-0.01657, 1],
      [-0.0039, 2],
      [-0.00207, 2],
      [-0.0107, 1],
      [-0.01441, 1],
      [-0.01418, 1],
      [-0.0106, 1],
      [-0.01136, 1],
      [-0.01478, 1],
      [-0.00388, 2],
      [-0.00252, 2],
      [-0.01658, 1],
      [-0.01552, 1],
      [-0.0028, 2],
      [-0.0024, 2],
      [-0.00286, 2],
      [-0.01445, 1],
      [-0.00361, 2]
    ],
    "red_o_points": [],
    "y_categories": ["N", "Y", "nan"],
    "blue_o_points": [],
    "blue_x_points": [
      [-0.00122, 2],
      [-0.00184, 2],
      [0.05166, 0],
      [-0.0005, 2],
      [-0.00798, 1],
      [-0.00846, 1],
      [0.03495, 0],
      [0.04429, 0],
      [-0.00223, 2],
      [0.04371, 0],
      [0.0536, 0],
      [-0.0019, 2],
      [-0.00909, 1],
      [-0.002, 2],
      [0.05718, 0]
    ]
  },
  "QA_lstPexInspectio[SurgicalScar]": {
    "red_x_points": [
      [-0.00289, 1],
      [-0.00505, 1],
      [-0.00744, 0],
      [-0.00355, 1],
      [-0.00737, 1],
      [-0.01218, 0],
      [-0.00623, 1],
      [-0.00261, 1],
      [-0.0095, 1],
      [-0.01137, 1],
      [-0.00937, 0],
      [-0.00989, 1],
      [-0.00205, 2],
      [-0.01076, 1],
      [-0.00605, 0],
      [0.00689, 2],
      [0.00447, 2],
      [-0.00536, 1],
      [-0.00439, 1],
      [-0.00647, 1],
      [-0.00284, 2],
      [-0.00377, 1],
      [-0.00983, 1],
      [0.01329, 2],
      [-0.00395, 1],
      [-0.00589, 1],
      [-0.00197, 1],
      [0.00723, 2],
      [-0.00373, 1]
    ],
    "red_o_points": [],
    "y_categories": ["ABS", "NAIA", "PT", "nan"],
    "blue_o_points": [],
    "blue_x_points": [
      [-0.00062, 1],
      [0.01042, 2],
      [0.02924, 2],
      [0.03027, 2],
      [0.00246, 1],
      [0.00039, 1],
      [0.00103, 0],
      [-0.00569, 1],
      [0.00096, 1],
      [0.00273, 1],
      [0.02622, 2],
      [-0.00042, 1],
      [0.00984, 2],
      [0.00494, 0],
      [0.01086, 2]
    ]
  },
  "QS_mulBpsurgeryType[Lysis]": {
    "red_x_points": [
      [-0.00065, 3],
      [-0.00575, 0],
      [-0.01903, 2],
      [-0.01716, 2],
      [-0.00377, 0],
      [-0.01982, 2],
      [-0.00386, 0],
      [-0.00121, 3],
      [-0.00341, 0],
      [-0.00348, 0],
      [-0.00106, 3],
      [-0.00364, 0],
      [-0.00135, 3],
      [-0.00517, 0],
      [-0.01817, 2],
      [-0.00093, 3],
      [-0.00086, 3],
      [-0.00104, 3],
      [-0.00355, 0],
      [-0.00079, 3],
      [-0.00123, 3],
      [-0.00116, 3],
      [-0.00333, 0],
      [-0.0036, 0],
      [-0.00165, 3],
      [0.02168, 1],
      [-0.00127, 3],
      [-0.0177, 2],
      [-0.00135, 3]
    ],
    "red_o_points": [],
    "y_categories": ["N", "NOT APPLICABLE", "Y", "nan"],
    "blue_o_points": [],
    "blue_x_points": [
      [0.03607, 1],
      [-0.00064, 3],
      [-0.00101, 0],
      [-0.00091, 0],
      [7e-5, 3],
      [0.02787, 1],
      [0.0203, 1],
      [-0.00158, 0],
      [-0.00067, 3],
      [-0.00024, 3],
      [-0.0012, 0],
      [0.02407, 1],
      [-0.00048, 3],
      [0.0233, 1],
      [-0.00065, 3]
    ]
  },
  "QS_mulLysisSite[Trunk]": {
    "red_x_points": [
      [-0.00028, 3],
      [-0.00399, 0],
      [-0.00285, 0],
      [-0.0023, 0],
      [-0.00262, 0],
      [-0.01194, 2],
      [-0.00287, 0],
      [-0.00034, 3],
      [-0.0028, 0],
      [-0.00249, 0],
      [-0.00047, 3],
      [-0.00298, 0],
      [-0.00044, 3],
      [-0.00323, 0],
      [-0.00975, 2],
      [-0.0006, 3],
      [-0.0001, 3],
      [-0.00052, 3],
      [-0.00252, 0],
      [-0.00027, 3],
      [-0.00048, 3],
      [-0.00027, 3],
      [-0.00305, 0],
      [-0.00296, 0],
      [-0.00069, 3],
      [0.00946, 1],
      [-0.00039, 3],
      [-0.01001, 2],
      [-0.00056, 3]
    ],
    "red_o_points": [],
    "y_categories": ["N", "NOT APPLICABLE", "Y", "nan"],
    "blue_o_points": [],
    "blue_x_points": [
      [0.0195, 1],
      [1e-5, 3],
      [-0.00095, 0],
      [-0.00063, 0],
      [2e-5, 3],
      [0.01457, 1],
      [0.00994, 1],
      [-0.00119, 0],
      [-3e-5, 3],
      [-5e-5, 3],
      [-0.0009, 0],
      [0.01159, 1],
      [-0.00042, 3],
      [0.01148, 1],
      [-0.00062, 3]
    ]
  },
  "QS_mulGraftTrunk[UpperTrunk]": {
    "red_x_points": [
      [-0.00026, 3],
      [-0.00193, 0],
      [-0.00133, 0],
      [-0.00084, 0],
      [-0.00128, 0],
      [-0.00081, 0],
      [-0.00129, 0],
      [-0.00029, 3],
      [-0.00113, 0],
      [-0.00077, 0],
      [-0.00068, 3],
      [-0.00121, 0],
      [-0.00051, 3],
      [-0.00811, 2],
      [-0.00164, 0],
      [-0.00037, 3],
      [-0.00035, 3],
      [-0.00042, 3],
      [-0.0008, 0],
      [-0.00041, 3],
      [-0.00043, 3],
      [-0.00038, 3],
      [-0.00126, 0],
      [-0.00137, 0],
      [-0.00026, 3],
      [0.00326, 1],
      [-0.00025, 3],
      [-0.00091, 0],
      [-0.00049, 3]
    ],
    "red_o_points": [],
    "y_categories": ["N", "NOT APPLICABLE", "Y", "nan"],
    "blue_o_points": [],
    "blue_x_points": [
      [0.00867, 1],
      [-0.00029, 3],
      [-6e-5, 0],
      [7e-5, 0],
      [-2e-5, 3],
      [0.00573, 1],
      [0.00395, 1],
      [-0.00051, 0],
      [-0.00025, 3],
      [-0.00016, 3],
      [3e-5, 0],
      [0.00535, 1],
      [-0.0002, 3],
      [0.00441, 1],
      [-0.00017, 3]
    ]
  },
  "QS_mulTransfSite[PhMc]": {
    "red_x_points": [
      [-0.00033, 3],
      [-0.00335, 0],
      [-0.00229, 0],
      [-0.00188, 0],
      [-0.0026, 0],
      [-0.0018, 0],
      [-0.00772, 2],
      [-0.00064, 3],
      [-0.00241, 0],
      [-0.0017, 0],
      [-0.00028, 3],
      [-0.00235, 0],
      [-0.00079, 3],
      [-0.0032, 0],
      [-0.00304, 0],
      [-0.00022, 3],
      [-0.00028, 3],
      [-0.00012, 3],
      [-0.00575, 2],
      [-0.00035, 3],
      [-0.00066, 3],
      [-0.00053, 3],
      [-0.00198, 0],
      [-0.00212, 0],
      [-0.00057, 3],
      [0.00723, 1],
      [-0.00058, 3],
      [-0.0018, 0],
      [-0.00071, 3]
    ],
    "red_o_points": [],
    "y_categories": ["N", "NOT APPLICABLE", "Y", "nan"],
    "blue_o_points": [],
    "blue_x_points": [
      [0.01396, 1],
      [-0.00035, 3],
      [-0.00127, 0],
      [-0.00124, 0],
      [0.00027, 3],
      [0.00938, 1],
      [0.0065, 1],
      [-0.00129, 0],
      [-0.00036, 3],
      [-0.0001, 3],
      [-0.00125, 0],
      [0.00951, 1],
      [-6e-5, 3],
      [0.0094, 1],
      [-0.00026, 3]
    ]
  },
  "QS_mulLysisRoot[C6]": {
    "red_x_points": [
      [-0.0004, 3],
      [-0.00408, 0],
      [-0.01083, 2],
      [-0.00277, 0],
      [-0.00311, 0],
      [-0.00279, 0],
      [-0.00307, 0],
      [-0.00083, 3],
      [-0.00315, 0],
      [-0.00265, 0],
      [-0.00047, 3],
      [-0.00275, 0],
      [-0.00099, 3],
      [-0.00409, 0],
      [-0.00376, 0],
      [-0.00057, 3],
      [-0.00049, 3],
      [-0.00057, 3],
      [-0.00253, 0],
      [-0.00065, 3],
      [-0.001, 3],
      [-0.00096, 3],
      [-0.00243, 0],
      [-0.00264, 0],
      [-0.00074, 3],
      [0.0104, 1],
      [-0.00074, 3],
      [-0.00874, 2],
      [-0.00102, 3]
    ],
    "red_o_points": [],
    "y_categories": ["N", "NOT APPLICABLE", "Y", "nan"],
    "blue_o_points": [],
    "blue_x_points": [
      [0.01793, 1],
      [-0.00055, 3],
      [-0.001, 0],
      [-0.00196, 0],
      [-0.00015, 3],
      [0.01496, 1],
      [0.00951, 1],
      [-0.00209, 0],
      [-0.00063, 3],
      [-0.00017, 3],
      [-0.00102, 0],
      [0.01245, 1],
      [-0.00038, 3],
      [0.01192, 1],
      [-0.0004, 3]
    ]
  },
  "QA_lstPexInspectio[ShoulderSubdisloc]": {
    "red_x_points": [
      [-0.00279, 1],
      [-0.00517, 1],
      [0.00208, 0],
      [-0.00312, 1],
      [-0.00634, 1],
      [-0.0025, 2],
      [-0.00594, 1],
      [-0.0028, 1],
      [-0.00758, 1],
      [-0.00921, 1],
      [-0.0014, 2],
      [-0.00833, 1],
      [-0.00252, 1],
      [-0.01021, 1],
      [-0.00319, 1],
      [-0.00601, 2],
      [-0.00084, 2],
      [0.00103, 1],
      [-0.00387, 1],
      [-0.00137, 1],
      [-0.01443, 0],
      [0.00356, 2],
      [-0.00109, 2],
      [-0.00067, 2],
      [-0.00202, 1],
      [-0.01571, 2],
      [-0.00206, 1],
      [-0.00166, 2],
      [-0.00367, 1]
    ],
    "red_o_points": [],
    "y_categories": ["ABS", "NAIA", "PT", "nan"],
    "blue_o_points": [],
    "blue_x_points": [
      [0.00527, 1],
      [0.00888, 2],
      [0.03353, 0],
      [0.007, 2],
      [0.00166, 1],
      [0.00664, 1],
      [0.00457, 0],
      [-0.00365, 1],
      [0.01284, 2],
      [0.00187, 1],
      [0.0304, 0],
      [0.00443, 1],
      [0.00425, 1],
      [-0.00328, 2],
      [0.00342, 1]
    ]
  },
  "QS_mulGraftLevel[Trunk]": {
    "red_x_points": [
      [-0.00017, 3],
      [-0.0018, 0],
      [-0.00111, 0],
      [-0.0011, 0],
      [-0.00142, 0],
      [-0.00077, 0],
      [-0.0016, 0],
      [-0.00031, 3],
      [-0.00132, 0],
      [-0.00091, 0],
      [-0.00049, 3],
      [-0.00109, 0],
      [-0.00037, 3],
      [-0.00846, 2],
      [-0.00152, 0],
      [-0.00028, 3],
      [-0.00021, 3],
      [-0.00036, 3],
      [-0.00097, 0],
      [-0.00021, 3],
      [-0.00033, 3],
      [-0.0004, 3],
      [-0.00123, 0],
      [-0.00141, 0],
      [-0.00052, 3],
      [0.00343, 1],
      [-0.00038, 3],
      [-0.00083, 0],
      [-0.00041, 3]
    ],
    "red_o_points": [],
    "y_categories": ["N", "NOT APPLICABLE", "Y", "nan"],
    "blue_o_points": [],
    "blue_x_points": [
      [0.00873, 1],
      [-0.00024, 3],
      [-7e-5, 0],
      [0.00075, 0],
      [-2e-5, 3],
      [0.00551, 1],
      [0.00343, 1],
      [-0.00054, 0],
      [-0.00026, 3],
      [-6e-5, 3],
      [8e-5, 0],
      [0.00517, 1],
      [-0.0003, 3],
      [0.00464, 1],
      [-0.00024, 3]
    ]
  },
  "QA_lstPexPain[C7]": {
    "red_x_points": [
      [-0.0018, 1],
      [-0.00377, 2],
      [-0.00312, 2],
      [-0.00091, 1],
      [-0.00539, 2],
      [-0.00311, 1],
      [-0.00263, 1],
      [-0.00504, 0],
      [-0.00398, 1],
      [0.00797, 0],
      [-0.00235, 1],
      [-0.00765, 2],
      [0.00275, 2],
      [-0.00725, 2],
      [-0.00215, 2],
      [-0.00729, 0],
      [-0.00164, 1],
      [-0.00565, 0],
      [-0.00355, 2],
      [-0.00653, 0],
      [0.00223, 2],
      [0.00127, 2],
      [-0.00768, 2],
      [-0.00489, 2],
      [-0.00413, 0],
      [-0.00282, 1],
      [-0.00122, 1],
      [-0.0015, 1],
      [-0.00088, 1]
    ],
    "red_o_points": [],
    "y_categories": ["NORM", "NPV", "nan"],
    "blue_o_points": [],
    "blue_x_points": [
      [4e-5, 1],
      [0.00424, 1],
      [0.01617, 0],
      [0.01928, 0],
      [0.00605, 2],
      [7e-5, 2],
      [-5e-5, 1],
      [0.00157, 1],
      [0.00726, 2],
      [0.00656, 2],
      [0.0132, 0],
      [0.00011, 1],
      [-0.00272, 0],
      [0.00294, 0],
      [0.00803, 1]
    ]
  },
  "QS_mulBpsurgeryType[Graft]": {
    "red_x_points": [
      [-4e-5, 3],
      [-0.00059, 0],
      [-0.00061, 0],
      [-0.00052, 0],
      [-0.0006, 0],
      [-0.0003, 0],
      [-0.00073, 0],
      [-0.00015, 3],
      [-0.00043, 0],
      [-0.00033, 0],
      [-0.00015, 3],
      [-0.00039, 0],
      [-0.00013, 3],
      [-0.00477, 2],
      [-0.00049, 0],
      [-0.0001, 3],
      [-3e-5, 3],
      [-3e-5, 3],
      [-0.0003, 0],
      [-5e-5, 3],
      [-0.00014, 3],
      [-0.00012, 3],
      [-0.00041, 0],
      [-0.00046, 0],
      [-0.00018, 3],
      [0.00169, 1],
      [-0.00017, 3],
      [-0.00037, 0],
      [-0.00015, 3]
    ],
    "red_o_points": [],
    "y_categories": ["N", "NOT APPLICABLE", "Y", "nan"],
    "blue_o_points": [],
    "blue_x_points": [
      [0.0026, 1],
      [-0.0001, 3],
      [0.00014, 0],
      [0.00045, 0],
      [6e-5, 3],
      [0.00205, 1],
      [0.00163, 1],
      [-0.00012, 0],
      [-0.00013, 3],
      [-1e-5, 3],
      [0.00016, 0],
      [0.00222, 1],
      [-8e-5, 3],
      [0.00228, 1],
      [-7e-5, 3]
    ]
  },
  "QS_mulGraftNerve[Ax]": {
    "red_x_points": [
      [1e-5, 2],
      [-5e-5, 0],
      [-4e-5, 0],
      [-1e-5, 0],
      [-5e-5, 0],
      [1e-5, 2],
      [-5e-5, 0],
      [-1e-5, 0],
      [-5e-5, 0],
      [1e-5, 2],
      [-4e-5, 0],
      [-0.0, 2],
      [-0.0, 2],
      [1e-5, 2],
      [1e-5, 2],
      [-5e-5, 0],
      [-5e-5, 0],
      [-1e-5, 0],
      [1e-5, 2]
    ],
    "red_o_points": [],
    "y_categories": ["N", "NOT APPLICABLE", "nan"],
    "blue_o_points": [],
    "blue_x_points": [
      [0.00032, 1],
      [1e-5, 2],
      [-1e-5, 0],
      [1e-5, 2],
      [-1e-5, 0]
    ]
  },
  "QS_mulNeuromadSite[C5]": {
    "red_x_points": [
      [-6e-5, 2],
      [-0.00043, 0],
      [-0.00019, 0],
      [-9e-5, 0],
      [-0.00014, 0],
      [-0.00017, 0],
      [-0.0002, 0],
      [-7e-5, 2],
      [-0.00015, 0],
      [-0.0002, 0],
      [1e-5, 2],
      [-0.00017, 0],
      [-0.00016, 2],
      [-0.00032, 0],
      [-0.0003, 0],
      [-3e-5, 2],
      [0.0, 2],
      [-2e-5, 2],
      [-0.0001, 0],
      [-7e-5, 2],
      [-2e-5, 2],
      [-0.0001, 2],
      [-0.00025, 0],
      [-0.00021, 0],
      [-2e-5, 2],
      [0.00038, 1],
      [-7e-5, 2],
      [-0.00021, 0],
      [-0.00013, 2]
    ],
    "red_o_points": [],
    "y_categories": ["N", "NOT APPLICABLE", "nan"],
    "blue_o_points": [],
    "blue_x_points": [
      [0.00153, 1],
      [-1e-5, 2],
      [-6e-5, 0],
      [6e-5, 0],
      [0.0, 2],
      [0.00101, 1],
      [0.00032, 1],
      [-0.00013, 0],
      [-1e-5, 2],
      [0.0, 2],
      [1e-5, 0],
      [0.00041, 1],
      [-2e-5, 2],
      [0.0004, 1],
      [-3e-5, 2]
    ]
  },
  "QS_mulNeuromadSite[C7]": {
    "red_x_points": [
      [-1e-5, 2],
      [-0.00034, 0],
      [-0.00022, 0],
      [-9e-5, 0],
      [-0.00018, 0],
      [-0.0001, 0],
      [-0.00021, 0],
      [-2e-5, 2],
      [-0.00025, 0],
      [-0.0002, 0],
      [2e-5, 2],
      [-0.00024, 0],
      [4e-5, 2],
      [-0.00031, 0],
      [-0.00014, 0],
      [1e-5, 2],
      [-2e-5, 2],
      [1e-5, 2],
      [-0.00019, 0],
      [2e-5, 2],
      [3e-5, 2],
      [4e-5, 2],
      [-0.00025, 0],
      [-0.00015, 0],
      [-1e-5, 2],
      [0.00046, 1],
      [-0.0, 2],
      [-0.00014, 0],
      [2e-5, 2]
    ],
    "red_o_points": [],
    "y_categories": ["N", "NOT APPLICABLE", "nan"],
    "blue_o_points": [],
    "blue_x_points": [
      [0.00107, 1],
      [3e-5, 2],
      [-0.0001, 0],
      [-0.00012, 0],
      [0.0, 2],
      [0.0006, 1],
      [0.0003, 1],
      [-9e-5, 0],
      [4e-5, 2],
      [-1e-5, 2],
      [-7e-5, 0],
      [0.0004, 1],
      [1e-5, 2],
      [0.0004, 1],
      [-1e-5, 2]
    ]
  },
  "QS_mulTransfSite[IMc]": {
    "red_x_points": [
      [-0.00096, 3],
      [-0.01885, 2],
      [-0.00325, 0],
      [-0.01553, 2],
      [-0.00299, 0],
      [-0.00307, 0],
      [-0.00352, 0],
      [-0.00131, 3],
      [-0.00349, 0],
      [-0.00309, 0],
      [-0.00089, 3],
      [-0.00325, 0],
      [-0.00126, 3],
      [-0.0049, 0],
      [-0.01653, 2],
      [-0.00103, 3],
      [-0.00111, 3],
      [-0.00092, 3],
      [-0.00321, 0],
      [-0.00079, 3],
      [-0.00136, 3],
      [-0.00142, 3],
      [-0.00329, 0],
      [-0.01934, 2],
      [-0.00141, 3],
      [0.02006, 1],
      [-0.0013, 3],
      [-0.01586, 2],
      [-0.00136, 3]
    ],
    "red_o_points": [],
    "y_categories": ["N", "NOT APPLICABLE", "Y", "nan"],
    "blue_o_points": [],
    "blue_x_points": [
      [0.03187, 1],
      [-0.00083, 3],
      [-0.00079, 0],
      [-0.00092, 0],
      [-0.00015, 3],
      [0.0268, 1],
      [0.02008, 1],
      [-0.00195, 0],
      [-0.00083, 3],
      [-0.00042, 3],
      [-0.00107, 0],
      [0.02291, 1],
      [-0.00058, 3],
      [0.02189, 1],
      [-0.00078, 3]
    ]
  },
  "QA_mulInjOrthesisType[ArmSling]": {
    "red_x_points": [
      [-0.00808, 2],
      [-0.00844, 2],
      [-0.00797, 2],
      [-0.00794, 2],
      [-0.00808, 2],
      [-0.00801, 2],
      [-0.00794, 2],
      [-0.00829, 2],
      [-0.0079, 2],
      [-0.00794, 2],
      [-0.00793, 2],
      [-0.00853, 2],
      [-0.00819, 2],
      [-0.00793, 2],
      [-0.02544, 0],
      [-0.00846, 2],
      [-0.00811, 2],
      [-0.02541, 0],
      [-0.02622, 3],
      [-0.00803, 2],
      [-0.00838, 2],
      [-0.00819, 2],
      [-0.00807, 2],
      [-0.0085, 2],
      [-0.02526, 3],
      [-0.02543, 3],
      [-0.02587, 3],
      [-0.00866, 2],
      [-0.00819, 2]
    ],
    "red_o_points": [],
    "y_categories": ["N", "NOT APPLICABLE", "Y", "nan"],
    "blue_o_points": [],
    "blue_x_points": [
      [-0.00734, 2],
      [-0.00798, 2],
      [-0.00793, 2],
      [-0.00748, 2],
      [0.0501, 1],
      [0.04803, 1],
      [0.04783, 1],
      [0.05087, 1],
      [-0.00802, 2],
      [0.05086, 1],
      [-0.00791, 2],
      [0.05051, 1],
      [0.04923, 1],
      [0.0488, 1],
      [-0.00817, 2]
    ]
  },
  "QS_mulLysisSite[Nerve]": {
    "red_x_points": [
      [-0.00033, 3],
      [-0.00319, 0],
      [-0.0087, 2],
      [-0.00727, 2],
      [-0.00265, 0],
      [-0.00195, 0],
      [-0.00265, 0],
      [-0.00069, 3],
      [-0.00281, 0],
      [-0.002, 0],
      [-0.00034, 3],
      [-0.00225, 0],
      [-0.00054, 3],
      [-0.00326, 0],
      [-0.00259, 0],
      [-0.00045, 3],
      [-0.00031, 3],
      [-0.00038, 3],
      [-0.00192, 0],
      [-0.00042, 3],
      [-0.0005, 3],
      [-0.00086, 3],
      [-0.00228, 0],
      [-0.00219, 0],
      [-0.00042, 3],
      [0.00832, 1],
      [-0.00045, 3],
      [-0.00188, 0],
      [-0.00052, 3]
    ],
    "red_o_points": [],
    "y_categories": ["N", "NOT APPLICABLE", "Y", "nan"],
    "blue_o_points": [],
    "blue_x_points": [
      [0.01406, 1],
      [-0.00026, 3],
      [-0.0013, 0],
      [-0.0014, 0],
      [5e-5, 3],
      [0.01045, 1],
      [0.00717, 1],
      [-0.00155, 0],
      [-0.00014, 3],
      [0.00012, 3],
      [-0.00119, 0],
      [0.01006, 1],
      [-0.00027, 3],
      [0.00994, 1],
      [-0.00028, 3]
    ]
  },
  "QS_mulLysisRoot[C7]": {
    "red_x_points": [
      [-0.0001, 3],
      [-0.0007, 0],
      [-0.00263, 2],
      [-0.0003, 0],
      [-0.00064, 0],
      [-0.00037, 0],
      [-0.00062, 0],
      [-8e-5, 3],
      [-0.00061, 0],
      [-0.0003, 0],
      [-9e-5, 3],
      [-0.0004, 0],
      [-8e-5, 3],
      [-0.00059, 0],
      [-0.00049, 0],
      [-7e-5, 3],
      [-7e-5, 3],
      [-0.00018, 3],
      [-0.00034, 0],
      [-0.00011, 3],
      [-0.00011, 3],
      [-5e-5, 3],
      [-0.0005, 0],
      [-0.00046, 0],
      [-0.00013, 3],
      [0.00164, 1],
      [-6e-5, 3],
      [-0.00036, 0],
      [-0.00013, 3]
    ],
    "red_o_points": [],
    "y_categories": ["N", "NOT APPLICABLE", "Y", "nan"],
    "blue_o_points": [],
    "blue_x_points": [
      [0.00336, 1],
      [-4e-5, 3],
      [-0.00012, 0],
      [-0.00043, 0],
      [-4e-5, 3],
      [0.00181, 1],
      [0.00105, 1],
      [-0.00019, 0],
      [-0.0001, 3],
      [-5e-5, 3],
      [-0.00017, 0],
      [0.00207, 1],
      [-0.00012, 3],
      [0.00192, 1],
      [-3e-5, 3]
    ]
  },
  "QS_lstBpsurgSide": {
    "red_x_points": [
      [-0.00057, 3],
      [-0.0124, 0],
      [-0.01274, 0],
      [-0.01022, 0],
      [-0.01221, 0],
      [-0.01181, 0],
      [-0.01195, 0],
      [-0.00106, 3],
      [-0.01306, 0],
      [0.00096, 2],
      [-0.00057, 3],
      [0.00019, 2],
      [-0.001, 3],
      [-0.00023, 2],
      [-0.00225, 2],
      [-0.00076, 3],
      [-0.00063, 3],
      [-0.00078, 3],
      [-0.00808, 0],
      [-0.00055, 3],
      [-0.00097, 3],
      [-0.00097, 3],
      [0.00066, 2],
      [0.00082, 2],
      [-0.00141, 3],
      [0.01505, 1],
      [-0.00123, 3],
      [-0.01132, 0],
      [-0.00117, 3]
    ],
    "red_o_points": [],
    "y_categories": ["L", "NOT APPLICABLE", "R", "nan"],
    "blue_o_points": [],
    "blue_x_points": [
      [0.03006, 1],
      [-0.00057, 3],
      [0.00383, 2],
      [0.00536, 2],
      [-9e-5, 3],
      [0.0187, 1],
      [0.01285, 1],
      [-0.00284, 0],
      [-0.00062, 3],
      [-0.00019, 3],
      [0.00314, 2],
      [0.01643, 1],
      [-0.00044, 3],
      [0.01512, 1],
      [-0.00049, 3]
    ]
  },
  "QS_mulTransfSite[AcMc]": {
    "red_x_points": [
      [-0.00014, 3],
      [-0.00167, 0],
      [-0.00116, 0],
      [-0.00091, 0],
      [-0.00111, 0],
      [-0.00085, 0],
      [-0.00133, 0],
      [-0.00026, 3],
      [-0.00091, 0],
      [-0.01126, 2],
      [-0.00022, 3],
      [-0.00124, 0],
      [-0.00021, 3],
      [-0.00147, 0],
      [-0.00156, 0],
      [-0.00045, 3],
      [-0.00013, 3],
      [-0.00017, 3],
      [-0.0009, 0],
      [-0.00039, 3],
      [-0.00022, 3],
      [-0.00023, 3],
      [-0.00104, 0],
      [-0.00123, 0],
      [-0.00024, 3],
      [0.00248, 1],
      [-0.00023, 3],
      [-0.00085, 0],
      [-0.0003, 3]
    ],
    "red_o_points": [],
    "y_categories": ["N", "NOT APPLICABLE", "Y", "nan"],
    "blue_o_points": [],
    "blue_x_points": [
      [0.00631, 1],
      [-0.0001, 3],
      [0.00257, 0],
      [0.0023, 0],
      [9e-5, 3],
      [0.00518, 1],
      [0.00318, 1],
      [-0.00029, 0],
      [-0.00017, 3],
      [-1e-5, 3],
      [0.00155, 0],
      [0.00352, 1],
      [-0.0002, 3],
      [0.00467, 1],
      [-0.00041, 3]
    ]
  },
  "QS_mulTransfSite[Other]": {
    "red_x_points": [
      [-0.00122, 3],
      [-0.01146, 0],
      [-0.00946, 0],
      [-0.00751, 0],
      [-0.0092, 0],
      [-0.00939, 0],
      [-0.0085, 0],
      [-0.00134, 3],
      [-0.00931, 0],
      [-0.00973, 0],
      [-0.00129, 3],
      [-0.00998, 0],
      [-0.00177, 3],
      [-0.01046, 0],
      [-0.00937, 0],
      [-0.00139, 3],
      [-0.00118, 3],
      [-0.00089, 3],
      [-0.00803, 0],
      [-0.00119, 3],
      [-0.00154, 3],
      [-0.00133, 3],
      [-0.00997, 0],
      [-0.00947, 0],
      [-0.00131, 3],
      [0.01881, 1],
      [-0.00124, 3],
      [-0.00906, 0],
      [-0.00173, 3]
    ],
    "red_o_points": [],
    "y_categories": ["N", "NOT APPLICABLE", "Y", "nan"],
    "blue_o_points": [],
    "blue_x_points": [
      [0.03236, 1],
      [-0.00083, 3],
      [-0.00745, 0],
      [-0.00788, 0],
      [-0.00025, 3],
      [0.02569, 1],
      [0.02079, 1],
      [-0.00693, 0],
      [-0.00094, 3],
      [-0.00066, 3],
      [0.04457, 2],
      [0.02147, 1],
      [-0.00061, 3],
      [0.02099, 1],
      [-0.00084, 3]
    ]
  },
  "QA_yonInjBpsurg": {
    "red_x_points": [
      [-0.00024, 1],
      [-0.00046, 1],
      [-0.00041, 1],
      [-0.00053, 1],
      [-0.00052, 1],
      [-0.00026, 1],
      [-0.00049, 1],
      [-0.00054, 1],
      [-0.00036, 1],
      [-0.0002, 1],
      [-0.00031, 1],
      [-0.00021, 1],
      [-0.00078, 1],
      [-0.00069, 1],
      [-0.00029, 1],
      [-0.00026, 1],
      [-0.00026, 1],
      [-0.00025, 1],
      [-0.00019, 1],
      [-0.0004, 1],
      [-0.00073, 1],
      [-0.00062, 1],
      [-0.00021, 1],
      [-0.00024, 1],
      [-0.0007, 1],
      [0.00191, 0],
      [-0.00052, 1],
      [-0.00027, 1],
      [-0.00081, 1]
    ],
    "red_o_points": [],
    "y_categories": ["N", "Y", "nan"],
    "blue_o_points": [],
    "blue_x_points": [
      [0.00431, 0],
      [-0.0004, 1],
      [-0.00026, 1],
      [-0.00054, 1],
      [-0.00017, 1],
      [0.00152, 0],
      [0.00163, 0],
      [-0.00024, 1],
      [-0.00038, 1],
      [-0.00016, 1],
      [-0.00022, 1],
      [0.00243, 0],
      [-0.00018, 1],
      [0.00269, 0],
      [-0.00018, 1]
    ]
  },
  "QA_lstPexTouch[C8]": {
    "red_x_points": [
      [-0.00146, 1],
      [-0.00576, 2],
      [-0.00255, 1],
      [-0.00238, 1],
      [-0.00732, 2],
      [-0.00437, 1],
      [-0.00356, 1],
      [-0.00429, 0],
      [-0.00612, 1],
      [0.01165, 0],
      [-0.00248, 1],
      [-0.00906, 2],
      [-0.00387, 2],
      [-0.00998, 2],
      [-0.00264, 2],
      [-0.00086, 0],
      [-0.00202, 1],
      [-0.00276, 0],
      [-0.00495, 2],
      [-0.00199, 0],
      [-0.00303, 2],
      [-0.00707, 0],
      [-0.00602, 1],
      [-0.00846, 2],
      [-0.00336, 0],
      [-0.00984, 1],
      [-0.00153, 2],
      [-0.00303, 1],
      [7e-5, 1]
    ],
    "red_o_points": [],
    "y_categories": ["NORM", "NPV", "nan"],
    "blue_o_points": [],
    "blue_x_points": [
      [0.00636, 0],
      [0.0087, 1],
      [0.0201, 0],
      [0.02805, 0],
      [0.00436, 2],
      [0.0018, 2],
      [-0.00018, 1],
      [-0.00109, 1],
      [0.01087, 1],
      [0.00449, 2],
      [0.01521, 0],
      [-0.00074, 1],
      [-0.00043, 0],
      [0.00526, 0],
      [0.00626, 0]
    ]
  },
  "QS_mulLysisNerve[Ssr]": {
    "red_x_points": [
      [-0.00048, 3],
      [-0.00425, 0],
      [-0.01084, 2],
      [-0.0096, 2],
      [-0.00279, 0],
      [-0.0023, 0],
      [-0.00256, 0],
      [-0.00096, 3],
      [-0.0025, 0],
      [-0.00239, 0],
      [-0.00063, 3],
      [-0.00259, 0],
      [-0.00091, 3],
      [-0.0036, 0],
      [-0.00361, 0],
      [-0.00057, 3],
      [-0.00041, 3],
      [-0.00042, 3],
      [-0.00253, 0],
      [-0.00065, 3],
      [-0.00086, 3],
      [-0.00092, 3],
      [-0.00279, 0],
      [-0.00273, 0],
      [-0.00084, 3],
      [0.0096, 1],
      [-0.00091, 3],
      [-0.00226, 0],
      [-0.00099, 3]
    ],
    "red_o_points": [],
    "y_categories": ["N", "NOT APPLICABLE", "Y", "nan"],
    "blue_o_points": [],
    "blue_x_points": [
      [0.01763, 1],
      [-0.00061, 3],
      [-0.00117, 0],
      [-0.00144, 0],
      [-3e-5, 3],
      [0.0135, 1],
      [0.0092, 1],
      [-0.00186, 0],
      [-0.00034, 3],
      [-0.0002, 3],
      [-0.0011, 0],
      [0.0125, 1],
      [-0.00031, 3],
      [0.01192, 1],
      [-0.00039, 3]
    ]
  },
  "QS_mulTransfSite[AcSsAA]": {
    "red_x_points": [
      [-0.00015, 3],
      [-0.00117, 2],
      [-0.00591, 0],
      [-0.00553, 0],
      [-8e-5, 2],
      [-0.00619, 0],
      [-0.00609, 0],
      [-0.0004, 3],
      [-0.00727, 0],
      [-0.00682, 0],
      [-0.00022, 3],
      [-0.00564, 0],
      [-0.00039, 3],
      [-0.00075, 2],
      [-0.00427, 0],
      [-0.00019, 3],
      [-0.00015, 3],
      [-0.0002, 3],
      [-0.00059, 2],
      [-3e-5, 3],
      [-0.00042, 3],
      [-0.00029, 3],
      [-0.00582, 0],
      [4e-5, 2],
      [-0.00043, 3],
      [0.00645, 1],
      [-0.0005, 3],
      [-0.00489, 0],
      [-0.00035, 3]
    ],
    "red_o_points": [],
    "y_categories": ["N", "NOT APPLICABLE", "Y", "nan"],
    "blue_o_points": [],
    "blue_x_points": [
      [0.01647, 1],
      [-0.0001, 3],
      [0.00548, 2],
      [0.00584, 2],
      [4e-5, 3],
      [0.00923, 1],
      [0.00702, 1],
      [-0.00223, 0],
      [-0.00016, 3],
      [0.0001, 3],
      [-0.00211, 0],
      [0.00923, 1],
      [-0.00012, 3],
      [0.00937, 1],
      [0.00019, 3]
    ]
  },
  "QS_mulLysisRoot[C5]": {
    "red_x_points": [
      [-0.00021, 3],
      [-0.00229, 0],
      [-0.00673, 2],
      [-0.0017, 0],
      [-0.002, 0],
      [-0.00157, 0],
      [-0.00196, 0],
      [-0.00041, 3],
      [-0.00195, 0],
      [-0.00157, 0],
      [-0.00039, 3],
      [-0.0015, 0],
      [-0.00048, 3],
      [-0.0026, 0],
      [-0.00212, 0],
      [-0.00042, 3],
      [-0.00025, 3],
      [-0.00033, 3],
      [-0.00131, 0],
      [-0.00037, 3],
      [-0.00045, 3],
      [-0.00053, 3],
      [-0.00181, 0],
      [-0.00169, 0],
      [-0.00041, 3],
      [0.00568, 1],
      [-0.00037, 3],
      [-0.00625, 2],
      [-0.00045, 3]
    ],
    "red_o_points": [],
    "y_categories": ["N", "NOT APPLICABLE", "Y", "nan"],
    "blue_o_points": [],
    "blue_x_points": [
      [0.0134, 1],
      [-0.00031, 3],
      [-0.00067, 0],
      [-0.00084, 0],
      [-9e-5, 3],
      [0.00767, 1],
      [0.00576, 1],
      [-0.00117, 0],
      [-0.00014, 3],
      [-0.00012, 3],
      [-0.00064, 0],
      [0.00702, 1],
      [-0.00025, 3],
      [0.00705, 1],
      [-0.00026, 3]
    ]
  },
  "QS_mulNeuromadSite[C6]": {
    "red_x_points": [
      [2e-5, 2],
      [-0.00023, 0],
      [-6e-5, 0],
      [-1e-5, 0],
      [-0.00013, 0],
      [-6e-5, 0],
      [-0.00015, 0],
      [1e-5, 2],
      [-0.00015, 0],
      [-0.00018, 0],
      [1e-5, 2],
      [-0.00012, 0],
      [3e-5, 2],
      [-0.00029, 0],
      [-0.0002, 0],
      [1e-5, 2],
      [1e-5, 2],
      [-0.0, 2],
      [2e-5, 2],
      [4e-5, 2],
      [0.0, 2],
      [-0.00018, 0],
      [-0.00015, 0],
      [-0.0, 2],
      [8e-5, 1],
      [-0.0, 2],
      [-4e-5, 0],
      [2e-5, 2]
    ],
    "red_o_points": [],
    "y_categories": ["N", "NOT APPLICABLE", "nan"],
    "blue_o_points": [],
    "blue_x_points": [
      [0.00113, 1],
      [1e-5, 2],
      [-3e-5, 0],
      [-2e-5, 0],
      [2e-5, 2],
      [0.0005, 1],
      [-2e-5, 0],
      [4e-5, 2],
      [2e-5, 2],
      [-3e-5, 0],
      [1e-5, 2],
      [8e-5, 1],
      [-0.0, 2]
    ]
  },
  "QS_mulNeuromadSite[T1]": {
    "red_x_points": [
      [4e-5, 2],
      [-0.00067, 0],
      [-0.00048, 0],
      [-0.00014, 0],
      [-0.00039, 0],
      [-0.00039, 0],
      [-0.00033, 0],
      [-8e-5, 2],
      [-0.00037, 0],
      [-0.0003, 0],
      [-0.00011, 2],
      [-0.00048, 0],
      [-0.00014, 2],
      [-0.00057, 0],
      [-0.0006, 0],
      [-3e-5, 2],
      [5e-5, 2],
      [-4e-5, 2],
      [-0.00043, 0],
      [2e-5, 2],
      [-5e-5, 2],
      [-3e-5, 2],
      [-0.00059, 0],
      [-0.00045, 0],
      [-0.00018, 2],
      [0.00082, 1],
      [-9e-5, 2],
      [-0.00034, 0],
      [-9e-5, 2]
    ],
    "red_o_points": [],
    "y_categories": ["N", "NOT APPLICABLE", "nan"],
    "blue_o_points": [],
    "blue_x_points": [
      [0.00205, 1],
      [2e-5, 2],
      [-0.00011, 0],
      [-0.00014, 0],
      [3e-5, 2],
      [0.00164, 1],
      [0.00077, 1],
      [-0.00011, 0],
      [-2e-5, 2],
      [-2e-5, 2],
      [-0.00017, 0],
      [0.00124, 1],
      [5e-5, 2],
      [0.00129, 1],
      [-9e-5, 2]
    ]
  },
  "QA_lstPexTouch[C7]": {
    "red_x_points": [
      [-0.00194, 1],
      [-0.01009, 2],
      [-0.00339, 1],
      [-0.00367, 1],
      [-0.01246, 2],
      [-0.00621, 1],
      [-0.00644, 1],
      [-0.00494, 0],
      [-0.00842, 1],
      [-0.00957, 1],
      [-0.00296, 1],
      [-0.01434, 2],
      [-0.00251, 2],
      [-0.01577, 2],
      [-0.00576, 2],
      [-0.00124, 0],
      [-0.00154, 1],
      [-0.0022, 0],
      [-0.00858, 2],
      [-0.00193, 0],
      [-0.00259, 2],
      [-0.00752, 0],
      [-0.0088, 1],
      [-0.01195, 2],
      [-0.00368, 0],
      [-0.00544, 1],
      [-0.00072, 2],
      [-0.00275, 1],
      [0.00066, 1]
    ],
    "red_o_points": [],
    "y_categories": ["NORM", "NPV", "nan"],
    "blue_o_points": [],
    "blue_x_points": [
      [-0.00013, 1],
      [0.00852, 1],
      [0.0414, 0],
      [0.04947, 0],
      [0.00594, 2],
      [-2e-5, 2],
      [-0.0001, 1],
      [-0.00371, 1],
      [0.00972, 1],
      [0.00624, 2],
      [0.03951, 0],
      [-3e-5, 1],
      [-0.00051, 0],
      [0.00493, 0],
      [0.00549, 0]
    ]
  },
  "QA_yonInjPhysio": {
    "red_x_points": [
      [-0.00811, 0],
      [0.00069, 0],
      [0.00027, 0],
      [-0.0, 0],
      [-0.00207, 2],
      [0.0009, 0],
      [0.00036, 0],
      [-0.00505, 0],
      [0.00127, 0],
      [-0.00942, 1],
      [-0.00693, 0],
      [0.00111, 0],
      [-0.008, 0],
      [-0.00846, 1],
      [-0.00164, 1],
      [0.00369, 1],
      [-0.00674, 0],
      [0.00463, 1],
      [0.00054, 0],
      [-0.00703, 0],
      [0.00398, 1],
      [0.00413, 1],
      [0.00154, 0],
      [-0.00584, 1],
      [-0.00842, 2],
      [-0.01775, 1],
      [-0.00873, 2],
      [7e-5, 0],
      [0.00504, 1]
    ],
    "red_o_points": [],
    "y_categories": ["N", "Y", "nan"],
    "blue_o_points": [],
    "blue_x_points": [
      [0.00647, 0],
      [0.00782, 1],
      [0.00598, 0],
      [0.00872, 0],
      [0.00851, 1],
      [0.00641, 0],
      [0.00389, 0],
      [0.00208, 0],
      [-0.00191, 0],
      [0.00691, 1],
      [0.00494, 0],
      [0.00519, 0],
      [0.0068, 1],
      [-0.00371, 1],
      [0.0079, 1]
    ]
  },
  "QS_mulLysisSite[Root]": {
    "red_x_points": [
      [-0.00021, 3],
      [-0.00149, 0],
      [-0.00543, 2],
      [-0.00131, 0],
      [-0.0015, 0],
      [-0.00122, 0],
      [-0.00143, 0],
      [-0.00035, 3],
      [-0.00146, 0],
      [-0.00139, 0],
      [-0.00045, 3],
      [-0.00136, 0],
      [-0.00043, 3],
      [-0.00161, 0],
      [-0.00143, 0],
      [-0.00046, 3],
      [-0.00041, 3],
      [-0.00015, 3],
      [-0.00121, 0],
      [-0.00032, 3],
      [-0.0004, 3],
      [-0.00039, 3],
      [-0.00136, 0],
      [-0.00128, 0],
      [-0.00026, 3],
      [0.00491, 1],
      [-0.00029, 3],
      [-0.00591, 2],
      [-0.00034, 3]
    ],
    "red_o_points": [],
    "y_categories": ["N", "NOT APPLICABLE", "Y", "nan"],
    "blue_o_points": [],
    "blue_x_points": [
      [0.01038, 1],
      [-0.00021, 3],
      [-0.00034, 0],
      [-0.00046, 0],
      [-3e-5, 3],
      [0.00641, 1],
      [0.00467, 1],
      [-0.00108, 0],
      [-0.00011, 3],
      [-0.0001, 3],
      [-0.00041, 0],
      [0.0056, 1],
      [-0.00011, 3],
      [0.005, 1],
      [-0.00031, 3]
    ]
  },
  "QS_mulNeuromadSite[T2]": {
    "red_x_points": [
      [3e-5, 2],
      [-0.00068, 0],
      [-0.00059, 0],
      [-0.00038, 0],
      [-0.00038, 0],
      [-0.00036, 0],
      [-0.00061, 0],
      [-9e-5, 2],
      [-0.00053, 0],
      [-0.00046, 0],
      [-2e-5, 2],
      [-0.00063, 0],
      [-0.0001, 2],
      [-0.00074, 0],
      [-0.00059, 0],
      [-1e-5, 2],
      [-3e-5, 2],
      [0.0, 2],
      [-0.00049, 0],
      [-3e-5, 2],
      [-6e-5, 2],
      [-6e-5, 2],
      [-0.00077, 0],
      [-0.00052, 0],
      [-0.0001, 2],
      [0.00075, 1],
      [-8e-5, 2],
      [-0.00036, 0],
      [-0.0001, 2]
    ],
    "red_o_points": [],
    "y_categories": ["N", "NOT APPLICABLE", "nan"],
    "blue_o_points": [],
    "blue_x_points": [
      [0.00348, 1],
      [-5e-5, 2],
      [-0.00033, 0],
      [-0.00029, 0],
      [0.00015, 2],
      [0.00179, 1],
      [0.00044, 1],
      [-0.00033, 0],
      [-1e-5, 2],
      [0.0001, 2],
      [-0.00022, 0],
      [0.00156, 1],
      [1e-5, 2],
      [0.00174, 1],
      [-6e-5, 2]
    ]
  },
  "QS_mulGraftNerve[MC]": {
    "red_x_points": [
      [-5e-5, 0],
      [0.0, 2],
      [-5e-5, 0],
      [0.0, 2],
      [5e-5, 1],
      [0.0, 2]
    ],
    "red_o_points": [],
    "y_categories": ["N", "NOT APPLICABLE", "nan"],
    "blue_o_points": [],
    "blue_x_points": [[0.0, 2], [5e-5, 1]]
  },
  "QS_mulNeuromadSite[C4]": {
    "red_x_points": [
      [-0.00015, 0],
      [-6e-5, 0],
      [-6e-5, 0],
      [-9e-5, 0],
      [-2e-5, 0],
      [-7e-5, 0],
      [1e-5, 2],
      [-6e-5, 0],
      [-6e-5, 0],
      [1e-5, 2],
      [-6e-5, 0],
      [2e-5, 2],
      [-0.00015, 0],
      [-9e-5, 0],
      [1e-5, 2],
      [1e-5, 2],
      [1e-5, 2],
      [2e-5, 2],
      [5e-5, 2],
      [-6e-5, 0],
      [-2e-5, 0],
      [6e-5, 2]
    ],
    "red_o_points": [],
    "y_categories": ["N", "NOT APPLICABLE", "nan"],
    "blue_o_points": [],
    "blue_x_points": [
      [0.00057, 1],
      [2e-5, 2],
      [-3e-5, 0],
      [1e-5, 2],
      [0.00011, 1],
      [5e-5, 2],
      [1e-5, 2],
      [-2e-5, 0],
      [1e-5, 2]
    ]
  },
  "QS_mulGraftNerve[Ra]": {
    "red_x_points": [
      [-6e-5, 0],
      [-6e-5, 0],
      [-1e-5, 2],
      [-6e-5, 0],
      [-1e-5, 2],
      [-1e-5, 2],
      [-1e-5, 2],
      [-1e-5, 2],
      [-1e-5, 2],
      [-1e-5, 2]
    ],
    "red_o_points": [],
    "y_categories": ["N", "NOT APPLICABLE", "nan"],
    "blue_o_points": [],
    "blue_x_points": [[0.00014, 1], [-1e-5, 2], [-1e-5, 2], [0.00014, 1]]
  },
  "QS_mulTransfSite[Oberlin]": {
    "red_x_points": [
      [-0.00156, 3],
      [-0.02636, 0],
      [-0.02487, 0],
      [-0.02368, 0],
      [-0.02512, 0],
      [0.00374, 2],
      [-0.02589, 0],
      [-0.00221, 3],
      [0.00427, 2],
      [0.00369, 2],
      [-0.00164, 3],
      [0.00377, 2],
      [-0.00238, 3],
      [0.00257, 2],
      [-0.02361, 0],
      [-0.0017, 3],
      [-0.00191, 3],
      [-0.00155, 3],
      [-0.02208, 0],
      [-0.00169, 3],
      [-0.00212, 3],
      [-0.00218, 3],
      [0.00344, 2],
      [-0.02491, 0],
      [-0.00221, 3],
      [0.02898, 1],
      [-0.00208, 3],
      [-0.02431, 0],
      [-0.00227, 3]
    ],
    "red_o_points": [],
    "y_categories": ["N", "NOT APPLICABLE", "Y", "nan"],
    "blue_o_points": [],
    "blue_x_points": [
      [0.04532, 1],
      [-0.0014, 3],
      [0.0061, 2],
      [0.00679, 2],
      [-0.00084, 3],
      [0.03738, 1],
      [0.03168, 1],
      [0.0047, 2],
      [-0.0014, 3],
      [-0.0011, 3],
      [0.00582, 2],
      [0.03399, 1],
      [-0.00095, 3],
      [0.03116, 1],
      [-0.00137, 3]
    ]
  },
  "QA_intPexForearmProna": {
    "red_x_points": [
      [-0.00046, 2],
      [-0.00067, 0],
      [-0.00064, 2],
      [-0.00025, 2],
      [-0.00056, 2],
      [-0.00207, 0],
      [-0.00064, 2],
      [-0.02072, 0],
      [-0.00057, 2],
      [-0.00064, 2],
      [-0.02116, 0],
      [-0.00222, 0],
      [-0.00102, 2],
      [-0.0005, 2],
      [2e-5, 2],
      [-0.02111, 0],
      [-0.01932, 0],
      [-0.01819, 0],
      [-0.00125, 0],
      [-0.00035, 2],
      [-0.00108, 2],
      [-0.00094, 2],
      [-0.00064, 2],
      [-0.00064, 2],
      [0.00032, 2],
      [0.00033, 1],
      [0.00038, 2],
      [-0.00189, 0],
      [-0.0009, 2]
    ],
    "red_o_points": [],
    "y_categories": ["GREATER THAN OR EQUALS TO 80", "LESS THAN 80", "nan"],
    "blue_o_points": [],
    "blue_x_points": [
      [-0.00042, 2],
      [0.05941, 1],
      [-0.00036, 0],
      [-0.00038, 2],
      [0.00105, 2],
      [2e-5, 2],
      [0.00089, 1],
      [9e-5, 2],
      [-0.00019, 2],
      [0.0011, 2],
      [-0.0004, 0],
      [1e-5, 2],
      [0.0016, 2],
      [2e-5, 2],
      [0.05495, 1]
    ]
  },
  "QA_lstPexArthre[Index]": {
    "red_x_points": [
      [-0.01236, 0],
      [-0.0053, 2],
      [-0.00358, 2],
      [-0.00644, 0],
      [-0.01011, 0],
      [0.00724, 1],
      [-0.00879, 0],
      [0.00043, 2],
      [0.01094, 1],
      [-0.01396, 0],
      [0.00342, 1],
      [-0.00731, 2],
      [0.00044, 2],
      [0.00978, 1],
      [-0.00229, 2],
      [0.00338, 1],
      [-0.01054, 0],
      [0.00233, 1],
      [-0.00545, 2],
      [-0.01249, 0],
      [0.00062, 2],
      [0.00031, 2],
      [-0.00705, 2],
      [-0.00604, 2],
      [0.00204, 1],
      [-0.00078, 2],
      [0.00079, 2],
      [-0.00584, 0],
      [0.00058, 2]
    ],
    "red_o_points": [],
    "y_categories": ["NPV", "PV", "nan"],
    "blue_o_points": [],
    "blue_x_points": [
      [0.00032, 0],
      [0.00199, 2],
      [0.01352, 1],
      [0.01431, 1],
      [0.00245, 2],
      [-0.00016, 2],
      [0.00154, 1],
      [0.01263, 1],
      [0.00205, 2],
      [0.00173, 2],
      [0.01268, 1],
      [0.00168, 1],
      [0.0037, 1],
      [-0.0002, 2],
      [0.00781, 1]
    ]
  },
  "QA_yonPexPain": {
    "red_x_points": [
      [-0.00658, 1],
      [-0.00062, 1],
      [-0.00075, 1],
      [-0.00044, 1],
      [-0.00063, 1],
      [-0.00224, 0],
      [-0.00057, 1],
      [-0.00675, 1],
      [-0.00163, 0],
      [-0.00042, 1],
      [-0.00433, 1],
      [-0.00072, 0],
      [-0.00936, 1],
      [-0.00031, 1],
      [-0.0005, 1],
      [0.00582, 0],
      [-0.00493, 1],
      [0.00567, 0],
      [-0.00033, 1],
      [0.00874, 0],
      [-0.01963, 2],
      [-0.00904, 1],
      [-0.0005, 1],
      [-0.00057, 1],
      [-0.01301, 2],
      [-0.00186, 1],
      [-0.0064, 1],
      [-0.00023, 1],
      [-0.00923, 1]
    ],
    "red_o_points": [],
    "y_categories": ["N", "Y", "nan"],
    "blue_o_points": [],
    "blue_x_points": [
      [-0.00026, 1],
      [0.02135, 0],
      [0.00139, 0],
      [0.00147, 1],
      [-0.00509, 1],
      [0.00051, 2],
      [-1e-5, 1],
      [0.00302, 1],
      [0.02671, 0],
      [0.01844, 0],
      [0.00126, 1],
      [0.00227, 0],
      [0.01046, 0],
      [-0.00029, 1],
      [0.00013, 1]
    ]
  },
  "QS_mulGraftNerve[FI]": {
    "red_x_points": [
      [0.0, 2],
      [-8e-5, 0],
      [-0.00012, 0],
      [-8e-5, 0],
      [-0.00013, 0],
      [-3e-5, 0],
      [-9e-5, 0],
      [0.0, 2],
      [-9e-5, 0],
      [-1e-5, 0],
      [-0.0, 2],
      [-0.00012, 0],
      [0.0, 2],
      [-0.00013, 0],
      [-7e-5, 0],
      [-0.0, 2],
      [-0.0, 2],
      [-0.0, 2],
      [-6e-5, 0],
      [1e-5, 2],
      [0.0, 2],
      [-1e-5, 2],
      [-0.00012, 0],
      [-0.00012, 0],
      [0.0, 2],
      [-1e-5, 2],
      [-6e-5, 0],
      [0.0, 2]
    ],
    "red_o_points": [],
    "y_categories": ["N", "NOT APPLICABLE", "nan"],
    "blue_o_points": [],
    "blue_x_points": [
      [0.0004, 1],
      [0.0, 2],
      [-1e-5, 0],
      [-5e-5, 0],
      [0.0, 2],
      [0.0003, 1],
      [0.00013, 1],
      [-8e-5, 0],
      [0.0, 2],
      [0.0, 2],
      [-5e-5, 0],
      [0.00026, 1],
      [1e-5, 2],
      [0.0004, 1],
      [-1e-5, 2]
    ]
  },
  "QA_lstPexPalle[Ulna]": {
    "red_x_points": [
      [-0.00083, 4],
      [-0.00301, 4],
      [-0.00241, 4],
      [-0.00767, 2],
      [-0.00355, 4],
      [-0.01204, 1],
      [-0.00272, 4],
      [-0.00065, 4],
      [-0.00448, 4],
      [0.01271, 3],
      [-0.01146, 1],
      [-0.00452, 4],
      [-0.00094, 4],
      [-0.00418, 4],
      [-0.00137, 4],
      [0.0056, 3],
      [-0.0108, 0],
      [0.00324, 3],
      [-0.0086, 0],
      [0.00513, 3],
      [-0.00088, 4],
      [-0.00092, 4],
      [-0.00445, 4],
      [-0.00355, 4],
      [-0.00043, 4],
      [0.00254, 3],
      [-0.00026, 4],
      [-0.0081, 0],
      [-0.00103, 4]
    ],
    "red_o_points": [],
    "y_categories": ["ABS", "HYPO", "NAIA", "PT", "nan"],
    "blue_o_points": [],
    "blue_x_points": [
      [-0.00046, 4],
      [-0.00026, 4],
      [0.01843, 3],
      [0.02189, 3],
      [9e-5, 4],
      [-0.00012, 4],
      [0.00227, 3],
      [-0.00317, 4],
      [0.00033, 4],
      [0.00036, 4],
      [0.01615, 3],
      [-0.00013, 4],
      [0.0039, 3],
      [-0.00012, 4],
      [0.01049, 3]
    ]
  }
}
