{
  "QA_lstPexMuscstrength[ElbowFlex]": {
    "red_x_points": [
      [-0.01353, 1],
      [-0.00115, 2],
      [-0.01228, 1],
      [-0.01175, 1],
      [-0.01269, 1],
      [-0.01356, 1],
      [-0.01268, 1],
      [-0.01204, 1],
      [-0.01333, 1],
      [-0.01378, 1],
      [-0.01331, 1],
      [-0.01352, 1],
      [-0.00058, 2],
      [-0.00475, 2],
      [0.00151, 2],
      [-0.01301, 1],
      [-0.01362, 1],
      [-0.01234, 1],
      [-0.01186, 1],
      [-0.01354, 1],
      [-0.00026, 2],
      [-0.0126, 1],
      [-0.01367, 1],
      [-0.01324, 1],
      [-0.01212, 1],
      [0.00112, 2],
      [-0.01191, 1],
      [-0.01288, 1],
      [-0.00024, 2]
    ],
    "red_o_points": [],
    "y_categories": ["GREATER THAN OR EQUALS TO 3", "LESS THAN 3", "nan"],
    "blue_o_points": [],
    "blue_x_points": [
      [0.00177, 2],
      [-0.01163, 1],
      [0.07042, 0],
      [-0.01283, 1],
      [0.00387, 2],
      [0.00319, 2],
      [0.04599, 0],
      [-0.01055, 1],
      [-0.0117, 1],
      [0.00302, 2],
      [0.06751, 0],
      [0.04681, 0],
      [0.05544, 0],
      [0.04761, 0],
      [-0.01134, 1]
    ]
  },
  "participant_code": {
    "red_x_points": [
      [-0.0436, 1],
      [-0.04491, 2],
      [-0.04251, 3],
      [-0.04449, 4],
      [-0.04395, 5],
      [-0.04429, 8],
      [-0.0434, 9],
      [-0.04319, 10],
      [-0.04429, 11],
      [-0.04381, 13],
      [-0.04443, 14],
      [-0.04347, 18],
      [-0.04278, 19],
      [-0.04367, 20],
      [-0.04319, 23],
      [-0.04388, 26],
      [-0.04381, 28],
      [-0.04484, 29],
      [-0.04395, 30],
      [-0.04333, 31],
      [-0.04312, 32],
      [-0.04395, 34],
      [-0.04374, 36],
      [-0.04285, 38],
      [-0.04504, 39],
      [-0.04408, 40],
      [-0.04401, 41],
      [-0.04353, 42],
      [-0.04326, 43]
    ],
    "red_o_points": [],
    "y_categories": [
      "P16554",
      "P18297",
      "P19283",
      "P19287",
      "P23172",
      "P23391",
      "P30595",
      "P31645",
      "P31691",
      "P34778",
      "P35046",
      "P36328",
      "P43633",
      "P4544",
      "P46417",
      "P48965",
      "P53068",
      "P5497",
      "P58556",
      "P59529",
      "P62483",
      "P64658",
      "P65202",
      "P66816",
      "P6751",
      "P7408",
      "P75566",
      "P76226",
      "P79971",
      "P82621",
      "P82990",
      "P84549",
      "P84932",
      "P85825",
      "P86989",
      "P8770",
      "P87791",
      "P90550",
      "P93159",
      "P94969",
      "P96710",
      "P97130",
      "P9744",
      "P98500",
      "nan"
    ],
    "blue_o_points": [],
    "blue_x_points": [
      [0.08383, 0],
      [0.08607, 6],
      [0.08554, 7],
      [0.08594, 12],
      [0.08554, 15],
      [0.08016, 16],
      [0.08252, 17],
      [0.08423, 21],
      [0.08554, 22],
      [0.08397, 24],
      [0.08659, 25],
      [0.08515, 27],
      [0.08344, 33],
      [0.08475, 35],
      [0.08607, 37]
    ]
  },
  "QS_mulLysisTrunk[Upper]": {
    "red_x_points": [
      [-0.00054, 3],
      [-0.00486, 0],
      [-0.00292, 0],
      [-0.00276, 0],
      [-0.00312, 0],
      [-0.0129, 2],
      [-0.00306, 0],
      [-0.00083, 3],
      [-0.00319, 0],
      [-0.00325, 0],
      [-0.00059, 3],
      [-0.00294, 0],
      [-0.00111, 3],
      [-0.00436, 0],
      [-0.01088, 2],
      [-0.00071, 3],
      [-0.00064, 3],
      [-0.00043, 3],
      [-0.00278, 0],
      [-0.00056, 3],
      [-0.00099, 3],
      [-0.00067, 3],
      [-0.00307, 0],
      [-0.00291, 0],
      [-0.00074, 3],
      [0.01072, 1],
      [-0.00062, 3],
      [-0.01228, 2],
      [-0.0007, 3]
    ],
    "red_o_points": [],
    "y_categories": ["N", "NOT APPLICABLE", "Y", "nan"],
    "blue_o_points": [],
    "blue_x_points": [
      [0.02551, 1],
      [-0.00045, 3],
      [-0.00096, 0],
      [-0.00139, 0],
      [-8e-5, 3],
      [0.01763, 1],
      [0.01255, 1],
      [-0.00162, 0],
      [-0.00029, 3],
      [-0.00039, 3],
      [-0.00086, 0],
      [0.01171, 1],
      [-0.00017, 3],
      [0.01274, 1],
      [-0.00026, 3]
    ]
  },
  "QS_mulNeuromadSite[C5]": {
    "red_x_points": [
      [-3e-5, 0],
      [-3e-5, 0],
      [-3e-5, 0],
      [1e-5, 2],
      [-3e-5, 0],
      [1e-5, 2],
      [1e-5, 2]
    ],
    "red_o_points": [],
    "y_categories": ["N", "NOT APPLICABLE", "nan"],
    "blue_o_points": [],
    "blue_x_points": [[0.00013, 1], [1e-5, 2], [-3e-5, 0], [1e-5, 2]]
  },
  "QS_mulTransfSite[IMc]": {
    "red_x_points": [
      [-0.00089, 3],
      [-0.02246, 2],
      [-0.00351, 0],
      [-0.01878, 2],
      [-0.00344, 0],
      [-0.00354, 0],
      [-0.00358, 0],
      [-0.00193, 3],
      [-0.00378, 0],
      [-0.00356, 0],
      [-0.00108, 3],
      [-0.00336, 0],
      [-0.00202, 3],
      [-0.00678, 0],
      [-0.01901, 2],
      [-0.00123, 3],
      [-0.0011, 3],
      [-0.00107, 3],
      [-0.00326, 0],
      [-0.00088, 3],
      [-0.00235, 3],
      [-0.0019, 3],
      [-0.00381, 0],
      [-0.02251, 2],
      [-0.00185, 3],
      [0.02273, 1],
      [-0.00181, 3],
      [-0.01975, 2],
      [-0.00216, 3]
    ],
    "red_o_points": [],
    "y_categories": ["N", "NOT APPLICABLE", "Y", "nan"],
    "blue_o_points": [],
    "blue_x_points": [
      [0.04254, 1],
      [-0.00106, 3],
      [-0.00057, 0],
      [-0.00078, 0],
      [-0.00027, 3],
      [0.03368, 1],
      [0.02131, 1],
      [-0.00189, 0],
      [-0.00108, 3],
      [-0.00045, 3],
      [-0.00083, 0],
      [0.02436, 1],
      [-0.00052, 3],
      [0.02512, 1],
      [-0.00088, 3]
    ]
  },
  "QA_mulInjOrthesisType[ArmSling]": {
    "red_x_points": [
      [-0.01042, 2],
      [-0.01042, 2],
      [-0.0095, 2],
      [-0.00947, 2],
      [-0.01011, 2],
      [-0.00984, 2],
      [-0.00972, 2],
      [-0.00985, 2],
      [-0.00926, 2],
      [-0.01041, 2],
      [-0.01023, 2],
      [-0.01001, 2],
      [-0.01094, 2],
      [-0.0097, 2],
      [-0.03139, 0],
      [-0.00996, 2],
      [-0.01038, 2],
      [-0.03058, 0],
      [-0.03059, 3],
      [-0.01038, 2],
      [-0.0099, 2],
      [-0.00948, 2],
      [-0.01036, 2],
      [-0.01029, 2],
      [-0.03029, 3],
      [-0.03365, 3],
      [-0.03079, 3],
      [-0.0097, 2],
      [-0.00993, 2]
    ],
    "red_o_points": [],
    "y_categories": ["N", "NOT APPLICABLE", "Y", "nan"],
    "blue_o_points": [],
    "blue_x_points": [
      [-0.00936, 2],
      [-0.00945, 2],
      [-0.00956, 2],
      [-0.00902, 2],
      [0.06215, 1],
      [0.06082, 1],
      [0.05716, 1],
      [0.05958, 1],
      [-0.00936, 2],
      [0.06103, 1],
      [-0.0096, 2],
      [0.05777, 1],
      [0.06469, 1],
      [0.06, 1],
      [-0.00931, 2]
    ]
  },
  "QS_mulLysisSite[Nerve]": {
    "red_x_points": [
      [-0.00033, 3],
      [-0.00179, 0],
      [-0.0059, 2],
      [-0.00522, 2],
      [-0.00152, 0],
      [-0.00102, 0],
      [-0.00135, 0],
      [-0.00058, 3],
      [-0.00124, 0],
      [-0.00123, 0],
      [-0.00038, 3],
      [-0.00116, 0],
      [-0.00093, 3],
      [-0.00242, 0],
      [-0.00178, 0],
      [-0.00021, 3],
      [-0.00029, 3],
      [-0.00025, 3],
      [-0.00097, 0],
      [-0.00038, 3],
      [-0.00084, 3],
      [-0.00077, 3],
      [-0.00112, 0],
      [-0.00126, 0],
      [-0.00053, 3],
      [0.00561, 1],
      [-0.0006, 3],
      [-0.00107, 0],
      [-0.00067, 3]
    ],
    "red_o_points": [],
    "y_categories": ["N", "NOT APPLICABLE", "Y", "nan"],
    "blue_o_points": [],
    "blue_x_points": [
      [0.01259, 1],
      [-0.0005, 3],
      [-0.00091, 0],
      [-0.00128, 0],
      [0.0, 3],
      [0.00631, 1],
      [0.0044, 1],
      [-0.00093, 0],
      [-0.00032, 3],
      [-6e-5, 3],
      [-0.00082, 0],
      [0.00581, 1],
      [-0.00021, 3],
      [0.00635, 1],
      [-0.00022, 3]
    ]
  },
  "QS_mulNeuromadSite[C8]": {
    "red_x_points": [
      [8e-5, 2],
      [-0.00028, 0],
      [-0.00016, 0],
      [-8e-5, 0],
      [-8e-5, 0],
      [-0.00013, 0],
      [-0.00018, 0],
      [-4e-5, 2],
      [-0.00016, 0],
      [-0.00018, 0],
      [2e-5, 2],
      [-0.0001, 0],
      [-3e-5, 2],
      [-0.00024, 0],
      [-0.00019, 0],
      [7e-5, 2],
      [2e-5, 2],
      [6e-5, 2],
      [-8e-5, 0],
      [4e-5, 2],
      [-9e-5, 2],
      [-6e-5, 2],
      [-0.00013, 0],
      [-9e-5, 0],
      [-3e-5, 2],
      [0.00022, 1],
      [-0.0, 2],
      [-0.0001, 0],
      [-6e-5, 2]
    ],
    "red_o_points": [],
    "y_categories": ["N", "NOT APPLICABLE", "nan"],
    "blue_o_points": [],
    "blue_x_points": [
      [0.00111, 1],
      [1e-5, 2],
      [-0.00011, 0],
      [8e-5, 2],
      [0.0005, 1],
      [-3e-5, 0],
      [-3e-5, 2],
      [1e-5, 2],
      [-2e-5, 0],
      [9e-5, 1],
      [7e-5, 2],
      [0.0003, 1],
      [0.0, 2]
    ]
  },
  "QS_mulTransfSite[AcMc]": {
    "red_x_points": [
      [-3e-5, 3],
      [-0.00058, 0],
      [-0.00038, 0],
      [-0.00041, 0],
      [-0.00042, 0],
      [-0.00027, 0],
      [-0.00039, 0],
      [-0.00013, 3],
      [-0.00041, 0],
      [-0.00305, 2],
      [-4e-5, 3],
      [-0.00016, 0],
      [-0.00033, 3],
      [-0.00065, 0],
      [-0.00043, 0],
      [-3e-5, 3],
      [-2e-5, 3],
      [2e-5, 3],
      [-0.00025, 0],
      [-4e-5, 3],
      [-0.00017, 3],
      [-0.00016, 3],
      [-5e-5, 0],
      [-0.00026, 0],
      [-4e-5, 3],
      [0.00101, 1],
      [-0.00011, 3],
      [-0.00026, 0],
      [-0.00027, 3]
    ],
    "red_o_points": [],
    "y_categories": ["N", "NOT APPLICABLE", "Y", "nan"],
    "blue_o_points": [],
    "blue_x_points": [
      [0.00358, 1],
      [-3e-5, 3],
      [9e-5, 0],
      [2e-5, 0],
      [2e-5, 3],
      [0.00163, 1],
      [0.0005, 1],
      [0.00022, 0],
      [1e-5, 3],
      [-2e-5, 3],
      [0.00018, 0],
      [0.00114, 1],
      [4e-5, 3],
      [0.00104, 1],
      [-6e-5, 3]
    ]
  },
  "QS_mulTransfSite[Other]": {
    "red_x_points": [
      [-0.00124, 3],
      [-0.01315, 0],
      [-0.01111, 0],
      [-0.00972, 0],
      [-0.01157, 0],
      [-0.01156, 0],
      [-0.01139, 0],
      [-0.00167, 3],
      [-0.01157, 0],
      [-0.01138, 0],
      [-0.00127, 3],
      [-0.01143, 0],
      [-0.00196, 3],
      [-0.01395, 0],
      [-0.01127, 0],
      [-0.0015, 3],
      [-0.00152, 3],
      [-0.0012, 3],
      [-0.00963, 0],
      [-0.0014, 3],
      [-0.0019, 3],
      [-0.0018, 3],
      [-0.01224, 0],
      [-0.01107, 0],
      [-0.00153, 3],
      [0.02097, 1],
      [-0.00155, 3],
      [-0.01115, 0],
      [-0.0019, 3]
    ],
    "red_o_points": [],
    "y_categories": ["N", "NOT APPLICABLE", "Y", "nan"],
    "blue_o_points": [],
    "blue_x_points": [
      [0.04251, 1],
      [-0.00106, 3],
      [-0.00963, 0],
      [-0.0103, 0],
      [-0.00036, 3],
      [0.03072, 1],
      [0.02377, 1],
      [-0.00829, 0],
      [-0.00114, 3],
      [-0.00084, 3],
      [0.06018, 2],
      [0.02385, 1],
      [-0.00079, 3],
      [0.02396, 1],
      [-0.00096, 3]
    ]
  },
  "QA_mulInjOrthesisType[ShoulderSupport]": {
    "red_x_points": [
      [-0.01113, 0],
      [-0.01082, 0],
      [-0.01025, 0],
      [-0.0415, 2],
      [-0.01069, 0],
      [-0.01064, 0],
      [-0.01063, 0],
      [-0.04023, 2],
      [-0.01067, 0],
      [-0.01064, 0],
      [-0.01057, 0],
      [-0.01076, 0],
      [-0.01083, 0],
      [-0.01058, 0],
      [-0.03957, 2],
      [-0.01068, 0],
      [-0.01087, 0],
      [-0.04036, 2],
      [-0.03915, 3],
      [-0.01067, 0],
      [-0.01056, 0],
      [-0.01044, 0],
      [-0.01043, 0],
      [-0.01042, 0],
      [-0.04116, 3],
      [-0.04143, 3],
      [-0.04191, 3],
      [-0.01055, 0],
      [-0.01058, 0]
    ],
    "red_o_points": [],
    "y_categories": ["N", "NOT APPLICABLE", "Y", "nan"],
    "blue_o_points": [],
    "blue_x_points": [
      [-0.00974, 0],
      [-0.01031, 0],
      [-0.01039, 0],
      [-0.01048, 0],
      [0.07851, 1],
      [0.07807, 1],
      [0.07569, 1],
      [0.07887, 1],
      [-0.01019, 0],
      [0.07731, 1],
      [-0.01007, 0],
      [0.07707, 1],
      [0.07851, 1],
      [0.07603, 1],
      [-0.01017, 0]
    ]
  },
  "QS_mulLysisNerve[Ssr]": {
    "red_x_points": [
      [-0.00025, 3],
      [-0.00231, 0],
      [-0.00611, 2],
      [-0.00578, 2],
      [-0.00192, 0],
      [-0.00156, 0],
      [-0.00191, 0],
      [-0.0007, 3],
      [-0.0018, 0],
      [-0.00151, 0],
      [-0.00012, 3],
      [-0.00146, 0],
      [-0.00073, 3],
      [-0.00282, 0],
      [-0.00179, 0],
      [-0.00016, 3],
      [-0.00021, 3],
      [-0.00014, 3],
      [-0.00128, 0],
      [-0.00012, 3],
      [-0.00073, 3],
      [-0.00065, 3],
      [-0.00175, 0],
      [-0.0015, 0],
      [-0.00051, 3],
      [0.00586, 1],
      [-0.0006, 3],
      [-0.00129, 0],
      [-0.00073, 3]
    ],
    "red_o_points": [],
    "y_categories": ["N", "NOT APPLICABLE", "Y", "nan"],
    "blue_o_points": [],
    "blue_x_points": [
      [0.01274, 1],
      [-0.00029, 3],
      [-0.00109, 0],
      [-0.00117, 0],
      [0.00014, 3],
      [0.00781, 1],
      [0.00517, 1],
      [-0.00095, 0],
      [-0.0004, 3],
      [-0.00014, 3],
      [-0.00095, 0],
      [0.00704, 1],
      [-1e-5, 3],
      [0.00693, 1],
      [-0.00024, 3]
    ]
  },
  "QS_mulTransfSite[AcSsAA]": {
    "red_x_points": [
      [-5e-5, 3],
      [-0.0, 2],
      [-0.0064, 0],
      [-0.00506, 0],
      [0.00108, 2],
      [-0.00432, 0],
      [-0.00682, 0],
      [-0.00087, 3],
      [-0.00863, 0],
      [-0.00522, 0],
      [-0.00017, 3],
      [-0.00548, 0],
      [-0.0009, 3],
      [0.00211, 2],
      [-0.00223, 0],
      [-0.00024, 3],
      [-9e-5, 3],
      [-0.0, 3],
      [-0.00015, 2],
      [-0.00017, 3],
      [-0.00087, 3],
      [-0.00072, 3],
      [-0.00522, 0],
      [0.00111, 2],
      [-0.00075, 3],
      [0.00617, 1],
      [-0.00076, 3],
      [-0.00307, 0],
      [-0.00086, 3]
    ],
    "red_o_points": [],
    "y_categories": ["N", "NOT APPLICABLE", "Y", "nan"],
    "blue_o_points": [],
    "blue_x_points": [
      [0.01691, 1],
      [-0.00042, 3],
      [0.00674, 2],
      [0.00759, 2],
      [-4e-5, 3],
      [0.0049, 1],
      [0.00289, 1],
      [-0.00172, 0],
      [-0.00045, 3],
      [0.0, 3],
      [-0.00165, 0],
      [0.00702, 1],
      [-2e-5, 3],
      [0.00679, 1],
      [5e-5, 3]
    ]
  },
  "QS_mulLysisRoot[C5]": {
    "red_x_points": [
      [-0.00018, 3],
      [-0.00172, 0],
      [-0.0039, 2],
      [-0.00081, 0],
      [-0.00097, 0],
      [-0.00089, 0],
      [-0.00104, 0],
      [-0.00052, 3],
      [-0.00113, 0],
      [-0.00063, 0],
      [-0.00023, 3],
      [-0.00079, 0],
      [-0.00069, 3],
      [-0.00196, 0],
      [-0.00168, 0],
      [-0.00034, 3],
      [-0.00021, 3],
      [-0.00016, 3],
      [-0.0009, 0],
      [-0.00027, 3],
      [-0.00061, 3],
      [-0.00054, 3],
      [-0.00083, 0],
      [-0.00067, 0],
      [-0.0005, 3],
      [0.00379, 1],
      [-0.00044, 3],
      [-0.00386, 2],
      [-0.00061, 3]
    ],
    "red_o_points": [],
    "y_categories": ["N", "NOT APPLICABLE", "Y", "nan"],
    "blue_o_points": [],
    "blue_x_points": [
      [0.00978, 1],
      [-0.00019, 3],
      [-0.00022, 0],
      [-0.00059, 0],
      [0.00015, 3],
      [0.00452, 1],
      [0.0028, 1],
      [-0.00056, 0],
      [-0.00021, 3],
      [1e-5, 3],
      [-0.00018, 0],
      [0.00426, 1],
      [-7e-5, 3],
      [0.00395, 1],
      [-0.00017, 3]
    ]
  },
  "QS_mulLysisSite[Root]": {
    "red_x_points": [
      [-0.00014, 3],
      [-0.00029, 0],
      [-0.00275, 2],
      [-0.00035, 0],
      [-0.00043, 0],
      [-0.00019, 0],
      [-0.00055, 0],
      [-0.00023, 3],
      [-0.00046, 0],
      [-0.00034, 0],
      [-0.00013, 3],
      [-0.00031, 0],
      [-0.00033, 3],
      [-0.0005, 0],
      [-0.00026, 0],
      [-0.00019, 3],
      [-0.00019, 3],
      [-6e-5, 3],
      [-0.00023, 0],
      [-0.00017, 3],
      [-0.00025, 3],
      [-0.00027, 3],
      [-0.00031, 0],
      [-9e-5, 0],
      [-0.00014, 3],
      [0.00161, 1],
      [-0.00018, 3],
      [-0.00285, 2],
      [-0.00023, 3]
    ],
    "red_o_points": [],
    "y_categories": ["N", "NOT APPLICABLE", "Y", "nan"],
    "blue_o_points": [],
    "blue_x_points": [
      [0.00568, 1],
      [-0.00028, 3],
      [0.00019, 0],
      [-5e-5, 0],
      [-3e-5, 3],
      [0.00116, 1],
      [0.0013, 1],
      [-0.00018, 0],
      [-0.00013, 3],
      [-4e-5, 3],
      [3e-5, 0],
      [0.0016, 1],
      [-5e-5, 3],
      [0.0018, 1],
      [-0.0002, 3]
    ]
  },
  "QS_lstBpsurgSide": {
    "red_x_points": [
      [-0.0006, 3],
      [-0.01351, 0],
      [-0.01463, 0],
      [-0.01116, 0],
      [-0.01432, 0],
      [-0.01178, 0],
      [-0.0142, 0],
      [-0.00173, 3],
      [-0.01349, 0],
      [0.00131, 2],
      [-0.00049, 3],
      [0.00116, 2],
      [-0.00164, 3],
      [0.00184, 2],
      [-0.00152, 2],
      [-0.00051, 3],
      [-0.00043, 3],
      [-0.00037, 3],
      [-0.00803, 0],
      [-0.0005, 3],
      [-0.00182, 3],
      [-0.00139, 3],
      [0.00086, 2],
      [0.0016, 2],
      [-0.0014, 3],
      [0.01472, 1],
      [-0.00138, 3],
      [-0.01188, 0],
      [-0.00159, 3]
    ],
    "red_o_points": [],
    "y_categories": ["L", "NOT APPLICABLE", "R", "nan"],
    "blue_o_points": [],
    "blue_x_points": [
      [0.03306, 1],
      [-0.00069, 3],
      [0.00403, 2],
      [0.00799, 2],
      [0.00019, 3],
      [0.01834, 1],
      [0.01133, 1],
      [-0.00176, 0],
      [-0.00087, 3],
      [-0.00015, 3],
      [0.00331, 2],
      [0.01645, 1],
      [-0.00023, 3],
      [0.01617, 1],
      [-0.0003, 3]
    ]
  },
  "QS_mulNeuromadSite[T1]": {
    "red_x_points": [
      [-0.0, 2],
      [-0.00021, 0],
      [-1e-5, 0],
      [-1e-5, 0],
      [-1e-5, 0],
      [-1e-5, 0],
      [-1e-5, 0],
      [-5e-5, 2],
      [-0.00014, 0],
      [-0.00011, 0],
      [-0.0, 2],
      [-0.0, 2],
      [-0.0, 2],
      [-5e-5, 2],
      [-0.0, 2],
      [-1e-5, 0],
      [-1e-5, 0],
      [0.0001, 1],
      [-0.0, 2]
    ],
    "red_o_points": [],
    "y_categories": ["N", "NOT APPLICABLE", "nan"],
    "blue_o_points": [],
    "blue_x_points": [
      [0.00024, 1],
      [-0.0, 2],
      [-1e-5, 0],
      [-1e-5, 0],
      [5e-5, 2],
      [0.00022, 1],
      [-0.0, 2],
      [5e-5, 2],
      [-1e-5, 0],
      [-0.0, 2]
    ]
  },
  "QA_yonInjUnconscio": {
    "red_x_points": [
      [-0.02152, 1],
      [-0.02145, 1],
      [-0.00193, 2],
      [-0.00292, 2],
      [-0.00191, 2],
      [-0.02236, 1],
      [-0.00186, 2],
      [-0.00425, 2],
      [-0.00227, 2],
      [-0.02379, 1],
      [-0.02162, 1],
      [-0.02444, 1],
      [-0.00449, 2],
      [-0.00286, 2],
      [-0.01427, 1],
      [-0.02174, 1],
      [-0.02162, 1],
      [-0.01522, 1],
      [-0.01531, 1],
      [-0.02097, 1],
      [-0.00498, 2],
      [-0.00351, 2],
      [-0.02476, 1],
      [-0.02322, 1],
      [-0.00439, 2],
      [-0.00332, 2],
      [-0.00439, 2],
      [-0.02036, 1],
      [-0.0057, 2]
    ],
    "red_o_points": [],
    "y_categories": ["N", "Y", "nan"],
    "blue_o_points": [],
    "blue_x_points": [
      [-0.00131, 2],
      [-0.00177, 2],
      [0.07677, 0],
      [-0.00057, 2],
      [-0.00942, 1],
      [-0.01155, 1],
      [0.04441, 0],
      [0.06392, 0],
      [-0.00218, 2],
      [0.06112, 0],
      [0.07784, 0],
      [-0.0025, 2],
      [-0.01163, 1],
      [-0.00229, 2],
      [0.08058, 0]
    ]
  },
  "QA_lstPexTouch[C7]": {
    "red_x_points": [
      [-0.00262, 1],
      [-0.00984, 2],
      [-0.00518, 1],
      [-0.00315, 1],
      [-0.01507, 2],
      [-0.00614, 1],
      [-0.00779, 1],
      [-0.00273, 0],
      [-0.01114, 1],
      [-0.01078, 1],
      [-0.00216, 1],
      [-0.02014, 2],
      [-0.0055, 2],
      [-0.01885, 2],
      [-0.00457, 2],
      [-0.00222, 0],
      [-0.00235, 1],
      [-0.00443, 0],
      [-0.00953, 2],
      [-0.00323, 0],
      [-0.00538, 2],
      [-0.00256, 0],
      [-0.01099, 1],
      [-0.01365, 2],
      [-0.00333, 0],
      [-0.0002, 1],
      [-0.00051, 2],
      [-0.00263, 1],
      [0.00169, 1]
    ],
    "red_o_points": [],
    "y_categories": ["NORM", "NPV", "nan"],
    "blue_o_points": [],
    "blue_x_points": [
      [-0.00016, 1],
      [0.00984, 1],
      [0.05005, 0],
      [0.06174, 0],
      [0.00829, 2],
      [0.0002, 2],
      [-0.00423, 1],
      [0.00981, 1],
      [0.00616, 2],
      [0.04038, 0],
      [-0.0002, 1],
      [-0.00111, 0],
      [0.0002, 0],
      [0.00403, 0]
    ]
  },
  "QA_lstPexInspectio[SurgicalScar]": {
    "red_x_points": [
      [-0.0027, 1],
      [-0.00675, 1],
      [-0.01049, 0],
      [-0.00467, 1],
      [-0.01231, 1],
      [-0.01402, 0],
      [-0.01089, 1],
      [-0.00257, 1],
      [-0.01362, 1],
      [-0.01374, 1],
      [-0.00727, 0],
      [-0.01374, 1],
      [0.00066, 2],
      [-0.01667, 1],
      [-0.00655, 0],
      [0.00477, 2],
      [0.00415, 2],
      [-0.00135, 1],
      [-0.00653, 1],
      [-0.0033, 1],
      [-0.00037, 2],
      [-0.00353, 1],
      [-0.01452, 1],
      [0.01866, 2],
      [-0.00159, 1],
      [-0.0003, 1],
      [-0.00149, 1],
      [0.00705, 2],
      [-0.00129, 1]
    ],
    "red_o_points": [],
    "y_categories": ["ABS", "NAIA", "PT", "nan"],
    "blue_o_points": [],
    "blue_x_points": [
      [-0.00049, 1],
      [0.00848, 2],
      [0.04023, 2],
      [0.04801, 2],
      [0.00197, 1],
      [0.00048, 1],
      [0.0005, 0],
      [-0.00843, 1],
      [-0.0023, 1],
      [0.00154, 1],
      [0.03388, 2],
      [-0.0004, 1],
      [0.0033, 2],
      [0.00123, 0],
      [0.0069, 2]
    ]
  },
  "QS_mulNeuromadSite[T2]": {
    "red_x_points": [
      [-1e-5, 2],
      [-0.00012, 0],
      [-0.00013, 0],
      [-4e-5, 0],
      [-0.00011, 0],
      [-5e-5, 0],
      [-0.00011, 0],
      [-3e-5, 2],
      [-0.00028, 0],
      [-5e-5, 0],
      [0.0, 2],
      [-5e-5, 0],
      [0.0, 2],
      [-0.00025, 0],
      [-5e-5, 0],
      [0.0, 2],
      [-1e-5, 2],
      [1e-5, 2],
      [-5e-5, 0],
      [1e-5, 2],
      [-9e-5, 2],
      [-1e-5, 2],
      [-2e-5, 0],
      [-7e-5, 0],
      [-2e-5, 2],
      [0.00017, 1],
      [-2e-5, 2],
      [-5e-5, 0],
      [-4e-5, 2]
    ],
    "red_o_points": [],
    "y_categories": ["N", "NOT APPLICABLE", "nan"],
    "blue_o_points": [],
    "blue_x_points": [
      [0.00073, 1],
      [4e-5, 2],
      [-2e-5, 0],
      [-0.00013, 0],
      [-1e-5, 2],
      [0.00036, 1],
      [9e-5, 1],
      [-2e-5, 0],
      [3e-5, 2],
      [0.0, 2],
      [-2e-5, 0],
      [0.00022, 1],
      [0.0, 2],
      [0.00017, 1],
      [-1e-5, 2]
    ]
  },
  "QS_mulBpsurgeryType[Lysis]": {
    "red_x_points": [
      [-0.00108, 3],
      [-0.00701, 0],
      [-0.02408, 2],
      [-0.01932, 2],
      [-0.00397, 0],
      [-0.02116, 2],
      [-0.00378, 0],
      [-0.00228, 3],
      [-0.00403, 0],
      [-0.00364, 0],
      [-0.00095, 3],
      [-0.00346, 0],
      [-0.00295, 3],
      [-0.00712, 0],
      [-0.01994, 2],
      [-0.00105, 3],
      [-0.00121, 3],
      [-0.00082, 3],
      [-0.00367, 0],
      [-0.00098, 3],
      [-0.00273, 3],
      [-0.0024, 3],
      [-0.00388, 0],
      [-0.00361, 0],
      [-0.00229, 3],
      [0.02658, 1],
      [-0.00227, 3],
      [-0.02124, 2],
      [-0.00236, 3]
    ],
    "red_o_points": [],
    "y_categories": ["N", "NOT APPLICABLE", "Y", "nan"],
    "blue_o_points": [],
    "blue_x_points": [
      [0.04699, 1],
      [-0.00167, 3],
      [-0.00098, 0],
      [-0.0014, 0],
      [0.0001, 3],
      [0.03369, 1],
      [0.02228, 1],
      [-0.00165, 0],
      [-0.00142, 3],
      [-0.00055, 3],
      [-0.00122, 0],
      [0.02673, 1],
      [-0.00048, 3],
      [0.02722, 1],
      [-0.00093, 3]
    ]
  },
  "QS_mulLysisSite[Trunk]": {
    "red_x_points": [
      [-0.00044, 3],
      [-0.00513, 0],
      [-0.00265, 0],
      [-0.00234, 0],
      [-0.00269, 0],
      [-0.01016, 2],
      [-0.0024, 0],
      [-0.0007, 3],
      [-0.00254, 0],
      [-0.00264, 0],
      [-0.00044, 3],
      [-0.00242, 0],
      [-0.00085, 3],
      [-0.00438, 0],
      [-0.00892, 2],
      [-0.00042, 3],
      [-0.00055, 3],
      [-0.00027, 3],
      [-0.00206, 0],
      [-0.00043, 3],
      [-0.00071, 3],
      [-0.00058, 3],
      [-0.00246, 0],
      [-0.00208, 0],
      [-0.00058, 3],
      [0.00898, 1],
      [-0.00056, 3],
      [-0.01012, 2],
      [-0.00076, 3]
    ],
    "red_o_points": [],
    "y_categories": ["N", "NOT APPLICABLE", "Y", "nan"],
    "blue_o_points": [],
    "blue_x_points": [
      [0.02154, 1],
      [-0.00024, 3],
      [-0.00123, 0],
      [-0.00112, 0],
      [0.00049, 3],
      [0.01423, 1],
      [0.00971, 1],
      [-0.00178, 0],
      [-0.00034, 3],
      [0.00022, 3],
      [-0.00072, 0],
      [0.00978, 1],
      [-0.00017, 3],
      [0.01117, 1],
      [-0.00024, 3]
    ]
  },
  "QS_mulGraftTrunk[UpperTrunk]": {
    "red_x_points": [
      [-0.00011, 3],
      [-0.00105, 0],
      [-0.00073, 0],
      [-0.00072, 0],
      [-0.00067, 0],
      [-0.00048, 0],
      [-0.00097, 0],
      [-0.00027, 3],
      [-0.00078, 0],
      [-0.0005, 0],
      [-0.00015, 3],
      [-0.00051, 0],
      [-0.0004, 3],
      [-0.00595, 2],
      [-0.00071, 0],
      [-6e-5, 3],
      [-7e-5, 3],
      [-2e-5, 3],
      [-0.00048, 0],
      [-0.00011, 3],
      [-0.00047, 3],
      [-0.00029, 3],
      [-0.00046, 0],
      [-0.00047, 0],
      [-0.00022, 3],
      [0.00217, 1],
      [-0.00023, 3],
      [-0.00041, 0],
      [-0.00032, 3]
    ],
    "red_o_points": [],
    "y_categories": ["N", "NOT APPLICABLE", "Y", "nan"],
    "blue_o_points": [],
    "blue_x_points": [
      [0.00641, 1],
      [-0.00014, 3],
      [0.00017, 0],
      [0.00085, 0],
      [0.00018, 3],
      [0.00312, 1],
      [0.00147, 1],
      [-0.00016, 0],
      [-0.00011, 3],
      [7e-5, 3],
      [-0.00017, 0],
      [0.00184, 1],
      [-5e-5, 3],
      [0.00206, 1],
      [-8e-5, 3]
    ]
  },
  "QS_mulTransfSite[PhMc]": {
    "red_x_points": [
      [-0.00018, 3],
      [-0.00167, 0],
      [-0.00105, 0],
      [-0.001, 0],
      [-0.00139, 0],
      [-0.00108, 0],
      [-0.00552, 2],
      [-0.00052, 3],
      [-0.00132, 0],
      [-0.00087, 0],
      [-0.00012, 3],
      [-0.00104, 0],
      [-0.00055, 3],
      [-0.00201, 0],
      [-0.00166, 0],
      [-0.00013, 3],
      [-0.00017, 3],
      [-2e-5, 3],
      [-0.00368, 2],
      [-0.00013, 3],
      [-0.00066, 3],
      [-0.00056, 3],
      [-0.00128, 0],
      [-0.00116, 0],
      [-0.00043, 3],
      [0.00468, 1],
      [-0.00042, 3],
      [-0.00114, 0],
      [-0.00065, 3]
    ],
    "red_o_points": [],
    "y_categories": ["N", "NOT APPLICABLE", "Y", "nan"],
    "blue_o_points": [],
    "blue_x_points": [
      [0.01012, 1],
      [-0.00037, 3],
      [-0.00064, 0],
      [-0.00084, 0],
      [8e-5, 3],
      [0.00556, 1],
      [0.00382, 1],
      [-0.00064, 0],
      [-0.00035, 3],
      [1e-5, 3],
      [-0.00048, 0],
      [0.00519, 1],
      [3e-5, 3],
      [0.00437, 1],
      [-0.00013, 3]
    ]
  },
  "QA_intPexForearmProna": {
    "red_x_points": [
      [-0.00127, 2],
      [-0.00084, 0],
      [-0.00085, 2],
      [-0.00045, 2],
      [-0.00104, 2],
      [-0.00309, 0],
      [-0.00101, 2],
      [-0.02346, 0],
      [-0.00107, 2],
      [-0.00114, 2],
      [-0.02111, 0],
      [-0.0035, 0],
      [-0.00245, 2],
      [-0.00097, 2],
      [1e-5, 2],
      [-0.02387, 0],
      [-0.02214, 0],
      [-0.01961, 0],
      [-0.00245, 0],
      [-0.00116, 2],
      [-0.00228, 2],
      [-0.0021, 2],
      [-0.00101, 2],
      [-0.0012, 2],
      [3e-5, 2],
      [0.00049, 1],
      [-4e-5, 2],
      [-0.00327, 0],
      [-0.00193, 2]
    ],
    "red_o_points": [],
    "y_categories": ["GREATER THAN OR EQUALS TO 80", "LESS THAN 80", "nan"],
    "blue_o_points": [],
    "blue_x_points": [
      [-0.00071, 2],
      [0.07471, 1],
      [-0.00056, 0],
      [-0.00103, 2],
      [0.001, 2],
      [1e-5, 2],
      [0.00049, 1],
      [0.00015, 2],
      [-0.0008, 2],
      [0.00123, 2],
      [-0.00039, 0],
      [2e-5, 2],
      [0.0011, 2],
      [0.0, 2],
      [0.06754, 1]
    ]
  },
  "QS_mulTransfSite[Oberlin]": {
    "red_x_points": [
      [-0.002, 3],
      [-0.0309, 0],
      [-0.02942, 0],
      [-0.0268, 0],
      [-0.03106, 0],
      [0.00435, 2],
      [-0.03015, 0],
      [-0.00281, 3],
      [0.00575, 2],
      [0.00445, 2],
      [-0.00191, 3],
      [0.00463, 2],
      [-0.00308, 3],
      [0.00302, 2],
      [-0.02558, 0],
      [-0.00202, 3],
      [-0.00234, 3],
      [-0.00167, 3],
      [-0.02353, 0],
      [-0.00207, 3],
      [-0.00317, 3],
      [-0.00289, 3],
      [0.00494, 2],
      [-0.02955, 0],
      [-0.00252, 3],
      [0.0317, 1],
      [-0.00254, 3],
      [-0.02927, 0],
      [-0.00285, 3]
    ],
    "red_o_points": [],
    "y_categories": ["N", "NOT APPLICABLE", "Y", "nan"],
    "blue_o_points": [],
    "blue_x_points": [
      [0.06113, 1],
      [-0.00223, 3],
      [0.00806, 2],
      [0.00994, 2],
      [-0.00065, 3],
      [0.04096, 1],
      [0.03313, 1],
      [0.00541, 2],
      [-0.00189, 3],
      [-0.00101, 3],
      [0.00777, 2],
      [0.03552, 1],
      [-0.00117, 3],
      [0.03597, 1],
      [-0.00166, 3]
    ]
  },
  "QA_yonPexPain": {
    "red_x_points": [
      [-0.00829, 1],
      [-0.00116, 1],
      [-0.00064, 1],
      [-0.00046, 1],
      [-0.00135, 1],
      [-0.00058, 0],
      [-0.00073, 1],
      [-0.00843, 1],
      [-0.00022, 0],
      [4e-5, 1],
      [-0.00663, 1],
      [-0.00077, 0],
      [-0.01205, 1],
      [-0.00162, 1],
      [-0.00035, 1],
      [0.01198, 0],
      [-0.007, 1],
      [0.00979, 0],
      [-0.00058, 1],
      [0.01355, 0],
      [-0.02349, 2],
      [-0.01097, 1],
      [6e-5, 1],
      [-0.00109, 1],
      [-0.01897, 2],
      [-0.00246, 1],
      [-0.00909, 1],
      [-0.00025, 1],
      [-0.01133, 1]
    ],
    "red_o_points": [],
    "y_categories": ["N", "Y", "nan"],
    "blue_o_points": [],
    "blue_x_points": [
      [-0.00063, 1],
      [0.02586, 0],
      [0.00547, 0],
      [-0.00029, 1],
      [-0.00653, 1],
      [0.00131, 2],
      [-7e-5, 1],
      [0.00128, 1],
      [0.03028, 0],
      [0.02125, 0],
      [0.00044, 1],
      [0.00305, 0],
      [0.01667, 0],
      [-0.00018, 1],
      [-0.00485, 1]
    ]
  },
  "QS_mulLysisRoot[C6]": {
    "red_x_points": [
      [-0.00034, 3],
      [-0.00363, 0],
      [-0.00822, 2],
      [-0.00243, 0],
      [-0.00244, 0],
      [-0.00253, 0],
      [-0.00265, 0],
      [-0.00065, 3],
      [-0.00285, 0],
      [-0.00277, 0],
      [-0.00026, 3],
      [-0.00264, 0],
      [-0.00105, 3],
      [-0.00351, 0],
      [-0.00326, 0],
      [-0.0005, 3],
      [-0.00031, 3],
      [-2e-5, 3],
      [-0.0024, 0],
      [-0.00044, 3],
      [-0.001, 3],
      [-0.00076, 3],
      [-0.00263, 0],
      [-0.002, 0],
      [-0.00061, 3],
      [0.00736, 1],
      [-0.00058, 3],
      [-0.00862, 2],
      [-0.00085, 3]
    ],
    "red_o_points": [],
    "y_categories": ["N", "NOT APPLICABLE", "Y", "nan"],
    "blue_o_points": [],
    "blue_x_points": [
      [0.02073, 1],
      [-0.00045, 3],
      [-0.0008, 0],
      [-0.00113, 0],
      [0.00012, 3],
      [0.01267, 1],
      [0.00726, 1],
      [-0.00154, 0],
      [-0.0004, 3],
      [-0.00012, 3],
      [-0.00082, 0],
      [0.00901, 1],
      [2e-5, 3],
      [0.0083, 1],
      [-0.00026, 3]
    ]
  },
  "QS_mulGraftLevel[Trunk]": {
    "red_x_points": [
      [0.0, 3],
      [-0.00047, 0],
      [-0.00041, 0],
      [-0.00037, 0],
      [-0.00038, 0],
      [-0.0003, 0],
      [-0.0004, 0],
      [-0.00013, 3],
      [-0.00051, 0],
      [-0.0002, 0],
      [-7e-5, 3],
      [-0.00018, 0],
      [-0.00023, 3],
      [-0.00496, 2],
      [-0.00048, 0],
      [-4e-5, 3],
      [5e-5, 3],
      [-1e-5, 3],
      [-0.00032, 0],
      [4e-5, 3],
      [-0.00025, 3],
      [-0.00011, 3],
      [-0.00018, 0],
      [-0.00023, 0],
      [-0.00011, 3],
      [0.00108, 1],
      [-0.00012, 3],
      [-0.00028, 0],
      [-0.00017, 3]
    ],
    "red_o_points": [],
    "y_categories": ["N", "NOT APPLICABLE", "Y", "nan"],
    "blue_o_points": [],
    "blue_x_points": [
      [0.0031, 1],
      [-2e-5, 3],
      [0.00026, 0],
      [0.00112, 0],
      [7e-5, 3],
      [0.00187, 1],
      [0.00071, 1],
      [6e-5, 0],
      [-2e-5, 3],
      [-4e-5, 3],
      [0.00013, 0],
      [0.00159, 1],
      [2e-5, 3],
      [0.00092, 1],
      [0.0, 3]
    ]
  }
}
