{
  "QA_lstPexPain[C8]": {
    "red_x_points": [
      [0.00636, 0],
      [-0.00611, 2],
      [-0.00637, 2],
      [0.00603, 0],
      [-0.0052, 2],
      [-0.00757, 1],
      [-0.01181, 1],
      [-0.01216, 1],
      [-0.00984, 2],
      [-0.00791, 2],
      [-0.00976, 2],
      [-0.00566, 2],
      [-0.01385, 1],
      [0.0056, 0],
      [-0.01081, 1],
      [-0.00968, 1],
      [-0.00553, 2],
      [-0.00858, 2],
      [-0.01065, 2],
      [-0.00606, 2],
      [-0.01336, 1],
      [-0.00543, 1],
      [-0.01445, 1]
    ],
    "red_o_points": [],
    "y_categories": ["NORM", "NPV", "nan"],
    "blue_o_points": [],
    "blue_x_points": [
      [-0.00641, 1],
      [-0.00637, 1],
      [0.01125, 0],
      [0.00061, 1],
      [0.01931, 0],
      [0.01562, 0],
      [0.01485, 0],
      [0.0138, 0],
      [-0.00575, 2],
      [-0.00025, 2],
      [-0.00405, 2],
      [0.00044, 1],
      [-0.00471, 2],
      [0.01533, 0],
      [0.01403, 0],
      [0.0158, 0],
      [-0.00525, 2],
      [0.01438, 0],
      [0.01429, 0],
      [0.02318, 0],
      [0.02274, 0]
    ]
  },
  "QA_lstPexPain[C7]": {
    "red_x_points": [
      [-0.01, 1],
      [-0.00834, 2],
      [-0.00785, 2],
      [-0.00933, 1],
      [-0.00735, 2],
      [-0.00692, 1],
      [-0.00804, 1],
      [-0.01049, 1],
      [-0.00894, 2],
      [-0.00971, 2],
      [-0.0105, 2],
      [-0.00743, 2],
      [-0.00957, 1],
      [0.01041, 0],
      [-0.01092, 1],
      [-0.0075, 1],
      [-0.00768, 2],
      [-0.00957, 2],
      [-0.01176, 2],
      [-0.00761, 2],
      [-0.01115, 1],
      [-0.00632, 1],
      [-0.00938, 1]
    ],
    "red_o_points": [],
    "y_categories": ["NORM", "NPV", "nan"],
    "blue_o_points": [],
    "blue_x_points": [
      [-0.00698, 1],
      [-0.00662, 1],
      [0.02095, 0],
      [-0.00166, 1],
      [0.02803, 0],
      [-0.00422, 1],
      [0.02427, 0],
      [0.02585, 0],
      [-0.00775, 2],
      [-0.00191, 2],
      [-0.00681, 2],
      [-0.0041, 1],
      [-0.00677, 2],
      [0.02088, 0],
      [0.01998, 0],
      [0.02389, 0],
      [-0.00665, 2],
      [0.02284, 0],
      [0.02985, 0],
      [-0.00697, 1],
      [0.02986, 0]
    ]
  },
  "QA_lstPexTouch[C6]": {
    "red_x_points": [
      [-0.0063, 1],
      [-0.00238, 2],
      [-0.00337, 1],
      [-0.00297, 1],
      [-0.00282, 2],
      [-0.00254, 1],
      [-0.0024, 1],
      [-0.00536, 1],
      [-0.00362, 2],
      [-0.00239, 2],
      [-0.00417, 1],
      [-0.00172, 2],
      [-0.00438, 1],
      [-0.00549, 1],
      [-0.0057, 1],
      [-0.00252, 1],
      [-0.00145, 2],
      [-0.00589, 1],
      [-0.00337, 1],
      [-0.0034, 2],
      [-0.00579, 1],
      [-0.00185, 1],
      [-0.00455, 1]
    ],
    "red_o_points": [],
    "y_categories": ["NORM", "NPV", "nan"],
    "blue_o_points": [],
    "blue_x_points": [
      [-0.00355, 1],
      [-0.00355, 1],
      [0.01517, 0],
      [-0.00217, 1],
      [0.02909, 0],
      [-0.00247, 1],
      [-0.0023, 1],
      [-0.00227, 1],
      [-0.00057, 2],
      [0.00448, 2],
      [-0.00022, 2],
      [-0.00292, 1],
      [0.00065, 2],
      [-0.00249, 1],
      [-0.00235, 1],
      [0.0189, 0],
      [0.00057, 2],
      [0.01606, 0],
      [0.03006, 0],
      [-0.00262, 1],
      [-0.00303, 1]
    ]
  },
  "QA_lstPexMuscstrength[FingersAddu]": {
    "red_x_points": [
      [5e-5, 2],
      [0.00022, 2],
      [-0.0238, 1],
      [-0.0009, 2],
      [-0.02158, 1],
      [-0.02298, 1],
      [0.00798, 0],
      [0.00801, 0],
      [6e-5, 2],
      [0.00026, 2],
      [0.00315, 0],
      [0.00018, 2],
      [-0.02148, 1],
      [0.00984, 0],
      [0.00732, 0],
      [-0.02297, 1],
      [-0.01818, 1],
      [0.00105, 2],
      [-0.00117, 2],
      [-0.02141, 1],
      [-0.0001, 2],
      [-0.01871, 1],
      [-0.0016, 2]
    ],
    "red_o_points": [],
    "y_categories": ["GREATER THAN OR EQUALS TO 3", "LESS THAN 3", "nan"],
    "blue_o_points": [],
    "blue_x_points": [
      [0.01745, 0],
      [-0.00275, 1],
      [0.00891, 0],
      [0.01256, 0],
      [0.01286, 0],
      [0.01472, 0],
      [0.00327, 2],
      [0.0137, 0],
      [0.00074, 2],
      [0.00257, 2],
      [0.00278, 2],
      [0.00355, 2],
      [0.00241, 2],
      [0.0095, 0],
      [0.00786, 0],
      [0.00773, 0],
      [0.00309, 2],
      [0.00239, 2],
      [0.01178, 0],
      [0.00117, 2],
      [0.00044, 2]
    ]
  },
  "QA_yonInjFracture": {
    "red_x_points": [
      [0.00534, 0],
      [-0.00653, 2],
      [0.00368, 0],
      [-0.00743, 2],
      [-0.01187, 1],
      [-0.01517, 1],
      [0.00252, 0],
      [0.00362, 0],
      [-0.01908, 1],
      [-0.01594, 1],
      [0.00455, 0],
      [-0.01085, 1],
      [-0.01771, 1],
      [-0.00584, 0],
      [-0.01821, 1],
      [-0.01148, 1],
      [-0.00951, 1],
      [0.00348, 0],
      [0.00319, 0],
      [0.00573, 0],
      [-0.01244, 1],
      [-0.00858, 1],
      [-0.02668, 1]
    ],
    "red_o_points": [],
    "y_categories": ["N", "Y", "nan"],
    "blue_o_points": [],
    "blue_x_points": [
      [0.01424, 0],
      [0.01721, 0],
      [0.00209, 0],
      [0.00734, 0],
      [0.0112, 2],
      [0.00969, 0],
      [0.00683, 1],
      [0.00302, 1],
      [-0.0062, 1],
      [0.01217, 0],
      [0.0152, 0],
      [0.01395, 0],
      [0.01169, 0],
      [0.0025, 0],
      [0.00463, 0],
      [0.00601, 2],
      [0.01458, 0],
      [0.00621, 0],
      [0.00467, 0],
      [-0.00113, 1],
      [0.0093, 2]
    ]
  },
  "QS_mulNeuromadSite[C8]": {
    "red_x_points": [
      [-0.00299, 1],
      [-0.00191, 0],
      [-0.00101, 0],
      [0.00025, 0],
      [-0.00131, 0],
      [0.0004, 0],
      [-5e-5, 2],
      [-0.00328, 1],
      [0.00109, 2],
      [-0.00125, 0],
      [0.00033, 2],
      [-0.00138, 0],
      [0.00015, 2],
      [-0.00017, 0],
      [-0.00549, 1],
      [2e-5, 2],
      [-0.00117, 0],
      [0.00025, 2],
      [-0.00063, 0],
      [-0.00245, 0],
      [-0.00296, 1],
      [0.00029, 0],
      [0.00013, 2]
    ],
    "red_o_points": [],
    "y_categories": ["N", "NOT APPLICABLE", "nan"],
    "blue_o_points": [],
    "blue_x_points": [
      [0.00128, 2],
      [0.00052, 2],
      [0.00071, 0],
      [0.00136, 0],
      [0.00031, 2],
      [0.00193, 0],
      [0.00095, 0],
      [0.00073, 0],
      [0.00168, 2],
      [0.00517, 1],
      [-0.00068, 0],
      [0.0022, 0],
      [0.00127, 2],
      [0.00067, 2],
      [0.00043, 2],
      [0.00037, 2],
      [0.00161, 2],
      [0.00059, 2],
      [0.00081, 1],
      [0.00071, 2],
      [0.00054, 2]
    ]
  },
  "QA_lstPexMuscstrength[FingersFlex]": {
    "red_x_points": [
      [0.00291, 2],
      [0.00322, 2],
      [-0.03648, 1],
      [0.01119, 0],
      [-0.03624, 1],
      [-0.03705, 1],
      [-0.04346, 1],
      [0.01152, 0],
      [0.00337, 2],
      [0.00302, 2],
      [0.01253, 0],
      [0.00276, 2],
      [-0.04265, 1],
      [0.01104, 0],
      [0.01099, 0],
      [-0.03963, 1],
      [-0.03535, 1],
      [0.00343, 2],
      [0.01215, 0],
      [0.01095, 0],
      [0.00285, 2],
      [-0.03474, 1],
      [0.00237, 2]
    ],
    "red_o_points": [],
    "y_categories": ["GREATER THAN OR EQUALS TO 3", "LESS THAN 3", "nan"],
    "blue_o_points": [],
    "blue_x_points": [
      [0.01714, 0],
      [0.01509, 0],
      [0.01138, 0],
      [0.01277, 0],
      [0.01506, 0],
      [0.01258, 0],
      [0.01275, 0],
      [0.01232, 0],
      [0.00437, 2],
      [0.00464, 2],
      [0.00461, 2],
      [0.00528, 2],
      [0.00455, 2],
      [0.01265, 0],
      [0.01303, 0],
      [0.01278, 0],
      [0.00521, 2],
      [0.00425, 2],
      [0.01236, 0],
      [0.00434, 2],
      [0.00414, 2]
    ]
  },
  "QA_lstPexPalle[Elbow]": {
    "red_x_points": [
      [-0.00157, 4],
      [-0.00139, 4],
      [-0.00168, 4],
      [0.01291, 3],
      [-0.0015, 4],
      [-0.00142, 4],
      [-0.02262, 1],
      [-0.01875, 1],
      [-0.00193, 4],
      [-0.00172, 4],
      [-0.00234, 4],
      [-0.00139, 4],
      [-0.00171, 4],
      [-0.02345, 1],
      [-0.00135, 4],
      [-0.03174, 0],
      [-0.0235, 2],
      [-0.00216, 4],
      [-0.0023, 4],
      [-0.00181, 4],
      [0.0115, 3],
      [-0.02538, 0],
      [-0.00178, 4]
    ],
    "red_o_points": [],
    "y_categories": ["ABS", "HYPO", "NAIA", "PT", "nan"],
    "blue_o_points": [],
    "blue_x_points": [
      [-0.00133, 4],
      [-0.00145, 4],
      [0.01882, 3],
      [0.02418, 3],
      [-0.00082, 4],
      [-0.00102, 4],
      [-0.00824, 1],
      [0.02085, 3],
      [-0.00157, 4],
      [-0.00142, 4],
      [-0.00121, 4],
      [-0.00079, 4],
      [-0.00144, 4],
      [0.02269, 3],
      [0.0217, 3],
      [0.01939, 3],
      [-0.00151, 4],
      [0.02082, 3],
      [-0.00076, 4],
      [0.02152, 3],
      [-0.00137, 4]
    ]
  },
  "QA_lstPexMuscstrength[ScapulaAbducSuprot]": {
    "red_x_points": [
      [-0.00192, 2],
      [-0.0008, 2],
      [-0.00642, 1],
      [-0.00359, 2],
      [-0.00636, 1],
      [-0.01066, 1],
      [-0.01127, 1],
      [0.00368, 0],
      [-0.00135, 2],
      [-0.00156, 2],
      [-0.00515, 2],
      [-0.00017, 2],
      [-0.01132, 1],
      [-0.00485, 0],
      [0.00464, 0],
      [-0.01124, 1],
      [-0.00235, 1],
      [-0.00121, 2],
      [-0.00916, 1],
      [0.00095, 0],
      [-0.00191, 2],
      [-0.00327, 1],
      [-0.0079, 2]
    ],
    "red_o_points": [],
    "y_categories": ["GREATER THAN OR EQUALS TO 3", "LESS THAN 3", "nan"],
    "blue_o_points": [],
    "blue_x_points": [
      [0.02647, 0],
      [0.02277, 0],
      [0.00385, 0],
      [0.0002, 1],
      [-0.0003, 1],
      [0.01232, 0],
      [0.00721, 0],
      [0.00255, 1],
      [-0.00038, 2],
      [0.0009, 2],
      [0.00093, 2],
      [0.00187, 2],
      [0.00038, 2],
      [0.00451, 0],
      [0.00577, 0],
      [-0.00073, 2],
      [0.00051, 2],
      [0.00493, 0],
      [0.00134, 2],
      [-0.00127, 1],
      [-0.00065, 2]
    ]
  },
  "participant_code": {
    "red_x_points": [
      [-0.04963, 0],
      [-0.05089, 2],
      [-0.05245, 3],
      [-0.05157, 4],
      [-0.05021, 5],
      [-0.04944, 9],
      [-0.05118, 14],
      [-0.04876, 17],
      [-0.0505, 19],
      [-0.04914, 20],
      [-0.04992, 22],
      [-0.0507, 23],
      [-0.05021, 24],
      [-0.05031, 26],
      [-0.05118, 28],
      [-0.04934, 29],
      [-0.0506, 31],
      [-0.05012, 35],
      [-0.05089, 37],
      [-0.05128, 39],
      [-0.05099, 41],
      [-0.05099, 42],
      [-0.0505, 43]
    ],
    "red_o_points": [],
    "y_categories": [
      "P16554",
      "P18297",
      "P19283",
      "P19287",
      "P23172",
      "P23391",
      "P30595",
      "P31645",
      "P31691",
      "P34778",
      "P35046",
      "P36328",
      "P43633",
      "P4544",
      "P46417",
      "P48965",
      "P53068",
      "P5497",
      "P58556",
      "P59529",
      "P62483",
      "P64658",
      "P65202",
      "P66816",
      "P67052",
      "P6751",
      "P7408",
      "P75566",
      "P76226",
      "P79971",
      "P82621",
      "P82990",
      "P84549",
      "P84932",
      "P85825",
      "P86989",
      "P8770",
      "P87791",
      "P90550",
      "P93159",
      "P94969",
      "P96710",
      "P9744",
      "P98500",
      "nan"
    ],
    "blue_o_points": [],
    "blue_x_points": [
      [0.05502, 1],
      [0.05594, 6],
      [0.05594, 7],
      [0.05502, 8],
      [0.05625, 10],
      [0.05409, 11],
      [0.05502, 12],
      [0.0545, 13],
      [0.05594, 15],
      [0.05553, 16],
      [0.05378, 18],
      [0.05563, 21],
      [0.05615, 25],
      [0.05605, 27],
      [0.05337, 30],
      [0.05481, 32],
      [0.05471, 33],
      [0.0544, 34],
      [0.05389, 36],
      [0.05841, 38],
      [0.05635, 40]
    ]
  },
  "QS_mulNeuromadSite[T2]": {
    "red_x_points": [
      [-0.00257, 1],
      [-0.00094, 0],
      [-0.00015, 0],
      [-3e-5, 0],
      [-0.00053, 0],
      [0.00028, 0],
      [-0.00012, 2],
      [-0.00224, 1],
      [0.0002, 2],
      [-0.00075, 0],
      [0.00027, 2],
      [-0.00095, 0],
      [8e-5, 2],
      [0.00015, 0],
      [-0.00279, 1],
      [3e-5, 2],
      [-0.00038, 0],
      [0.00015, 2],
      [-0.00019, 0],
      [-0.00054, 0],
      [-0.00114, 1],
      [0.00011, 0],
      [7e-5, 2]
    ],
    "red_o_points": [],
    "y_categories": ["N", "NOT APPLICABLE", "nan"],
    "blue_o_points": [],
    "blue_x_points": [
      [0.00091, 2],
      [0.00028, 2],
      [0.00027, 0],
      [0.00077, 0],
      [0.00011, 2],
      [0.00123, 0],
      [0.00039, 0],
      [0.00035, 0],
      [0.00077, 2],
      [0.00223, 1],
      [-0.00029, 0],
      [0.00145, 0],
      [0.00085, 2],
      [0.00024, 2],
      [0.0001, 2],
      [0.00012, 2],
      [0.00065, 2],
      [0.00065, 2],
      [0.00032, 1],
      [0.00035, 2],
      [0.00021, 2]
    ]
  },
  "QA_mulInjOrthesisType[ArmSling]": {
    "red_x_points": [
      [-0.00735, 2],
      [-0.01039, 2],
      [-0.00393, 2],
      [-0.00304, 2],
      [-0.00588, 2],
      [-0.00293, 2],
      [-0.00128, 2],
      [-0.00552, 1],
      [-0.01115, 2],
      [-0.00866, 2],
      [-0.00472, 2],
      [-0.0249, 0],
      [-0.00709, 3],
      [-0.00151, 2],
      [-0.00298, 1],
      [-0.00134, 2],
      [-0.01223, 3],
      [-0.00955, 2],
      [-0.00466, 2],
      [-0.00593, 2],
      [-0.00822, 3],
      [-0.00121, 2],
      [-0.00668, 2]
    ],
    "red_o_points": [],
    "y_categories": ["N", "NOT APPLICABLE", "Y", "nan"],
    "blue_o_points": [],
    "blue_x_points": [
      [-0.00041, 2],
      [-0.00115, 2],
      [0.00053, 2],
      [0.00036, 2],
      [-0.00114, 2],
      [0.00018, 2],
      [8e-5, 2],
      [-0.00051, 2],
      [0.0469, 1],
      [0.03439, 1],
      [-0.00689, 2],
      [0.02686, 1],
      [0.03156, 1],
      [-4e-5, 2],
      [0.00637, 0],
      [-0.00095, 2],
      [-0.0087, 2],
      [0.01271, 1],
      [0.01004, 1],
      [-0.00348, 2],
      [0.00442, 3]
    ]
  },
  "QA_mulInjOrthesisType[ShoulderSupport]": {
    "red_x_points": [
      [-0.00787, 0],
      [-0.01047, 0],
      [-0.00461, 0],
      [-0.01981, 2],
      [-0.00627, 0],
      [-0.00327, 0],
      [-0.00219, 0],
      [-0.00367, 1],
      [-0.01179, 0],
      [-0.00921, 0],
      [-0.00592, 0],
      [-0.01922, 2],
      [-0.00994, 3],
      [-0.00329, 0],
      [-0.00494, 1],
      [-0.00231, 0],
      [-0.01382, 3],
      [-0.01046, 0],
      [-0.00536, 0],
      [-0.00687, 0],
      [-0.00984, 3],
      [-0.00094, 0],
      [-0.0081, 0]
    ],
    "red_o_points": [],
    "y_categories": ["N", "NOT APPLICABLE", "Y", "nan"],
    "blue_o_points": [],
    "blue_x_points": [
      [-0.00116, 0],
      [-0.00157, 0],
      [0.00085, 0],
      [0.00187, 0],
      [0.01446, 2],
      [0.00151, 0],
      [9e-5, 0],
      [0.00241, 0],
      [0.04651, 1],
      [0.03454, 1],
      [-0.00735, 0],
      [0.03137, 1],
      [0.03447, 1],
      [0.00022, 0],
      [0.00413, 2],
      [-0.00019, 0],
      [-0.00936, 0],
      [0.01395, 1],
      [0.01204, 1],
      [-0.00232, 0],
      [0.00368, 3]
    ]
  },
  "QA_lstPexKine[Shoulder]": {
    "red_x_points": [
      [0.00091, 1],
      [-0.0006, 2],
      [-0.00307, 2],
      [0.00159, 1],
      [-0.00182, 2],
      [-0.01258, 0],
      [0.00093, 1],
      [0.00118, 1],
      [-0.00061, 2],
      [0.00138, 1],
      [-0.00185, 2],
      [-0.00047, 2],
      [-0.00184, 2],
      [-0.03321, 0],
      [0.00138, 1],
      [0.00109, 1],
      [-0.00073, 2],
      [-0.00214, 2],
      [-0.00646, 2],
      [-0.00152, 2],
      [-0.00126, 2],
      [0.00159, 1],
      [-0.00168, 2]
    ],
    "red_o_points": [],
    "y_categories": ["NPV", "PV", "nan"],
    "blue_o_points": [],
    "blue_x_points": [
      [0.00512, 1],
      [-0.0006, 2],
      [0.00465, 1],
      [0.00843, 1],
      [0.00034, 2],
      [0.00771, 1],
      [0.00737, 1],
      [0.00688, 1],
      [-0.00026, 2],
      [-0.0003, 2],
      [-0.00106, 2],
      [0.00839, 1],
      [-0.00045, 2],
      [0.00403, 1],
      [0.0029, 1],
      [0.00032, 0],
      [-0.00062, 2],
      [0.0022, 1],
      [4e-5, 2],
      [0.00294, 1],
      [0.00179, 1]
    ]
  },
  "QA_lstPexPain[C6]": {
    "red_x_points": [
      [-0.00095, 1],
      [-0.00296, 2],
      [-0.00285, 2],
      [-0.00125, 1],
      [-0.0023, 2],
      [-0.00019, 1],
      [-0.00118, 1],
      [-0.00065, 1],
      [-0.00451, 2],
      [-0.00341, 2],
      [-0.00486, 2],
      [-0.00216, 2],
      [-0.0014, 1],
      [-0.00229, 1],
      [-0.00027, 1],
      [-0.00075, 1],
      [-0.00238, 2],
      [-0.00566, 2],
      [-0.00473, 2],
      [-0.00342, 2],
      [-0.0012, 1],
      [-0.00044, 1],
      [-0.00213, 1]
    ],
    "red_o_points": [],
    "y_categories": ["NORM", "NPV", "nan"],
    "blue_o_points": [],
    "blue_x_points": [
      [-9e-5, 1],
      [-0.00021, 1],
      [0.00872, 0],
      [-0.00022, 1],
      [0.0189, 0],
      [7e-5, 1],
      [-6e-5, 1],
      [-0.00044, 1],
      [-0.00229, 2],
      [-0.00203, 2],
      [-0.00236, 2],
      [-0.00014, 1],
      [-0.00181, 2],
      [0.01256, 0],
      [-0.00048, 1],
      [0.01338, 0],
      [-0.00243, 2],
      [0.01226, 0],
      [-0.00025, 1],
      [-0.00084, 1],
      [-0.00026, 1]
    ]
  },
  "QA_lstPexArthre[Shoulder]": {
    "red_x_points": [
      [0.00622, 2],
      [-0.00237, 3],
      [-0.00498, 3],
      [0.00673, 2],
      [-0.0164, 0],
      [-0.02081, 1],
      [0.00768, 2],
      [0.00659, 2],
      [-0.00268, 3],
      [0.00545, 2],
      [-0.00352, 3],
      [-0.0022, 3],
      [-0.00447, 3],
      [-0.03658, 1],
      [0.00664, 2],
      [-0.01834, 1],
      [-0.00177, 3],
      [-0.00466, 3],
      [-0.0093, 3],
      [-0.0025, 3],
      [-0.00313, 3],
      [-0.01628, 1],
      [-0.00487, 3]
    ],
    "red_o_points": [],
    "y_categories": ["NAIA", "NPV", "PV", "nan"],
    "blue_o_points": [],
    "blue_x_points": [
      [0.01427, 2],
      [-0.00255, 3],
      [0.00791, 2],
      [0.01243, 2],
      [-0.0007, 3],
      [0.01381, 2],
      [0.01367, 2],
      [0.01181, 2],
      [-0.00127, 3],
      [-0.0009, 3],
      [-0.00133, 3],
      [0.01403, 2],
      [-0.0011, 3],
      [0.00841, 2],
      [0.00736, 2],
      [-0.00165, 1],
      [-0.0011, 3],
      [0.00601, 2],
      [-0.00042, 3],
      [0.01035, 2],
      [0.00652, 2]
    ]
  },
  "QS_mulGraftTrunk[UpperTrunk]": {
    "red_x_points": [
      [-0.00842, 1],
      [-0.00418, 0],
      [-0.00116, 0],
      [0.00093, 0],
      [-0.0023, 0],
      [0.00102, 0],
      [6e-5, 3],
      [-0.00839, 1],
      [0.00279, 3],
      [-0.02243, 2],
      [0.00151, 3],
      [-0.00342, 0],
      [0.00033, 3],
      [-0.00013, 0],
      [-0.01197, 1],
      [0.00047, 3],
      [-0.0031, 0],
      [0.00083, 3],
      [-0.00113, 0],
      [-0.00516, 0],
      [-0.00546, 1],
      [0.00095, 0],
      [0.00063, 3]
    ],
    "red_o_points": [],
    "y_categories": ["N", "NOT APPLICABLE", "Y", "nan"],
    "blue_o_points": [],
    "blue_x_points": [
      [0.00321, 3],
      [0.00122, 3],
      [0.00228, 0],
      [0.00407, 0],
      [0.00072, 3],
      [0.00577, 0],
      [0.00402, 0],
      [0.00262, 0],
      [0.00469, 3],
      [0.01297, 1],
      [0.00031, 0],
      [0.00709, 0],
      [0.00371, 3],
      [0.00124, 3],
      [0.00126, 3],
      [0.00053, 3],
      [0.00469, 3],
      [0.00166, 3],
      [0.00189, 1],
      [0.00207, 3],
      [0.0017, 3]
    ]
  },
  "QS_mulTransfSite[PhMc]": {
    "red_x_points": [
      [-0.00688, 1],
      [-0.00254, 0],
      [0.00037, 0],
      [0.00173, 0],
      [-0.00152, 0],
      [-0.01204, 2],
      [0.00037, 3],
      [-0.00789, 1],
      [0.00224, 3],
      [-0.00193, 0],
      [0.00061, 3],
      [-0.00236, 0],
      [0.00057, 3],
      [0.00032, 0],
      [-0.01136, 1],
      [0.00052, 3],
      [-0.00793, 2],
      [0.00095, 3],
      [-0.00044, 0],
      [-0.00297, 0],
      [-0.0072, 1],
      [0.0019, 0],
      [0.00081, 3]
    ],
    "red_o_points": [],
    "y_categories": ["N", "NOT APPLICABLE", "Y", "nan"],
    "blue_o_points": [],
    "blue_x_points": [
      [0.00301, 3],
      [0.00159, 3],
      [0.00122, 0],
      [0.00473, 0],
      [0.0012, 3],
      [0.00567, 0],
      [0.00141, 0],
      [0.00173, 0],
      [0.00285, 3],
      [0.00883, 1],
      [-0.00085, 0],
      [0.0081, 0],
      [0.00312, 3],
      [0.00122, 3],
      [0.00098, 3],
      [0.00079, 3],
      [0.00347, 3],
      [0.00141, 3],
      [0.00118, 1],
      [0.00158, 3],
      [0.00141, 3]
    ]
  },
  "QS_mulGraftLevel[Trunk]": {
    "red_x_points": [
      [-0.00755, 1],
      [-0.00414, 0],
      [-0.00133, 0],
      [0.00038, 0],
      [-0.00274, 0],
      [0.00034, 0],
      [-0.00014, 3],
      [-0.007, 1],
      [0.00298, 3],
      [-0.02228, 2],
      [0.00139, 3],
      [-0.00357, 0],
      [0.00042, 3],
      [0.00022, 0],
      [-0.01041, 1],
      [0.00051, 3],
      [-0.00285, 0],
      [0.00139, 3],
      [-0.00088, 0],
      [-0.00441, 0],
      [-0.00545, 1],
      [0.00034, 0],
      [0.00065, 3]
    ],
    "red_o_points": [],
    "y_categories": ["N", "NOT APPLICABLE", "Y", "nan"],
    "blue_o_points": [],
    "blue_x_points": [
      [0.00273, 3],
      [0.00162, 3],
      [0.00232, 0],
      [0.00279, 0],
      [0.00063, 3],
      [0.00491, 0],
      [0.00334, 0],
      [0.00223, 0],
      [0.0046, 3],
      [0.01336, 1],
      [-0.00044, 0],
      [0.00636, 0],
      [0.00421, 3],
      [0.00147, 3],
      [0.00117, 3],
      [0.00086, 3],
      [0.00462, 3],
      [0.00167, 3],
      [0.00138, 1],
      [0.00239, 3],
      [0.00191, 3]
    ]
  },
  "QS_mulGraftNerve[other]": {
    "red_x_points": [
      [-0.00302, 1],
      [-0.0016, 0],
      [-0.00051, 0],
      [0.00015, 0],
      [-0.00087, 0],
      [0.00033, 0],
      [-5e-5, 2],
      [-0.00294, 1],
      [0.0006, 2],
      [-0.00117, 0],
      [0.00014, 2],
      [-0.00127, 0],
      [0.00017, 2],
      [-0.00045, 0],
      [-0.00479, 1],
      [-3e-5, 2],
      [-0.0008, 0],
      [0.00028, 2],
      [-0.00079, 0],
      [-0.0015, 0],
      [-0.00354, 1],
      [0.00034, 0],
      [0.00014, 2]
    ],
    "red_o_points": [],
    "y_categories": ["N", "NOT APPLICABLE", "nan"],
    "blue_o_points": [],
    "blue_x_points": [
      [0.00082, 2],
      [0.00034, 2],
      [0.00068, 0],
      [0.00159, 0],
      [0.00044, 2],
      [0.00165, 0],
      [0.00056, 0],
      [0.0011, 0],
      [0.00124, 2],
      [0.00407, 1],
      [-0.00057, 0],
      [0.0019, 0],
      [0.00103, 2],
      [0.00079, 2],
      [0.00076, 2],
      [0.00042, 2],
      [0.00107, 2],
      [0.00061, 2],
      [0.00118, 1],
      [0.00104, 2],
      [0.00046, 2]
    ]
  },
  "QS_mulTransfSite[AcSsAA]": {
    "red_x_points": [
      [-0.01109, 1],
      [-0.01853, 2],
      [-0.00133, 0],
      [-0.00017, 0],
      [-0.01454, 2],
      [0.00128, 0],
      [-0.00062, 3],
      [-0.01753, 1],
      [0.00657, 3],
      [-0.02038, 2],
      [0.00213, 3],
      [-0.00201, 0],
      [0.0015, 3],
      [-0.01133, 0],
      [-0.01797, 1],
      [0.00099, 3],
      [-0.01208, 2],
      [0.00384, 3],
      [-0.00235, 0],
      [-0.01707, 2],
      [-0.01098, 1],
      [0.00021, 0],
      [0.00233, 3]
    ],
    "red_o_points": [],
    "y_categories": ["N", "NOT APPLICABLE", "Y", "nan"],
    "blue_o_points": [],
    "blue_x_points": [
      [0.00523, 3],
      [0.0029, 3],
      [0.007, 2],
      [0.00422, 0],
      [0.00359, 3],
      [0.00666, 0],
      [0.01535, 2],
      [0.00071, 0],
      [0.00943, 3],
      [0.02009, 1],
      [0.01094, 0],
      [0.00747, 0],
      [0.00877, 3],
      [0.00453, 3],
      [0.00351, 3],
      [0.00312, 3],
      [0.00942, 3],
      [0.00408, 3],
      [0.0032, 1],
      [0.00505, 3],
      [0.00387, 3]
    ]
  },
  "QA_lstPexMuscstrength[WristFlex]": {
    "red_x_points": [
      [-0.00154, 0],
      [-0.00195, 2],
      [-0.00795, 1],
      [0.00019, 0],
      [-0.00573, 1],
      [-0.00988, 1],
      [-0.0028, 0],
      [8e-5, 0],
      [-0.00235, 2],
      [-0.00341, 2],
      [-0.00161, 0],
      [-0.00125, 2],
      [-0.00767, 1],
      [0.00056, 0],
      [0.00095, 0],
      [-0.00221, 1],
      [-0.00474, 1],
      [-0.00589, 0],
      [0.00089, 0],
      [-0.0, 0],
      [-0.00199, 2],
      [-0.00514, 1],
      [-0.0066, 2]
    ],
    "red_o_points": [],
    "y_categories": ["GREATER THAN OR EQUALS TO 3", "LESS THAN 3", "nan"],
    "blue_o_points": [],
    "blue_x_points": [
      [0.00707, 1],
      [0.00738, 0],
      [0.00103, 0],
      [0.00329, 0],
      [0.00327, 0],
      [0.00446, 0],
      [0.00287, 0],
      [0.00337, 0],
      [0.00128, 2],
      [0.00076, 2],
      [0.00527, 0],
      [0.0058, 0],
      [0.00177, 2],
      [0.00022, 0],
      [0.00064, 0],
      [0.0011, 0],
      [0.00272, 2],
      [0.005, 1],
      [0.00126, 0],
      [0.01092, 1],
      [0.00053, 2]
    ]
  },
  "QS_mulNeuromadSite[C7]": {
    "red_x_points": [
      [-0.00895, 1],
      [-0.00527, 0],
      [-0.00143, 0],
      [0.00098, 0],
      [-0.00314, 0],
      [0.00119, 0],
      [-0.00022, 2],
      [-0.0102, 1],
      [0.00285, 2],
      [-0.0035, 0],
      [0.00082, 2],
      [-0.00441, 0],
      [0.00054, 2],
      [-6e-5, 0],
      [-0.01349, 1],
      [7e-5, 2],
      [-0.00285, 0],
      [0.00056, 2],
      [-0.00218, 0],
      [-0.00559, 0],
      [-0.00716, 1],
      [0.0007, 0],
      [0.00042, 2]
    ],
    "red_o_points": [],
    "y_categories": ["N", "NOT APPLICABLE", "nan"],
    "blue_o_points": [],
    "blue_x_points": [
      [0.00296, 2],
      [0.00192, 2],
      [0.00203, 0],
      [0.00403, 0],
      [0.00103, 2],
      [0.00452, 0],
      [0.00181, 0],
      [0.00158, 0],
      [0.00411, 2],
      [0.01326, 1],
      [-0.00185, 0],
      [0.00551, 0],
      [0.00378, 2],
      [0.00176, 2],
      [0.00211, 2],
      [0.00112, 2],
      [0.00409, 2],
      [0.0019, 2],
      [0.00155, 1],
      [0.00202, 2],
      [0.0011, 2]
    ]
  },
  "QA_lstPexMuscstrength[ElbowExte]": {
    "red_x_points": [
      [-0.00468, 2],
      [-0.00446, 2],
      [-0.00371, 1],
      [-0.00291, 1],
      [-0.00828, 1],
      [-0.00257, 1],
      [-0.00293, 1],
      [-0.00039, 0],
      [-0.0027, 2],
      [-0.00891, 2],
      [-0.00479, 1],
      [-0.00298, 2],
      [-0.00032, 1],
      [-0.01098, 1],
      [-0.00138, 0],
      [-0.00214, 1],
      [-0.00549, 1],
      [-0.00813, 0],
      [-0.00755, 1],
      [-0.00422, 2],
      [-0.0013, 2],
      [-0.00123, 1],
      [-0.0048, 2]
    ],
    "red_o_points": [],
    "y_categories": ["GREATER THAN OR EQUALS TO 3", "LESS THAN 3", "nan"],
    "blue_o_points": [],
    "blue_x_points": [
      [9e-5, 1],
      [0.00047, 1],
      [0.00858, 0],
      [-0.00289, 1],
      [-0.00053, 1],
      [0.01535, 0],
      [0.0175, 0],
      [-0.00259, 1],
      [5e-5, 2],
      [-0.00023, 2],
      [0.02216, 0],
      [0.00109, 1],
      [0.00145, 2],
      [0.00697, 0],
      [0.00513, 0],
      [0.00738, 0],
      [0.00076, 2],
      [0.00391, 0],
      [0.00626, 0],
      [0.00336, 1],
      [0.00256, 1]
    ]
  },
  "QA_intPexForearmSupin": {
    "red_x_points": [
      [-0.0006, 2],
      [-0.00786, 0],
      [-0.00092, 2],
      [-0.00094, 2],
      [-0.00071, 2],
      [-0.00061, 2],
      [-0.02486, 0],
      [-0.01697, 0],
      [-0.00079, 2],
      [-0.0007, 2],
      [-0.00147, 2],
      [-0.00019, 2],
      [-0.00145, 2],
      [0.00467, 1],
      [-0.00082, 2],
      [-0.01681, 0],
      [-0.00032, 1],
      [-0.00107, 2],
      [-0.00115, 2],
      [-0.00079, 2],
      [0.00501, 1],
      [-0.00989, 0],
      [-0.00145, 2]
    ],
    "red_o_points": [],
    "y_categories": ["GREATER THAN OR EQUALS TO 80", "LESS THAN 80", "nan"],
    "blue_o_points": [],
    "blue_x_points": [
      [-0.00043, 2],
      [0.0173, 1],
      [0.0046, 1],
      [0.01468, 1],
      [0.01028, 1],
      [-0.00011, 2],
      [0.0002, 2],
      [0.00033, 2],
      [-0.00024, 2],
      [0.0, 2],
      [0.00399, 0],
      [-7e-5, 2],
      [-0.00018, 2],
      [0.00828, 1],
      [0.00836, 1],
      [-0.00011, 2],
      [-0.00035, 2],
      [-0.00016, 2],
      [0.00033, 2],
      [0.01403, 1],
      [-3e-5, 2]
    ]
  },
  "QA_lstPexTinel[TinelSign]": {
    "red_x_points": [
      [0.00073, 1],
      [-0.00187, 1],
      [-0.01014, 2],
      [0.00183, 1],
      [0.00014, 1],
      [0.00098, 1],
      [-0.01614, 2],
      [-0.01426, 2],
      [-0.00807, 1],
      [-0.00112, 1],
      [-0.02233, 2],
      [-0.00668, 2],
      [-0.00108, 1],
      [-0.02208, 2],
      [0.00265, 1],
      [-0.01277, 2],
      [0.00059, 1],
      [-0.00311, 1],
      [-0.01704, 2],
      [-0.0108, 2],
      [-0.00122, 1],
      [-0.00719, 2],
      [-0.00339, 1]
    ],
    "red_o_points": [],
    "y_categories": ["ABS", "NAIA", "PT", "nan"],
    "blue_o_points": [],
    "blue_x_points": [
      [0.01025, 1],
      [0.04413, 0],
      [0.01925, 0],
      [-0.01158, 2],
      [0.00607, 1],
      [0.00729, 1],
      [-0.00848, 2],
      [0.00753, 1],
      [0.00918, 2],
      [0.00167, 1],
      [0.00588, 1],
      [0.00644, 1],
      [0.00132, 1],
      [0.02196, 0],
      [0.00587, 1],
      [0.00469, 1],
      [0.00633, 2],
      [0.00299, 1],
      [0.00714, 1],
      [0.00232, 1],
      [0.00211, 1]
    ]
  },
  "QA_lstPexArthre[Index]": {
    "red_x_points": [
      [-0.01223, 0],
      [-0.0021, 2],
      [-0.00348, 2],
      [-0.01212, 0],
      [-0.00362, 0],
      [-0.00927, 0],
      [-0.00053, 1],
      [0.00055, 1],
      [-0.00179, 2],
      [0.00331, 1],
      [-0.00299, 2],
      [-0.00151, 2],
      [-0.00296, 2],
      [-0.00059, 1],
      [0.00118, 1],
      [-0.00392, 0],
      [-0.00075, 2],
      [-0.00239, 2],
      [-0.00638, 2],
      [-0.00123, 2],
      [-0.0027, 2],
      [-0.00608, 0],
      [-0.00348, 2]
    ],
    "red_o_points": [],
    "y_categories": ["NPV", "PV", "nan"],
    "blue_o_points": [],
    "blue_x_points": [
      [0.00465, 0],
      [-0.00075, 2],
      [0.0023, 1],
      [0.00791, 1],
      [0.00046, 2],
      [0.00984, 1],
      [0.00715, 1],
      [0.00132, 0],
      [-0.00125, 2],
      [-0.00054, 2],
      [-0.00081, 2],
      [0.01817, 1],
      [-0.00053, 2],
      [0.00178, 1],
      [0.00206, 1],
      [0.00104, 0],
      [-0.0007, 2],
      [0.0043, 1],
      [0.00043, 2],
      [0.01044, 1],
      [0.00781, 1]
    ]
  },
  "QS_mulTransfSite[IMc]": {
    "red_x_points": [
      [-0.01315, 1],
      [-0.01982, 2],
      [0.00073, 0],
      [-0.02702, 2],
      [-0.00232, 0],
      [0.00529, 0],
      [0.00174, 3],
      [-0.01723, 1],
      [0.00613, 3],
      [-0.00181, 0],
      [0.00421, 3],
      [-0.01868, 2],
      [0.00295, 3],
      [0.00163, 0],
      [-0.02083, 1],
      [0.00221, 3],
      [-0.00346, 0],
      [0.00323, 3],
      [0.00071, 0],
      [-0.02333, 2],
      [-0.01769, 1],
      [-0.0119, 2],
      [0.00349, 3]
    ],
    "red_o_points": [],
    "y_categories": ["N", "NOT APPLICABLE", "Y", "nan"],
    "blue_o_points": [],
    "blue_x_points": [
      [0.00794, 3],
      [0.00564, 3],
      [0.00478, 0],
      [0.01, 0],
      [0.00534, 3],
      [0.00954, 0],
      [0.0062, 0],
      [0.00847, 0],
      [0.00891, 3],
      [0.01581, 1],
      [0.00217, 0],
      [0.01081, 0],
      [0.00833, 3],
      [0.00488, 3],
      [0.00508, 3],
      [0.00428, 3],
      [0.00895, 3],
      [0.00479, 3],
      [0.00228, 1],
      [0.006, 3],
      [0.00475, 3]
    ]
  },
  "QA_lstPexPain[T1]": {
    "red_x_points": [
      [-0.008, 1],
      [-0.00384, 2],
      [-0.00539, 2],
      [-0.00025, 0],
      [-0.00369, 2],
      [-0.00148, 1],
      [-0.00318, 0],
      [-0.00053, 0],
      [-0.00739, 2],
      [-0.00583, 2],
      [-0.00744, 2],
      [-0.00338, 2],
      [-0.00748, 1],
      [-0.0173, 1],
      [-0.00338, 1],
      [-0.00259, 1],
      [-0.0034, 2],
      [-0.01067, 2],
      [-0.009, 2],
      [-0.00287, 2],
      [-0.00881, 1],
      [-0.00209, 1],
      [-0.00788, 1]
    ],
    "red_o_points": [],
    "y_categories": ["NORM", "NPV", "nan"],
    "blue_o_points": [],
    "blue_x_points": [
      [0.00221, 1],
      [-0.00015, 1],
      [0.00638, 0],
      [0.00434, 1],
      [0.01627, 0],
      [0.00236, 1],
      [0.01473, 0],
      [0.01282, 0],
      [-0.00265, 2],
      [0.0012, 2],
      [-0.00184, 2],
      [0.00145, 1],
      [-0.0017, 2],
      [0.00859, 0],
      [0.0072, 0],
      [0.01037, 0],
      [-0.0021, 2],
      [-0.00503, 1],
      [0.01276, 0],
      [0.02025, 0],
      [0.01839, 0]
    ]
  },
  "QS_mulTransfSite[AcMc]": {
    "red_x_points": [
      [-0.01042, 1],
      [-0.00737, 0],
      [-0.00461, 0],
      [-0.00929, 0],
      [-0.00453, 0],
      [-0.00022, 0],
      [0.00034, 3],
      [-0.01288, 1],
      [0.00369, 3],
      [-0.00492, 0],
      [0.00115, 3],
      [-0.00471, 0],
      [0.00172, 3],
      [-0.0071, 0],
      [-0.0153, 1],
      [0.00073, 3],
      [-0.00456, 0],
      [0.00103, 3],
      [-0.00401, 0],
      [-0.0071, 0],
      [-0.01218, 1],
      [-0.00115, 0],
      [0.00138, 3]
    ],
    "red_o_points": [],
    "y_categories": ["N", "NOT APPLICABLE", "Y", "nan"],
    "blue_o_points": [],
    "blue_x_points": [
      [0.00399, 3],
      [0.00275, 3],
      [0.00107, 0],
      [0.00288, 0],
      [0.00435, 3],
      [0.00443, 0],
      [0.00119, 0],
      [0.02773, 2],
      [0.00541, 3],
      [0.013, 1],
      [-0.00227, 0],
      [0.00294, 0],
      [0.00375, 3],
      [0.00429, 3],
      [0.00327, 3],
      [0.00308, 3],
      [0.00542, 3],
      [0.00245, 3],
      [0.00382, 1],
      [0.00467, 3],
      [0.00209, 3]
    ]
  },
  "QS_mulTransfSite[Other]": {
    "red_x_points": [
      [-0.00546, 1],
      [-0.00117, 0],
      [-0.00017, 0],
      [0.00035, 0],
      [-0.00103, 0],
      [0.0008, 0],
      [-0.00079, 3],
      [-0.01003, 1],
      [0.00081, 3],
      [-0.00054, 0],
      [0.00076, 3],
      [-0.00122, 0],
      [0.00056, 3],
      [-0.04315, 2],
      [-0.00804, 1],
      [0.00062, 3],
      [-0.00081, 0],
      [0.00077, 3],
      [0.00126, 0],
      [-0.00096, 0],
      [-0.0059, 1],
      [0.00046, 0],
      [0.00023, 3]
    ],
    "red_o_points": [],
    "y_categories": ["N", "NOT APPLICABLE", "Y", "nan"],
    "blue_o_points": [],
    "blue_x_points": [
      [0.00284, 3],
      [0.00173, 3],
      [0.00601, 0],
      [0.00614, 0],
      [0.00312, 3],
      [0.00466, 0],
      [0.00998, 0],
      [0.00536, 0],
      [0.00143, 3],
      [0.00323, 1],
      [0.00031, 0],
      [0.00353, 0],
      [0.00136, 3],
      [0.0049, 3],
      [0.00462, 3],
      [0.00296, 3],
      [0.00156, 3],
      [0.00261, 3],
      [0.00111, 1],
      [0.00316, 3],
      [0.00202, 3]
    ]
  },
  "QA_yonInjBpsurg": {
    "red_x_points": [
      [-0.01052, 0],
      [0.00015, 1],
      [0.00043, 1],
      [0.00182, 1],
      [5e-5, 1],
      [0.0013, 1],
      [0.00133, 1],
      [-0.01084, 0],
      [0.00012, 1],
      [0.00054, 1],
      [0.00102, 1],
      [0.00016, 1],
      [0.00073, 1],
      [0.00125, 1],
      [-0.01369, 0],
      [0.00085, 1],
      [-0.00149, 1],
      [-0.00223, 1],
      [0.00075, 1],
      [-0.00198, 1],
      [-0.01149, 0],
      [0.00085, 1],
      [0.00096, 1]
    ],
    "red_o_points": [],
    "y_categories": ["N", "Y", "nan"],
    "blue_o_points": [],
    "blue_x_points": [
      [0.00395, 1],
      [0.00188, 1],
      [0.00167, 1],
      [0.00289, 1],
      [0.0007, 1],
      [0.00293, 1],
      [0.00192, 1],
      [0.00199, 1],
      [0.00018, 1],
      [0.00645, 0],
      [0.0004, 1],
      [0.00277, 1],
      [0.00039, 1],
      [0.0015, 1],
      [0.00214, 1],
      [0.00116, 1],
      [3e-5, 1],
      [0.00226, 1],
      [-0.00028, 0],
      [0.00255, 1],
      [0.00243, 1]
    ]
  },
  "QA_lstPexTouch[C8]": {
    "red_x_points": [
      [0.00809, 0],
      [-0.00447, 2],
      [-0.00846, 1],
      [-0.01542, 1],
      [-0.00315, 2],
      [-0.00883, 1],
      [-0.01089, 1],
      [-0.01264, 1],
      [-0.00407, 2],
      [-0.00399, 2],
      [-0.01318, 1],
      [-0.00338, 2],
      [-0.01426, 1],
      [0.00837, 0],
      [-0.01167, 1],
      [-0.00994, 1],
      [-0.00325, 2],
      [0.00459, 0],
      [-0.00993, 1],
      [-0.00393, 2],
      [-0.01752, 1],
      [-0.00855, 1],
      [-0.01533, 1]
    ],
    "red_o_points": [],
    "y_categories": ["NORM", "NPV", "nan"],
    "blue_o_points": [],
    "blue_x_points": [
      [-0.00832, 1],
      [-0.01063, 1],
      [0.0126, 0],
      [-0.00642, 1],
      [0.02051, 0],
      [-0.00621, 1],
      [0.01896, 0],
      [0.02146, 0],
      [4e-5, 2],
      [0.00292, 2],
      [-0.00071, 2],
      [-0.0064, 1],
      [0.00168, 2],
      [0.01458, 0],
      [0.01394, 0],
      [0.01743, 0],
      [0.0027, 2],
      [0.01413, 0],
      [0.01614, 0],
      [0.0219, 0],
      [0.02154, 0]
    ]
  },
  "QA_lstPexTouch[C5]": {
    "red_x_points": [
      [-0.00168, 0],
      [-0.00039, 2],
      [-0.0015, 1],
      [-0.0011, 1],
      [-0.00095, 2],
      [-0.00048, 1],
      [-0.00131, 1],
      [-0.00421, 1],
      [-0.00076, 2],
      [-0.0007, 2],
      [-0.00233, 1],
      [-0.00036, 2],
      [-0.00272, 1],
      [-0.00187, 1],
      [-0.00402, 1],
      [-0.00114, 1],
      [-0.00088, 2],
      [-0.0044, 1],
      [-0.00184, 1],
      [-0.0011, 2],
      [-0.0023, 1],
      [-0.00034, 1],
      [-0.00279, 1]
    ],
    "red_o_points": [],
    "y_categories": ["NORM", "NPV", "nan"],
    "blue_o_points": [],
    "blue_x_points": [
      [-0.00126, 1],
      [-0.0016, 1],
      [-0.00028, 1],
      [-0.00042, 1],
      [0.0155, 0],
      [-0.00033, 1],
      [-0.00039, 1],
      [-0.00058, 1],
      [0.00114, 2],
      [0.00383, 2],
      [0.00039, 2],
      [-0.00045, 1],
      [0.00185, 2],
      [-0.0008, 1],
      [0.00587, 0],
      [-0.00077, 1],
      [0.00155, 2],
      [0.00537, 0],
      [0.01217, 0],
      [-0.00092, 1],
      [-0.00069, 1]
    ]
  },
  "QA_txtInjMedicatioListNer": {
    "red_x_points": [
      [-0.00791, 1],
      [-0.00674, 1],
      [-0.00686, 1],
      [-0.00522, 1],
      [-0.00806, 1],
      [-0.00022, 2],
      [-0.00906, 1],
      [0.00361, 0],
      [-0.01088, 2],
      [-0.00526, 2],
      [-0.00447, 2],
      [-0.0041, 2],
      [-0.00879, 1],
      [-0.00937, 1],
      [-0.00051, 2],
      [-0.00858, 1],
      [-0.00281, 2],
      [-0.00897, 1],
      [-0.0109, 1],
      [-0.00752, 1],
      [-0.00484, 1],
      [-3e-5, 2],
      [-0.00251, 2]
    ],
    "red_o_points": [],
    "y_categories": ["N", "Y", "nan"],
    "blue_o_points": [],
    "blue_x_points": [
      [0.03668, 0],
      [0.00159, 2],
      [0.01224, 0],
      [-0.00442, 1],
      [0.00215, 2],
      [0.00304, 2],
      [0.00314, 2],
      [-0.00475, 1],
      [-0.00219, 1],
      [-0.00448, 1],
      [0.03626, 0],
      [2e-5, 2],
      [0.02715, 0],
      [-0.00461, 1],
      [0.00181, 2],
      [0.00085, 2],
      [-0.00316, 1],
      [0.01347, 0],
      [0.01941, 0],
      [-0.00435, 1],
      [0.00013, 2]
    ]
  },
  "QS_mulNeuromadSite[C6]": {
    "red_x_points": [
      [-0.00311, 1],
      [-0.00273, 0],
      [-0.00042, 0],
      [0.00037, 0],
      [-0.00098, 0],
      [0.00054, 0],
      [-0.00011, 2],
      [-0.00416, 1],
      [0.00134, 2],
      [-0.002, 0],
      [0.0004, 2],
      [-0.00208, 0],
      [0.00026, 2],
      [2e-5, 0],
      [-0.00631, 1],
      [-0.0001, 2],
      [-0.00171, 0],
      [0.0002, 2],
      [-0.00046, 0],
      [-0.00232, 0],
      [-0.00357, 1],
      [0.0004, 0],
      [-0.00029, 2]
    ],
    "red_o_points": [],
    "y_categories": ["N", "NOT APPLICABLE", "nan"],
    "blue_o_points": [],
    "blue_x_points": [
      [0.00151, 2],
      [0.00109, 2],
      [0.00079, 0],
      [0.0017, 0],
      [0.00039, 2],
      [0.00157, 0],
      [0.00072, 0],
      [0.00076, 0],
      [0.00205, 2],
      [0.00579, 1],
      [-0.00088, 0],
      [0.0029, 0],
      [0.00197, 2],
      [0.00071, 2],
      [0.00089, 2],
      [0.00022, 2],
      [0.00218, 2],
      [0.00029, 2],
      [0.0006, 1],
      [0.00087, 2],
      [0.00067, 2]
    ]
  },
  "QA_yonPreFracture": {
    "red_x_points": [
      [-0.03674, 1],
      [0.00117, 2],
      [0.00606, 0],
      [0.00159, 2],
      [0.00559, 0],
      [0.00623, 0],
      [-0.0336, 1],
      [0.00706, 0],
      [0.00108, 2],
      [-0.03936, 1],
      [-0.04568, 1],
      [-0.03068, 1],
      [0.0026, 2],
      [0.00743, 0],
      [0.0068, 0],
      [0.00555, 0],
      [0.00459, 0],
      [0.00913, 0],
      [-0.04317, 1],
      [0.0062, 0],
      [0.00055, 2],
      [-0.02502, 1],
      [0.00183, 2]
    ],
    "red_o_points": [],
    "y_categories": ["N", "Y", "nan"],
    "blue_o_points": [],
    "blue_x_points": [
      [0.01082, 0],
      [0.00721, 2],
      [0.00818, 0],
      [0.01099, 0],
      [0.006, 2],
      [0.01099, 0],
      [0.0096, 0],
      [0.00761, 2],
      [0.00443, 2],
      [0.01093, 0],
      [0.01269, 0],
      [0.01301, 0],
      [0.0112, 0],
      [0.00728, 0],
      [0.00705, 0],
      [0.00504, 2],
      [0.01226, 0],
      [0.00959, 0],
      [0.00805, 0],
      [0.00333, 2],
      [0.00453, 2]
    ]
  },
  "QA_lstPexMuscstrength[ThumbOppo]": {
    "red_x_points": [
      [-0.00021, 2],
      [-0.00023, 2],
      [-0.01185, 1],
      [-0.02795, 1],
      [-0.0077, 1],
      [-0.01237, 1],
      [-0.00246, 0],
      [0.0014, 0],
      [0.00053, 2],
      [-0.00032, 2],
      [-0.00681, 0],
      [0.00069, 2],
      [-0.00934, 1],
      [0.00416, 0],
      [0.00157, 0],
      [-0.0065, 1],
      [-0.00705, 1],
      [0.00083, 2],
      [0.00312, 0],
      [-0.00801, 1],
      [-0.00065, 2],
      [-0.0103, 1],
      [-0.00177, 2]
    ],
    "red_o_points": [],
    "y_categories": ["GREATER THAN OR EQUALS TO 3", "LESS THAN 3", "nan"],
    "blue_o_points": [],
    "blue_x_points": [
      [0.00346, 1],
      [0.004, 1],
      [0.00423, 0],
      [0.00725, 0],
      [0.00778, 0],
      [0.008, 0],
      [0.00688, 0],
      [0.01168, 0],
      [0.00192, 2],
      [0.00141, 2],
      [0.00253, 2],
      [0.00883, 2],
      [0.00148, 2],
      [0.00512, 0],
      [0.00404, 0],
      [0.00553, 0],
      [0.00341, 2],
      [0.00139, 2],
      [0.00683, 0],
      [0.00348, 2],
      [0.00198, 2]
    ]
  },
  "QA_lstPexMuscstrength[ShoulderAbduc]": {
    "red_x_points": [
      [-0.00161, 2],
      [0.00013, 1],
      [0.00012, 1],
      [0.00075, 1],
      [0.00014, 1],
      [0.00067, 1],
      [0.00075, 1],
      [-0.01772, 0],
      [-0.00018, 2],
      [-0.00104, 2],
      [-0.00455, 2],
      [-0.00039, 2],
      [0.00027, 1],
      [0.00138, 1],
      [-0.02691, 0],
      [0.00033, 1],
      [6e-5, 1],
      [0.00015, 1],
      [0.00087, 1],
      [0.00049, 1],
      [-0.00108, 2],
      [0.00025, 1],
      [-0.00073, 2]
    ],
    "red_o_points": [],
    "y_categories": ["GREATER THAN OR EQUALS TO 3", "LESS THAN 3", "nan"],
    "blue_o_points": [],
    "blue_x_points": [
      [0.00407, 1],
      [0.00319, 1],
      [0.00302, 1],
      [0.00333, 1],
      [0.00212, 1],
      [0.00551, 1],
      [0.00215, 1],
      [0.00165, 1],
      [0.00046, 2],
      [0.00073, 2],
      [0.00136, 1],
      [0.00082, 2],
      [0.00049, 2],
      [0.00281, 1],
      [0.00332, 1],
      [-0.00016, 2],
      [0.00054, 2],
      [0.00231, 1],
      [0.00777, 1],
      [0.00083, 1],
      [0.00152, 1]
    ]
  },
  "QA_lstPexTouch[C7]": {
    "red_x_points": [
      [-0.0151, 1],
      [-0.00468, 2],
      [-0.00987, 1],
      [-0.01349, 1],
      [-0.00431, 2],
      [-0.00963, 1],
      [-0.0133, 1],
      [-0.01423, 1],
      [-0.0044, 2],
      [-0.00688, 2],
      [-0.01626, 1],
      [-0.00418, 2],
      [-0.01452, 1],
      [0.0101, 0],
      [-0.01461, 1],
      [-0.01116, 1],
      [-0.00397, 2],
      [0.01108, 0],
      [-0.01085, 1],
      [-0.00608, 2],
      [-0.01755, 1],
      [-0.00895, 1],
      [-0.01747, 1]
    ],
    "red_o_points": [],
    "y_categories": ["NORM", "NPV", "nan"],
    "blue_o_points": [],
    "blue_x_points": [
      [-0.01219, 1],
      [-0.01198, 1],
      [0.02152, 0],
      [-0.00649, 1],
      [0.0269, 0],
      [-0.00871, 1],
      [0.02603, 0],
      [-0.00786, 1],
      [0.00052, 2],
      [0.00279, 2],
      [-0.00073, 2],
      [-0.00726, 1],
      [0.00196, 2],
      [0.02116, 0],
      [0.02112, 0],
      [0.02287, 0],
      [0.00221, 2],
      [0.02105, 0],
      [0.02813, 0],
      [0.02866, 0],
      [0.03063, 0]
    ]
  },
  "QA_lstPexMuscstrength[ShoulderExrot]": {
    "red_x_points": [
      [-0.00081, 2],
      [-0.0002, 2],
      [-0.01596, 0],
      [-0.00082, 2],
      [0.00294, 1],
      [-0.00063, 2],
      [0.00253, 1],
      [-0.0246, 0],
      [-0.00027, 2],
      [-0.00034, 2],
      [-0.00178, 2],
      [-0.00026, 2],
      [-0.00064, 2],
      [0.00416, 1],
      [-0.03061, 0],
      [0.00265, 1],
      [8e-5, 2],
      [0.00033, 2],
      [0.00512, 1],
      [-0.01752, 0],
      [-0.00038, 2],
      [0.00178, 1],
      [-0.00057, 2]
    ],
    "red_o_points": [],
    "y_categories": ["GREATER THAN OR EQUALS TO 3", "LESS THAN 3", "nan"],
    "blue_o_points": [],
    "blue_x_points": [
      [0.00975, 1],
      [0.00023, 2],
      [0.00569, 1],
      [0.00659, 1],
      [0.00671, 1],
      [0.01136, 1],
      [0.00627, 1],
      [0.00058, 2],
      [9e-5, 2],
      [0.00088, 2],
      [0.00082, 2],
      [0.00108, 2],
      [0.00081, 2],
      [0.00546, 1],
      [0.00582, 1],
      [0.00025, 2],
      [0.0007, 2],
      [0.00083, 2],
      [0.01187, 1],
      [9e-5, 2],
      [-7e-5, 2]
    ]
  },
  "QA_lstPexTouch[T1]": {
    "red_x_points": [
      [-0.01109, 1],
      [-0.00282, 2],
      [-0.00638, 1],
      [0.00528, 0],
      [-0.0034, 2],
      [-0.00736, 1],
      [0.00319, 0],
      [-0.01133, 1],
      [-0.00265, 2],
      [-0.00605, 2],
      [-0.01089, 1],
      [-0.00291, 2],
      [-0.00877, 1],
      [-0.01685, 1],
      [-0.01238, 1],
      [-0.00645, 1],
      [-0.00259, 2],
      [6e-5, 0],
      [-0.01061, 1],
      [-0.00429, 2],
      [-0.01236, 1],
      [-0.0053, 1],
      [-0.00961, 1]
    ],
    "red_o_points": [],
    "y_categories": ["NORM", "NPV", "nan"],
    "blue_o_points": [],
    "blue_x_points": [
      [-0.00663, 1],
      [-0.00454, 1],
      [0.01553, 0],
      [-0.00446, 1],
      [-0.00516, 1],
      [0.02168, 0],
      [0.02274, 0],
      [0.01763, 0],
      [0.0009, 2],
      [0.00317, 2],
      [-0.00059, 2],
      [-0.00469, 1],
      [0.00125, 2],
      [0.01236, 0],
      [0.01242, 0],
      [0.01424, 0],
      [0.00331, 2],
      [-0.00646, 1],
      [0.01977, 0],
      [0.01512, 0],
      [0.01799, 0]
    ]
  },
  "QA_equInjTbpiTime": {
    "red_x_points": [
      [-0.01639, 0],
      [-0.01381, 0],
      [0.00187, 3],
      [0.00291, 3],
      [-0.0117, 0],
      [-0.00999, 0],
      [-0.01138, 0],
      [-0.01408, 0],
      [0.00105, 3],
      [-0.01355, 0],
      [-0.01606, 0],
      [-0.01255, 0],
      [0.00018, 3],
      [-0.0008, 3],
      [-0.01584, 0],
      [-0.01022, 0],
      [-0.01649, 2],
      [-0.03054, 2],
      [-0.0143, 0],
      [-0.02056, 2],
      [-0.01605, 0],
      [0.00187, 3],
      [0.01192, 1]
    ],
    "red_o_points": [],
    "y_categories": [
      "0 TO 6 MONTHS",
      "13 TO 24 MONTHS",
      "25 MONTHS OR MORE",
      "7 TO 12 MONTHS",
      "nan"
    ],
    "blue_o_points": [],
    "blue_x_points": [
      [-0.00877, 0],
      [0.03126, 1],
      [-0.00887, 0],
      [0.03179, 1],
      [0.00676, 3],
      [-0.00942, 0],
      [-0.00718, 0],
      [0.00576, 3],
      [-0.00732, 0],
      [0.00231, 2],
      [0.03713, 1],
      [0.00876, 3],
      [0.03359, 1],
      [0.00596, 3],
      [0.02689, 1],
      [0.02591, 1],
      [0.00926, 3],
      [0.02456, 1],
      [0.01308, 3],
      [0.0083, 3],
      [-0.00525, 0]
    ]
  },
  "QA_lstPexKine[Elbow]": {
    "red_x_points": [
      [-0.00016, 1],
      [-0.00033, 2],
      [-0.00325, 2],
      [0.00136, 1],
      [-0.001, 2],
      [-0.00768, 0],
      [-0.00084, 1],
      [-0.00027, 1],
      [-0.00047, 2],
      [0.00015, 1],
      [-0.00156, 2],
      [-0.00072, 2],
      [-0.00202, 2],
      [0.00014, 1],
      [0.00015, 1],
      [-0.00255, 0],
      [-0.00053, 2],
      [-0.00094, 2],
      [-0.00369, 2],
      [-0.00075, 2],
      [-0.00029, 2],
      [-0.00546, 0],
      [-0.00103, 2]
    ],
    "red_o_points": [],
    "y_categories": ["NPV", "PV", "nan"],
    "blue_o_points": [],
    "blue_x_points": [
      [0.00578, 0],
      [-0.00069, 2],
      [0.00056, 1],
      [0.00389, 1],
      [-1e-5, 2],
      [0.00408, 1],
      [0.00196, 1],
      [0.00309, 1],
      [-9e-5, 2],
      [-1e-5, 2],
      [-3e-5, 2],
      [0.006, 1],
      [-9e-5, 2],
      [0.0009, 1],
      [0.00058, 1],
      [0.00239, 0],
      [-0.00023, 2],
      [0.00038, 1],
      [0.00025, 2],
      [0.00233, 1],
      [0.0007, 1]
    ]
  },
  "QS_mulNeuromadSite[C4]": {
    "red_x_points": [
      [-0.00623, 1],
      [-0.00367, 0],
      [-0.00118, 0],
      [0.00057, 0],
      [-0.00291, 0],
      [0.00113, 0],
      [-0.00085, 2],
      [-0.00896, 1],
      [0.00178, 2],
      [-0.00272, 0],
      [0.00033, 2],
      [-0.00296, 0],
      [0.00048, 2],
      [5e-5, 0],
      [-0.01324, 1],
      [0.00015, 2],
      [-0.00259, 0],
      [0.00074, 2],
      [-0.00134, 0],
      [-0.0049, 0],
      [-0.00718, 1],
      [0.0008, 0],
      [5e-5, 2]
    ],
    "red_o_points": [],
    "y_categories": ["N", "NOT APPLICABLE", "nan"],
    "blue_o_points": [],
    "blue_x_points": [
      [0.00252, 2],
      [0.00163, 2],
      [0.002, 0],
      [0.00399, 0],
      [0.00066, 2],
      [0.00484, 0],
      [0.00206, 0],
      [0.00128, 0],
      [0.00322, 2],
      [0.01124, 1],
      [-0.00108, 0],
      [0.00491, 0],
      [0.00294, 2],
      [0.00158, 2],
      [0.00148, 2],
      [0.00072, 2],
      [0.00319, 2],
      [0.00132, 2],
      [0.00168, 1],
      [0.00158, 2],
      [0.00089, 2]
    ]
  },
  "QS_mulTransfSite[Oberlin]": {
    "red_x_points": [
      [-0.01558, 1],
      [-0.04641, 0],
      [-0.04377, 0],
      [-0.04779, 0],
      [-0.04306, 0],
      [-0.04304, 0],
      [0.0114, 3],
      [-0.0156, 1],
      [0.01358, 3],
      [0.01771, 2],
      [0.01304, 3],
      [-0.04404, 0],
      [0.01242, 3],
      [0.01839, 2],
      [-0.01801, 1],
      [0.01309, 3],
      [-0.04281, 0],
      [0.01345, 3],
      [0.02023, 2],
      [-0.04734, 0],
      [-0.01891, 1],
      [-0.03984, 0],
      [0.01231, 3]
    ],
    "red_o_points": [],
    "y_categories": ["N", "NOT APPLICABLE", "Y", "nan"],
    "blue_o_points": [],
    "blue_x_points": [
      [0.0151, 3],
      [0.01412, 3],
      [0.02175, 2],
      [0.02421, 2],
      [0.0137, 3],
      [0.02487, 2],
      [0.02224, 2],
      [0.02304, 2],
      [0.01581, 3],
      [-0.00413, 1],
      [0.02187, 2],
      [0.02562, 2],
      [0.01461, 3],
      [0.01342, 3],
      [0.01304, 3],
      [0.01386, 3],
      [0.01518, 3],
      [0.01363, 3],
      [-0.00873, 1],
      [0.01395, 3],
      [0.01345, 3]
    ]
  },
  "QA_yonPexPain": {
    "red_x_points": [
      [-0.0161, 1],
      [-0.01831, 1],
      [-0.01493, 1],
      [-0.01611, 1],
      [-0.01697, 1],
      [-0.01554, 1],
      [-0.01495, 1],
      [-0.01321, 1],
      [-0.01995, 1],
      [-0.01909, 1],
      [0.01979, 0],
      [-0.01746, 1],
      [-0.01576, 1],
      [-0.01735, 1],
      [0.01797, 0],
      [-0.01543, 1],
      [-0.01533, 1],
      [-0.02003, 1],
      [-0.01653, 1],
      [-0.01789, 1],
      [-0.01609, 1],
      [-0.01394, 1],
      [-0.01979, 1]
    ],
    "red_o_points": [],
    "y_categories": ["N", "Y", "nan"],
    "blue_o_points": [],
    "blue_x_points": [
      [-0.01515, 1],
      [0.03303, 0],
      [0.02759, 0],
      [0.03183, 0],
      [-0.0143, 1],
      [0.03136, 0],
      [-0.01493, 1],
      [-0.01426, 1],
      [-0.0169, 1],
      [0.04189, 2],
      [0.03948, 0],
      [-0.01724, 1],
      [0.03345, 0],
      [0.02597, 0],
      [0.02624, 0],
      [0.02673, 0],
      [0.04891, 2],
      [0.02798, 0],
      [-0.01178, 1],
      [-0.01697, 1],
      [0.04009, 2]
    ]
  },
  "QA_lstPexKine[Index]": {
    "red_x_points": [
      [0.00012, 1],
      [-0.00054, 2],
      [-0.00325, 2],
      [0.00123, 1],
      [-0.00147, 2],
      [-0.00809, 0],
      [-0.00089, 1],
      [-2e-5, 1],
      [-0.00055, 2],
      [0.00076, 1],
      [-0.00188, 2],
      [-0.00058, 2],
      [-0.00184, 2],
      [-4e-5, 1],
      [-2e-5, 1],
      [-0.00213, 0],
      [-0.00064, 2],
      [-0.00184, 2],
      [-0.00355, 2],
      [-0.00069, 2],
      [-0.00034, 2],
      [-0.00549, 0],
      [-0.00194, 2]
    ],
    "red_o_points": [],
    "y_categories": ["NPV", "PV", "nan"],
    "blue_o_points": [],
    "blue_x_points": [
      [0.00737, 0],
      [-0.00092, 2],
      [0.0008, 1],
      [0.00394, 1],
      [-5e-5, 2],
      [0.00351, 1],
      [0.00236, 1],
      [0.00293, 1],
      [-0.00019, 2],
      [-6e-5, 2],
      [-0.00036, 2],
      [0.00585, 1],
      [-0.00016, 2],
      [0.0008, 1],
      [0.00056, 1],
      [0.00311, 0],
      [-0.0003, 2],
      [0.00093, 1],
      [-1e-5, 2],
      [0.00253, 1],
      [0.00103, 1]
    ]
  },
  "QA_lstPexPalle[Ulna]": {
    "red_x_points": [
      [-0.00146, 4],
      [-0.00129, 4],
      [-0.00136, 4],
      [-0.034, 2],
      [-0.0014, 4],
      [-0.00155, 4],
      [-0.01329, 1],
      [0.00603, 3],
      [-0.0016, 4],
      [-0.00155, 4],
      [-0.00231, 4],
      [-0.00123, 4],
      [-0.00184, 4],
      [0.00563, 3],
      [-0.00141, 4],
      [-0.02613, 0],
      [-0.01864, 0],
      [-0.00216, 4],
      [-0.00218, 4],
      [-0.00166, 4],
      [0.00758, 3],
      [-0.02079, 0],
      [-0.00194, 4]
    ],
    "red_o_points": [],
    "y_categories": ["ABS", "HYPO", "NAIA", "PT", "nan"],
    "blue_o_points": [],
    "blue_x_points": [
      [-0.00096, 4],
      [-0.00142, 4],
      [0.01037, 3],
      [0.01688, 1],
      [-0.00078, 4],
      [8e-5, 4],
      [0.01291, 3],
      [0.01553, 3],
      [-0.00151, 4],
      [-0.00112, 4],
      [-0.00103, 4],
      [-0.00038, 4],
      [-0.00141, 4],
      [0.01448, 3],
      [0.0136, 3],
      [0.01475, 3],
      [-0.0014, 4],
      [0.01287, 3],
      [-0.0004, 4],
      [0.01838, 3],
      [-0.00091, 4]
    ]
  }
}
