{
  "QA_lstPexMuscstrength[ElbowFlex]": {
    "red_x_points": [
      [-0.00456, 1],
      [0.00035, 2],
      [-0.00238, 1],
      [-0.00224, 1],
      [0.00267, 0],
      [-0.00178, 1],
      [-0.00223, 1],
      [-0.00382, 1],
      [-0.00201, 1],
      [-0.00188, 1],
      [-0.00203, 1],
      [-0.00445, 1],
      [0.00069, 2],
      [0.00348, 2],
      [0.00033, 2],
      [-0.00399, 1],
      [0.00026, 2],
      [0.00181, 0],
      [-0.004, 1],
      [-0.00384, 1],
      [-0.00442, 1],
      [-0.00198, 1],
      [0.00325, 2],
      [-0.00026, 0],
      [-0.00424, 1],
      [-0.00196, 1],
      [-0.0037, 1],
      [-0.00223, 1],
      [-0.00398, 1],
      [0.00059, 2],
      [-0.00215, 1]
    ],
    "red_o_points": [],
    "y_categories": ["GREATER THAN OR EQUALS TO 3", "LESS THAN 3", "nan"],
    "blue_o_points": [],
    "blue_x_points": [
      [0.00034, 2],
      [0.00525, 2],
      [0.00552, 0],
      [0.00022, 1],
      [0.00481, 2],
      [0.00632, 0],
      [0.0068, 0]
    ]
  },
  "QS_mulGraftRoot[C6]": {
    "red_x_points": [
      [-5e-5, 0],
      [-5e-5, 0],
      [-5e-5, 0],
      [-5e-5, 0],
      [-5e-5, 0],
      [-3e-5, 2],
      [-5e-5, 0],
      [-5e-5, 0],
      [0.00012, 1],
      [-3e-5, 2],
      [-5e-5, 0],
      [-3e-5, 2],
      [-3e-5, 2],
      [-3e-5, 2],
      [-3e-5, 2],
      [-5e-5, 0],
      [-3e-5, 2],
      [-3e-5, 2],
      [-3e-5, 2],
      [-5e-5, 0],
      [-3e-5, 2],
      [-5e-5, 0],
      [-3e-5, 2]
    ],
    "red_o_points": [],
    "y_categories": ["N", "NOT APPLICABLE", "nan"],
    "blue_o_points": [],
    "blue_x_points": [
      [0.00012, 1],
      [-3e-5, 2],
      [0.00012, 1],
      [0.00012, 1],
      [0.00012, 1]
    ]
  },
  "QS_mulTransfSite[C7cont]": {
    "red_x_points": [
      [0.0, 2],
      [-5e-5, 0],
      [-5e-5, 0],
      [-5e-5, 0],
      [-5e-5, 0],
      [-5e-5, 0],
      [0.0, 2],
      [-5e-5, 0],
      [-5e-5, 0],
      [-5e-5, 0],
      [0.0, 2],
      [-5e-5, 0],
      [-5e-5, 0],
      [0.0, 2],
      [0.0, 2],
      [0.0, 2],
      [0.0, 2],
      [-5e-5, 0],
      [0.0, 2],
      [-5e-5, 0],
      [0.0, 2],
      [0.00011, 1],
      [-5e-5, 0]
    ],
    "red_o_points": [],
    "y_categories": ["N", "NOT APPLICABLE", "nan"],
    "blue_o_points": [],
    "blue_x_points": [
      [0.0, 2],
      [0.00011, 1],
      [0.0, 2],
      [0.00011, 1],
      [0.00011, 1]
    ]
  },
  "QS_mulBpsurgeryType[Transf]": {
    "red_x_points": [
      [-0.00033, 3],
      [-0.00048, 2],
      [-0.00136, 0],
      [-0.00057, 2],
      [-0.00054, 2],
      [-0.00045, 2],
      [-0.00054, 2],
      [-0.00034, 3],
      [-0.00051, 2],
      [-0.0005, 2],
      [-0.00049, 2],
      [-0.00033, 3],
      [0.00186, 1],
      [-0.00026, 3],
      [-0.00059, 2],
      [-0.00051, 3],
      [-0.00044, 2],
      [-0.00053, 2],
      [-0.0003, 3],
      [-0.0003, 3],
      [-0.00041, 3],
      [-0.00046, 2],
      [-0.00032, 3],
      [-0.00037, 3],
      [-0.00041, 3],
      [-0.00051, 2],
      [-0.00035, 3],
      [-0.00044, 2],
      [-0.00023, 3],
      [0.00139, 1],
      [-0.00056, 2]
    ],
    "red_o_points": [],
    "y_categories": ["N", "NOT APPLICABLE", "Y", "nan"],
    "blue_o_points": [],
    "blue_x_points": [
      [0.0021, 1],
      [-0.00012, 3],
      [0.00199, 1],
      [-0.00054, 2],
      [-5e-5, 3],
      [0.00171, 1],
      [0.00156, 1]
    ]
  },
  "QS_mulNeuromadSite[T1]": {
    "red_x_points": [
      [-0.00118, 2],
      [-0.00426, 0],
      [-0.00449, 0],
      [-0.00387, 0],
      [-0.00432, 0],
      [-0.00388, 0],
      [-0.00391, 0],
      [-0.00117, 2],
      [-0.00397, 0],
      [-0.00411, 0],
      [-0.00385, 0],
      [-0.00184, 2],
      [0.00687, 1],
      [-0.00099, 2],
      [-0.00406, 0],
      [-0.0017, 2],
      [-0.00418, 0],
      [-0.00405, 0],
      [-0.00146, 2],
      [-0.00141, 2],
      [-0.00112, 2],
      [-0.00375, 0],
      [-0.00113, 2],
      [-0.00154, 2],
      [-0.00152, 2],
      [-0.00383, 0],
      [-0.00139, 2],
      [-0.0038, 0],
      [-0.00106, 2],
      [0.00796, 1],
      [-0.00392, 0]
    ],
    "red_o_points": [],
    "y_categories": ["N", "NOT APPLICABLE", "nan"],
    "blue_o_points": [],
    "blue_x_points": [
      [0.01346, 1],
      [-0.00011, 2],
      [0.00883, 1],
      [-0.00017, 0],
      [-0.00022, 2],
      [0.00877, 1],
      [0.01085, 1]
    ]
  },
  "QS_mulNeuromadSite[T2]": {
    "red_x_points": [
      [-0.00148, 2],
      [-0.00486, 0],
      [-0.00533, 0],
      [-0.00444, 0],
      [-0.00482, 0],
      [-0.0045, 0],
      [-0.00429, 0],
      [-0.00131, 2],
      [-0.00454, 0],
      [-0.00474, 0],
      [-0.00487, 0],
      [-0.00163, 2],
      [0.00819, 1],
      [-0.00136, 2],
      [-0.00456, 0],
      [-0.00164, 2],
      [-0.00536, 0],
      [-0.00539, 0],
      [-0.00139, 2],
      [-0.00133, 2],
      [-0.00141, 2],
      [-0.00425, 0],
      [-0.00125, 2],
      [-0.00171, 2],
      [-0.00131, 2],
      [-0.00488, 0],
      [-0.00143, 2],
      [-0.0045, 0],
      [-0.00108, 2],
      [0.01002, 1],
      [-0.00526, 0]
    ],
    "red_o_points": [],
    "y_categories": ["N", "NOT APPLICABLE", "nan"],
    "blue_o_points": [],
    "blue_x_points": [
      [0.01472, 1],
      [0.00013, 2],
      [0.01096, 1],
      [-0.00032, 0],
      [0.00029, 2],
      [0.01023, 1],
      [0.01299, 1]
    ]
  },
  "QA_lstPexMuscstrength[FingersAddu]": {
    "red_x_points": [
      [-4e-5, 0],
      [-5e-5, 1],
      [-7e-5, 1],
      [-3e-5, 0],
      [-3e-5, 0],
      [-5e-5, 1],
      [-6e-5, 0],
      [-6e-5, 0],
      [-4e-5, 0],
      [-3e-5, 0],
      [8e-5, 2],
      [6e-5, 2],
      [8e-5, 2],
      [-0.00015, 0],
      [3e-5, 2],
      [-3e-5, 0],
      [-3e-5, 0],
      [-0.00014, 1],
      [-6e-5, 0],
      [-7e-5, 1],
      [3e-5, 2],
      [6e-5, 2],
      [8e-5, 2],
      [6e-5, 2],
      [-5e-5, 1],
      [8e-5, 2],
      [-5e-5, 1]
    ],
    "red_o_points": [],
    "y_categories": ["GREATER THAN OR EQUALS TO 3", "LESS THAN 3", "nan"],
    "blue_o_points": [],
    "blue_x_points": [[4e-5, 2], [6e-5, 2], [8e-5, 2], [0.0001, 2], [-6e-5, 0]]
  },
  "QS_mulLysisTrunk[Upper]": {
    "red_x_points": [
      [-0.00199, 3],
      [-0.00344, 0],
      [-0.00335, 0],
      [-0.00336, 0],
      [-0.00318, 0],
      [-0.0056, 2],
      [-0.00314, 0],
      [-0.00184, 3],
      [-0.00345, 0],
      [-0.00308, 0],
      [-0.00308, 0],
      [-0.00197, 3],
      [0.00904, 1],
      [-0.00183, 3],
      [-0.00307, 0],
      [-0.00209, 3],
      [-0.00585, 2],
      [-0.00304, 0],
      [-0.00192, 3],
      [-0.00208, 3],
      [-0.0017, 3],
      [-0.00322, 0],
      [-0.00192, 3],
      [-0.00204, 3],
      [-0.00206, 3],
      [-0.00324, 0],
      [-0.00174, 3],
      [-0.00331, 0],
      [-0.00159, 3],
      [0.00923, 1],
      [-0.00525, 2]
    ],
    "red_o_points": [],
    "y_categories": ["N", "NOT APPLICABLE", "Y", "nan"],
    "blue_o_points": [],
    "blue_x_points": [
      [0.01257, 1],
      [-0.00054, 3],
      [0.00997, 1],
      [-0.00161, 0],
      [-0.00066, 3],
      [0.0103, 1],
      [0.01083, 1]
    ]
  },
  "QS_mulGraftNerve[Ac]": {
    "red_x_points": [
      [-0.00041, 2],
      [-0.00157, 0],
      [-0.00119, 0],
      [-0.00145, 0],
      [-0.00128, 0],
      [-0.00135, 0],
      [-0.00122, 0],
      [-0.00055, 2],
      [-0.00137, 0],
      [-0.00107, 0],
      [-0.00146, 0],
      [-0.00065, 2],
      [0.00222, 1],
      [-0.00029, 2],
      [-0.00134, 0],
      [-0.00052, 2],
      [-0.00146, 0],
      [-0.00127, 0],
      [-0.00051, 2],
      [-0.00038, 2],
      [-0.00052, 2],
      [-0.00141, 0],
      [-0.00012, 2],
      [-0.00078, 2],
      [-0.0006, 2],
      [-0.00141, 0],
      [-0.00049, 2],
      [-0.00142, 0],
      [-0.00033, 2],
      [0.00331, 1],
      [-0.00132, 0]
    ],
    "red_o_points": [],
    "y_categories": ["N", "NOT APPLICABLE", "nan"],
    "blue_o_points": [],
    "blue_x_points": [
      [0.00425, 1],
      [7e-5, 2],
      [0.00324, 1],
      [-0.00018, 0],
      [0.00016, 2],
      [0.00294, 1],
      [0.00392, 1]
    ]
  },
  "QS_mulGraftNerve[Me]": {
    "red_x_points": [
      [-0.00031, 2],
      [-0.00074, 0],
      [-0.00118, 0],
      [-0.00069, 0],
      [-0.00093, 0],
      [-0.00094, 0],
      [-0.00087, 0],
      [-0.00033, 2],
      [-0.00096, 0],
      [-0.00101, 0],
      [-0.00082, 0],
      [-0.00042, 2],
      [0.00171, 1],
      [-0.00025, 2],
      [-0.00093, 0],
      [-0.00044, 2],
      [-0.00059, 0],
      [-0.00099, 0],
      [-0.00029, 2],
      [-0.00033, 2],
      [-0.0003, 2],
      [-0.00074, 0],
      [-0.00041, 2],
      [-0.00024, 2],
      [-0.00043, 2],
      [-0.00096, 0],
      [-0.00028, 2],
      [-0.00088, 0],
      [-0.0002, 2],
      [0.00189, 1],
      [-0.00093, 0]
    ],
    "red_o_points": [],
    "y_categories": ["N", "NOT APPLICABLE", "nan"],
    "blue_o_points": [],
    "blue_x_points": [
      [0.00318, 1],
      [-1e-5, 2],
      [0.00222, 1],
      [-0.00027, 0],
      [-6e-5, 2],
      [0.00206, 1],
      [0.00203, 1]
    ]
  },
  "QA_lstPexMuscstrength[FingersAbdu]": {
    "red_x_points": [
      [4e-5, 2],
      [-0.0, 2],
      [-0.00029, 1],
      [-0.00032, 1],
      [-2e-5, 0],
      [-0.00028, 0],
      [-0.00048, 1],
      [3e-5, 0],
      [-2e-5, 0],
      [1e-5, 2],
      [-0.00016, 1],
      [7e-5, 0],
      [3e-5, 2],
      [3e-5, 2],
      [3e-5, 2],
      [0.00013, 0],
      [1e-5, 2],
      [-9e-5, 0],
      [3e-5, 0],
      [-0.00014, 1],
      [-0.0, 0],
      [-0.00028, 1],
      [3e-5, 2],
      [4e-5, 2],
      [4e-5, 2],
      [-0.00021, 1],
      [3e-5, 2],
      [-0.00016, 1],
      [1e-5, 2],
      [4e-5, 2],
      [-0.00023, 1]
    ],
    "red_o_points": [],
    "y_categories": ["GREATER THAN OR EQUALS TO 3", "LESS THAN 3", "nan"],
    "blue_o_points": [],
    "blue_x_points": [
      [4e-5, 2],
      [7e-5, 0],
      [0.00093, 2],
      [3e-5, 2],
      [0.00013, 0],
      [0.00013, 0]
    ]
  },
  "QS_mulNeuromadSite[C8]": {
    "red_x_points": [
      [-0.00124, 2],
      [-0.00339, 0],
      [-0.00364, 0],
      [-0.00301, 0],
      [-0.00319, 0],
      [-0.00322, 0],
      [-0.00346, 0],
      [-0.00098, 2],
      [-0.00343, 0],
      [-0.00325, 0],
      [-0.00318, 0],
      [-0.00182, 2],
      [0.00575, 1],
      [-0.00105, 2],
      [-0.00351, 0],
      [-0.00152, 2],
      [-0.00349, 0],
      [-0.00313, 0],
      [-0.00131, 2],
      [-0.00104, 2],
      [-0.00087, 2],
      [-0.00308, 0],
      [-0.00118, 2],
      [-0.00123, 2],
      [-0.00169, 2],
      [-0.00282, 0],
      [-0.00108, 2],
      [-0.00369, 0],
      [-0.00091, 2],
      [0.00656, 1],
      [-0.00319, 0]
    ],
    "red_o_points": [],
    "y_categories": ["N", "NOT APPLICABLE", "nan"],
    "blue_o_points": [],
    "blue_x_points": [
      [0.01229, 1],
      [-0.00021, 2],
      [0.00762, 1],
      [-2e-5, 0],
      [-0.00011, 2],
      [0.00696, 1],
      [0.00835, 1]
    ]
  },
  "QS_mulGraftNerve[Ph]": {
    "red_x_points": [
      [-0.00049, 2],
      [-0.00097, 0],
      [-0.00177, 0],
      [-0.0015, 0],
      [-0.0019, 0],
      [-0.0015, 0],
      [-0.00134, 0],
      [-0.00067, 2],
      [-0.00164, 0],
      [-0.00134, 0],
      [-0.00149, 0],
      [-0.00064, 2],
      [0.00247, 1],
      [-0.00063, 2],
      [-0.00136, 0],
      [-0.00053, 2],
      [-0.00128, 0],
      [-0.00217, 0],
      [-0.00075, 2],
      [-0.00051, 2],
      [-0.00056, 2],
      [-0.00159, 0],
      [-0.00051, 2],
      [-0.00098, 2],
      [-0.00065, 2],
      [-0.00137, 0],
      [-0.0005, 2],
      [-0.00153, 0],
      [-0.00047, 2],
      [0.00242, 1],
      [-0.00163, 0]
    ],
    "red_o_points": [],
    "y_categories": ["N", "NOT APPLICABLE", "nan"],
    "blue_o_points": [],
    "blue_x_points": [
      [0.00482, 1],
      [-0.0001, 2],
      [0.00399, 1],
      [0.00013, 0],
      [-0.00016, 2],
      [0.00453, 1],
      [0.00393, 1]
    ]
  },
  "QS_mulTransfSite[AcSsPA]": {
    "red_x_points": [
      [-0.00062, 3],
      [-0.0011, 0],
      [-0.00182, 0],
      [-0.00155, 0],
      [-0.00139, 0],
      [-0.00126, 0],
      [-0.00148, 0],
      [-0.00067, 3],
      [-0.00168, 0],
      [-0.00134, 0],
      [-0.00126, 0],
      [-0.00068, 3],
      [0.00317, 1],
      [-0.00071, 3],
      [-0.00117, 0],
      [-0.00063, 3],
      [-0.0028, 2],
      [-0.00132, 0],
      [-0.00087, 3],
      [-0.00062, 3],
      [-0.00066, 3],
      [-0.00122, 0],
      [-0.00065, 3],
      [-0.00061, 3],
      [-0.00062, 3],
      [-0.00127, 0],
      [-0.0005, 3],
      [-0.00141, 0],
      [-0.00057, 3],
      [0.00325, 1],
      [-0.00143, 0]
    ],
    "red_o_points": [],
    "y_categories": ["N", "NOT APPLICABLE", "Y", "nan"],
    "blue_o_points": [],
    "blue_x_points": [
      [0.00569, 1],
      [-7e-5, 3],
      [0.00407, 1],
      [-0.00073, 0],
      [-0.00027, 3],
      [0.00451, 1],
      [0.00438, 1]
    ]
  },
  "QA_lstPexPalle[Elbow]": {
    "red_x_points": [
      [9e-5, 4],
      [7e-5, 4],
      [0.0001, 4],
      [7e-5, 4],
      [-0.00014, 3],
      [-0.00037, 3],
      [6e-5, 4],
      [0.00014, 4],
      [8e-5, 4],
      [0.00011, 1],
      [-0.00033, 3],
      [0.00023, 1],
      [0.00049, 4],
      [5e-5, 4],
      [9e-5, 4],
      [7e-5, 4],
      [7e-5, 4],
      [0.0001, 1],
      [-0.00043, 3],
      [-0.00023, 0],
      [-0.00037, 3],
      [-0.00033, 2],
      [5e-5, 4],
      [-0.00203, 3],
      [6e-5, 4],
      [7e-5, 4],
      [-0.00062, 3],
      [6e-5, 4],
      [0.00012, 4],
      [-0.01043, 3],
      [-0.00033, 0]
    ],
    "red_o_points": [],
    "y_categories": ["ABS", "HYPO", "NAIA", "PT", "nan"],
    "blue_o_points": [],
    "blue_x_points": [
      [0.00092, 4],
      [0.00029, 4],
      [0.00464, 1],
      [0.00027, 4],
      [0.00028, 4],
      [0.00089, 4],
      [0.00102, 4]
    ]
  },
  "QA_lstPexMuscstrength[ScapulaAbducSuprot]": {
    "red_x_points": [
      [-0.00042, 0],
      [9e-5, 2],
      [-0.00016, 1],
      [-0.00014, 1],
      [-8e-5, 0],
      [-0.00017, 1],
      [-0.00035, 1],
      [-0.00062, 1],
      [-6e-5, 0],
      [-9e-5, 0],
      [-0.00033, 1],
      [-0.00065, 1],
      [0.00015, 2],
      [0.0005, 2],
      [0.00015, 2],
      [0.00033, 2],
      [6e-5, 2],
      [-7e-5, 0],
      [-0.00052, 0],
      [-0.00044, 1],
      [-0.00046, 0],
      [-0.00023, 1],
      [0.00021, 2],
      [-0.00038, 0],
      [0.00054, 2],
      [-0.00032, 1],
      [-0.00039, 1],
      [-4e-5, 0],
      [0.00024, 2],
      [0.00014, 2],
      [-0.00011, 1]
    ],
    "red_o_points": [],
    "y_categories": ["GREATER THAN OR EQUALS TO 3", "LESS THAN 3", "nan"],
    "blue_o_points": [],
    "blue_x_points": [
      [8e-5, 2],
      [0.0006, 2],
      [-2e-5, 0],
      [0.00056, 2],
      [0.00077, 2],
      [-1e-5, 0],
      [5e-5, 2]
    ]
  },
  "participant_code": {
    "red_x_points": [
      [-0.0139, 1],
      [-0.01432, 2],
      [-0.01418, 3],
      [-0.01446, 4],
      [-0.01362, 5],
      [-0.01381, 6],
      [-0.01484, 7],
      [-0.01395, 8],
      [-0.01423, 9],
      [-0.01404, 10],
      [-0.01404, 11],
      [-0.0146, 12],
      [-0.01432, 14],
      [-0.01395, 16],
      [-0.01414, 17],
      [-0.01423, 19],
      [-0.01358, 20],
      [-0.01442, 22],
      [-0.01432, 23],
      [-0.01358, 25],
      [-0.01437, 26],
      [-0.01358, 27],
      [-0.01409, 28],
      [-0.01404, 29],
      [-0.01325, 30],
      [-0.01381, 32],
      [-0.01372, 33],
      [-0.01409, 34],
      [-0.01395, 35],
      [-0.01432, 36],
      [-0.0139, 37]
    ],
    "red_o_points": [],
    "y_categories": [
      "P16554",
      "P18297",
      "P19283",
      "P19287",
      "P23391",
      "P31645",
      "P31691",
      "P34778",
      "P35046",
      "P36328",
      "P43633",
      "P4544",
      "P46417",
      "P48965",
      "P53068",
      "P5497",
      "P59529",
      "P62483",
      "P64658",
      "P65202",
      "P66816",
      "P6751",
      "P7408",
      "P75566",
      "P76226",
      "P79971",
      "P82621",
      "P82990",
      "P84932",
      "P85825",
      "P86989",
      "P8770",
      "P87791",
      "P90550",
      "P93159",
      "P94969",
      "P96710",
      "P9744",
      "nan"
    ],
    "blue_o_points": [],
    "blue_x_points": [
      [0.04047, 0],
      [0.0417, 13],
      [0.03986, 15],
      [0.04124, 18],
      [0.04063, 21],
      [0.03909, 24],
      [0.04292, 31]
    ]
  },
  "QA_lstPexMuscstrength[ShoulderExrot]": {
    "red_x_points": [
      [-0.00132, 1],
      [0.00022, 2],
      [0.00169, 0],
      [-0.00134, 1],
      [-0.0016, 1],
      [-0.00137, 1],
      [0.00015, 2],
      [-0.00113, 1],
      [-0.00135, 1],
      [-0.0013, 1],
      [0.00022, 2],
      [-0.00098, 1],
      [-0.00021, 2],
      [0.00021, 2],
      [0.00012, 2],
      [0.00017, 2],
      [0.00015, 2],
      [-0.00136, 1],
      [-0.00133, 1],
      [-0.00146, 1],
      [-0.00134, 1],
      [0.0002, 2],
      [0.00016, 2],
      [0.00011, 2],
      [0.00024, 2],
      [-0.00136, 1],
      [0.00019, 2],
      [0.00147, 0],
      [0.00021, 2],
      [-0.00034, 2],
      [-0.0014, 1]
    ],
    "red_o_points": [],
    "y_categories": ["GREATER THAN OR EQUALS TO 3", "LESS THAN 3", "nan"],
    "blue_o_points": [],
    "blue_x_points": [
      [-0.00027, 2],
      [0.00023, 2],
      [0.00336, 0],
      [0.00035, 2],
      [0.00031, 2],
      [0.00363, 0],
      [0.00025, 1]
    ]
  },
  "QA_mulInjOrthesisType[ArmSling]": {
    "red_x_points": [
      [-0.00892, 2],
      [-0.00819, 2],
      [-0.00804, 2],
      [-0.00814, 2],
      [-0.00778, 2],
      [-0.00792, 2],
      [-0.00864, 2],
      [-0.00883, 2],
      [-0.00808, 2],
      [-0.00763, 2],
      [-0.00778, 2],
      [-0.00906, 2],
      [0.02273, 1],
      [-0.00899, 2],
      [-0.00792, 2],
      [-0.00927, 2],
      [-0.00957, 0],
      [-0.00784, 2],
      [-0.00849, 2],
      [-0.00905, 2],
      [-0.01059, 0],
      [-0.01008, 3],
      [-0.00845, 2],
      [0.02332, 1],
      [-0.0092, 2],
      [-0.00813, 2],
      [-0.00842, 2],
      [-0.00771, 2],
      [-0.01057, 3],
      [-0.01416, 3],
      [-0.00813, 2]
    ],
    "red_o_points": [],
    "y_categories": ["N", "NOT APPLICABLE", "Y", "nan"],
    "blue_o_points": [],
    "blue_x_points": [
      [-0.00439, 2],
      [0.02603, 1],
      [0.02089, 1],
      [0.02534, 1],
      [0.02787, 1],
      [0.0212, 1],
      [0.02126, 1]
    ]
  },
  "QS_mulGraftNerve[Ul]": {
    "red_x_points": [
      [-0.00025, 2],
      [-0.00053, 0],
      [-0.0008, 0],
      [-0.00067, 0],
      [-0.00063, 0],
      [-0.00068, 0],
      [-0.00069, 0],
      [-0.00019, 2],
      [-0.00061, 0],
      [-0.0006, 0],
      [-0.00071, 0],
      [-0.00022, 2],
      [0.00154, 1],
      [-0.00017, 2],
      [-0.00065, 0],
      [-0.00033, 2],
      [-0.00057, 0],
      [-0.00064, 0],
      [-0.00036, 2],
      [-0.00029, 2],
      [-0.00038, 2],
      [-0.00049, 0],
      [-0.00023, 2],
      [-0.00028, 2],
      [-0.0004, 2],
      [-0.00065, 0],
      [-0.00026, 2],
      [-0.0008, 0],
      [-0.00023, 2],
      [0.00114, 1],
      [-0.00054, 0]
    ],
    "red_o_points": [],
    "y_categories": ["N", "NOT APPLICABLE", "nan"],
    "blue_o_points": [],
    "blue_x_points": [
      [0.00183, 1],
      [-0.0, 2],
      [0.00166, 1],
      [-0.00013, 0],
      [-4e-5, 2],
      [0.00182, 1],
      [0.00142, 1]
    ]
  },
  "QA_lstPexPain[C6]": {
    "red_x_points": [
      [-0.00037, 1],
      [-7e-5, 2],
      [-6e-5, 2],
      [-7e-5, 2],
      [-0.00106, 0],
      [0.0001, 1],
      [8e-5, 1],
      [-0.00088, 0],
      [0.0001, 1],
      [4e-5, 1],
      [0.0, 1],
      [-0.00012, 1],
      [-0.00046, 2],
      [0.00049, 2],
      [-0.0, 2],
      [0.00028, 2],
      [-3e-5, 2],
      [1e-5, 1],
      [-0.00057, 0],
      [-0.00019, 1],
      [-0.00016, 1],
      [-3e-5, 2],
      [0.00025, 2],
      [-0.00505, 0],
      [0.00022, 2],
      [-0.00011, 2],
      [-0.0004, 1],
      [-3e-5, 2],
      [-0.00054, 1],
      [3e-5, 1],
      [3e-5, 1]
    ],
    "red_o_points": [],
    "y_categories": ["NORM", "NPV", "nan"],
    "blue_o_points": [],
    "blue_x_points": [
      [6e-5, 1],
      [0.00055, 2],
      [0.00081, 1],
      [0.00131, 1],
      [0.00083, 2],
      [0.00075, 1],
      [0.00062, 1]
    ]
  },
  "QA_yonInjUnconscio": {
    "red_x_points": [
      [-0.00381, 1],
      [-0.0037, 1],
      [-0.00171, 2],
      [-0.00182, 2],
      [0.00698, 0],
      [-0.00368, 1],
      [-0.00207, 2],
      [-0.00472, 2],
      [-0.002, 2],
      [-0.00146, 2],
      [-0.00404, 1],
      [-0.00454, 1],
      [-0.02003, 1],
      [-0.00519, 2],
      [-0.00201, 2],
      [-0.00477, 2],
      [-0.00322, 1],
      [0.00662, 0],
      [-0.00389, 1],
      [-0.00367, 1],
      [-0.00336, 1],
      [-0.00341, 1],
      [-0.00426, 2],
      [-0.00566, 1],
      [-0.00472, 2],
      [-0.00363, 1],
      [0.00978, 0],
      [-0.00308, 1],
      [-0.00437, 2],
      [-0.00119, 2],
      [-0.00352, 1]
    ],
    "red_o_points": [],
    "y_categories": ["N", "Y", "nan"],
    "blue_o_points": [],
    "blue_x_points": [
      [0.00098, 2],
      [-0.00052, 1],
      [0.01212, 0],
      [0.01728, 0],
      [0.02127, 0],
      [0.00145, 2],
      [0.00193, 2]
    ]
  },
  "QA_lstPexMuscstrength[ShoulderAbduc]": {
    "red_x_points": [
      [-0.00522, 1],
      [-0.0051, 1],
      [-0.0052, 1],
      [-0.00567, 1],
      [-0.00545, 1],
      [-0.00562, 1],
      [-0.00507, 1],
      [-0.00534, 1],
      [-0.00498, 1],
      [-0.00546, 1],
      [-0.00542, 1],
      [-0.00533, 1],
      [0.00253, 2],
      [0.00484, 2],
      [0.00461, 2],
      [0.00451, 2],
      [0.0045, 2],
      [-0.00539, 1],
      [-0.0053, 1],
      [-0.00485, 1],
      [-0.00551, 1],
      [-0.00494, 1],
      [0.00479, 2],
      [-0.00711, 1],
      [-0.00535, 1],
      [-0.00536, 1],
      [-0.00614, 1],
      [-0.00553, 1],
      [-0.00527, 1],
      [0.00353, 2],
      [-0.00519, 1]
    ],
    "red_o_points": [],
    "y_categories": ["GREATER THAN OR EQUALS TO 3", "LESS THAN 3", "nan"],
    "blue_o_points": [],
    "blue_x_points": [
      [0.00386, 2],
      [0.00482, 2],
      [0.02093, 0],
      [0.00549, 2],
      [0.00505, 2],
      [0.02223, 0],
      [-0.0009, 1]
    ]
  },
  "QS_mulGraftNerve[MCA]": {
    "red_x_points": [
      [-5e-5, 2],
      [-0.00021, 0],
      [-0.0003, 0],
      [-0.00025, 0],
      [-0.00022, 0],
      [-0.00019, 0],
      [-0.00027, 0],
      [-0.00022, 2],
      [-0.00034, 0],
      [-0.00029, 0],
      [-0.00014, 0],
      [-1e-5, 2],
      [0.00022, 1],
      [-5e-5, 2],
      [-0.00019, 0],
      [-0.00015, 2],
      [-0.00029, 0],
      [-0.00022, 0],
      [-3e-5, 2],
      [-0.00012, 2],
      [-2e-5, 2],
      [-9e-5, 0],
      [-5e-5, 2],
      [-0.0001, 2],
      [-0.0001, 2],
      [-0.00017, 0],
      [-5e-5, 2],
      [-0.00019, 0],
      [-6e-5, 2],
      [0.00044, 1],
      [-0.00023, 0]
    ],
    "red_o_points": [],
    "y_categories": ["N", "NOT APPLICABLE", "nan"],
    "blue_o_points": [],
    "blue_x_points": [
      [0.00097, 1],
      [-1e-5, 2],
      [0.0006, 1],
      [6e-5, 0],
      [0.00014, 2],
      [0.00045, 1],
      [0.00069, 1]
    ]
  },
  "QA_lstPexInspectio[SurgicalScar]": {
    "red_x_points": [
      [0.00205, 1],
      [0.00085, 1],
      [0.0003, 0],
      [0.00095, 1],
      [-0.00359, 2],
      [-0.00015, 0],
      [0.00095, 1],
      [0.0018, 1],
      [0.00104, 1],
      [-0.0025, 2],
      [0.00109, 1],
      [-0.00231, 0],
      [-0.0007, 1],
      [-0.00527, 2],
      [0.00095, 1],
      [0.00186, 1],
      [-0.00068, 0],
      [-0.00402, 2],
      [-0.00437, 2],
      [-0.00407, 2],
      [0.00208, 1],
      [0.00089, 1],
      [-0.00484, 2],
      [-0.00906, 2],
      [0.00189, 1],
      [0.00115, 1],
      [-0.00503, 2],
      [-0.00226, 2],
      [0.0018, 1],
      [-1e-5, 1],
      [-0.00279, 2]
    ],
    "red_o_points": [],
    "y_categories": ["ABS", "NAIA", "PT", "nan"],
    "blue_o_points": [],
    "blue_x_points": [
      [0.00056, 1],
      [0.00334, 1],
      [0.00344, 0],
      [0.00325, 1],
      [0.00462, 1],
      [0.00077, 1],
      [0.00313, 0]
    ]
  },
  "QA_intPexWristFlex": {
    "red_x_points": [[0.0005, 2], [-0.01482, 1]],
    "red_o_points": [],
    "y_categories": ["GREATER THAN OR EQUALS TO 60", "LESS THAN 60", "nan"],
    "blue_o_points": [],
    "blue_x_points": [[0.00143, 2], [0.00598, 0], [0.00125, 2], [0.00121, 2]]
  },
  "QS_mulGraftTrunk[LowerTrunk]": {
    "red_x_points": [
      [-4e-5, 0],
      [-4e-5, 0],
      [-4e-5, 0],
      [-4e-5, 0],
      [-4e-5, 0],
      [0.0, 2],
      [-3e-5, 0],
      [-4e-5, 0],
      [-4e-5, 0],
      [0.0, 2],
      [-1e-5, 2],
      [-4e-5, 0],
      [-1e-5, 2],
      [-4e-5, 0],
      [-1e-5, 2],
      [-1e-5, 2],
      [-1e-5, 2],
      [0.0, 2],
      [-3e-5, 0],
      [-1e-5, 2],
      [-3e-5, 0],
      [0.0, 2],
      [0.0001, 1],
      [-4e-5, 0]
    ],
    "red_o_points": [],
    "y_categories": ["N", "NOT APPLICABLE", "nan"],
    "blue_o_points": [],
    "blue_x_points": [
      [0.00029, 1],
      [0.0001, 1],
      [-3e-5, 0],
      [0.0, 2],
      [0.0001, 1]
    ]
  },
  "QS_mulGraftRoot[T2]": {
    "red_x_points": [
      [-1e-5, 2],
      [-5e-5, 0],
      [-6e-5, 0],
      [-6e-5, 0],
      [-6e-5, 0],
      [-6e-5, 0],
      [-4e-5, 2],
      [-0.00015, 0],
      [-6e-5, 0],
      [-6e-5, 0],
      [-0.00013, 2],
      [0.00011, 1],
      [-5e-5, 0],
      [-0.00013, 2],
      [-6e-5, 0],
      [-0.00015, 0],
      [-3e-5, 2],
      [-1e-5, 2],
      [-4e-5, 2],
      [-2e-5, 0],
      [-4e-5, 2],
      [-4e-5, 2],
      [-4e-5, 2],
      [-6e-5, 0],
      [-4e-5, 2],
      [-6e-5, 0],
      [-3e-5, 2]
    ],
    "red_o_points": [],
    "y_categories": ["N", "NOT APPLICABLE", "nan"],
    "blue_o_points": [],
    "blue_x_points": [
      [0.00027, 1],
      [-4e-5, 2],
      [0.00011, 1],
      [-2e-5, 0],
      [-1e-5, 2],
      [0.00038, 1],
      [0.00023, 1]
    ]
  },
  "QS_mulGraftNerve[Ax]": {
    "red_x_points": [
      [-0.00029, 2],
      [-0.00097, 0],
      [-0.00076, 0],
      [-0.0011, 0],
      [-0.00088, 0],
      [-0.00091, 0],
      [-0.00106, 0],
      [-0.00041, 2],
      [-0.00089, 0],
      [-0.00118, 0],
      [-0.00092, 0],
      [-0.00052, 2],
      [0.00122, 1],
      [-0.00024, 2],
      [-0.00107, 0],
      [-0.00039, 2],
      [-0.00084, 0],
      [-0.00114, 0],
      [-0.00034, 2],
      [-0.00022, 2],
      [-0.0003, 2],
      [-0.00103, 0],
      [-0.00025, 2],
      [-0.00017, 2],
      [-0.00035, 2],
      [-0.00082, 0],
      [-0.00026, 2],
      [-0.00111, 0],
      [-0.00026, 2],
      [0.00206, 1],
      [-0.00081, 0]
    ],
    "red_o_points": [],
    "y_categories": ["N", "NOT APPLICABLE", "nan"],
    "blue_o_points": [],
    "blue_x_points": [
      [0.00331, 1],
      [3e-5, 2],
      [0.00184, 1],
      [-7e-5, 0],
      [-5e-5, 2],
      [0.00263, 1],
      [0.00225, 1]
    ]
  },
  "QS_mulBpsurgeryType[Lysis]": {
    "red_x_points": [
      [-0.00259, 3],
      [-0.00433, 0],
      [-0.00716, 2],
      [-0.0043, 0],
      [-0.00424, 0],
      [-0.00754, 2],
      [-0.00428, 0],
      [-0.00221, 3],
      [-0.00422, 0],
      [-0.00461, 0],
      [-0.00446, 0],
      [-0.00253, 3],
      [0.012, 1],
      [-0.00226, 3],
      [-0.00416, 0],
      [-0.00287, 3],
      [-0.00727, 2],
      [-0.00417, 0],
      [-0.00258, 3],
      [-0.00252, 3],
      [-0.00244, 3],
      [-0.00408, 0],
      [-0.00263, 3],
      [-0.0025, 3],
      [-0.00272, 3],
      [-0.00431, 0],
      [-0.00222, 3],
      [-0.00441, 0],
      [-0.00265, 3],
      [0.01348, 1],
      [-0.00692, 2]
    ],
    "red_o_points": [],
    "y_categories": ["N", "NOT APPLICABLE", "Y", "nan"],
    "blue_o_points": [],
    "blue_x_points": [
      [0.01706, 1],
      [-0.00097, 3],
      [0.01339, 1],
      [-0.00145, 0],
      [-0.001, 3],
      [0.01343, 1],
      [0.01709, 1]
    ]
  },
  "QS_mulLysisSite[Trunk]": {
    "red_x_points": [
      [-0.00167, 3],
      [-0.00266, 0],
      [-0.00283, 0],
      [-0.00282, 0],
      [-0.00281, 0],
      [-0.00454, 2],
      [-0.00264, 0],
      [-0.00183, 3],
      [-0.00258, 0],
      [-0.00262, 0],
      [-0.0024, 0],
      [-0.00194, 3],
      [0.00891, 1],
      [-0.00174, 3],
      [-0.00279, 0],
      [-0.0017, 3],
      [-0.00481, 2],
      [-0.00255, 0],
      [-0.00169, 3],
      [-0.00155, 3],
      [-0.00132, 3],
      [-0.00278, 0],
      [-0.0017, 3],
      [-0.00177, 3],
      [-0.00182, 3],
      [-0.00296, 0],
      [-0.00169, 3],
      [-0.00267, 0],
      [-0.00153, 3],
      [0.00784, 1],
      [-0.00482, 2]
    ],
    "red_o_points": [],
    "y_categories": ["N", "NOT APPLICABLE", "Y", "nan"],
    "blue_o_points": [],
    "blue_x_points": [
      [0.01045, 1],
      [-0.00073, 3],
      [0.00795, 1],
      [-0.0017, 0],
      [-0.00068, 3],
      [0.00873, 1],
      [0.01011, 1]
    ]
  },
  "QS_mulGraftTrunk[UpperTrunk]": {
    "red_x_points": [
      [-0.00096, 3],
      [-0.00163, 0],
      [-0.00133, 0],
      [-0.00147, 0],
      [-0.00183, 0],
      [-0.00154, 0],
      [-0.00157, 0],
      [-0.00076, 3],
      [-0.00151, 0],
      [-0.00156, 0],
      [-0.00148, 0],
      [-0.00087, 3],
      [0.00374, 1],
      [-0.00062, 3],
      [-0.0035, 2],
      [-0.00081, 3],
      [-0.00144, 0],
      [-0.00193, 0],
      [-0.0009, 3],
      [-0.00072, 3],
      [-0.00073, 3],
      [-0.0014, 0],
      [-0.00073, 3],
      [-0.00086, 3],
      [-0.00082, 3],
      [-0.00134, 0],
      [-0.00071, 3],
      [-0.00145, 0],
      [-0.00071, 3],
      [0.00421, 1],
      [-0.00108, 0]
    ],
    "red_o_points": [],
    "y_categories": ["N", "NOT APPLICABLE", "Y", "nan"],
    "blue_o_points": [],
    "blue_x_points": [
      [0.00531, 1],
      [-0.00014, 3],
      [0.00501, 1],
      [-0.00079, 0],
      [-0.00017, 3],
      [0.00421, 1],
      [0.00546, 1]
    ]
  },
  "QS_mulTransfSite[PhMc]": {
    "red_x_points": [
      [-0.00142, 3],
      [-0.00282, 0],
      [-0.00272, 0],
      [-0.0026, 0],
      [-0.00292, 0],
      [-0.0029, 0],
      [-0.00505, 2],
      [-0.00141, 3],
      [-0.00266, 0],
      [-0.00261, 0],
      [-0.00276, 0],
      [-0.00135, 3],
      [0.00727, 1],
      [-0.00127, 3],
      [-0.00263, 0],
      [-0.00143, 3],
      [-0.00248, 0],
      [-0.00258, 0],
      [-0.0015, 3],
      [-0.00141, 3],
      [-0.00115, 3],
      [-0.00443, 2],
      [-0.00141, 3],
      [-0.00124, 3],
      [-0.00134, 3],
      [-0.00255, 0],
      [-0.00152, 3],
      [-0.00284, 0],
      [-0.00134, 3],
      [0.00771, 1],
      [-0.00266, 0]
    ],
    "red_o_points": [],
    "y_categories": ["N", "NOT APPLICABLE", "Y", "nan"],
    "blue_o_points": [],
    "blue_x_points": [
      [0.00957, 1],
      [-0.00044, 3],
      [0.0084, 1],
      [-0.0017, 0],
      [-0.00055, 3],
      [0.00785, 1],
      [0.00792, 1]
    ]
  },
  "QA_mulInjTbpiCause[Motorcycle]": {
    "red_x_points": [
      [0.00127, 0],
      [-0.00097, 1],
      [-0.00115, 1],
      [-0.00098, 1],
      [-0.00147, 1],
      [-0.00088, 1],
      [-0.00106, 1],
      [-0.00067, 1],
      [-0.00099, 1],
      [-0.00101, 1],
      [-0.00068, 1],
      [0.00031, 0],
      [-0.02652, 1],
      [-0.00097, 1],
      [-0.00103, 1],
      [-0.00078, 1],
      [-0.00108, 1],
      [-0.00142, 1],
      [0.0013, 0],
      [-0.00091, 1],
      [-0.00109, 1],
      [-0.0008, 1],
      [-0.00095, 1],
      [-0.00157, 1],
      [0.00138, 0],
      [-0.00096, 1],
      [-0.00077, 1],
      [-0.00098, 1],
      [-0.00094, 1],
      [-0.02553, 1],
      [-0.00095, 1]
    ],
    "red_o_points": [],
    "y_categories": ["N", "Y", "nan"],
    "blue_o_points": [],
    "blue_x_points": [
      [0.01282, 0],
      [-2e-5, 1],
      [0.01089, 0],
      [-0.00148, 1],
      [0.0, 1],
      [0.01326, 0],
      [0.01279, 0]
    ]
  },
  "QS_mulLysisSite[Root]": {
    "red_x_points": [
      [-0.00064, 3],
      [-0.00118, 0],
      [-0.00247, 2],
      [-0.00124, 0],
      [-0.00105, 0],
      [-0.0011, 0],
      [-0.00121, 0],
      [-0.00037, 3],
      [-0.0012, 0],
      [-0.00112, 0],
      [-0.00126, 0],
      [-0.0006, 3],
      [0.00299, 1],
      [-0.00054, 3],
      [-0.00126, 0],
      [-0.00067, 3],
      [-0.00113, 0],
      [-0.00103, 0],
      [-0.00047, 3],
      [-0.00071, 3],
      [-0.00051, 3],
      [-0.00143, 0],
      [-0.00053, 3],
      [-0.00063, 3],
      [-0.00068, 3],
      [-0.00117, 0],
      [-0.00069, 3],
      [-0.00114, 0],
      [-0.0005, 3],
      [0.00409, 1],
      [-0.00219, 2]
    ],
    "red_o_points": [],
    "y_categories": ["N", "NOT APPLICABLE", "Y", "nan"],
    "blue_o_points": [],
    "blue_x_points": [
      [0.00435, 1],
      [-0.00012, 3],
      [0.00378, 1],
      [-0.00128, 0],
      [-0.00027, 3],
      [0.0033, 1],
      [0.00408, 1]
    ]
  },
  "QA_yonInjOrtsurg": {
    "red_x_points": [
      [-0.00307, 2],
      [-0.00025, 2],
      [-4e-5, 2],
      [-0.00011, 2],
      [-4e-5, 2],
      [-2e-5, 2],
      [-0.00028, 1],
      [-0.00341, 2],
      [5e-5, 0],
      [-0.00026, 1],
      [-0.00026, 1],
      [-0.00316, 2],
      [-0.00237, 0],
      [0.00048, 1],
      [-0.00027, 2],
      [-0.00333, 2],
      [0.0004, 0],
      [-2e-5, 2],
      [0.00254, 0],
      [0.0002, 1],
      [-0.00316, 2],
      [-0.00027, 1],
      [-0.00379, 2],
      [-0.00362, 2],
      [-0.00292, 2],
      [5e-5, 0],
      [-0.00036, 1],
      [0.00017, 0],
      [-0.00288, 2],
      [-0.00201, 1],
      [-0.0003, 1]
    ],
    "red_o_points": [],
    "y_categories": ["N", "Y", "nan"],
    "blue_o_points": [],
    "blue_x_points": [
      [0.00047, 2],
      [0.00385, 1],
      [0.00053, 2],
      [0.00022, 2],
      [0.01395, 0],
      [0.00051, 2],
      [0.00065, 2]
    ]
  },
  "QS_mulGraftLevel[Trunk]": {
    "red_x_points": [
      [-0.00081, 3],
      [-0.00102, 0],
      [-0.00101, 0],
      [-0.00089, 0],
      [-0.00099, 0],
      [-0.00108, 0],
      [-0.00092, 0],
      [-0.00062, 3],
      [-0.00104, 0],
      [-0.00101, 0],
      [-0.00101, 0],
      [-0.00063, 3],
      [0.00341, 1],
      [-0.00073, 3],
      [-0.00206, 2],
      [-0.00071, 3],
      [-0.00098, 0],
      [-0.00099, 0],
      [-0.0008, 3],
      [-0.00062, 3],
      [-0.00071, 3],
      [-0.00088, 0],
      [-0.0008, 3],
      [-0.00055, 3],
      [-0.0007, 3],
      [-0.00087, 0],
      [-0.00067, 3],
      [-0.00092, 0],
      [-0.00069, 3],
      [0.00303, 1],
      [-0.00108, 0]
    ],
    "red_o_points": [],
    "y_categories": ["N", "NOT APPLICABLE", "Y", "nan"],
    "blue_o_points": [],
    "blue_x_points": [
      [0.00382, 1],
      [-0.00039, 3],
      [0.00319, 1],
      [-0.00086, 0],
      [-0.00021, 3],
      [0.00337, 1],
      [0.00361, 1]
    ]
  },
  "QS_mulGraftNerve[Sc]": {
    "red_x_points": [
      [-3e-5, 0],
      [-3e-5, 0],
      [-3e-5, 0],
      [-0.0002, 0],
      [-3e-5, 0],
      [-2e-5, 2],
      [-3e-5, 0],
      [-3e-5, 0],
      [-3e-5, 0],
      [-2e-5, 2],
      [9e-5, 1],
      [-2e-5, 2],
      [-3e-5, 0],
      [-2e-5, 2],
      [-2e-5, 2],
      [-2e-5, 2],
      [-2e-5, 2],
      [-2e-5, 2],
      [-2e-5, 2],
      [-2e-5, 2],
      [-3e-5, 0],
      [-2e-5, 2],
      [9e-5, 1]
    ],
    "red_o_points": [],
    "y_categories": ["N", "NOT APPLICABLE", "nan"],
    "blue_o_points": [],
    "blue_x_points": [
      [9e-5, 1],
      [-3e-5, 0],
      [-2e-5, 2],
      [3e-5, 1],
      [0.00012, 1]
    ]
  },
  "QS_mulGraftNerve[other]": {
    "red_x_points": [
      [-0.00067, 2],
      [-0.00172, 0],
      [-0.00188, 0],
      [-0.00198, 0],
      [-0.00187, 0],
      [-0.00178, 0],
      [-0.00199, 0],
      [-0.00077, 2],
      [-0.0021, 0],
      [-0.00189, 0],
      [-0.00166, 0],
      [-0.00075, 2],
      [0.00357, 1],
      [-0.00067, 2],
      [-0.00182, 0],
      [-0.0007, 2],
      [-0.00167, 0],
      [-0.00177, 0],
      [-0.001, 2],
      [-0.00075, 2],
      [-0.00088, 2],
      [-0.00169, 0],
      [-0.00064, 2],
      [-0.0004, 2],
      [-0.00082, 2],
      [-0.00169, 0],
      [-0.0007, 2],
      [-0.00177, 0],
      [-0.00067, 2],
      [0.00379, 1],
      [-0.00166, 0]
    ],
    "red_o_points": [],
    "y_categories": ["N", "NOT APPLICABLE", "nan"],
    "blue_o_points": [],
    "blue_x_points": [
      [0.00675, 1],
      [-8e-5, 2],
      [0.00459, 1],
      [-0.00048, 0],
      [-6e-5, 2],
      [0.00537, 1],
      [0.00406, 1]
    ]
  },
  "QS_mulTransfSite[AcSsAA]": {
    "red_x_points": [
      [-0.003, 3],
      [-0.00827, 2],
      [-0.0034, 0],
      [-0.00815, 2],
      [-0.009, 2],
      [-0.00334, 0],
      [-0.00332, 0],
      [-0.00281, 3],
      [-0.00323, 0],
      [-0.00779, 2],
      [-0.00323, 0],
      [-0.00297, 3],
      [0.01358, 1],
      [-0.00293, 3],
      [-0.00878, 2],
      [-0.00332, 3],
      [-0.00311, 0],
      [-0.00319, 0],
      [-0.00301, 3],
      [-0.00258, 3],
      [-0.00264, 3],
      [-0.00814, 2],
      [-0.00295, 3],
      [-0.00272, 3],
      [-0.00266, 3],
      [-0.00296, 0],
      [-0.00278, 3],
      [-0.00771, 2],
      [-0.00249, 3],
      [0.01491, 1],
      [-0.00304, 0]
    ],
    "red_o_points": [],
    "y_categories": ["N", "NOT APPLICABLE", "Y", "nan"],
    "blue_o_points": [],
    "blue_x_points": [
      [0.02008, 1],
      [-0.00124, 3],
      [0.01488, 1],
      [-0.00069, 0],
      [-0.00098, 3],
      [0.01375, 1],
      [0.01456, 1]
    ]
  },
  "QS_mulGraftNerve[DS]": {
    "red_x_points": [
      [-5e-5, 2],
      [-0.00023, 0],
      [-9e-5, 0],
      [-0.00019, 0],
      [-0.00016, 0],
      [-0.00022, 0],
      [-0.00017, 0],
      [-5e-5, 2],
      [-0.00017, 0],
      [-0.0002, 0],
      [-0.00013, 0],
      [-5e-5, 2],
      [0.0003, 1],
      [-6e-5, 2],
      [-0.00013, 0],
      [-0.00013, 2],
      [-0.00012, 0],
      [-9e-5, 0],
      [-2e-5, 2],
      [-5e-5, 2],
      [2e-5, 2],
      [-0.00015, 0],
      [-3e-5, 2],
      [-4e-5, 2],
      [-3e-5, 2],
      [-0.00014, 0],
      [-5e-5, 2],
      [-0.00015, 0],
      [-6e-5, 2],
      [0.00041, 1],
      [-0.00015, 0]
    ],
    "red_o_points": [],
    "y_categories": ["N", "NOT APPLICABLE", "nan"],
    "blue_o_points": [],
    "blue_x_points": [
      [0.00059, 1],
      [2e-5, 2],
      [0.00032, 1],
      [-1e-5, 0],
      [2e-5, 2],
      [0.00038, 1],
      [0.00049, 1]
    ]
  },
  "QS_mulGraftNerve[MP]": {
    "red_x_points": [
      [-2e-5, 2],
      [-0.00014, 0],
      [-9e-5, 0],
      [-0.00014, 0],
      [-0.00014, 0],
      [-9e-5, 0],
      [-0.00014, 0],
      [0.0, 2],
      [-0.00014, 0],
      [-9e-5, 0],
      [-9e-5, 0],
      [-1e-5, 2],
      [0.00032, 1],
      [-1e-5, 2],
      [-0.00014, 0],
      [1e-5, 2],
      [-5e-5, 0],
      [-9e-5, 0],
      [0.0, 2],
      [-1e-5, 2],
      [-2e-5, 2],
      [-0.00014, 0],
      [-1e-5, 2],
      [1e-5, 2],
      [1e-5, 2],
      [-0.00014, 0],
      [-2e-5, 2],
      [-9e-5, 0],
      [0.0, 2],
      [0.0001, 1],
      [-5e-5, 0]
    ],
    "red_o_points": [],
    "y_categories": ["N", "NOT APPLICABLE", "nan"],
    "blue_o_points": [],
    "blue_x_points": [
      [0.00022, 1],
      [0.0, 2],
      [0.0002, 1],
      [1e-5, 2],
      [0.00012, 1],
      [0.00032, 1]
    ]
  },
  "QS_mulGraftNerve[LP]": {
    "red_x_points": [
      [-2e-5, 2],
      [-4e-5, 0],
      [-0.0001, 0],
      [-5e-5, 0],
      [-4e-5, 0],
      [-8e-5, 0],
      [-3e-5, 0],
      [-0.0, 2],
      [-3e-5, 0],
      [-6e-5, 0],
      [-1e-5, 0],
      [-2e-5, 2],
      [-9e-5, 1],
      [-3e-5, 2],
      [-1e-5, 0],
      [0.0, 2],
      [-3e-5, 0],
      [-6e-5, 0],
      [-3e-5, 2],
      [-2e-5, 2],
      [-0.00012, 2],
      [-3e-5, 0],
      [-2e-5, 2],
      [1e-5, 2],
      [-3e-5, 2],
      [-5e-5, 0],
      [-0.0, 2],
      [-6e-5, 0],
      [-0.0, 2],
      [9e-5, 1],
      [-6e-5, 0]
    ],
    "red_o_points": [],
    "y_categories": ["N", "NOT APPLICABLE", "nan"],
    "blue_o_points": [],
    "blue_x_points": [
      [0.00027, 1],
      [1e-5, 2],
      [3e-5, 0],
      [0.0, 2],
      [7e-5, 1],
      [0.00032, 1]
    ]
  },
  "QA_lstPexMuscstrength[WristFlex]": {
    "red_x_points": [
      [-0.0034, 1],
      [-9e-5, 2],
      [-0.00098, 1],
      [-0.00102, 1],
      [0.00033, 0],
      [0.00054, 0],
      [-0.0015, 1],
      [-0.00171, 0],
      [0.00036, 0],
      [0.00028, 0],
      [0.00043, 0],
      [-0.00162, 0],
      [-0.00059, 2],
      [0.00141, 2],
      [-9e-5, 2],
      [-0.0014, 0],
      [5e-5, 2],
      [0.00043, 0],
      [-0.00134, 0],
      [-0.00307, 1],
      [-0.0021, 0],
      [-0.00147, 1],
      [0.00177, 2],
      [-0.00874, 1],
      [-0.00158, 0],
      [0.00034, 0],
      [-0.00276, 1],
      [0.00036, 0],
      [0.00225, 2],
      [1e-5, 2],
      [-0.00108, 1]
    ],
    "red_o_points": [],
    "y_categories": ["GREATER THAN OR EQUALS TO 3", "LESS THAN 3", "nan"],
    "blue_o_points": [],
    "blue_x_points": [
      [0.00038, 0],
      [0.00397, 2],
      [0.00147, 0],
      [0.00216, 0],
      [0.00442, 2],
      [0.0015, 0],
      [0.00139, 0]
    ]
  },
  "QS_mulNeuromadSite[C5]": {
    "red_x_points": [
      [-0.00148, 2],
      [-0.00328, 0],
      [-0.0036, 0],
      [-0.00396, 0],
      [-0.00355, 0],
      [-0.00339, 0],
      [-0.0035, 0],
      [-0.00141, 2],
      [-0.00342, 0],
      [-0.00352, 0],
      [-0.00299, 0],
      [-0.00124, 2],
      [0.00467, 1],
      [-0.00117, 2],
      [-0.0039, 0],
      [-0.00189, 2],
      [-0.00314, 0],
      [-0.00343, 0],
      [-0.00118, 2],
      [-0.00125, 2],
      [-0.00124, 2],
      [-0.00325, 0],
      [-0.00116, 2],
      [-0.00176, 2],
      [-0.00144, 2],
      [-0.00311, 0],
      [-0.00137, 2],
      [-0.00348, 0],
      [-0.00118, 2],
      [0.00778, 1],
      [-0.00356, 0]
    ],
    "red_o_points": [],
    "y_categories": ["N", "NOT APPLICABLE", "nan"],
    "blue_o_points": [],
    "blue_x_points": [
      [0.01353, 1],
      [0.0004, 2],
      [0.00759, 1],
      [0.00014, 0],
      [7e-5, 2],
      [0.00852, 1],
      [0.00887, 1]
    ]
  },
  "QS_mulNeuromadSite[C7]": {
    "red_x_points": [
      [-0.00081, 2],
      [-0.00275, 0],
      [-0.00319, 0],
      [-0.00254, 0],
      [-0.00299, 0],
      [-0.0026, 0],
      [-0.00278, 0],
      [-0.00124, 2],
      [-0.00276, 0],
      [-0.00274, 0],
      [-0.00274, 0],
      [-0.00111, 2],
      [0.00506, 1],
      [-0.00092, 2],
      [-0.00324, 0],
      [-0.00126, 2],
      [-0.00283, 0],
      [-0.00298, 0],
      [-0.00101, 2],
      [-0.0008, 2],
      [-0.00079, 2],
      [-0.00249, 0],
      [-0.00082, 2],
      [-0.00141, 2],
      [-0.00114, 2],
      [-0.00257, 0],
      [-0.00095, 2],
      [-0.00285, 0],
      [-0.00082, 2],
      [0.00521, 1],
      [-0.00242, 0]
    ],
    "red_o_points": [],
    "y_categories": ["N", "NOT APPLICABLE", "nan"],
    "blue_o_points": [],
    "blue_x_points": [
      [0.00968, 1],
      [-0.00015, 2],
      [0.00679, 1],
      [-0.00044, 0],
      [0.00015, 2],
      [0.00692, 1],
      [0.00828, 1]
    ]
  },
  "QA_lstPexMuscstrength[ShoulderInrot]": {
    "red_x_points": [
      [-0.00102, 1],
      [0.0001, 2],
      [0.00041, 0],
      [-0.00081, 1],
      [0.00031, 0],
      [-0.00094, 1],
      [0.00023, 2],
      [-0.001, 1],
      [0.00014, 0],
      [0.00013, 2],
      [0.00022, 2],
      [-0.00096, 1],
      [0.00016, 2],
      [8e-5, 2],
      [8e-5, 2],
      [0.00019, 2],
      [9e-5, 2],
      [-0.00105, 1],
      [0.00049, 0],
      [-0.00065, 1],
      [0.00031, 0],
      [0.0001, 2],
      [0.0001, 2],
      [0.00014, 2],
      [9e-5, 2],
      [-0.00085, 1],
      [8e-5, 2],
      [-0.00065, 1],
      [0.00013, 2],
      [0.00019, 2],
      [0.00033, 0]
    ],
    "red_o_points": [],
    "y_categories": ["GREATER THAN OR EQUALS TO 3", "LESS THAN 3", "nan"],
    "blue_o_points": [],
    "blue_x_points": [
      [6e-5, 2],
      [0.00016, 2],
      [0.00056, 0],
      [0.00037, 2],
      [0.00011, 2],
      [0.00079, 0],
      [0.00049, 0]
    ]
  },
  "QA_lstPexMuscstrength[ElbowExte]": {
    "red_x_points": [
      [-0.00312, 1],
      [-9e-5, 2],
      [-2e-5, 1],
      [0.0001, 1],
      [-0.00127, 0],
      [7e-5, 1],
      [-1e-5, 1],
      [-0.00334, 1],
      [-0.00097, 0],
      [-0.00044, 0],
      [9e-5, 1],
      [-0.00268, 1],
      [5e-5, 2],
      [0.00309, 2],
      [-0.00018, 2],
      [-0.00289, 1],
      [-5e-5, 2],
      [0.00024, 1],
      [-0.00226, 0],
      [-0.00245, 1],
      [-0.0034, 0],
      [0.0, 1],
      [0.00379, 2],
      [-0.00318, 0],
      [-0.00346, 0],
      [0.0001, 1],
      [-0.00247, 1],
      [-0.00017, 2],
      [-0.00337, 1],
      [9e-5, 2],
      [-9e-5, 1]
    ],
    "red_o_points": [],
    "y_categories": ["GREATER THAN OR EQUALS TO 3", "LESS THAN 3", "nan"],
    "blue_o_points": [],
    "blue_x_points": [
      [0.00028, 2],
      [0.00775, 2],
      [0.00021, 0],
      [0.00132, 1],
      [0.00728, 2],
      [2e-5, 0],
      [0.0001, 0]
    ]
  },
  "QA_intPexForearmSupin": {
    "red_x_points": [
      [1e-5, 2],
      [7e-5, 0],
      [0.0, 2],
      [1e-5, 2],
      [-0.00021, 1],
      [-0.00014, 1],
      [0.0, 2],
      [-0.00014, 1],
      [2e-5, 2],
      [2e-5, 2],
      [2e-5, 2],
      [4e-5, 0],
      [0.00043, 2],
      [2e-5, 2],
      [1e-5, 2],
      [2e-5, 2],
      [1e-5, 2],
      [-0.00037, 1],
      [-0.00039, 1],
      [0.00016, 0],
      [-0.00014, 1],
      [-0.00014, 1],
      [2e-5, 2],
      [2e-5, 2],
      [4e-5, 2],
      [0.0, 2],
      [-0.00042, 1],
      [2e-5, 2],
      [2e-5, 2],
      [-0.01379, 1],
      [7e-5, 0]
    ],
    "red_o_points": [],
    "y_categories": ["GREATER THAN OR EQUALS TO 80", "LESS THAN 80", "nan"],
    "blue_o_points": [],
    "blue_x_points": [
      [0.00139, 2],
      [0.0, 2],
      [0.00577, 0],
      [0.00018, 2],
      [0.00011, 2],
      [0.00111, 2],
      [0.00115, 2]
    ]
  },
  "QS_mulGraftNerve[SS]": {
    "red_x_points": [
      [-0.0, 2],
      [-0.00043, 0],
      [-0.00027, 0],
      [-0.00046, 0],
      [-0.00028, 0],
      [-0.00032, 0],
      [-0.00041, 0],
      [0.0, 2],
      [-0.00039, 0],
      [-0.00021, 0],
      [-0.00032, 0],
      [-1e-5, 2],
      [0.00061, 1],
      [3e-5, 2],
      [-0.00028, 0],
      [3e-5, 2],
      [-0.00028, 0],
      [-0.00041, 0],
      [-4e-5, 2],
      [-3e-5, 2],
      [1e-5, 2],
      [-0.00034, 0],
      [5e-5, 2],
      [-0.0, 2],
      [-3e-5, 2],
      [-0.00043, 0],
      [-4e-5, 2],
      [-0.00043, 0],
      [-1e-5, 2],
      [0.00046, 1],
      [-0.0003, 0]
    ],
    "red_o_points": [],
    "y_categories": ["N", "NOT APPLICABLE", "nan"],
    "blue_o_points": [],
    "blue_x_points": [
      [0.00133, 1],
      [4e-5, 2],
      [0.00071, 1],
      [8e-5, 0],
      [6e-5, 2],
      [0.0004, 1],
      [0.00057, 1]
    ]
  },
  "QS_mulGraftNerve[MCF]": {
    "red_x_points": [
      [-6e-5, 2],
      [-0.00012, 0],
      [-0.0003, 0],
      [-0.00026, 0],
      [-0.0003, 0],
      [-0.0002, 0],
      [-0.00025, 0],
      [-1e-5, 2],
      [-0.00023, 0],
      [-0.00025, 0],
      [-0.00016, 0],
      [-3e-5, 2],
      [0.00051, 1],
      [-6e-5, 2],
      [-0.00029, 0],
      [-1e-5, 2],
      [-0.00023, 0],
      [-0.00016, 0],
      [-4e-5, 2],
      [-7e-5, 2],
      [-4e-5, 2],
      [-0.00023, 0],
      [-5e-5, 2],
      [-3e-5, 2],
      [-5e-5, 2],
      [-0.00021, 0],
      [-6e-5, 2],
      [-0.00021, 0],
      [-4e-5, 2],
      [0.0004, 1],
      [-0.00026, 0]
    ],
    "red_o_points": [],
    "y_categories": ["N", "NOT APPLICABLE", "nan"],
    "blue_o_points": [],
    "blue_x_points": [
      [0.00081, 1],
      [-1e-5, 2],
      [0.00046, 1],
      [-4e-5, 2],
      [0.00051, 1],
      [0.00051, 1]
    ]
  },
  "QS_mulNeuromadSite[C6]": {
    "red_x_points": [
      [-0.00081, 2],
      [-0.00223, 0],
      [-0.00192, 0],
      [-0.00229, 0],
      [-0.00214, 0],
      [-0.00199, 0],
      [-0.00235, 0],
      [-0.00083, 2],
      [-0.0023, 0],
      [-0.00218, 0],
      [-0.00225, 0],
      [-0.00077, 2],
      [0.00425, 1],
      [-0.00072, 2],
      [-0.00215, 0],
      [-0.0011, 2],
      [-0.00219, 0],
      [-0.00237, 0],
      [-0.00087, 2],
      [-0.00071, 2],
      [-0.00071, 2],
      [-0.00181, 0],
      [-0.00076, 2],
      [-0.00082, 2],
      [-0.00086, 2],
      [-0.00224, 0],
      [-0.00083, 2],
      [-0.00232, 0],
      [-0.00051, 2],
      [0.00423, 1],
      [-0.00192, 0]
    ],
    "red_o_points": [],
    "y_categories": ["N", "NOT APPLICABLE", "nan"],
    "blue_o_points": [],
    "blue_x_points": [
      [0.00811, 1],
      [-0.00011, 2],
      [0.00571, 1],
      [-0.00029, 0],
      [0.0, 2],
      [0.00486, 1],
      [0.00478, 1]
    ]
  },
  "QS_mulLysisSite[Nerve]": {
    "red_x_points": [
      [-0.00053, 3],
      [-0.00048, 0],
      [-0.00162, 2],
      [-0.00045, 0],
      [-0.0005, 0],
      [-0.00057, 0],
      [-0.00052, 0],
      [-0.00055, 3],
      [-0.00056, 0],
      [-0.00062, 0],
      [-0.00055, 0],
      [-0.00049, 3],
      [0.00191, 1],
      [-0.00044, 3],
      [-0.00048, 0],
      [-0.00039, 3],
      [-0.0005, 0],
      [-0.00066, 0],
      [-0.00049, 3],
      [-0.00044, 3],
      [-0.00046, 3],
      [-0.00049, 0],
      [-0.00045, 3],
      [-0.00039, 3],
      [-0.00052, 3],
      [-0.00062, 0],
      [-0.00048, 3],
      [-0.00063, 0],
      [-0.00044, 3],
      [0.00182, 1],
      [-0.00046, 0]
    ],
    "red_o_points": [],
    "y_categories": ["N", "NOT APPLICABLE", "Y", "nan"],
    "blue_o_points": [],
    "blue_x_points": [
      [0.00216, 1],
      [-0.00014, 3],
      [0.00205, 1],
      [-0.00063, 0],
      [-0.00023, 3],
      [0.00208, 1],
      [0.00197, 1]
    ]
  },
  "QS_mulGraftNerve[TD]": {
    "red_x_points": [
      [-0.00014, 2],
      [-0.00032, 0],
      [-0.0003, 0],
      [-0.00036, 0],
      [-0.00023, 0],
      [-0.00048, 0],
      [-0.00031, 0],
      [-8e-5, 2],
      [-0.0004, 0],
      [-0.00041, 0],
      [-0.00033, 0],
      [-0.00012, 2],
      [0.0003, 1],
      [-0.00016, 2],
      [-0.00035, 0],
      [-0.00016, 2],
      [-0.00037, 0],
      [-0.00035, 0],
      [-0.00018, 2],
      [-0.00018, 2],
      [-0.00014, 2],
      [-0.00036, 0],
      [-0.00015, 2],
      [-0.00016, 2],
      [-0.00015, 2],
      [-0.0003, 0],
      [-0.00011, 2],
      [-0.00034, 0],
      [-0.00013, 2],
      [0.00051, 1],
      [-0.00038, 0]
    ],
    "red_o_points": [],
    "y_categories": ["N", "NOT APPLICABLE", "nan"],
    "blue_o_points": [],
    "blue_x_points": [
      [0.00145, 1],
      [-9e-5, 2],
      [0.00058, 1],
      [1e-5, 0],
      [-1e-5, 2],
      [0.00104, 1],
      [0.00088, 1]
    ]
  },
  "QS_mulLysisRoot[C7]": {
    "red_x_points": [
      [-0.00054, 3],
      [-0.00127, 0],
      [-0.00224, 2],
      [-0.00102, 0],
      [-0.00105, 0],
      [-0.0011, 0],
      [-0.00114, 0],
      [-0.00049, 3],
      [-0.00119, 0],
      [-0.00102, 0],
      [-0.001, 0],
      [-0.0005, 3],
      [0.00264, 1],
      [-0.00049, 3],
      [-0.00115, 0],
      [-0.00049, 3],
      [-0.00113, 0],
      [-0.00106, 0],
      [-0.00049, 3],
      [-0.00062, 3],
      [-0.00054, 3],
      [-0.00114, 0],
      [-0.0006, 3],
      [-0.00057, 3],
      [-0.00058, 3],
      [-0.00111, 0],
      [-0.00049, 3],
      [-0.00103, 0],
      [-0.00042, 3],
      [0.00313, 1],
      [-0.00101, 0]
    ],
    "red_o_points": [],
    "y_categories": ["N", "NOT APPLICABLE", "Y", "nan"],
    "blue_o_points": [],
    "blue_x_points": [
      [0.00382, 1],
      [-0.00023, 3],
      [0.00309, 1],
      [-0.00088, 0],
      [-0.00021, 3],
      [0.00339, 1],
      [0.0033, 1]
    ]
  },
  "QS_mulTransfSite[IMc]": {
    "red_x_points": [
      [-0.00219, 3],
      [-0.00705, 2],
      [-0.00518, 0],
      [-0.00446, 0],
      [-0.0047, 0],
      [-0.00486, 0],
      [-0.00429, 0],
      [-0.00236, 3],
      [-0.00427, 0],
      [-0.00435, 0],
      [-0.00441, 0],
      [-0.0024, 3],
      [0.01046, 1],
      [-0.00217, 3],
      [-0.0046, 0],
      [-0.00217, 3],
      [-0.00785, 2],
      [-0.0048, 0],
      [-0.00212, 3],
      [-0.00222, 3],
      [-0.00195, 3],
      [-0.00426, 0],
      [-0.00227, 3],
      [-0.00213, 3],
      [-0.00192, 3],
      [-0.00457, 0],
      [-0.00218, 3],
      [-0.00684, 2],
      [-0.00201, 3],
      [0.01077, 1],
      [-0.00679, 2]
    ],
    "red_o_points": [],
    "y_categories": ["N", "NOT APPLICABLE", "Y", "nan"],
    "blue_o_points": [],
    "blue_x_points": [
      [0.01764, 1],
      [-0.00035, 3],
      [0.01478, 1],
      [-0.00175, 0],
      [-0.00027, 3],
      [0.01289, 1],
      [0.01411, 1]
    ]
  },
  "QA_lstPexTouch[T1]": {
    "red_x_points": [
      [-0.00204, 1],
      [-0.00012, 2],
      [0.00032, 1],
      [-0.00011, 2],
      [-0.00089, 0],
      [0.00046, 1],
      [0.00067, 1],
      [-0.00229, 1],
      [-0.00154, 0],
      [-0.0009, 0],
      [-0.0013, 0],
      [-0.00285, 0],
      [-0.01024, 2],
      [0.00353, 2],
      [-0.00012, 2],
      [-0.00211, 1],
      [-0.0001, 2],
      [0.00038, 1],
      [-0.00291, 0],
      [-0.00234, 1],
      [-0.00318, 0],
      [-0.00022, 2],
      [0.00331, 2],
      [-0.00231, 1],
      [-0.00326, 0],
      [0.00044, 1],
      [-0.00375, 0],
      [-0.00017, 2],
      [-0.00306, 0],
      [0.00047, 1],
      [0.00026, 1]
    ],
    "red_o_points": [],
    "y_categories": ["NORM", "NPV", "nan"],
    "blue_o_points": [],
    "blue_x_points": [
      [0.0009, 1],
      [0.00657, 2],
      [0.00058, 1],
      [0.00183, 1],
      [0.00574, 2],
      [0.00071, 1],
      [0.005, 0]
    ]
  },
  "QA_mulInjOrthesisType[ShoulderSupport]": {
    "red_x_points": [
      [-0.01053, 0],
      [-0.01, 0],
      [-0.0103, 0],
      [-0.01054, 0],
      [-0.01068, 0],
      [-0.01012, 0],
      [-0.01049, 0],
      [-0.01297, 2],
      [-0.01033, 0],
      [-0.01041, 0],
      [-0.0102, 0],
      [-0.00999, 0],
      [0.02811, 1],
      [-0.01108, 0],
      [-0.01006, 0],
      [-0.01023, 0],
      [-0.01195, 2],
      [-0.01025, 0],
      [-0.01026, 0],
      [-0.01076, 0],
      [-0.01239, 2],
      [-0.01211, 3],
      [-0.0104, 0],
      [0.02838, 1],
      [-0.01097, 0],
      [-0.01011, 0],
      [-0.01105, 0],
      [-0.01039, 0],
      [-0.01314, 3],
      [-0.0161, 3],
      [-0.00966, 0]
    ],
    "red_o_points": [],
    "y_categories": ["N", "NOT APPLICABLE", "Y", "nan"],
    "blue_o_points": [],
    "blue_x_points": [
      [-0.00496, 0],
      [0.03043, 1],
      [0.02608, 1],
      [0.03128, 1],
      [0.0287, 1],
      [0.02745, 1],
      [0.02769, 1]
    ]
  },
  "QS_mulTransfSite[AcMc]": {
    "red_x_points": [
      [-0.00044, 3],
      [-0.00085, 0],
      [-0.00073, 0],
      [-0.00087, 0],
      [-0.00067, 0],
      [-0.00076, 0],
      [-0.00083, 0],
      [-0.00034, 3],
      [-0.00078, 0],
      [-0.00063, 0],
      [-0.00167, 2],
      [-0.00056, 3],
      [0.00214, 1],
      [-0.00043, 3],
      [-0.00067, 0],
      [-0.00061, 3],
      [-0.00064, 0],
      [-0.00069, 0],
      [-0.00049, 3],
      [-0.00036, 3],
      [-0.00051, 3],
      [-0.00074, 0],
      [-0.00049, 3],
      [-0.00044, 3],
      [-0.0005, 3],
      [-0.0006, 0],
      [-0.00061, 3],
      [-0.00075, 0],
      [-0.00057, 3],
      [0.00185, 1],
      [-0.00084, 0]
    ],
    "red_o_points": [],
    "y_categories": ["N", "NOT APPLICABLE", "Y", "nan"],
    "blue_o_points": [],
    "blue_x_points": [
      [0.00348, 1],
      [-0.00011, 3],
      [0.00268, 1],
      [-0.00066, 0],
      [-0.00016, 3],
      [0.00204, 1],
      [0.00228, 1]
    ]
  },
  "QS_mulTransfSite[Other]": {
    "red_x_points": [
      [-0.00043, 3],
      [-0.0012, 0],
      [-0.00111, 0],
      [-0.00128, 0],
      [-0.00107, 0],
      [-0.00119, 0],
      [-0.00127, 0],
      [-0.00057, 3],
      [-0.00118, 0],
      [-0.00106, 0],
      [-0.00129, 0],
      [-0.00078, 3],
      [0.00326, 1],
      [-0.00055, 3],
      [-0.00113, 0],
      [-0.00088, 3],
      [-0.00133, 0],
      [-0.004, 2],
      [-0.00067, 3],
      [-0.00048, 3],
      [-0.00055, 3],
      [-0.00112, 0],
      [-0.00049, 3],
      [-0.00055, 3],
      [-0.00074, 3],
      [-0.0012, 0],
      [-0.00041, 3],
      [-0.00102, 0],
      [-0.00052, 3],
      [0.00335, 1],
      [-0.00098, 0]
    ],
    "red_o_points": [],
    "y_categories": ["N", "NOT APPLICABLE", "Y", "nan"],
    "blue_o_points": [],
    "blue_x_points": [
      [0.00419, 1],
      [-0.00032, 3],
      [0.00403, 1],
      [-0.00036, 0],
      [-0.00027, 3],
      [0.00358, 1],
      [0.00415, 1]
    ]
  },
  "QA_yonInjBpsurg": {
    "red_x_points": [
      [-0.00349, 1],
      [-0.0033, 1],
      [-0.00349, 1],
      [-0.00335, 1],
      [-0.00355, 1],
      [-0.00368, 1],
      [-0.00338, 1],
      [-0.00309, 1],
      [-0.00334, 1],
      [-0.00348, 1],
      [-0.00363, 1],
      [-0.00376, 1],
      [0.00848, 0],
      [-0.00359, 1],
      [-0.00354, 1],
      [-0.00365, 1],
      [-0.00275, 1],
      [-0.00382, 1],
      [-0.00368, 1],
      [-0.00354, 1],
      [-0.00322, 1],
      [-0.00296, 1],
      [-0.00373, 1],
      [-0.00332, 1],
      [-0.00388, 1],
      [-0.00352, 1],
      [-0.00314, 1],
      [-0.00307, 1],
      [-0.00297, 1],
      [0.00967, 0],
      [-0.00361, 1]
    ],
    "red_o_points": [],
    "y_categories": ["N", "Y", "nan"],
    "blue_o_points": [],
    "blue_x_points": [
      [0.01883, 0],
      [-0.00067, 1],
      [0.01194, 0],
      [-0.00255, 1],
      [-0.00096, 1],
      [0.01214, 0],
      [0.01283, 0]
    ]
  },
  "QA_equInjTbpiAge": {
    "red_x_points": [
      [-0.0006, 1],
      [-0.00011, 1],
      [2e-5, 1],
      [-0.00016, 0],
      [-0.00084, 0],
      [2e-5, 1],
      [5e-5, 1],
      [0.00083, 0],
      [-0.00029, 0],
      [-7e-5, 0],
      [9e-5, 1],
      [0.00057, 0],
      [-0.01255, 1],
      [-0.00088, 1],
      [-0.00017, 1],
      [-0.00078, 1],
      [9e-5, 0],
      [-0.00087, 0],
      [-0.00094, 1],
      [0.0002, 0],
      [-0.00063, 1],
      [-7e-5, 1],
      [-0.00092, 1],
      [-0.00163, 1],
      [0.00079, 0],
      [3e-5, 1],
      [-0.00148, 1],
      [2e-5, 1],
      [-0.00066, 1],
      [-0.01253, 1],
      [-7e-5, 0]
    ],
    "red_o_points": [],
    "y_categories": ["GREATER THAN OR EQUALS TO 30", "LESS THAN 30", "nan"],
    "blue_o_points": [],
    "blue_x_points": [
      [-0.00432, 1],
      [-0.00078, 1],
      [0.00603, 0],
      [0.00075, 1],
      [0.00494, 0],
      [0.00708, 0],
      [0.0069, 0]
    ]
  },
  "QS_mulLysisNerve[Ssr]": {
    "red_x_points": [
      [-0.00035, 3],
      [-0.00071, 0],
      [-0.00149, 2],
      [-0.0006, 0],
      [-0.00051, 0],
      [-0.00048, 0],
      [-0.00058, 0],
      [-0.00043, 3],
      [-0.00041, 0],
      [-0.00044, 0],
      [-0.00053, 0],
      [-0.00046, 3],
      [0.00189, 1],
      [-0.00032, 3],
      [-0.00041, 0],
      [-0.00049, 3],
      [-0.00048, 0],
      [-0.00058, 0],
      [-0.00036, 3],
      [-0.00046, 3],
      [-0.00047, 3],
      [-0.00042, 0],
      [-0.00044, 3],
      [-0.00035, 3],
      [-0.0003, 3],
      [-0.00059, 0],
      [-0.00048, 3],
      [-0.00049, 0],
      [-0.00027, 3],
      [0.0019, 1],
      [-0.00034, 0]
    ],
    "red_o_points": [],
    "y_categories": ["N", "NOT APPLICABLE", "Y", "nan"],
    "blue_o_points": [],
    "blue_x_points": [
      [0.00227, 1],
      [-0.00013, 3],
      [0.00157, 1],
      [-0.00052, 0],
      [-0.00025, 3],
      [0.00196, 1],
      [0.00189, 1]
    ]
  },
  "QS_mulBpsurgeryType[Graft]": {
    "red_x_points": [
      [-0.00015, 3],
      [-0.00037, 0],
      [-0.0003, 0],
      [-0.00036, 0],
      [-0.0004, 0],
      [-0.00039, 0],
      [-0.00044, 0],
      [-0.00014, 3],
      [-0.00031, 0],
      [-0.00044, 0],
      [-0.00028, 0],
      [-0.00012, 3],
      [0.00117, 1],
      [-0.0001, 3],
      [-0.00143, 2],
      [-0.0002, 3],
      [-0.00024, 0],
      [-0.00044, 0],
      [-0.00017, 3],
      [-0.00016, 3],
      [-0.00017, 3],
      [-0.0003, 0],
      [-0.00021, 3],
      [-0.00013, 3],
      [-0.00025, 3],
      [-0.00038, 0],
      [-0.0001, 3],
      [-0.0004, 0],
      [-0.00011, 3],
      [0.00102, 1],
      [-0.00044, 0]
    ],
    "red_o_points": [],
    "y_categories": ["N", "NOT APPLICABLE", "Y", "nan"],
    "blue_o_points": [],
    "blue_x_points": [
      [0.00146, 1],
      [-0.0001, 3],
      [0.00106, 1],
      [-0.0002, 0],
      [-6e-5, 3],
      [0.00103, 1],
      [0.00114, 1]
    ]
  },
  "QA_lstPexMuscstrength[WristExte]": {
    "red_x_points": [
      [-0.0025, 1],
      [-0.0002, 2],
      [-0.00133, 1],
      [-0.00138, 1],
      [0.00046, 0],
      [-0.00137, 1],
      [-0.00184, 1],
      [-0.00206, 0],
      [0.00128, 0],
      [0.0006, 0],
      [-0.00173, 1],
      [-0.00173, 0],
      [-0.00244, 2],
      [0.00139, 2],
      [-7e-5, 2],
      [-0.00105, 0],
      [-0.00022, 2],
      [0.00048, 0],
      [-0.00109, 0],
      [-0.00261, 1],
      [-0.00113, 0],
      [-0.00151, 1],
      [0.00127, 2],
      [-0.00081, 0],
      [-0.00363, 1],
      [0.00045, 0],
      [-0.00242, 1],
      [0.00041, 0],
      [0.0019, 2],
      [-0.00213, 2],
      [-0.00144, 1]
    ],
    "red_o_points": [],
    "y_categories": ["GREATER THAN OR EQUALS TO 3", "LESS THAN 3", "nan"],
    "blue_o_points": [],
    "blue_x_points": [
      [0.00168, 0],
      [0.00362, 2],
      [0.00083, 0],
      [0.00277, 0],
      [0.00528, 2],
      [0.001, 1],
      [0.00092, 0]
    ]
  },
  "QS_mulLysisRoot[C6]": {
    "red_x_points": [
      [-0.00114, 3],
      [-0.00236, 0],
      [-0.00405, 2],
      [-0.00222, 0],
      [-0.00236, 0],
      [-0.00219, 0],
      [-0.0022, 0],
      [-0.00106, 3],
      [-0.00214, 0],
      [-0.00234, 0],
      [-0.00224, 0],
      [-0.00134, 3],
      [0.00682, 1],
      [-0.00107, 3],
      [-0.00212, 0],
      [-0.00119, 3],
      [-0.00224, 0],
      [-0.00254, 0],
      [-0.00089, 3],
      [-0.00109, 3],
      [-0.00111, 3],
      [-0.00203, 0],
      [-0.00099, 3],
      [-0.00107, 3],
      [-0.00106, 3],
      [-0.00249, 0],
      [-0.00109, 3],
      [-0.0024, 0],
      [-0.00124, 3],
      [0.00739, 1],
      [-0.00364, 2]
    ],
    "red_o_points": [],
    "y_categories": ["N", "NOT APPLICABLE", "Y", "nan"],
    "blue_o_points": [],
    "blue_x_points": [
      [0.00722, 1],
      [-0.0004, 3],
      [0.00747, 1],
      [-0.00185, 0],
      [-0.00052, 3],
      [0.00633, 1],
      [0.00771, 1]
    ]
  },
  "QA_lstPexPalle[Clavicle]": {
    "red_x_points": [
      [7e-5, 3],
      [2e-5, 3],
      [3e-5, 3],
      [3e-5, 3],
      [-0.00038, 2],
      [-0.00019, 2],
      [1e-5, 3],
      [4e-5, 3],
      [2e-5, 3],
      [-0.00014, 2],
      [-0.00019, 2],
      [-5e-5, 0],
      [0.00082, 3],
      [7e-5, 3],
      [5e-5, 3],
      [7e-5, 3],
      [5e-5, 3],
      [0.0, 0],
      [0.00014, 0],
      [-2e-5, 0],
      [-0.00024, 2],
      [-0.00019, 1],
      [4e-5, 3],
      [-0.00365, 2],
      [5e-5, 3],
      [5e-5, 3],
      [-0.00044, 2],
      [3e-5, 3],
      [6e-5, 3],
      [-0.01614, 2]
    ],
    "red_o_points": [],
    "y_categories": ["HYPO", "NAIA", "PT", "nan"],
    "blue_o_points": [],
    "blue_x_points": [
      [0.00167, 3],
      [0.00039, 3],
      [0.00743, 0],
      [0.00048, 3],
      [0.00048, 3],
      [0.00157, 3],
      [0.00179, 3]
    ]
  },
  "QS_mulGraftNerve[FI]": {
    "red_x_points": [
      [-0.0006, 2],
      [-0.00137, 0],
      [-0.00156, 0],
      [-0.00135, 0],
      [-0.00129, 0],
      [-0.00145, 0],
      [-0.00134, 0],
      [-0.00058, 2],
      [-0.0015, 0],
      [-0.00141, 0],
      [-0.00131, 0],
      [-0.00053, 2],
      [0.00251, 1],
      [-0.00043, 2],
      [-0.00125, 0],
      [-0.00054, 2],
      [-0.00123, 0],
      [-0.0013, 0],
      [-0.00051, 2],
      [-0.00038, 2],
      [-0.00067, 2],
      [-0.0015, 0],
      [-0.00047, 2],
      [-0.00029, 2],
      [-0.00049, 2],
      [-0.00115, 0],
      [-0.00052, 2],
      [-0.00106, 0],
      [-0.00048, 2],
      [0.00284, 1],
      [-0.00131, 0]
    ],
    "red_o_points": [],
    "y_categories": ["N", "NOT APPLICABLE", "nan"],
    "blue_o_points": [],
    "blue_x_points": [
      [0.00465, 1],
      [-8e-5, 2],
      [0.00317, 1],
      [-0.00014, 0],
      [-0.00016, 2],
      [0.00346, 1],
      [0.00321, 1]
    ]
  },
  "QS_mulGraftNerve[LT]": {
    "red_x_points": [
      [-8e-5, 2],
      [-0.00017, 0],
      [-3e-5, 0],
      [-0.00012, 0],
      [-0.00014, 0],
      [-0.00011, 0],
      [-3e-5, 0],
      [-8e-5, 2],
      [-0.00014, 0],
      [-6e-5, 0],
      [-0.00011, 0],
      [-8e-5, 2],
      [0.00014, 1],
      [1e-5, 2],
      [-0.00022, 0],
      [-0.00013, 2],
      [-3e-5, 0],
      [-6e-5, 0],
      [-8e-5, 2],
      [-8e-5, 2],
      [-5e-5, 2],
      [-0.0001, 0],
      [-7e-5, 2],
      [-0.00012, 2],
      [-7e-5, 2],
      [-9e-5, 0],
      [-4e-5, 2],
      [-0.00018, 0],
      [-3e-5, 2],
      [0.00018, 1],
      [-0.00019, 0]
    ],
    "red_o_points": [],
    "y_categories": ["N", "NOT APPLICABLE", "nan"],
    "blue_o_points": [],
    "blue_x_points": [
      [0.0004, 1],
      [4e-5, 2],
      [0.00036, 1],
      [6e-5, 0],
      [9e-5, 2],
      [0.00039, 1],
      [0.00024, 1]
    ]
  },
  "QS_mulLysisRoot[C5]": {
    "red_x_points": [
      [-0.00121, 3],
      [-0.00229, 0],
      [-0.00366, 2],
      [-0.00195, 0],
      [-0.002, 0],
      [-0.00217, 0],
      [-0.00194, 0],
      [-0.00121, 3],
      [-0.00228, 0],
      [-0.00215, 0],
      [-0.0021, 0],
      [-0.00123, 3],
      [0.00627, 1],
      [-0.00095, 3],
      [-0.00218, 0],
      [-0.00128, 3],
      [-0.00227, 0],
      [-0.00252, 0],
      [-0.00143, 3],
      [-0.00119, 3],
      [-0.00113, 3],
      [-0.00208, 0],
      [-0.00108, 3],
      [-0.00134, 3],
      [-0.0012, 3],
      [-0.00201, 0],
      [-0.00121, 3],
      [-0.0022, 0],
      [-0.00116, 3],
      [0.00556, 1],
      [-0.0037, 2]
    ],
    "red_o_points": [],
    "y_categories": ["N", "NOT APPLICABLE", "Y", "nan"],
    "blue_o_points": [],
    "blue_x_points": [
      [0.00744, 1],
      [-0.00056, 3],
      [0.00675, 1],
      [-0.00151, 0],
      [-0.00049, 3],
      [0.0069, 1],
      [0.0075, 1]
    ]
  },
  "QS_mulNeuromadSite[C4]": {
    "red_x_points": [
      [-0.00074, 2],
      [-0.0024, 0],
      [-0.00248, 0],
      [-0.00223, 0],
      [-0.00256, 0],
      [-0.00215, 0],
      [-0.00251, 0],
      [-0.0007, 2],
      [-0.0025, 0],
      [-0.00257, 0],
      [-0.00204, 0],
      [-0.00084, 2],
      [0.00428, 1],
      [-0.00062, 2],
      [-0.00265, 0],
      [-0.00092, 2],
      [-0.00226, 0],
      [-0.00272, 0],
      [-0.0007, 2],
      [-0.00073, 2],
      [-0.00089, 2],
      [-0.00202, 0],
      [-0.00082, 2],
      [-0.00096, 2],
      [-0.00082, 2],
      [-0.00231, 0],
      [-0.00068, 2],
      [-0.00236, 0],
      [-0.00063, 2],
      [0.00511, 1],
      [-0.0022, 0]
    ],
    "red_o_points": [],
    "y_categories": ["N", "NOT APPLICABLE", "nan"],
    "blue_o_points": [],
    "blue_x_points": [
      [0.00685, 1],
      [0.0001, 2],
      [0.00535, 1],
      [-0.00024, 0],
      [-9e-5, 2],
      [0.0062, 1],
      [0.00582, 1]
    ]
  },
  "QS_lstBpsurgSide": {
    "red_x_points": [
      [-0.00304, 3],
      [-0.00505, 0],
      [-0.00544, 0],
      [-0.00481, 0],
      [-0.01138, 2],
      [-0.00507, 0],
      [-0.00503, 0],
      [-0.00363, 3],
      [-0.00469, 0],
      [-0.01081, 2],
      [-0.01033, 2],
      [-0.00355, 3],
      [0.01841, 1],
      [-0.00335, 3],
      [-0.01133, 2],
      [-0.0037, 3],
      [-0.01073, 2],
      [-0.01127, 2],
      [-0.00327, 3],
      [-0.00337, 3],
      [-0.00313, 3],
      [-0.0045, 0],
      [-0.00338, 3],
      [-0.00331, 3],
      [-0.00358, 3],
      [-0.01113, 2],
      [-0.00363, 3],
      [-0.01046, 2],
      [-0.00354, 3],
      [0.01945, 1],
      [-0.00502, 0]
    ],
    "red_o_points": [],
    "y_categories": ["L", "NOT APPLICABLE", "R", "nan"],
    "blue_o_points": [],
    "blue_x_points": [
      [0.02597, 1],
      [-0.00125, 3],
      [0.02002, 1],
      [2e-5, 0],
      [-0.00149, 3],
      [0.02206, 1],
      [0.02045, 1]
    ]
  },
  "QS_mulGraftNerve[IS]": {
    "red_x_points": [
      [-0.00032, 2],
      [-0.00058, 0],
      [-0.00093, 0],
      [-0.00063, 0],
      [-0.00081, 0],
      [-0.00066, 0],
      [-0.0007, 0],
      [-0.0004, 2],
      [-0.00067, 0],
      [-0.00066, 0],
      [-0.00064, 0],
      [-0.0003, 2],
      [0.00152, 1],
      [-0.00031, 2],
      [-0.00076, 0],
      [-0.00035, 2],
      [-0.00061, 0],
      [-0.00066, 0],
      [-0.0003, 2],
      [-0.00023, 2],
      [-0.00026, 2],
      [-0.00069, 0],
      [-0.00027, 2],
      [-0.00033, 2],
      [-0.00037, 2],
      [-0.00058, 0],
      [-0.00021, 2],
      [-0.00092, 0],
      [-0.00031, 2],
      [0.00161, 1],
      [-0.00082, 0]
    ],
    "red_o_points": [],
    "y_categories": ["N", "NOT APPLICABLE", "nan"],
    "blue_o_points": [],
    "blue_x_points": [
      [0.00245, 1],
      [-0.00014, 2],
      [0.00187, 1],
      [-0.00025, 0],
      [-0.00013, 2],
      [0.00176, 1],
      [0.00207, 1]
    ]
  },
  "QS_mulGraftNerve[MC]": {
    "red_x_points": [
      [-0.00014, 2],
      [-0.00049, 0],
      [-0.00044, 0],
      [-0.00017, 0],
      [-0.0005, 0],
      [-0.0004, 0],
      [-0.00035, 0],
      [-0.00017, 2],
      [-0.00048, 0],
      [-0.00028, 0],
      [-0.00042, 0],
      [-0.00026, 2],
      [0.00069, 1],
      [-5e-5, 2],
      [-0.00031, 0],
      [-0.00032, 2],
      [-0.00031, 0],
      [-0.00041, 0],
      [-0.0002, 2],
      [-0.00019, 2],
      [-7e-5, 2],
      [-0.00025, 0],
      [-9e-5, 2],
      [-9e-5, 2],
      [-0.00016, 2],
      [-0.0003, 0],
      [-0.00015, 2],
      [-0.00032, 0],
      [-7e-5, 2],
      [0.00036, 1],
      [-0.00036, 0]
    ],
    "red_o_points": [],
    "y_categories": ["N", "NOT APPLICABLE", "nan"],
    "blue_o_points": [],
    "blue_x_points": [
      [0.00208, 1],
      [-2e-5, 2],
      [0.00071, 1],
      [-4e-5, 0],
      [-8e-5, 2],
      [0.00051, 1],
      [0.00095, 1]
    ]
  },
  "QA_yonPreOrtsurg": {
    "red_x_points": [
      [-0.00375, 0],
      [-0.00028, 2],
      [4e-5, 0],
      [-0.00011, 0],
      [-4e-5, 0],
      [3e-5, 0],
      [-6e-5, 0],
      [8e-5, 2],
      [-9e-5, 0],
      [-2e-5, 0],
      [-0.00023, 2],
      [0.0041, 1],
      [-0.00125, 0],
      [2e-5, 2],
      [-0.00031, 0],
      [-0.0047, 0],
      [9e-5, 1],
      [3e-5, 0],
      [-0.00347, 0],
      [-0.00341, 0],
      [-0.00359, 0],
      [-7e-5, 0],
      [-0.00418, 0],
      [-0.00494, 0],
      [-0.00368, 0],
      [-0.00017, 2],
      [2e-5, 2],
      [-4e-5, 0],
      [-6e-5, 2],
      [-0.0003, 2],
      [4e-5, 1]
    ],
    "red_o_points": [],
    "y_categories": ["N", "Y", "nan"],
    "blue_o_points": [],
    "blue_x_points": [
      [2e-5, 0],
      [0.00235, 2],
      [-0.00016, 0],
      [0.00017, 0],
      [0.01648, 1],
      [0.0, 0],
      [2e-5, 0]
    ]
  },
  "QS_mulGraftNerve[Ra]": {
    "red_x_points": [
      [-0.00021, 2],
      [-0.00064, 0],
      [-0.00066, 0],
      [-0.00052, 0],
      [-0.00053, 0],
      [-0.00045, 0],
      [-0.00051, 0],
      [-0.0003, 2],
      [-0.00054, 0],
      [-0.00048, 0],
      [-0.00051, 0],
      [-0.00015, 2],
      [0.00111, 1],
      [-0.00013, 2],
      [-0.00063, 0],
      [-0.00039, 2],
      [-0.00044, 0],
      [-0.00045, 0],
      [-0.00028, 2],
      [-0.00014, 2],
      [-0.00019, 2],
      [-0.00042, 0],
      [-0.00021, 2],
      [-0.00018, 2],
      [-0.00035, 2],
      [-0.0003, 0],
      [-0.00016, 2],
      [-0.00041, 0],
      [-0.00015, 2],
      [0.00088, 1],
      [-0.00059, 0]
    ],
    "red_o_points": [],
    "y_categories": ["N", "NOT APPLICABLE", "nan"],
    "blue_o_points": [],
    "blue_x_points": [
      [0.00149, 1],
      [1e-5, 2],
      [0.00111, 1],
      [-5e-5, 0],
      [5e-5, 2],
      [0.00153, 1],
      [0.00167, 1]
    ]
  },
  "QS_mulTransfSite[Oberlin]": {
    "red_x_points": [
      [-0.00295, 3],
      [-0.00984, 0],
      [-0.00984, 0],
      [-0.00872, 0],
      [-0.00516, 2],
      [-0.00492, 2],
      [-0.00942, 0],
      [-0.00332, 3],
      [-0.00521, 2],
      [-0.00533, 2],
      [-0.00491, 2],
      [-0.00322, 3],
      [0.01622, 1],
      [-0.00307, 3],
      [-0.00544, 2],
      [-0.00323, 3],
      [-0.00961, 0],
      [-0.00479, 2],
      [-0.00306, 3],
      [-0.00306, 3],
      [-0.00318, 3],
      [-0.0094, 0],
      [-0.00313, 3],
      [-0.00324, 3],
      [-0.00352, 3],
      [-0.0046, 2],
      [-0.00274, 3],
      [-0.00939, 0],
      [-0.00323, 3],
      [0.01733, 1],
      [-0.00976, 0]
    ],
    "red_o_points": [],
    "y_categories": ["N", "NOT APPLICABLE", "Y", "nan"],
    "blue_o_points": [],
    "blue_x_points": [
      [0.02345, 1],
      [-0.00151, 3],
      [0.01939, 1],
      [-0.00084, 2],
      [-0.00108, 3],
      [0.01887, 1],
      [0.01933, 1]
    ]
  },
  "QS_mulGraftNerve[Ssr]": {
    "red_x_points": [
      [-1e-5, 2],
      [-6e-5, 0],
      [-5e-5, 0],
      [-6e-5, 0],
      [-2e-5, 0],
      [-6e-5, 0],
      [-3e-5, 2],
      [-2e-5, 0],
      [-0.00011, 0],
      [-6e-5, 0],
      [-9e-5, 2],
      [0.00012, 1],
      [-4e-5, 2],
      [-5e-5, 0],
      [-4e-5, 2],
      [-0.00011, 0],
      [-4e-5, 2],
      [-3e-5, 2],
      [-1e-5, 2],
      [-6e-5, 0],
      [-4e-5, 2],
      [-4e-5, 2],
      [-4e-5, 2],
      [-6e-5, 0],
      [-6e-5, 0],
      [-4e-5, 2],
      [0.00011, 1],
      [-6e-5, 0]
    ],
    "red_o_points": [],
    "y_categories": ["N", "NOT APPLICABLE", "nan"],
    "blue_o_points": [],
    "blue_x_points": [
      [0.00012, 1],
      [-1e-5, 2],
      [0.00038, 1],
      [-2e-5, 0],
      [-4e-5, 2],
      [0.00011, 1]
    ]
  },
  "QA_lstPexKine[Index]": {
    "red_x_points": [
      [-0.00082, 0],
      [-0.00043, 2],
      [-0.00035, 2],
      [-0.00034, 2],
      [5e-5, 1],
      [8e-5, 1],
      [-0.00151, 0],
      [0.00041, 2],
      [0.00024, 1],
      [0.00041, 1],
      [-0.00039, 1],
      [-3e-5, 2],
      [0.0004, 2],
      [0.00019, 1],
      [3e-5, 2],
      [-0.00018, 2],
      [0.00018, 1],
      [-0.00046, 1],
      [-0.00062, 0],
      [-0.00027, 1],
      [-0.00044, 2],
      [0.00042, 2],
      [-0.00034, 1],
      [7e-5, 2],
      [-0.00075, 2],
      [-0.00056, 1],
      [-0.00015, 2],
      [-0.00031, 1],
      [-0.00019, 2],
      [-0.00025, 0]
    ],
    "red_o_points": [],
    "y_categories": ["NPV", "PV", "nan"],
    "blue_o_points": [],
    "blue_x_points": [
      [0.00017, 1],
      [0.00041, 2],
      [0.00174, 1],
      [0.00038, 2],
      [0.00022, 1]
    ]
  },
  "QA_lstPexPalle[Ulna]": {
    "red_x_points": [
      [3e-5, 3],
      [3e-5, 3],
      [-9e-5, 2],
      [-9e-5, 0],
      [-9e-5, 2],
      [3e-5, 3],
      [-9e-5, 2],
      [3e-5, 3]
    ],
    "red_o_points": [],
    "y_categories": ["ABS", "HYPO", "PT", "nan"],
    "blue_o_points": [],
    "blue_x_points": [[3e-5, 3], [3e-5, 3]]
  }
}
