{
  "QA_lstPexPain[C8]": {
    "red_x_points": [
      [0.00743, 0],
      [-0.00608, 2],
      [-0.00545, 2],
      [0.008, 0],
      [-0.00534, 2],
      [-0.0079, 1],
      [-0.01109, 1],
      [-0.01078, 1],
      [-0.00793, 2],
      [-0.00768, 2],
      [-0.00871, 2],
      [-0.00591, 2],
      [-0.01104, 1],
      [0.00737, 0],
      [-0.00966, 1],
      [-0.00874, 1],
      [-0.00493, 2],
      [-0.00786, 2],
      [-0.00863, 2],
      [-0.00563, 2],
      [-0.01197, 1],
      [-0.0063, 1],
      [-0.01193, 1]
    ],
    "red_o_points": [],
    "y_categories": ["NORM", "NPV", "nan"],
    "blue_o_points": [],
    "blue_x_points": [
      [-0.00765, 1],
      [-0.00668, 1],
      [0.01132, 0],
      [-0.00117, 1],
      [0.01579, 0],
      [0.01402, 0],
      [0.01515, 0],
      [0.01368, 0],
      [-0.00525, 2],
      [-0.00103, 2],
      [-0.00476, 2],
      [-0.00106, 1],
      [-0.00483, 2],
      [0.01388, 0],
      [0.01378, 0],
      [0.01426, 0],
      [-0.00481, 2],
      [0.01288, 0],
      [0.0142, 0],
      [0.01998, 0],
      [0.01903, 0]
    ]
  },
  "QA_lstPexPain[C7]": {
    "red_x_points": [
      [-0.00824, 1],
      [-0.00748, 2],
      [-0.00724, 2],
      [-0.00701, 1],
      [-0.00727, 2],
      [-0.00593, 1],
      [-0.00664, 1],
      [-0.0079, 1],
      [-0.00831, 2],
      [-0.00866, 2],
      [-0.01064, 2],
      [-0.00755, 2],
      [-0.00726, 1],
      [0.01224, 0],
      [-0.00796, 1],
      [-0.00585, 1],
      [-0.00697, 2],
      [-0.00946, 2],
      [-0.01112, 2],
      [-0.00737, 2],
      [-0.00893, 1],
      [-0.0054, 1],
      [-0.0082, 1]
    ],
    "red_o_points": [],
    "y_categories": ["NORM", "NPV", "nan"],
    "blue_o_points": [],
    "blue_x_points": [
      [-0.006, 1],
      [-0.00543, 1],
      [0.01949, 0],
      [-0.00291, 1],
      [0.02364, 0],
      [-0.00433, 1],
      [0.0225, 0],
      [0.02162, 0],
      [-0.00727, 2],
      [-0.00411, 2],
      [-0.00641, 2],
      [-0.00372, 1],
      [-0.00673, 2],
      [0.01913, 0],
      [0.01954, 0],
      [0.02075, 0],
      [-0.0067, 2],
      [0.02033, 0],
      [0.02471, 0],
      [-0.00592, 1],
      [0.02694, 0]
    ]
  },
  "QS_mulTransfSite[TrAx]": {
    "red_x_points": [[-0.0001, 1]],
    "red_o_points": [],
    "y_categories": ["N", "NOT APPLICABLE", "nan"],
    "blue_o_points": [],
    "blue_x_points": [[0.0001, 0]]
  },
  "QA_lstPexKine[Index]": {
    "red_x_points": [
      [-0.00018, 1],
      [-0.00083, 2],
      [-0.00268, 2],
      [0.00107, 1],
      [-0.00137, 2],
      [-0.01019, 0],
      [-0.00062, 1],
      [-0.00032, 1],
      [-0.00067, 2],
      [0.00073, 1],
      [-0.00163, 2],
      [-0.00102, 2],
      [-0.00147, 2],
      [0.00049, 1],
      [-0.00015, 1],
      [-0.00176, 0],
      [-0.00075, 2],
      [-0.00158, 2],
      [-0.00416, 2],
      [-0.00099, 2],
      [-0.00021, 2],
      [-0.0062, 0],
      [-0.00125, 2]
    ],
    "red_o_points": [],
    "y_categories": ["NPV", "PV", "nan"],
    "blue_o_points": [],
    "blue_x_points": [
      [0.00546, 0],
      [-0.0006, 2],
      [0.00118, 1],
      [0.00475, 1],
      [-0.00039, 2],
      [0.00583, 1],
      [0.00239, 1],
      [0.00293, 1],
      [-0.00023, 2],
      [-5e-5, 2],
      [-0.00069, 2],
      [0.00691, 1],
      [-6e-5, 2],
      [0.00128, 1],
      [0.00091, 1],
      [0.00253, 0],
      [-0.00026, 2],
      [0.00098, 1],
      [-0.00012, 2],
      [0.00217, 1],
      [0.00084, 1]
    ]
  },
  "QA_yonInjDisloc": {
    "red_x_points": [
      [-2e-5, 2],
      [-2e-5, 2],
      [-7e-5, 2],
      [4e-5, 2],
      [-3e-5, 2],
      [-3e-5, 2],
      [-0.00011, 2],
      [-9e-5, 2],
      [-2e-5, 2],
      [-3e-5, 2],
      [-1e-5, 2],
      [-2e-5, 2],
      [-2e-5, 2],
      [-8e-5, 2],
      [-0.01144, 1],
      [-0.00017, 2],
      [-2e-5, 2],
      [1e-5, 2],
      [3e-5, 2],
      [-1e-5, 2],
      [-2e-5, 2],
      [-0.00537, 1],
      [-2e-5, 2]
    ],
    "red_o_points": [],
    "y_categories": ["N", "Y", "nan"],
    "blue_o_points": [],
    "blue_x_points": [
      [0.00011, 2],
      [6e-5, 2],
      [0.00011, 2],
      [0.00013, 2],
      [6e-5, 2],
      [8e-5, 2],
      [7e-5, 2],
      [6e-5, 2],
      [0.00011, 2],
      [0.00017, 2],
      [-1e-5, 2],
      [0.00023, 2],
      [0.00758, 0],
      [0.00818, 0],
      [0.00014, 2],
      [0.00012, 2],
      [-2e-5, 2],
      [7e-5, 2],
      [0.00032, 2],
      [-0.0, 2],
      [-1e-5, 2]
    ]
  },
  "QA_lstPexTouch[C7]": {
    "red_x_points": [
      [-0.01285, 1],
      [-0.00334, 2],
      [-0.00783, 1],
      [-0.00991, 1],
      [-0.00335, 2],
      [-0.00746, 1],
      [-0.01076, 1],
      [-0.01183, 1],
      [-0.00347, 2],
      [-0.00486, 2],
      [-0.01302, 1],
      [-0.00353, 2],
      [-0.01207, 1],
      [0.00904, 0],
      [-0.0117, 1],
      [-0.00933, 1],
      [-0.00286, 2],
      [0.00901, 0],
      [-0.0086, 1],
      [-0.00392, 2],
      [-0.01332, 1],
      [-0.00802, 1],
      [-0.01296, 1]
    ],
    "red_o_points": [],
    "y_categories": ["NORM", "NPV", "nan"],
    "blue_o_points": [],
    "blue_x_points": [
      [-0.00869, 1],
      [-0.00998, 1],
      [0.01752, 0],
      [-0.0059, 1],
      [0.02162, 0],
      [-0.00611, 1],
      [0.01906, 0],
      [-0.00662, 1],
      [0.00136, 2],
      [0.00385, 2],
      [-0.00153, 2],
      [-0.00657, 1],
      [0.00098, 2],
      [0.01769, 0],
      [0.0169, 0],
      [0.01752, 0],
      [0.00224, 2],
      [0.017, 0],
      [0.02344, 0],
      [0.02118, 0],
      [0.02201, 0]
    ]
  },
  "QA_lstPexTouch[C6]": {
    "red_x_points": [
      [-0.00502, 1],
      [-0.00215, 2],
      [-0.00304, 1],
      [-0.00294, 1],
      [-0.00178, 2],
      [-0.00261, 1],
      [-0.00246, 1],
      [-0.00386, 1],
      [-0.0022, 2],
      [-0.00206, 2],
      [-0.00408, 1],
      [-0.00137, 2],
      [-0.00363, 1],
      [-0.00483, 1],
      [-0.00483, 1],
      [-0.00239, 1],
      [-0.00168, 2],
      [-0.0054, 1],
      [-0.00319, 1],
      [-0.00224, 2],
      [-0.00485, 1],
      [-0.00216, 1],
      [-0.00413, 1]
    ],
    "red_o_points": [],
    "y_categories": ["NORM", "NPV", "nan"],
    "blue_o_points": [],
    "blue_x_points": [
      [-0.00311, 1],
      [-0.00354, 1],
      [0.0162, 0],
      [-0.00231, 1],
      [0.02324, 0],
      [-0.00256, 1],
      [-0.00209, 1],
      [-0.00245, 1],
      [-0.00023, 2],
      [0.00235, 2],
      [-0.00065, 2],
      [-0.003, 1],
      [-0.0, 2],
      [-0.00241, 1],
      [-0.00203, 1],
      [0.01925, 0],
      [-0.00017, 2],
      [0.01847, 0],
      [0.02401, 0],
      [-0.00266, 1],
      [-0.00339, 1]
    ]
  },
  "QS_equBpsurgTime": {
    "red_x_points": [
      [0.00112, 3],
      [-0.01142, 0],
      [-0.00072, 2],
      [-0.01378, 0],
      [-0.00692, 0],
      [-0.00126, 1],
      [-0.00047, 3],
      [-0.00028, 3],
      [0.00216, 3],
      [-0.00913, 1],
      [0.00059, 3],
      [-6e-5, 2],
      [0.00055, 3],
      [-0.01069, 2],
      [0.00044, 3],
      [0.00011, 3],
      [-0.0058, 0],
      [0.00214, 3],
      [-0.01282, 0],
      [-0.00935, 0],
      [0.00064, 3],
      [-0.00137, 2],
      [0.00091, 3]
    ],
    "red_o_points": [],
    "y_categories": [
      "0 TO 6 MONTHS",
      "13 TO 24 MONTHS",
      "7 TO 12 MONTHS",
      "nan"
    ],
    "blue_o_points": [],
    "blue_x_points": [
      [0.00167, 3],
      [0.00147, 3],
      [3e-5, 0],
      [0.01146, 1],
      [0.00214, 3],
      [0.00842, 1],
      [0.0028, 0],
      [0.00575, 2],
      [0.00277, 3],
      [0.00264, 3],
      [0.00938, 2],
      [0.00837, 2],
      [0.00282, 3],
      [0.0018, 3],
      [0.00162, 3],
      [0.00133, 3],
      [0.00383, 3],
      [0.00137, 3],
      [0.00186, 3],
      [0.00217, 3],
      [0.00173, 3]
    ]
  },
  "QA_lstPexPain[T1]": {
    "red_x_points": [
      [-0.00731, 1],
      [-0.00363, 2],
      [-0.0043, 2],
      [0.00049, 0],
      [-0.00337, 2],
      [-0.0021, 1],
      [0.00143, 0],
      [0.00186, 0],
      [-0.00623, 2],
      [-0.00528, 2],
      [-0.00662, 2],
      [-0.00348, 2],
      [-0.00709, 1],
      [-0.01125, 1],
      [-0.00359, 1],
      [-0.00268, 1],
      [-0.00327, 2],
      [-0.00929, 2],
      [-0.00897, 2],
      [-0.00379, 2],
      [-0.00658, 1],
      [-0.00204, 1],
      [-0.00748, 1]
    ],
    "red_o_points": [],
    "y_categories": ["NORM", "NPV", "nan"],
    "blue_o_points": [],
    "blue_x_points": [
      [-0.00015, 1],
      [-0.00134, 1],
      [0.00601, 0],
      [0.00226, 1],
      [0.01574, 0],
      [0.00101, 1],
      [0.01135, 0],
      [0.0121, 0],
      [-0.00277, 2],
      [0.00097, 2],
      [-0.00233, 2],
      [0.0005, 1],
      [-0.00234, 2],
      [0.00756, 0],
      [0.00691, 0],
      [0.00808, 0],
      [-0.00217, 2],
      [-0.00425, 1],
      [0.01257, 0],
      [0.0161, 0],
      [0.01876, 0]
    ]
  },
  "QA_lstPexInspectio[ScapulaAlata]": {
    "red_x_points": [
      [-0.00173, 1],
      [-0.00021, 1],
      [-0.00052, 1],
      [-0.00033, 1],
      [-0.00019, 1],
      [-0.0002, 1],
      [-0.0009, 1],
      [-0.00262, 1],
      [-0.00051, 1],
      [-0.00014, 1],
      [-0.00044, 1],
      [-0.00015, 1],
      [-0.00032, 1],
      [-0.00101, 1],
      [-0.00183, 1],
      [-0.00079, 1],
      [-0.00015, 1],
      [-0.0005, 1],
      [-0.00031, 1],
      [-0.00052, 1],
      [-0.00121, 1],
      [-0.00055, 1],
      [-0.00019, 1]
    ],
    "red_o_points": [],
    "y_categories": ["ABS", "NAIA", "PT", "nan"],
    "blue_o_points": [],
    "blue_x_points": [
      [-0.00047, 1],
      [-0.00023, 1],
      [-0.00029, 1],
      [-0.00042, 1],
      [-0.00031, 1],
      [-0.00036, 1],
      [-0.00032, 1],
      [-0.00033, 1],
      [-0.00021, 1],
      [-0.00079, 1],
      [-0.00016, 1],
      [-0.00029, 1],
      [-0.00018, 1],
      [0.00803, 0],
      [-0.0002, 1],
      [-0.00015, 1],
      [-0.00038, 1],
      [-0.00011, 1],
      [0.01293, 2],
      [-0.00028, 1],
      [-0.00016, 1]
    ]
  },
  "QS_mulGraftRoot[T1]": {
    "red_x_points": [
      [-6e-5, 1],
      [2e-5, 0],
      [2e-5, 0],
      [2e-5, 2],
      [-6e-5, 1],
      [2e-5, 2],
      [-6e-5, 1],
      [-7e-5, 0],
      [-7e-5, 0],
      [-6e-5, 1],
      [2e-5, 0],
      [2e-5, 2]
    ],
    "red_o_points": [],
    "y_categories": ["N", "NOT APPLICABLE", "nan"],
    "blue_o_points": [],
    "blue_x_points": [[2e-5, 2], [2e-5, 0], [0.00013, 1], [2e-5, 0], [2e-5, 2]]
  },
  "QA_yonInjFracture": {
    "red_x_points": [
      [0.00388, 0],
      [-0.00315, 2],
      [0.00311, 0],
      [-0.00365, 2],
      [-0.00909, 1],
      [-0.01182, 1],
      [0.00202, 0],
      [0.00262, 0],
      [-0.01295, 1],
      [-0.01074, 1],
      [0.00353, 0],
      [-0.00867, 1],
      [-0.01409, 1],
      [-0.00183, 0],
      [-0.01315, 1],
      [-0.00865, 1],
      [-0.00737, 1],
      [0.00274, 0],
      [0.00267, 0],
      [0.00344, 0],
      [-0.0092, 1],
      [-0.00569, 1],
      [-0.01678, 1]
    ],
    "red_o_points": [],
    "y_categories": ["N", "Y", "nan"],
    "blue_o_points": [],
    "blue_x_points": [
      [0.0102, 0],
      [0.00976, 0],
      [0.00223, 0],
      [0.0056, 0],
      [0.01015, 2],
      [0.00739, 0],
      [0.00251, 1],
      [0.00023, 1],
      [-0.00648, 1],
      [0.00801, 0],
      [0.01091, 0],
      [0.0102, 0],
      [0.00814, 0],
      [0.00284, 0],
      [0.00383, 0],
      [0.00495, 2],
      [0.00943, 0],
      [0.00475, 0],
      [0.0039, 0],
      [-0.00316, 1],
      [0.00743, 2]
    ]
  },
  "QS_mulGraftTrunk[MiddleTrunk]": {
    "red_x_points": [
      [-0.00017, 1],
      [-7e-5, 0],
      [-0.00034, 1],
      [0.0, 2],
      [-7e-5, 0],
      [1e-5, 2],
      [3e-5, 0],
      [3e-5, 0],
      [-0.00024, 1],
      [0.0, 2],
      [-0.0003, 1],
      [0.0, 2]
    ],
    "red_o_points": [],
    "y_categories": ["N", "NOT APPLICABLE", "nan"],
    "blue_o_points": [],
    "blue_x_points": [
      [4e-5, 2],
      [9e-5, 0],
      [5e-5, 0],
      [1e-5, 2],
      [9e-5, 0],
      [0.00016, 0],
      [0.00013, 0],
      [7e-5, 2],
      [3e-5, 1],
      [-3e-5, 0],
      [8e-5, 0],
      [0.0, 2],
      [8e-5, 2],
      [4e-5, 2],
      [4e-5, 2],
      [7e-5, 2],
      [4e-5, 2],
      [-8e-5, 1],
      [0.0002, 2],
      [0.0, 2]
    ]
  },
  "QS_mulGraftNerve[Ac]": {
    "red_x_points": [
      [-0.00103, 1],
      [-0.00056, 0],
      [-0.0001, 0],
      [3e-5, 0],
      [-0.00028, 0],
      [6e-5, 0],
      [-7e-5, 2],
      [-0.00065, 1],
      [0.00029, 2],
      [-0.00045, 0],
      [1e-5, 2],
      [-0.00045, 0],
      [4e-5, 2],
      [-3e-5, 0],
      [-0.00077, 1],
      [1e-5, 2],
      [-0.00013, 0],
      [3e-5, 2],
      [-0.00017, 0],
      [-0.00031, 0],
      [-0.0007, 1],
      [7e-5, 2]
    ],
    "red_o_points": [],
    "y_categories": ["N", "NOT APPLICABLE", "nan"],
    "blue_o_points": [],
    "blue_x_points": [
      [0.00015, 2],
      [0.00016, 2],
      [0.00021, 0],
      [0.00015, 0],
      [0.00016, 2],
      [0.00017, 0],
      [0.00033, 0],
      [9e-5, 0],
      [0.00026, 2],
      [0.00119, 1],
      [-0.00016, 0],
      [0.00033, 0],
      [0.00026, 2],
      [0.00024, 2],
      [0.00021, 2],
      [0.00015, 2],
      [0.00029, 2],
      [0.00014, 2],
      [0.00035, 1],
      [0.00025, 2],
      [0.00022, 2]
    ]
  },
  "QA_lstPexArthre[Shoulder]": {
    "red_x_points": [
      [0.00469, 2],
      [-0.00243, 3],
      [-0.00385, 3],
      [0.00596, 2],
      [-0.0152, 0],
      [-0.02022, 1],
      [0.00649, 2],
      [0.00536, 2],
      [-0.0026, 3],
      [0.00607, 2],
      [-0.00364, 3],
      [-0.00189, 3],
      [-0.00398, 3],
      [-0.02719, 1],
      [0.00569, 2],
      [-0.01539, 1],
      [-0.00197, 3],
      [-0.00464, 3],
      [-0.00665, 3],
      [-0.00274, 3],
      [-0.00263, 3],
      [-0.01413, 1],
      [-0.00408, 3]
    ],
    "red_o_points": [],
    "y_categories": ["NAIA", "NPV", "PV", "nan"],
    "blue_o_points": [],
    "blue_x_points": [
      [0.01184, 2],
      [-0.00274, 3],
      [0.00763, 2],
      [0.01162, 2],
      [-0.00107, 3],
      [0.0115, 2],
      [0.01072, 2],
      [0.01085, 2],
      [-0.00173, 3],
      [-0.00099, 3],
      [-0.00199, 3],
      [0.01196, 2],
      [-0.00114, 3],
      [0.00807, 2],
      [0.00631, 2],
      [-0.00016, 1],
      [-0.00173, 3],
      [0.00597, 2],
      [-0.00117, 3],
      [0.00877, 2],
      [0.00646, 2]
    ]
  },
  "QS_mulNeuromadSite[C8]": {
    "red_x_points": [
      [-0.0036, 1],
      [-0.00249, 0],
      [-0.00044, 0],
      [0.00014, 0],
      [-0.00207, 0],
      [9e-5, 0],
      [-2e-5, 2],
      [-0.00382, 1],
      [0.00111, 2],
      [-0.00132, 0],
      [0.00036, 2],
      [-0.0017, 0],
      [0.00044, 2],
      [-0.00012, 0],
      [-0.00464, 1],
      [0.00016, 2],
      [-0.00167, 0],
      [0.00048, 2],
      [-0.00116, 0],
      [-0.00319, 0],
      [-0.0037, 1],
      [0.00031, 0],
      [0.00017, 2]
    ],
    "red_o_points": [],
    "y_categories": ["N", "NOT APPLICABLE", "nan"],
    "blue_o_points": [],
    "blue_x_points": [
      [0.00095, 2],
      [0.0006, 2],
      [0.0007, 0],
      [0.00108, 0],
      [0.00064, 2],
      [0.00152, 0],
      [0.00112, 0],
      [0.00053, 0],
      [0.00224, 2],
      [0.00624, 1],
      [-0.00049, 0],
      [0.00144, 0],
      [0.0017, 2],
      [0.00101, 2],
      [0.00092, 2],
      [0.0006, 2],
      [0.00184, 2],
      [0.001, 2],
      [0.00132, 1],
      [0.0012, 2],
      [0.00052, 2]
    ]
  },
  "QS_mulGraftNerve[Ph]": {
    "red_x_points": [
      [-0.00165, 1],
      [-0.0007, 0],
      [-2e-5, 0],
      [0.00027, 0],
      [-0.00044, 0],
      [0.00016, 0],
      [-6e-5, 2],
      [-0.00118, 1],
      [0.00057, 2],
      [-0.00094, 0],
      [2e-5, 2],
      [-0.00097, 0],
      [1e-5, 2],
      [-1e-5, 0],
      [-0.00232, 1],
      [2e-5, 2],
      [-0.00083, 0],
      [0.00014, 2],
      [-0.00018, 0],
      [-0.00083, 0],
      [-0.00124, 1],
      [0.00017, 0],
      [0.00015, 2]
    ],
    "red_o_points": [],
    "y_categories": ["N", "NOT APPLICABLE", "nan"],
    "blue_o_points": [],
    "blue_x_points": [
      [0.00026, 2],
      [0.00015, 2],
      [0.00021, 0],
      [0.00073, 0],
      [-2e-5, 2],
      [0.00079, 0],
      [0.00037, 0],
      [0.00049, 0],
      [0.00098, 2],
      [0.00229, 1],
      [-0.0003, 0],
      [0.00061, 0],
      [0.00081, 2],
      [0.00014, 2],
      [0.00041, 2],
      [7e-5, 2],
      [0.0007, 2],
      [0.0003, 2],
      [4e-5, 1],
      [0.00044, 2],
      [0.0004, 2]
    ]
  },
  "QA_lstPexMuscstrength[FingersFlex]": {
    "red_x_points": [
      [0.00256, 2],
      [0.00256, 2],
      [-0.02883, 1],
      [0.00954, 0],
      [-0.02945, 1],
      [-0.03058, 1],
      [-0.03106, 1],
      [0.00936, 0],
      [0.00266, 2],
      [0.00232, 2],
      [0.0094, 0],
      [0.00243, 2],
      [-0.0339, 1],
      [0.00924, 0],
      [0.00976, 0],
      [-0.03297, 1],
      [-0.02875, 1],
      [0.0026, 2],
      [0.00961, 0],
      [0.00858, 0],
      [0.0022, 2],
      [-0.02998, 1],
      [0.00227, 2]
    ],
    "red_o_points": [],
    "y_categories": ["GREATER THAN OR EQUALS TO 3", "LESS THAN 3", "nan"],
    "blue_o_points": [],
    "blue_x_points": [
      [0.01288, 0],
      [0.01232, 0],
      [0.01014, 0],
      [0.01022, 0],
      [0.01137, 0],
      [0.01097, 0],
      [0.01028, 0],
      [0.01003, 0],
      [0.00328, 2],
      [0.00331, 2],
      [0.00336, 2],
      [0.00402, 2],
      [0.00328, 2],
      [0.01045, 0],
      [0.01046, 0],
      [0.01065, 0],
      [0.00371, 2],
      [0.00325, 2],
      [0.00987, 0],
      [0.00346, 2],
      [0.00312, 2]
    ]
  },
  "QA_lstPexPalle[Elbow]": {
    "red_x_points": [
      [-0.00124, 4],
      [-0.00146, 4],
      [-0.00147, 4],
      [0.01074, 3],
      [-0.0012, 4],
      [-0.00118, 4],
      [-0.01839, 1],
      [-0.01491, 1],
      [-0.00139, 4],
      [-0.0014, 4],
      [-0.00174, 4],
      [-0.00122, 4],
      [-0.00137, 4],
      [-0.01887, 1],
      [-0.0014, 4],
      [-0.02341, 0],
      [-0.02129, 2],
      [-0.0016, 4],
      [-0.00195, 4],
      [-0.00156, 4],
      [0.01023, 3],
      [-0.02027, 0],
      [-0.00147, 4]
    ],
    "red_o_points": [],
    "y_categories": ["ABS", "HYPO", "NAIA", "PT", "nan"],
    "blue_o_points": [],
    "blue_x_points": [
      [-0.00101, 4],
      [-0.00111, 4],
      [0.01686, 3],
      [0.01844, 3],
      [-0.00045, 4],
      [-0.00088, 4],
      [-0.00712, 1],
      [0.01746, 3],
      [-0.00126, 4],
      [-0.00107, 4],
      [-0.00106, 4],
      [-0.00074, 4],
      [-0.0012, 4],
      [0.01831, 3],
      [0.01663, 3],
      [0.0158, 3],
      [-0.00128, 4],
      [0.01565, 3],
      [-0.00068, 4],
      [0.01745, 3],
      [-0.00093, 4]
    ]
  },
  "QS_mulGraftRoot[C5]": {
    "red_x_points": [
      [-0.0002, 1],
      [-0.00015, 0],
      [-0.00015, 0],
      [1e-5, 0],
      [-6e-5, 0],
      [3e-5, 2],
      [-0.00031, 1],
      [4e-5, 2],
      [-7e-5, 0],
      [6e-5, 2],
      [-0.00014, 0],
      [0.00018, 2],
      [1e-5, 0],
      [-0.00013, 1],
      [-5e-5, 0],
      [6e-5, 2],
      [-0.00013, 0],
      [-0.0001, 0],
      [-0.00039, 1],
      [1e-5, 0],
      [5e-5, 2]
    ],
    "red_o_points": [],
    "y_categories": ["N", "NOT APPLICABLE", "nan"],
    "blue_o_points": [],
    "blue_x_points": [
      [0.00012, 2],
      [0.00016, 2],
      [2e-5, 0],
      [6e-5, 0],
      [8e-5, 2],
      [3e-5, 0],
      [2e-5, 0],
      [-4e-5, 0],
      [0.0001, 2],
      [0.00019, 1],
      [-8e-5, 0],
      [-3e-5, 0],
      [4e-5, 2],
      [8e-5, 2],
      [0.00011, 2],
      [0.0001, 2],
      [3e-5, 2],
      [8e-5, 2],
      [0.00011, 1],
      [0.00013, 2],
      [0.00011, 2]
    ]
  },
  "QA_lstPexPalle[Ulna]": {
    "red_x_points": [
      [-0.00133, 4],
      [-0.00119, 4],
      [-0.00145, 4],
      [-0.02688, 2],
      [-0.00115, 4],
      [-0.00106, 4],
      [-0.00987, 1],
      [0.00619, 3],
      [-0.00151, 4],
      [-0.00142, 4],
      [-0.00169, 4],
      [-0.00129, 4],
      [-0.00121, 4],
      [0.00677, 3],
      [-0.0014, 4],
      [-0.02083, 0],
      [-0.01817, 0],
      [-0.00166, 4],
      [-0.00207, 4],
      [-0.00158, 4],
      [0.00667, 3],
      [-0.01889, 0],
      [-0.0014, 4]
    ],
    "red_o_points": [],
    "y_categories": ["ABS", "HYPO", "NAIA", "PT", "nan"],
    "blue_o_points": [],
    "blue_x_points": [
      [-0.0007, 4],
      [-0.00108, 4],
      [0.01012, 3],
      [0.013, 1],
      [-0.00062, 4],
      [-0.00063, 4],
      [0.01152, 3],
      [0.01232, 3],
      [-0.0011, 4],
      [-0.00106, 4],
      [-0.00118, 4],
      [-0.00077, 4],
      [-0.00122, 4],
      [0.0116, 3],
      [0.01206, 3],
      [0.01189, 3],
      [-0.00127, 4],
      [0.01117, 3],
      [-0.00083, 4],
      [0.01406, 3],
      [-0.00084, 4]
    ]
  },
  "QA_lstPexMuscstrength[ScapulaAbducSuprot]": {
    "red_x_points": [
      [-0.00126, 2],
      [-0.00044, 2],
      [-0.00533, 1],
      [-0.00264, 2],
      [-0.00485, 1],
      [-0.00803, 1],
      [-0.0091, 1],
      [0.0023, 0],
      [-0.00114, 2],
      [-0.00114, 2],
      [-0.00415, 2],
      [-0.00035, 2],
      [-0.00978, 1],
      [-0.00247, 0],
      [0.00413, 0],
      [-0.00923, 1],
      [-0.00322, 1],
      [-0.00159, 2],
      [-0.00836, 1],
      [0.00235, 0],
      [-0.00168, 2],
      [-0.00351, 1],
      [-0.00627, 2]
    ],
    "red_o_points": [],
    "y_categories": ["GREATER THAN OR EQUALS TO 3", "LESS THAN 3", "nan"],
    "blue_o_points": [],
    "blue_x_points": [
      [0.02035, 0],
      [0.01935, 0],
      [0.0038, 0],
      [-0.00052, 1],
      [-0.0012, 1],
      [0.01074, 0],
      [0.00796, 0],
      [0.00087, 1],
      [-0.00053, 2],
      [0.00049, 2],
      [0.00062, 2],
      [0.00147, 2],
      [0.00011, 2],
      [0.00449, 0],
      [0.00594, 0],
      [-0.00086, 2],
      [-0.0, 2],
      [0.00546, 0],
      [0.00052, 2],
      [-0.00226, 1],
      [-0.00102, 2]
    ]
  },
  "participant_code": {
    "red_x_points": [
      [-0.0406, 0],
      [-0.03933, 2],
      [-0.03982, 3],
      [-0.03982, 4],
      [-0.03836, 5],
      [-0.03739, 9],
      [-0.03836, 14],
      [-0.03875, 17],
      [-0.03807, 19],
      [-0.03904, 20],
      [-0.03827, 22],
      [-0.03924, 23],
      [-0.03933, 24],
      [-0.03836, 26],
      [-0.04157, 28],
      [-0.03875, 29],
      [-0.03953, 31],
      [-0.03953, 35],
      [-0.03827, 37],
      [-0.03885, 39],
      [-0.0405, 41],
      [-0.04031, 42],
      [-0.04001, 43]
    ],
    "red_o_points": [],
    "y_categories": [
      "P16554",
      "P18297",
      "P19283",
      "P19287",
      "P23172",
      "P23391",
      "P30595",
      "P31645",
      "P31691",
      "P34778",
      "P35046",
      "P36328",
      "P43633",
      "P4544",
      "P46417",
      "P48965",
      "P53068",
      "P5497",
      "P58556",
      "P59529",
      "P62483",
      "P64658",
      "P65202",
      "P66816",
      "P67052",
      "P6751",
      "P7408",
      "P75566",
      "P76226",
      "P79971",
      "P82621",
      "P82990",
      "P84549",
      "P84932",
      "P85825",
      "P86989",
      "P8770",
      "P87791",
      "P90550",
      "P93159",
      "P94969",
      "P96710",
      "P9744",
      "P98500",
      "nan"
    ],
    "blue_o_points": [],
    "blue_x_points": [
      [0.04278, 1],
      [0.0435, 6],
      [0.04432, 7],
      [0.0435, 8],
      [0.04257, 10],
      [0.04329, 11],
      [0.0434, 12],
      [0.04227, 13],
      [0.04329, 15],
      [0.0436, 16],
      [0.04278, 18],
      [0.04247, 21],
      [0.04278, 25],
      [0.04371, 27],
      [0.04196, 30],
      [0.04206, 32],
      [0.04319, 33],
      [0.04278, 34],
      [0.04371, 36],
      [0.04175, 38],
      [0.04237, 40]
    ]
  },
  "QS_mulGraftNerve[IS]": {
    "red_x_points": [
      [-0.00021, 1],
      [-0.00013, 0],
      [-3e-5, 0],
      [1e-5, 0],
      [-3e-5, 2],
      [-0.00023, 1],
      [6e-5, 2],
      [-0.0001, 0],
      [0.0, 2],
      [-0.00013, 0],
      [1e-5, 2],
      [-0.00023, 1],
      [-0.0001, 0],
      [1e-5, 2],
      [-2e-5, 0],
      [-0.00022, 0],
      [-1e-5, 1],
      [3e-5, 2]
    ],
    "red_o_points": [],
    "y_categories": ["N", "NOT APPLICABLE", "nan"],
    "blue_o_points": [],
    "blue_x_points": [
      [7e-5, 2],
      [3e-5, 2],
      [1e-5, 0],
      [1e-5, 0],
      [3e-5, 2],
      [0.00011, 0],
      [1e-5, 0],
      [0.00011, 0],
      [6e-5, 2],
      [0.00028, 1],
      [0.0001, 0],
      [0.00019, 0],
      [0.0001, 2],
      [3e-5, 2],
      [3e-5, 2],
      [0.0001, 2],
      [7e-5, 1],
      [2e-5, 2]
    ]
  },
  "QS_mulTransfSite[MeMc]": {
    "red_x_points": [
      [-6e-5, 0],
      [-6e-5, 0],
      [-0.0001, 1],
      [4e-5, 2],
      [-6e-5, 0],
      [-6e-5, 0]
    ],
    "red_o_points": [],
    "y_categories": ["N", "NOT APPLICABLE", "nan"],
    "blue_o_points": [],
    "blue_x_points": [[0.00014, 1], [0.0001, 0], [4e-5, 2]]
  },
  "QA_mulInjOrthesisType[ArmSling]": {
    "red_x_points": [
      [-0.00649, 2],
      [-0.00648, 2],
      [-0.0034, 2],
      [-0.00199, 2],
      [-0.00432, 2],
      [-0.00224, 2],
      [-0.00146, 2],
      [-0.00088, 1],
      [-0.00714, 2],
      [-0.00605, 2],
      [-0.004, 2],
      [-0.01854, 0],
      [-0.00706, 3],
      [-0.00154, 2],
      [0.00059, 1],
      [-0.00114, 2],
      [-0.01014, 3],
      [-0.0064, 2],
      [-0.00367, 2],
      [-0.00442, 2],
      [-0.00701, 3],
      [-0.0013, 2],
      [-0.00443, 2]
    ],
    "red_o_points": [],
    "y_categories": ["N", "NOT APPLICABLE", "Y", "nan"],
    "blue_o_points": [],
    "blue_x_points": [
      [-0.00123, 2],
      [-0.00134, 2],
      [-3e-5, 2],
      [-0.00074, 2],
      [-0.00138, 2],
      [-0.00081, 2],
      [-0.00032, 2],
      [-0.00075, 2],
      [0.03269, 1],
      [0.02588, 1],
      [-0.00495, 2],
      [0.01983, 1],
      [0.02393, 1],
      [-0.00015, 2],
      [0.00555, 0],
      [-0.00075, 2],
      [-0.00619, 2],
      [0.00981, 1],
      [0.01154, 1],
      [-0.00227, 2],
      [0.00119, 3]
    ]
  },
  "QS_mulGraftNerve[Ul]": {
    "red_x_points": [
      [-7e-5, 1],
      [-0.00013, 0],
      [0.0, 0],
      [-6e-5, 0],
      [0.0, 0],
      [-7e-5, 1],
      [2e-5, 2],
      [-0.0001, 0],
      [4e-5, 2],
      [-0.00011, 0],
      [3e-5, 2],
      [-0.00016, 1],
      [-0.00011, 0],
      [-1e-5, 2],
      [0.0, 0],
      [-0.00011, 0],
      [-0.00013, 1],
      [0.0, 0],
      [-3e-5, 2]
    ],
    "red_o_points": [],
    "y_categories": ["N", "NOT APPLICABLE", "nan"],
    "blue_o_points": [],
    "blue_x_points": [
      [3e-5, 2],
      [4e-5, 2],
      [4e-5, 0],
      [0.0, 0],
      [4e-5, 0],
      [0.00012, 2],
      [0.00038, 1],
      [-2e-5, 0],
      [0.00013, 0],
      [0.00016, 2],
      [1e-5, 2],
      [1e-5, 2],
      [1e-5, 2],
      [3e-5, 2]
    ]
  },
  "QS_mulGraftNerve[Ssr]": {
    "red_x_points": [
      [-0.00081, 1],
      [-0.00067, 0],
      [-5e-5, 0],
      [-1e-5, 0],
      [-0.00034, 0],
      [8e-5, 0],
      [1e-5, 2],
      [-0.00135, 1],
      [0.00024, 2],
      [-0.00047, 0],
      [0.00017, 2],
      [-0.00047, 0],
      [6e-5, 2],
      [7e-5, 0],
      [-0.00118, 1],
      [-3e-5, 2],
      [-0.00038, 0],
      [0.0001, 2],
      [-0.00034, 0],
      [-0.00045, 0],
      [-0.00121, 1],
      [3e-5, 0],
      [6e-5, 2]
    ],
    "red_o_points": [],
    "y_categories": ["N", "NOT APPLICABLE", "nan"],
    "blue_o_points": [],
    "blue_x_points": [
      [0.00025, 2],
      [0.00018, 2],
      [0.00039, 0],
      [0.00044, 0],
      [5e-5, 2],
      [0.00048, 0],
      [0.00016, 0],
      [7e-5, 0],
      [0.00051, 2],
      [0.00146, 1],
      [-0.00027, 0],
      [0.00058, 0],
      [0.0004, 2],
      [0.0002, 2],
      [0.00033, 2],
      [0.0002, 2],
      [0.00049, 2],
      [0.0003, 2],
      [0.00011, 1],
      [0.00039, 2],
      [0.00019, 2]
    ]
  },
  "QS_mulGraftLevel[Nerve]": {
    "red_x_points": [[-0.00013, 0], [2e-5, 2]],
    "red_o_points": [],
    "y_categories": ["N", "NOT APPLICABLE", "nan"],
    "blue_o_points": [],
    "blue_x_points": [[2e-5, 2], [7e-5, 1], [2e-5, 2], [2e-5, 2]]
  },
  "QA_lstPexKine[Shoulder]": {
    "red_x_points": [
      [0.00058, 1],
      [-0.00107, 2],
      [-0.00309, 2],
      [0.00206, 1],
      [-0.00218, 2],
      [-0.01468, 0],
      [0.00102, 1],
      [0.00118, 1],
      [-0.00095, 2],
      [0.00163, 1],
      [-0.00154, 2],
      [-0.00117, 2],
      [-0.00124, 2],
      [-0.02686, 0],
      [0.00097, 1],
      [0.00125, 1],
      [-0.00119, 2],
      [-0.00206, 2],
      [-0.00636, 2],
      [-0.00168, 2],
      [-0.00121, 2],
      [0.00142, 1],
      [-0.00176, 2]
    ],
    "red_o_points": [],
    "y_categories": ["NPV", "PV", "nan"],
    "blue_o_points": [],
    "blue_x_points": [
      [0.0042, 1],
      [-0.00081, 2],
      [0.00479, 1],
      [0.00776, 1],
      [-0.00028, 2],
      [0.0074, 1],
      [0.00711, 1],
      [0.00678, 1],
      [-0.00069, 2],
      [-0.00022, 2],
      [-0.00127, 2],
      [0.00838, 1],
      [-0.00042, 2],
      [0.00384, 1],
      [0.00295, 1],
      [9e-5, 0],
      [-0.00062, 2],
      [0.00252, 1],
      [-0.00028, 2],
      [0.00338, 1],
      [0.00233, 1]
    ]
  },
  "QS_mulGraftNerve[MCA]": {
    "red_x_points": [
      [-0.0004, 1],
      [-0.00055, 0],
      [-0.00039, 0],
      [-2e-5, 0],
      [-0.00039, 0],
      [2e-5, 0],
      [0.00012, 2],
      [-0.00056, 1],
      [0.00018, 2],
      [-0.00016, 0],
      [7e-5, 2],
      [-0.00034, 0],
      [6e-5, 2],
      [-9e-5, 0],
      [-0.00031, 1],
      [0.0, 2],
      [-9e-5, 0],
      [0.00019, 2],
      [-0.00036, 0],
      [-0.0004, 0],
      [-0.00063, 1],
      [0.00011, 0],
      [0.00013, 2]
    ],
    "red_o_points": [],
    "y_categories": ["N", "NOT APPLICABLE", "nan"],
    "blue_o_points": [],
    "blue_x_points": [
      [0.00015, 2],
      [0.00016, 2],
      [5e-5, 0],
      [0.0002, 0],
      [6e-5, 2],
      [6e-5, 0],
      [0.0, 0],
      [5e-5, 0],
      [0.00039, 2],
      [0.00077, 1],
      [-0.00032, 0],
      [0.00039, 0],
      [0.00035, 2],
      [0.00013, 2],
      [0.00021, 2],
      [0.00046, 2],
      [0.00021, 2],
      [0.00021, 1],
      [0.00011, 2],
      [0.00016, 2]
    ]
  },
  "QA_lstPexInspectio[Swelling]": {
    "red_x_points": [
      [0.00085, 1],
      [0.00169, 1],
      [-0.00378, 0],
      [0.00195, 1],
      [-0.01353, 2],
      [0.00189, 1],
      [-0.01819, 2],
      [-0.00169, 0],
      [-0.00817, 0],
      [0.0015, 1],
      [-0.00794, 0],
      [0.00145, 1],
      [0.0038, 1],
      [-0.0329, 2],
      [0.0018, 1],
      [-0.01654, 2],
      [0.00184, 1],
      [0.00256, 1],
      [0.00168, 1],
      [-0.00218, 0],
      [-0.00464, 0],
      [-0.00196, 0],
      [0.00328, 1]
    ],
    "red_o_points": [],
    "y_categories": ["ABS", "NAIA", "PT", "nan"],
    "blue_o_points": [],
    "blue_x_points": [
      [0.00707, 1],
      [0.00612, 1],
      [0.00443, 0],
      [0.00382, 0],
      [0.00492, 1],
      [0.00343, 1],
      [0.00706, 0],
      [0.00383, 1],
      [0.00503, 1],
      [0.00257, 1],
      [0.00318, 1],
      [0.00407, 1],
      [0.00383, 1],
      [0.00245, 0],
      [0.00412, 1],
      [0.00448, 1],
      [0.00029, 0],
      [0.00322, 1],
      [0.00443, 0],
      [0.00465, 1],
      [0.00423, 1]
    ]
  },
  "QA_mulInjOrthesisType[ShoulderSupport]": {
    "red_x_points": [
      [-0.00486, 0],
      [-0.00625, 0],
      [-0.00314, 0],
      [-0.0137, 2],
      [-0.00412, 0],
      [-0.00243, 0],
      [-0.00142, 0],
      [-0.0029, 1],
      [-0.00798, 0],
      [-0.00545, 0],
      [-0.00416, 0],
      [-0.01315, 2],
      [-0.00805, 3],
      [-0.00166, 0],
      [-0.0018, 1],
      [-0.00171, 0],
      [-0.01018, 3],
      [-0.00692, 0],
      [-0.00408, 0],
      [-0.00416, 0],
      [-0.00649, 3],
      [-0.00119, 0],
      [-0.00565, 0]
    ],
    "red_o_points": [],
    "y_categories": ["N", "NOT APPLICABLE", "Y", "nan"],
    "blue_o_points": [],
    "blue_x_points": [
      [-0.00106, 0],
      [-0.00104, 0],
      [0.00066, 0],
      [0.0016, 0],
      [0.00989, 2],
      [0.0005, 0],
      [0.00015, 0],
      [0.00107, 0],
      [0.03167, 1],
      [0.02257, 1],
      [-0.00436, 0],
      [0.02156, 1],
      [0.02178, 1],
      [-0.00021, 0],
      [0.00539, 2],
      [-0.00059, 0],
      [-0.00662, 0],
      [0.0103, 1],
      [0.00865, 1],
      [-0.00214, 0],
      [0.00162, 3]
    ]
  },
  "QA_lstPexPain[C6]": {
    "red_x_points": [
      [-0.00057, 1],
      [-0.00378, 2],
      [-0.00294, 2],
      [-0.00055, 1],
      [-0.00357, 2],
      [-0.00035, 1],
      [-0.00066, 1],
      [-0.00079, 1],
      [-0.00446, 2],
      [-0.00373, 2],
      [-0.00529, 2],
      [-0.00282, 2],
      [-0.00084, 1],
      [-0.0023, 1],
      [-0.0003, 1],
      [-0.00095, 1],
      [-0.00294, 2],
      [-0.00602, 2],
      [-0.0047, 2],
      [-0.0039, 2],
      [-0.00068, 1],
      [-0.00056, 1],
      [-0.00104, 1]
    ],
    "red_o_points": [],
    "y_categories": ["NORM", "NPV", "nan"],
    "blue_o_points": [],
    "blue_x_points": [
      [-0.00016, 1],
      [-6e-5, 1],
      [0.01195, 0],
      [-5e-5, 1],
      [0.01763, 0],
      [0.00024, 1],
      [0.00017, 1],
      [-0.00021, 1],
      [-0.00291, 2],
      [-0.00266, 2],
      [-0.0024, 2],
      [0.00012, 1],
      [-0.00244, 2],
      [0.01276, 0],
      [-0.00053, 1],
      [0.01453, 0],
      [-0.00345, 2],
      [0.01195, 0],
      [-0.00015, 1],
      [-0.00054, 1],
      [-5e-5, 1]
    ]
  },
  "QS_mulGraftTrunk[LowerTrunk]": {
    "red_x_points": [
      [-0.00043, 1],
      [-0.00023, 0],
      [-2e-5, 0],
      [-6e-5, 0],
      [-0.00011, 0],
      [4e-5, 0],
      [5e-5, 2],
      [-0.00045, 1],
      [0.00017, 2],
      [-0.00024, 0],
      [0.0001, 2],
      [-0.00026, 0],
      [9e-5, 2],
      [2e-5, 0],
      [-0.0004, 1],
      [-0.00023, 0],
      [6e-5, 2],
      [-9e-5, 0],
      [-0.00021, 0],
      [-0.00022, 1],
      [2e-5, 0],
      [0.00011, 2]
    ],
    "red_o_points": [],
    "y_categories": ["N", "NOT APPLICABLE", "nan"],
    "blue_o_points": [],
    "blue_x_points": [
      [0.0002, 2],
      [0.0001, 2],
      [4e-5, 0],
      [0.0001, 0],
      [3e-5, 2],
      [0.00011, 0],
      [4e-5, 0],
      [2e-5, 0],
      [0.00027, 2],
      [0.00062, 1],
      [-0.00015, 0],
      [9e-5, 0],
      [0.00023, 2],
      [3e-5, 2],
      [0.00018, 2],
      [0.00012, 2],
      [0.00019, 2],
      [8e-5, 2]
    ]
  },
  "QS_mulGraftRoot[T2]": {
    "red_x_points": [
      [-0.00025, 1],
      [-0.00015, 0],
      [-4e-5, 0],
      [-0.0001, 0],
      [-1e-5, 0],
      [-7e-5, 1],
      [0.0001, 2],
      [-0.0002, 0],
      [3e-5, 2],
      [-0.0002, 0],
      [3e-5, 2],
      [-0.0003, 1],
      [2e-5, 2],
      [-5e-5, 0],
      [8e-5, 2],
      [-2e-5, 0],
      [-0.0001, 0],
      [-0.00017, 1],
      [3e-5, 0],
      [3e-5, 2]
    ],
    "red_o_points": [],
    "y_categories": ["N", "NOT APPLICABLE", "nan"],
    "blue_o_points": [],
    "blue_x_points": [
      [0.00015, 2],
      [3e-5, 2],
      [4e-5, 0],
      [7e-5, 0],
      [2e-5, 2],
      [3e-5, 0],
      [0.0001, 2],
      [0.00043, 1],
      [-0.00016, 0],
      [0.00014, 0],
      [0.0002, 2],
      [0.0, 2],
      [0.0, 2],
      [0.0, 2],
      [0.00019, 2],
      [0.0, 2],
      [3e-5, 2],
      [3e-5, 2]
    ]
  },
  "QS_mulGraftNerve[MC]": {
    "red_x_points": [
      [2e-5, 0],
      [2e-5, 0],
      [-7e-5, 1],
      [0.0, 2],
      [-0.00024, 1],
      [2e-5, 2]
    ],
    "red_o_points": [],
    "y_categories": ["N", "NOT APPLICABLE", "nan"],
    "blue_o_points": [],
    "blue_x_points": [
      [2e-5, 2],
      [0.0, 2],
      [4e-5, 0],
      [6e-5, 0],
      [4e-5, 0],
      [4e-5, 0],
      [2e-5, 0],
      [0.0, 2],
      [0.0, 2],
      [0.0, 2],
      [0.0, 2]
    ]
  },
  "QS_mulGraftTrunk[UpperTrunk]": {
    "red_x_points": [
      [-0.0072, 1],
      [-0.00356, 0],
      [-0.00148, 0],
      [0.0, 0],
      [-0.00262, 0],
      [0.00066, 0],
      [0.00026, 3],
      [-0.00715, 1],
      [0.00304, 3],
      [-0.0185, 2],
      [0.00144, 3],
      [-0.00388, 0],
      [0.00079, 3],
      [0.00033, 0],
      [-0.00891, 1],
      [0.00041, 3],
      [-0.00303, 0],
      [0.00177, 3],
      [-0.00085, 0],
      [-0.00471, 0],
      [-0.00633, 1],
      [0.00038, 0],
      [0.00121, 3]
    ],
    "red_o_points": [],
    "y_categories": ["N", "NOT APPLICABLE", "Y", "nan"],
    "blue_o_points": [],
    "blue_x_points": [
      [0.00233, 3],
      [0.00114, 3],
      [0.00169, 0],
      [0.00279, 0],
      [0.0009, 3],
      [0.00362, 0],
      [0.00276, 0],
      [0.00131, 0],
      [0.00531, 3],
      [0.01179, 1],
      [-0.00197, 0],
      [0.00397, 0],
      [0.0042, 3],
      [0.00142, 3],
      [0.00175, 3],
      [0.00135, 3],
      [0.00538, 3],
      [0.00197, 3],
      [0.00098, 1],
      [0.00297, 3],
      [0.00227, 3]
    ]
  },
  "QS_mulTransfSite[PhMc]": {
    "red_x_points": [
      [-0.00654, 1],
      [-0.00379, 0],
      [-0.00117, 0],
      [0.00054, 0],
      [-0.00246, 0],
      [-0.01192, 2],
      [0.00042, 3],
      [-0.00628, 1],
      [0.00312, 3],
      [-0.00226, 0],
      [0.00176, 3],
      [-0.00343, 0],
      [0.00124, 3],
      [0.00031, 0],
      [-0.00988, 1],
      [0.00094, 3],
      [-0.00875, 2],
      [0.00135, 3],
      [-0.00133, 0],
      [-0.00378, 0],
      [-0.00599, 1],
      [0.00134, 0],
      [0.00098, 3]
    ],
    "red_o_points": [],
    "y_categories": ["N", "NOT APPLICABLE", "Y", "nan"],
    "blue_o_points": [],
    "blue_x_points": [
      [0.00295, 3],
      [0.00242, 3],
      [0.00098, 0],
      [0.00344, 0],
      [0.00166, 3],
      [0.00442, 0],
      [0.00173, 0],
      [0.00134, 0],
      [0.00467, 3],
      [0.01001, 1],
      [-0.00216, 0],
      [0.00508, 0],
      [0.00419, 3],
      [0.00133, 3],
      [0.00183, 3],
      [0.00131, 3],
      [0.00402, 3],
      [0.00118, 3],
      [0.00086, 1],
      [0.00212, 3],
      [0.00221, 3]
    ]
  },
  "QA_yonPexPain": {
    "red_x_points": [
      [-0.01166, 1],
      [-0.01298, 1],
      [-0.0109, 1],
      [-0.01111, 1],
      [-0.01216, 1],
      [-0.01159, 1],
      [-0.01214, 1],
      [-0.01126, 1],
      [-0.01328, 1],
      [-0.01363, 1],
      [0.01453, 0],
      [-0.01246, 1],
      [-0.01121, 1],
      [-0.0127, 1],
      [0.01544, 0],
      [-0.01153, 1],
      [-0.01217, 1],
      [-0.01315, 1],
      [-0.01211, 1],
      [-0.01295, 1],
      [-0.01233, 1],
      [-0.01039, 1],
      [-0.01467, 1]
    ],
    "red_o_points": [],
    "y_categories": ["N", "Y", "nan"],
    "blue_o_points": [],
    "blue_x_points": [
      [-0.01063, 1],
      [0.02373, 0],
      [0.01986, 0],
      [0.02238, 0],
      [-0.01039, 1],
      [0.02254, 0],
      [-0.0107, 1],
      [-0.01084, 1],
      [-0.01223, 1],
      [0.0315, 2],
      [0.02653, 0],
      [-0.01262, 1],
      [0.02428, 0],
      [0.02047, 0],
      [0.0198, 0],
      [0.02095, 0],
      [0.03183, 2],
      [0.02303, 0],
      [-0.01045, 1],
      [-0.01291, 1],
      [0.03027, 2]
    ]
  },
  "QS_mulLysisRoot[C6]": {
    "red_x_points": [
      [-0.0035, 1],
      [-0.00075, 0],
      [-0.00901, 2],
      [0.00135, 0],
      [-0.0005, 0],
      [0.00252, 0],
      [0.00051, 3],
      [-0.00429, 1],
      [0.00071, 3],
      [-0.0003, 0],
      [0.00104, 3],
      [-0.00049, 0],
      [0.00066, 3],
      [0.00079, 0],
      [-0.00403, 1],
      [0.0007, 3],
      [-0.0005, 0],
      [0.00094, 3],
      [0.00097, 0],
      [-0.00058, 0],
      [-0.00366, 1],
      [-0.00847, 2],
      [0.00078, 3]
    ],
    "red_o_points": [],
    "y_categories": ["N", "NOT APPLICABLE", "Y", "nan"],
    "blue_o_points": [],
    "blue_x_points": [
      [0.00103, 3],
      [0.0011, 3],
      [0.00019, 0],
      [0.00355, 0],
      [0.00067, 3],
      [0.00247, 0],
      [0.00105, 0],
      [0.00142, 0],
      [0.00089, 3],
      [0.0026, 1],
      [-0.00041, 0],
      [0.00378, 0],
      [0.00091, 3],
      [0.00054, 3],
      [0.00041, 3],
      [0.00027, 3],
      [0.00129, 3],
      [0.00028, 3],
      [0.00186, 1],
      [0.0007, 3],
      [0.00051, 3]
    ]
  },
  "QS_mulGraftLevel[Trunk]": {
    "red_x_points": [
      [-0.00647, 1],
      [-0.00431, 0],
      [-0.00178, 0],
      [-0.00021, 0],
      [-0.00315, 0],
      [0.00021, 0],
      [0.00044, 3],
      [-0.00549, 1],
      [0.00356, 3],
      [-0.01969, 2],
      [0.00125, 3],
      [-0.00419, 0],
      [0.00114, 3],
      [-0.00043, 0],
      [-0.00748, 1],
      [0.00068, 3],
      [-0.00261, 0],
      [0.00218, 3],
      [-0.00209, 0],
      [-0.0041, 0],
      [-0.00671, 1],
      [0.00027, 0],
      [0.0015, 3]
    ],
    "red_o_points": [],
    "y_categories": ["N", "NOT APPLICABLE", "Y", "nan"],
    "blue_o_points": [],
    "blue_x_points": [
      [0.00257, 3],
      [0.00142, 3],
      [0.00193, 0],
      [0.00226, 0],
      [0.00138, 3],
      [0.00308, 0],
      [0.00252, 0],
      [0.00143, 0],
      [0.00562, 3],
      [0.01091, 1],
      [-0.00138, 0],
      [0.00343, 0],
      [0.0051, 3],
      [0.00131, 3],
      [0.00163, 3],
      [0.00089, 3],
      [0.00463, 3],
      [0.00206, 3],
      [0.00157, 1],
      [0.00286, 3],
      [0.00225, 3]
    ]
  },
  "QS_mulGraftNerve[other]": {
    "red_x_points": [
      [-0.00407, 1],
      [-0.00217, 0],
      [-0.0006, 0],
      [0.00015, 0],
      [-0.00143, 0],
      [0.00043, 0],
      [6e-5, 2],
      [-0.00381, 1],
      [0.00121, 2],
      [-0.00197, 0],
      [0.00045, 2],
      [-0.00187, 0],
      [0.00035, 2],
      [-0.00049, 0],
      [-0.00542, 1],
      [0.00037, 2],
      [-0.0015, 0],
      [0.00078, 2],
      [-0.00074, 0],
      [-0.00219, 0],
      [-0.00343, 1],
      [0.0004, 0],
      [0.00053, 2]
    ],
    "red_o_points": [],
    "y_categories": ["N", "NOT APPLICABLE", "nan"],
    "blue_o_points": [],
    "blue_x_points": [
      [0.00107, 2],
      [0.00077, 2],
      [0.00094, 0],
      [0.00112, 0],
      [0.0007, 2],
      [0.00171, 0],
      [0.0009, 0],
      [0.00051, 0],
      [0.00172, 2],
      [0.00545, 1],
      [-0.00088, 0],
      [0.002, 0],
      [0.00192, 2],
      [0.00089, 2],
      [0.00073, 2],
      [0.00038, 2],
      [0.00177, 2],
      [0.00055, 2],
      [0.0009, 1],
      [0.00117, 2],
      [0.00065, 2]
    ]
  },
  "QS_mulTransfSite[AcSsAA]": {
    "red_x_points": [
      [-0.00889, 1],
      [-0.01602, 2],
      [-0.00193, 0],
      [-0.00063, 0],
      [-0.01132, 2],
      [0.0011, 0],
      [-0.00018, 3],
      [-0.01078, 1],
      [0.00558, 3],
      [-0.01814, 2],
      [0.00313, 3],
      [-0.00131, 0],
      [0.00212, 3],
      [-0.00762, 0],
      [-0.01227, 1],
      [0.00056, 3],
      [-0.0095, 2],
      [0.00378, 3],
      [-0.00272, 0],
      [-0.01397, 2],
      [-0.01229, 1],
      [0.00032, 0],
      [0.00238, 3]
    ],
    "red_o_points": [],
    "y_categories": ["N", "NOT APPLICABLE", "Y", "nan"],
    "blue_o_points": [],
    "blue_x_points": [
      [0.00429, 3],
      [0.00344, 3],
      [0.00634, 2],
      [0.00287, 0],
      [0.00347, 3],
      [0.00376, 0],
      [0.01026, 2],
      [0.00047, 0],
      [0.00776, 3],
      [0.01396, 1],
      [0.00554, 0],
      [0.00528, 0],
      [0.00723, 3],
      [0.00323, 3],
      [0.004, 3],
      [0.00315, 3],
      [0.00777, 3],
      [0.00422, 3],
      [0.00307, 1],
      [0.00451, 3],
      [0.00395, 3]
    ]
  },
  "QS_mulGraftNerve[Ax]": {
    "red_x_points": [
      [-0.00134, 1],
      [-0.00078, 0],
      [-0.00021, 0],
      [0.00027, 0],
      [-0.0007, 0],
      [0.0002, 0],
      [-9e-5, 2],
      [-0.0013, 1],
      [0.00039, 2],
      [-0.00047, 0],
      [0.00015, 2],
      [-0.00089, 0],
      [2e-5, 2],
      [-0.00016, 0],
      [-0.00213, 1],
      [-4e-5, 2],
      [-0.00036, 0],
      [0.00016, 2],
      [-0.00026, 0],
      [-0.00094, 0],
      [-0.00076, 1],
      [8e-5, 0],
      [4e-5, 2]
    ],
    "red_o_points": [],
    "y_categories": ["N", "NOT APPLICABLE", "nan"],
    "blue_o_points": [],
    "blue_x_points": [
      [0.00021, 2],
      [8e-5, 2],
      [0.00027, 0],
      [0.00074, 0],
      [0.00013, 2],
      [0.00106, 0],
      [0.00028, 0],
      [7e-5, 0],
      [0.00076, 2],
      [0.00208, 1],
      [-0.00036, 0],
      [0.0008, 0],
      [0.00073, 2],
      [0.00024, 2],
      [0.00022, 2],
      [0.00017, 2],
      [0.00071, 2],
      [0.00026, 2],
      [0.00026, 1],
      [0.00022, 2],
      [0.00018, 2]
    ]
  },
  "QA_lstPexMuscstrength[WristFlex]": {
    "red_x_points": [
      [-0.00074, 0],
      [-0.00218, 2],
      [-0.00834, 1],
      [0.00116, 0],
      [-0.0062, 1],
      [-0.01071, 1],
      [-0.0033, 0],
      [-0.00024, 0],
      [-0.00165, 2],
      [-0.00305, 2],
      [-0.00163, 0],
      [-0.00249, 2],
      [-0.00584, 1],
      [0.00107, 0],
      [0.00095, 0],
      [-0.00192, 1],
      [-0.0058, 1],
      [-0.00405, 0],
      [0.0024, 0],
      [0.00133, 0],
      [-0.001, 2],
      [-0.00665, 1],
      [-0.00544, 2]
    ],
    "red_o_points": [],
    "y_categories": ["GREATER THAN OR EQUALS TO 3", "LESS THAN 3", "nan"],
    "blue_o_points": [],
    "blue_x_points": [
      [0.00556, 1],
      [0.00636, 0],
      [0.0015, 0],
      [0.00388, 0],
      [0.00203, 0],
      [0.00493, 0],
      [0.00307, 0],
      [0.00402, 0],
      [0.00183, 2],
      [0.00065, 2],
      [0.00494, 0],
      [0.00662, 0],
      [0.00168, 2],
      [0.00053, 0],
      [0.00067, 0],
      [0.00161, 0],
      [0.00169, 2],
      [0.00377, 1],
      [0.00111, 0],
      [0.00686, 1],
      [0.00103, 2]
    ]
  },
  "QS_mulNeuromadSite[C5]": {
    "red_x_points": [
      [-0.0022, 1],
      [-0.00164, 0],
      [-0.00078, 0],
      [4e-5, 0],
      [-0.00089, 0],
      [0.0, 0],
      [5e-5, 2],
      [-0.00224, 1],
      [0.00071, 2],
      [-0.00087, 0],
      [0.00023, 2],
      [-0.00151, 0],
      [8e-5, 2],
      [-0.00034, 0],
      [-0.00351, 1],
      [0.00012, 2],
      [-0.00104, 0],
      [0.00015, 2],
      [-0.00039, 0],
      [-0.00173, 0],
      [-0.00257, 1],
      [0.0001, 0],
      [0.00012, 2]
    ],
    "red_o_points": [],
    "y_categories": ["N", "NOT APPLICABLE", "nan"],
    "blue_o_points": [],
    "blue_x_points": [
      [0.00093, 2],
      [0.00057, 2],
      [0.00042, 0],
      [0.00056, 0],
      [0.00033, 2],
      [0.00123, 0],
      [0.00067, 0],
      [0.00044, 0],
      [0.00154, 2],
      [0.00397, 1],
      [-0.00058, 0],
      [0.0012, 0],
      [0.0012, 2],
      [0.0006, 2],
      [0.00075, 2],
      [0.00041, 2],
      [0.00132, 2],
      [0.00073, 2],
      [0.00051, 1],
      [0.00079, 2],
      [0.0005, 2]
    ]
  },
  "QS_mulNeuromadSite[C7]": {
    "red_x_points": [
      [-0.00616, 1],
      [-0.00487, 0],
      [-0.00221, 0],
      [-0.00044, 0],
      [-0.00255, 0],
      [0.00079, 0],
      [0.00022, 2],
      [-0.0078, 1],
      [0.00247, 2],
      [-0.00293, 0],
      [0.00113, 2],
      [-0.00413, 0],
      [0.00083, 2],
      [-0.00066, 0],
      [-0.01171, 1],
      [0.00023, 2],
      [-0.00326, 0],
      [0.00128, 2],
      [-0.00215, 0],
      [-0.00536, 0],
      [-0.00733, 1],
      [0.00071, 0],
      [0.00102, 2]
    ],
    "red_o_points": [],
    "y_categories": ["N", "NOT APPLICABLE", "nan"],
    "blue_o_points": [],
    "blue_x_points": [
      [0.00253, 2],
      [0.00152, 2],
      [0.00159, 0],
      [0.0034, 0],
      [0.00098, 2],
      [0.00334, 0],
      [0.00195, 0],
      [0.00112, 0],
      [0.00377, 2],
      [0.01222, 1],
      [-0.00216, 0],
      [0.00243, 0],
      [0.00375, 2],
      [0.00189, 2],
      [0.00202, 2],
      [0.00107, 2],
      [0.00393, 2],
      [0.00168, 2],
      [0.00192, 1],
      [0.00237, 2],
      [0.00155, 2]
    ]
  },
  "QS_mulGraftNerve[TD]": {
    "red_x_points": [
      [-0.00114, 1],
      [-0.00104, 0],
      [-0.00028, 0],
      [-0.00017, 0],
      [-0.00051, 0],
      [0.00019, 0],
      [-0.00016, 2],
      [-0.00106, 1],
      [0.0004, 2],
      [-0.00065, 0],
      [6e-5, 2],
      [-0.00059, 0],
      [0.0001, 2],
      [-0.00012, 0],
      [-0.00214, 1],
      [-2e-5, 2],
      [-0.0007, 0],
      [9e-5, 2],
      [-9e-5, 0],
      [-0.00076, 0],
      [-0.00094, 1],
      [3e-5, 0],
      [6e-5, 2]
    ],
    "red_o_points": [],
    "y_categories": ["N", "NOT APPLICABLE", "nan"],
    "blue_o_points": [],
    "blue_x_points": [
      [0.00042, 2],
      [0.00022, 2],
      [0.00022, 0],
      [0.00097, 0],
      [8e-5, 2],
      [0.00071, 0],
      [0.00035, 0],
      [0.00016, 0],
      [0.00079, 2],
      [0.00243, 1],
      [-0.00019, 0],
      [0.00065, 0],
      [0.00062, 2],
      [0.0002, 2],
      [0.00015, 2],
      [0.00012, 2],
      [0.00055, 2],
      [0.00029, 2],
      [0.00027, 1],
      [0.00029, 2],
      [0.00017, 2]
    ]
  },
  "QA_intPexForearmSupin": {
    "red_x_points": [
      [-0.00044, 2],
      [-0.00859, 0],
      [-0.00077, 2],
      [-0.00064, 2],
      [-0.00063, 2],
      [-0.0006, 2],
      [-0.02114, 0],
      [-0.01274, 0],
      [-0.00073, 2],
      [-0.00059, 2],
      [-0.00115, 2],
      [-4e-5, 2],
      [-0.00133, 2],
      [0.0047, 1],
      [-0.00062, 2],
      [-0.01688, 0],
      [0.00084, 1],
      [-0.00074, 2],
      [-0.00081, 2],
      [-0.00065, 2],
      [0.00424, 1],
      [-0.01, 0],
      [-0.00147, 2]
    ],
    "red_o_points": [],
    "y_categories": ["GREATER THAN OR EQUALS TO 80", "LESS THAN 80", "nan"],
    "blue_o_points": [],
    "blue_x_points": [
      [-0.00028, 2],
      [0.01434, 1],
      [0.00587, 1],
      [0.0108, 1],
      [0.01032, 1],
      [-0.0001, 2],
      [-5e-5, 2],
      [8e-5, 2],
      [-0.00032, 2],
      [-2e-5, 2],
      [0.00256, 0],
      [-0.00011, 2],
      [-0.0002, 2],
      [0.00905, 1],
      [0.00858, 1],
      [-0.0003, 2],
      [-0.00036, 2],
      [1e-5, 2],
      [-6e-5, 2],
      [0.01117, 1],
      [-0.00017, 2]
    ]
  },
  "QS_mulGraftNerve[SS]": {
    "red_x_points": [
      [-0.0004, 1],
      [-0.00043, 0],
      [-9e-5, 0],
      [2e-5, 0],
      [-0.0002, 0],
      [8e-5, 0],
      [3e-5, 2],
      [-0.00039, 1],
      [0.0002, 2],
      [-0.00027, 0],
      [7e-5, 2],
      [-0.00032, 0],
      [2e-5, 2],
      [3e-5, 0],
      [-0.0005, 1],
      [3e-5, 2],
      [-0.00032, 0],
      [0.0001, 2],
      [-0.00012, 0],
      [-0.00031, 0],
      [-0.00052, 1],
      [5e-5, 0],
      [-7e-5, 2]
    ],
    "red_o_points": [],
    "y_categories": ["N", "NOT APPLICABLE", "nan"],
    "blue_o_points": [],
    "blue_x_points": [
      [0.00017, 2],
      [5e-5, 2],
      [5e-5, 0],
      [8e-5, 0],
      [0.00012, 0],
      [8e-5, 0],
      [3e-5, 0],
      [0.00031, 2],
      [0.00093, 1],
      [-0.00017, 0],
      [0.00039, 0],
      [0.00029, 2],
      [0.00012, 2],
      [0.0002, 2],
      [7e-5, 2],
      [0.00034, 2],
      [7e-5, 2],
      [0.0001, 2],
      [7e-5, 2]
    ]
  },
  "QS_mulGraftNerve[MCF]": {
    "red_x_points": [[-0.00013, 1], [4e-5, 0], [1e-5, 2], [-0.00013, 1]],
    "red_o_points": [],
    "y_categories": ["N", "NOT APPLICABLE", "nan"],
    "blue_o_points": [],
    "blue_x_points": [
      [1e-5, 2],
      [4e-5, 0],
      [4e-5, 0],
      [4e-5, 0],
      [4e-5, 0],
      [4e-5, 0],
      [1e-5, 2]
    ]
  },
  "QA_lstPexTouch[C5]": {
    "red_x_points": [
      [-0.00176, 0],
      [-0.00034, 2],
      [-0.00158, 1],
      [-0.00071, 1],
      [-0.0009, 2],
      [-0.0005, 1],
      [-0.001, 1],
      [-0.00383, 1],
      [-0.00098, 2],
      [-0.00073, 2],
      [-0.00239, 1],
      [-8e-5, 2],
      [-0.00292, 1],
      [-0.00132, 1],
      [-0.00391, 1],
      [-0.00082, 1],
      [-0.00082, 2],
      [-0.00349, 1],
      [-0.00128, 1],
      [-0.00128, 2],
      [-0.00261, 1],
      [-0.00023, 1],
      [-0.00286, 1]
    ],
    "red_o_points": [],
    "y_categories": ["NORM", "NPV", "nan"],
    "blue_o_points": [],
    "blue_x_points": [
      [-0.00147, 1],
      [-0.00214, 1],
      [-0.00038, 1],
      [-0.00032, 1],
      [0.01341, 0],
      [-0.00036, 1],
      [-0.00012, 1],
      [-0.00036, 1],
      [0.00146, 2],
      [0.0048, 2],
      [0.00052, 2],
      [-0.00046, 1],
      [0.00155, 2],
      [-0.00074, 1],
      [0.00545, 0],
      [-0.00085, 1],
      [0.00149, 2],
      [0.00574, 0],
      [0.01117, 0],
      [-0.00078, 1],
      [-0.00126, 1]
    ]
  },
  "QS_mulLysisSite[Nerve]": {
    "red_x_points": [
      [-0.00585, 1],
      [-0.00132, 0],
      [-0.00966, 2],
      [-0.02072, 2],
      [-0.00078, 0],
      [0.0021, 0],
      [0.0005, 3],
      [-0.0071, 1],
      [0.00129, 3],
      [-0.00105, 0],
      [0.00146, 3],
      [-0.00136, 0],
      [0.00115, 3],
      [0.00053, 0],
      [-0.00676, 1],
      [0.00049, 3],
      [-0.00104, 0],
      [0.00133, 3],
      [0.00121, 0],
      [-0.00112, 0],
      [-0.00702, 1],
      [0.0016, 0],
      [0.0012, 3]
    ],
    "red_o_points": [],
    "y_categories": ["N", "NOT APPLICABLE", "Y", "nan"],
    "blue_o_points": [],
    "blue_x_points": [
      [0.00296, 3],
      [0.00191, 3],
      [0.00167, 0],
      [0.00431, 0],
      [0.0016, 3],
      [0.0037, 0],
      [0.00226, 0],
      [0.00433, 0],
      [0.00145, 3],
      [0.00427, 1],
      [-0.00073, 0],
      [0.00415, 0],
      [0.00142, 3],
      [0.00251, 3],
      [0.00272, 3],
      [0.0019, 3],
      [0.00204, 3],
      [0.00178, 3],
      [0.00128, 1],
      [0.0034, 3],
      [0.002, 3]
    ]
  },
  "QA_lstPexMuscstrength[ElbowExte]": {
    "red_x_points": [
      [-0.00413, 2],
      [-0.00394, 2],
      [-0.00337, 1],
      [-0.00254, 1],
      [-0.00589, 1],
      [-0.00303, 1],
      [-0.00336, 1],
      [0.00114, 0],
      [-0.00222, 2],
      [-0.00751, 2],
      [-0.00476, 1],
      [-0.005, 2],
      [-0.00049, 1],
      [-0.00625, 1],
      [3e-5, 0],
      [-0.00141, 1],
      [-0.00525, 1],
      [-0.00612, 0],
      [-0.00674, 1],
      [-0.00419, 2],
      [-0.00213, 2],
      [-0.00168, 1],
      [-0.00449, 2]
    ],
    "red_o_points": [],
    "y_categories": ["GREATER THAN OR EQUALS TO 3", "LESS THAN 3", "nan"],
    "blue_o_points": [],
    "blue_x_points": [
      [9e-5, 1],
      [0.00027, 1],
      [0.00752, 0],
      [-0.00266, 1],
      [0.00019, 1],
      [0.01344, 0],
      [0.01302, 0],
      [-0.00219, 1],
      [0.00013, 2],
      [-0.0004, 2],
      [0.01845, 0],
      [0.00114, 1],
      [0.00079, 2],
      [0.00685, 0],
      [0.00528, 0],
      [0.00684, 0],
      [0.00045, 2],
      [0.00442, 0],
      [0.00525, 0],
      [0.00193, 1],
      [0.00253, 1]
    ]
  },
  "QA_lstPexMuscstrength[FingersAddu]": {
    "red_x_points": [
      [0.00045, 2],
      [6e-5, 2],
      [-0.01981, 1],
      [-0.00046, 2],
      [-0.0171, 1],
      [-0.02164, 1],
      [0.00667, 0],
      [0.00683, 0],
      [0.00027, 2],
      [0.00047, 2],
      [0.00487, 0],
      [0.00058, 2],
      [-0.01885, 1],
      [0.00682, 0],
      [0.00674, 0],
      [-0.01628, 1],
      [-0.01621, 1],
      [0.00051, 2],
      [-0.0007, 2],
      [-0.01632, 1],
      [-0.00023, 2],
      [-0.01661, 1],
      [-0.00182, 2]
    ],
    "red_o_points": [],
    "y_categories": ["GREATER THAN OR EQUALS TO 3", "LESS THAN 3", "nan"],
    "blue_o_points": [],
    "blue_x_points": [
      [0.0131, 0],
      [-0.00548, 1],
      [0.0071, 0],
      [0.01121, 0],
      [0.01151, 0],
      [0.01234, 0],
      [0.00189, 2],
      [0.01271, 0],
      [0.00087, 2],
      [0.00162, 2],
      [0.0017, 2],
      [0.00222, 2],
      [0.00183, 2],
      [0.00787, 0],
      [0.0074, 0],
      [0.00892, 0],
      [0.00193, 2],
      [0.00136, 2],
      [0.00975, 0],
      [0.00114, 2],
      [0.00073, 2]
    ]
  },
  "QA_equInjTbpiTime": {
    "red_x_points": [
      [-0.01245, 0],
      [-0.01117, 0],
      [0.00217, 3],
      [0.00212, 3],
      [-0.01026, 0],
      [-0.00907, 0],
      [-0.0103, 0],
      [-0.01129, 0],
      [0.00197, 3],
      [-0.01146, 0],
      [-0.01105, 0],
      [-0.01118, 0],
      [0.00038, 3],
      [0.00056, 3],
      [-0.01161, 0],
      [-0.00898, 0],
      [-0.01387, 2],
      [-0.02468, 2],
      [-0.01041, 0],
      [-0.01648, 2],
      [-0.01156, 0],
      [0.00196, 3],
      [0.01164, 1]
    ],
    "red_o_points": [],
    "y_categories": [
      "0 TO 6 MONTHS",
      "13 TO 24 MONTHS",
      "25 MONTHS OR MORE",
      "7 TO 12 MONTHS",
      "nan"
    ],
    "blue_o_points": [],
    "blue_x_points": [
      [-0.00715, 0],
      [0.02383, 1],
      [-0.00694, 0],
      [0.02844, 1],
      [0.00508, 3],
      [-0.00773, 0],
      [-0.00627, 0],
      [0.00422, 3],
      [-0.00715, 0],
      [-0.00205, 2],
      [0.02931, 1],
      [0.00762, 3],
      [0.02617, 1],
      [0.00502, 3],
      [0.02227, 1],
      [0.02094, 1],
      [0.00709, 3],
      [0.02181, 1],
      [0.00844, 3],
      [0.00644, 3],
      [-0.00435, 0]
    ]
  },
  "QS_mulTransfSite[IMc]": {
    "red_x_points": [
      [-0.01088, 1],
      [-0.02346, 2],
      [0.001, 0],
      [-0.02926, 2],
      [-0.00194, 0],
      [0.00393, 0],
      [0.00232, 3],
      [-0.01342, 1],
      [0.00734, 3],
      [-0.00173, 0],
      [0.00418, 3],
      [-0.02117, 2],
      [0.00393, 3],
      [0.00183, 0],
      [-0.01696, 1],
      [0.00287, 3],
      [-0.00399, 0],
      [0.00449, 3],
      [0.00054, 0],
      [-0.02254, 2],
      [-0.01451, 1],
      [-0.01385, 2],
      [0.00431, 3]
    ],
    "red_o_points": [],
    "y_categories": ["N", "NOT APPLICABLE", "Y", "nan"],
    "blue_o_points": [],
    "blue_x_points": [
      [0.00676, 3],
      [0.00531, 3],
      [0.00441, 0],
      [0.00803, 0],
      [0.0053, 3],
      [0.00799, 0],
      [0.00566, 0],
      [0.00671, 0],
      [0.01041, 3],
      [0.01217, 1],
      [0.0013, 0],
      [0.00858, 0],
      [0.00854, 3],
      [0.00613, 3],
      [0.00612, 3],
      [0.00537, 3],
      [0.00955, 3],
      [0.00527, 3],
      [0.00082, 1],
      [0.0071, 3],
      [0.00546, 3]
    ]
  },
  "QA_lstPexTouch[T1]": {
    "red_x_points": [
      [-0.00836, 1],
      [-0.00228, 2],
      [-0.00548, 1],
      [0.00589, 0],
      [-0.00268, 2],
      [-0.00687, 1],
      [0.00454, 0],
      [-0.00956, 1],
      [-0.00208, 2],
      [-0.00369, 2],
      [-0.00933, 1],
      [-0.00258, 2],
      [-0.0061, 1],
      [-0.01207, 1],
      [-0.00949, 1],
      [-0.0054, 1],
      [-0.00234, 2],
      [0.00032, 0],
      [-0.00836, 1],
      [-0.00295, 2],
      [-0.01104, 1],
      [-0.00473, 1],
      [-0.0078, 1]
    ],
    "red_o_points": [],
    "y_categories": ["NORM", "NPV", "nan"],
    "blue_o_points": [],
    "blue_x_points": [
      [-0.0049, 1],
      [-0.00463, 1],
      [0.01178, 0],
      [-0.00476, 1],
      [-0.0044, 1],
      [0.01729, 0],
      [0.01586, 0],
      [0.01405, 0],
      [0.00081, 2],
      [0.00337, 2],
      [-0.00078, 2],
      [-0.00452, 1],
      [0.00191, 2],
      [0.00968, 0],
      [0.00898, 0],
      [0.01049, 0],
      [0.00301, 2],
      [-0.00399, 1],
      [0.01715, 0],
      [0.01215, 0],
      [0.01388, 0]
    ]
  },
  "QA_lstPexArthre[Elbow]": {
    "red_x_points": [
      [-0.00034, 2],
      [-0.00115, 3],
      [-0.00123, 3],
      [0.00034, 2],
      [-0.00593, 0],
      [-0.00837, 1],
      [-0.00287, 2],
      [-0.00061, 2],
      [-0.00062, 3],
      [0.00114, 2],
      [-0.00132, 3],
      [-0.00117, 3],
      [-0.00171, 3],
      [0.00058, 2],
      [-0.00049, 2],
      [-0.00436, 2],
      [-0.00095, 3],
      [-0.00125, 3],
      [-0.00334, 3],
      [-0.00095, 3],
      [-0.0005, 3],
      [0.00028, 2],
      [-0.00231, 3]
    ],
    "red_o_points": [],
    "y_categories": ["NAIA", "NPV", "PV", "nan"],
    "blue_o_points": [],
    "blue_x_points": [
      [0.01675, 1],
      [-0.00061, 3],
      [0.00135, 2],
      [0.00255, 2],
      [0.00015, 3],
      [0.00435, 2],
      [0.00197, 2],
      [0.00224, 2],
      [-0.00011, 3],
      [-0.00014, 3],
      [-0.00051, 3],
      [0.00457, 2],
      [-0.00022, 3],
      [0.00015, 2],
      [0.0003, 2],
      [0.00314, 1],
      [-0.00019, 3],
      [0.0002, 2],
      [6e-5, 3],
      [0.00058, 2],
      [0.00051, 2]
    ]
  },
  "QS_mulTransfSite[AcMc]": {
    "red_x_points": [
      [-0.00826, 1],
      [-0.00658, 0],
      [-0.00343, 0],
      [-0.00515, 0],
      [-0.0034, 0],
      [-0.00137, 0],
      [0.00105, 3],
      [-0.00882, 1],
      [0.00321, 3],
      [-0.00453, 0],
      [0.00145, 3],
      [-0.00433, 0],
      [0.00193, 3],
      [-0.00355, 0],
      [-0.01229, 1],
      [0.0012, 3],
      [-0.00369, 0],
      [0.00183, 3],
      [-0.0041, 0],
      [-0.00459, 0],
      [-0.00911, 1],
      [-0.00097, 0],
      [0.00185, 3]
    ],
    "red_o_points": [],
    "y_categories": ["N", "NOT APPLICABLE", "Y", "nan"],
    "blue_o_points": [],
    "blue_x_points": [
      [0.00354, 3],
      [0.00304, 3],
      [0.00055, 0],
      [0.00152, 0],
      [0.00323, 3],
      [0.00088, 0],
      [0.00088, 0],
      [0.02123, 2],
      [0.00408, 3],
      [0.00785, 1],
      [-0.00203, 0],
      [0.0011, 0],
      [0.00323, 3],
      [0.00232, 3],
      [0.00336, 3],
      [0.00271, 3],
      [0.00372, 3],
      [0.00263, 3],
      [0.00143, 1],
      [0.00391, 3],
      [0.00246, 3]
    ]
  },
  "QS_mulTransfSite[Other]": {
    "red_x_points": [
      [-0.00619, 1],
      [-0.00203, 0],
      [-0.00037, 0],
      [0.0002, 0],
      [-0.00151, 0],
      [0.0008, 0],
      [-0.0001, 3],
      [-0.00746, 1],
      [0.00136, 3],
      [-0.00113, 0],
      [0.00131, 3],
      [-0.00156, 0],
      [0.00071, 3],
      [-0.03031, 2],
      [-0.00779, 1],
      [0.00075, 3],
      [-0.00165, 0],
      [0.00072, 3],
      [0.00024, 0],
      [-0.00209, 0],
      [-0.00464, 1],
      [0.00034, 0],
      [0.00053, 3]
    ],
    "red_o_points": [],
    "y_categories": ["N", "NOT APPLICABLE", "Y", "nan"],
    "blue_o_points": [],
    "blue_x_points": [
      [0.00294, 3],
      [0.00208, 3],
      [0.00395, 0],
      [0.00467, 0],
      [0.00261, 3],
      [0.00363, 0],
      [0.00679, 0],
      [0.00404, 0],
      [0.00217, 3],
      [0.0047, 1],
      [-0.00067, 0],
      [0.00321, 0],
      [0.00186, 3],
      [0.00316, 3],
      [0.0032, 3],
      [0.00201, 3],
      [0.00232, 3],
      [0.00229, 3],
      [-3e-5, 1],
      [0.00284, 3],
      [0.00208, 3]
    ]
  },
  "QA_yonInjBpsurg": {
    "red_x_points": [
      [-0.00733, 0],
      [0.00043, 1],
      [7e-5, 1],
      [0.00089, 1],
      [0.00017, 1],
      [0.00089, 1],
      [0.00053, 1],
      [-0.00763, 0],
      [0.00023, 1],
      [0.00062, 1],
      [0.00048, 1],
      [0.00035, 1],
      [0.00051, 1],
      [0.00088, 1],
      [-0.0104, 0],
      [0.0005, 1],
      [-0.00085, 1],
      [-0.00108, 1],
      [0.00058, 1],
      [-0.00117, 1],
      [-0.01045, 0],
      [0.00028, 1],
      [0.00075, 1]
    ],
    "red_o_points": [],
    "y_categories": ["N", "Y", "nan"],
    "blue_o_points": [],
    "blue_x_points": [
      [0.00225, 1],
      [0.00146, 1],
      [0.00201, 1],
      [0.00183, 1],
      [0.00066, 1],
      [0.00244, 1],
      [0.00201, 1],
      [0.00146, 1],
      [0.00093, 1],
      [0.00287, 0],
      [0.00028, 1],
      [0.00198, 1],
      [0.00056, 1],
      [0.00156, 1],
      [0.00172, 1],
      [0.00127, 1],
      [0.00023, 1],
      [0.0019, 1],
      [-0.00044, 0],
      [0.00221, 1],
      [0.00154, 1]
    ]
  },
  "QA_lstPexTouch[C8]": {
    "red_x_points": [
      [0.00689, 0],
      [-0.00301, 2],
      [-0.00871, 1],
      [-0.01264, 1],
      [-0.00253, 2],
      [-0.00736, 1],
      [-0.00956, 1],
      [-0.01052, 1],
      [-0.00347, 2],
      [-0.00439, 2],
      [-0.01241, 1],
      [-0.00271, 2],
      [-0.01201, 1],
      [0.00953, 0],
      [-0.0103, 1],
      [-0.00891, 1],
      [-0.00282, 2],
      [0.0062, 0],
      [-0.00891, 1],
      [-0.00415, 2],
      [-0.01263, 1],
      [-0.00808, 1],
      [-0.01332, 1]
    ],
    "red_o_points": [],
    "y_categories": ["NORM", "NPV", "nan"],
    "blue_o_points": [],
    "blue_x_points": [
      [-0.00907, 1],
      [-0.00838, 1],
      [0.01364, 0],
      [-0.00704, 1],
      [0.01767, 0],
      [-0.00625, 1],
      [0.0168, 0],
      [0.01733, 0],
      [0.00027, 2],
      [0.00191, 2],
      [-0.00081, 2],
      [-0.00644, 1],
      [0.00202, 2],
      [0.0132, 0],
      [0.01251, 0],
      [0.01372, 0],
      [0.00156, 2],
      [0.01217, 0],
      [0.0161, 0],
      [0.01826, 0],
      [0.01665, 0]
    ]
  },
  "QS_mulLysisNerve[Ssr]": {
    "red_x_points": [
      [-0.00524, 1],
      [-0.00127, 0],
      [-0.00946, 2],
      [-0.01963, 2],
      [-0.00079, 0],
      [0.00185, 0],
      [0.00086, 3],
      [-0.00591, 1],
      [0.00124, 3],
      [-0.00096, 0],
      [0.00104, 3],
      [-0.00105, 0],
      [0.00101, 3],
      [0.00054, 0],
      [-0.00518, 1],
      [0.00067, 3],
      [-0.00098, 0],
      [0.00158, 3],
      [0.00072, 0],
      [-0.00093, 0],
      [-0.00691, 1],
      [0.00179, 0],
      [0.00105, 3]
    ],
    "red_o_points": [],
    "y_categories": ["N", "NOT APPLICABLE", "Y", "nan"],
    "blue_o_points": [],
    "blue_x_points": [
      [0.00197, 3],
      [0.00177, 3],
      [0.00175, 0],
      [0.00392, 0],
      [0.00177, 3],
      [0.00333, 0],
      [0.00214, 0],
      [0.00468, 0],
      [0.00152, 3],
      [0.00316, 1],
      [-0.0002, 0],
      [0.00332, 0],
      [0.00152, 3],
      [0.0019, 3],
      [0.00198, 3],
      [0.00147, 3],
      [0.00178, 3],
      [0.00196, 3],
      [0.00094, 1],
      [0.00348, 3],
      [0.0018, 3]
    ]
  },
  "QS_mulBpsurgeryType[Graft]": {
    "red_x_points": [
      [-0.00433, 1],
      [-0.00138, 0],
      [-0.00037, 0],
      [0.00045, 0],
      [-0.00097, 0],
      [0.00025, 0],
      [0.00059, 3],
      [-0.00425, 1],
      [0.00199, 3],
      [-0.01505, 2],
      [0.00068, 3],
      [-0.00162, 0],
      [0.00027, 3],
      [0.00045, 0],
      [-0.00486, 1],
      [0.00037, 3],
      [-0.00099, 0],
      [0.00094, 3],
      [-0.00027, 0],
      [-0.00181, 0],
      [-0.00193, 1],
      [0.00017, 0],
      [0.00062, 3]
    ],
    "red_o_points": [],
    "y_categories": ["N", "NOT APPLICABLE", "Y", "nan"],
    "blue_o_points": [],
    "blue_x_points": [
      [0.00113, 3],
      [0.00039, 3],
      [0.00139, 0],
      [0.00192, 0],
      [0.00054, 3],
      [0.00252, 0],
      [0.00183, 0],
      [0.00136, 0],
      [0.00237, 3],
      [0.00471, 1],
      [-0.00048, 0],
      [0.00273, 0],
      [0.00197, 3],
      [0.0006, 3],
      [0.00065, 3],
      [0.00045, 3],
      [0.00223, 3],
      [0.00137, 3],
      [0.00036, 1],
      [0.00123, 3],
      [0.00175, 3]
    ]
  },
  "QA_lstPexTinel[TinelSign]": {
    "red_x_points": [
      [0.00094, 1],
      [-0.00047, 1],
      [-0.00893, 2],
      [0.00194, 1],
      [0.00052, 1],
      [0.00084, 1],
      [-0.01228, 2],
      [-0.01109, 2],
      [-0.00455, 1],
      [0.0001, 1],
      [-0.01548, 2],
      [-0.00722, 2],
      [-0.0003, 1],
      [-0.01348, 2],
      [0.00189, 1],
      [-0.00948, 2],
      [0.00056, 1],
      [-0.00171, 1],
      [-0.01305, 2],
      [-0.0089, 2],
      [-0.00012, 1],
      [-0.00698, 2],
      [-0.00041, 1]
    ],
    "red_o_points": [],
    "y_categories": ["ABS", "NAIA", "PT", "nan"],
    "blue_o_points": [],
    "blue_x_points": [
      [0.00604, 1],
      [0.0307, 0],
      [0.01569, 0],
      [-0.0078, 2],
      [0.00428, 1],
      [0.00525, 1],
      [-0.00581, 2],
      [0.00442, 1],
      [0.00443, 2],
      [0.00154, 1],
      [0.00504, 1],
      [0.00454, 1],
      [0.0006, 1],
      [0.01899, 0],
      [0.00415, 1],
      [0.00303, 1],
      [0.00206, 2],
      [0.00202, 1],
      [0.0047, 1],
      [0.00208, 1],
      [0.00173, 1]
    ]
  },
  "QS_mulLysisRoot[C5]": {
    "red_x_points": [
      [-0.00353, 1],
      [-0.00119, 0],
      [-0.01113, 2],
      [0.0013, 0],
      [-0.00098, 0],
      [0.00212, 0],
      [0.00087, 3],
      [-0.00543, 1],
      [0.00127, 3],
      [-0.00089, 0],
      [0.00111, 3],
      [-0.00103, 0],
      [0.00108, 3],
      [0.00027, 0],
      [-0.00571, 1],
      [0.00081, 3],
      [-0.00068, 0],
      [0.00132, 3],
      [0.0004, 0],
      [-0.00118, 0],
      [-0.00417, 1],
      [-0.00799, 2],
      [0.00095, 3]
    ],
    "red_o_points": [],
    "y_categories": ["N", "NOT APPLICABLE", "Y", "nan"],
    "blue_o_points": [],
    "blue_x_points": [
      [0.00176, 3],
      [0.00146, 3],
      [0.00073, 0],
      [0.0036, 0],
      [0.00102, 3],
      [0.00273, 0],
      [0.00133, 0],
      [0.00128, 0],
      [0.00145, 3],
      [0.00374, 1],
      [-0.00021, 0],
      [0.00341, 0],
      [0.00115, 3],
      [0.00101, 3],
      [0.00051, 3],
      [0.00043, 3],
      [0.00216, 3],
      [0.00081, 3],
      [0.0019, 1],
      [0.00133, 3],
      [0.00082, 3]
    ]
  },
  "QS_mulNeuromadSite[C6]": {
    "red_x_points": [
      [-0.00393, 1],
      [-0.00242, 0],
      [-0.00069, 0],
      [-0.00037, 0],
      [-0.00111, 0],
      [0.00044, 0],
      [-0.00028, 2],
      [-0.00429, 1],
      [0.00126, 2],
      [-0.00199, 0],
      [0.00074, 2],
      [-0.00181, 0],
      [0.00034, 2],
      [-0.0, 0],
      [-0.00695, 1],
      [0.00011, 2],
      [-0.00137, 0],
      [0.00041, 2],
      [-0.00144, 0],
      [-0.00235, 0],
      [-0.00482, 1],
      [0.0003, 0],
      [0.00038, 2]
    ],
    "red_o_points": [],
    "y_categories": ["N", "NOT APPLICABLE", "nan"],
    "blue_o_points": [],
    "blue_x_points": [
      [0.00149, 2],
      [0.00109, 2],
      [0.00102, 0],
      [0.00164, 0],
      [0.0011, 2],
      [0.00181, 0],
      [0.0009, 0],
      [0.00071, 0],
      [0.00171, 2],
      [0.00556, 1],
      [-0.00097, 0],
      [0.00166, 0],
      [0.0015, 2],
      [0.00109, 2],
      [0.00148, 2],
      [0.00087, 2],
      [0.00207, 2],
      [0.0013, 2],
      [0.00103, 1],
      [0.00181, 2],
      [0.00097, 2]
    ]
  },
  "QS_mulNeuromadSite[T1]": {
    "red_x_points": [
      [-0.00274, 1],
      [-0.00109, 0],
      [-0.00046, 0],
      [-0.0002, 0],
      [-0.00086, 0],
      [0.0005, 0],
      [5e-5, 2],
      [-0.00265, 1],
      [0.00067, 2],
      [-0.00092, 0],
      [9e-5, 2],
      [-0.00119, 0],
      [2e-5, 2],
      [-0.00026, 0],
      [-0.00472, 1],
      [5e-5, 2],
      [-0.00101, 0],
      [-0.00018, 2],
      [-0.00055, 0],
      [-0.00135, 0],
      [-0.0016, 1],
      [0.00015, 0],
      [1e-5, 2]
    ],
    "red_o_points": [],
    "y_categories": ["N", "NOT APPLICABLE", "nan"],
    "blue_o_points": [],
    "blue_x_points": [
      [0.00082, 2],
      [0.00053, 2],
      [0.00068, 0],
      [0.00095, 0],
      [0.00046, 2],
      [0.0015, 0],
      [0.00068, 0],
      [0.00039, 0],
      [0.00097, 2],
      [0.00335, 1],
      [-0.00037, 0],
      [0.00161, 0],
      [0.00106, 2],
      [0.00062, 2],
      [0.00082, 2],
      [0.00029, 2],
      [0.00086, 2],
      [0.00048, 2],
      [0.00137, 1],
      [0.0005, 2],
      [0.00071, 2]
    ]
  },
  "QS_mulGraftNerve[LT]": {
    "red_x_points": [
      [-0.00017, 1],
      [-5e-5, 0],
      [1e-5, 0],
      [-1e-5, 0],
      [1e-5, 0],
      [-5e-5, 2],
      [-0.00034, 1],
      [3e-5, 2],
      [-5e-5, 0],
      [6e-5, 2],
      [-5e-5, 0],
      [-1e-5, 0],
      [-0.00018, 1],
      [1e-5, 2],
      [-3e-5, 2],
      [-7e-5, 0],
      [-8e-5, 0],
      [-0.00017, 1],
      [0.0, 2]
    ],
    "red_o_points": [],
    "y_categories": ["N", "NOT APPLICABLE", "nan"],
    "blue_o_points": [],
    "blue_x_points": [
      [9e-5, 2],
      [6e-5, 2],
      [0.00025, 0],
      [-1e-5, 0],
      [1e-5, 0],
      [-1e-5, 0],
      [3e-5, 2],
      [0.00024, 1],
      [-5e-5, 0],
      [0.00024, 0],
      [3e-5, 2],
      [7e-5, 2],
      [6e-5, 2],
      [3e-5, 2],
      [0.0001, 2],
      [0.0, 2]
    ]
  },
  "QA_lstPexMuscstrength[ShoulderAbduc]": {
    "red_x_points": [
      [-0.0008, 2],
      [9e-5, 1],
      [0.00021, 1],
      [0.00067, 1],
      [0.00014, 1],
      [0.00055, 1],
      [0.00064, 1],
      [-0.01467, 0],
      [-0.00024, 2],
      [-0.00053, 2],
      [-0.00317, 2],
      [-0.00015, 2],
      [0.00049, 1],
      [0.00111, 1],
      [-0.01946, 0],
      [0.00013, 1],
      [0.00018, 1],
      [0.00025, 1],
      [0.00091, 1],
      [0.00044, 1],
      [-0.00092, 2],
      [0.00026, 1],
      [-0.00075, 2]
    ],
    "red_o_points": [],
    "y_categories": ["GREATER THAN OR EQUALS TO 3", "LESS THAN 3", "nan"],
    "blue_o_points": [],
    "blue_x_points": [
      [0.00227, 1],
      [0.00178, 1],
      [0.00233, 1],
      [0.00218, 1],
      [0.00183, 1],
      [0.00308, 1],
      [0.00166, 1],
      [0.00113, 1],
      [0.00027, 2],
      [0.00069, 2],
      [0.00099, 1],
      [0.00071, 2],
      [0.00066, 2],
      [0.00201, 1],
      [0.00218, 1],
      [-0.00014, 2],
      [0.00015, 2],
      [0.00163, 1],
      [0.00799, 1],
      [0.00036, 1],
      [0.00087, 1]
    ]
  },
  "QA_lstPexMuscstrength[ThumbOppo]": {
    "red_x_points": [
      [0.00059, 2],
      [-1e-5, 2],
      [-0.0116, 1],
      [-0.0217, 1],
      [-0.00905, 1],
      [-0.01354, 1],
      [-0.00092, 0],
      [0.00235, 0],
      [0.00036, 2],
      [0.0002, 2],
      [-0.00335, 0],
      [0.00026, 2],
      [-0.01018, 1],
      [0.00454, 0],
      [0.00169, 0],
      [-0.00779, 1],
      [-0.0095, 1],
      [0.00098, 2],
      [0.00325, 0],
      [-0.00886, 1],
      [-0.00035, 2],
      [-0.01048, 1],
      [-0.00138, 2]
    ],
    "red_o_points": [],
    "y_categories": ["GREATER THAN OR EQUALS TO 3", "LESS THAN 3", "nan"],
    "blue_o_points": [],
    "blue_x_points": [
      [0.00022, 1],
      [0.00085, 1],
      [0.00565, 0],
      [0.00828, 0],
      [0.00797, 0],
      [0.00875, 0],
      [0.00733, 0],
      [0.0097, 0],
      [0.00164, 2],
      [0.0014, 2],
      [0.00206, 2],
      [0.00807, 2],
      [0.00164, 2],
      [0.00513, 0],
      [0.0047, 0],
      [0.00601, 0],
      [0.00292, 2],
      [0.00159, 2],
      [0.00604, 0],
      [0.00243, 2],
      [0.0021, 2]
    ]
  },
  "QA_lstPexMuscstrength[ShoulderExrot]": {
    "red_x_points": [
      [-0.00093, 2],
      [-0.00022, 2],
      [-0.0144, 0],
      [-0.00069, 2],
      [0.00324, 1],
      [-0.00078, 2],
      [0.00258, 1],
      [-0.02006, 0],
      [-0.00056, 2],
      [-0.00038, 2],
      [-0.00077, 2],
      [-0.00046, 2],
      [-0.00055, 2],
      [0.00398, 1],
      [-0.0251, 0],
      [0.00275, 1],
      [-5e-5, 2],
      [-4e-5, 2],
      [0.00494, 1],
      [-0.01698, 0],
      [-0.00106, 2],
      [0.00231, 1],
      [-0.00065, 2]
    ],
    "red_o_points": [],
    "y_categories": ["GREATER THAN OR EQUALS TO 3", "LESS THAN 3", "nan"],
    "blue_o_points": [],
    "blue_x_points": [
      [0.0089, 1],
      [0.00026, 2],
      [0.00487, 1],
      [0.0057, 1],
      [0.00576, 1],
      [0.00837, 1],
      [0.00613, 1],
      [-1e-5, 2],
      [3e-5, 2],
      [0.00022, 2],
      [0.00044, 2],
      [0.00027, 2],
      [0.0006, 2],
      [0.00532, 1],
      [0.00541, 1],
      [0.00051, 2],
      [0.00036, 2],
      [0.0007, 2],
      [0.01035, 1],
      [-0.00017, 2],
      [-0.00013, 2]
    ]
  },
  "QS_mulNeuromadSite[T2]": {
    "red_x_points": [
      [-0.00266, 1],
      [-0.00159, 0],
      [-0.00042, 0],
      [0.00011, 0],
      [-0.00151, 0],
      [0.00031, 0],
      [-8e-5, 2],
      [-0.00238, 1],
      [0.00091, 2],
      [-0.00154, 0],
      [0.00037, 2],
      [-0.0013, 0],
      [0.00012, 2],
      [-1e-5, 0],
      [-0.00333, 1],
      [0.0001, 2],
      [-0.00096, 0],
      [-0.00011, 2],
      [-0.00017, 0],
      [-0.00155, 0],
      [-0.00238, 1],
      [0.00021, 0],
      [0.00018, 2]
    ],
    "red_o_points": [],
    "y_categories": ["N", "NOT APPLICABLE", "nan"],
    "blue_o_points": [],
    "blue_x_points": [
      [0.0008, 2],
      [0.00048, 2],
      [0.00034, 0],
      [0.00112, 0],
      [0.00029, 2],
      [0.00108, 0],
      [0.00052, 0],
      [0.00039, 0],
      [0.00156, 2],
      [0.00436, 1],
      [-0.00073, 0],
      [0.0015, 0],
      [0.00146, 2],
      [0.00028, 2],
      [0.00039, 2],
      [0.00041, 2],
      [0.00155, 2],
      [0.0007, 2],
      [0.00037, 1],
      [0.00042, 2],
      [0.00037, 2]
    ]
  },
  "QS_mulTransfSite[IAx]": {
    "red_x_points": [[-7e-5, 0], [-7e-5, 0]],
    "red_o_points": [],
    "y_categories": ["N", "NOT APPLICABLE", "nan"],
    "blue_o_points": [],
    "blue_x_points": [[0.00013, 1]]
  },
  "QA_txtInjMedicatioListNer": {
    "red_x_points": [
      [-0.00595, 1],
      [-0.00578, 1],
      [-0.00531, 1],
      [-0.00513, 1],
      [-0.00732, 1],
      [-0.0007, 2],
      [-0.00682, 1],
      [0.00357, 0],
      [-0.00878, 2],
      [-0.00372, 2],
      [-0.00322, 2],
      [-0.00363, 2],
      [-0.00766, 1],
      [-0.00674, 1],
      [-0.00109, 2],
      [-0.00686, 1],
      [-0.00246, 2],
      [-0.00695, 1],
      [-0.00827, 1],
      [-0.0072, 1],
      [-0.00392, 1],
      [-0.00015, 2],
      [-0.00264, 2]
    ],
    "red_o_points": [],
    "y_categories": ["N", "Y", "nan"],
    "blue_o_points": [],
    "blue_x_points": [
      [0.0286, 0],
      [0.0006, 2],
      [0.01218, 0],
      [-0.00377, 1],
      [0.00103, 2],
      [0.00175, 2],
      [0.00211, 2],
      [-0.00413, 1],
      [-0.00255, 1],
      [-0.0036, 1],
      [0.02811, 0],
      [-0.00023, 2],
      [0.02487, 0],
      [-0.00407, 1],
      [0.00142, 2],
      [0.00045, 2],
      [-0.00239, 1],
      [0.01451, 0],
      [0.01643, 0],
      [-0.00412, 1],
      [-0.00049, 2]
    ]
  },
  "QA_lstPexKine[Elbow]": {
    "red_x_points": [
      [-0.00037, 1],
      [-0.00081, 2],
      [-0.00186, 2],
      [0.00068, 1],
      [-0.00122, 2],
      [-0.00963, 0],
      [-0.00039, 1],
      [-6e-5, 1],
      [-0.00071, 2],
      [0.00098, 1],
      [-0.00172, 2],
      [-0.00077, 2],
      [-0.00164, 2],
      [0.00105, 1],
      [-0.00017, 1],
      [-0.00276, 0],
      [-0.00104, 2],
      [-0.00097, 2],
      [-0.00346, 2],
      [-0.00076, 2],
      [-0.00062, 2],
      [-0.00502, 0],
      [-0.00204, 2]
    ],
    "red_o_points": [],
    "y_categories": ["NPV", "PV", "nan"],
    "blue_o_points": [],
    "blue_x_points": [
      [0.00446, 0],
      [-0.00096, 2],
      [0.00115, 1],
      [0.00504, 1],
      [-0.00016, 2],
      [0.00459, 1],
      [0.00249, 1],
      [0.0033, 1],
      [-0.00025, 2],
      [-9e-5, 2],
      [-0.00085, 2],
      [0.00533, 1],
      [-0.00031, 2],
      [0.00087, 1],
      [0.00099, 1],
      [0.00289, 0],
      [-0.00036, 2],
      [0.00073, 1],
      [0.0002, 2],
      [0.00256, 1],
      [0.00169, 1]
    ]
  },
  "QS_mulNeuromadSite[C4]": {
    "red_x_points": [
      [-0.00589, 1],
      [-0.0038, 0],
      [-0.00105, 0],
      [0.00012, 0],
      [-0.00238, 0],
      [0.00067, 0],
      [2e-5, 2],
      [-0.00586, 1],
      [0.00232, 2],
      [-0.00323, 0],
      [0.0007, 2],
      [-0.0037, 0],
      [0.0004, 2],
      [-0.00056, 0],
      [-0.00786, 1],
      [0.00031, 2],
      [-0.00261, 0],
      [0.00045, 2],
      [-0.00106, 0],
      [-0.00351, 0],
      [-0.0048, 1],
      [0.00015, 0],
      [0.00049, 2]
    ],
    "red_o_points": [],
    "y_categories": ["N", "NOT APPLICABLE", "nan"],
    "blue_o_points": [],
    "blue_x_points": [
      [0.00185, 2],
      [0.00091, 2],
      [0.00083, 0],
      [0.0022, 0],
      [0.00074, 2],
      [0.00248, 0],
      [0.00119, 0],
      [0.00075, 0],
      [0.00345, 2],
      [0.0092, 1],
      [-0.00152, 0],
      [0.00331, 0],
      [0.00276, 2],
      [0.00154, 2],
      [0.00114, 2],
      [0.00058, 2],
      [0.0032, 2],
      [0.00141, 2],
      [0.00178, 1],
      [0.00175, 2],
      [0.00115, 2]
    ]
  },
  "QS_mulGraftNerve[Ra]": {
    "red_x_points": [
      [-0.00026, 1],
      [-5e-5, 0],
      [9e-5, 0],
      [-5e-5, 0],
      [6e-5, 0],
      [1e-5, 2],
      [-6e-5, 1],
      [0.0, 2],
      [-0.00019, 0],
      [-5e-5, 0],
      [-2e-5, 2],
      [-0.00019, 1],
      [-2e-5, 2],
      [-5e-5, 0],
      [5e-5, 2],
      [-5e-5, 0],
      [-6e-5, 1],
      [-3e-5, 2]
    ],
    "red_o_points": [],
    "y_categories": ["N", "NOT APPLICABLE", "nan"],
    "blue_o_points": [],
    "blue_x_points": [
      [3e-5, 2],
      [9e-5, 0],
      [9e-5, 0],
      [3e-5, 0],
      [8e-5, 2],
      [0.00018, 1],
      [8e-5, 0],
      [9e-5, 0],
      [8e-5, 2],
      [3e-5, 2],
      [3e-5, 2],
      [8e-5, 2],
      [-3e-5, 2],
      [3e-5, 2]
    ]
  },
  "QS_mulTransfSite[Oberlin]": {
    "red_x_points": [
      [-0.0112, 1],
      [-0.03288, 0],
      [-0.03359, 0],
      [-0.0343, 0],
      [-0.03321, 0],
      [-0.03335, 0],
      [0.00943, 3],
      [-0.01215, 1],
      [0.01042, 3],
      [0.01248, 2],
      [0.00975, 3],
      [-0.03189, 0],
      [0.00964, 3],
      [0.01302, 2],
      [-0.01223, 1],
      [0.00895, 3],
      [-0.03373, 0],
      [0.00912, 3],
      [0.01392, 2],
      [-0.03308, 0],
      [-0.01318, 1],
      [-0.03213, 0],
      [0.00979, 3]
    ],
    "red_o_points": [],
    "y_categories": ["N", "NOT APPLICABLE", "Y", "nan"],
    "blue_o_points": [],
    "blue_x_points": [
      [0.01166, 3],
      [0.01044, 3],
      [0.01638, 2],
      [0.0185, 2],
      [0.01118, 3],
      [0.01767, 2],
      [0.01687, 2],
      [0.01652, 2],
      [0.01141, 3],
      [-0.00391, 1],
      [0.01649, 2],
      [0.01826, 2],
      [0.01116, 3],
      [0.01029, 3],
      [0.0105, 3],
      [0.00983, 3],
      [0.01152, 3],
      [0.01036, 3],
      [-0.00616, 1],
      [0.01092, 3],
      [0.0105, 3]
    ]
  },
  "QA_lstPexArthre[Index]": {
    "red_x_points": [
      [-0.00768, 0],
      [-0.00165, 2],
      [-0.00273, 2],
      [-0.0084, 0],
      [-0.00401, 0],
      [-0.00962, 0],
      [-0.00052, 1],
      [0.00024, 1],
      [-0.00143, 2],
      [0.00311, 1],
      [-0.00209, 2],
      [-0.00165, 2],
      [-0.00256, 2],
      [0.00031, 1],
      [0.00123, 1],
      [-0.00355, 0],
      [-0.00083, 2],
      [-0.00236, 2],
      [-0.00493, 2],
      [-0.00128, 2],
      [-0.0023, 2],
      [-0.00503, 0],
      [-0.00334, 2]
    ],
    "red_o_points": [],
    "y_categories": ["NPV", "PV", "nan"],
    "blue_o_points": [],
    "blue_x_points": [
      [0.00417, 0],
      [-0.00133, 2],
      [0.00277, 1],
      [0.00803, 1],
      [-0.00055, 2],
      [0.00877, 1],
      [0.00532, 1],
      [0.00063, 0],
      [-0.00119, 2],
      [-0.00029, 2],
      [-0.00079, 2],
      [0.01243, 1],
      [-0.00061, 2],
      [0.00273, 1],
      [0.00296, 1],
      [0.0007, 0],
      [-0.00085, 2],
      [0.00354, 1],
      [0.00023, 2],
      [0.00795, 1],
      [0.00644, 1]
    ]
  },
  "QA_yonPreFracture": {
    "red_x_points": [
      [-0.02787, 1],
      [0.00154, 2],
      [0.00491, 0],
      [0.0023, 2],
      [0.00516, 0],
      [0.00544, 0],
      [-0.02569, 1],
      [0.00503, 0],
      [0.00139, 2],
      [-0.03025, 1],
      [-0.03287, 1],
      [-0.02666, 1],
      [0.00214, 2],
      [0.00554, 0],
      [0.00522, 0],
      [0.00445, 0],
      [0.00449, 0],
      [0.00719, 0],
      [-0.03358, 1],
      [0.00541, 0],
      [0.00104, 2],
      [-0.02105, 1],
      [0.00181, 2]
    ],
    "red_o_points": [],
    "y_categories": ["N", "Y", "nan"],
    "blue_o_points": [],
    "blue_x_points": [
      [0.00809, 0],
      [0.00452, 2],
      [0.0061, 0],
      [0.00733, 0],
      [0.00435, 2],
      [0.00801, 0],
      [0.00708, 0],
      [0.00537, 2],
      [0.00419, 2],
      [0.00853, 0],
      [0.00902, 0],
      [0.00907, 0],
      [0.00866, 0],
      [0.00655, 0],
      [0.00576, 0],
      [0.0042, 2],
      [0.00872, 0],
      [0.00628, 0],
      [0.00603, 0],
      [0.00342, 2],
      [0.00365, 2]
    ]
  },
  "QS_mulGraftNerve[FI]": {
    "red_x_points": [
      [-0.00067, 1],
      [-0.00047, 0],
      [-0.00012, 0],
      [-1e-5, 0],
      [-0.00028, 0],
      [9e-5, 0],
      [-4e-5, 2],
      [-0.00044, 1],
      [0.00017, 2],
      [-0.00034, 0],
      [2e-5, 2],
      [-0.00036, 0],
      [4e-5, 2],
      [-0.00105, 1],
      [1e-5, 2],
      [-0.00046, 0],
      [-1e-5, 2],
      [-9e-5, 0],
      [-0.00052, 0],
      [-0.00085, 1],
      [2e-5, 0],
      [8e-5, 2]
    ],
    "red_o_points": [],
    "y_categories": ["N", "NOT APPLICABLE", "nan"],
    "blue_o_points": [],
    "blue_x_points": [
      [0.00023, 2],
      [0.0001, 2],
      [0.0001, 0],
      [6e-5, 0],
      [0.00058, 0],
      [0.00021, 0],
      [0.0001, 0],
      [0.0004, 2],
      [0.0017, 1],
      [-0.00026, 0],
      [0.00042, 0],
      [0.00038, 2],
      [0.0001, 2],
      [6e-5, 2],
      [0.0001, 2],
      [0.00039, 2],
      [0.00018, 2],
      [0.00017, 1],
      [0.00015, 2],
      [0.00012, 2]
    ]
  },
  "QA_lstPexPalle[Clavicle]": {
    "red_x_points": [
      [-0.00095, 3],
      [-0.00077, 3],
      [-0.00095, 3],
      [0.00548, 2],
      [-0.00095, 3],
      [-0.00096, 3],
      [-0.01352, 0],
      [-0.01436, 0],
      [-0.00077, 3],
      [-0.00103, 3],
      [-0.00109, 3],
      [-0.00068, 3],
      [-0.0008, 3],
      [-0.02108, 0],
      [-0.00088, 3],
      [-0.01179, 0],
      [-0.00474, 1],
      [-0.00103, 3],
      [-0.00158, 3],
      [-0.00092, 3],
      [0.00638, 2],
      [-0.01096, 0],
      [-0.00084, 3]
    ],
    "red_o_points": [],
    "y_categories": ["HYPO", "NAIA", "PT", "nan"],
    "blue_o_points": [],
    "blue_x_points": [
      [-0.00055, 3],
      [-0.00048, 3],
      [0.01129, 2],
      [0.01562, 2],
      [-0.00039, 3],
      [-0.00084, 3],
      [0.01629, 2],
      [0.01249, 2],
      [-0.00069, 3],
      [-0.0005, 3],
      [-0.00085, 3],
      [-0.00052, 3],
      [-0.00048, 3],
      [-0.00754, 0],
      [0.01045, 2],
      [0.00777, 1],
      [-0.00069, 3],
      [0.00882, 2],
      [-0.00057, 3],
      [0.01064, 2],
      [-0.00046, 3]
    ]
  }
}
