{
  "QS_mulGraftNerve[other]": {
    "red_x_points": [
      [-0.00018, 2],
      [-0.00064, 0],
      [-0.00064, 0],
      [-0.00046, 0],
      [-0.00055, 0],
      [-0.00063, 0],
      [-0.00056, 0],
      [-0.00013, 2],
      [-0.00056, 0],
      [-0.0005, 0],
      [-0.00058, 0],
      [-0.00023, 2],
      [0.00025, 1],
      [-0.00018, 2],
      [-0.00062, 0],
      [-0.00024, 2],
      [-0.00051, 0],
      [-0.00061, 0],
      [-0.0002, 2],
      [-0.00018, 2],
      [-6e-5, 2],
      [-0.00053, 0],
      [-0.00024, 2],
      [-6e-5, 2],
      [-0.0002, 2],
      [-0.00053, 0],
      [-0.00013, 2],
      [-0.00056, 0],
      [-9e-5, 2],
      [0.0009, 1],
      [-0.00059, 0]
    ],
    "red_o_points": [],
    "y_categories": ["N", "NOT APPLICABLE", "nan"],
    "blue_o_points": [],
    "blue_x_points": [
      [0.00307, 1],
      [-0.0, 2],
      [0.00084, 1],
      [0.00029, 0],
      [-3e-5, 2],
      [0.00086, 1],
      [0.00183, 1]
    ]
  },
  "participant_code": {
    "red_x_points": [
      [-0.0279, 1],
      [-0.02776, 2],
      [-0.02832, 3],
      [-0.02855, 4],
      [-0.02967, 5],
      [-0.02827, 6],
      [-0.02879, 7],
      [-0.02785, 8],
      [-0.02804, 9],
      [-0.02851, 10],
      [-0.02855, 11],
      [-0.02809, 12],
      [-0.02893, 14],
      [-0.02827, 16],
      [-0.02893, 17],
      [-0.02865, 19],
      [-0.02869, 20],
      [-0.02743, 22],
      [-0.0272, 23],
      [-0.02916, 25],
      [-0.0286, 26],
      [-0.02869, 27],
      [-0.02981, 28],
      [-0.02785, 29],
      [-0.02855, 30],
      [-0.02897, 32],
      [-0.02851, 33],
      [-0.02907, 34],
      [-0.02911, 35],
      [-0.0286, 36],
      [-0.02781, 37]
    ],
    "red_o_points": [],
    "y_categories": [
      "P16554",
      "P18297",
      "P19283",
      "P19287",
      "P23391",
      "P31645",
      "P31691",
      "P34778",
      "P35046",
      "P36328",
      "P43633",
      "P4544",
      "P46417",
      "P48965",
      "P53068",
      "P5497",
      "P59529",
      "P62483",
      "P64658",
      "P65202",
      "P66816",
      "P6751",
      "P7408",
      "P75566",
      "P76226",
      "P79971",
      "P82621",
      "P82990",
      "P84932",
      "P85825",
      "P86989",
      "P8770",
      "P87791",
      "P90550",
      "P93159",
      "P94969",
      "P96710",
      "P9744",
      "nan"
    ],
    "blue_o_points": [],
    "blue_x_points": [
      [0.08447, 0],
      [0.08355, 13],
      [0.08217, 15],
      [0.08324, 18],
      [0.08355, 21],
      [0.08263, 24],
      [0.08616, 31]
    ]
  },
  "QS_mulLysisTrunk[Upper]": {
    "red_x_points": [
      [-0.00138, 3],
      [-0.00187, 0],
      [-0.00218, 0],
      [-0.00192, 0],
      [-0.00208, 0],
      [-0.00436, 2],
      [-0.00194, 0],
      [-0.00129, 3],
      [-0.00205, 0],
      [-0.00208, 0],
      [-0.00234, 0],
      [-0.0013, 3],
      [0.00719, 1],
      [-0.00109, 3],
      [-0.0023, 0],
      [-0.00125, 3],
      [-0.00481, 2],
      [-0.00228, 0],
      [-0.00137, 3],
      [-0.00137, 3],
      [-0.00124, 3],
      [-0.00197, 0],
      [-0.00137, 3],
      [-0.0012, 3],
      [-0.00133, 3],
      [-0.00215, 0],
      [-0.00145, 3],
      [-0.00211, 0],
      [-0.00132, 3],
      [0.00649, 1],
      [-0.00435, 2]
    ],
    "red_o_points": [],
    "y_categories": ["N", "NOT APPLICABLE", "Y", "nan"],
    "blue_o_points": [],
    "blue_x_points": [
      [0.00902, 1],
      [-0.00086, 3],
      [0.00705, 1],
      [-0.00154, 0],
      [-0.00066, 3],
      [0.00753, 1],
      [0.00685, 1]
    ]
  },
  "QS_mulNeuromadSite[C5]": {
    "red_x_points": [
      [-0.00076, 2],
      [-0.00325, 0],
      [-0.0034, 0],
      [-0.00277, 0],
      [-0.00298, 0],
      [-0.00286, 0],
      [-0.00329, 0],
      [-0.00082, 2],
      [-0.00344, 0],
      [-0.00321, 0],
      [-0.00298, 0],
      [-0.00081, 2],
      [0.00313, 1],
      [-0.00105, 2],
      [-0.00319, 0],
      [-0.00133, 2],
      [-0.00235, 0],
      [-0.00313, 0],
      [-0.00082, 2],
      [-0.00076, 2],
      [-0.00051, 2],
      [-0.0029, 0],
      [-0.00125, 2],
      [-0.00052, 2],
      [-0.00112, 2],
      [-0.003, 0],
      [-0.00076, 2],
      [-0.00324, 0],
      [-0.00078, 2],
      [0.00561, 1],
      [-0.00291, 0]
    ],
    "red_o_points": [],
    "y_categories": ["N", "NOT APPLICABLE", "nan"],
    "blue_o_points": [],
    "blue_x_points": [
      [0.01439, 1],
      [0.00018, 2],
      [0.00528, 1],
      [0.0007, 0],
      [5e-5, 2],
      [0.00518, 1],
      [0.00766, 1]
    ]
  },
  "QS_mulNeuromadSite[C7]": {
    "red_x_points": [
      [-0.00075, 2],
      [-0.00149, 0],
      [-0.0019, 0],
      [-0.00197, 0],
      [-0.00175, 0],
      [-0.00179, 0],
      [-0.00176, 0],
      [-0.00056, 2],
      [-0.00174, 0],
      [-0.00172, 0],
      [-0.00188, 0],
      [-0.00062, 2],
      [0.00237, 1],
      [-0.00055, 2],
      [-0.00185, 0],
      [-0.00059, 2],
      [-0.00148, 0],
      [-0.002, 0],
      [-0.00062, 2],
      [-0.0006, 2],
      [-0.00031, 2],
      [-0.00143, 0],
      [-0.00056, 2],
      [-0.00054, 2],
      [-0.00077, 2],
      [-0.00161, 0],
      [-0.00083, 2],
      [-0.00163, 0],
      [-0.00032, 2],
      [0.0032, 1],
      [-0.00175, 0]
    ],
    "red_o_points": [],
    "y_categories": ["N", "NOT APPLICABLE", "nan"],
    "blue_o_points": [],
    "blue_x_points": [
      [0.00906, 1],
      [-2e-5, 2],
      [0.00307, 1],
      [0.00032, 0],
      [-0.00014, 2],
      [0.00302, 1],
      [0.00466, 1]
    ]
  },
  "QS_mulTransfSite[IMc]": {
    "red_x_points": [
      [-0.00255, 3],
      [-0.00718, 2],
      [-0.00467, 0],
      [-0.00446, 0],
      [-0.00445, 0],
      [-0.00431, 0],
      [-0.00453, 0],
      [-0.00249, 3],
      [-0.00431, 0],
      [-0.00434, 0],
      [-0.00424, 0],
      [-0.0023, 3],
      [0.01058, 1],
      [-0.00266, 3],
      [-0.00391, 0],
      [-0.00267, 3],
      [-0.00745, 2],
      [-0.00442, 0],
      [-0.00264, 3],
      [-0.00253, 3],
      [-0.00214, 3],
      [-0.00374, 0],
      [-0.00277, 3],
      [-0.00243, 3],
      [-0.00269, 3],
      [-0.00408, 0],
      [-0.00238, 3],
      [-0.00653, 2],
      [-0.00235, 3],
      [0.01128, 1],
      [-0.00724, 2]
    ],
    "red_o_points": [],
    "y_categories": ["N", "NOT APPLICABLE", "Y", "nan"],
    "blue_o_points": [],
    "blue_x_points": [
      [0.0204, 1],
      [-0.00099, 3],
      [0.01298, 1],
      [-0.00098, 0],
      [-0.00103, 3],
      [0.01211, 1],
      [0.01529, 1]
    ]
  },
  "QA_mulInjOrthesisType[ShoulderSupport]": {
    "red_x_points": [
      [-0.01926, 0],
      [-0.01739, 0],
      [-0.01805, 0],
      [-0.01661, 0],
      [-0.01748, 0],
      [-0.01727, 0],
      [-0.01735, 0],
      [-0.02116, 2],
      [-0.01639, 0],
      [-0.01668, 0],
      [-0.01719, 0],
      [-0.01768, 0],
      [0.04488, 1],
      [-0.01871, 0],
      [-0.01708, 0],
      [-0.01807, 0],
      [-0.02016, 2],
      [-0.01754, 0],
      [-0.01734, 0],
      [-0.01887, 0],
      [-0.0223, 2],
      [-0.01941, 3],
      [-0.01906, 0],
      [0.05208, 1],
      [-0.01841, 0],
      [-0.01749, 0],
      [-0.01839, 0],
      [-0.01679, 0],
      [-0.02179, 3],
      [-0.03259, 3],
      [-0.01735, 0]
    ],
    "red_o_points": [],
    "y_categories": ["N", "NOT APPLICABLE", "Y", "nan"],
    "blue_o_points": [],
    "blue_x_points": [
      [-0.00735, 0],
      [0.05322, 1],
      [0.04483, 1],
      [0.0526, 1],
      [0.05399, 1],
      [0.04468, 1],
      [0.04502, 1]
    ]
  },
  "QA_mulInjOrthesisType[ArmSling]": {
    "red_x_points": [
      [-0.01598, 2],
      [-0.01453, 2],
      [-0.01491, 2],
      [-0.01364, 2],
      [-0.01464, 2],
      [-0.01494, 2],
      [-0.01501, 2],
      [-0.01596, 2],
      [-0.01484, 2],
      [-0.01459, 2],
      [-0.01495, 2],
      [-0.01612, 2],
      [0.03903, 1],
      [-0.01673, 2],
      [-0.01488, 2],
      [-0.01633, 2],
      [-0.01757, 0],
      [-0.01535, 2],
      [-0.01599, 2],
      [-0.01593, 2],
      [-0.01829, 0],
      [-0.0176, 3],
      [-0.01595, 2],
      [0.04513, 1],
      [-0.01595, 2],
      [-0.01476, 2],
      [-0.01588, 2],
      [-0.01436, 2],
      [-0.01806, 3],
      [-0.02729, 3],
      [-0.01518, 2]
    ],
    "red_o_points": [],
    "y_categories": ["N", "NOT APPLICABLE", "Y", "nan"],
    "blue_o_points": [],
    "blue_x_points": [
      [-0.00637, 2],
      [0.04509, 1],
      [0.03916, 1],
      [0.0472, 1],
      [0.0456, 1],
      [0.0376, 1],
      [0.03757, 1]
    ]
  },
  "QS_mulGraftNerve[Ac]": {
    "red_x_points": [
      [-0.00013, 2],
      [-0.00027, 0],
      [-0.00026, 0],
      [-0.00015, 0],
      [-0.00014, 0],
      [-0.0002, 0],
      [-0.00018, 0],
      [-0.0001, 2],
      [-0.0002, 0],
      [-0.00027, 0],
      [-0.00023, 0],
      [-9e-5, 2],
      [0.00028, 1],
      [-8e-5, 2],
      [-0.00018, 0],
      [-9e-5, 2],
      [-0.00033, 0],
      [-0.00018, 0],
      [-0.00012, 2],
      [-6e-5, 2],
      [-0.00013, 2],
      [-0.00022, 0],
      [-0.00013, 2],
      [-0.00013, 2],
      [-0.00011, 2],
      [-0.00012, 0],
      [-0.00014, 2],
      [-0.00024, 0],
      [-0.0001, 2],
      [0.00042, 1],
      [-0.00026, 0]
    ],
    "red_o_points": [],
    "y_categories": ["N", "NOT APPLICABLE", "nan"],
    "blue_o_points": [],
    "blue_x_points": [
      [0.00051, 1],
      [-1e-5, 2],
      [0.00047, 1],
      [1e-5, 0],
      [-0.0, 2],
      [0.00069, 1],
      [0.00056, 1]
    ]
  },
  "QS_mulNeuromadSite[C8]": {
    "red_x_points": [
      [-0.00129, 2],
      [-0.0037, 0],
      [-0.00428, 0],
      [-0.0037, 0],
      [-0.00349, 0],
      [-0.00341, 0],
      [-0.00374, 0],
      [-0.00135, 2],
      [-0.00391, 0],
      [-0.00399, 0],
      [-0.00357, 0],
      [-0.0016, 2],
      [0.00488, 1],
      [-0.00195, 2],
      [-0.00392, 0],
      [-0.00167, 2],
      [-0.00269, 0],
      [-0.0037, 0],
      [-0.00146, 2],
      [-0.00133, 2],
      [-0.00097, 2],
      [-0.00308, 0],
      [-0.00191, 2],
      [-0.00141, 2],
      [-0.00185, 2],
      [-0.00357, 0],
      [-0.00169, 2],
      [-0.00352, 0],
      [-0.00152, 2],
      [0.00758, 1],
      [-0.00382, 0]
    ],
    "red_o_points": [],
    "y_categories": ["N", "NOT APPLICABLE", "nan"],
    "blue_o_points": [],
    "blue_x_points": [
      [0.01622, 1],
      [0.0001, 2],
      [0.00722, 1],
      [0.00083, 0],
      [-0.0002, 2],
      [0.00731, 1],
      [0.0096, 1]
    ]
  },
  "QS_mulGraftNerve[Ph]": {
    "red_x_points": [
      [-5e-5, 2],
      [-5e-5, 0],
      [-7e-5, 0],
      [-7e-5, 0],
      [-6e-5, 0],
      [-5e-5, 0],
      [-7e-5, 0],
      [-5e-5, 2],
      [-5e-5, 0],
      [-2e-5, 0],
      [-7e-5, 0],
      [-3e-5, 2],
      [-2e-5, 1],
      [-2e-5, 2],
      [-7e-5, 0],
      [-2e-5, 2],
      [-5e-5, 0],
      [-0.00013, 0],
      [-5e-5, 2],
      [-3e-5, 2],
      [-5e-5, 0],
      [-5e-5, 2],
      [-3e-5, 2],
      [-5e-5, 2],
      [-5e-5, 0],
      [-3e-5, 2],
      [-3e-5, 2],
      [-7e-5, 0]
    ],
    "red_o_points": [],
    "y_categories": ["N", "NOT APPLICABLE", "nan"],
    "blue_o_points": [],
    "blue_x_points": [
      [0.00033, 1],
      [-3e-5, 2],
      [0.00023, 1],
      [-1e-5, 0],
      [2e-5, 2],
      [0.00013, 1],
      [-2e-5, 1]
    ]
  },
  "QS_mulTransfSite[AcSsPA]": {
    "red_x_points": [
      [-0.00039, 3],
      [-0.00027, 0],
      [-0.00023, 0],
      [-0.00021, 0],
      [-0.00022, 0],
      [-0.00024, 0],
      [-0.00025, 0],
      [-0.00028, 3],
      [-0.00025, 0],
      [-0.00022, 0],
      [-0.00021, 0],
      [-0.00035, 3],
      [0.00114, 1],
      [-0.00033, 3],
      [-6e-5, 0],
      [-0.0002, 3],
      [-0.00176, 2],
      [-0.00024, 0],
      [-0.00024, 3],
      [-0.00031, 3],
      [-0.00028, 3],
      [-0.00024, 0],
      [-0.00031, 3],
      [-0.00042, 3],
      [-0.00035, 3],
      [-0.00021, 0],
      [-0.00035, 3],
      [-0.00021, 0],
      [-0.00023, 3],
      [0.00083, 1],
      [-0.0002, 0]
    ],
    "red_o_points": [],
    "y_categories": ["N", "NOT APPLICABLE", "Y", "nan"],
    "blue_o_points": [],
    "blue_x_points": [
      [0.00091, 1],
      [-0.00017, 3],
      [0.00098, 1],
      [0.00045, 0],
      [-2e-5, 3],
      [0.00127, 1],
      [0.00101, 1]
    ]
  },
  "QS_mulTransfSite[Other]": {
    "red_x_points": [
      [-0.00011, 3],
      [-0.00013, 0],
      [-0.00016, 0],
      [-0.00017, 0],
      [-9e-5, 0],
      [-0.0002, 0],
      [-0.00014, 0],
      [-0.00016, 3],
      [-0.00014, 0],
      [-9e-5, 0],
      [-0.00016, 0],
      [-0.00015, 3],
      [0.00048, 1],
      [-0.00014, 3],
      [-0.00018, 0],
      [-0.00013, 3],
      [-0.00013, 0],
      [-0.00287, 2],
      [-8e-5, 3],
      [-0.00011, 3],
      [-0.00014, 3],
      [-0.00016, 0],
      [-0.0001, 3],
      [-0.00013, 3],
      [-0.00014, 3],
      [-0.00018, 0],
      [-0.00027, 3],
      [-0.00018, 0],
      [-0.0001, 3],
      [0.00084, 1],
      [-0.00015, 0]
    ],
    "red_o_points": [],
    "y_categories": ["N", "NOT APPLICABLE", "Y", "nan"],
    "blue_o_points": [],
    "blue_x_points": [
      [0.00077, 1],
      [-7e-5, 3],
      [0.00074, 1],
      [0.00083, 0],
      [1e-5, 3],
      [0.00038, 1],
      [0.00078, 1]
    ]
  },
  "QA_yonInjBpsurg": {
    "red_x_points": [
      [-0.00639, 1],
      [-0.00595, 1],
      [-0.00572, 1],
      [-0.00558, 1],
      [-0.00573, 1],
      [-0.00538, 1],
      [-0.00565, 1],
      [-0.00545, 1],
      [-0.00581, 1],
      [-0.00535, 1],
      [-0.00581, 1],
      [-0.00615, 1],
      [0.01218, 0],
      [-0.00552, 1],
      [-0.00534, 1],
      [-0.00574, 1],
      [-0.00446, 1],
      [-0.00561, 1],
      [-0.00648, 1],
      [-0.00573, 1],
      [-0.00476, 1],
      [-0.00461, 1],
      [-0.00579, 1],
      [-0.0055, 1],
      [-0.00628, 1],
      [-0.00584, 1],
      [-0.00559, 1],
      [-0.00556, 1],
      [-0.00496, 1],
      [0.0152, 0],
      [-0.00588, 1]
    ],
    "red_o_points": [],
    "y_categories": ["N", "Y", "nan"],
    "blue_o_points": [],
    "blue_x_points": [
      [0.03589, 0],
      [-0.00085, 1],
      [0.01794, 0],
      [-0.00406, 1],
      [-0.00169, 1],
      [0.01711, 0],
      [0.02034, 0]
    ]
  },
  "QS_mulNeuromadSite[T1]": {
    "red_x_points": [
      [-0.00173, 2],
      [-0.00482, 0],
      [-0.00486, 0],
      [-0.00486, 0],
      [-0.00487, 0],
      [-0.00475, 0],
      [-0.00502, 0],
      [-0.00178, 2],
      [-0.00508, 0],
      [-0.00474, 0],
      [-0.00442, 0],
      [-0.00184, 2],
      [0.00684, 1],
      [-0.00207, 2],
      [-0.00489, 0],
      [-0.00174, 2],
      [-0.00418, 0],
      [-0.00479, 0],
      [-0.00187, 2],
      [-0.00202, 2],
      [-0.00122, 2],
      [-0.00413, 0],
      [-0.00175, 2],
      [-0.00173, 2],
      [-0.00221, 2],
      [-0.00442, 0],
      [-0.00229, 2],
      [-0.00476, 0],
      [-0.00135, 2],
      [0.00814, 1],
      [-0.00431, 0]
    ],
    "red_o_points": [],
    "y_categories": ["N", "NOT APPLICABLE", "nan"],
    "blue_o_points": [],
    "blue_x_points": [
      [0.02138, 1],
      [-4e-5, 2],
      [0.00965, 1],
      [0.00028, 0],
      [-6e-5, 2],
      [0.00962, 1],
      [0.0123, 1]
    ]
  },
  "QS_mulTransfSite[AcSsAA]": {
    "red_x_points": [
      [-0.00298, 3],
      [-0.00882, 2],
      [-0.00307, 0],
      [-0.0097, 2],
      [-0.00951, 2],
      [-0.00324, 0],
      [-0.00311, 0],
      [-0.00259, 3],
      [-0.00318, 0],
      [-0.00878, 2],
      [-0.00308, 0],
      [-0.00286, 3],
      [0.01539, 1],
      [-0.00292, 3],
      [-0.01052, 2],
      [-0.00283, 3],
      [-0.00271, 0],
      [-0.00329, 0],
      [-0.00291, 3],
      [-0.00273, 3],
      [-0.00259, 3],
      [-0.00898, 2],
      [-0.00337, 3],
      [-0.00268, 3],
      [-0.00308, 3],
      [-0.00306, 0],
      [-0.00303, 3],
      [-0.00855, 2],
      [-0.00269, 3],
      [0.0159, 1],
      [-0.00296, 0]
    ],
    "red_o_points": [],
    "y_categories": ["N", "NOT APPLICABLE", "Y", "nan"],
    "blue_o_points": [],
    "blue_x_points": [
      [0.01956, 1],
      [-0.00147, 3],
      [0.01684, 1],
      [-0.00049, 0],
      [-0.00108, 3],
      [0.01484, 1],
      [0.01624, 1]
    ]
  },
  "QS_mulLysisRoot[C5]": {
    "red_x_points": [
      [-0.00039, 3],
      [-0.00069, 0],
      [-0.00144, 2],
      [-0.00081, 0],
      [-0.0004, 0],
      [-0.00069, 0],
      [-0.00057, 0],
      [-0.00045, 3],
      [-0.00051, 0],
      [-0.00063, 0],
      [-0.00063, 0],
      [-0.00047, 3],
      [0.00241, 1],
      [-0.00047, 3],
      [-0.00063, 0],
      [-0.00047, 3],
      [-0.00061, 0],
      [-0.00052, 0],
      [-0.0005, 3],
      [-0.0006, 3],
      [-0.00053, 3],
      [-0.0007, 0],
      [-0.00056, 3],
      [-0.00059, 3],
      [-0.00051, 3],
      [-0.00058, 0],
      [-0.00053, 3],
      [-0.00055, 0],
      [-0.00051, 3],
      [0.00182, 1],
      [-0.00125, 2]
    ],
    "red_o_points": [],
    "y_categories": ["N", "NOT APPLICABLE", "Y", "nan"],
    "blue_o_points": [],
    "blue_x_points": [
      [0.00302, 1],
      [-0.00024, 3],
      [0.00266, 1],
      [-0.00054, 0],
      [-0.00033, 3],
      [0.0025, 1],
      [0.00182, 1]
    ]
  },
  "QS_mulNeuromadSite[C6]": {
    "red_x_points": [
      [-0.00051, 2],
      [-0.00081, 0],
      [-0.00101, 0],
      [-0.00083, 0],
      [-0.00108, 0],
      [-0.0009, 0],
      [-0.00078, 0],
      [-0.00037, 2],
      [-0.00072, 0],
      [-0.0009, 0],
      [-0.00064, 0],
      [-0.00041, 2],
      [0.00107, 1],
      [-0.00036, 2],
      [-0.0008, 0],
      [-0.00043, 2],
      [-0.00092, 0],
      [-0.00091, 0],
      [-0.00046, 2],
      [-0.00047, 2],
      [-0.00029, 2],
      [-0.00073, 0],
      [-0.0004, 2],
      [-0.00044, 2],
      [-0.0004, 2],
      [-0.00097, 0],
      [-0.00045, 2],
      [-0.00084, 0],
      [-0.0003, 2],
      [0.00202, 1],
      [-0.00085, 0]
    ],
    "red_o_points": [],
    "y_categories": ["N", "NOT APPLICABLE", "nan"],
    "blue_o_points": [],
    "blue_x_points": [
      [0.00462, 1],
      [-0.00011, 2],
      [0.00209, 1],
      [0.00023, 0],
      [-0.00028, 2],
      [0.00202, 1],
      [0.0019, 1]
    ]
  },
  "QS_lstBpsurgSide": {
    "red_x_points": [
      [-0.00572, 3],
      [-0.00762, 0],
      [-0.00805, 0],
      [-0.0081, 0],
      [-0.0172, 2],
      [-0.00758, 0],
      [-0.00766, 0],
      [-0.00549, 3],
      [-0.00825, 0],
      [-0.0167, 2],
      [-0.01575, 2],
      [-0.00574, 3],
      [0.02679, 1],
      [-0.006, 3],
      [-0.01815, 2],
      [-0.00538, 3],
      [-0.01706, 2],
      [-0.01627, 2],
      [-0.00544, 3],
      [-0.00583, 3],
      [-0.00488, 3],
      [-0.00743, 0],
      [-0.00553, 3],
      [-0.0055, 3],
      [-0.00619, 3],
      [-0.0162, 2],
      [-0.00522, 3],
      [-0.01548, 2],
      [-0.00504, 3],
      [0.02844, 1],
      [-0.00749, 0]
    ],
    "red_o_points": [],
    "y_categories": ["L", "NOT APPLICABLE", "R", "nan"],
    "blue_o_points": [],
    "blue_x_points": [
      [0.04342, 1],
      [-0.00209, 3],
      [0.02855, 1],
      [0.00306, 0],
      [-0.00197, 3],
      [0.0315, 1],
      [0.03256, 1]
    ]
  },
  "QS_mulBpsurgeryType[Lysis]": {
    "red_x_points": [
      [-0.00227, 3],
      [-0.00397, 0],
      [-0.00716, 2],
      [-0.00439, 0],
      [-0.00401, 0],
      [-0.00788, 2],
      [-0.00455, 0],
      [-0.00224, 3],
      [-0.0041, 0],
      [-0.00418, 0],
      [-0.00419, 0],
      [-0.00232, 3],
      [0.01061, 1],
      [-0.00224, 3],
      [-0.00441, 0],
      [-0.00233, 3],
      [-0.00753, 2],
      [-0.00418, 0],
      [-0.00252, 3],
      [-0.00221, 3],
      [-0.00196, 3],
      [-0.00401, 0],
      [-0.00293, 3],
      [-0.0027, 3],
      [-0.00255, 3],
      [-0.00407, 0],
      [-0.00236, 3],
      [-0.00399, 0],
      [-0.00235, 3],
      [0.01245, 1],
      [-0.00728, 2]
    ],
    "red_o_points": [],
    "y_categories": ["N", "NOT APPLICABLE", "Y", "nan"],
    "blue_o_points": [],
    "blue_x_points": [
      [0.01891, 1],
      [-0.00081, 3],
      [0.01235, 1],
      [-0.0017, 0],
      [-0.00081, 3],
      [0.0135, 1],
      [0.01529, 1]
    ]
  },
  "QA_yonInjUnconscio": {
    "red_x_points": [
      [-0.0046, 1],
      [-0.00463, 1],
      [-0.00282, 2],
      [-0.00239, 2],
      [0.00759, 0],
      [-0.00565, 1],
      [-0.00321, 2],
      [-0.00521, 2],
      [-0.00314, 2],
      [-0.00152, 2],
      [-0.0044, 1],
      [-0.00453, 1],
      [-0.03432, 1],
      [-0.00575, 2],
      [-0.00216, 2],
      [-0.00542, 2],
      [-0.00358, 1],
      [0.00811, 0],
      [-0.00461, 1],
      [-0.00402, 1],
      [-0.00401, 1],
      [-0.00502, 1],
      [-0.00537, 2],
      [-0.01308, 1],
      [-0.0049, 2],
      [-0.00417, 1],
      [0.01116, 0],
      [-0.00344, 1],
      [-0.00488, 2],
      [-0.00051, 2],
      [-0.00437, 1]
    ],
    "red_o_points": [],
    "y_categories": ["N", "Y", "nan"],
    "blue_o_points": [],
    "blue_x_points": [
      [0.00157, 2],
      [-0.00358, 1],
      [0.01738, 0],
      [0.02477, 0],
      [0.02719, 0],
      [0.00419, 2],
      [0.00426, 2]
    ]
  },
  "QS_mulTransfSite[Oberlin]": {
    "red_x_points": [
      [-0.0048, 3],
      [-0.01275, 0],
      [-0.01324, 0],
      [-0.01366, 0],
      [-0.00643, 2],
      [-0.00622, 2],
      [-0.01401, 0],
      [-0.00448, 3],
      [-0.00639, 2],
      [-0.00636, 2],
      [-0.00588, 2],
      [-0.00475, 3],
      [0.02133, 1],
      [-0.00537, 3],
      [-0.00595, 2],
      [-0.00468, 3],
      [-0.01396, 0],
      [-0.00647, 2],
      [-0.00485, 3],
      [-0.00485, 3],
      [-0.00486, 3],
      [-0.01264, 0],
      [-0.00479, 3],
      [-0.00459, 3],
      [-0.00507, 3],
      [-0.00643, 2],
      [-0.00508, 3],
      [-0.01301, 0],
      [-0.00434, 3],
      [0.02177, 1],
      [-0.01259, 0]
    ],
    "red_o_points": [],
    "y_categories": ["N", "NOT APPLICABLE", "Y", "nan"],
    "blue_o_points": [],
    "blue_x_points": [
      [0.03901, 1],
      [-0.00205, 3],
      [0.02686, 1],
      [0.00102, 2],
      [-0.0014, 3],
      [0.02537, 1],
      [0.02767, 1]
    ]
  },
  "QA_lstPexMuscstrength[ShoulderAbduc]": {
    "red_x_points": [
      [-0.00856, 1],
      [-0.00845, 1],
      [-0.00848, 1],
      [-0.00803, 1],
      [-0.00827, 1],
      [-0.0084, 1],
      [-0.00813, 1],
      [-0.0078, 1],
      [-0.00858, 1],
      [-0.00808, 1],
      [-0.00785, 1],
      [-0.00884, 1],
      [0.00449, 2],
      [0.00703, 2],
      [0.00732, 2],
      [0.00691, 2],
      [0.00723, 2],
      [-0.00801, 1],
      [-0.00845, 1],
      [-0.00816, 1],
      [-0.0082, 1],
      [-0.00814, 1],
      [0.00662, 2],
      [-0.01293, 1],
      [-0.0082, 1],
      [-0.00774, 1],
      [-0.00934, 1],
      [-0.00801, 1],
      [-0.00808, 1],
      [0.0034, 2],
      [-0.00769, 1]
    ],
    "red_o_points": [],
    "y_categories": ["GREATER THAN OR EQUALS TO 3", "LESS THAN 3", "nan"],
    "blue_o_points": [],
    "blue_x_points": [
      [0.00486, 2],
      [0.00738, 2],
      [0.03325, 0],
      [0.00785, 2],
      [0.00766, 2],
      [0.03745, 0],
      [-0.00149, 1]
    ]
  },
  "QS_mulGraftNerve[Me]": {
    "red_x_points": [
      [-3e-5, 0],
      [-3e-5, 0],
      [-3e-5, 2],
      [-3e-5, 0],
      [-3e-5, 0],
      [-3e-5, 1],
      [-3e-5, 2],
      [-3e-5, 0],
      [-3e-5, 2],
      [-3e-5, 2],
      [-3e-5, 2],
      [-3e-5, 2]
    ],
    "red_o_points": [],
    "y_categories": ["N", "NOT APPLICABLE", "nan"],
    "blue_o_points": [],
    "blue_x_points": [
      [0.00017, 1],
      [-3e-5, 2],
      [-3e-5, 1],
      [7e-5, 0],
      [0.00017, 1]
    ]
  },
  "QS_mulNeuromadSite[T2]": {
    "red_x_points": [
      [-0.00259, 2],
      [-0.00738, 0],
      [-0.00806, 0],
      [-0.00777, 0],
      [-0.00779, 0],
      [-0.00754, 0],
      [-0.00758, 0],
      [-0.0023, 2],
      [-0.00739, 0],
      [-0.00751, 0],
      [-0.00712, 0],
      [-0.00245, 2],
      [0.01137, 1],
      [-0.00244, 2],
      [-0.00847, 0],
      [-0.00272, 2],
      [-0.00691, 0],
      [-0.00826, 0],
      [-0.00277, 2],
      [-0.00247, 2],
      [-0.0017, 2],
      [-0.00645, 0],
      [-0.00267, 2],
      [-0.00198, 2],
      [-0.00257, 2],
      [-0.00733, 0],
      [-0.00247, 2],
      [-0.0077, 0],
      [-0.00209, 2],
      [0.0126, 1],
      [-0.00768, 0]
    ],
    "red_o_points": [],
    "y_categories": ["N", "NOT APPLICABLE", "nan"],
    "blue_o_points": [],
    "blue_x_points": [
      [0.03363, 1],
      [-0.00029, 2],
      [0.01488, 1],
      [0.0008, 0],
      [-9e-5, 2],
      [0.01639, 1],
      [0.0197, 1]
    ]
  },
  "QS_mulLysisSite[Trunk]": {
    "red_x_points": [
      [-0.00121, 3],
      [-0.00169, 0],
      [-0.0016, 0],
      [-0.00184, 0],
      [-0.0016, 0],
      [-0.00388, 2],
      [-0.00187, 0],
      [-0.0012, 3],
      [-0.00167, 0],
      [-0.00175, 0],
      [-0.00165, 0],
      [-0.0013, 3],
      [0.00524, 1],
      [-0.0011, 3],
      [-0.00161, 0],
      [-0.00102, 3],
      [-0.00424, 2],
      [-0.00172, 0],
      [-0.00136, 3],
      [-0.00101, 3],
      [-0.00114, 3],
      [-0.00155, 0],
      [-0.00114, 3],
      [-0.00139, 3],
      [-0.00116, 3],
      [-0.00157, 0],
      [-0.00126, 3],
      [-0.00153, 0],
      [-0.00128, 3],
      [0.00538, 1],
      [-0.00329, 2]
    ],
    "red_o_points": [],
    "y_categories": ["N", "NOT APPLICABLE", "Y", "nan"],
    "blue_o_points": [],
    "blue_x_points": [
      [0.00695, 1],
      [-0.0002, 3],
      [0.00633, 1],
      [-0.001, 0],
      [-0.00059, 3],
      [0.00586, 1],
      [0.00748, 1]
    ]
  },
  "QS_mulNeuromadSite[C4]": {
    "red_x_points": [
      [-0.00035, 2],
      [-0.00066, 0],
      [-0.00071, 0],
      [-0.00077, 0],
      [-0.00086, 0],
      [-0.0007, 0],
      [-0.0007, 0],
      [-0.00027, 2],
      [-0.00078, 0],
      [-0.0008, 0],
      [-0.00074, 0],
      [-0.00032, 2],
      [0.00036, 1],
      [-0.00022, 2],
      [-0.0008, 0],
      [-0.00037, 2],
      [-0.00058, 0],
      [-0.00069, 0],
      [-0.00028, 2],
      [-0.00027, 2],
      [-0.00014, 2],
      [-0.00066, 0],
      [-0.00032, 2],
      [-0.00032, 2],
      [-0.00041, 2],
      [-0.00076, 0],
      [-0.00033, 2],
      [-0.00074, 0],
      [-0.00022, 2],
      [0.00156, 1],
      [-0.00065, 0]
    ],
    "red_o_points": [],
    "y_categories": ["N", "NOT APPLICABLE", "nan"],
    "blue_o_points": [],
    "blue_x_points": [
      [0.00467, 1],
      [0.00016, 2],
      [0.00119, 1],
      [0.00038, 0],
      [5e-5, 2],
      [0.00123, 1],
      [0.00158, 1]
    ]
  },
  "QS_mulGraftTrunk[UpperTrunk]": {
    "red_x_points": [
      [-0.00037, 3],
      [-0.00048, 0],
      [-0.00048, 0],
      [-0.00046, 0],
      [-0.00061, 0],
      [-0.00051, 0],
      [-0.00047, 0],
      [-0.00027, 3],
      [-0.00037, 0],
      [-0.00056, 0],
      [-0.00048, 0],
      [-0.0002, 3],
      [0.0011, 1],
      [-0.00044, 3],
      [-0.00279, 2],
      [-0.00055, 3],
      [-0.00013, 0],
      [-0.00047, 0],
      [-0.00027, 3],
      [-0.0003, 3],
      [-0.00033, 3],
      [-0.00048, 0],
      [-0.00059, 3],
      [-0.0003, 3],
      [-0.00035, 3],
      [-0.00041, 0],
      [-0.0002, 3],
      [-0.00046, 0],
      [-0.00018, 3],
      [0.00172, 1],
      [-0.00041, 0]
    ],
    "red_o_points": [],
    "y_categories": ["N", "NOT APPLICABLE", "Y", "nan"],
    "blue_o_points": [],
    "blue_x_points": [
      [0.00226, 1],
      [-0.00032, 3],
      [0.00164, 1],
      [0.00063, 0],
      [-0.00014, 3],
      [0.00155, 1],
      [0.00188, 1]
    ]
  },
  "QS_mulTransfSite[PhMc]": {
    "red_x_points": [
      [-0.00053, 3],
      [-0.00091, 0],
      [-0.0008, 0],
      [-0.00087, 0],
      [-0.00089, 0],
      [-0.00083, 0],
      [-0.00228, 2],
      [-0.00045, 3],
      [-0.00083, 0],
      [-0.00079, 0],
      [-0.00092, 0],
      [-0.00038, 3],
      [0.0024, 1],
      [-0.00026, 3],
      [-0.00108, 0],
      [-0.00035, 3],
      [-0.00097, 0],
      [-0.00096, 0],
      [-0.00043, 3],
      [-0.00047, 3],
      [-0.00049, 3],
      [-0.00184, 2],
      [-0.00048, 3],
      [-0.00043, 3],
      [-0.00048, 3],
      [-0.00069, 0],
      [-0.00042, 3],
      [-0.00094, 0],
      [-0.00045, 3],
      [0.00258, 1],
      [-0.00087, 0]
    ],
    "red_o_points": [],
    "y_categories": ["N", "NOT APPLICABLE", "Y", "nan"],
    "blue_o_points": [],
    "blue_x_points": [
      [0.00316, 1],
      [-7e-5, 3],
      [0.00336, 1],
      [-0.00042, 0],
      [-0.0004, 3],
      [0.00228, 1],
      [0.00289, 1]
    ]
  },
  "QA_mulInjTbpiCause[Motorcycle]": {
    "red_x_points": [
      [0.00274, 0],
      [-0.00129, 1],
      [-0.00141, 1],
      [-0.00177, 1],
      [-0.00121, 1],
      [-0.00141, 1],
      [-0.00183, 1],
      [-0.00173, 1],
      [-0.00169, 1],
      [-0.00151, 1],
      [-0.0013, 1],
      [0.00181, 0],
      [-0.05228, 1],
      [-0.00174, 1],
      [-0.00191, 1],
      [-0.00187, 1],
      [-0.00153, 1],
      [-0.00143, 1],
      [0.00245, 0],
      [-0.0013, 1],
      [-0.00138, 1],
      [-0.00135, 1],
      [-0.00221, 1],
      [-0.0032, 1],
      [0.00266, 0],
      [-0.00123, 1],
      [-0.0012, 1],
      [-0.00123, 1],
      [-0.00186, 1],
      [-0.04891, 1],
      [-0.00131, 1]
    ],
    "red_o_points": [],
    "y_categories": ["N", "Y", "nan"],
    "blue_o_points": [],
    "blue_x_points": [
      [0.02391, 0],
      [-0.00124, 1],
      [0.02048, 0],
      [-0.00277, 1],
      [-0.00138, 1],
      [0.02272, 0],
      [0.02411, 0]
    ]
  },
  "QS_mulLysisRoot[C6]": {
    "red_x_points": [
      [-0.0005, 3],
      [-0.00116, 0],
      [-0.00245, 2],
      [-0.00112, 0],
      [-0.00118, 0],
      [-0.00127, 0],
      [-0.00124, 0],
      [-0.00049, 3],
      [-0.00124, 0],
      [-0.00127, 0],
      [-0.00122, 0],
      [-0.0006, 3],
      [0.00353, 1],
      [-0.00057, 3],
      [-0.00119, 0],
      [-0.00075, 3],
      [-0.00102, 0],
      [-0.00123, 0],
      [-0.00063, 3],
      [-0.0006, 3],
      [-0.00063, 3],
      [-0.0012, 0],
      [-0.00059, 3],
      [-0.00054, 3],
      [-0.00069, 3],
      [-0.00116, 0],
      [-0.00063, 3],
      [-0.00119, 0],
      [-0.00048, 3],
      [0.00348, 1],
      [-0.00215, 2]
    ],
    "red_o_points": [],
    "y_categories": ["N", "NOT APPLICABLE", "Y", "nan"],
    "blue_o_points": [],
    "blue_x_points": [
      [0.00419, 1],
      [-0.00035, 3],
      [0.00328, 1],
      [-0.0013, 0],
      [-0.00036, 3],
      [0.00375, 1],
      [0.00504, 1]
    ]
  },
  "QS_mulGraftNerve[FI]": {
    "red_x_points": [
      [-9e-5, 2],
      [-0.00019, 0],
      [-0.00024, 0],
      [-0.00016, 0],
      [-0.00018, 0],
      [-0.00024, 0],
      [-0.00018, 0],
      [-6e-5, 2],
      [-0.00022, 0],
      [-0.00018, 0],
      [-0.00018, 0],
      [-9e-5, 2],
      [-8e-5, 1],
      [-9e-5, 2],
      [-0.00016, 0],
      [-0.0001, 2],
      [-9e-5, 0],
      [-0.00018, 0],
      [-0.00011, 2],
      [-9e-5, 2],
      [-7e-5, 2],
      [-0.00019, 0],
      [-8e-5, 2],
      [-3e-5, 2],
      [-0.00014, 2],
      [-0.00019, 0],
      [-9e-5, 2],
      [-0.00022, 0],
      [-0.0001, 2],
      [0.00042, 1],
      [-0.00017, 0]
    ],
    "red_o_points": [],
    "y_categories": ["N", "NOT APPLICABLE", "nan"],
    "blue_o_points": [],
    "blue_x_points": [
      [0.00107, 1],
      [-4e-5, 2],
      [0.00044, 1],
      [0.0002, 0],
      [-1e-5, 2],
      [0.00034, 1],
      [0.00033, 1]
    ]
  }
}
