{
  "QS_mulGraftNerve[other]": {
    "red_x_points": [
      [-0.00016, 2],
      [-0.0005, 0],
      [-0.00074, 0],
      [-0.00072, 0],
      [-0.00072, 0],
      [-0.0007, 0],
      [-0.00068, 0],
      [-0.00017, 2],
      [-0.0006, 0],
      [-0.00071, 0],
      [-0.00064, 0],
      [-0.00017, 2],
      [0.00061, 1],
      [-0.0002, 2],
      [-0.00062, 0],
      [-0.00015, 2],
      [-0.00062, 0],
      [-0.00086, 0],
      [-0.00022, 2],
      [-0.00023, 2],
      [-0.00015, 2],
      [-0.00047, 0],
      [-0.00011, 2],
      [-0.00018, 2],
      [-0.00025, 2],
      [-0.00054, 0],
      [-0.00014, 2],
      [-0.0006, 0],
      [-0.00013, 2],
      [0.00103, 1],
      [-0.00051, 0]
    ],
    "red_o_points": [],
    "y_categories": ["N", "NOT APPLICABLE", "nan"],
    "blue_o_points": [],
    "blue_x_points": [
      [0.00298, 1],
      [6e-5, 2],
      [0.00147, 1],
      [0.00013, 0],
      [6e-5, 2],
      [0.00086, 1],
      [0.00155, 1]
    ]
  },
  "participant_code": {
    "red_x_points": [
      [-0.03061, 1],
      [-0.03023, 2],
      [-0.03089, 3],
      [-0.03033, 4],
      [-0.03056, 5],
      [-0.03135, 6],
      [-0.03019, 7],
      [-0.02949, 8],
      [-0.03014, 9],
      [-0.02911, 10],
      [-0.03135, 11],
      [-0.02939, 12],
      [-0.02958, 14],
      [-0.03093, 16],
      [-0.0307, 17],
      [-0.03009, 19],
      [-0.02967, 20],
      [-0.03028, 22],
      [-0.03056, 23],
      [-0.02953, 25],
      [-0.02972, 26],
      [-0.03089, 27],
      [-0.03051, 28],
      [-0.03028, 29],
      [-0.03023, 30],
      [-0.03023, 32],
      [-0.03014, 33],
      [-0.03056, 34],
      [-0.03075, 35],
      [-0.02972, 36],
      [-0.02986, 37]
    ],
    "red_o_points": [],
    "y_categories": [
      "P16554",
      "P18297",
      "P19283",
      "P19287",
      "P23391",
      "P31645",
      "P31691",
      "P34778",
      "P35046",
      "P36328",
      "P43633",
      "P4544",
      "P46417",
      "P48965",
      "P53068",
      "P5497",
      "P59529",
      "P62483",
      "P64658",
      "P65202",
      "P66816",
      "P6751",
      "P7408",
      "P75566",
      "P76226",
      "P79971",
      "P82621",
      "P82990",
      "P84932",
      "P85825",
      "P86989",
      "P8770",
      "P87791",
      "P90550",
      "P93159",
      "P94969",
      "P96710",
      "P9744",
      "nan"
    ],
    "blue_o_points": [],
    "blue_x_points": [
      [0.08784, 0],
      [0.08984, 13],
      [0.09137, 15],
      [0.08907, 18],
      [0.08692, 21],
      [0.08815, 24],
      [0.09014, 31]
    ]
  },
  "QS_mulLysisTrunk[Upper]": {
    "red_x_points": [
      [-0.00131, 3],
      [-0.00173, 0],
      [-0.00161, 0],
      [-0.00173, 0],
      [-0.00159, 0],
      [-0.00399, 2],
      [-0.00161, 0],
      [-0.00124, 3],
      [-0.00185, 0],
      [-0.00167, 0],
      [-0.00172, 0],
      [-0.00136, 3],
      [0.00508, 1],
      [-0.00111, 3],
      [-0.00176, 0],
      [-0.00132, 3],
      [-0.0043, 2],
      [-0.0016, 0],
      [-0.00121, 3],
      [-0.0012, 3],
      [-0.00116, 3],
      [-0.00163, 0],
      [-0.00094, 3],
      [-0.00115, 3],
      [-0.00131, 3],
      [-0.00172, 0],
      [-0.00132, 3],
      [-0.0018, 0],
      [-0.00115, 3],
      [0.00585, 1],
      [-0.00317, 2]
    ],
    "red_o_points": [],
    "y_categories": ["N", "NOT APPLICABLE", "Y", "nan"],
    "blue_o_points": [],
    "blue_x_points": [
      [0.0077, 1],
      [-0.00054, 3],
      [0.00527, 1],
      [-0.0003, 0],
      [-0.00055, 3],
      [0.0063, 1],
      [0.00687, 1]
    ]
  },
  "QS_mulNeuromadSite[C5]": {
    "red_x_points": [
      [-0.00085, 2],
      [-0.00264, 0],
      [-0.00306, 0],
      [-0.00306, 0],
      [-0.00268, 0],
      [-0.00277, 0],
      [-0.00302, 0],
      [-0.00089, 2],
      [-0.00327, 0],
      [-0.00277, 0],
      [-0.00292, 0],
      [-0.00076, 2],
      [0.00317, 1],
      [-0.0013, 2],
      [-0.00311, 0],
      [-0.00112, 2],
      [-0.00236, 0],
      [-0.00255, 0],
      [-0.00075, 2],
      [-0.00083, 2],
      [-0.00044, 2],
      [-0.00265, 0],
      [-0.0009, 2],
      [-0.00086, 2],
      [-0.00103, 2],
      [-0.00251, 0],
      [-0.00096, 2],
      [-0.00308, 0],
      [-0.0006, 2],
      [0.00547, 1],
      [-0.00296, 0]
    ],
    "red_o_points": [],
    "y_categories": ["N", "NOT APPLICABLE", "nan"],
    "blue_o_points": [],
    "blue_x_points": [
      [0.01444, 1],
      [0.0001, 2],
      [0.00501, 1],
      [0.00081, 0],
      [8e-5, 2],
      [0.00656, 1],
      [0.00646, 1]
    ]
  },
  "QS_mulNeuromadSite[C7]": {
    "red_x_points": [
      [-0.00066, 2],
      [-0.00209, 0],
      [-0.00219, 0],
      [-0.00208, 0],
      [-0.00197, 0],
      [-0.00211, 0],
      [-0.0022, 0],
      [-0.00064, 2],
      [-0.00206, 0],
      [-0.00226, 0],
      [-0.00205, 0],
      [-0.00064, 2],
      [0.00228, 1],
      [-0.00077, 2],
      [-0.00193, 0],
      [-0.00086, 2],
      [-0.00174, 0],
      [-0.00204, 0],
      [-0.00078, 2],
      [-0.00059, 2],
      [-0.00052, 2],
      [-0.00147, 0],
      [-0.00075, 2],
      [-0.00077, 2],
      [-0.00089, 2],
      [-0.00217, 0],
      [-0.00069, 2],
      [-0.00194, 0],
      [-0.00059, 2],
      [0.00367, 1],
      [-0.00173, 0]
    ],
    "red_o_points": [],
    "y_categories": ["N", "NOT APPLICABLE", "nan"],
    "blue_o_points": [],
    "blue_x_points": [
      [0.00875, 1],
      [0.0001, 2],
      [0.00408, 1],
      [0.00055, 0],
      [1e-5, 2],
      [0.00453, 1],
      [0.00471, 1]
    ]
  },
  "QS_mulTransfSite[IMc]": {
    "red_x_points": [
      [-0.00191, 3],
      [-0.00622, 2],
      [-0.00358, 0],
      [-0.00339, 0],
      [-0.00354, 0],
      [-0.00325, 0],
      [-0.00342, 0],
      [-0.00181, 3],
      [-0.00364, 0],
      [-0.00333, 0],
      [-0.00339, 0],
      [-0.00202, 3],
      [0.00843, 1],
      [-0.00208, 3],
      [-0.00327, 0],
      [-0.00178, 3],
      [-0.00654, 2],
      [-0.00375, 0],
      [-0.00199, 3],
      [-0.0023, 3],
      [-0.0016, 3],
      [-0.00325, 0],
      [-0.00223, 3],
      [-0.00182, 3],
      [-0.00201, 3],
      [-0.00371, 0],
      [-0.00238, 3],
      [-0.0057, 2],
      [-0.00178, 3],
      [0.00983, 1],
      [-0.00566, 2]
    ],
    "red_o_points": [],
    "y_categories": ["N", "NOT APPLICABLE", "Y", "nan"],
    "blue_o_points": [],
    "blue_x_points": [
      [0.01693, 1],
      [-0.00069, 3],
      [0.01055, 1],
      [-0.00089, 0],
      [-0.00026, 3],
      [0.00959, 1],
      [0.01183, 1]
    ]
  },
  "QA_mulInjOrthesisType[ShoulderSupport]": {
    "red_x_points": [
      [-0.01853, 0],
      [-0.01699, 0],
      [-0.01714, 0],
      [-0.01698, 0],
      [-0.01673, 0],
      [-0.01768, 0],
      [-0.018, 0],
      [-0.02167, 2],
      [-0.01756, 0],
      [-0.01751, 0],
      [-0.01644, 0],
      [-0.01834, 0],
      [0.04766, 1],
      [-0.01904, 0],
      [-0.01784, 0],
      [-0.01914, 0],
      [-0.02043, 2],
      [-0.01705, 0],
      [-0.01838, 0],
      [-0.01818, 0],
      [-0.0221, 2],
      [-0.01992, 3],
      [-0.01842, 0],
      [0.05131, 1],
      [-0.01851, 0],
      [-0.01668, 0],
      [-0.01813, 0],
      [-0.01758, 0],
      [-0.0212, 3],
      [-0.03192, 3],
      [-0.01638, 0]
    ],
    "red_o_points": [],
    "y_categories": ["N", "NOT APPLICABLE", "Y", "nan"],
    "blue_o_points": [],
    "blue_x_points": [
      [-0.00799, 0],
      [0.05442, 1],
      [0.04567, 1],
      [0.05823, 1],
      [0.0528, 1],
      [0.04388, 1],
      [0.04851, 1]
    ]
  },
  "QA_mulInjOrthesisType[ArmSling]": {
    "red_x_points": [
      [-0.01703, 2],
      [-0.01513, 2],
      [-0.01557, 2],
      [-0.01474, 2],
      [-0.01557, 2],
      [-0.01561, 2],
      [-0.01562, 2],
      [-0.01611, 2],
      [-0.01565, 2],
      [-0.01514, 2],
      [-0.01566, 2],
      [-0.01726, 2],
      [0.04204, 1],
      [-0.01725, 2],
      [-0.01487, 2],
      [-0.01579, 2],
      [-0.01877, 0],
      [-0.01559, 2],
      [-0.0171, 2],
      [-0.01721, 2],
      [-0.02046, 0],
      [-0.01867, 3],
      [-0.01705, 2],
      [0.04573, 1],
      [-0.01726, 2],
      [-0.01475, 2],
      [-0.01688, 2],
      [-0.01547, 2],
      [-0.01951, 3],
      [-0.0294, 3],
      [-0.01531, 2]
    ],
    "red_o_points": [],
    "y_categories": ["N", "NOT APPLICABLE", "Y", "nan"],
    "blue_o_points": [],
    "blue_x_points": [
      [-0.00693, 2],
      [0.04786, 1],
      [0.03944, 1],
      [0.04786, 1],
      [0.04735, 1],
      [0.0405, 1],
      [0.0405, 1]
    ]
  },
  "QS_mulGraftNerve[Ac]": {
    "red_x_points": [
      [-2e-5, 2],
      [-6e-5, 0],
      [-0.0001, 0],
      [-6e-5, 0],
      [-7e-5, 0],
      [-7e-5, 0],
      [-0.00012, 0],
      [0.0, 2],
      [-0.00012, 0],
      [-8e-5, 0],
      [-0.00012, 0],
      [-3e-5, 2],
      [-0.00016, 1],
      [-3e-5, 2],
      [-7e-5, 0],
      [-4e-5, 2],
      [-9e-5, 0],
      [-0.00012, 0],
      [-2e-5, 2],
      [-2e-5, 2],
      [-1e-5, 2],
      [-9e-5, 0],
      [-3e-5, 2],
      [-1e-5, 2],
      [-3e-5, 2],
      [-8e-5, 0],
      [-3e-5, 2],
      [-6e-5, 0],
      [0.0, 2],
      [0.00019, 1],
      [-9e-5, 0]
    ],
    "red_o_points": [],
    "y_categories": ["N", "NOT APPLICABLE", "nan"],
    "blue_o_points": [],
    "blue_x_points": [
      [0.00044, 1],
      [0.0, 2],
      [0.00017, 0],
      [8e-5, 2],
      [0.00019, 1],
      [0.00019, 1]
    ]
  },
  "QS_mulGraftNerve[Ph]": {
    "red_x_points": [
      [-2e-5, 2],
      [-7e-5, 0],
      [-8e-5, 0],
      [-8e-5, 0],
      [-9e-5, 0],
      [-7e-5, 0],
      [-4e-5, 0],
      [-1e-5, 2],
      [-3e-5, 0],
      [-7e-5, 0],
      [-9e-5, 0],
      [-1e-5, 2],
      [-3e-5, 2],
      [-9e-5, 0],
      [-4e-5, 2],
      [-5e-5, 0],
      [-8e-5, 0],
      [-4e-5, 2],
      [-4e-5, 2],
      [0.0, 2],
      [-5e-5, 0],
      [-4e-5, 2],
      [0.0, 2],
      [-2e-5, 2],
      [-9e-5, 0],
      [-2e-5, 2],
      [-8e-5, 0],
      [-8e-5, 0]
    ],
    "red_o_points": [],
    "y_categories": ["N", "NOT APPLICABLE", "nan"],
    "blue_o_points": [],
    "blue_x_points": [[0.00071, 1], [0.0, 2], [0.00015, 1], [0.00015, 1]]
  },
  "QS_mulNeuromadSite[C8]": {
    "red_x_points": [
      [-0.0013, 2],
      [-0.00398, 0],
      [-0.0044, 0],
      [-0.00435, 0],
      [-0.00413, 0],
      [-0.00431, 0],
      [-0.00462, 0],
      [-0.00137, 2],
      [-0.0045, 0],
      [-0.00419, 0],
      [-0.00411, 0],
      [-0.0013, 2],
      [0.00671, 1],
      [-0.00162, 2],
      [-0.00448, 0],
      [-0.00163, 2],
      [-0.00427, 0],
      [-0.00436, 0],
      [-0.00122, 2],
      [-0.00127, 2],
      [-0.001, 2],
      [-0.00358, 0],
      [-0.00159, 2],
      [-0.00145, 2],
      [-0.00152, 2],
      [-0.0041, 0],
      [-0.00144, 2],
      [-0.00448, 0],
      [-0.00131, 2],
      [0.00851, 1],
      [-0.00392, 0]
    ],
    "red_o_points": [],
    "y_categories": ["N", "NOT APPLICABLE", "nan"],
    "blue_o_points": [],
    "blue_x_points": [
      [0.01721, 1],
      [-5e-5, 2],
      [0.00879, 1],
      [0.00034, 0],
      [-0.00028, 2],
      [0.00946, 1],
      [0.01065, 1]
    ]
  },
  "QS_mulTransfSite[PhMc]": {
    "red_x_points": [
      [-0.00066, 3],
      [-0.00124, 0],
      [-0.00105, 0],
      [-0.00113, 0],
      [-0.00116, 0],
      [-0.00127, 0],
      [-0.0027, 2],
      [-0.00092, 3],
      [-0.00111, 0],
      [-0.00116, 0],
      [-0.00125, 0],
      [-0.00088, 3],
      [0.00343, 1],
      [-0.00079, 3],
      [-0.00127, 0],
      [-0.00084, 3],
      [-0.00112, 0],
      [-0.0012, 0],
      [-0.00087, 3],
      [-0.00095, 3],
      [-0.00073, 3],
      [-0.00245, 2],
      [-0.00096, 3],
      [-0.00071, 3],
      [-0.00078, 3],
      [-0.00117, 0],
      [-0.00084, 3],
      [-0.00105, 0],
      [-0.00074, 3],
      [0.00436, 1],
      [-0.00111, 0]
    ],
    "red_o_points": [],
    "y_categories": ["N", "NOT APPLICABLE", "Y", "nan"],
    "blue_o_points": [],
    "blue_x_points": [
      [0.00585, 1],
      [-0.00033, 3],
      [0.00373, 1],
      [-0.00121, 0],
      [-0.00031, 3],
      [0.00444, 1],
      [0.00401, 1]
    ]
  },
  "QA_yonInjBpsurg": {
    "red_x_points": [
      [-0.00507, 1],
      [-0.00474, 1],
      [-0.00569, 1],
      [-0.00485, 1],
      [-0.0049, 1],
      [-0.00494, 1],
      [-0.00519, 1],
      [-0.00496, 1],
      [-0.00495, 1],
      [-0.00505, 1],
      [-0.00492, 1],
      [-0.00528, 1],
      [0.0101, 0],
      [-0.00506, 1],
      [-0.00535, 1],
      [-0.00499, 1],
      [-0.00391, 1],
      [-0.00489, 1],
      [-0.00548, 1],
      [-0.0051, 1],
      [-0.00447, 1],
      [-0.00385, 1],
      [-0.00554, 1],
      [-0.00442, 1],
      [-0.00608, 1],
      [-0.00477, 1],
      [-0.00476, 1],
      [-0.0048, 1],
      [-0.00445, 1],
      [0.01489, 0],
      [-0.00458, 1]
    ],
    "red_o_points": [],
    "y_categories": ["N", "Y", "nan"],
    "blue_o_points": [],
    "blue_x_points": [
      [0.03299, 0],
      [-0.00134, 1],
      [0.01477, 0],
      [-0.00325, 1],
      [-0.00159, 1],
      [0.01496, 0],
      [0.01938, 0]
    ]
  },
  "QS_mulNeuromadSite[T1]": {
    "red_x_points": [
      [-0.00151, 2],
      [-0.00393, 0],
      [-0.00423, 0],
      [-0.0045, 0],
      [-0.00451, 0],
      [-0.0045, 0],
      [-0.00459, 0],
      [-0.00142, 2],
      [-0.00399, 0],
      [-0.00456, 0],
      [-0.00417, 0],
      [-0.00143, 2],
      [0.00463, 1],
      [-0.00183, 2],
      [-0.00432, 0],
      [-0.00173, 2],
      [-0.00372, 0],
      [-0.00416, 0],
      [-0.00156, 2],
      [-0.00152, 2],
      [-0.00086, 2],
      [-0.0036, 0],
      [-0.00176, 2],
      [-0.00118, 2],
      [-0.00173, 2],
      [-0.00395, 0],
      [-0.0015, 2],
      [-0.00459, 0],
      [-0.00118, 2],
      [0.00765, 1],
      [-0.00421, 0]
    ],
    "red_o_points": [],
    "y_categories": ["N", "NOT APPLICABLE", "nan"],
    "blue_o_points": [],
    "blue_x_points": [
      [0.01935, 1],
      [-0.00032, 2],
      [0.00882, 1],
      [0.00101, 0],
      [3e-5, 2],
      [0.0091, 1],
      [0.00995, 1]
    ]
  },
  "QS_mulTransfSite[AcSsAA]": {
    "red_x_points": [
      [-0.00293, 3],
      [-0.00783, 2],
      [-0.00301, 0],
      [-0.00761, 2],
      [-0.00973, 2],
      [-0.00312, 0],
      [-0.00312, 0],
      [-0.00257, 3],
      [-0.00316, 0],
      [-0.00822, 2],
      [-0.00295, 0],
      [-0.00291, 3],
      [0.01293, 1],
      [-0.00258, 3],
      [-0.00969, 2],
      [-0.00289, 3],
      [-0.00283, 0],
      [-0.00267, 0],
      [-0.00277, 3],
      [-0.00277, 3],
      [-0.00269, 3],
      [-0.00782, 2],
      [-0.0025, 3],
      [-0.00264, 3],
      [-0.00278, 3],
      [-0.00281, 0],
      [-0.0031, 3],
      [-0.00771, 2],
      [-0.00289, 3],
      [0.01191, 1],
      [-0.00258, 0]
    ],
    "red_o_points": [],
    "y_categories": ["N", "NOT APPLICABLE", "Y", "nan"],
    "blue_o_points": [],
    "blue_x_points": [
      [0.01933, 1],
      [-0.00103, 3],
      [0.01472, 1],
      [-0.00072, 0],
      [-0.00097, 3],
      [0.01501, 1],
      [0.01546, 1]
    ]
  },
  "QS_mulLysisRoot[C5]": {
    "red_x_points": [
      [-0.00047, 3],
      [-0.00067, 0],
      [-0.00172, 2],
      [-0.00066, 0],
      [-0.00075, 0],
      [-0.00067, 0],
      [-0.00068, 0],
      [-0.00052, 3],
      [-0.00059, 0],
      [-0.00068, 0],
      [-0.00074, 0],
      [-0.00044, 3],
      [0.00232, 1],
      [-0.00047, 3],
      [-0.00065, 0],
      [-0.00043, 3],
      [-0.00062, 0],
      [-0.0007, 0],
      [-0.0004, 3],
      [-0.00047, 3],
      [-0.00036, 3],
      [-0.00063, 0],
      [-0.00048, 3],
      [-0.00046, 3],
      [-0.00052, 3],
      [-0.00067, 0],
      [-0.00036, 3],
      [-0.00073, 0],
      [-0.00041, 3],
      [0.00276, 1],
      [-0.00167, 2]
    ],
    "red_o_points": [],
    "y_categories": ["N", "NOT APPLICABLE", "Y", "nan"],
    "blue_o_points": [],
    "blue_x_points": [
      [0.002, 1],
      [-0.00028, 3],
      [0.00222, 1],
      [-0.00082, 0],
      [-0.00029, 3],
      [0.00275, 1],
      [0.00286, 1]
    ]
  },
  "QS_mulNeuromadSite[C6]": {
    "red_x_points": [
      [-0.00044, 2],
      [-0.00092, 0],
      [-0.00106, 0],
      [-0.00106, 0],
      [-0.00115, 0],
      [-0.00097, 0],
      [-0.001, 0],
      [-0.00043, 2],
      [-0.00108, 0],
      [-0.00118, 0],
      [-0.00098, 0],
      [-0.00034, 2],
      [0.00117, 1],
      [-0.0005, 2],
      [-0.00118, 0],
      [-0.00052, 2],
      [-0.0007, 0],
      [-0.00107, 0],
      [-0.00042, 2],
      [-0.0004, 2],
      [-0.00025, 2],
      [-0.00087, 0],
      [-0.00059, 2],
      [-0.00028, 2],
      [-0.00047, 2],
      [-0.001, 0],
      [-0.00041, 2],
      [-0.00115, 0],
      [-0.0003, 2],
      [0.00143, 1],
      [-0.00109, 0]
    ],
    "red_o_points": [],
    "y_categories": ["N", "NOT APPLICABLE", "nan"],
    "blue_o_points": [],
    "blue_x_points": [
      [0.00565, 1],
      [-0.00018, 2],
      [0.00205, 1],
      [0.00037, 0],
      [0.0, 2],
      [0.00182, 1],
      [0.00218, 1]
    ]
  },
  "QS_lstBpsurgSide": {
    "red_x_points": [
      [-0.00596, 3],
      [-0.00779, 0],
      [-0.00827, 0],
      [-0.00789, 0],
      [-0.01732, 2],
      [-0.00739, 0],
      [-0.00815, 0],
      [-0.00511, 3],
      [-0.00827, 0],
      [-0.01592, 2],
      [-0.01607, 2],
      [-0.00596, 3],
      [0.02482, 1],
      [-0.00621, 3],
      [-0.01817, 2],
      [-0.00623, 3],
      [-0.01785, 2],
      [-0.01707, 2],
      [-0.00602, 3],
      [-0.00581, 3],
      [-0.00478, 3],
      [-0.00758, 0],
      [-0.00631, 3],
      [-0.0058, 3],
      [-0.00635, 3],
      [-0.01632, 2],
      [-0.00582, 3],
      [-0.01568, 2],
      [-0.00519, 3],
      [0.028, 1],
      [-0.00837, 0]
    ],
    "red_o_points": [],
    "y_categories": ["L", "NOT APPLICABLE", "R", "nan"],
    "blue_o_points": [],
    "blue_x_points": [
      [0.04697, 1],
      [-0.00182, 3],
      [0.02874, 1],
      [0.00484, 0],
      [-0.00141, 3],
      [0.03017, 1],
      [0.03444, 1]
    ]
  },
  "QS_mulBpsurgeryType[Lysis]": {
    "red_x_points": [
      [-0.00297, 3],
      [-0.00407, 0],
      [-0.0075, 2],
      [-0.00404, 0],
      [-0.00406, 0],
      [-0.00834, 2],
      [-0.00432, 0],
      [-0.00305, 3],
      [-0.00441, 0],
      [-0.00457, 0],
      [-0.00407, 0],
      [-0.00279, 3],
      [0.01221, 1],
      [-0.00277, 3],
      [-0.00382, 0],
      [-0.00278, 3],
      [-0.00837, 2],
      [-0.00459, 0],
      [-0.0027, 3],
      [-0.00277, 3],
      [-0.00244, 3],
      [-0.00365, 0],
      [-0.00269, 3],
      [-0.00278, 3],
      [-0.00275, 3],
      [-0.0042, 0],
      [-0.0031, 3],
      [-0.00409, 0],
      [-0.00229, 3],
      [0.01214, 1],
      [-0.00747, 2]
    ],
    "red_o_points": [],
    "y_categories": ["N", "NOT APPLICABLE", "Y", "nan"],
    "blue_o_points": [],
    "blue_x_points": [
      [0.02004, 1],
      [-0.00108, 3],
      [0.01409, 1],
      [-0.00137, 0],
      [-0.00089, 3],
      [0.01349, 1],
      [0.01483, 1]
    ]
  },
  "QA_yonInjUnconscio": {
    "red_x_points": [
      [-0.00516, 1],
      [-0.00416, 1],
      [-0.00232, 2],
      [-0.00222, 2],
      [0.00782, 0],
      [-0.00502, 1],
      [-0.0025, 2],
      [-0.00496, 2],
      [-0.003, 2],
      [-0.00192, 2],
      [-0.00421, 1],
      [-0.00488, 1],
      [-0.03709, 1],
      [-0.00525, 2],
      [-0.00239, 2],
      [-0.0054, 2],
      [-0.00433, 1],
      [0.00731, 0],
      [-0.00478, 1],
      [-0.00452, 1],
      [-0.00455, 1],
      [-0.0041, 1],
      [-0.00504, 2],
      [-0.01242, 1],
      [-0.00424, 2],
      [-0.00411, 1],
      [0.01212, 0],
      [-0.0034, 1],
      [-0.00474, 2],
      [-0.00085, 2],
      [-0.00427, 1]
    ],
    "red_o_points": [],
    "y_categories": ["N", "Y", "nan"],
    "blue_o_points": [],
    "blue_x_points": [
      [0.00218, 2],
      [-0.00342, 1],
      [0.01935, 0],
      [0.02286, 0],
      [0.02627, 0],
      [0.00326, 2],
      [0.0045, 2]
    ]
  },
  "QA_lstPexMuscstrength[ShoulderAbduc]": {
    "red_x_points": [
      [-0.00743, 1],
      [-0.00704, 1],
      [-0.0078, 1],
      [-0.00781, 1],
      [-0.008, 1],
      [-0.00697, 1],
      [-0.00743, 1],
      [-0.00673, 1],
      [-0.00737, 1],
      [-0.00707, 1],
      [-0.00773, 1],
      [-0.0073, 1],
      [0.00167, 2],
      [0.0054, 2],
      [0.00644, 2],
      [0.00573, 2],
      [0.00688, 2],
      [-0.0081, 1],
      [-0.00791, 1],
      [-0.00718, 1],
      [-0.00707, 1],
      [-0.00691, 1],
      [0.00611, 2],
      [-0.01078, 1],
      [-0.00772, 1],
      [-0.00726, 1],
      [-0.0079, 1],
      [-0.00721, 1],
      [-0.00736, 1],
      [0.00304, 2],
      [-0.00756, 1]
    ],
    "red_o_points": [],
    "y_categories": ["GREATER THAN OR EQUALS TO 3", "LESS THAN 3", "nan"],
    "blue_o_points": [],
    "blue_x_points": [
      [0.00413, 2],
      [0.00661, 2],
      [0.03228, 0],
      [0.00752, 2],
      [0.00684, 2],
      [0.0332, 0],
      [-0.0017, 1]
    ]
  },
  "QS_mulNeuromadSite[T2]": {
    "red_x_points": [
      [-0.00286, 2],
      [-0.00901, 0],
      [-0.00832, 0],
      [-0.00832, 0],
      [-0.00901, 0],
      [-0.00748, 0],
      [-0.00783, 0],
      [-0.00264, 2],
      [-0.00886, 0],
      [-0.00859, 0],
      [-0.00775, 0],
      [-0.00292, 2],
      [0.01344, 1],
      [-0.00302, 2],
      [-0.0089, 0],
      [-0.00317, 2],
      [-0.00722, 0],
      [-0.00813, 0],
      [-0.00296, 2],
      [-0.00278, 2],
      [-0.00215, 2],
      [-0.00722, 0],
      [-0.00313, 2],
      [-0.00272, 2],
      [-0.00289, 2],
      [-0.00778, 0],
      [-0.00287, 2],
      [-0.00872, 0],
      [-0.00225, 2],
      [0.01609, 1],
      [-0.00813, 0]
    ],
    "red_o_points": [],
    "y_categories": ["N", "NOT APPLICABLE", "nan"],
    "blue_o_points": [],
    "blue_x_points": [
      [0.03759, 1],
      [-0.00056, 2],
      [0.01719, 1],
      [0.00019, 0],
      [-0.00076, 2],
      [0.01734, 1],
      [0.01802, 1]
    ]
  },
  "QS_mulLysisSite[Trunk]": {
    "red_x_points": [
      [-0.00118, 3],
      [-0.00158, 0],
      [-0.00129, 0],
      [-0.0014, 0],
      [-0.00152, 0],
      [-0.00306, 2],
      [-0.00146, 0],
      [-0.00087, 3],
      [-0.00126, 0],
      [-0.00159, 0],
      [-0.0014, 0],
      [-0.00093, 3],
      [0.00481, 1],
      [-0.0008, 3],
      [-0.00113, 0],
      [-0.00098, 3],
      [-0.00379, 2],
      [-0.0014, 0],
      [-0.00089, 3],
      [-0.00102, 3],
      [-0.00084, 3],
      [-0.00133, 0],
      [-0.00101, 3],
      [-0.00087, 3],
      [-0.00076, 3],
      [-0.00134, 0],
      [-0.00111, 3],
      [-0.00137, 0],
      [-0.00091, 3],
      [0.00371, 1],
      [-0.0028, 2]
    ],
    "red_o_points": [],
    "y_categories": ["N", "NOT APPLICABLE", "Y", "nan"],
    "blue_o_points": [],
    "blue_x_points": [
      [0.00635, 1],
      [-0.00032, 3],
      [0.00447, 1],
      [-0.00051, 0],
      [-0.0005, 3],
      [0.00459, 1],
      [0.00565, 1]
    ]
  },
  "QS_mulNeuromadSite[C4]": {
    "red_x_points": [
      [-0.00044, 2],
      [-0.00088, 0],
      [-0.00088, 0],
      [-0.00075, 0],
      [-0.00087, 0],
      [-0.00073, 0],
      [-0.00079, 0],
      [-0.00025, 2],
      [-0.00068, 0],
      [-0.00061, 0],
      [-0.0008, 0],
      [-0.00029, 2],
      [0.00099, 1],
      [-0.00046, 2],
      [-0.00093, 0],
      [-0.00038, 2],
      [-0.00059, 0],
      [-0.00088, 0],
      [-0.00039, 2],
      [-0.00038, 2],
      [-0.0003, 2],
      [-0.00079, 0],
      [-0.00043, 2],
      [-0.00025, 2],
      [-0.00048, 2],
      [-0.00081, 0],
      [-0.00042, 2],
      [-0.00087, 0],
      [-0.0002, 2],
      [0.00157, 1],
      [-0.00085, 0]
    ],
    "red_o_points": [],
    "y_categories": ["N", "NOT APPLICABLE", "nan"],
    "blue_o_points": [],
    "blue_x_points": [
      [0.00492, 1],
      [-0.00012, 2],
      [0.00152, 1],
      [0.00018, 0],
      [-7e-5, 2],
      [0.00117, 1],
      [0.00171, 1]
    ]
  },
  "QS_mulGraftTrunk[UpperTrunk]": {
    "red_x_points": [
      [-0.00024, 3],
      [-0.00033, 0],
      [-0.0003, 0],
      [-0.00045, 0],
      [-0.00026, 0],
      [-0.00038, 0],
      [-0.00037, 0],
      [-0.00022, 3],
      [-0.0003, 0],
      [-0.00042, 0],
      [-0.00042, 0],
      [-0.00025, 3],
      [0.00106, 1],
      [-0.00019, 3],
      [-0.00228, 2],
      [-0.00036, 3],
      [-0.00027, 0],
      [-0.00038, 0],
      [-0.00027, 3],
      [-0.00026, 3],
      [-0.00025, 3],
      [-0.00036, 0],
      [-0.00017, 3],
      [-0.00023, 3],
      [-0.00029, 3],
      [-0.00027, 0],
      [-0.00022, 3],
      [-0.0003, 0],
      [-0.0002, 3],
      [0.00104, 1],
      [-0.00027, 0]
    ],
    "red_o_points": [],
    "y_categories": ["N", "NOT APPLICABLE", "Y", "nan"],
    "blue_o_points": [],
    "blue_x_points": [
      [0.00128, 1],
      [-0.00011, 3],
      [0.00099, 1],
      [0.00059, 0],
      [-5e-5, 3],
      [0.00106, 1],
      [0.00142, 1]
    ]
  },
  "QS_mulTransfSite[Oberlin]": {
    "red_x_points": [
      [-0.00515, 3],
      [-0.01491, 0],
      [-0.01514, 0],
      [-0.01514, 0],
      [-0.00824, 2],
      [-0.00749, 2],
      [-0.01529, 0],
      [-0.00468, 3],
      [-0.00771, 2],
      [-0.0073, 2],
      [-0.00724, 2],
      [-0.00478, 3],
      [0.02392, 1],
      [-0.00544, 3],
      [-0.00705, 2],
      [-0.00523, 3],
      [-0.01474, 0],
      [-0.00756, 2],
      [-0.00536, 3],
      [-0.00472, 3],
      [-0.00455, 3],
      [-0.01472, 0],
      [-0.00559, 3],
      [-0.0048, 3],
      [-0.00549, 3],
      [-0.00786, 2],
      [-0.00506, 3],
      [-0.01469, 0],
      [-0.0042, 3],
      [0.02526, 1],
      [-0.01504, 0]
    ],
    "red_o_points": [],
    "y_categories": ["N", "NOT APPLICABLE", "Y", "nan"],
    "blue_o_points": [],
    "blue_x_points": [
      [0.04278, 1],
      [-0.00119, 3],
      [0.02832, 1],
      [0.00176, 2],
      [-0.00168, 3],
      [0.02601, 1],
      [0.03068, 1]
    ]
  },
  "QA_mulInjTbpiCause[Motorcycle]": {
    "red_x_points": [
      [0.00168, 0],
      [-0.0012, 1],
      [-0.00193, 1],
      [-0.00178, 1],
      [-0.00119, 1],
      [-0.0012, 1],
      [-0.00179, 1],
      [-0.0017, 1],
      [-0.00174, 1],
      [-0.00159, 1],
      [-0.00113, 1],
      [0.00279, 0],
      [-0.05151, 1],
      [-0.00209, 1],
      [-0.00215, 1],
      [-0.00163, 1],
      [-0.00154, 1],
      [-0.00111, 1],
      [0.00177, 0],
      [-0.00122, 1],
      [-0.0012, 1],
      [-0.00133, 1],
      [-0.00207, 1],
      [-0.00321, 1],
      [0.00333, 0],
      [-0.00114, 1],
      [-0.00106, 1],
      [-0.00103, 1],
      [-0.00152, 1],
      [-0.04996, 1],
      [-0.00129, 1]
    ],
    "red_o_points": [],
    "y_categories": ["N", "Y", "nan"],
    "blue_o_points": [],
    "blue_x_points": [
      [0.02361, 0],
      [-0.00182, 1],
      [0.02146, 0],
      [-0.00327, 1],
      [-0.00159, 1],
      [0.02364, 0],
      [0.0253, 0]
    ]
  },
  "QS_mulLysisRoot[C6]": {
    "red_x_points": [
      [-0.00073, 3],
      [-0.00085, 0],
      [-0.00239, 2],
      [-0.00075, 0],
      [-0.00079, 0],
      [-0.00074, 0],
      [-0.00072, 0],
      [-0.00065, 3],
      [-0.0007, 0],
      [-0.00075, 0],
      [-0.00073, 0],
      [-0.00068, 3],
      [0.00339, 1],
      [-0.00068, 3],
      [-0.00095, 0],
      [-0.00071, 3],
      [-0.00077, 0],
      [-0.00073, 0],
      [-0.00061, 3],
      [-0.00061, 3],
      [-0.00061, 3],
      [-0.00084, 0],
      [-0.00058, 3],
      [-0.0008, 3],
      [-0.00055, 3],
      [-0.00082, 0],
      [-0.0006, 3],
      [-0.00084, 0],
      [-0.00049, 3],
      [0.00283, 1],
      [-0.00209, 2]
    ],
    "red_o_points": [],
    "y_categories": ["N", "NOT APPLICABLE", "Y", "nan"],
    "blue_o_points": [],
    "blue_x_points": [
      [0.00371, 1],
      [-0.00034, 3],
      [0.00297, 1],
      [-0.00086, 0],
      [-0.00024, 3],
      [0.00282, 1],
      [0.00315, 1]
    ]
  },
  "QS_mulGraftNerve[FI]": {
    "red_x_points": [
      [-1e-5, 0],
      [-1e-5, 0],
      [-1e-5, 0],
      [-1e-5, 0],
      [-1e-5, 0],
      [-1e-5, 2],
      [-1e-5, 0],
      [-1e-5, 0],
      [-1e-5, 0],
      [-1e-5, 2],
      [-0.00039, 1],
      [-1e-5, 0],
      [-1e-5, 2],
      [-1e-5, 2],
      [-0.0, 2],
      [-1e-5, 2],
      [-1e-5, 0],
      [-1e-5, 2],
      [-1e-5, 0],
      [-1e-5, 0]
    ],
    "red_o_points": [],
    "y_categories": ["N", "NOT APPLICABLE", "nan"],
    "blue_o_points": [],
    "blue_x_points": [[0.00019, 1], [8e-5, 2], [0.00021, 0], [-0.0, 2]]
  }
}
