{
  "QA_lstPexMuscstrength[ElbowFlex]": {
    "red_x_points": [
      [-0.01362, 1],
      [-0.00079, 2],
      [-0.01215, 1],
      [-0.01187, 1],
      [-0.01231, 1],
      [-0.01332, 1],
      [-0.01318, 1],
      [-0.01166, 1],
      [-0.01264, 1],
      [-0.01369, 1],
      [-0.01285, 1],
      [-0.01379, 1],
      [-0.0008, 2],
      [-0.00392, 2],
      [0.00135, 2],
      [-0.01306, 1],
      [-0.01315, 1],
      [-0.0126, 1],
      [-0.01212, 1],
      [-0.01275, 1],
      [-0.00083, 2],
      [-0.01258, 1],
      [-0.01358, 1],
      [-0.01275, 1],
      [-0.01183, 1],
      [0.00065, 2],
      [-0.01195, 1],
      [-0.01293, 1],
      [-0.0006, 2]
    ],
    "red_o_points": [],
    "y_categories": ["GREATER THAN OR EQUALS TO 3", "LESS THAN 3", "nan"],
    "blue_o_points": [],
    "blue_x_points": [
      [0.00112, 2],
      [-0.01204, 1],
      [0.06941, 0],
      [-0.01256, 1],
      [0.00405, 2],
      [0.00299, 2],
      [0.0477, 0],
      [-0.01043, 1],
      [-0.01184, 1],
      [0.00258, 2],
      [0.06519, 0],
      [0.04788, 0],
      [0.05519, 0],
      [0.04756, 0],
      [-0.0115, 1]
    ]
  },
  "participant_code": {
    "red_x_points": [
      [-0.04532, 1],
      [-0.04223, 2],
      [-0.04292, 3],
      [-0.04353, 4],
      [-0.04429, 5],
      [-0.04347, 8],
      [-0.04477, 9],
      [-0.04388, 10],
      [-0.0423, 11],
      [-0.04415, 13],
      [-0.0436, 14],
      [-0.04203, 18],
      [-0.04347, 19],
      [-0.04278, 20],
      [-0.04292, 23],
      [-0.04367, 26],
      [-0.04484, 28],
      [-0.04312, 29],
      [-0.04333, 30],
      [-0.04257, 31],
      [-0.04456, 32],
      [-0.04415, 34],
      [-0.04456, 36],
      [-0.04203, 38],
      [-0.0423, 39],
      [-0.04264, 40],
      [-0.04333, 41],
      [-0.04388, 42],
      [-0.04484, 43]
    ],
    "red_o_points": [],
    "y_categories": [
      "P16554",
      "P18297",
      "P19283",
      "P19287",
      "P23172",
      "P23391",
      "P30595",
      "P31645",
      "P31691",
      "P34778",
      "P35046",
      "P36328",
      "P43633",
      "P4544",
      "P46417",
      "P48965",
      "P53068",
      "P5497",
      "P58556",
      "P59529",
      "P62483",
      "P64658",
      "P65202",
      "P66816",
      "P6751",
      "P7408",
      "P75566",
      "P76226",
      "P79971",
      "P82621",
      "P82990",
      "P84549",
      "P84932",
      "P85825",
      "P86989",
      "P8770",
      "P87791",
      "P90550",
      "P93159",
      "P94969",
      "P96710",
      "P97130",
      "P9744",
      "P98500",
      "nan"
    ],
    "blue_o_points": [],
    "blue_x_points": [
      [0.08567, 0],
      [0.08436, 6],
      [0.08633, 7],
      [0.08449, 12],
      [0.08423, 15],
      [0.08489, 16],
      [0.08252, 17],
      [0.08226, 21],
      [0.08383, 22],
      [0.08291, 24],
      [0.08541, 25],
      [0.08344, 27],
      [0.08357, 33],
      [0.08331, 35],
      [0.08423, 37]
    ]
  },
  "QS_mulLysisTrunk[Upper]": {
    "red_x_points": [
      [-0.00077, 3],
      [-0.00647, 0],
      [-0.00357, 0],
      [-0.00345, 0],
      [-0.00368, 0],
      [-0.01416, 2],
      [-0.00381, 0],
      [-0.00112, 3],
      [-0.00373, 0],
      [-0.00375, 0],
      [-0.00068, 3],
      [-0.004, 0],
      [-0.00141, 3],
      [-0.00517, 0],
      [-0.01307, 2],
      [-0.00085, 3],
      [-0.00074, 3],
      [-0.00066, 3],
      [-0.00341, 0],
      [-0.00084, 3],
      [-0.0015, 3],
      [-0.00105, 3],
      [-0.0038, 0],
      [-0.00325, 0],
      [-0.00097, 3],
      [0.01509, 1],
      [-0.00093, 3],
      [-0.01414, 2],
      [-0.00131, 3]
    ],
    "red_o_points": [],
    "y_categories": ["N", "NOT APPLICABLE", "Y", "nan"],
    "blue_o_points": [],
    "blue_x_points": [
      [0.02832, 1],
      [-0.00077, 3],
      [-0.00184, 0],
      [-0.00204, 0],
      [0.00011, 3],
      [0.02159, 1],
      [0.01519, 1],
      [-0.00251, 0],
      [-0.00054, 3],
      [-0.00038, 3],
      [-0.00149, 0],
      [0.01596, 1],
      [-0.00038, 3],
      [0.01677, 1],
      [-0.00074, 3]
    ]
  },
  "QS_mulNeuromadSite[C5]": {
    "red_x_points": [
      [1e-5, 2],
      [-6e-5, 0],
      [-5e-5, 0],
      [-6e-5, 0],
      [-7e-5, 0],
      [-2e-5, 0],
      [-7e-5, 0],
      [0.0, 2],
      [-6e-5, 0],
      [-7e-5, 0],
      [0.0, 2],
      [-3e-5, 0],
      [-1e-5, 2],
      [-7e-5, 0],
      [-3e-5, 0],
      [0.0, 2],
      [0.0, 2],
      [-0.0, 2],
      [-3e-5, 0],
      [1e-5, 2],
      [0.0, 2],
      [-1e-5, 2],
      [-7e-5, 0],
      [-2e-5, 0],
      [-1e-5, 2],
      [-1e-5, 2],
      [-2e-5, 0],
      [1e-5, 2]
    ],
    "red_o_points": [],
    "y_categories": ["N", "NOT APPLICABLE", "nan"],
    "blue_o_points": [],
    "blue_x_points": [
      [0.00046, 1],
      [-1e-5, 2],
      [-2e-5, 0],
      [-5e-5, 0],
      [0.00017, 1],
      [1e-5, 2],
      [0.00014, 1],
      [-0.0, 2],
      [0.0, 2]
    ]
  },
  "QS_mulNeuromadSite[C7]": {
    "red_x_points": [
      [-0.00019, 0],
      [-6e-5, 0],
      [-3e-5, 0],
      [-0.00012, 0],
      [-6e-5, 0],
      [1e-5, 2],
      [-0.00012, 0],
      [3e-5, 2],
      [-0.00013, 0],
      [-7e-5, 0],
      [3e-5, 2],
      [1e-5, 2],
      [8e-5, 1],
      [3e-5, 2]
    ],
    "red_o_points": [],
    "y_categories": ["N", "NOT APPLICABLE", "nan"],
    "blue_o_points": [],
    "blue_x_points": [
      [0.00049, 1],
      [2e-5, 2],
      [-6e-5, 0],
      [3e-5, 2],
      [8e-5, 1],
      [2e-5, 2],
      [3e-5, 2]
    ]
  },
  "QS_mulTransfSite[IMc]": {
    "red_x_points": [
      [-0.00108, 3],
      [-0.02009, 2],
      [-0.0027, 0],
      [-0.01631, 2],
      [-0.00271, 0],
      [-0.00282, 0],
      [-0.00288, 0],
      [-0.00148, 3],
      [-0.0032, 0],
      [-0.00294, 0],
      [-0.00093, 3],
      [-0.00288, 0],
      [-0.00201, 3],
      [-0.00526, 0],
      [-0.0165, 2],
      [-0.00111, 3],
      [-0.00106, 3],
      [-0.00081, 3],
      [-0.00282, 0],
      [-0.00109, 3],
      [-0.00191, 3],
      [-0.00155, 3],
      [-0.00293, 0],
      [-0.01968, 2],
      [-0.00149, 3],
      [0.01937, 1],
      [-0.00146, 3],
      [-0.01747, 2],
      [-0.00154, 3]
    ],
    "red_o_points": [],
    "y_categories": ["N", "NOT APPLICABLE", "Y", "nan"],
    "blue_o_points": [],
    "blue_x_points": [
      [0.03566, 1],
      [-0.00098, 3],
      [-0.00038, 0],
      [9e-5, 0],
      [0.00011, 3],
      [0.02787, 1],
      [0.01924, 1],
      [-0.0016, 0],
      [-0.00085, 3],
      [-0.00035, 3],
      [-0.00021, 0],
      [0.02135, 1],
      [-0.00048, 3],
      [0.02066, 1],
      [-0.00077, 3]
    ]
  },
  "QA_mulInjOrthesisType[ArmSling]": {
    "red_x_points": [
      [-0.00954, 2],
      [-0.00978, 2],
      [-0.00938, 2],
      [-0.00951, 2],
      [-0.0096, 2],
      [-0.00917, 2],
      [-0.00936, 2],
      [-0.00959, 2],
      [-0.00989, 2],
      [-0.00948, 2],
      [-0.00937, 2],
      [-0.00967, 2],
      [-0.00992, 2],
      [-0.00969, 2],
      [-0.03058, 0],
      [-0.00986, 2],
      [-0.00979, 2],
      [-0.02897, 0],
      [-0.02931, 3],
      [-0.00974, 2],
      [-0.00946, 2],
      [-0.00948, 2],
      [-0.01013, 2],
      [-0.00924, 2],
      [-0.03038, 3],
      [-0.03121, 3],
      [-0.03063, 3],
      [-0.00967, 2],
      [-0.00979, 2]
    ],
    "red_o_points": [],
    "y_categories": ["N", "NOT APPLICABLE", "Y", "nan"],
    "blue_o_points": [],
    "blue_x_points": [
      [-0.00911, 2],
      [-0.00904, 2],
      [-0.00923, 2],
      [-0.00897, 2],
      [0.06081, 1],
      [0.05917, 1],
      [0.05522, 1],
      [0.05969, 1],
      [-0.00928, 2],
      [0.05717, 1],
      [-0.00932, 2],
      [0.05643, 1],
      [0.05946, 1],
      [0.05832, 1],
      [-0.00912, 2]
    ]
  },
  "QS_mulLysisSite[Nerve]": {
    "red_x_points": [
      [-8e-5, 3],
      [-0.00254, 0],
      [-0.00701, 2],
      [-0.00597, 2],
      [-0.00155, 0],
      [-0.00134, 0],
      [-0.00167, 0],
      [-0.0007, 3],
      [-0.00147, 0],
      [-0.00143, 0],
      [-0.0001, 3],
      [-0.00146, 0],
      [-0.00095, 3],
      [-0.00249, 0],
      [-0.00212, 0],
      [-7e-5, 3],
      [-0.00014, 3],
      [-4e-5, 3],
      [-0.00128, 0],
      [-0.00018, 3],
      [-0.00086, 3],
      [-0.00076, 3],
      [-0.00149, 0],
      [-0.00148, 0],
      [-0.00063, 3],
      [0.00676, 1],
      [-0.00069, 3],
      [-0.00145, 0],
      [-0.00088, 3]
    ],
    "red_o_points": [],
    "y_categories": ["N", "NOT APPLICABLE", "Y", "nan"],
    "blue_o_points": [],
    "blue_x_points": [
      [0.01358, 1],
      [-0.00035, 3],
      [-0.00074, 0],
      [-0.00118, 0],
      [0.00026, 3],
      [0.0077, 1],
      [0.00452, 1],
      [-0.00099, 0],
      [-0.00046, 3],
      [-0.00016, 3],
      [-0.00088, 0],
      [0.00661, 1],
      [-3e-5, 3],
      [0.00634, 1],
      [-0.00013, 3]
    ]
  },
  "QS_mulNeuromadSite[C8]": {
    "red_x_points": [
      [-1e-5, 2],
      [-0.00027, 0],
      [-5e-5, 0],
      [-0.0, 0],
      [-9e-5, 0],
      [-2e-5, 0],
      [-0.0001, 0],
      [-6e-5, 2],
      [-8e-5, 0],
      [-8e-5, 0],
      [-1e-5, 2],
      [-4e-5, 0],
      [-0.00014, 2],
      [-0.00032, 0],
      [-0.0003, 0],
      [-0.0, 2],
      [-0.0, 2],
      [-1e-5, 2],
      [-5e-5, 2],
      [-5e-5, 2],
      [-8e-5, 0],
      [-4e-5, 0],
      [0.00019, 1],
      [-5e-5, 2],
      [-2e-5, 0],
      [-0.00014, 2]
    ],
    "red_o_points": [],
    "y_categories": ["N", "NOT APPLICABLE", "nan"],
    "blue_o_points": [],
    "blue_x_points": [
      [0.00147, 1],
      [1e-5, 2],
      [-2e-5, 0],
      [-3e-5, 0],
      [0.0001, 2],
      [0.00017, 1],
      [3e-5, 2],
      [2e-5, 2],
      [-2e-5, 0],
      [9e-5, 1],
      [-0.0, 2]
    ]
  },
  "QS_mulTransfSite[AcSsPA]": {
    "red_x_points": [
      [-2e-5, 3],
      [-0.00031, 0],
      [-0.0002, 0],
      [-0.0002, 0],
      [-0.00021, 0],
      [-0.00015, 0],
      [-0.00023, 0],
      [-3e-5, 3],
      [-0.00028, 0],
      [-0.00022, 0],
      [-3e-5, 3],
      [-0.00012, 0],
      [-3e-5, 3],
      [-0.00023, 0],
      [-0.00079, 2],
      [-2e-5, 3],
      [-1e-5, 3],
      [-2e-5, 3],
      [-0.00023, 0],
      [-3e-5, 3],
      [1e-5, 3],
      [1e-5, 3],
      [-0.00022, 0],
      [-0.00016, 0],
      [-2e-5, 3],
      [0.00069, 1],
      [-1e-5, 3],
      [-0.00022, 0],
      [-1e-5, 3]
    ],
    "red_o_points": [],
    "y_categories": ["N", "NOT APPLICABLE", "Y", "nan"],
    "blue_o_points": [],
    "blue_x_points": [
      [0.00094, 1],
      [1e-5, 3],
      [-0.00013, 0],
      [-0.00014, 0],
      [-1e-5, 3],
      [0.00087, 1],
      [0.0009, 1],
      [-0.0002, 0],
      [0.0, 3],
      [-2e-5, 3],
      [-0.0001, 0],
      [0.00059, 1],
      [-0.0, 3],
      [0.00059, 1],
      [-2e-5, 3]
    ]
  },
  "QS_mulTransfSite[AcMc]": {
    "red_x_points": [
      [-7e-5, 3],
      [-0.00089, 0],
      [-0.00038, 0],
      [-0.00045, 0],
      [-0.0005, 0],
      [-0.0004, 0],
      [-0.00046, 0],
      [-5e-5, 3],
      [-0.00041, 0],
      [-0.00317, 2],
      [-8e-5, 3],
      [-0.00024, 0],
      [-6e-5, 3],
      [-0.00082, 0],
      [-0.00056, 0],
      [-3e-5, 3],
      [-4e-5, 3],
      [-8e-5, 3],
      [-0.0004, 0],
      [1e-5, 3],
      [-0.00012, 3],
      [-6e-5, 3],
      [-0.00018, 0],
      [-0.00033, 0],
      [-0.0001, 3],
      [0.00131, 1],
      [-0.00012, 3],
      [-0.00036, 0],
      [3e-5, 3]
    ],
    "red_o_points": [],
    "y_categories": ["N", "NOT APPLICABLE", "Y", "nan"],
    "blue_o_points": [],
    "blue_x_points": [
      [0.00332, 1],
      [-2e-5, 3],
      [-2e-5, 0],
      [2e-5, 0],
      [7e-5, 3],
      [0.00223, 1],
      [0.00096, 1],
      [-0.00012, 0],
      [-3e-5, 3],
      [1e-5, 3],
      [0.00012, 0],
      [0.00136, 1],
      [-5e-5, 3],
      [0.00117, 1],
      [-3e-5, 3]
    ]
  },
  "QS_mulTransfSite[Other]": {
    "red_x_points": [
      [-0.00084, 3],
      [-0.0109, 0],
      [-0.00905, 0],
      [-0.00871, 0],
      [-0.00941, 0],
      [-0.00986, 0],
      [-0.00901, 0],
      [-0.00123, 3],
      [-0.00991, 0],
      [-0.01019, 0],
      [-0.00074, 3],
      [-0.01073, 0],
      [-0.00171, 3],
      [-0.01169, 0],
      [-0.00939, 0],
      [-0.00095, 3],
      [-0.00093, 3],
      [-0.00077, 3],
      [-0.00815, 0],
      [-0.00088, 3],
      [-0.0017, 3],
      [-0.00139, 3],
      [-0.01081, 0],
      [-0.00979, 0],
      [-0.00122, 3],
      [0.01727, 1],
      [-0.00131, 3],
      [-0.00947, 0],
      [-0.00121, 3]
    ],
    "red_o_points": [],
    "y_categories": ["N", "NOT APPLICABLE", "Y", "nan"],
    "blue_o_points": [],
    "blue_x_points": [
      [0.03436, 1],
      [-0.00082, 3],
      [-0.00783, 0],
      [-0.00841, 0],
      [-4e-5, 3],
      [0.02609, 1],
      [0.01951, 1],
      [-0.00671, 0],
      [-0.00079, 3],
      [-0.00036, 3],
      [0.04973, 2],
      [0.01974, 1],
      [-0.0003, 3],
      [0.02127, 1],
      [-0.00072, 3]
    ]
  },
  "QA_mulInjOrthesisType[ShoulderSupport]": {
    "red_x_points": [
      [-0.00967, 0],
      [-0.00974, 0],
      [-0.00929, 0],
      [-0.03777, 2],
      [-0.0096, 0],
      [-0.00986, 0],
      [-0.00983, 0],
      [-0.03781, 2],
      [-0.00976, 0],
      [-0.00944, 0],
      [-0.00959, 0],
      [-0.00958, 0],
      [-0.00966, 0],
      [-0.00968, 0],
      [-0.03606, 2],
      [-0.00999, 0],
      [-0.0096, 0],
      [-0.03773, 2],
      [-0.03646, 3],
      [-0.00944, 0],
      [-0.00938, 0],
      [-0.01006, 0],
      [-0.00961, 0],
      [-0.00941, 0],
      [-0.03697, 3],
      [-0.03783, 3],
      [-0.03691, 3],
      [-0.0099, 0],
      [-0.00951, 0]
    ],
    "red_o_points": [],
    "y_categories": ["N", "NOT APPLICABLE", "Y", "nan"],
    "blue_o_points": [],
    "blue_x_points": [
      [-0.00965, 0],
      [-0.0093, 0],
      [-0.00954, 0],
      [-0.00918, 0],
      [0.06987, 1],
      [0.07017, 1],
      [0.06964, 1],
      [0.07173, 1],
      [-0.00941, 0],
      [0.07163, 1],
      [-0.00915, 0],
      [0.06953, 1],
      [0.07275, 1],
      [0.07057, 1],
      [-0.00951, 0]
    ]
  },
  "QS_mulLysisNerve[Ssr]": {
    "red_x_points": [
      [-0.00035, 3],
      [-0.00335, 0],
      [-0.0074, 2],
      [-0.00818, 2],
      [-0.00213, 0],
      [-0.002, 0],
      [-0.00211, 0],
      [-0.00094, 3],
      [-0.00214, 0],
      [-0.00204, 0],
      [-0.00046, 3],
      [-0.00202, 0],
      [-0.00116, 3],
      [-0.0033, 0],
      [-0.00305, 0],
      [-0.00044, 3],
      [-0.0005, 3],
      [-0.0003, 3],
      [-0.00193, 0],
      [-0.00038, 3],
      [-0.00107, 3],
      [-0.0009, 3],
      [-0.00225, 0],
      [-0.00199, 0],
      [-0.00081, 3],
      [0.00809, 1],
      [-0.00094, 3],
      [-0.00197, 0],
      [-0.00131, 3]
    ],
    "red_o_points": [],
    "y_categories": ["N", "NOT APPLICABLE", "Y", "nan"],
    "blue_o_points": [],
    "blue_x_points": [
      [0.01664, 1],
      [-0.00057, 3],
      [-0.00126, 0],
      [-0.00168, 0],
      [-1e-5, 3],
      [0.01029, 1],
      [0.00815, 1],
      [-0.00159, 0],
      [-0.00049, 3],
      [-0.00022, 3],
      [-0.00138, 0],
      [0.01041, 1],
      [-0.00014, 3],
      [0.00958, 1],
      [-0.00038, 3]
    ]
  },
  "QS_mulTransfSite[AcSsAA]": {
    "red_x_points": [
      [-0.00015, 3],
      [0.00094, 2],
      [-0.00587, 0],
      [-0.00474, 0],
      [0.00164, 2],
      [-0.00545, 0],
      [-0.00595, 0],
      [-0.00054, 3],
      [-0.00817, 0],
      [-0.00584, 0],
      [-0.0001, 3],
      [-0.00652, 0],
      [-0.00086, 3],
      [0.00338, 2],
      [-0.00266, 0],
      [-0.00028, 3],
      [-0.00021, 3],
      [-4e-5, 3],
      [8e-5, 2],
      [-0.00024, 3],
      [-0.00071, 3],
      [-0.00056, 3],
      [-0.00639, 0],
      [0.00097, 2],
      [-0.00048, 3],
      [0.0064, 1],
      [-0.00064, 3],
      [-0.00363, 0],
      [-0.00076, 3]
    ],
    "red_o_points": [],
    "y_categories": ["N", "NOT APPLICABLE", "Y", "nan"],
    "blue_o_points": [],
    "blue_x_points": [
      [0.01583, 1],
      [-0.00033, 3],
      [0.00828, 2],
      [0.00865, 2],
      [-5e-5, 3],
      [0.00501, 1],
      [0.00432, 1],
      [-0.00263, 0],
      [-0.00036, 3],
      [-8e-5, 3],
      [-0.00332, 0],
      [0.00574, 1],
      [-4e-5, 3],
      [0.00647, 1],
      [-0.00011, 3]
    ]
  },
  "QS_mulLysisRoot[C5]": {
    "red_x_points": [
      [-0.00016, 3],
      [-0.00174, 0],
      [-0.0054, 2],
      [-0.00106, 0],
      [-0.00165, 0],
      [-0.00127, 0],
      [-0.00134, 0],
      [-0.00047, 3],
      [-0.00145, 0],
      [-0.00118, 0],
      [-0.0001, 3],
      [-0.00129, 0],
      [-0.00052, 3],
      [-0.00199, 0],
      [-0.00128, 0],
      [-0.00012, 3],
      [-0.00017, 3],
      [-0.0001, 3],
      [-0.00099, 0],
      [-0.00014, 3],
      [-0.00058, 3],
      [-0.00049, 3],
      [-0.00133, 0],
      [-0.00132, 0],
      [-0.00041, 3],
      [0.00486, 1],
      [-0.00044, 3],
      [-0.00517, 2],
      [-0.00054, 3]
    ],
    "red_o_points": [],
    "y_categories": ["N", "NOT APPLICABLE", "Y", "nan"],
    "blue_o_points": [],
    "blue_x_points": [
      [0.01106, 1],
      [-0.00017, 3],
      [-0.00083, 0],
      [-0.00084, 0],
      [-5e-5, 3],
      [0.00561, 1],
      [0.00392, 1],
      [-0.00085, 0],
      [-8e-5, 3],
      [-0.00011, 3],
      [-0.00043, 0],
      [0.00543, 1],
      [-8e-5, 3],
      [0.00537, 1],
      [-0.00011, 3]
    ]
  },
  "QS_mulLysisSite[Root]": {
    "red_x_points": [
      [-9e-5, 3],
      [-0.00079, 0],
      [-0.00347, 2],
      [-0.00066, 0],
      [-0.00095, 0],
      [-0.00058, 0],
      [-0.00087, 0],
      [-0.00028, 3],
      [-0.00085, 0],
      [-0.00068, 0],
      [-0.00019, 3],
      [-0.00073, 0],
      [-0.00038, 3],
      [-0.00081, 0],
      [-0.00062, 0],
      [-0.00032, 3],
      [-0.0003, 3],
      [-0.00011, 3],
      [-0.00051, 0],
      [-8e-5, 3],
      [-0.00044, 3],
      [-0.0002, 3],
      [-0.00074, 0],
      [-0.00042, 0],
      [-0.00021, 3],
      [0.0023, 1],
      [-0.00014, 3],
      [-0.00402, 2],
      [-0.00028, 3]
    ],
    "red_o_points": [],
    "y_categories": ["N", "NOT APPLICABLE", "Y", "nan"],
    "blue_o_points": [],
    "blue_x_points": [
      [0.00723, 1],
      [-0.00031, 3],
      [2e-5, 0],
      [-3e-5, 0],
      [-3e-5, 3],
      [0.00242, 1],
      [0.00264, 1],
      [-0.00046, 0],
      [-0.00012, 3],
      [-4e-5, 3],
      [4e-5, 0],
      [0.00328, 1],
      [-9e-5, 3],
      [0.003, 1],
      [-0.00013, 3]
    ]
  },
  "QS_lstBpsurgSide": {
    "red_x_points": [
      [-0.0007, 3],
      [-0.01513, 0],
      [-0.01541, 0],
      [-0.01214, 0],
      [-0.01584, 0],
      [-0.01384, 0],
      [-0.01625, 0],
      [-0.00159, 3],
      [-0.0154, 0],
      [0.00171, 2],
      [-0.00051, 3],
      [0.00195, 2],
      [-0.00173, 3],
      [0.00341, 2],
      [-0.00192, 2],
      [-0.00057, 3],
      [-0.00084, 3],
      [-0.00043, 3],
      [-0.00953, 0],
      [-0.00053, 3],
      [-0.0013, 3],
      [-0.00164, 3],
      [0.00205, 2],
      [0.00214, 2],
      [-0.00141, 3],
      [0.01588, 1],
      [-0.00151, 3],
      [-0.01381, 0],
      [-0.00162, 3]
    ],
    "red_o_points": [],
    "y_categories": ["L", "NOT APPLICABLE", "R", "nan"],
    "blue_o_points": [],
    "blue_x_points": [
      [0.03713, 1],
      [-0.00077, 3],
      [0.00472, 2],
      [0.00863, 2],
      [6e-5, 3],
      [0.01945, 1],
      [0.01392, 1],
      [-0.00337, 0],
      [-0.00082, 3],
      [-0.00017, 3],
      [0.00438, 2],
      [0.0163, 1],
      [-0.00019, 3],
      [0.01762, 1],
      [-0.00039, 3]
    ]
  },
  "QS_mulNeuromadSite[T1]": {
    "red_x_points": [
      [1e-5, 2],
      [-0.00011, 0],
      [-0.00014, 0],
      [-8e-5, 0],
      [-0.00019, 0],
      [-6e-5, 0],
      [-0.00017, 0],
      [-0.00013, 0],
      [-8e-5, 0],
      [1e-5, 2],
      [-3e-5, 0],
      [3e-5, 2],
      [-0.00016, 0],
      [-6e-5, 0],
      [1e-5, 2],
      [1e-5, 2],
      [-3e-5, 0],
      [-1e-5, 2],
      [1e-5, 2],
      [1e-5, 2],
      [-0.00011, 0],
      [-6e-5, 0],
      [0.0, 2],
      [0.00017, 1],
      [0.0, 2],
      [-3e-5, 0],
      [1e-5, 2]
    ],
    "red_o_points": [],
    "y_categories": ["N", "NOT APPLICABLE", "nan"],
    "blue_o_points": [],
    "blue_x_points": [
      [0.00065, 1],
      [3e-5, 2],
      [-3e-5, 0],
      [-8e-5, 0],
      [0.0, 2],
      [0.00026, 1],
      [9e-5, 1],
      [3e-5, 2],
      [0.0, 2],
      [-3e-5, 0],
      [0.00017, 1],
      [1e-5, 2],
      [7e-5, 1],
      [0.0, 2]
    ]
  },
  "QA_yonInjUnconscio": {
    "red_x_points": [
      [-0.01834, 1],
      [-0.0189, 1],
      [-0.00165, 2],
      [-0.00257, 2],
      [-0.00198, 2],
      [-0.02022, 1],
      [-0.00193, 2],
      [-0.0034, 2],
      [-0.00227, 2],
      [-0.02101, 1],
      [-0.0185, 1],
      [-0.02094, 1],
      [-0.00441, 2],
      [-0.00235, 2],
      [-0.01244, 1],
      [-0.01893, 1],
      [-0.01845, 1],
      [-0.01281, 1],
      [-0.01382, 1],
      [-0.01764, 1],
      [-0.00451, 2],
      [-0.00273, 2],
      [-0.02125, 1],
      [-0.0196, 1],
      [-0.00416, 2],
      [-0.00317, 2],
      [-0.00413, 2],
      [-0.0188, 1],
      [-0.00422, 2]
    ],
    "red_o_points": [],
    "y_categories": ["N", "Y", "nan"],
    "blue_o_points": [],
    "blue_x_points": [
      [-0.00105, 2],
      [-0.00147, 2],
      [0.06873, 0],
      [-0.00051, 2],
      [-0.00916, 1],
      [-0.01029, 1],
      [0.04126, 0],
      [0.05595, 0],
      [-0.00197, 2],
      [0.05393, 0],
      [0.0661, 0],
      [-0.00234, 2],
      [-0.01057, 1],
      [-0.00212, 2],
      [0.06863, 0]
    ]
  },
  "QA_lstPexTouch[C7]": {
    "red_x_points": [
      [-0.00212, 1],
      [-0.01123, 2],
      [-0.00462, 1],
      [-0.00338, 1],
      [-0.01544, 2],
      [-0.00672, 1],
      [-0.00723, 1],
      [-0.00264, 0],
      [-0.01111, 1],
      [-0.01194, 1],
      [-0.00221, 1],
      [-0.0204, 2],
      [-0.00445, 2],
      [-0.0212, 2],
      [-0.00569, 2],
      [-0.00153, 0],
      [-0.0028, 1],
      [-0.00346, 0],
      [-0.00991, 2],
      [-0.00381, 0],
      [-0.00412, 2],
      [-0.00306, 0],
      [-0.0121, 1],
      [-0.01508, 2],
      [-0.00338, 0],
      [-0.00016, 1],
      [-9e-5, 2],
      [-0.00306, 1],
      [0.00169, 1]
    ],
    "red_o_points": [],
    "y_categories": ["NORM", "NPV", "nan"],
    "blue_o_points": [],
    "blue_x_points": [
      [-0.0001, 1],
      [0.00818, 1],
      [0.05196, 0],
      [0.06608, 0],
      [0.00826, 2],
      [6e-5, 2],
      [-0.00486, 1],
      [0.00877, 1],
      [0.00592, 2],
      [0.04424, 0],
      [-0.0, 1],
      [-0.00084, 0],
      [0.00025, 0],
      [0.00333, 0]
    ]
  },
  "QA_lstPexInspectio[SurgicalScar]": {
    "red_x_points": [
      [-0.00258, 1],
      [-0.00691, 1],
      [-0.00924, 0],
      [-0.00432, 1],
      [-0.01017, 1],
      [-0.01331, 0],
      [-0.00947, 1],
      [-0.00276, 1],
      [-0.01232, 1],
      [-0.0124, 1],
      [-0.00673, 0],
      [-0.01291, 1],
      [0.00073, 2],
      [-0.01476, 1],
      [-0.0061, 0],
      [0.0053, 2],
      [0.00484, 2],
      [-0.00163, 1],
      [-0.00577, 1],
      [-0.0028, 1],
      [0.00049, 2],
      [-0.00342, 1],
      [-0.01357, 1],
      [0.01784, 2],
      [-0.00182, 1],
      [-2e-5, 1],
      [-0.00124, 1],
      [0.00667, 2],
      [-0.00173, 1]
    ],
    "red_o_points": [],
    "y_categories": ["ABS", "NAIA", "PT", "nan"],
    "blue_o_points": [],
    "blue_x_points": [
      [-0.00102, 1],
      [0.00832, 2],
      [0.03366, 2],
      [0.04249, 2],
      [0.00135, 1],
      [0.00088, 1],
      [6e-5, 0],
      [-0.0077, 1],
      [-0.00204, 1],
      [0.00128, 1],
      [0.03178, 2],
      [-0.00035, 1],
      [0.00309, 2],
      [0.00125, 0],
      [0.00702, 2]
    ]
  },
  "QS_mulNeuromadSite[T2]": {
    "red_x_points": [
      [1e-5, 2],
      [-0.00059, 0],
      [-0.00012, 0],
      [-0.00013, 0],
      [-0.00019, 0],
      [-0.00018, 0],
      [-0.00029, 0],
      [-7e-5, 2],
      [-0.00022, 0],
      [-0.00018, 0],
      [-2e-5, 2],
      [-0.00014, 0],
      [-0.00025, 2],
      [-0.00062, 0],
      [-0.00039, 0],
      [-2e-5, 2],
      [2e-5, 2],
      [3e-5, 2],
      [-0.00015, 0],
      [5e-5, 2],
      [-0.00013, 2],
      [-0.0001, 2],
      [-0.00026, 0],
      [-0.00016, 0],
      [-2e-5, 2],
      [0.00056, 1],
      [-0.0001, 2],
      [-0.00018, 0],
      [-0.00014, 2]
    ],
    "red_o_points": [],
    "y_categories": ["N", "NOT APPLICABLE", "nan"],
    "blue_o_points": [],
    "blue_x_points": [
      [0.00228, 1],
      [-3e-5, 2],
      [-2e-5, 0],
      [-0.00012, 0],
      [0.00013, 2],
      [0.00111, 1],
      [0.00018, 1],
      [-4e-5, 0],
      [-1e-5, 2],
      [5e-5, 2],
      [-6e-5, 0],
      [0.00017, 1],
      [4e-5, 2],
      [0.00032, 1],
      [-1e-5, 2]
    ]
  },
  "QS_mulBpsurgeryType[Lysis]": {
    "red_x_points": [
      [-0.00087, 3],
      [-0.00734, 0],
      [-0.02178, 2],
      [-0.0183, 2],
      [-0.0037, 0],
      [-0.02052, 2],
      [-0.00368, 0],
      [-0.0018, 3],
      [-0.00388, 0],
      [-0.00373, 0],
      [-0.00099, 3],
      [-0.00344, 0],
      [-0.00175, 3],
      [-0.00605, 0],
      [-0.01929, 2],
      [-0.00102, 3],
      [-0.00083, 3],
      [-0.001, 3],
      [-0.00354, 0],
      [-0.00082, 3],
      [-0.00194, 3],
      [-0.00177, 3],
      [-0.00384, 0],
      [-0.00366, 0],
      [-0.00177, 3],
      [0.02453, 1],
      [-0.00167, 3],
      [-0.0204, 2],
      [-0.00168, 3]
    ],
    "red_o_points": [],
    "y_categories": ["N", "NOT APPLICABLE", "Y", "nan"],
    "blue_o_points": [],
    "blue_x_points": [
      [0.04333, 1],
      [-0.00095, 3],
      [-0.00091, 0],
      [-0.00209, 0],
      [0.00029, 3],
      [0.03079, 1],
      [0.02189, 1],
      [-0.0021, 0],
      [-0.00089, 3],
      [-0.00034, 3],
      [-0.00147, 0],
      [0.02586, 1],
      [-0.00028, 3],
      [0.02411, 1],
      [-0.00072, 3]
    ]
  },
  "QS_mulLysisSite[Trunk]": {
    "red_x_points": [
      [-0.00025, 3],
      [-0.00397, 0],
      [-0.0026, 0],
      [-0.00222, 0],
      [-0.00269, 0],
      [-0.01133, 2],
      [-0.0029, 0],
      [-0.00066, 3],
      [-0.00307, 0],
      [-0.0029, 0],
      [-0.00032, 3],
      [-0.00267, 0],
      [-0.00068, 3],
      [-0.00344, 0],
      [-0.00918, 2],
      [-0.00019, 3],
      [-0.00018, 3],
      [-0.00023, 3],
      [-0.00255, 0],
      [-0.00037, 3],
      [-0.00089, 3],
      [-0.00057, 3],
      [-0.00288, 0],
      [-0.00309, 0],
      [-0.00054, 3],
      [0.01028, 1],
      [-0.00064, 3],
      [-0.01041, 2],
      [-0.00081, 3]
    ],
    "red_o_points": [],
    "y_categories": ["N", "NOT APPLICABLE", "Y", "nan"],
    "blue_o_points": [],
    "blue_x_points": [
      [0.02027, 1],
      [-0.00027, 3],
      [-0.00155, 0],
      [-0.00196, 0],
      [0.00035, 3],
      [0.01537, 1],
      [0.01088, 1],
      [-0.00177, 0],
      [-0.00041, 3],
      [-0.00019, 3],
      [-0.00158, 0],
      [0.0115, 1],
      [-7e-5, 3],
      [0.01167, 1],
      [-0.00028, 3]
    ]
  },
  "QS_mulGraftTrunk[UpperTrunk]": {
    "red_x_points": [
      [-5e-5, 3],
      [-0.00149, 0],
      [-0.00068, 0],
      [-0.00079, 0],
      [-0.00091, 0],
      [-0.00078, 0],
      [-0.00086, 0],
      [-0.00035, 3],
      [-0.00076, 0],
      [-0.00063, 0],
      [4e-5, 3],
      [-0.00064, 0],
      [-0.00056, 3],
      [-0.00662, 2],
      [-0.00107, 0],
      [5e-5, 3],
      [2e-5, 3],
      [6e-5, 3],
      [-0.00074, 0],
      [-0.00012, 3],
      [-0.00055, 3],
      [-0.00042, 3],
      [-0.00051, 0],
      [-0.00077, 0],
      [-0.00026, 3],
      [0.0024, 1],
      [-0.00035, 3],
      [-0.00077, 0],
      [-0.00052, 3]
    ],
    "red_o_points": [],
    "y_categories": ["N", "NOT APPLICABLE", "Y", "nan"],
    "blue_o_points": [],
    "blue_x_points": [
      [0.00701, 1],
      [-0.00025, 3],
      [9e-5, 0],
      [0.00075, 0],
      [0.00019, 3],
      [0.00445, 1],
      [0.00162, 1],
      [-7e-5, 0],
      [-0.00028, 3],
      [2e-5, 3],
      [-4e-5, 0],
      [0.0023, 1],
      [0.00012, 3],
      [0.00281, 1],
      [-9e-5, 3]
    ]
  },
  "QS_mulTransfSite[PhMc]": {
    "red_x_points": [
      [-0.00014, 3],
      [-0.00247, 0],
      [-0.0012, 0],
      [-0.00124, 0],
      [-0.00151, 0],
      [-0.00125, 0],
      [-0.00598, 2],
      [-0.00039, 3],
      [-0.00162, 0],
      [-0.00146, 0],
      [-0.00016, 3],
      [-0.0013, 0],
      [-0.00055, 3],
      [-0.00251, 0],
      [-0.00214, 0],
      [-0.00013, 3],
      [-0.00016, 3],
      [-0.0001, 3],
      [-0.00392, 2],
      [-9e-5, 3],
      [-0.00067, 3],
      [-0.00041, 3],
      [-0.00147, 0],
      [-0.0012, 0],
      [-0.00027, 3],
      [0.0048, 1],
      [-0.00039, 3],
      [-0.00127, 0],
      [-0.00061, 3]
    ],
    "red_o_points": [],
    "y_categories": ["N", "NOT APPLICABLE", "Y", "nan"],
    "blue_o_points": [],
    "blue_x_points": [
      [0.01174, 1],
      [-0.00013, 3],
      [-0.00083, 0],
      [-0.00111, 0],
      [0.00016, 3],
      [0.00689, 1],
      [0.00452, 1],
      [-0.00102, 0],
      [-0.00023, 3],
      [-1e-5, 3],
      [-0.00094, 0],
      [0.00588, 1],
      [-6e-5, 3],
      [0.00508, 1],
      [-0.00011, 3]
    ]
  },
  "QA_intPexForearmProna": {
    "red_x_points": [
      [-0.00084, 2],
      [-0.00093, 0],
      [-0.00097, 2],
      [-0.00038, 2],
      [-0.00094, 2],
      [-0.00272, 0],
      [-0.0009, 2],
      [-0.02395, 0],
      [-0.00085, 2],
      [-0.00086, 2],
      [-0.02313, 0],
      [-0.0029, 0],
      [-0.00154, 2],
      [-0.00067, 2],
      [2e-5, 2],
      [-0.02335, 0],
      [-0.02283, 0],
      [-0.02024, 0],
      [-0.00205, 0],
      [-0.00076, 2],
      [-0.00143, 2],
      [-0.00126, 2],
      [-0.00083, 2],
      [-0.00106, 2],
      [9e-5, 2],
      [0.00033, 1],
      [0.00016, 2],
      [-0.00288, 0],
      [-0.00132, 2]
    ],
    "red_o_points": [],
    "y_categories": ["GREATER THAN OR EQUALS TO 80", "LESS THAN 80", "nan"],
    "blue_o_points": [],
    "blue_x_points": [
      [-0.00069, 2],
      [0.0697, 1],
      [-0.00046, 0],
      [-0.00095, 2],
      [0.00122, 2],
      [2e-5, 2],
      [0.00074, 1],
      [5e-5, 2],
      [-0.00032, 2],
      [0.00132, 2],
      [-0.00059, 0],
      [3e-5, 2],
      [0.00123, 2],
      [3e-5, 2],
      [0.06765, 1]
    ]
  },
  "QS_mulTransfSite[Oberlin]": {
    "red_x_points": [
      [-0.00226, 3],
      [-0.02955, 0],
      [-0.03059, 0],
      [-0.0265, 0],
      [-0.03054, 0],
      [0.00434, 2],
      [-0.02934, 0],
      [-0.00265, 3],
      [0.00489, 2],
      [0.00425, 2],
      [-0.00218, 3],
      [0.00374, 2],
      [-0.00272, 3],
      [0.0032, 2],
      [-0.02488, 0],
      [-0.00228, 3],
      [-0.00251, 3],
      [-0.00186, 3],
      [-0.02432, 0],
      [-0.0023, 3],
      [-0.00262, 3],
      [-0.00276, 3],
      [0.0046, 2],
      [-0.02882, 0],
      [-0.00238, 3],
      [0.03265, 1],
      [-0.00244, 3],
      [-0.02921, 0],
      [-0.00249, 3]
    ],
    "red_o_points": [],
    "y_categories": ["N", "NOT APPLICABLE", "Y", "nan"],
    "blue_o_points": [],
    "blue_x_points": [
      [0.05746, 1],
      [-0.00187, 3],
      [0.00756, 2],
      [0.00849, 2],
      [-0.00052, 3],
      [0.03988, 1],
      [0.03356, 1],
      [0.00527, 2],
      [-0.00183, 3],
      [-0.00116, 3],
      [0.00702, 2],
      [0.03768, 1],
      [-0.00106, 3],
      [0.03875, 1],
      [-0.00166, 3]
    ]
  },
  "QA_yonPexPain": {
    "red_x_points": [
      [-0.00792, 1],
      [-0.00106, 1],
      [-0.00067, 1],
      [-0.00047, 1],
      [-0.00134, 1],
      [-0.0009, 0],
      [-0.00061, 1],
      [-0.0067, 1],
      [-0.00027, 0],
      [0.0002, 1],
      [-0.00606, 1],
      [-0.00096, 0],
      [-0.01114, 1],
      [-0.00138, 1],
      [-0.00027, 1],
      [0.01048, 0],
      [-0.00658, 1],
      [0.00858, 0],
      [-0.00077, 1],
      [0.01369, 0],
      [-0.02162, 2],
      [-0.00972, 1],
      [0.00024, 1],
      [-0.00157, 1],
      [-0.018, 2],
      [-0.00105, 1],
      [-0.0083, 1],
      [-0.00051, 1],
      [-0.01038, 1]
    ],
    "red_o_points": [],
    "y_categories": ["N", "Y", "nan"],
    "blue_o_points": [],
    "blue_x_points": [
      [-0.00057, 1],
      [0.02237, 0],
      [0.00673, 0],
      [-0.00074, 1],
      [-0.00638, 1],
      [0.00067, 2],
      [-5e-5, 1],
      [0.00121, 1],
      [0.02603, 0],
      [0.02217, 0],
      [0.00043, 1],
      [0.00178, 0],
      [0.01633, 0],
      [-0.00026, 1],
      [-0.00468, 1]
    ]
  },
  "QS_mulLysisRoot[C6]": {
    "red_x_points": [
      [-0.00033, 3],
      [-0.00276, 0],
      [-0.00643, 2],
      [-0.00182, 0],
      [-0.00201, 0],
      [-0.00179, 0],
      [-0.00214, 0],
      [-0.0007, 3],
      [-0.00217, 0],
      [-0.00178, 0],
      [-0.00029, 3],
      [-0.0018, 0],
      [-0.00094, 3],
      [-0.00341, 0],
      [-0.00254, 0],
      [-0.00029, 3],
      [-0.00041, 3],
      [-0.00034, 3],
      [-0.00166, 0],
      [-0.00027, 3],
      [-0.00097, 3],
      [-0.00062, 3],
      [-0.00197, 0],
      [-0.00176, 0],
      [-0.00067, 3],
      [0.00656, 1],
      [-0.0006, 3],
      [-0.00734, 2],
      [-0.00086, 3]
    ],
    "red_o_points": [],
    "y_categories": ["N", "NOT APPLICABLE", "Y", "nan"],
    "blue_o_points": [],
    "blue_x_points": [
      [0.0172, 1],
      [-0.00041, 3],
      [-0.00075, 0],
      [-0.00114, 0],
      [0.00023, 3],
      [0.00867, 1],
      [0.0058, 1],
      [-0.00135, 0],
      [-0.00037, 3],
      [-0.0001, 3],
      [-0.0002, 0],
      [0.0074, 1],
      [0.0, 3],
      [0.00744, 1],
      [-0.00033, 3]
    ]
  },
  "QS_mulGraftLevel[Trunk]": {
    "red_x_points": [
      [2e-5, 3],
      [-0.00119, 0],
      [-0.00059, 0],
      [-0.00061, 0],
      [-0.0007, 0],
      [-0.00045, 0],
      [-0.00074, 0],
      [-0.00014, 3],
      [-0.0007, 0],
      [-0.00045, 0],
      [1e-5, 3],
      [-0.00044, 0],
      [-0.00033, 3],
      [-0.00535, 2],
      [-0.00093, 0],
      [-2e-5, 3],
      [-1e-5, 3],
      [-2e-5, 3],
      [-0.00057, 0],
      [-2e-5, 3],
      [-0.0004, 3],
      [-0.0001, 3],
      [-0.00055, 0],
      [-0.00067, 0],
      [-0.0002, 3],
      [0.00211, 1],
      [-0.00017, 3],
      [-0.00043, 0],
      [-0.00025, 3]
    ],
    "red_o_points": [],
    "y_categories": ["N", "NOT APPLICABLE", "Y", "nan"],
    "blue_o_points": [],
    "blue_x_points": [
      [0.00622, 1],
      [5e-5, 3],
      [0.0002, 0],
      [0.00066, 0],
      [9e-5, 3],
      [0.00234, 1],
      [0.00111, 1],
      [-0.00015, 0],
      [-4e-5, 3],
      [2e-5, 3],
      [-6e-5, 0],
      [0.00183, 1],
      [-2e-5, 3],
      [0.00163, 1],
      [2e-5, 3]
    ]
  }
}
