{
  "QS_mulGraftNerve[other]": {
    "red_x_points": [
      [-0.0001, 2],
      [-0.00038, 0],
      [-0.00032, 0],
      [-0.00043, 0],
      [-0.00045, 0],
      [-0.00029, 0],
      [-0.00044, 0],
      [-0.00012, 2],
      [-0.00037, 0],
      [-0.00038, 0],
      [-0.00014, 0],
      [-0.00016, 2],
      [1e-5, 1],
      [-0.00021, 2],
      [-0.00042, 0],
      [-0.00022, 2],
      [-0.00041, 0],
      [-0.0005, 0],
      [-0.00016, 2],
      [-0.00014, 2],
      [-2e-5, 2],
      [-0.00022, 0],
      [-0.00022, 2],
      [-5e-5, 2],
      [-0.00012, 2],
      [-0.00039, 0],
      [-0.00016, 2],
      [-0.00037, 0],
      [-7e-5, 2],
      [0.00039, 1],
      [-0.00035, 0]
    ],
    "red_o_points": [],
    "y_categories": ["N", "NOT APPLICABLE", "nan"],
    "blue_o_points": [],
    "blue_x_points": [
      [0.00242, 1],
      [8e-5, 2],
      [0.00095, 1],
      [1e-5, 0],
      [5e-5, 2],
      [0.00043, 1],
      [0.00053, 1]
    ]
  },
  "participant_code": {
    "red_x_points": [
      [-0.03261, 1],
      [-0.03243, 2],
      [-0.03271, 3],
      [-0.03182, 4],
      [-0.03336, 5],
      [-0.03173, 6],
      [-0.0321, 7],
      [-0.03271, 8],
      [-0.03238, 9],
      [-0.03299, 10],
      [-0.03308, 11],
      [-0.03285, 12],
      [-0.03299, 14],
      [-0.03345, 16],
      [-0.03345, 17],
      [-0.03233, 19],
      [-0.03341, 20],
      [-0.03243, 22],
      [-0.03182, 23],
      [-0.03364, 25],
      [-0.03257, 26],
      [-0.03322, 27],
      [-0.03289, 28],
      [-0.03313, 29],
      [-0.03233, 30],
      [-0.03331, 32],
      [-0.03331, 33],
      [-0.03149, 34],
      [-0.0314, 35],
      [-0.03173, 36],
      [-0.03229, 37]
    ],
    "red_o_points": [],
    "y_categories": [
      "P16554",
      "P18297",
      "P19283",
      "P19287",
      "P23391",
      "P31645",
      "P31691",
      "P34778",
      "P35046",
      "P36328",
      "P43633",
      "P4544",
      "P46417",
      "P48965",
      "P53068",
      "P5497",
      "P59529",
      "P62483",
      "P64658",
      "P65202",
      "P66816",
      "P6751",
      "P7408",
      "P75566",
      "P76226",
      "P79971",
      "P82621",
      "P82990",
      "P84932",
      "P85825",
      "P86989",
      "P8770",
      "P87791",
      "P90550",
      "P93159",
      "P94969",
      "P96710",
      "P9744",
      "nan"
    ],
    "blue_o_points": [],
    "blue_x_points": [
      [0.09658, 0],
      [0.09566, 13],
      [0.09658, 15],
      [0.09106, 18],
      [0.09658, 21],
      [0.0952, 24],
      [0.09735, 31]
    ]
  },
  "QS_mulLysisTrunk[Upper]": {
    "red_x_points": [
      [-0.00099, 3],
      [-0.00149, 0],
      [-0.00143, 0],
      [-0.0016, 0],
      [-0.00152, 0],
      [-0.00335, 2],
      [-0.00143, 0],
      [-0.00085, 3],
      [-0.00167, 0],
      [-0.00159, 0],
      [-0.00161, 0],
      [-0.00115, 3],
      [0.00497, 1],
      [-0.00106, 3],
      [-0.00153, 0],
      [-0.00133, 3],
      [-0.00427, 2],
      [-0.00136, 0],
      [-0.00116, 3],
      [-0.00102, 3],
      [-0.00108, 3],
      [-0.00167, 0],
      [-0.00111, 3],
      [-0.00114, 3],
      [-0.001, 3],
      [-0.00145, 0],
      [-0.00111, 3],
      [-0.00149, 0],
      [-0.00101, 3],
      [0.00503, 1],
      [-0.00333, 2]
    ],
    "red_o_points": [],
    "y_categories": ["N", "NOT APPLICABLE", "Y", "nan"],
    "blue_o_points": [],
    "blue_x_points": [
      [0.00712, 1],
      [-0.0006, 3],
      [0.00511, 1],
      [-0.00094, 0],
      [-0.00037, 3],
      [0.00557, 1],
      [0.00646, 1]
    ]
  },
  "QS_mulNeuromadSite[C5]": {
    "red_x_points": [
      [-0.00149, 2],
      [-0.00295, 0],
      [-0.00309, 0],
      [-0.00305, 0],
      [-0.00309, 0],
      [-0.003, 0],
      [-0.00338, 0],
      [-0.00099, 2],
      [-0.00309, 0],
      [-0.00355, 0],
      [-0.00317, 0],
      [-0.00125, 2],
      [0.00343, 1],
      [-0.0014, 2],
      [-0.00303, 0],
      [-0.00149, 2],
      [-0.00303, 0],
      [-0.00343, 0],
      [-0.00135, 2],
      [-0.00127, 2],
      [-0.0006, 2],
      [-0.00224, 0],
      [-0.00142, 2],
      [-0.00097, 2],
      [-0.00162, 2],
      [-0.00318, 0],
      [-0.00131, 2],
      [-0.00327, 0],
      [-0.00073, 2],
      [0.00534, 1],
      [-0.0034, 0]
    ],
    "red_o_points": [],
    "y_categories": ["N", "NOT APPLICABLE", "nan"],
    "blue_o_points": [],
    "blue_x_points": [
      [0.01569, 1],
      [-0.0001, 2],
      [0.00672, 1],
      [0.00048, 0],
      [-0.0004, 2],
      [0.00687, 1],
      [0.00767, 1]
    ]
  },
  "QS_mulNeuromadSite[C7]": {
    "red_x_points": [
      [-0.00083, 2],
      [-0.00182, 0],
      [-0.00185, 0],
      [-0.00179, 0],
      [-0.0017, 0],
      [-0.00191, 0],
      [-0.00173, 0],
      [-0.00078, 2],
      [-0.00174, 0],
      [-0.00192, 0],
      [-0.00197, 0],
      [-0.00072, 2],
      [0.00171, 1],
      [-0.00053, 2],
      [-0.00173, 0],
      [-0.00078, 2],
      [-0.00147, 0],
      [-0.0019, 0],
      [-0.00074, 2],
      [-0.0008, 2],
      [-0.00057, 2],
      [-0.00151, 0],
      [-0.00087, 2],
      [-0.00086, 2],
      [-0.00088, 2],
      [-0.00177, 0],
      [-0.00089, 2],
      [-0.00162, 0],
      [-0.00063, 2],
      [0.00289, 1],
      [-0.00169, 0]
    ],
    "red_o_points": [],
    "y_categories": ["N", "NOT APPLICABLE", "nan"],
    "blue_o_points": [],
    "blue_x_points": [
      [0.00808, 1],
      [-0.00014, 2],
      [0.00356, 1],
      [0.00039, 0],
      [-9e-5, 2],
      [0.00429, 1],
      [0.00607, 1]
    ]
  },
  "QS_mulTransfSite[IMc]": {
    "red_x_points": [
      [-0.00182, 3],
      [-0.00614, 2],
      [-0.00369, 0],
      [-0.00367, 0],
      [-0.00361, 0],
      [-0.00346, 0],
      [-0.00389, 0],
      [-0.00183, 3],
      [-0.00354, 0],
      [-0.00364, 0],
      [-0.00367, 0],
      [-0.0022, 3],
      [0.00949, 1],
      [-0.00264, 3],
      [-0.00356, 0],
      [-0.00239, 3],
      [-0.00641, 2],
      [-0.00339, 0],
      [-0.00205, 3],
      [-0.00199, 3],
      [-0.00188, 3],
      [-0.00318, 0],
      [-0.00212, 3],
      [-0.00185, 3],
      [-0.00206, 3],
      [-0.00331, 0],
      [-0.00205, 3],
      [-0.00559, 2],
      [-0.00181, 3],
      [0.01047, 1],
      [-0.00584, 2]
    ],
    "red_o_points": [],
    "y_categories": ["N", "NOT APPLICABLE", "Y", "nan"],
    "blue_o_points": [],
    "blue_x_points": [
      [0.01624, 1],
      [-0.00071, 3],
      [0.01044, 1],
      [-0.00153, 0],
      [-0.00079, 3],
      [0.01082, 1],
      [0.01163, 1]
    ]
  },
  "QA_mulInjOrthesisType[ShoulderSupport]": {
    "red_x_points": [
      [-0.01807, 0],
      [-0.01641, 0],
      [-0.01645, 0],
      [-0.01731, 0],
      [-0.0155, 0],
      [-0.01659, 0],
      [-0.01537, 0],
      [-0.02122, 2],
      [-0.01672, 0],
      [-0.01634, 0],
      [-0.01689, 0],
      [-0.01798, 0],
      [0.04745, 1],
      [-0.01865, 0],
      [-0.01646, 0],
      [-0.0182, 0],
      [-0.0194, 2],
      [-0.01737, 0],
      [-0.01836, 0],
      [-0.01809, 0],
      [-0.022, 2],
      [-0.01996, 3],
      [-0.01874, 0],
      [0.05089, 1],
      [-0.01802, 0],
      [-0.01625, 0],
      [-0.01839, 0],
      [-0.01681, 0],
      [-0.02187, 3],
      [-0.0328, 3],
      [-0.01645, 0]
    ],
    "red_o_points": [],
    "y_categories": ["N", "NOT APPLICABLE", "Y", "nan"],
    "blue_o_points": [],
    "blue_x_points": [
      [-0.00731, 0],
      [0.05133, 1],
      [0.04137, 1],
      [0.05111, 1],
      [0.05405, 1],
      [0.04482, 1],
      [0.04591, 1]
    ]
  },
  "QA_mulInjOrthesisType[ArmSling]": {
    "red_x_points": [
      [-0.01753, 2],
      [-0.01545, 2],
      [-0.01472, 2],
      [-0.01466, 2],
      [-0.01497, 2],
      [-0.01558, 2],
      [-0.01547, 2],
      [-0.01613, 2],
      [-0.01588, 2],
      [-0.0156, 2],
      [-0.01528, 2],
      [-0.01628, 2],
      [0.04437, 1],
      [-0.01665, 2],
      [-0.01531, 2],
      [-0.01666, 2],
      [-0.01872, 0],
      [-0.01628, 2],
      [-0.01728, 2],
      [-0.01662, 2],
      [-0.01911, 0],
      [-0.01846, 3],
      [-0.01725, 2],
      [0.04696, 1],
      [-0.01686, 2],
      [-0.01622, 2],
      [-0.01599, 2],
      [-0.01581, 2],
      [-0.01966, 3],
      [-0.03033, 3],
      [-0.01537, 2]
    ],
    "red_o_points": [],
    "y_categories": ["N", "NOT APPLICABLE", "Y", "nan"],
    "blue_o_points": [],
    "blue_x_points": [
      [-0.00678, 2],
      [0.04839, 1],
      [0.03851, 1],
      [0.04955, 1],
      [0.04971, 1],
      [0.04207, 1],
      [0.04154, 1]
    ]
  },
  "QS_mulGraftNerve[Ac]": {
    "red_x_points": [
      [-6e-5, 2],
      [-0.00016, 0],
      [-0.00014, 0],
      [-0.00016, 0],
      [-0.00021, 0],
      [-0.00021, 0],
      [-0.00016, 0],
      [-3e-5, 2],
      [-0.00016, 0],
      [-0.00012, 0],
      [-0.00016, 0],
      [-8e-5, 2],
      [0.0002, 1],
      [-5e-5, 2],
      [-0.00016, 0],
      [-6e-5, 2],
      [-0.00019, 0],
      [-0.00021, 0],
      [-4e-5, 2],
      [-5e-5, 2],
      [-3e-5, 2],
      [-9e-5, 0],
      [-5e-5, 2],
      [-0.0002, 2],
      [-2e-5, 2],
      [-0.00021, 0],
      [-7e-5, 2],
      [-0.00014, 0],
      [-5e-5, 2],
      [9e-5, 1],
      [-0.00021, 0]
    ],
    "red_o_points": [],
    "y_categories": ["N", "NOT APPLICABLE", "nan"],
    "blue_o_points": [],
    "blue_x_points": [
      [0.00067, 1],
      [-6e-5, 2],
      [0.00028, 1],
      [0.0001, 0],
      [2e-5, 2],
      [0.00034, 1],
      [0.00049, 1]
    ]
  },
  "QS_mulGraftNerve[Ph]": {
    "red_x_points": [
      [-6e-5, 2],
      [-5e-5, 0],
      [-6e-5, 0],
      [-6e-5, 0],
      [-5e-5, 0],
      [-5e-5, 0],
      [-6e-5, 0],
      [-5e-5, 2],
      [-6e-5, 0],
      [-1e-5, 0],
      [-6e-5, 0],
      [0.00011, 1],
      [-1e-5, 2],
      [-6e-5, 0],
      [-6e-5, 2],
      [-5e-5, 0],
      [-6e-5, 0],
      [-1e-5, 2],
      [-6e-5, 2],
      [-5e-5, 0],
      [-6e-5, 2],
      [-5e-5, 2],
      [-6e-5, 0],
      [-5e-5, 2],
      [-1e-5, 0],
      [-5e-5, 2],
      [0.00011, 1],
      [-1e-5, 0]
    ],
    "red_o_points": [],
    "y_categories": ["N", "NOT APPLICABLE", "nan"],
    "blue_o_points": [],
    "blue_x_points": [[0.0003, 1], [0.00011, 1], [0.00011, 1]]
  },
  "QS_mulNeuromadSite[C8]": {
    "red_x_points": [
      [-0.0011, 2],
      [-0.00333, 0],
      [-0.00352, 0],
      [-0.0031, 0],
      [-0.00331, 0],
      [-0.00335, 0],
      [-0.00316, 0],
      [-0.00095, 2],
      [-0.00304, 0],
      [-0.00354, 0],
      [-0.00339, 0],
      [-0.00114, 2],
      [0.004, 1],
      [-0.00116, 2],
      [-0.00358, 0],
      [-0.00125, 2],
      [-0.00289, 0],
      [-0.00309, 0],
      [-0.00108, 2],
      [-0.00106, 2],
      [-0.00059, 2],
      [-0.00276, 0],
      [-0.00142, 2],
      [-0.00144, 2],
      [-0.0013, 2],
      [-0.00295, 0],
      [-0.00123, 2],
      [-0.003, 0],
      [-0.00071, 2],
      [0.00587, 1],
      [-0.00342, 0]
    ],
    "red_o_points": [],
    "y_categories": ["N", "NOT APPLICABLE", "nan"],
    "blue_o_points": [],
    "blue_x_points": [
      [0.01729, 1],
      [-0.00021, 2],
      [0.00574, 1],
      [0.00073, 0],
      [-9e-5, 2],
      [0.00571, 1],
      [0.00717, 1]
    ]
  },
  "QS_mulTransfSite[PhMc]": {
    "red_x_points": [
      [-0.00077, 3],
      [-0.00115, 0],
      [-0.00088, 0],
      [-0.00099, 0],
      [-0.00076, 0],
      [-0.00101, 0],
      [-0.00246, 2],
      [-0.00086, 3],
      [-0.00099, 0],
      [-0.0009, 0],
      [-0.00106, 0],
      [-0.00084, 3],
      [0.00335, 1],
      [-0.00081, 3],
      [-0.00108, 0],
      [-0.00085, 3],
      [-0.00089, 0],
      [-0.00097, 0],
      [-0.00092, 3],
      [-0.0008, 3],
      [-0.00072, 3],
      [-0.00232, 2],
      [-0.00075, 3],
      [-0.00082, 3],
      [-0.00088, 3],
      [-0.00117, 0],
      [-0.00083, 3],
      [-0.00097, 0],
      [-0.00074, 3],
      [0.00339, 1],
      [-0.00107, 0]
    ],
    "red_o_points": [],
    "y_categories": ["N", "NOT APPLICABLE", "Y", "nan"],
    "blue_o_points": [],
    "blue_x_points": [
      [0.00409, 1],
      [-0.00038, 3],
      [0.00391, 1],
      [-0.00088, 0],
      [-0.00035, 3],
      [0.00369, 1],
      [0.00396, 1]
    ]
  },
  "QA_yonInjBpsurg": {
    "red_x_points": [
      [-0.00588, 1],
      [-0.0053, 1],
      [-0.0054, 1],
      [-0.00514, 1],
      [-0.00536, 1],
      [-0.005, 1],
      [-0.00528, 1],
      [-0.00529, 1],
      [-0.00535, 1],
      [-0.00569, 1],
      [-0.00538, 1],
      [-0.0059, 1],
      [0.00884, 0],
      [-0.00561, 1],
      [-0.00549, 1],
      [-0.00555, 1],
      [-0.00358, 1],
      [-0.00494, 1],
      [-0.00574, 1],
      [-0.00563, 1],
      [-0.00461, 1],
      [-0.00456, 1],
      [-0.00554, 1],
      [-0.00476, 1],
      [-0.00656, 1],
      [-0.00507, 1],
      [-0.00546, 1],
      [-0.00534, 1],
      [-0.00506, 1],
      [0.01329, 0],
      [-0.00486, 1]
    ],
    "red_o_points": [],
    "y_categories": ["N", "Y", "nan"],
    "blue_o_points": [],
    "blue_x_points": [
      [0.0361, 0],
      [-0.00129, 1],
      [0.01513, 0],
      [-0.00324, 1],
      [-0.00088, 1],
      [0.01573, 0],
      [0.02068, 0]
    ]
  },
  "QS_mulNeuromadSite[T1]": {
    "red_x_points": [
      [-0.0014, 2],
      [-0.00432, 0],
      [-0.00417, 0],
      [-0.00405, 0],
      [-0.00422, 0],
      [-0.00436, 0],
      [-0.00474, 0],
      [-0.00127, 2],
      [-0.00452, 0],
      [-0.0047, 0],
      [-0.00398, 0],
      [-0.0013, 2],
      [0.00579, 1],
      [-0.00191, 2],
      [-0.00466, 0],
      [-0.00139, 2],
      [-0.0033, 0],
      [-0.00391, 0],
      [-0.00138, 2],
      [-0.0014, 2],
      [-0.00089, 2],
      [-0.00384, 0],
      [-0.00173, 2],
      [-0.00116, 2],
      [-0.00155, 2],
      [-0.00402, 0],
      [-0.00178, 2],
      [-0.00381, 0],
      [-0.00108, 2],
      [0.00783, 1],
      [-0.00424, 0]
    ],
    "red_o_points": [],
    "y_categories": ["N", "NOT APPLICABLE", "nan"],
    "blue_o_points": [],
    "blue_x_points": [
      [0.0189, 1],
      [8e-5, 2],
      [0.00757, 1],
      [0.0007, 0],
      [0.0, 2],
      [0.008, 1],
      [0.00979, 1]
    ]
  },
  "QS_mulTransfSite[AcSsAA]": {
    "red_x_points": [
      [-0.00306, 3],
      [-0.00902, 2],
      [-0.00334, 0],
      [-0.00893, 2],
      [-0.01083, 2],
      [-0.003, 0],
      [-0.0031, 0],
      [-0.00295, 3],
      [-0.00309, 0],
      [-0.00934, 2],
      [-0.00299, 0],
      [-0.00312, 3],
      [0.01582, 1],
      [-0.00335, 3],
      [-0.01152, 2],
      [-0.00313, 3],
      [-0.00282, 0],
      [-0.00288, 0],
      [-0.00294, 3],
      [-0.00308, 3],
      [-0.00298, 3],
      [-0.00961, 2],
      [-0.00355, 3],
      [-0.00316, 3],
      [-0.00309, 3],
      [-0.00328, 0],
      [-0.00302, 3],
      [-0.00881, 2],
      [-0.00331, 3],
      [0.01691, 1],
      [-0.00294, 0]
    ],
    "red_o_points": [],
    "y_categories": ["N", "NOT APPLICABLE", "Y", "nan"],
    "blue_o_points": [],
    "blue_x_points": [
      [0.01967, 1],
      [-0.0014, 3],
      [0.01624, 1],
      [-0.00036, 0],
      [-0.00129, 3],
      [0.01687, 1],
      [0.01753, 1]
    ]
  },
  "QS_mulLysisRoot[C5]": {
    "red_x_points": [
      [-0.00036, 3],
      [-0.00046, 0],
      [-0.00099, 2],
      [-0.00063, 0],
      [-0.0005, 0],
      [-0.00056, 0],
      [-0.00044, 0],
      [-0.00029, 3],
      [-0.00053, 0],
      [-0.00046, 0],
      [-0.00051, 0],
      [-0.00037, 3],
      [0.00185, 1],
      [-0.00037, 3],
      [-0.00057, 0],
      [-0.00034, 3],
      [-0.00049, 0],
      [-0.00057, 0],
      [-0.00029, 3],
      [-0.00035, 3],
      [-0.00039, 3],
      [-0.00052, 0],
      [-0.00038, 3],
      [-0.00035, 3],
      [-0.00042, 3],
      [-0.00051, 0],
      [-0.0004, 3],
      [-0.00048, 0],
      [-0.00037, 3],
      [0.00182, 1],
      [-0.00118, 2]
    ],
    "red_o_points": [],
    "y_categories": ["N", "NOT APPLICABLE", "Y", "nan"],
    "blue_o_points": [],
    "blue_x_points": [
      [0.00243, 1],
      [-0.00021, 3],
      [0.00155, 1],
      [-0.00067, 0],
      [-0.00031, 3],
      [0.00187, 1],
      [0.00196, 1]
    ]
  },
  "QS_mulNeuromadSite[C6]": {
    "red_x_points": [
      [-0.00033, 2],
      [-0.00058, 0],
      [-0.00049, 0],
      [-0.00077, 0],
      [-0.00078, 0],
      [-0.00075, 0],
      [-0.00074, 0],
      [-0.00029, 2],
      [-0.00066, 0],
      [-0.00075, 0],
      [-0.00075, 0],
      [-0.00034, 2],
      [-0.00028, 1],
      [-0.00047, 2],
      [-0.00093, 0],
      [-0.00047, 2],
      [-0.00054, 0],
      [-0.00065, 0],
      [-0.00029, 2],
      [-0.00039, 2],
      [-0.00019, 2],
      [-0.00051, 0],
      [-0.00046, 2],
      [-0.00032, 2],
      [-0.00043, 2],
      [-0.00077, 0],
      [-0.00034, 2],
      [-0.00055, 0],
      [-0.00021, 2],
      [0.00111, 1],
      [-0.00069, 0]
    ],
    "red_o_points": [],
    "y_categories": ["N", "NOT APPLICABLE", "nan"],
    "blue_o_points": [],
    "blue_x_points": [
      [0.00372, 1],
      [4e-5, 2],
      [0.0013, 1],
      [0.00059, 0],
      [-1e-5, 2],
      [0.00166, 1],
      [0.00186, 1]
    ]
  },
  "QS_lstBpsurgSide": {
    "red_x_points": [
      [-0.00567, 3],
      [-0.00751, 0],
      [-0.00835, 0],
      [-0.0074, 0],
      [-0.01847, 2],
      [-0.00726, 0],
      [-0.00885, 0],
      [-0.00535, 3],
      [-0.00773, 0],
      [-0.01635, 2],
      [-0.01617, 2],
      [-0.00558, 3],
      [0.02492, 1],
      [-0.00605, 3],
      [-0.01843, 2],
      [-0.00554, 3],
      [-0.01697, 2],
      [-0.01863, 2],
      [-0.00557, 3],
      [-0.00568, 3],
      [-0.00458, 3],
      [-0.00718, 0],
      [-0.00596, 3],
      [-0.00558, 3],
      [-0.00581, 3],
      [-0.01625, 2],
      [-0.00578, 3],
      [-0.01491, 2],
      [-0.00525, 3],
      [0.0277, 1],
      [-0.00846, 0]
    ],
    "red_o_points": [],
    "y_categories": ["L", "NOT APPLICABLE", "R", "nan"],
    "blue_o_points": [],
    "blue_x_points": [
      [0.04648, 1],
      [-0.00183, 3],
      [0.03042, 1],
      [0.00526, 0],
      [-0.00189, 3],
      [0.02856, 1],
      [0.03431, 1]
    ]
  },
  "QS_mulBpsurgeryType[Lysis]": {
    "red_x_points": [
      [-0.00305, 3],
      [-0.00455, 0],
      [-0.00762, 2],
      [-0.0046, 0],
      [-0.00444, 0],
      [-0.00784, 2],
      [-0.00451, 0],
      [-0.00266, 3],
      [-0.00405, 0],
      [-0.00446, 0],
      [-0.00423, 0],
      [-0.00254, 3],
      [0.01125, 1],
      [-0.00312, 3],
      [-0.00386, 0],
      [-0.00291, 3],
      [-0.00713, 2],
      [-0.00436, 0],
      [-0.00294, 3],
      [-0.00295, 3],
      [-0.00248, 3],
      [-0.00371, 0],
      [-0.00332, 3],
      [-0.00294, 3],
      [-0.00284, 3],
      [-0.0043, 0],
      [-0.00288, 3],
      [-0.00434, 0],
      [-0.00212, 3],
      [0.01208, 1],
      [-0.00728, 2]
    ],
    "red_o_points": [],
    "y_categories": ["N", "NOT APPLICABLE", "Y", "nan"],
    "blue_o_points": [],
    "blue_x_points": [
      [0.02264, 1],
      [-0.00084, 3],
      [0.01314, 1],
      [-0.00014, 0],
      [-0.00072, 3],
      [0.01121, 1],
      [0.01369, 1]
    ]
  },
  "QA_yonInjUnconscio": {
    "red_x_points": [
      [-0.00467, 1],
      [-0.00446, 1],
      [-0.0033, 2],
      [-0.00263, 2],
      [0.00723, 0],
      [-0.00582, 1],
      [-0.00308, 2],
      [-0.00542, 2],
      [-0.00349, 2],
      [-0.00163, 2],
      [-0.00447, 1],
      [-0.0051, 1],
      [-0.03908, 1],
      [-0.00617, 2],
      [-0.0029, 2],
      [-0.00643, 2],
      [-0.00443, 1],
      [0.00774, 0],
      [-0.00488, 1],
      [-0.00468, 1],
      [-0.00453, 1],
      [-0.00474, 1],
      [-0.00572, 2],
      [-0.01488, 1],
      [-0.00435, 2],
      [-0.00436, 1],
      [0.01107, 0],
      [-0.00349, 1],
      [-0.00511, 2],
      [-0.00075, 2],
      [-0.00523, 1]
    ],
    "red_o_points": [],
    "y_categories": ["N", "Y", "nan"],
    "blue_o_points": [],
    "blue_x_points": [
      [0.00123, 2],
      [-0.00508, 1],
      [0.01957, 0],
      [0.0287, 0],
      [0.03012, 0],
      [0.00428, 2],
      [0.00547, 2]
    ]
  },
  "QA_lstPexMuscstrength[ShoulderAbduc]": {
    "red_x_points": [
      [-0.00859, 1],
      [-0.00928, 1],
      [-0.00867, 1],
      [-0.00877, 1],
      [-0.00951, 1],
      [-0.00914, 1],
      [-0.00874, 1],
      [-0.0089, 1],
      [-0.00912, 1],
      [-0.00882, 1],
      [-0.00874, 1],
      [-0.00885, 1],
      [0.00511, 2],
      [0.0076, 2],
      [0.00697, 2],
      [0.00751, 2],
      [0.00759, 2],
      [-0.00894, 1],
      [-0.00796, 1],
      [-0.00854, 1],
      [-0.00861, 1],
      [-0.00846, 1],
      [0.00775, 2],
      [-0.01468, 1],
      [-0.00971, 1],
      [-0.00889, 1],
      [-0.00918, 1],
      [-0.00863, 1],
      [-0.0088, 1],
      [0.00316, 2],
      [-0.00915, 1]
    ],
    "red_o_points": [],
    "y_categories": ["GREATER THAN OR EQUALS TO 3", "LESS THAN 3", "nan"],
    "blue_o_points": [],
    "blue_x_points": [
      [0.00522, 2],
      [0.00861, 2],
      [0.0358, 0],
      [0.00901, 2],
      [0.00769, 2],
      [0.03797, 0],
      [-0.00202, 1]
    ]
  },
  "QS_mulNeuromadSite[T2]": {
    "red_x_points": [
      [-0.00293, 2],
      [-0.00842, 0],
      [-0.0094, 0],
      [-0.00908, 0],
      [-0.00865, 0],
      [-0.00808, 0],
      [-0.0086, 0],
      [-0.00244, 2],
      [-0.00875, 0],
      [-0.00896, 0],
      [-0.00926, 0],
      [-0.00237, 2],
      [0.01457, 1],
      [-0.003, 2],
      [-0.0088, 0],
      [-0.00273, 2],
      [-0.00791, 0],
      [-0.00827, 0],
      [-0.00277, 2],
      [-0.0025, 2],
      [-0.00175, 2],
      [-0.00763, 0],
      [-0.003, 2],
      [-0.00223, 2],
      [-0.00296, 2],
      [-0.00821, 0],
      [-0.00278, 2],
      [-0.00874, 0],
      [-0.00212, 2],
      [0.0155, 1],
      [-0.00888, 0]
    ],
    "red_o_points": [],
    "y_categories": ["N", "NOT APPLICABLE", "nan"],
    "blue_o_points": [],
    "blue_x_points": [
      [0.03444, 1],
      [-0.00041, 2],
      [0.01717, 1],
      [0.00088, 0],
      [-0.00049, 2],
      [0.0176, 1],
      [0.02233, 1]
    ]
  },
  "QS_mulLysisSite[Trunk]": {
    "red_x_points": [
      [-0.0007, 3],
      [-0.00089, 0],
      [-0.00091, 0],
      [-0.00085, 0],
      [-0.00089, 0],
      [-0.00251, 2],
      [-0.00096, 0],
      [-0.00049, 3],
      [-0.00087, 0],
      [-0.00094, 0],
      [-0.00084, 0],
      [-0.00069, 3],
      [0.00255, 1],
      [-0.0006, 3],
      [-0.00084, 0],
      [-0.00055, 3],
      [-0.00255, 2],
      [-0.00072, 0],
      [-0.00058, 3],
      [-0.0006, 3],
      [-0.00061, 3],
      [-0.00082, 0],
      [-0.0005, 3],
      [-0.00047, 3],
      [-0.00048, 3],
      [-0.00084, 0],
      [-0.00054, 3],
      [-0.0009, 0],
      [-0.00049, 3],
      [0.00326, 1],
      [-0.00189, 2]
    ],
    "red_o_points": [],
    "y_categories": ["N", "NOT APPLICABLE", "Y", "nan"],
    "blue_o_points": [],
    "blue_x_points": [
      [0.00432, 1],
      [-0.00024, 3],
      [0.00325, 1],
      [0.00021, 0],
      [-0.00035, 3],
      [0.00269, 1],
      [0.0036, 1]
    ]
  },
  "QS_mulNeuromadSite[C4]": {
    "red_x_points": [
      [-0.00047, 2],
      [-0.001, 0],
      [-0.00123, 0],
      [-0.00108, 0],
      [-0.00085, 0],
      [-0.00108, 0],
      [-0.00131, 0],
      [-0.0004, 2],
      [-0.0011, 0],
      [-0.00091, 0],
      [-0.00105, 0],
      [-0.00051, 2],
      [0.0014, 1],
      [-0.00048, 2],
      [-0.00138, 0],
      [-0.00056, 2],
      [-0.00095, 0],
      [-0.00121, 0],
      [-0.00045, 2],
      [-0.00053, 2],
      [-0.00023, 2],
      [-0.00085, 0],
      [-0.0006, 2],
      [-0.00035, 2],
      [-0.00048, 2],
      [-0.00095, 0],
      [-0.00035, 2],
      [-0.00097, 0],
      [-0.00021, 2],
      [0.00205, 1],
      [-0.00115, 0]
    ],
    "red_o_points": [],
    "y_categories": ["N", "NOT APPLICABLE", "nan"],
    "blue_o_points": [],
    "blue_x_points": [
      [0.00546, 1],
      [-8e-5, 2],
      [0.00189, 1],
      [0.00058, 0],
      [0.0, 2],
      [0.0016, 1],
      [0.00316, 1]
    ]
  },
  "QS_mulTransfSite[Oberlin]": {
    "red_x_points": [
      [-0.00467, 3],
      [-0.01436, 0],
      [-0.01393, 0],
      [-0.01423, 0],
      [-0.00655, 2],
      [-0.00577, 2],
      [-0.01444, 0],
      [-0.00475, 3],
      [-0.00669, 2],
      [-0.00684, 2],
      [-0.0059, 2],
      [-0.00477, 3],
      [0.01999, 1],
      [-0.0051, 3],
      [-0.00663, 2],
      [-0.00506, 3],
      [-0.01435, 0],
      [-0.00682, 2],
      [-0.00491, 3],
      [-0.00495, 3],
      [-0.00407, 3],
      [-0.01246, 0],
      [-0.00537, 3],
      [-0.00441, 3],
      [-0.00532, 3],
      [-0.00635, 2],
      [-0.00499, 3],
      [-0.01386, 0],
      [-0.00446, 3],
      [0.02504, 1],
      [-0.0144, 0]
    ],
    "red_o_points": [],
    "y_categories": ["N", "NOT APPLICABLE", "Y", "nan"],
    "blue_o_points": [],
    "blue_x_points": [
      [0.03953, 1],
      [-0.00162, 3],
      [0.02555, 1],
      [0.00125, 2],
      [-0.00151, 3],
      [0.02509, 1],
      [0.029, 1]
    ]
  },
  "QA_mulInjTbpiCause[Motorcycle]": {
    "red_x_points": [
      [0.00239, 0],
      [-0.00116, 1],
      [-0.00176, 1],
      [-0.002, 1],
      [-0.00145, 1],
      [-0.00121, 1],
      [-0.00187, 1],
      [-0.00181, 1],
      [-0.0017, 1],
      [-0.00174, 1],
      [-0.00137, 1],
      [0.00188, 0],
      [-0.05566, 1],
      [-0.0021, 1],
      [-0.00223, 1],
      [-0.0019, 1],
      [-0.0014, 1],
      [-0.00127, 1],
      [0.00255, 0],
      [-0.00123, 1],
      [-0.00112, 1],
      [-0.00133, 1],
      [-0.00216, 1],
      [-0.00327, 1],
      [0.00276, 0],
      [-0.0013, 1],
      [-0.00127, 1],
      [-0.00147, 1],
      [-0.00166, 1],
      [-0.04901, 1],
      [-0.00135, 1]
    ],
    "red_o_points": [],
    "y_categories": ["N", "Y", "nan"],
    "blue_o_points": [],
    "blue_x_points": [
      [0.02404, 0],
      [-0.00164, 1],
      [0.02198, 0],
      [-0.0028, 1],
      [-0.0013, 1],
      [0.02508, 0],
      [0.02408, 0]
    ]
  },
  "QS_mulLysisRoot[C6]": {
    "red_x_points": [
      [-0.00049, 3],
      [-0.00056, 0],
      [-0.0017, 2],
      [-0.00046, 0],
      [-0.00052, 0],
      [-0.00044, 0],
      [-0.00047, 0],
      [-0.00049, 3],
      [-0.00057, 0],
      [-0.0005, 0],
      [-0.00062, 0],
      [-0.0005, 3],
      [0.002, 1],
      [-0.00043, 3],
      [-0.00065, 0],
      [-0.00036, 3],
      [-0.00043, 0],
      [-0.00047, 0],
      [-0.00041, 3],
      [-0.00044, 3],
      [-0.0003, 3],
      [-0.00049, 0],
      [-0.00048, 3],
      [-0.00038, 3],
      [-0.00043, 3],
      [-0.00057, 0],
      [-0.00039, 3],
      [-0.00052, 0],
      [-0.00037, 3],
      [0.00264, 1],
      [-0.00165, 2]
    ],
    "red_o_points": [],
    "y_categories": ["N", "NOT APPLICABLE", "Y", "nan"],
    "blue_o_points": [],
    "blue_x_points": [
      [0.00219, 1],
      [-0.00018, 3],
      [0.00201, 1],
      [-0.00063, 0],
      [-0.00023, 3],
      [0.00226, 1],
      [0.0023, 1]
    ]
  },
  "QS_mulGraftNerve[FI]": {
    "red_x_points": [
      [-3e-5, 2],
      [-2e-5, 0],
      [-7e-5, 0],
      [-2e-5, 0],
      [-7e-5, 0],
      [-7e-5, 0],
      [-5e-5, 0],
      [-1e-5, 2],
      [-7e-5, 0],
      [-7e-5, 0],
      [-5e-5, 0],
      [-3e-5, 2],
      [7e-5, 1],
      [-7e-5, 0],
      [-1e-5, 2],
      [-5e-5, 0],
      [-2e-5, 0],
      [-1e-5, 2],
      [-3e-5, 2],
      [-1e-5, 2],
      [-5e-5, 0],
      [-3e-5, 2],
      [-2e-5, 2],
      [-3e-5, 2],
      [-5e-5, 0],
      [-2e-5, 0],
      [0.0001, 1],
      [-7e-5, 0]
    ],
    "red_o_points": [],
    "y_categories": ["N", "NOT APPLICABLE", "nan"],
    "blue_o_points": [],
    "blue_x_points": [
      [0.00018, 1],
      [-1e-5, 2],
      [0.0001, 1],
      [4e-5, 0],
      [-3e-5, 2],
      [7e-5, 1]
    ]
  }
}
