{
  "QA_lstPexPain[C8]": {
    "red_x_points": [
      [-0.00895, 1],
      [-0.00286, 2],
      [-0.00339, 2],
      [-0.00275, 2],
      [-0.00924, 1],
      [0.00039, 0],
      [-0.00097, 1],
      [-0.00042, 1],
      [0.00715, 0],
      [0.00011, 0],
      [0.001, 0],
      [0.00046, 0],
      [-0.01078, 1],
      [-0.01613, 2],
      [-0.00506, 2],
      [-0.00308, 2],
      [-0.00449, 2],
      [-0.00188, 2],
      [-0.00494, 2],
      [0.00831, 0],
      [-0.01035, 1],
      [0.00671, 0],
      [-0.00287, 2],
      [-0.00521, 2],
      [0.00463, 0],
      [-0.00515, 2],
      [-0.0052, 2],
      [-0.00293, 2],
      [-0.00763, 1],
      [-0.01051, 1],
      [-0.00164, 1],
      [-0.00961, 1]
    ],
    "red_o_points": [],
    "y_categories": ["NORM", "NPV", "nan"],
    "blue_o_points": [],
    "blue_x_points": [
      [0.01, 0],
      [-0.00127, 2],
      [0.00055, 1],
      [0.01031, 1],
      [0.00388, 0],
      [0.00015, 1],
      [0.01181, 0],
      [0.00615, 0],
      [0.01087, 0],
      [0.01269, 0]
    ]
  },
  "QS_mulLysisSite[Root]": {
    "red_x_points": [
      [-0.00048, 3],
      [-0.00148, 0],
      [-0.00513, 2],
      [-0.00147, 0],
      [-0.00047, 3],
      [-0.00155, 0],
      [-0.00159, 0],
      [-0.0015, 0],
      [-0.00063, 3],
      [-0.00167, 0],
      [-0.00159, 0],
      [-0.00124, 0],
      [-0.00058, 3],
      [0.00327, 1],
      [-0.00042, 3],
      [-0.00137, 0],
      [-0.00034, 3],
      [-0.00113, 0],
      [-0.0003, 3],
      [-0.00049, 3],
      [-0.00038, 3],
      [-0.00025, 3],
      [-0.00115, 0],
      [-0.00068, 3],
      [-0.00041, 3],
      [-0.00045, 3],
      [-0.00127, 0],
      [-0.00115, 0],
      [0.00322, 1],
      [-0.00019, 3],
      [-0.00481, 2],
      [-0.00041, 3]
    ],
    "red_o_points": [],
    "y_categories": ["N", "NOT APPLICABLE", "Y", "nan"],
    "blue_o_points": [],
    "blue_x_points": [
      [0.00474, 1],
      [-0.00017, 3],
      [0.00442, 1],
      [0.00045, 0],
      [-0.00029, 0],
      [0.00382, 1],
      [-5e-5, 3],
      [0.00444, 1],
      [-0.00025, 3],
      [-0.00019, 3]
    ]
  },
  "QS_mulLysisTrunk[Upper]": {
    "red_x_points": [
      [-0.00148, 3],
      [-0.00374, 0],
      [-0.00397, 0],
      [-0.00491, 0],
      [-0.00166, 3],
      [-0.00537, 0],
      [-0.00957, 2],
      [-0.00398, 0],
      [-0.00178, 3],
      [-0.00413, 0],
      [-0.00543, 0],
      [-0.00381, 0],
      [-0.00149, 3],
      [0.0101, 1],
      [-0.00174, 3],
      [-0.00452, 0],
      [-0.00187, 3],
      [-0.00904, 2],
      [-0.00141, 3],
      [-0.0017, 3],
      [-0.00147, 3],
      [-0.00146, 3],
      [-0.00352, 0],
      [-0.00169, 3],
      [-0.00228, 3],
      [-0.00137, 3],
      [-0.00393, 0],
      [-0.00381, 0],
      [0.01051, 1],
      [-0.00133, 3],
      [-0.0095, 2],
      [-0.00161, 3]
    ],
    "red_o_points": [],
    "y_categories": ["N", "NOT APPLICABLE", "Y", "nan"],
    "blue_o_points": [],
    "blue_x_points": [
      [0.01627, 1],
      [-0.00031, 3],
      [0.01139, 1],
      [0.00073, 0],
      [-0.00152, 0],
      [0.01277, 1],
      [-0.00054, 3],
      [0.01277, 1],
      [-0.00055, 3],
      [-0.00034, 3]
    ]
  },
  "QS_mulBpsurgeryType[Lysis]": {
    "red_x_points": [
      [-0.00174, 3],
      [-0.00582, 0],
      [-0.01366, 2],
      [-0.00598, 0],
      [-0.00166, 3],
      [-0.00602, 0],
      [-0.01296, 2],
      [-0.00562, 0],
      [-0.00242, 3],
      [-0.00609, 0],
      [-0.00595, 0],
      [-0.00471, 0],
      [-0.0016, 3],
      [0.01293, 1],
      [-0.00195, 3],
      [-0.00559, 0],
      [-0.00212, 3],
      [-0.01334, 2],
      [-0.00174, 3],
      [-0.00227, 3],
      [-0.00157, 3],
      [-0.0017, 3],
      [-0.00498, 0],
      [-0.00194, 3],
      [-0.00201, 3],
      [-0.00141, 3],
      [-0.00598, 0],
      [-0.00503, 0],
      [0.01403, 1],
      [-0.00129, 3],
      [-0.01383, 2],
      [-0.00194, 3]
    ],
    "red_o_points": [],
    "y_categories": ["N", "NOT APPLICABLE", "Y", "nan"],
    "blue_o_points": [],
    "blue_x_points": [
      [0.01964, 1],
      [8e-5, 3],
      [0.01591, 1],
      [0.00216, 0],
      [-0.00047, 0],
      [0.01656, 1],
      [-0.00075, 3],
      [0.0195, 1],
      [-0.00081, 3],
      [-0.0003, 3]
    ]
  },
  "QS_mulBpsurgeryType[Transf]": {
    "red_x_points": [
      [-0.00012, 3],
      [-0.00044, 2],
      [-0.00162, 0],
      [-0.00043, 2],
      [-0.00012, 3],
      [-0.00031, 2],
      [-0.00029, 2],
      [-0.00027, 2],
      [-6e-5, 3],
      [-0.00041, 2],
      [-0.00043, 2],
      [-0.00042, 2],
      [-5e-5, 3],
      [0.00101, 1],
      [-5e-5, 3],
      [-0.00031, 2],
      [-0.00013, 3],
      [-0.00035, 2],
      [-8e-5, 3],
      [-6e-5, 3],
      [-9e-5, 3],
      [-7e-5, 3],
      [-0.00042, 2],
      [-4e-5, 3],
      [-2e-5, 3],
      [-6e-5, 3],
      [-0.00029, 2],
      [-0.00044, 2],
      [0.00059, 1],
      [-6e-5, 3],
      [-0.00037, 2],
      [-0.00012, 3]
    ],
    "red_o_points": [],
    "y_categories": ["N", "NOT APPLICABLE", "Y", "nan"],
    "blue_o_points": [],
    "blue_x_points": [
      [0.00135, 1],
      [-4e-5, 3],
      [0.00093, 1],
      [-0.0001, 2],
      [-0.00025, 2],
      [0.00103, 1],
      [-2e-5, 3],
      [0.00102, 1],
      [-1e-5, 3],
      [-3e-5, 3]
    ]
  },
  "QS_equBpsurgTime": {
    "red_x_points": [
      [0.00065, 3],
      [-0.00657, 0],
      [0.00686, 2],
      [-0.00699, 0],
      [0.00062, 3],
      [-0.01165, 0],
      [-0.00787, 1],
      [-0.00811, 1],
      [0.00039, 3],
      [-0.00821, 1],
      [-0.00878, 0],
      [0.01087, 2],
      [0.00066, 3],
      [0.00075, 3],
      [0.00062, 3],
      [-0.00805, 1],
      [0.00068, 3],
      [0.00521, 2],
      [0.00073, 3],
      [0.00062, 3],
      [0.00062, 3],
      [0.00042, 3],
      [-0.00657, 0],
      [0.00065, 3],
      [0.0005, 3],
      [0.00054, 3],
      [-0.00909, 0],
      [-0.0067, 0],
      [0.00061, 3],
      [0.0006, 3],
      [0.00536, 2],
      [0.00065, 3]
    ],
    "red_o_points": [],
    "y_categories": [
      "0 TO 6 MONTHS",
      "13 TO 24 MONTHS",
      "7 TO 12 MONTHS",
      "nan"
    ],
    "blue_o_points": [],
    "blue_x_points": [
      [0.00047, 3],
      [0.00061, 3],
      [0.00045, 3],
      [0.0135, 2],
      [0.01425, 2],
      [0.00047, 3],
      [0.00073, 3],
      [0.00047, 3],
      [0.00077, 3],
      [0.00068, 3]
    ]
  },
  "QA_lstPexPain[C5]": {
    "red_x_points": [
      [-0.00235, 1],
      [-0.00437, 2],
      [-0.0051, 2],
      [-0.00489, 2],
      [-0.0019, 1],
      [-0.00074, 1],
      [-0.00065, 1],
      [-0.001, 1],
      [-0.0029, 1],
      [-0.00082, 1],
      [-0.00104, 1],
      [-0.00083, 1],
      [-0.00237, 1],
      [-0.0164, 2],
      [-0.00685, 2],
      [-0.00505, 2],
      [-0.00753, 2],
      [-0.00435, 2],
      [-0.00668, 2],
      [-0.00218, 1],
      [-0.00235, 1],
      [-0.00218, 1],
      [-0.00572, 2],
      [-0.00677, 2],
      [-0.00269, 1],
      [-0.00786, 2],
      [-0.00442, 2],
      [-0.00446, 2],
      [-0.00356, 1],
      [-0.00363, 1],
      [-0.00074, 1],
      [-0.0024, 1]
    ],
    "red_o_points": [],
    "y_categories": ["NORM", "NPV", "nan"],
    "blue_o_points": [],
    "blue_x_points": [
      [0.0227, 0],
      [-0.00339, 2],
      [-6e-5, 1],
      [-0.00038, 1],
      [-0.00041, 1],
      [0.00032, 1],
      [-0.00125, 1],
      [0.01988, 0],
      [-0.00113, 1],
      [0.04367, 0]
    ]
  },
  "QA_yonInjFracture": {
    "red_x_points": [
      [-0.0093, 0],
      [-0.00077, 2],
      [0.0013, 0],
      [-0.00126, 1],
      [-0.0087, 0],
      [0.00078, 0],
      [0.00067, 0],
      [-0.00311, 1],
      [0.00592, 2],
      [0.00122, 0],
      [-0.00323, 1],
      [-0.00729, 1],
      [-0.01124, 0],
      [-0.0014, 0],
      [0.00621, 1],
      [-0.00227, 1],
      [-0.00996, 0],
      [-0.00247, 1],
      [-0.01122, 0],
      [-0.01342, 0],
      [0.00699, 1],
      [-0.01092, 0],
      [-0.00115, 1],
      [-0.01076, 0],
      [-0.01209, 0],
      [-0.01156, 0],
      [0.00085, 0],
      [0.0004, 0],
      [-0.00971, 1],
      [0.00486, 2],
      [-0.00345, 1],
      [0.00505, 1]
    ],
    "red_o_points": [],
    "y_categories": ["N", "Y", "nan"],
    "blue_o_points": [],
    "blue_x_points": [
      [0.00227, 0],
      [0.01393, 1],
      [0.00137, 0],
      [0.00402, 0],
      [0.00543, 0],
      [0.00153, 1],
      [0.01306, 2],
      [0.0012, 0],
      [0.01515, 1],
      [0.01226, 2]
    ]
  },
  "QS_mulGraftNerve[Ac]": {
    "red_x_points": [
      [-1e-5, 2],
      [-0.00056, 0],
      [-0.00041, 0],
      [-0.00044, 0],
      [-3e-5, 2],
      [-0.00045, 0],
      [-0.00037, 0],
      [-0.00035, 0],
      [-4e-5, 2],
      [-0.00049, 0],
      [-0.00045, 0],
      [-0.00063, 0],
      [2e-5, 2],
      [0.00042, 1],
      [0.0, 2],
      [-0.00034, 0],
      [-9e-5, 2],
      [-0.00047, 0],
      [-6e-5, 2],
      [6e-5, 2],
      [6e-5, 2],
      [-9e-5, 2],
      [-0.0003, 0],
      [3e-5, 2],
      [4e-5, 2],
      [3e-5, 2],
      [-0.00043, 0],
      [-0.00028, 0],
      [0.00073, 1],
      [1e-5, 2],
      [-0.00039, 0],
      [-2e-5, 2]
    ],
    "red_o_points": [],
    "y_categories": ["N", "NOT APPLICABLE", "nan"],
    "blue_o_points": [],
    "blue_x_points": [
      [0.00121, 1],
      [6e-5, 2],
      [0.00091, 1],
      [0.00013, 0],
      [-0.00021, 0],
      [0.00082, 1],
      [6e-5, 2],
      [0.00047, 1],
      [0.0001, 2],
      [8e-5, 2]
    ]
  },
  "QS_mulNeuromadSite[C8]": {
    "red_x_points": [
      [-6e-5, 2],
      [-0.00226, 0],
      [-0.0017, 0],
      [-0.00263, 0],
      [-0.00016, 2],
      [-0.00277, 0],
      [-0.00236, 0],
      [-0.00237, 0],
      [-0.0003, 2],
      [-0.00213, 0],
      [-0.00317, 0],
      [-0.00247, 0],
      [-0.00025, 2],
      [0.00243, 1],
      [-0.00022, 2],
      [-0.00242, 0],
      [-0.00033, 2],
      [-0.00228, 0],
      [-0.00064, 2],
      [-0.00049, 2],
      [5e-5, 2],
      [-0.00029, 2],
      [-0.00193, 0],
      [-0.00022, 2],
      [-0.00114, 2],
      [-0.00018, 2],
      [-0.0021, 0],
      [-0.00195, 0],
      [0.00314, 1],
      [-1e-5, 2],
      [-0.00202, 0],
      [-0.00016, 2]
    ],
    "red_o_points": [],
    "y_categories": ["N", "NOT APPLICABLE", "nan"],
    "blue_o_points": [],
    "blue_x_points": [
      [0.00688, 1],
      [0.00011, 2],
      [0.00508, 1],
      [0.00093, 0],
      [-0.00071, 0],
      [0.00468, 1],
      [0.00016, 2],
      [0.00461, 1],
      [8e-5, 2],
      [0.00025, 2]
    ]
  },
  "QS_mulGraftNerve[Ph]": {
    "red_x_points": [
      [5e-5, 2],
      [-0.0003, 0],
      [-0.00028, 0],
      [-0.0004, 0],
      [-0.0001, 2],
      [-0.00049, 0],
      [-0.00026, 0],
      [-0.00034, 0],
      [-0.00015, 2],
      [-0.0004, 0],
      [-0.00043, 0],
      [-0.00026, 0],
      [-2e-5, 2],
      [0.00043, 1],
      [-0.00013, 2],
      [-0.00032, 0],
      [-0.00012, 2],
      [-0.00042, 0],
      [-0.00012, 2],
      [-0.00012, 2],
      [7e-5, 2],
      [-0.00011, 2],
      [-0.00016, 0],
      [-0.0001, 2],
      [-9e-5, 2],
      [-7e-5, 2],
      [-0.00028, 0],
      [-0.00024, 0],
      [0.0006, 1],
      [-0.0001, 2],
      [-0.00024, 0],
      [-0.0001, 2]
    ],
    "red_o_points": [],
    "y_categories": ["N", "NOT APPLICABLE", "nan"],
    "blue_o_points": [],
    "blue_x_points": [
      [0.00066, 1],
      [0.00014, 2],
      [0.0005, 1],
      [0.00015, 0],
      [-4e-5, 0],
      [0.00086, 1],
      [1e-5, 2],
      [0.00053, 1],
      [-2e-5, 2],
      [2e-5, 2]
    ]
  },
  "QS_mulTransfSite[AcSsPA]": {
    "red_x_points": [
      [-0.00055, 3],
      [-0.00167, 0],
      [-0.00158, 0],
      [-0.00183, 0],
      [-0.0005, 3],
      [-0.00184, 0],
      [-0.00176, 0],
      [-0.0017, 0],
      [-0.00061, 3],
      [-0.00217, 0],
      [-0.00179, 0],
      [-0.00176, 0],
      [-0.00067, 3],
      [0.00389, 1],
      [-0.00053, 3],
      [-0.00185, 0],
      [-0.0006, 3],
      [-0.00439, 2],
      [-0.00059, 3],
      [-0.00049, 3],
      [-0.00053, 3],
      [-0.00039, 3],
      [-0.00176, 0],
      [-0.00057, 3],
      [-0.00066, 3],
      [-0.00051, 3],
      [-0.00172, 0],
      [-0.00174, 0],
      [0.0038, 1],
      [-0.00049, 3],
      [-0.0016, 0],
      [-0.00048, 3]
    ],
    "red_o_points": [],
    "y_categories": ["N", "NOT APPLICABLE", "Y", "nan"],
    "blue_o_points": [],
    "blue_x_points": [
      [0.00548, 1],
      [-0.00014, 3],
      [0.00364, 1],
      [-0.00064, 0],
      [-0.00087, 0],
      [0.00439, 1],
      [-0.00013, 3],
      [0.00506, 1],
      [-0.00022, 3],
      [-0.0003, 3]
    ]
  },
  "participant_code": {
    "red_x_points": [
      [-0.02776, 1],
      [-0.02811, 2],
      [-0.02858, 3],
      [-0.02705, 4],
      [-0.02823, 5],
      [-0.02647, 6],
      [-0.02682, 7],
      [-0.02705, 8],
      [-0.02794, 9],
      [-0.02764, 10],
      [-0.02794, 11],
      [-0.02846, 12],
      [-0.02823, 13],
      [-0.02758, 15],
      [-0.02729, 17],
      [-0.02811, 18],
      [-0.02729, 20],
      [-0.02629, 21],
      [-0.02694, 22],
      [-0.02623, 24],
      [-0.02617, 26],
      [-0.02694, 27],
      [-0.02776, 28],
      [-0.02752, 30],
      [-0.02729, 31],
      [-0.02776, 32],
      [-0.0267, 34],
      [-0.02782, 36],
      [-0.02676, 38],
      [-0.02694, 39],
      [-0.02723, 40],
      [-0.02764, 41]
    ],
    "red_o_points": [],
    "y_categories": [
      "P16554",
      "P18297",
      "P19283",
      "P19287",
      "P23391",
      "P30595",
      "P31645",
      "P31691",
      "P34778",
      "P35046",
      "P36328",
      "P43633",
      "P4544",
      "P46417",
      "P48965",
      "P53068",
      "P5497",
      "P59529",
      "P62483",
      "P64658",
      "P65202",
      "P66816",
      "P6751",
      "P7408",
      "P75566",
      "P76226",
      "P79971",
      "P82621",
      "P82990",
      "P84549",
      "P84932",
      "P85825",
      "P86989",
      "P8770",
      "P87791",
      "P90550",
      "P93159",
      "P94969",
      "P96710",
      "P97130",
      "P9744",
      "P98500",
      "nan"
    ],
    "blue_o_points": [],
    "blue_x_points": [
      [0.05787, 0],
      [0.05844, 14],
      [0.05505, 16],
      [0.05928, 19],
      [0.05618, 23],
      [0.0566, 25],
      [0.05646, 29],
      [0.05801, 33],
      [0.05815, 35],
      [0.05787, 37]
    ]
  },
  "QA_lstPexTouch[T1]": {
    "red_x_points": [
      [-0.00887, 1],
      [-0.00272, 2],
      [0.00052, 1],
      [-0.00241, 2],
      [-0.01015, 1],
      [-0.00799, 0],
      [0.00145, 1],
      [0.00181, 1],
      [-0.01231, 1],
      [-0.0053, 0],
      [-0.00443, 0],
      [-0.00759, 0],
      [0.007, 0],
      [-0.00908, 2],
      [-0.00451, 2],
      [-0.00356, 2],
      [-0.00996, 1],
      [-0.00256, 2],
      [-0.00537, 2],
      [0.00753, 0],
      [-0.01045, 1],
      [0.00789, 0],
      [-0.00298, 2],
      [-0.00452, 2],
      [-0.01114, 1],
      [0.00764, 0],
      [0.00298, 1],
      [-0.00294, 2],
      [-0.00217, 1],
      [-0.00532, 2],
      [0.0003, 1],
      [-0.01173, 1]
    ],
    "red_o_points": [],
    "y_categories": ["NORM", "NPV", "nan"],
    "blue_o_points": [],
    "blue_x_points": [
      [0.00067, 1],
      [0.00061, 2],
      [0.00099, 1],
      [0.0086, 1],
      [0.01162, 1],
      [0.00038, 1],
      [0.01294, 0],
      [0.00535, 0],
      [0.01209, 0],
      [0.01446, 0]
    ]
  },
  "QA_mulInjOrthesisType[ArmSling]": {
    "red_x_points": [
      [-0.00617, 2],
      [-0.00543, 2],
      [-0.0071, 2],
      [-0.00609, 2],
      [-0.00643, 2],
      [-0.00654, 2],
      [-0.00632, 2],
      [-0.00614, 2],
      [-0.00556, 2],
      [-0.00708, 2],
      [-0.00651, 2],
      [-0.00709, 2],
      [-0.00688, 2],
      [0.01171, 1],
      [-0.0081, 2],
      [-0.00633, 2],
      [-0.00665, 2],
      [-0.01203, 0],
      [0.01281, 1],
      [-0.00583, 2],
      [-0.00674, 2],
      [-0.01971, 0],
      [-0.00391, 3],
      [-0.00768, 2],
      [0.00976, 1],
      [-0.00626, 2],
      [-0.00647, 2],
      [-0.00585, 2],
      [-0.0134, 3],
      [-0.00133, 3],
      [-0.00558, 2],
      [-0.00735, 2]
    ],
    "red_o_points": [],
    "y_categories": ["N", "NOT APPLICABLE", "Y", "nan"],
    "blue_o_points": [],
    "blue_x_points": [
      [0.00328, 2],
      [0.02098, 1],
      [0.01495, 1],
      [0.03472, 1],
      [-0.00389, 2],
      [0.01543, 1],
      [-0.00199, 2],
      [0.01563, 1],
      [-0.00314, 2],
      [0.01246, 3]
    ]
  },
  "QS_mulGraftNerve[Ul]": {
    "red_x_points": [
      [-6e-5, 0],
      [-6e-5, 0],
      [-0.00012, 0],
      [-1e-5, 2],
      [-0.00024, 0],
      [-6e-5, 0],
      [-0.00012, 0],
      [0.0, 2],
      [-6e-5, 0],
      [-0.00024, 0],
      [-6e-5, 0],
      [4e-5, 2],
      [-1e-5, 2],
      [-0.00012, 0],
      [3e-5, 2],
      [-0.00012, 0],
      [-1e-5, 2],
      [0.0, 2],
      [3e-5, 2],
      [1e-5, 2],
      [-1e-5, 2],
      [-1e-5, 2],
      [-1e-5, 2],
      [-6e-5, 0],
      [-6e-5, 0],
      [3e-5, 2],
      [-1e-5, 2]
    ],
    "red_o_points": [],
    "y_categories": ["N", "NOT APPLICABLE", "nan"],
    "blue_o_points": [],
    "blue_x_points": [
      [0.00028, 1],
      [4e-5, 2],
      [0.00014, 1],
      [0.00014, 1],
      [1e-5, 2],
      [0.00022, 1],
      [1e-5, 2],
      [3e-5, 2]
    ]
  },
  "QA_mulInjOrthesisType[ShoulderSupport]": {
    "red_x_points": [
      [-0.00626, 0],
      [-0.00546, 0],
      [-0.00595, 0],
      [-0.00567, 0],
      [-0.00608, 0],
      [-0.00657, 0],
      [-0.00605, 0],
      [-0.00633, 0],
      [-0.02162, 2],
      [-0.00626, 0],
      [-0.006, 0],
      [-0.00572, 0],
      [-0.00619, 0],
      [0.01399, 1],
      [-0.00692, 0],
      [-0.00595, 0],
      [-0.00664, 0],
      [-0.01032, 2],
      [0.0134, 1],
      [-0.00477, 0],
      [-0.00644, 0],
      [-0.01844, 2],
      [-0.00227, 3],
      [-0.00666, 0],
      [0.00796, 1],
      [-0.00596, 0],
      [-0.00605, 0],
      [-0.00554, 0],
      [-0.00999, 3],
      [-0.00089, 3],
      [-0.00593, 0],
      [-0.00654, 0]
    ],
    "red_o_points": [],
    "y_categories": ["N", "NOT APPLICABLE", "Y", "nan"],
    "blue_o_points": [],
    "blue_x_points": [
      [0.00152, 0],
      [0.02137, 1],
      [0.01578, 1],
      [0.02939, 1],
      [-0.00407, 0],
      [0.01428, 1],
      [-0.00106, 0],
      [0.01483, 1],
      [-0.00218, 0],
      [0.01396, 3]
    ]
  },
  "QA_yonInjUnconscio": {
    "red_x_points": [
      [-0.00623, 1],
      [-0.00754, 1],
      [-0.00477, 2],
      [-0.00412, 2],
      [-0.00469, 2],
      [0.01999, 0],
      [-0.009, 1],
      [-0.00485, 2],
      [-0.00522, 2],
      [-0.00554, 2],
      [-0.00462, 2],
      [-0.01083, 1],
      [-0.00784, 1],
      [-0.02036, 1],
      [-0.00635, 2],
      [-0.00422, 2],
      [-0.00463, 2],
      [-0.00758, 1],
      [0.00642, 0],
      [-0.00845, 1],
      [-0.00686, 1],
      [-0.00856, 1],
      [-0.00735, 1],
      [-0.00663, 2],
      [-0.00755, 1],
      [-0.0059, 2],
      [-0.00909, 1],
      [-0.00678, 1],
      [-0.00204, 2],
      [-0.00519, 2],
      [-0.00779, 1],
      [-0.00505, 2]
    ],
    "red_o_points": [],
    "y_categories": ["N", "Y", "nan"],
    "blue_o_points": [],
    "blue_x_points": [
      [0.00031, 2],
      [0.00819, 1],
      [0.01914, 0],
      [0.02848, 0],
      [0.02421, 0],
      [0.00043, 2],
      [-0.00299, 1],
      [0.00082, 2],
      [0.03209, 0],
      [-0.00088, 2]
    ]
  },
  "QS_mulTransfSite[Other]": {
    "red_x_points": [
      [-0.0024, 3],
      [-0.01382, 0],
      [-0.01497, 0],
      [-0.0145, 0],
      [-0.00287, 3],
      [-0.01471, 0],
      [-0.01412, 0],
      [-0.0148, 0],
      [-0.00277, 3],
      [-0.01483, 0],
      [-0.01454, 0],
      [-0.01421, 0],
      [-0.00245, 3],
      [0.01934, 1],
      [-0.003, 3],
      [-0.01412, 0],
      [-0.00217, 3],
      [-0.01339, 0],
      [-0.00316, 3],
      [-0.00292, 3],
      [-0.00243, 3],
      [-0.00222, 3],
      [-0.01312, 0],
      [-0.00274, 3],
      [-0.00374, 3],
      [-0.00256, 3],
      [-0.01433, 0],
      [-0.01407, 0],
      [0.02182, 1],
      [-0.00227, 3],
      [-0.01424, 0],
      [-0.00259, 3]
    ],
    "red_o_points": [],
    "y_categories": ["N", "NOT APPLICABLE", "Y", "nan"],
    "blue_o_points": [],
    "blue_x_points": [
      [0.02833, 1],
      [-0.00111, 3],
      [0.02283, 1],
      [-0.00611, 0],
      [0.04711, 2],
      [0.02276, 1],
      [-0.00117, 3],
      [0.02275, 1],
      [-0.00137, 3],
      [-0.00063, 3]
    ]
  },
  "QA_lstInjTpbiSide": {
    "red_x_points": [
      [-0.00272, 1],
      [0.00051, 0],
      [-0.00036, 0],
      [1e-5, 0],
      [0.00039, 0],
      [-0.0014, 1],
      [-0.00038, 0],
      [-0.00094, 0],
      [-0.00424, 1],
      [-0.00014, 0],
      [-0.00095, 1],
      [-0.00224, 1],
      [-0.00306, 1],
      [-0.01564, 0],
      [-0.00714, 1],
      [-0.00146, 1],
      [0.00119, 0],
      [-0.00134, 1],
      [-0.00791, 1],
      [0.001, 0],
      [0.00173, 0],
      [0.0005, 0],
      [0.00034, 0],
      [0.0024, 0],
      [-0.00554, 1],
      [-0.00501, 1],
      [-0.00089, 1],
      [-0.00053, 1],
      [-0.01602, 0],
      [-0.0061, 1],
      [-0.00082, 0],
      [0.00145, 0]
    ],
    "red_o_points": [],
    "y_categories": ["L", "R", "nan"],
    "blue_o_points": [],
    "blue_x_points": [
      [-0.00381, 0],
      [0.00791, 0],
      [0.00791, 1],
      [0.00352, 0],
      [0.00132, 1],
      [0.00999, 1],
      [0.00104, 1],
      [0.00735, 1],
      [0.00463, 0],
      [0.00666, 0]
    ]
  },
  "QS_mulGraftNerve[Me]": {
    "red_x_points": [
      [-7e-5, 0],
      [1e-5, 2],
      [-7e-5, 0],
      [-7e-5, 0],
      [-7e-5, 0],
      [1e-5, 2],
      [1e-5, 2],
      [1e-5, 2]
    ],
    "red_o_points": [],
    "y_categories": ["N", "NOT APPLICABLE", "nan"],
    "blue_o_points": [],
    "blue_x_points": [
      [9e-5, 1],
      [-7e-5, 0],
      [1e-5, 2],
      [9e-5, 1],
      [1e-5, 2],
      [1e-5, 2]
    ]
  },
  "QS_mulGraftNerve[MC]": {
    "red_x_points": [
      [1e-5, 2],
      [-4e-5, 0],
      [-4e-5, 0],
      [-4e-5, 0],
      [1e-5, 2],
      [-4e-5, 0],
      [-4e-5, 0],
      [-4e-5, 0],
      [1e-5, 2],
      [-4e-5, 0],
      [-4e-5, 0],
      [-4e-5, 0],
      [7e-5, 1],
      [-4e-5, 0],
      [-4e-5, 0],
      [1e-5, 2],
      [1e-5, 2],
      [1e-5, 2],
      [1e-5, 2],
      [1e-5, 2],
      [-4e-5, 0],
      [-4e-5, 0],
      [7e-5, 1],
      [1e-5, 2]
    ],
    "red_o_points": [],
    "y_categories": ["N", "NOT APPLICABLE", "nan"],
    "blue_o_points": [],
    "blue_x_points": [
      [7e-5, 1],
      [-4e-5, 0],
      [7e-5, 1],
      [1e-5, 2],
      [7e-5, 1],
      [1e-5, 2],
      [1e-5, 2]
    ]
  },
  "QS_mulLysisSite[Trunk]": {
    "red_x_points": [
      [-0.00101, 3],
      [-0.00355, 0],
      [-0.00323, 0],
      [-0.00359, 0],
      [-0.00126, 3],
      [-0.00389, 0],
      [-0.0091, 2],
      [-0.00383, 0],
      [-0.00126, 3],
      [-0.00356, 0],
      [-0.00411, 0],
      [-0.00289, 0],
      [-0.00134, 3],
      [0.00819, 1],
      [-0.00113, 3],
      [-0.00349, 0],
      [-0.00151, 3],
      [-0.00769, 2],
      [-0.00166, 3],
      [-0.00173, 3],
      [-0.001, 3],
      [-0.00118, 3],
      [-0.00367, 0],
      [-0.00126, 3],
      [-0.00237, 3],
      [-0.00109, 3],
      [-0.00323, 0],
      [-0.00332, 0],
      [0.00929, 1],
      [-0.00074, 3],
      [-0.00872, 2],
      [-0.00118, 3]
    ],
    "red_o_points": [],
    "y_categories": ["N", "NOT APPLICABLE", "Y", "nan"],
    "blue_o_points": [],
    "blue_x_points": [
      [0.01395, 1],
      [-0.00024, 3],
      [0.01005, 1],
      [0.00118, 0],
      [-0.00129, 0],
      [0.01087, 1],
      [-0.00089, 3],
      [0.01118, 1],
      [-0.00052, 3],
      [-0.00021, 3]
    ]
  },
  "QS_mulGraftTrunk[UpperTrunk]": {
    "red_x_points": [
      [-0.00026, 3],
      [-0.00106, 0],
      [-0.0012, 0],
      [-0.00145, 0],
      [-0.00033, 3],
      [-0.00116, 0],
      [-0.00137, 0],
      [-0.00131, 0],
      [-0.00021, 3],
      [-0.00149, 0],
      [-0.00157, 0],
      [-0.00148, 0],
      [-0.00028, 3],
      [0.0023, 1],
      [-0.00028, 3],
      [-0.00398, 2],
      [-0.00033, 3],
      [-0.00097, 0],
      [-0.00026, 3],
      [-0.00034, 3],
      [-0.00028, 3],
      [-0.00044, 3],
      [-0.00132, 0],
      [-0.00029, 3],
      [-0.00042, 3],
      [-0.0003, 3],
      [-0.00143, 0],
      [-0.00134, 0],
      [0.00275, 1],
      [-0.00025, 3],
      [-0.00135, 0],
      [-0.0004, 3]
    ],
    "red_o_points": [],
    "y_categories": ["N", "NOT APPLICABLE", "Y", "nan"],
    "blue_o_points": [],
    "blue_x_points": [
      [0.00399, 1],
      [-3e-5, 3],
      [0.00341, 1],
      [0.00022, 0],
      [-0.00093, 0],
      [0.00299, 1],
      [-0.00025, 3],
      [0.00365, 1],
      [-2e-5, 3],
      [-9e-5, 3]
    ]
  },
  "QS_mulTransfSite[PhMc]": {
    "red_x_points": [
      [-0.00086, 3],
      [-0.00396, 0],
      [-0.00338, 0],
      [-0.00364, 0],
      [-0.00084, 3],
      [-0.00453, 0],
      [-0.00352, 0],
      [-0.00858, 2],
      [-0.00092, 3],
      [-0.00309, 0],
      [-0.00391, 0],
      [-0.00346, 0],
      [-0.00081, 3],
      [0.00706, 1],
      [-0.00073, 3],
      [-0.00354, 0],
      [-0.00079, 3],
      [-0.00284, 0],
      [-0.00102, 3],
      [-0.00101, 3],
      [-0.0007, 3],
      [-0.00102, 3],
      [-0.00579, 2],
      [-0.00067, 3],
      [-0.0011, 3],
      [-0.00078, 3],
      [-0.00323, 0],
      [-0.00295, 0],
      [0.00717, 1],
      [-0.0009, 3],
      [-0.00317, 0],
      [-0.00082, 3]
    ],
    "red_o_points": [],
    "y_categories": ["N", "NOT APPLICABLE", "Y", "nan"],
    "blue_o_points": [],
    "blue_x_points": [
      [0.01063, 1],
      [-7e-5, 3],
      [0.00904, 1],
      [-0.00105, 0],
      [-0.0011, 0],
      [0.00738, 1],
      [-3e-5, 3],
      [0.00837, 1],
      [-0.00023, 3],
      [-0.00027, 3]
    ]
  },
  "QA_mulInjTbpiCause[Motorcycle]": {
    "red_x_points": [
      [-0.00201, 0],
      [-0.0006, 1],
      [-0.00054, 1],
      [-0.00042, 1],
      [-7e-5, 1],
      [-0.0006, 1],
      [-0.0004, 1],
      [-0.00052, 1],
      [0.00063, 1],
      [-0.00044, 1],
      [-0.00052, 1],
      [-0.00035, 1],
      [-0.00698, 0],
      [-0.03786, 1],
      [-0.0002, 1],
      [-0.00058, 1],
      [-0.00048, 1],
      [-0.00036, 1],
      [-0.00099, 1],
      [-0.01155, 0],
      [0.00033, 1],
      [0.0026, 1],
      [-0.00032, 1],
      [-0.00033, 1],
      [-0.00084, 1],
      [-0.00808, 0],
      [-0.00037, 1],
      [-0.00037, 1],
      [-0.03915, 1],
      [-0.00011, 1],
      [-0.00041, 1],
      [-0.00068, 1]
    ],
    "red_o_points": [],
    "y_categories": ["N", "Y", "nan"],
    "blue_o_points": [],
    "blue_x_points": [
      [0.01721, 0],
      [-0.00034, 1],
      [0.015, 0],
      [-0.00127, 1],
      [-0.00035, 1],
      [0.01601, 0],
      [0.00418, 1],
      [0.01568, 0],
      [0.00467, 1],
      [0.00355, 1]
    ]
  },
  "QS_mulLysisRoot[C6]": {
    "red_x_points": [
      [-0.0006, 3],
      [-0.00217, 0],
      [-0.0073, 2],
      [-0.00183, 0],
      [-0.00055, 3],
      [-0.00253, 0],
      [-0.00204, 0],
      [-0.0018, 0],
      [-0.00109, 3],
      [-0.00229, 0],
      [-0.00212, 0],
      [-0.00155, 0],
      [-0.00061, 3],
      [0.00465, 1],
      [-0.00102, 3],
      [-0.00213, 0],
      [-0.00046, 3],
      [-0.00199, 0],
      [-0.00066, 3],
      [-0.00105, 3],
      [-0.00066, 3],
      [-0.00069, 3],
      [-0.00201, 0],
      [-0.00085, 3],
      [-0.00071, 3],
      [-0.00062, 3],
      [-0.00185, 0],
      [-0.00188, 0],
      [0.00553, 1],
      [-0.00043, 3],
      [-0.00636, 2],
      [-0.00045, 3]
    ],
    "red_o_points": [],
    "y_categories": ["N", "NOT APPLICABLE", "Y", "nan"],
    "blue_o_points": [],
    "blue_x_points": [
      [0.00615, 1],
      [-2e-5, 3],
      [0.00643, 1],
      [0.00095, 0],
      [-9e-5, 0],
      [0.0057, 1],
      [-0.00018, 3],
      [0.00643, 1],
      [-0.00042, 3],
      [-0.00027, 3]
    ]
  },
  "QS_mulGraftLevel[Trunk]": {
    "red_x_points": [
      [-0.00033, 3],
      [-0.00049, 0],
      [-0.00055, 0],
      [-0.00079, 0],
      [-0.00019, 3],
      [-0.00077, 0],
      [-0.00065, 0],
      [-0.0007, 0],
      [-0.00023, 3],
      [-0.0006, 0],
      [-0.00087, 0],
      [-0.00078, 0],
      [-0.00031, 3],
      [0.0013, 1],
      [-0.00024, 3],
      [-0.00261, 2],
      [-0.00024, 3],
      [-0.00037, 0],
      [-0.00031, 3],
      [-0.0003, 3],
      [-0.00025, 3],
      [-0.00024, 3],
      [-0.00051, 0],
      [-0.00033, 3],
      [-0.00041, 3],
      [-0.00037, 3],
      [-0.0007, 0],
      [-0.00058, 0],
      [0.00145, 1],
      [-0.0003, 3],
      [-0.00073, 0],
      [-0.00033, 3]
    ],
    "red_o_points": [],
    "y_categories": ["N", "NOT APPLICABLE", "Y", "nan"],
    "blue_o_points": [],
    "blue_x_points": [
      [0.00265, 1],
      [-0.00015, 3],
      [0.00201, 1],
      [0.00019, 0],
      [-0.00044, 0],
      [0.00155, 1],
      [-0.00011, 3],
      [0.00222, 1],
      [-0.00015, 3],
      [-0.00017, 3]
    ]
  },
  "QS_mulGraftNerve[other]": {
    "red_x_points": [
      [-1e-5, 2],
      [-0.00028, 0],
      [-0.00022, 0],
      [-0.0003, 0],
      [-5e-5, 2],
      [-0.00025, 0],
      [-0.00021, 0],
      [-0.00029, 0],
      [-0.0, 2],
      [-0.00038, 0],
      [-0.00032, 0],
      [-0.00022, 0],
      [-1e-5, 2],
      [0.00028, 1],
      [-5e-5, 2],
      [-0.00043, 0],
      [0.0, 2],
      [-0.00025, 0],
      [-0.00035, 2],
      [-4e-5, 2],
      [2e-5, 2],
      [-3e-5, 2],
      [-0.00022, 0],
      [-4e-5, 2],
      [-0.00017, 2],
      [-7e-5, 2],
      [-0.00019, 0],
      [-0.00022, 0],
      [0.00041, 1],
      [-6e-5, 2],
      [-0.00016, 0],
      [-4e-5, 2]
    ],
    "red_o_points": [],
    "y_categories": ["N", "NOT APPLICABLE", "nan"],
    "blue_o_points": [],
    "blue_x_points": [
      [0.00059, 1],
      [5e-5, 2],
      [0.00051, 1],
      [0.00011, 0],
      [-0.00011, 0],
      [0.00086, 1],
      [3e-5, 2],
      [0.00071, 1],
      [-2e-5, 2],
      [-5e-5, 2]
    ]
  },
  "QS_mulTransfSite[AcSsAA]": {
    "red_x_points": [
      [-0.00154, 3],
      [-0.01333, 2],
      [-0.00399, 0],
      [-0.0143, 2],
      [-0.00162, 3],
      [-0.01736, 2],
      [-0.00408, 0],
      [-0.0039, 0],
      [-0.0017, 3],
      [-0.00468, 0],
      [-0.01565, 2],
      [-0.00496, 0],
      [-0.00176, 3],
      [0.01591, 1],
      [-0.00133, 3],
      [-0.01398, 2],
      [-0.00149, 3],
      [-0.00396, 0],
      [-0.00188, 3],
      [-0.00149, 3],
      [-0.00141, 3],
      [-0.00152, 3],
      [-0.01256, 2],
      [-0.00139, 3],
      [-0.00196, 3],
      [-0.00147, 3],
      [-0.00391, 0],
      [-0.01388, 2],
      [0.01666, 1],
      [-0.00118, 3],
      [-0.00401, 0],
      [-0.00136, 3]
    ],
    "red_o_points": [],
    "y_categories": ["N", "NOT APPLICABLE", "Y", "nan"],
    "blue_o_points": [],
    "blue_x_points": [
      [0.01991, 1],
      [0.00013, 3],
      [0.01712, 1],
      [0.00098, 0],
      [0.00082, 0],
      [0.0187, 1],
      [-0.00025, 3],
      [0.01833, 1],
      [-1e-5, 3],
      [0.0001, 3]
    ]
  },
  "QS_mulGraftNerve[Ax]": {
    "red_x_points": [
      [3e-5, 1],
      [0.0, 2],
      [-4e-5, 0],
      [-4e-5, 0],
      [0.0, 2],
      [0.0, 2],
      [3e-5, 1],
      [0.0, 2]
    ],
    "red_o_points": [],
    "y_categories": ["N", "NOT APPLICABLE", "nan"],
    "blue_o_points": [],
    "blue_x_points": [[3e-5, 1], [0.0, 2]]
  },
  "QS_mulNeuromadSite[C5]": {
    "red_x_points": [
      [-0.00012, 2],
      [-0.0006, 0],
      [-0.00043, 0],
      [-0.00038, 0],
      [-0.00011, 2],
      [-0.00055, 0],
      [-0.00031, 0],
      [-0.00038, 0],
      [3e-5, 2],
      [-0.00055, 0],
      [-0.00065, 0],
      [-0.0007, 0],
      [-0.00011, 2],
      [0.00085, 1],
      [-2e-5, 2],
      [-0.00056, 0],
      [-0.00015, 2],
      [-0.00037, 0],
      [-0.0003, 2],
      [-0.0001, 2],
      [-5e-5, 2],
      [0.0, 2],
      [-0.00066, 0],
      [-0.0001, 2],
      [-0.00025, 2],
      [-0.00011, 2],
      [-0.00032, 0],
      [-0.00045, 0],
      [0.00058, 1],
      [-0.00012, 2],
      [-0.00043, 0],
      [-0.00012, 2]
    ],
    "red_o_points": [],
    "y_categories": ["N", "NOT APPLICABLE", "nan"],
    "blue_o_points": [],
    "blue_x_points": [
      [0.00107, 1],
      [5e-5, 2],
      [0.00107, 1],
      [3e-5, 0],
      [-8e-5, 0],
      [0.00096, 1],
      [-1e-5, 2],
      [0.00142, 1],
      [5e-5, 2],
      [4e-5, 2]
    ]
  },
  "QS_mulNeuromadSite[C7]": {
    "red_x_points": [
      [-4e-5, 2],
      [-0.00092, 0],
      [-0.00062, 0],
      [-0.00104, 0],
      [-0.00023, 2],
      [-0.00099, 0],
      [-0.00084, 0],
      [-0.00097, 0],
      [-0.00013, 2],
      [-0.0011, 0],
      [-0.0014, 0],
      [-0.00088, 0],
      [-3e-5, 2],
      [0.00111, 1],
      [-8e-5, 2],
      [-0.00097, 0],
      [-0.00051, 2],
      [-0.00082, 0],
      [-0.00033, 2],
      [-7e-5, 2],
      [-7e-5, 2],
      [-6e-5, 2],
      [-0.00076, 0],
      [-8e-5, 2],
      [-0.00067, 2],
      [-0.0001, 2],
      [-0.0011, 0],
      [-0.00069, 0],
      [0.00147, 1],
      [-0.00016, 2],
      [-0.00065, 0],
      [-0.00018, 2]
    ],
    "red_o_points": [],
    "y_categories": ["N", "NOT APPLICABLE", "nan"],
    "blue_o_points": [],
    "blue_x_points": [
      [0.00275, 1],
      [0.00013, 2],
      [0.00194, 1],
      [0.00014, 0],
      [-0.00038, 0],
      [0.00198, 1],
      [-5e-5, 2],
      [0.00167, 1],
      [-3e-5, 2],
      [2e-5, 2]
    ]
  },
  "QA_lstPexMuscstrength[WristExte]": {
    "red_x_points": [
      [0.00086, 1],
      [-0.0011, 2],
      [-0.00496, 1],
      [-0.00199, 1],
      [0.00094, 1],
      [0.00081, 0],
      [-0.00403, 1],
      [-0.00427, 1],
      [-0.01197, 0],
      [0.00295, 0],
      [0.00054, 0],
      [-0.00608, 1],
      [-0.00624, 0],
      [-0.0009, 2],
      [-0.00059, 2],
      [-0.00125, 2],
      [-0.00533, 0],
      [-0.00265, 2],
      [-0.0001, 2],
      [-0.01236, 0],
      [0.00082, 1],
      [-0.01153, 0],
      [-0.00196, 1],
      [-0.00075, 2],
      [-0.00831, 0],
      [0.00208, 1],
      [0.00171, 0],
      [0.00089, 0],
      [-0.00135, 2],
      [0.00112, 1],
      [-0.00505, 1],
      [-0.00015, 2]
    ],
    "red_o_points": [],
    "y_categories": ["GREATER THAN OR EQUALS TO 3", "LESS THAN 3", "nan"],
    "blue_o_points": [],
    "blue_x_points": [
      [0.00092, 0],
      [0.00195, 2],
      [0.00057, 0],
      [0.00866, 0],
      [0.00602, 0],
      [0.00076, 1],
      [0.0103, 1],
      [0.00052, 0],
      [0.01107, 1],
      [0.01023, 2]
    ]
  },
  "QS_mulTransfSite[IMc]": {
    "red_x_points": [
      [-0.00111, 3],
      [-0.01027, 2],
      [-0.00448, 0],
      [-0.0044, 0],
      [-0.00107, 3],
      [-0.00467, 0],
      [-0.00447, 0],
      [-0.00468, 0],
      [-0.00152, 3],
      [-0.00504, 0],
      [-0.00504, 0],
      [-0.00457, 0],
      [-0.00146, 3],
      [0.01083, 1],
      [-0.00107, 3],
      [-0.00449, 0],
      [-0.00134, 3],
      [-0.01005, 2],
      [-0.00173, 3],
      [-0.00159, 3],
      [-0.00115, 3],
      [-0.00152, 3],
      [-0.00462, 0],
      [-0.00136, 3],
      [-0.00212, 3],
      [-0.00133, 3],
      [-0.00418, 0],
      [-0.00918, 2],
      [0.01126, 1],
      [-0.00121, 3],
      [-0.01016, 2],
      [-0.00135, 3]
    ],
    "red_o_points": [],
    "y_categories": ["N", "NOT APPLICABLE", "Y", "nan"],
    "blue_o_points": [],
    "blue_x_points": [
      [0.01657, 1],
      [-0.00048, 3],
      [0.01301, 1],
      [-0.00019, 0],
      [-0.00173, 0],
      [0.01309, 1],
      [-0.00061, 3],
      [0.01435, 1],
      [-0.00035, 3],
      [-0.00052, 3]
    ]
  },
  "QS_mulLysisSite[Nerve]": {
    "red_x_points": [
      [-8e-5, 3],
      [-0.00034, 0],
      [-0.00263, 2],
      [-0.00041, 0],
      [-6e-5, 3],
      [-0.00041, 0],
      [-0.00035, 0],
      [-0.0003, 0],
      [-0.00022, 3],
      [-0.00032, 0],
      [-0.00034, 0],
      [-0.00019, 0],
      [-8e-5, 3],
      [0.00081, 1],
      [-0.00026, 3],
      [-0.00041, 0],
      [-6e-5, 3],
      [-0.00031, 0],
      [-0.0, 3],
      [-0.00027, 3],
      [-5e-5, 3],
      [-5e-5, 3],
      [-0.00036, 0],
      [-0.00013, 3],
      [-6e-5, 3],
      [-8e-5, 3],
      [-0.00046, 0],
      [-0.00039, 0],
      [0.00116, 1],
      [-9e-5, 3],
      [-0.00013, 0],
      [-0.0001, 3]
    ],
    "red_o_points": [],
    "y_categories": ["N", "NOT APPLICABLE", "Y", "nan"],
    "blue_o_points": [],
    "blue_x_points": [
      [0.00142, 1],
      [2e-5, 3],
      [0.00065, 1],
      [0.00019, 0],
      [0.00015, 0],
      [0.00121, 1],
      [2e-5, 3],
      [0.00097, 1],
      [-0.0001, 3],
      [4e-5, 3]
    ]
  },
  "QS_mulGraftNerve[TD]": {
    "red_x_points": [
      [1e-5, 2],
      [-2e-5, 0],
      [-2e-5, 0],
      [1e-5, 2],
      [-2e-5, 0],
      [-2e-5, 0],
      [-2e-5, 0],
      [1e-5, 2],
      [1e-5, 2],
      [1e-5, 2],
      [3e-5, 1],
      [1e-5, 2],
      [-2e-5, 0],
      [1e-5, 2]
    ],
    "red_o_points": [],
    "y_categories": ["N", "NOT APPLICABLE", "nan"],
    "blue_o_points": [],
    "blue_x_points": [[3e-5, 1], [-2e-5, 0], [-2e-5, 0], [1e-5, 2], [1e-5, 2]]
  },
  "QS_mulLysisRoot[C7]": {
    "red_x_points": [
      [-0.0002, 3],
      [-0.00072, 0],
      [-0.00334, 2],
      [-0.00069, 0],
      [-0.00028, 3],
      [-0.00058, 0],
      [-0.00073, 0],
      [-0.00063, 0],
      [-0.00034, 3],
      [-0.00082, 0],
      [-0.00075, 0],
      [-0.00046, 0],
      [-0.00013, 3],
      [0.00142, 1],
      [-0.00025, 3],
      [-0.00087, 0],
      [-0.00019, 3],
      [-0.00079, 0],
      [-0.00022, 3],
      [-0.00026, 3],
      [-0.00018, 3],
      [-0.00017, 3],
      [-0.00072, 0],
      [-0.00033, 3],
      [-0.0004, 3],
      [-0.00023, 3],
      [-0.00055, 0],
      [-0.00066, 0],
      [0.00134, 1],
      [-0.00022, 3],
      [-0.00043, 0],
      [-0.00015, 3]
    ],
    "red_o_points": [],
    "y_categories": ["N", "NOT APPLICABLE", "Y", "nan"],
    "blue_o_points": [],
    "blue_x_points": [
      [0.00284, 1],
      [-3e-5, 3],
      [0.00176, 1],
      [-0.00012, 0],
      [-0.00013, 0],
      [0.00213, 1],
      [-6e-5, 3],
      [0.0019, 1],
      [-0.00022, 3],
      [-3e-5, 3]
    ]
  },
  "QS_lstBpsurgSide": {
    "red_x_points": [
      [-0.0014, 3],
      [-0.00639, 0],
      [-0.00696, 0],
      [-0.00688, 0],
      [-0.00105, 3],
      [-0.00905, 2],
      [-0.00689, 0],
      [-0.008, 0],
      [-0.00142, 3],
      [-0.00815, 0],
      [-0.00841, 2],
      [-0.00778, 2],
      [-0.00119, 3],
      [0.01086, 1],
      [-0.00125, 3],
      [-0.00775, 2],
      [-0.00135, 3],
      [-0.00719, 2],
      [-0.00176, 3],
      [-0.00133, 3],
      [-0.00138, 3],
      [-0.00095, 3],
      [-0.00685, 0],
      [-0.00121, 3],
      [-0.00143, 3],
      [-0.00081, 3],
      [-0.00657, 2],
      [-0.00545, 2],
      [0.01239, 1],
      [-0.0013, 3],
      [-0.00678, 0],
      [-0.00125, 3]
    ],
    "red_o_points": [],
    "y_categories": ["L", "NOT APPLICABLE", "R", "nan"],
    "blue_o_points": [],
    "blue_x_points": [
      [0.01526, 1],
      [9e-5, 3],
      [0.01574, 1],
      [0.00323, 0],
      [0.00012, 2],
      [0.01525, 1],
      [-6e-5, 3],
      [0.01511, 1],
      [-0.00017, 3],
      [3e-5, 3]
    ]
  },
  "QA_lstPexPain[T1]": {
    "red_x_points": [
      [-0.00841, 1],
      [-0.00248, 2],
      [-0.00374, 2],
      [-0.00267, 2],
      [-0.00871, 1],
      [-0.00644, 0],
      [0.00165, 1],
      [0.00113, 1],
      [0.00686, 0],
      [0.00277, 1],
      [-0.00359, 0],
      [-0.00795, 0],
      [0.00699, 0],
      [-0.01428, 2],
      [-0.00522, 2],
      [-0.00369, 2],
      [-0.00499, 2],
      [-0.00257, 2],
      [-0.00504, 2],
      [0.0059, 0],
      [-0.01071, 1],
      [0.00678, 0],
      [-0.00405, 2],
      [-0.00525, 2],
      [-0.00885, 1],
      [-0.0055, 2],
      [-0.00477, 2],
      [-0.00302, 2],
      [-0.00678, 1],
      [-0.01282, 1],
      [0.00051, 1],
      [-0.01029, 1]
    ],
    "red_o_points": [],
    "y_categories": ["NORM", "NPV", "nan"],
    "blue_o_points": [],
    "blue_x_points": [
      [0.00026, 1],
      [-0.00038, 2],
      [0.00728, 0],
      [0.00778, 1],
      [0.01418, 1],
      [-0.0004, 1],
      [0.01164, 0],
      [0.00627, 0],
      [0.01219, 0],
      [0.01496, 0]
    ]
  },
  "QS_mulTransfSite[AcMc]": {
    "red_x_points": [
      [-0.00033, 3],
      [-0.00105, 0],
      [-0.0006, 0],
      [-0.00102, 0],
      [-0.00031, 3],
      [-0.00099, 0],
      [-0.00086, 0],
      [-0.00072, 0],
      [-0.00048, 3],
      [-0.00114, 0],
      [-0.00094, 0],
      [-0.00654, 2],
      [-0.00029, 3],
      [0.00192, 1],
      [-0.00035, 3],
      [-0.00116, 0],
      [-0.0003, 3],
      [-0.00105, 0],
      [-0.00019, 3],
      [-0.00061, 3],
      [-0.00036, 3],
      [-0.00029, 3],
      [-0.00089, 0],
      [-0.00038, 3],
      [-0.00039, 3],
      [-0.00023, 3],
      [-0.00113, 0],
      [-0.00111, 0],
      [0.00295, 1],
      [-0.00031, 3],
      [-0.00102, 0],
      [-0.00025, 3]
    ],
    "red_o_points": [],
    "y_categories": ["N", "NOT APPLICABLE", "Y", "nan"],
    "blue_o_points": [],
    "blue_x_points": [
      [0.00339, 1],
      [-0.00014, 3],
      [0.00234, 1],
      [0.00012, 0],
      [0.00023, 0],
      [0.00303, 1],
      [-0.00017, 3],
      [0.00351, 1],
      [-0.00025, 3],
      [-5e-5, 3]
    ]
  },
  "QA_lstPexKine[Shoulder]": {
    "red_x_points": [
      [-0.00128, 1],
      [-0.00315, 2],
      [-0.00364, 2],
      [-0.00297, 2],
      [-0.00651, 2],
      [-0.00343, 1],
      [-0.00224, 1],
      [0.00587, 0],
      [-0.00962, 2],
      [-0.00203, 1],
      [-0.00287, 1],
      [-0.00354, 1],
      [-0.00167, 1],
      [-0.00138, 2],
      [-0.00542, 2],
      [-0.00143, 1],
      [-0.00543, 2],
      [-0.00322, 2],
      [-0.00539, 2],
      [-0.00224, 1],
      [-0.00143, 1],
      [-0.00274, 1],
      [-0.00326, 2],
      [-0.00488, 2],
      [-0.00191, 1],
      [-0.00787, 2],
      [-0.00632, 2],
      [-0.00396, 2],
      [-0.00174, 2],
      [-0.00539, 2],
      [-0.00092, 1],
      [-0.00531, 2]
    ],
    "red_o_points": [],
    "y_categories": ["NPV", "PV", "nan"],
    "blue_o_points": [],
    "blue_x_points": [
      [-0.00028, 1],
      [-0.00275, 2],
      [-8e-5, 1],
      [0.00079, 1],
      [0.02669, 0],
      [7e-5, 1],
      [0.03955, 0],
      [-0.00066, 2],
      [0.00052, 1],
      [0.00073, 1]
    ]
  },
  "QA_yonInjBpsurg": {
    "red_x_points": [
      [-0.00195, 1],
      [-0.00128, 1],
      [-0.00159, 1],
      [-0.00168, 1],
      [-0.00173, 1],
      [-0.00188, 1],
      [-0.00141, 1],
      [-0.0018, 1],
      [-0.00193, 1],
      [-0.00173, 1],
      [-0.00164, 1],
      [-0.00172, 1],
      [-0.0021, 1],
      [0.00423, 0],
      [-0.00196, 1],
      [-0.00147, 1],
      [-0.00185, 1],
      [-0.00143, 1],
      [-0.00165, 1],
      [-0.00183, 1],
      [-0.00148, 1],
      [-0.00185, 1],
      [-0.00127, 1],
      [-0.00181, 1],
      [-0.00236, 1],
      [-0.00219, 1],
      [-0.0015, 1],
      [-0.00143, 1],
      [0.00399, 0],
      [-0.00149, 1],
      [-0.00129, 1],
      [-0.00169, 1]
    ],
    "red_o_points": [],
    "y_categories": ["N", "Y", "nan"],
    "blue_o_points": [],
    "blue_x_points": [
      [0.00809, 0],
      [-0.0005, 1],
      [0.00669, 0],
      [-0.00132, 1],
      [-0.00124, 1],
      [0.00709, 0],
      [-0.00118, 1],
      [0.00836, 0],
      [-0.00067, 1],
      [-0.00088, 1]
    ]
  },
  "QA_lstPexTouch[C8]": {
    "red_x_points": [
      [-0.006, 1],
      [-0.00264, 2],
      [-0.00332, 1],
      [-0.00226, 2],
      [-0.00677, 1],
      [0.00271, 0],
      [-0.00297, 1],
      [-0.0037, 1],
      [0.00484, 0],
      [-0.00338, 1],
      [0.00317, 0],
      [0.00221, 0],
      [-0.00809, 1],
      [-0.01291, 2],
      [-0.00445, 2],
      [-0.00288, 2],
      [-0.00806, 1],
      [-0.00176, 2],
      [-0.00494, 2],
      [0.00595, 0],
      [-0.008, 1],
      [0.00501, 0],
      [-0.00233, 2],
      [-0.00418, 2],
      [0.00399, 0],
      [0.00642, 0],
      [-0.0025, 1],
      [-0.00224, 2],
      [-0.00652, 1],
      [-0.00422, 2],
      [-0.00256, 1],
      [-0.00863, 1]
    ],
    "red_o_points": [],
    "y_categories": ["NORM", "NPV", "nan"],
    "blue_o_points": [],
    "blue_x_points": [
      [0.01095, 0],
      [-9e-5, 2],
      [0.00018, 1],
      [0.00104, 1],
      [0.00734, 0],
      [-0.00022, 1],
      [0.00796, 0],
      [0.0056, 0],
      [0.00833, 0],
      [0.00894, 0]
    ]
  },
  "QS_mulLysisNerve[Ssr]": {
    "red_x_points": [
      [-0.00018, 3],
      [-0.00056, 0],
      [-0.00318, 2],
      [-0.00066, 0],
      [-0.00022, 3],
      [-0.00062, 0],
      [-0.00048, 0],
      [-0.00051, 0],
      [-0.00024, 3],
      [-0.0004, 0],
      [-0.00054, 0],
      [-0.00037, 0],
      [-0.00021, 3],
      [0.00077, 1],
      [-0.0003, 3],
      [-0.0004, 0],
      [-0.00021, 3],
      [-0.00051, 0],
      [-0.00014, 3],
      [-0.00037, 3],
      [-0.00022, 3],
      [-0.00013, 3],
      [-0.00049, 0],
      [-0.00041, 3],
      [-0.00015, 3],
      [-0.00014, 3],
      [-0.00041, 0],
      [-0.00042, 0],
      [0.0013, 1],
      [-0.00015, 3],
      [-0.00033, 0],
      [-0.00022, 3]
    ],
    "red_o_points": [],
    "y_categories": ["N", "NOT APPLICABLE", "Y", "nan"],
    "blue_o_points": [],
    "blue_x_points": [
      [0.00248, 1],
      [-0.00012, 3],
      [0.00138, 1],
      [0.00022, 0],
      [2e-5, 0],
      [0.00109, 1],
      [-0.00011, 3],
      [0.00212, 1],
      [-0.00015, 3],
      [-0.00014, 3]
    ]
  },
  "QS_mulBpsurgeryType[Graft]": {
    "red_x_points": [
      [-0.00022, 3],
      [-0.00037, 0],
      [-0.0003, 0],
      [-0.00042, 0],
      [-0.00019, 3],
      [-0.00046, 0],
      [-0.00053, 0],
      [-0.0003, 0],
      [-0.00023, 3],
      [-0.00039, 0],
      [-0.00035, 0],
      [-0.00052, 0],
      [-0.00024, 3],
      [0.00121, 1],
      [-9e-5, 3],
      [-0.00206, 2],
      [-0.0002, 3],
      [-0.00028, 0],
      [-0.00021, 3],
      [-0.00028, 3],
      [-0.00026, 3],
      [-0.00029, 3],
      [-0.00042, 0],
      [-0.00021, 3],
      [-0.00028, 3],
      [-0.00024, 3],
      [-0.00027, 0],
      [-0.00044, 0],
      [0.00087, 1],
      [-0.00022, 3],
      [-0.00047, 0],
      [-0.00025, 3]
    ],
    "red_o_points": [],
    "y_categories": ["N", "NOT APPLICABLE", "Y", "nan"],
    "blue_o_points": [],
    "blue_x_points": [
      [0.00178, 1],
      [-6e-5, 3],
      [0.00163, 1],
      [-8e-5, 0],
      [-0.00028, 0],
      [0.00103, 1],
      [-0.00015, 3],
      [0.00135, 1],
      [-4e-5, 3],
      [-0.00013, 3]
    ]
  },
  "QS_mulLysisRoot[C5]": {
    "red_x_points": [
      [-0.00075, 3],
      [-0.00289, 0],
      [-0.00818, 2],
      [-0.00303, 0],
      [-0.00081, 3],
      [-0.00331, 0],
      [-0.0023, 0],
      [-0.00305, 0],
      [-0.00122, 3],
      [-0.00303, 0],
      [-0.00305, 0],
      [-0.00232, 0],
      [-0.00078, 3],
      [0.00672, 1],
      [-0.00098, 3],
      [-0.00313, 0],
      [-0.00124, 3],
      [-0.00287, 0],
      [-0.00102, 3],
      [-0.00078, 3],
      [-0.00084, 3],
      [-0.00067, 3],
      [-0.00239, 0],
      [-0.0012, 3],
      [-0.00138, 3],
      [-0.00091, 3],
      [-0.00274, 0],
      [-0.0026, 0],
      [0.00634, 1],
      [-0.00091, 3],
      [-0.00733, 2],
      [-0.00091, 3]
    ],
    "red_o_points": [],
    "y_categories": ["N", "NOT APPLICABLE", "Y", "nan"],
    "blue_o_points": [],
    "blue_x_points": [
      [0.0093, 1],
      [-0.00013, 3],
      [0.00778, 1],
      [0.00013, 0],
      [-0.00027, 0],
      [0.00792, 1],
      [-0.00029, 3],
      [0.0085, 1],
      [-0.00068, 3],
      [-0.00024, 3]
    ]
  },
  "QS_mulNeuromadSite[C6]": {
    "red_x_points": [
      [-4e-5, 2],
      [-0.00049, 0],
      [-0.00034, 0],
      [-0.00052, 0],
      [-0.00012, 2],
      [-0.00074, 0],
      [-0.00037, 0],
      [-0.0005, 0],
      [-0.00025, 2],
      [-0.00046, 0],
      [-0.00044, 0],
      [-0.00033, 0],
      [-0.0002, 2],
      [0.00073, 1],
      [-0.00011, 2],
      [-0.00061, 0],
      [-0.00011, 2],
      [-0.00041, 0],
      [-0.00023, 2],
      [-0.00011, 2],
      [-6e-5, 2],
      [-0.00023, 2],
      [-0.00026, 0],
      [-0.00015, 2],
      [-0.00029, 2],
      [-0.00011, 2],
      [-0.00053, 0],
      [-0.0004, 0],
      [0.00112, 1],
      [-0.00019, 2],
      [-0.00044, 0],
      [-7e-5, 2]
    ],
    "red_o_points": [],
    "y_categories": ["N", "NOT APPLICABLE", "nan"],
    "blue_o_points": [],
    "blue_x_points": [
      [0.00149, 1],
      [-5e-5, 2],
      [0.00119, 1],
      [6e-5, 0],
      [-0.00014, 0],
      [0.0013, 1],
      [-1e-5, 2],
      [0.00084, 1],
      [-1e-5, 2],
      [-5e-5, 2]
    ]
  },
  "QS_mulNeuromadSite[T1]": {
    "red_x_points": [
      [-0.00018, 2],
      [-0.00086, 0],
      [-0.00084, 0],
      [-0.00113, 0],
      [-0.00036, 2],
      [-0.00142, 0],
      [-0.00084, 0],
      [-0.00111, 0],
      [-0.0003, 2],
      [-0.00102, 0],
      [-0.00121, 0],
      [-0.00098, 0],
      [-0.0002, 2],
      [0.00041, 1],
      [-0.00026, 2],
      [-0.00113, 0],
      [-0.00033, 2],
      [-0.00068, 0],
      [-0.00031, 2],
      [-0.00026, 2],
      [-0.00014, 2],
      [-0.00014, 2],
      [-0.00095, 0],
      [-0.00021, 2],
      [-0.00052, 2],
      [-0.00028, 2],
      [-0.00114, 0],
      [-0.00065, 0],
      [0.0007, 1],
      [-0.00018, 2],
      [-0.00082, 0],
      [-0.00043, 2]
    ],
    "red_o_points": [],
    "y_categories": ["N", "NOT APPLICABLE", "nan"],
    "blue_o_points": [],
    "blue_x_points": [
      [0.00397, 1],
      [0.0, 2],
      [0.00221, 1],
      [0.00056, 0],
      [-0.0004, 0],
      [0.00204, 1],
      [-1e-5, 2],
      [0.003, 1],
      [6e-5, 2],
      [-3e-5, 2]
    ]
  },
  "QA_lstPexTouch[C7]": {
    "red_x_points": [
      [-0.00844, 1],
      [-0.00201, 2],
      [-0.00302, 1],
      [-0.00211, 2],
      [-0.00828, 1],
      [0.00165, 0],
      [-0.00247, 1],
      [-0.00345, 1],
      [0.00621, 0],
      [-0.00228, 1],
      [0.0026, 0],
      [-0.00452, 1],
      [-0.00986, 1],
      [-0.00722, 2],
      [-0.00454, 2],
      [-0.00258, 2],
      [-0.00888, 1],
      [-0.00263, 2],
      [-0.00508, 2],
      [0.00636, 0],
      [-0.00926, 1],
      [0.0061, 0],
      [-0.00279, 2],
      [-0.00474, 2],
      [0.00339, 0],
      [0.00686, 0],
      [-0.00282, 1],
      [-0.00262, 2],
      [-0.00297, 1],
      [-0.00477, 2],
      [-0.00236, 1],
      [-0.00904, 1]
    ],
    "red_o_points": [],
    "y_categories": ["NORM", "NPV", "nan"],
    "blue_o_points": [],
    "blue_x_points": [
      [-7e-5, 1],
      [1e-5, 2],
      [0.00132, 1],
      [0.0016, 1],
      [0.01256, 0],
      [0.00064, 1],
      [0.01047, 0],
      [0.00362, 0],
      [0.00983, 0],
      [0.01132, 0]
    ]
  },
  "QA_lstPexMuscstrength[ShoulderAbduc]": {
    "red_x_points": [
      [-0.003, 1],
      [-0.0026, 1],
      [-0.00256, 1],
      [-0.00278, 1],
      [-0.00301, 1],
      [-0.00324, 1],
      [-0.00263, 1],
      [-0.00283, 1],
      [-0.00313, 1],
      [-0.00276, 1],
      [-0.00302, 1],
      [-0.00281, 1],
      [-0.00348, 1],
      [-3e-5, 2],
      [0.00111, 2],
      [0.00095, 2],
      [0.00111, 2],
      [0.00109, 2],
      [0.00079, 2],
      [-0.00307, 1],
      [-0.00299, 1],
      [-0.00304, 1],
      [-0.00258, 1],
      [0.00114, 2],
      [-0.00401, 1],
      [-0.00294, 1],
      [-0.00281, 1],
      [-0.00271, 1],
      [0.00085, 2],
      [-0.00334, 1],
      [-0.00307, 1],
      [0.001, 2]
    ],
    "red_o_points": [],
    "y_categories": ["GREATER THAN OR EQUALS TO 3", "LESS THAN 3", "nan"],
    "blue_o_points": [],
    "blue_x_points": [
      [0.00109, 2],
      [0.00129, 2],
      [0.01717, 0],
      [0.00193, 2],
      [-0.00261, 1],
      [0.01731, 0],
      [0.00181, 2],
      [-0.00119, 1],
      [-0.00187, 1],
      [-0.00186, 1]
    ]
  },
  "QA_lstPexMuscstrength[ThumbOppo]": {
    "red_x_points": [
      [-0.00665, 1],
      [0.00074, 2],
      [-0.0063, 1],
      [-0.00475, 1],
      [-0.00666, 1],
      [0.0012, 0],
      [0.0011, 0],
      [-0.00649, 1],
      [0.00097, 0],
      [0.00126, 0],
      [0.00133, 0],
      [0.00166, 0],
      [0.00103, 0],
      [0.00068, 2],
      [0.00129, 2],
      [0.00072, 2],
      [0.00067, 0],
      [0.00094, 2],
      [0.00099, 2],
      [0.00075, 0],
      [-0.00723, 1],
      [0.00066, 0],
      [-0.00443, 1],
      [0.00131, 2],
      [0.00116, 2],
      [0.00139, 2],
      [0.00126, 0],
      [-0.00451, 1],
      [0.00083, 2],
      [-0.00786, 1],
      [-0.00569, 1],
      [0.00151, 2]
    ],
    "red_o_points": [],
    "y_categories": ["GREATER THAN OR EQUALS TO 3", "LESS THAN 3", "nan"],
    "blue_o_points": [],
    "blue_x_points": [
      [0.0005, 2],
      [0.00177, 2],
      [0.0014, 0],
      [0.0041, 2],
      [0.003, 0],
      [0.00153, 0],
      [0.00392, 0],
      [0.00147, 0],
      [0.00258, 2],
      [0.00232, 2]
    ]
  },
  "QS_mulNeuromadSite[T2]": {
    "red_x_points": [
      [-9e-5, 2],
      [-0.00159, 0],
      [-0.00171, 0],
      [-0.00209, 0],
      [-0.00015, 2],
      [-0.00218, 0],
      [-0.00129, 0],
      [-0.0019, 0],
      [-0.00028, 2],
      [-0.00218, 0],
      [-0.00215, 0],
      [-0.00149, 0],
      [-0.0006, 2],
      [0.00191, 1],
      [-0.00013, 2],
      [-0.00196, 0],
      [-0.00027, 2],
      [-0.00152, 0],
      [-0.00051, 2],
      [-0.00039, 2],
      [-0.00019, 2],
      [-0.00055, 2],
      [-0.00116, 0],
      [-0.00018, 2],
      [-0.0009, 2],
      [-0.00013, 2],
      [-0.00164, 0],
      [-0.00113, 0],
      [0.00319, 1],
      [-7e-5, 2],
      [-0.00133, 0],
      [-0.00022, 2]
    ],
    "red_o_points": [],
    "y_categories": ["N", "NOT APPLICABLE", "nan"],
    "blue_o_points": [],
    "blue_x_points": [
      [0.00466, 1],
      [7e-5, 2],
      [0.00315, 1],
      [4e-5, 0],
      [-0.00055, 0],
      [0.00426, 1],
      [-0.00018, 2],
      [0.00366, 1],
      [-3e-5, 2],
      [0.00013, 2]
    ]
  },
  "QA_equInjTbpiTime": {
    "red_x_points": [
      [-0.00121, 0],
      [-0.00328, 0],
      [0.00739, 3],
      [-0.00372, 0],
      [-0.00423, 1],
      [-0.00688, 0],
      [-0.00681, 1],
      [-0.00557, 0],
      [-0.00076, 3],
      [-0.00613, 0],
      [-0.00512, 0],
      [0.01121, 3],
      [-0.00146, 0],
      [-0.03852, 2],
      [-0.00059, 3],
      [-0.00445, 0],
      [0.00021, 0],
      [-0.00236, 0],
      [-0.01518, 1],
      [0.00129, 3],
      [-0.00191, 0],
      [-0.00634, 1],
      [-0.00832, 2],
      [-0.0007, 3],
      [-0.01074, 1],
      [-0.01423, 2],
      [-0.00601, 0],
      [-0.00807, 2],
      [0.00116, 0],
      [-0.00024, 0],
      [0.00669, 3],
      [-0.00706, 1]
    ],
    "red_o_points": [],
    "y_categories": [
      "0 TO 6 MONTHS",
      "13 TO 24 MONTHS",
      "25 MONTHS OR MORE",
      "7 TO 12 MONTHS",
      "nan"
    ],
    "blue_o_points": [],
    "blue_x_points": [
      [0.00378, 0],
      [0.00869, 0],
      [0.00399, 0],
      [0.01664, 3],
      [0.01515, 3],
      [0.00462, 0],
      [0.00469, 1],
      [0.01148, 3],
      [0.00857, 3],
      [0.00755, 0]
    ]
  },
  "QS_mulNeuromadSite[C4]": {
    "red_x_points": [
      [-0.00011, 2],
      [-0.00097, 0],
      [-0.00087, 0],
      [-0.00109, 0],
      [-0.00017, 2],
      [-0.00121, 0],
      [-0.00124, 0],
      [-0.00118, 0],
      [-0.00035, 2],
      [-0.00124, 0],
      [-0.0015, 0],
      [-0.00164, 0],
      [-0.00032, 2],
      [0.00141, 1],
      [-0.00021, 2],
      [-0.00105, 0],
      [-0.00026, 2],
      [-0.00106, 0],
      [-0.00036, 2],
      [-0.00025, 2],
      [-0.00015, 2],
      [-0.00034, 2],
      [-0.00114, 0],
      [-0.00016, 2],
      [-0.00039, 2],
      [-0.00026, 2],
      [-0.00114, 0],
      [-0.00089, 0],
      [0.00189, 1],
      [-0.00022, 2],
      [-0.0008, 0],
      [-0.00031, 2]
    ],
    "red_o_points": [],
    "y_categories": ["N", "NOT APPLICABLE", "nan"],
    "blue_o_points": [],
    "blue_x_points": [
      [0.00212, 1],
      [-0.00022, 2],
      [0.00293, 1],
      [0.00031, 0],
      [-0.00043, 0],
      [0.00303, 1],
      [-0.00018, 2],
      [0.00324, 1],
      [-2e-5, 2],
      [0.00016, 2]
    ]
  },
  "QS_mulTransfSite[Oberlin]": {
    "red_x_points": [
      [-0.00253, 3],
      [-0.01666, 0],
      [-0.01844, 0],
      [-0.01595, 0],
      [-0.00298, 3],
      [-0.00294, 2],
      [-0.00169, 2],
      [-0.01639, 0],
      [-0.00293, 3],
      [-0.00296, 2],
      [-0.00337, 2],
      [-0.00171, 2],
      [-0.00289, 3],
      [0.02084, 1],
      [-0.00283, 3],
      [-0.00299, 2],
      [-0.00276, 3],
      [-0.01695, 0],
      [-0.0035, 3],
      [-0.00282, 3],
      [-0.00262, 3],
      [-0.00232, 3],
      [-0.01573, 0],
      [-0.00277, 3],
      [-0.00305, 3],
      [-0.00225, 3],
      [-0.003, 2],
      [-0.01604, 0],
      [0.01903, 1],
      [-0.00244, 3],
      [-0.01719, 0],
      [-0.00233, 3]
    ],
    "red_o_points": [],
    "y_categories": ["N", "NOT APPLICABLE", "Y", "nan"],
    "blue_o_points": [],
    "blue_x_points": [
      [0.02605, 1],
      [-0.00099, 3],
      [0.02231, 1],
      [0.00299, 2],
      [0.00182, 2],
      [0.02141, 1],
      [-0.00119, 3],
      [0.02197, 1],
      [-0.00123, 3],
      [-0.001, 3]
    ]
  },
  "QA_lstPexMuscstrength[ElbowFlex]": {
    "red_x_points": [
      [-0.00259, 1],
      [-0.00204, 2],
      [-0.00337, 1],
      [-0.00302, 1],
      [-0.00271, 1],
      [0.0071, 0],
      [-0.00355, 1],
      [-0.00334, 1],
      [-0.00268, 1],
      [-0.0039, 1],
      [-0.00362, 1],
      [-0.00492, 1],
      [-0.00255, 1],
      [-0.00254, 2],
      [-0.0031, 2],
      [-0.00309, 2],
      [-0.00298, 1],
      [-0.00271, 2],
      [-0.0041, 2],
      [-0.0024, 1],
      [-0.00265, 1],
      [-0.00165, 1],
      [-0.00268, 1],
      [-0.00267, 2],
      [0.00165, 0],
      [-0.00241, 1],
      [-0.00347, 1],
      [-0.0027, 1],
      [-0.00255, 2],
      [-0.00271, 1],
      [-0.00301, 1],
      [-0.00272, 2]
    ],
    "red_o_points": [],
    "y_categories": ["GREATER THAN OR EQUALS TO 3", "LESS THAN 3", "nan"],
    "blue_o_points": [],
    "blue_x_points": [
      [-0.00044, 2],
      [-0.00102, 2],
      [0.00883, 0],
      [-0.00025, 1],
      [0.02126, 0],
      [0.0093, 0],
      [-0.00067, 1],
      [0.01106, 0],
      [-0.00037, 1],
      [-0.00051, 1]
    ]
  },
  "QS_mulGraftNerve[FI]": {
    "red_x_points": [
      [-5e-5, 2],
      [-0.00025, 0],
      [-0.00019, 0],
      [-0.00037, 0],
      [-7e-5, 2],
      [-0.00022, 0],
      [-0.00025, 0],
      [-0.00024, 0],
      [-3e-5, 2],
      [-0.00035, 0],
      [-0.00034, 0],
      [-0.0002, 0],
      [0.0, 2],
      [0.00039, 1],
      [-0.00012, 2],
      [-0.00029, 0],
      [7e-5, 2],
      [-0.00023, 0],
      [-0.00022, 2],
      [1e-5, 2],
      [2e-5, 2],
      [-3e-5, 2],
      [-5e-5, 0],
      [-0.0001, 2],
      [0.0, 2],
      [-3e-5, 2],
      [-0.00022, 0],
      [-0.00024, 0],
      [0.00034, 1],
      [-1e-5, 2],
      [-0.00015, 0],
      [-1e-5, 2]
    ],
    "red_o_points": [],
    "y_categories": ["N", "NOT APPLICABLE", "nan"],
    "blue_o_points": [],
    "blue_x_points": [
      [0.00093, 1],
      [7e-5, 2],
      [0.00043, 1],
      [2e-5, 0],
      [-4e-5, 0],
      [0.00029, 1],
      [1e-5, 2],
      [0.0006, 1],
      [2e-5, 2],
      [4e-5, 2]
    ]
  }
}
