{
  "QS_mulGraftNerve[other]": {
    "red_x_points": [
      [-0.00026, 2],
      [-0.00106, 0],
      [-0.00103, 0],
      [-0.00104, 0],
      [-0.00093, 0],
      [-0.00104, 0],
      [-0.00114, 0],
      [-0.00028, 2],
      [-0.00092, 0],
      [-0.00098, 0],
      [-0.0008, 0],
      [-0.00028, 2],
      [0.00115, 1],
      [-0.00039, 2],
      [-0.00116, 0],
      [-0.00042, 2],
      [-0.00082, 0],
      [-0.00093, 0],
      [-0.00039, 2],
      [-0.00028, 2],
      [-0.00012, 2],
      [-0.00097, 0],
      [-0.00042, 2],
      [-0.00064, 2],
      [-0.00039, 2],
      [-0.00087, 0],
      [-0.00038, 2],
      [-0.00081, 0],
      [-0.00022, 2],
      [0.00189, 1],
      [-0.00108, 0]
    ],
    "red_o_points": [],
    "y_categories": ["N", "NOT APPLICABLE", "nan"],
    "blue_o_points": [],
    "blue_x_points": [
      [0.00545, 1],
      [4e-5, 2],
      [0.00145, 1],
      [0.00027, 0],
      [-3e-5, 2],
      [0.00203, 1],
      [0.0027, 1]
    ]
  },
  "participant_code": {
    "red_x_points": [
      [-0.0258, 1],
      [-0.02524, 2],
      [-0.02701, 3],
      [-0.02468, 4],
      [-0.02599, 5],
      [-0.02529, 6],
      [-0.02533, 7],
      [-0.02547, 8],
      [-0.02529, 9],
      [-0.02473, 10],
      [-0.02622, 11],
      [-0.02436, 12],
      [-0.0251, 14],
      [-0.02617, 16],
      [-0.02636, 17],
      [-0.02631, 19],
      [-0.02496, 20],
      [-0.02566, 22],
      [-0.02594, 23],
      [-0.02613, 25],
      [-0.02547, 26],
      [-0.0251, 27],
      [-0.02599, 28],
      [-0.02608, 29],
      [-0.02599, 30],
      [-0.02454, 32],
      [-0.02552, 33],
      [-0.02482, 34],
      [-0.02585, 35],
      [-0.02557, 36],
      [-0.02496, 37]
    ],
    "red_o_points": [],
    "y_categories": [
      "P16554",
      "P18297",
      "P19283",
      "P19287",
      "P23391",
      "P31645",
      "P31691",
      "P34778",
      "P35046",
      "P36328",
      "P43633",
      "P4544",
      "P46417",
      "P48965",
      "P53068",
      "P5497",
      "P59529",
      "P62483",
      "P64658",
      "P65202",
      "P66816",
      "P6751",
      "P7408",
      "P75566",
      "P76226",
      "P79971",
      "P82621",
      "P82990",
      "P84932",
      "P85825",
      "P86989",
      "P8770",
      "P87791",
      "P90550",
      "P93159",
      "P94969",
      "P96710",
      "P9744",
      "nan"
    ],
    "blue_o_points": [],
    "blue_x_points": [
      [0.07267, 0],
      [0.07726, 13],
      [0.07466, 15],
      [0.0742, 18],
      [0.07742, 21],
      [0.07588, 24],
      [0.07558, 31]
    ]
  },
  "QS_mulLysisTrunk[Upper]": {
    "red_x_points": [
      [-0.00136, 3],
      [-0.0025, 0],
      [-0.00233, 0],
      [-0.00255, 0],
      [-0.00225, 0],
      [-0.00427, 2],
      [-0.0023, 0],
      [-0.00132, 3],
      [-0.0024, 0],
      [-0.00245, 0],
      [-0.00232, 0],
      [-0.00111, 3],
      [0.00586, 1],
      [-0.00138, 3],
      [-0.00205, 0],
      [-0.00124, 3],
      [-0.00411, 2],
      [-0.00237, 0],
      [-0.00108, 3],
      [-0.00126, 3],
      [-0.0011, 3],
      [-0.00226, 0],
      [-0.00135, 3],
      [-0.00121, 3],
      [-0.0013, 3],
      [-0.00227, 0],
      [-0.00142, 3],
      [-0.00222, 0],
      [-0.00104, 3],
      [0.00613, 1],
      [-0.00414, 2]
    ],
    "red_o_points": [],
    "y_categories": ["N", "NOT APPLICABLE", "Y", "nan"],
    "blue_o_points": [],
    "blue_x_points": [
      [0.01093, 1],
      [-0.00064, 3],
      [0.00716, 1],
      [-0.00124, 0],
      [-0.00047, 3],
      [0.00733, 1],
      [0.00682, 1]
    ]
  },
  "QS_mulNeuromadSite[C5]": {
    "red_x_points": [
      [-0.00123, 2],
      [-0.00336, 0],
      [-0.00338, 0],
      [-0.00357, 0],
      [-0.00311, 0],
      [-0.00316, 0],
      [-0.00327, 0],
      [-0.00107, 2],
      [-0.00337, 0],
      [-0.00333, 0],
      [-0.00338, 0],
      [-0.00112, 2],
      [0.00557, 1],
      [-0.00106, 2],
      [-0.00371, 0],
      [-0.00118, 2],
      [-0.00332, 0],
      [-0.0033, 0],
      [-0.00122, 2],
      [-0.00097, 2],
      [-0.00068, 2],
      [-0.00266, 0],
      [-0.00107, 2],
      [-0.00128, 2],
      [-0.00144, 2],
      [-0.00308, 0],
      [-0.00127, 2],
      [-0.00295, 0],
      [-0.00093, 2],
      [0.00717, 1],
      [-0.00306, 0]
    ],
    "red_o_points": [],
    "y_categories": ["N", "NOT APPLICABLE", "nan"],
    "blue_o_points": [],
    "blue_x_points": [
      [0.01349, 1],
      [-0.00017, 2],
      [0.00596, 1],
      [-5e-5, 0],
      [-0.00011, 2],
      [0.00631, 1],
      [0.00862, 1]
    ]
  },
  "QS_mulNeuromadSite[C7]": {
    "red_x_points": [
      [-0.00077, 2],
      [-0.00211, 0],
      [-0.00203, 0],
      [-0.00195, 0],
      [-0.00198, 0],
      [-0.00199, 0],
      [-0.00192, 0],
      [-0.00054, 2],
      [-0.00191, 0],
      [-0.00207, 0],
      [-0.00204, 0],
      [-0.00059, 2],
      [0.00211, 1],
      [-0.00054, 2],
      [-0.00173, 0],
      [-0.00077, 2],
      [-0.00139, 0],
      [-0.00212, 0],
      [-0.00055, 2],
      [-0.00054, 2],
      [-0.00045, 2],
      [-0.00168, 0],
      [-0.00063, 2],
      [-0.00088, 2],
      [-0.00063, 2],
      [-0.00175, 0],
      [-0.0006, 2],
      [-0.00188, 0],
      [-0.0003, 2],
      [0.0031, 1],
      [-0.00186, 0]
    ],
    "red_o_points": [],
    "y_categories": ["N", "NOT APPLICABLE", "nan"],
    "blue_o_points": [],
    "blue_x_points": [
      [0.00868, 1],
      [3e-5, 2],
      [0.003, 1],
      [0.00039, 0],
      [0.00017, 2],
      [0.00393, 1],
      [0.0046, 1]
    ]
  },
  "QS_mulTransfSite[IMc]": {
    "red_x_points": [
      [-0.00287, 3],
      [-0.00718, 2],
      [-0.00431, 0],
      [-0.00396, 0],
      [-0.00426, 0],
      [-0.00388, 0],
      [-0.0039, 0],
      [-0.00271, 3],
      [-0.00427, 0],
      [-0.00403, 0],
      [-0.00404, 0],
      [-0.00271, 3],
      [0.01176, 1],
      [-0.00261, 3],
      [-0.0038, 0],
      [-0.00277, 3],
      [-0.00763, 2],
      [-0.00363, 0],
      [-0.0026, 3],
      [-0.00261, 3],
      [-0.00244, 3],
      [-0.00384, 0],
      [-0.0027, 3],
      [-0.00272, 3],
      [-0.00294, 3],
      [-0.00395, 0],
      [-0.00281, 3],
      [-0.00707, 2],
      [-0.00215, 3],
      [0.01278, 1],
      [-0.00708, 2]
    ],
    "red_o_points": [],
    "y_categories": ["N", "NOT APPLICABLE", "Y", "nan"],
    "blue_o_points": [],
    "blue_x_points": [
      [0.02158, 1],
      [-0.00118, 3],
      [0.01257, 1],
      [-0.00166, 0],
      [-0.00087, 3],
      [0.01285, 1],
      [0.01363, 1]
    ]
  },
  "QS_mulGraftNerve[Ul]": {
    "red_x_points": [[-0.0001, 1], [0.0, 2]],
    "red_o_points": [],
    "y_categories": ["N", "NOT APPLICABLE", "nan"],
    "blue_o_points": [],
    "blue_x_points": [[0.0001, 0], [0.0, 2]]
  },
  "QA_mulInjOrthesisType[ShoulderSupport]": {
    "red_x_points": [
      [-0.01824, 0],
      [-0.01655, 0],
      [-0.0157, 0],
      [-0.0172, 0],
      [-0.01623, 0],
      [-0.01687, 0],
      [-0.0168, 0],
      [-0.02015, 2],
      [-0.01717, 0],
      [-0.0155, 0],
      [-0.01647, 0],
      [-0.01767, 0],
      [0.04334, 1],
      [-0.01708, 0],
      [-0.01696, 0],
      [-0.01739, 0],
      [-0.02007, 2],
      [-0.01643, 0],
      [-0.01763, 0],
      [-0.01776, 0],
      [-0.02048, 2],
      [-0.01967, 3],
      [-0.01694, 0],
      [0.04735, 1],
      [-0.01742, 0],
      [-0.01648, 0],
      [-0.01783, 0],
      [-0.01645, 0],
      [-0.02049, 3],
      [-0.02843, 3],
      [-0.01606, 0]
    ],
    "red_o_points": [],
    "y_categories": ["N", "NOT APPLICABLE", "Y", "nan"],
    "blue_o_points": [],
    "blue_x_points": [
      [-0.00686, 0],
      [0.05041, 1],
      [0.04397, 1],
      [0.05195, 1],
      [0.04912, 1],
      [0.0425, 1],
      [0.0423, 1]
    ]
  },
  "QA_mulInjOrthesisType[ArmSling]": {
    "red_x_points": [
      [-0.01496, 2],
      [-0.01414, 2],
      [-0.01464, 2],
      [-0.0147, 2],
      [-0.01441, 2],
      [-0.01466, 2],
      [-0.01466, 2],
      [-0.01547, 2],
      [-0.01457, 2],
      [-0.01376, 2],
      [-0.01433, 2],
      [-0.01535, 2],
      [0.04149, 1],
      [-0.01595, 2],
      [-0.01416, 2],
      [-0.01548, 2],
      [-0.01756, 0],
      [-0.01508, 2],
      [-0.0158, 2],
      [-0.01517, 2],
      [-0.01791, 0],
      [-0.01644, 3],
      [-0.01594, 2],
      [0.04226, 1],
      [-0.01556, 2],
      [-0.01502, 2],
      [-0.01504, 2],
      [-0.0151, 2],
      [-0.01863, 3],
      [-0.02548, 3],
      [-0.01424, 2]
    ],
    "red_o_points": [],
    "y_categories": ["N", "NOT APPLICABLE", "Y", "nan"],
    "blue_o_points": [],
    "blue_x_points": [
      [-0.00692, 2],
      [0.04259, 1],
      [0.03761, 1],
      [0.04634, 1],
      [0.04402, 1],
      [0.03714, 1],
      [0.03837, 1]
    ]
  },
  "QS_mulGraftNerve[Ac]": {
    "red_x_points": [
      [-0.00016, 2],
      [-0.00046, 0],
      [-0.00032, 0],
      [-0.00033, 0],
      [-0.00026, 0],
      [-0.0003, 0],
      [-0.00035, 0],
      [-0.00012, 2],
      [-0.00029, 0],
      [-0.00029, 0],
      [-0.00034, 0],
      [-0.00013, 2],
      [0.00011, 1],
      [-0.00022, 2],
      [-0.00038, 0],
      [-0.00021, 2],
      [-0.00025, 0],
      [-0.00041, 0],
      [-0.0002, 2],
      [-0.00023, 2],
      [-9e-5, 2],
      [-0.00034, 0],
      [-0.00015, 2],
      [-0.00014, 2],
      [-0.00016, 2],
      [-0.00041, 0],
      [-0.00021, 2],
      [-0.00031, 0],
      [-0.00014, 2],
      [0.00055, 1],
      [-0.00043, 0]
    ],
    "red_o_points": [],
    "y_categories": ["N", "NOT APPLICABLE", "nan"],
    "blue_o_points": [],
    "blue_x_points": [
      [0.00256, 1],
      [1e-5, 2],
      [0.00069, 1],
      [0.0002, 0],
      [-8e-5, 2],
      [0.00078, 1],
      [0.00064, 1]
    ]
  },
  "QS_mulNeuromadSite[C8]": {
    "red_x_points": [
      [-0.00156, 2],
      [-0.00433, 0],
      [-0.0048, 0],
      [-0.0046, 0],
      [-0.00443, 0],
      [-0.00445, 0],
      [-0.00494, 0],
      [-0.00141, 2],
      [-0.00463, 0],
      [-0.00491, 0],
      [-0.0041, 0],
      [-0.00153, 2],
      [0.00594, 1],
      [-0.00202, 2],
      [-0.0047, 0],
      [-0.00189, 2],
      [-0.00338, 0],
      [-0.00439, 0],
      [-0.00172, 2],
      [-0.0015, 2],
      [-0.00127, 2],
      [-0.00419, 0],
      [-0.00206, 2],
      [-0.00135, 2],
      [-0.00177, 2],
      [-0.00404, 0],
      [-0.00142, 2],
      [-0.00478, 0],
      [-0.00154, 2],
      [0.00879, 1],
      [-0.00456, 0]
    ],
    "red_o_points": [],
    "y_categories": ["N", "NOT APPLICABLE", "nan"],
    "blue_o_points": [],
    "blue_x_points": [
      [0.02019, 1],
      [-1e-5, 2],
      [0.00925, 1],
      [0.00081, 0],
      [-0.00028, 2],
      [0.00937, 1],
      [0.01212, 1]
    ]
  },
  "QS_mulGraftNerve[Ph]": {
    "red_x_points": [
      [-3e-5, 2],
      [-0.0001, 0],
      [-9e-5, 0],
      [-9e-5, 0],
      [-0.0001, 0],
      [-5e-5, 0],
      [-0.0001, 0],
      [-7e-5, 2],
      [-9e-5, 0],
      [-0.00012, 0],
      [-0.0001, 0],
      [-4e-5, 2],
      [-0.00023, 1],
      [-7e-5, 2],
      [-0.00014, 0],
      [-9e-5, 2],
      [-8e-5, 0],
      [-6e-5, 0],
      [-2e-5, 2],
      [-3e-5, 2],
      [-1e-5, 2],
      [-8e-5, 0],
      [-3e-5, 2],
      [-1e-5, 2],
      [-7e-5, 2],
      [-9e-5, 0],
      [-4e-5, 2],
      [-5e-5, 0],
      [0.00031, 1],
      [-9e-5, 0]
    ],
    "red_o_points": [],
    "y_categories": ["N", "NOT APPLICABLE", "nan"],
    "blue_o_points": [],
    "blue_x_points": [
      [0.00069, 1],
      [2e-5, 2],
      [4e-5, 0],
      [6e-5, 2],
      [0.00021, 1],
      [0.0002, 1]
    ]
  },
  "QS_mulTransfSite[AcSsPA]": {
    "red_x_points": [
      [-0.00033, 3],
      [-0.00035, 0],
      [-0.00042, 0],
      [-0.00048, 0],
      [-0.00041, 0],
      [-0.00047, 0],
      [-0.00038, 0],
      [-0.00033, 3],
      [-0.00048, 0],
      [-0.00047, 0],
      [-0.00043, 0],
      [-0.00037, 3],
      [0.00155, 1],
      [-0.00029, 3],
      [-0.00029, 0],
      [-0.00043, 3],
      [-0.00178, 2],
      [-0.00046, 0],
      [-0.00035, 3],
      [-0.00028, 3],
      [-0.00037, 3],
      [-0.00047, 0],
      [-0.00031, 3],
      [-0.00026, 3],
      [-0.00034, 3],
      [-0.00038, 0],
      [-0.00034, 3],
      [-0.00045, 0],
      [-0.00026, 3],
      [0.00113, 1],
      [-0.00029, 0]
    ],
    "red_o_points": [],
    "y_categories": ["N", "NOT APPLICABLE", "Y", "nan"],
    "blue_o_points": [],
    "blue_x_points": [
      [0.0015, 1],
      [-0.00026, 3],
      [0.00152, 1],
      [-3e-5, 0],
      [-0.00012, 3],
      [0.00149, 1],
      [0.00146, 1]
    ]
  },
  "QA_yonInjBpsurg": {
    "red_x_points": [
      [-0.00508, 1],
      [-0.00423, 1],
      [-0.00466, 1],
      [-0.00491, 1],
      [-0.00452, 1],
      [-0.00466, 1],
      [-0.00489, 1],
      [-0.0047, 1],
      [-0.00532, 1],
      [-0.00462, 1],
      [-0.00439, 1],
      [-0.00489, 1],
      [0.00832, 0],
      [-0.00502, 1],
      [-0.00481, 1],
      [-0.00508, 1],
      [-0.00384, 1],
      [-0.0043, 1],
      [-0.00496, 1],
      [-0.00462, 1],
      [-0.0036, 1],
      [-0.00364, 1],
      [-0.00499, 1],
      [-0.00475, 1],
      [-0.00571, 1],
      [-0.00453, 1],
      [-0.00437, 1],
      [-0.00444, 1],
      [-0.00441, 1],
      [0.01339, 0],
      [-0.00452, 1]
    ],
    "red_o_points": [],
    "y_categories": ["N", "Y", "nan"],
    "blue_o_points": [],
    "blue_x_points": [
      [0.03096, 0],
      [-0.00087, 1],
      [0.01352, 0],
      [-0.00308, 1],
      [-0.00145, 1],
      [0.01388, 0],
      [0.01848, 0]
    ]
  },
  "QS_mulNeuromadSite[T1]": {
    "red_x_points": [
      [-0.00191, 2],
      [-0.0048, 0],
      [-0.00524, 0],
      [-0.00475, 0],
      [-0.00481, 0],
      [-0.00482, 0],
      [-0.00506, 0],
      [-0.00167, 2],
      [-0.00471, 0],
      [-0.00489, 0],
      [-0.00469, 0],
      [-0.00186, 2],
      [0.00804, 1],
      [-0.00182, 2],
      [-0.00496, 0],
      [-0.00175, 2],
      [-0.00418, 0],
      [-0.00523, 0],
      [-0.00168, 2],
      [-0.00187, 2],
      [-0.00149, 2],
      [-0.00478, 0],
      [-0.00206, 2],
      [-0.00161, 2],
      [-0.00213, 2],
      [-0.00495, 0],
      [-0.00181, 2],
      [-0.0051, 0],
      [-0.00143, 2],
      [0.00949, 1],
      [-0.00502, 0]
    ],
    "red_o_points": [],
    "y_categories": ["N", "NOT APPLICABLE", "nan"],
    "blue_o_points": [],
    "blue_x_points": [
      [0.02003, 1],
      [-0.0002, 2],
      [0.00971, 1],
      [0.00056, 0],
      [-0.00024, 2],
      [0.01106, 1],
      [0.01336, 1]
    ]
  },
  "QS_mulTransfSite[AcSsAA]": {
    "red_x_points": [
      [-0.00343, 3],
      [-0.00817, 2],
      [-0.00328, 0],
      [-0.00796, 2],
      [-0.00904, 2],
      [-0.00318, 0],
      [-0.00325, 0],
      [-0.0031, 3],
      [-0.00317, 0],
      [-0.0082, 2],
      [-0.00321, 0],
      [-0.00334, 3],
      [0.01271, 1],
      [-0.00316, 3],
      [-0.00956, 2],
      [-0.00293, 3],
      [-0.00288, 0],
      [-0.00323, 0],
      [-0.00342, 3],
      [-0.00325, 3],
      [-0.00307, 3],
      [-0.00823, 2],
      [-0.00323, 3],
      [-0.00315, 3],
      [-0.00324, 3],
      [-0.00313, 0],
      [-0.0034, 3],
      [-0.00823, 2],
      [-0.00313, 3],
      [0.01455, 1],
      [-0.00301, 0]
    ],
    "red_o_points": [],
    "y_categories": ["N", "NOT APPLICABLE", "Y", "nan"],
    "blue_o_points": [],
    "blue_x_points": [
      [0.02102, 1],
      [-0.00131, 3],
      [0.01531, 1],
      [0.00019, 0],
      [-0.00137, 3],
      [0.01596, 1],
      [0.01686, 1]
    ]
  },
  "QS_mulLysisRoot[C5]": {
    "red_x_points": [
      [-0.00078, 3],
      [-0.00125, 0],
      [-0.00211, 2],
      [-0.00112, 0],
      [-0.00097, 0],
      [-0.00104, 0],
      [-0.00103, 0],
      [-0.00072, 3],
      [-0.00095, 0],
      [-0.00102, 0],
      [-0.00108, 0],
      [-0.00056, 3],
      [0.00406, 1],
      [-0.00058, 3],
      [-0.00106, 0],
      [-0.00047, 3],
      [-0.00124, 0],
      [-0.001, 0],
      [-0.00046, 3],
      [-0.00072, 3],
      [-0.00057, 3],
      [-0.00092, 0],
      [-0.00071, 3],
      [-0.00071, 3],
      [-0.00079, 3],
      [-0.00099, 0],
      [-0.00069, 3],
      [-0.00111, 0],
      [-0.00068, 3],
      [0.00319, 1],
      [-0.00239, 2]
    ],
    "red_o_points": [],
    "y_categories": ["N", "NOT APPLICABLE", "Y", "nan"],
    "blue_o_points": [],
    "blue_x_points": [
      [0.00479, 1],
      [-0.00039, 3],
      [0.00372, 1],
      [-0.00131, 0],
      [-0.00047, 3],
      [0.0038, 1],
      [0.00404, 1]
    ]
  },
  "QS_mulNeuromadSite[C6]": {
    "red_x_points": [
      [-0.00026, 2],
      [-0.00103, 0],
      [-0.00094, 0],
      [-0.00106, 0],
      [-0.00116, 0],
      [-0.00095, 0],
      [-0.0008, 0],
      [-0.0002, 2],
      [-0.00101, 0],
      [-0.00122, 0],
      [-0.00105, 0],
      [-0.00018, 2],
      [0.00136, 1],
      [-0.00028, 2],
      [-0.00127, 0],
      [-0.00035, 2],
      [-0.00074, 0],
      [-0.00101, 0],
      [-0.00024, 2],
      [-0.00028, 2],
      [-0.00011, 2],
      [-0.00097, 0],
      [-0.0004, 2],
      [-0.00041, 2],
      [-0.00021, 2],
      [-0.00074, 0],
      [-0.00026, 2],
      [-0.001, 0],
      [-0.00014, 2],
      [0.00166, 1],
      [-0.00102, 0]
    ],
    "red_o_points": [],
    "y_categories": ["N", "NOT APPLICABLE", "nan"],
    "blue_o_points": [],
    "blue_x_points": [
      [0.00496, 1],
      [6e-5, 2],
      [0.00171, 1],
      [0.00016, 0],
      [-7e-5, 2],
      [0.00167, 1],
      [0.00221, 1]
    ]
  },
  "QS_lstBpsurgSide": {
    "red_x_points": [
      [-0.00505, 3],
      [-0.00786, 0],
      [-0.00821, 0],
      [-0.00768, 0],
      [-0.01596, 2],
      [-0.0078, 0],
      [-0.00804, 0],
      [-0.00504, 3],
      [-0.00829, 0],
      [-0.01503, 2],
      [-0.015, 2],
      [-0.0048, 3],
      [0.02465, 1],
      [-0.00527, 3],
      [-0.01727, 2],
      [-0.00548, 3],
      [-0.01654, 2],
      [-0.01672, 2],
      [-0.00513, 3],
      [-0.00494, 3],
      [-0.00449, 3],
      [-0.00785, 0],
      [-0.00564, 3],
      [-0.00459, 3],
      [-0.00526, 3],
      [-0.01518, 2],
      [-0.00534, 3],
      [-0.01477, 2],
      [-0.00465, 3],
      [0.02575, 1],
      [-0.00747, 0]
    ],
    "red_o_points": [],
    "y_categories": ["L", "NOT APPLICABLE", "R", "nan"],
    "blue_o_points": [],
    "blue_x_points": [
      [0.04106, 1],
      [-0.00213, 3],
      [0.02983, 1],
      [0.00326, 0],
      [-0.00169, 3],
      [0.03043, 1],
      [0.03317, 1]
    ]
  },
  "QS_mulBpsurgeryType[Lysis]": {
    "red_x_points": [
      [-0.00269, 3],
      [-0.00475, 0],
      [-0.00839, 2],
      [-0.00489, 0],
      [-0.00511, 0],
      [-0.00815, 2],
      [-0.00527, 0],
      [-0.00251, 3],
      [-0.00505, 0],
      [-0.0049, 0],
      [-0.00493, 0],
      [-0.0025, 3],
      [0.01297, 1],
      [-0.00285, 3],
      [-0.00452, 0],
      [-0.00307, 3],
      [-0.00852, 2],
      [-0.00486, 0],
      [-0.00263, 3],
      [-0.00238, 3],
      [-0.00216, 3],
      [-0.00446, 0],
      [-0.00288, 3],
      [-0.00251, 3],
      [-0.00245, 3],
      [-0.00452, 0],
      [-0.00262, 3],
      [-0.00485, 0],
      [-0.00233, 3],
      [0.01391, 1],
      [-0.00722, 2]
    ],
    "red_o_points": [],
    "y_categories": ["N", "NOT APPLICABLE", "Y", "nan"],
    "blue_o_points": [],
    "blue_x_points": [
      [0.02199, 1],
      [-0.0011, 3],
      [0.01372, 1],
      [-0.00099, 0],
      [-0.00061, 3],
      [0.01327, 1],
      [0.01624, 1]
    ]
  },
  "QA_yonInjUnconscio": {
    "red_x_points": [
      [-0.00446, 1],
      [-0.00467, 1],
      [-0.00256, 2],
      [-0.00253, 2],
      [0.00706, 0],
      [-0.00536, 1],
      [-0.00283, 2],
      [-0.00456, 2],
      [-0.00307, 2],
      [-0.00162, 2],
      [-0.00365, 1],
      [-0.00414, 1],
      [-0.03209, 1],
      [-0.00587, 2],
      [-0.00218, 2],
      [-0.00534, 2],
      [-0.00448, 1],
      [0.00757, 0],
      [-0.00488, 1],
      [-0.004, 1],
      [-0.00379, 1],
      [-0.0045, 1],
      [-0.00539, 2],
      [-0.01098, 1],
      [-0.00389, 2],
      [-0.00403, 1],
      [0.00987, 0],
      [-0.00352, 1],
      [-0.00485, 2],
      [-0.00084, 2],
      [-0.00478, 1]
    ],
    "red_o_points": [],
    "y_categories": ["N", "Y", "nan"],
    "blue_o_points": [],
    "blue_x_points": [
      [0.00131, 2],
      [-0.00278, 1],
      [0.01778, 0],
      [0.02474, 0],
      [0.02505, 0],
      [0.00358, 2],
      [0.00383, 2]
    ]
  },
  "QS_mulTransfSite[Oberlin]": {
    "red_x_points": [
      [-0.00504, 3],
      [-0.01433, 0],
      [-0.01395, 0],
      [-0.01433, 0],
      [-0.00632, 2],
      [-0.00619, 2],
      [-0.01361, 0],
      [-0.00458, 3],
      [-0.00628, 2],
      [-0.00666, 2],
      [-0.00673, 2],
      [-0.00513, 3],
      [0.02314, 1],
      [-0.00509, 3],
      [-0.00668, 2],
      [-0.00533, 3],
      [-0.01477, 0],
      [-0.00601, 2],
      [-0.00487, 3],
      [-0.0048, 3],
      [-0.00453, 3],
      [-0.01433, 0],
      [-0.00504, 3],
      [-0.00468, 3],
      [-0.0053, 3],
      [-0.00626, 2],
      [-0.00503, 3],
      [-0.01418, 0],
      [-0.00445, 3],
      [0.0251, 1],
      [-0.0142, 0]
    ],
    "red_o_points": [],
    "y_categories": ["N", "NOT APPLICABLE", "Y", "nan"],
    "blue_o_points": [],
    "blue_x_points": [
      [0.03624, 1],
      [-0.00183, 3],
      [0.02734, 1],
      [0.00079, 2],
      [-0.00162, 3],
      [0.02573, 1],
      [0.02969, 1]
    ]
  },
  "QA_lstPexMuscstrength[ShoulderAbduc]": {
    "red_x_points": [
      [-0.00852, 1],
      [-0.00759, 1],
      [-0.00827, 1],
      [-0.00869, 1],
      [-0.00893, 1],
      [-0.00858, 1],
      [-0.0091, 1],
      [-0.00816, 1],
      [-0.00886, 1],
      [-0.00824, 1],
      [-0.00887, 1],
      [-0.00898, 1],
      [0.00274, 2],
      [0.00675, 2],
      [0.00683, 2],
      [0.00711, 2],
      [0.00642, 2],
      [-0.00874, 1],
      [-0.00877, 1],
      [-0.00849, 1],
      [-0.00836, 1],
      [-0.00836, 1],
      [0.00718, 2],
      [-0.01282, 1],
      [-0.00893, 1],
      [-0.00817, 1],
      [-0.00885, 1],
      [-0.00812, 1],
      [-0.00843, 1],
      [0.00323, 2],
      [-0.00811, 1]
    ],
    "red_o_points": [],
    "y_categories": ["GREATER THAN OR EQUALS TO 3", "LESS THAN 3", "nan"],
    "blue_o_points": [],
    "blue_x_points": [
      [0.00459, 2],
      [0.00686, 2],
      [0.03867, 0],
      [0.00847, 2],
      [0.00705, 2],
      [0.03589, 0],
      [-0.00231, 1]
    ]
  },
  "QS_mulGraftNerve[Me]": {
    "red_x_points": [[-0.00015, 1]],
    "red_o_points": [],
    "y_categories": ["N", "NOT APPLICABLE", "nan"],
    "blue_o_points": [],
    "blue_x_points": [[5e-5, 0], [5e-5, 2]]
  },
  "QS_mulNeuromadSite[T2]": {
    "red_x_points": [
      [-0.00267, 2],
      [-0.00613, 0],
      [-0.00681, 0],
      [-0.00628, 0],
      [-0.00737, 0],
      [-0.00703, 0],
      [-0.00726, 0],
      [-0.00241, 2],
      [-0.00733, 0],
      [-0.00718, 0],
      [-0.00707, 0],
      [-0.00258, 2],
      [0.01068, 1],
      [-0.00277, 2],
      [-0.00706, 0],
      [-0.00282, 2],
      [-0.00575, 0],
      [-0.00661, 0],
      [-0.00246, 2],
      [-0.00238, 2],
      [-0.00188, 2],
      [-0.00622, 0],
      [-0.00286, 2],
      [-0.0026, 2],
      [-0.00252, 2],
      [-0.00708, 0],
      [-0.00271, 2],
      [-0.00745, 0],
      [-0.00191, 2],
      [0.0138, 1],
      [-0.00676, 0]
    ],
    "red_o_points": [],
    "y_categories": ["N", "NOT APPLICABLE", "nan"],
    "blue_o_points": [],
    "blue_x_points": [
      [0.02978, 1],
      [-0.00068, 2],
      [0.01483, 1],
      [0.00071, 0],
      [-0.00067, 2],
      [0.01346, 1],
      [0.01734, 1]
    ]
  },
  "QS_mulLysisSite[Trunk]": {
    "red_x_points": [
      [-0.00114, 3],
      [-0.00166, 0],
      [-0.00178, 0],
      [-0.00169, 0],
      [-0.00149, 0],
      [-0.00345, 2],
      [-0.00184, 0],
      [-0.00123, 3],
      [-0.00148, 0],
      [-0.00156, 0],
      [-0.00164, 0],
      [-0.00128, 3],
      [0.00568, 1],
      [-0.00136, 3],
      [-0.00122, 0],
      [-0.00135, 3],
      [-0.00419, 2],
      [-0.00174, 0],
      [-0.00135, 3],
      [-0.00125, 3],
      [-0.00123, 3],
      [-0.00132, 0],
      [-0.00122, 3],
      [-0.00121, 3],
      [-0.00148, 3],
      [-0.00171, 0],
      [-0.00113, 3],
      [-0.00157, 0],
      [-0.00103, 3],
      [0.00507, 1],
      [-0.00286, 2]
    ],
    "red_o_points": [],
    "y_categories": ["N", "NOT APPLICABLE", "Y", "nan"],
    "blue_o_points": [],
    "blue_x_points": [
      [0.00793, 1],
      [-0.00043, 3],
      [0.00597, 1],
      [-0.00062, 0],
      [-0.00068, 3],
      [0.00531, 1],
      [0.00622, 1]
    ]
  },
  "QS_mulNeuromadSite[C4]": {
    "red_x_points": [
      [-0.00032, 2],
      [-0.00085, 0],
      [-0.00116, 0],
      [-0.00124, 0],
      [-0.00123, 0],
      [-0.00118, 0],
      [-0.00102, 0],
      [-0.00043, 2],
      [-0.00088, 0],
      [-0.00132, 0],
      [-0.0009, 0],
      [-0.00036, 2],
      [0.00144, 1],
      [-0.00049, 2],
      [-0.00141, 0],
      [-0.00043, 2],
      [-0.00088, 0],
      [-0.00105, 0],
      [-0.00037, 2],
      [-0.00029, 2],
      [-0.00027, 2],
      [-0.00078, 0],
      [-0.00058, 2],
      [-0.00021, 2],
      [-0.00054, 2],
      [-0.00107, 0],
      [-0.00041, 2],
      [-0.00116, 0],
      [-0.00042, 2],
      [0.00229, 1],
      [-0.001, 0]
    ],
    "red_o_points": [],
    "y_categories": ["N", "NOT APPLICABLE", "nan"],
    "blue_o_points": [],
    "blue_x_points": [
      [0.00499, 1],
      [-4e-5, 2],
      [0.00243, 1],
      [0.00028, 0],
      [-0.00015, 2],
      [0.00254, 1],
      [0.00337, 1]
    ]
  },
  "QS_mulGraftTrunk[UpperTrunk]": {
    "red_x_points": [
      [-0.00032, 3],
      [-0.00062, 0],
      [-0.00063, 0],
      [-0.00054, 0],
      [-0.00065, 0],
      [-0.00045, 0],
      [-0.00056, 0],
      [-0.00032, 3],
      [-0.00067, 0],
      [-0.00052, 0],
      [-0.00065, 0],
      [-0.0003, 3],
      [0.00166, 1],
      [-0.00047, 3],
      [-0.00287, 2],
      [-0.0004, 3],
      [-0.00053, 0],
      [-0.00052, 0],
      [-0.00042, 3],
      [-0.00037, 3],
      [-0.00025, 3],
      [-0.00057, 0],
      [-0.00029, 3],
      [-0.00037, 3],
      [-0.0004, 3],
      [-0.00054, 0],
      [-0.00036, 3],
      [-0.00049, 0],
      [-0.00027, 3],
      [0.00176, 1],
      [-0.00053, 0]
    ],
    "red_o_points": [],
    "y_categories": ["N", "NOT APPLICABLE", "Y", "nan"],
    "blue_o_points": [],
    "blue_x_points": [
      [0.00226, 1],
      [-0.00015, 3],
      [0.00123, 1],
      [0.00059, 0],
      [-1e-5, 3],
      [0.00225, 1],
      [0.00234, 1]
    ]
  },
  "QS_mulTransfSite[PhMc]": {
    "red_x_points": [
      [-0.00105, 3],
      [-0.00135, 0],
      [-0.00155, 0],
      [-0.0014, 0],
      [-0.00147, 0],
      [-0.00141, 0],
      [-0.00351, 2],
      [-0.00094, 3],
      [-0.00133, 0],
      [-0.00149, 0],
      [-0.00123, 0],
      [-0.00118, 3],
      [0.00379, 1],
      [-0.00108, 3],
      [-0.00146, 0],
      [-0.00118, 3],
      [-0.00122, 0],
      [-0.00132, 0],
      [-0.00122, 3],
      [-0.00107, 3],
      [-0.00107, 3],
      [-0.00313, 2],
      [-0.00114, 3],
      [-0.00135, 3],
      [-0.00125, 3],
      [-0.00127, 0],
      [-0.00112, 3],
      [-0.00131, 0],
      [-0.00123, 3],
      [0.00517, 1],
      [-0.00139, 0]
    ],
    "red_o_points": [],
    "y_categories": ["N", "NOT APPLICABLE", "Y", "nan"],
    "blue_o_points": [],
    "blue_x_points": [
      [0.00634, 1],
      [-0.00051, 3],
      [0.00481, 1],
      [-0.00102, 0],
      [-0.00059, 3],
      [0.00581, 1],
      [0.00586, 1]
    ]
  },
  "QA_mulInjTbpiCause[Motorcycle]": {
    "red_x_points": [
      [0.00195, 0],
      [-0.00126, 1],
      [-0.00163, 1],
      [-0.00152, 1],
      [-0.00096, 1],
      [-0.00107, 1],
      [-0.00158, 1],
      [-0.00146, 1],
      [-0.00138, 1],
      [-0.00135, 1],
      [-0.00113, 1],
      [0.00127, 0],
      [-0.04381, 1],
      [-0.00186, 1],
      [-0.00187, 1],
      [-0.00194, 1],
      [-0.00125, 1],
      [-0.0011, 1],
      [0.00153, 0],
      [-0.00102, 1],
      [-0.00128, 1],
      [-0.00102, 1],
      [-0.00186, 1],
      [-0.00263, 1],
      [0.00327, 0],
      [-0.00108, 1],
      [-0.00117, 1],
      [-0.00106, 1],
      [-0.00141, 1],
      [-0.04177, 1],
      [-0.00105, 1]
    ],
    "red_o_points": [],
    "y_categories": ["N", "Y", "nan"],
    "blue_o_points": [],
    "blue_x_points": [
      [0.02181, 0],
      [-0.00139, 1],
      [0.01751, 0],
      [-0.00257, 1],
      [-0.00152, 1],
      [0.02009, 0],
      [0.02138, 0]
    ]
  },
  "QS_mulLysisRoot[C6]": {
    "red_x_points": [
      [-0.00075, 3],
      [-0.00097, 0],
      [-0.00263, 2],
      [-0.00113, 0],
      [-0.00103, 0],
      [-0.001, 0],
      [-0.00086, 0],
      [-0.0007, 3],
      [-0.00108, 0],
      [-0.00088, 0],
      [-0.001, 0],
      [-0.00081, 3],
      [0.00314, 1],
      [-0.00087, 3],
      [-0.00106, 0],
      [-0.0008, 3],
      [-0.00113, 0],
      [-0.00067, 0],
      [-0.00058, 3],
      [-0.00057, 3],
      [-0.00069, 3],
      [-0.00097, 0],
      [-0.00086, 3],
      [-0.00087, 3],
      [-0.00086, 3],
      [-0.00103, 0],
      [-0.00052, 3],
      [-0.00114, 0],
      [-0.00074, 3],
      [0.00375, 1],
      [-0.00222, 2]
    ],
    "red_o_points": [],
    "y_categories": ["N", "NOT APPLICABLE", "Y", "nan"],
    "blue_o_points": [],
    "blue_x_points": [
      [0.00458, 1],
      [-0.0003, 3],
      [0.00317, 1],
      [-0.00097, 0],
      [-0.00036, 3],
      [0.00342, 1],
      [0.00387, 1]
    ]
  },
  "QS_mulGraftNerve[FI]": {
    "red_x_points": [
      [-4e-5, 2],
      [-7e-5, 0],
      [-0.00019, 0],
      [-0.00014, 0],
      [-0.00018, 0],
      [-8e-5, 0],
      [-0.00018, 0],
      [-4e-5, 2],
      [-0.00014, 0],
      [-0.00011, 0],
      [-0.00011, 0],
      [-3e-5, 2],
      [-0.00012, 1],
      [-4e-5, 2],
      [-0.00011, 0],
      [3e-5, 2],
      [-5e-5, 0],
      [-0.00013, 0],
      [-5e-5, 2],
      [-6e-5, 2],
      [-3e-5, 2],
      [-7e-5, 0],
      [-3e-5, 2],
      [-2e-5, 2],
      [-6e-5, 2],
      [-0.00019, 0],
      [-4e-5, 2],
      [-0.00013, 0],
      [-1e-5, 2],
      [9e-5, 1],
      [-0.00014, 0]
    ],
    "red_o_points": [],
    "y_categories": ["N", "NOT APPLICABLE", "nan"],
    "blue_o_points": [],
    "blue_x_points": [
      [0.00046, 1],
      [8e-5, 2],
      [0.0001, 0],
      [9e-5, 2],
      [0.0002, 1],
      [0.00067, 1]
    ]
  }
}
