{
  "QA_lstPexPain[C8]": {
    "red_x_points": [
      [-0.00596, 1],
      [-0.00209, 2],
      [-0.00203, 2],
      [-0.00212, 2],
      [-0.00674, 1],
      [0.00048, 0],
      [-0.00117, 1],
      [-0.00092, 1],
      [0.00583, 0],
      [-0.00053, 0],
      [0.00041, 0],
      [0.00012, 0],
      [-0.00735, 1],
      [-0.00991, 2],
      [-0.00314, 2],
      [-0.00242, 2],
      [-0.00321, 2],
      [-0.00149, 2],
      [-0.00305, 2],
      [0.00529, 0],
      [-0.00732, 1],
      [0.00548, 0],
      [-0.00213, 2],
      [-0.00326, 2],
      [0.00482, 0],
      [-0.00394, 2],
      [-0.00284, 2],
      [-0.00206, 2],
      [-0.0053, 1],
      [-0.00757, 1],
      [-0.00099, 1],
      [-0.0074, 1]
    ],
    "red_o_points": [],
    "y_categories": ["NORM", "NPV", "nan"],
    "blue_o_points": [],
    "blue_x_points": [
      [0.00754, 0],
      [-0.00065, 2],
      [0.00034, 1],
      [0.00773, 1],
      [0.00259, 0],
      [-0.00042, 1],
      [0.00714, 0],
      [0.0041, 0],
      [0.00817, 0],
      [0.00918, 0]
    ]
  },
  "QS_mulLysisTrunk[Upper]": {
    "red_x_points": [
      [-0.00102, 3],
      [-0.00334, 0],
      [-0.00384, 0],
      [-0.00363, 0],
      [-0.00104, 3],
      [-0.00399, 0],
      [-0.00877, 2],
      [-0.0035, 0],
      [-0.00139, 3],
      [-0.00388, 0],
      [-0.00405, 0],
      [-0.00364, 0],
      [-0.00119, 3],
      [0.00866, 1],
      [-0.0011, 3],
      [-0.00367, 0],
      [-0.00116, 3],
      [-0.00796, 2],
      [-0.00087, 3],
      [-0.00102, 3],
      [-0.00093, 3],
      [-0.00087, 3],
      [-0.003, 0],
      [-0.00108, 3],
      [-0.00111, 3],
      [-0.00107, 3],
      [-0.00324, 0],
      [-0.00344, 0],
      [0.00791, 1],
      [-0.00084, 3],
      [-0.00735, 2],
      [-0.00135, 3]
    ],
    "red_o_points": [],
    "y_categories": ["N", "NOT APPLICABLE", "Y", "nan"],
    "blue_o_points": [],
    "blue_x_points": [
      [0.01235, 1],
      [0.0001, 3],
      [0.00972, 1],
      [-0.00011, 0],
      [-0.00126, 0],
      [0.01014, 1],
      [-0.00044, 3],
      [0.01047, 1],
      [-0.00035, 3],
      [-0.00032, 3]
    ]
  },
  "QS_mulBpsurgeryType[Transf]": {
    "red_x_points": [
      [-0.0002, 3],
      [-0.00066, 2],
      [-0.00206, 0],
      [-0.00068, 2],
      [-0.00033, 3],
      [-0.00082, 2],
      [-0.00066, 2],
      [-0.00089, 2],
      [-0.00036, 3],
      [-0.00087, 2],
      [-0.00073, 2],
      [-0.0006, 2],
      [-0.00026, 3],
      [0.00184, 1],
      [-0.00032, 3],
      [-0.00068, 2],
      [-0.00023, 3],
      [-0.00073, 2],
      [-0.00027, 3],
      [-0.0003, 3],
      [-0.00038, 3],
      [-0.00019, 3],
      [-0.00069, 2],
      [-0.00024, 3],
      [-0.00013, 3],
      [-0.00027, 3],
      [-0.00088, 2],
      [-0.00075, 2],
      [0.00136, 1],
      [-0.00029, 3],
      [-0.00065, 2],
      [-0.00028, 3]
    ],
    "red_o_points": [],
    "y_categories": ["N", "NOT APPLICABLE", "Y", "nan"],
    "blue_o_points": [],
    "blue_x_points": [
      [0.00263, 1],
      [-0.00016, 3],
      [0.00223, 1],
      [-0.00058, 2],
      [-0.00038, 2],
      [0.0025, 1],
      [-0.00015, 3],
      [0.00222, 1],
      [-0.00013, 3],
      [-7e-5, 3]
    ]
  },
  "QS_equBpsurgTime": {
    "red_x_points": [
      [0.00044, 3],
      [-0.00462, 0],
      [0.00403, 2],
      [-0.0052, 0],
      [0.00048, 3],
      [-0.00811, 0],
      [-0.00584, 1],
      [-0.00601, 1],
      [0.00045, 3],
      [-0.00681, 1],
      [-0.00632, 0],
      [0.00669, 2],
      [0.00047, 3],
      [0.00054, 3],
      [0.00048, 3],
      [-0.00624, 1],
      [0.00041, 3],
      [0.00445, 2],
      [0.00039, 3],
      [0.00047, 3],
      [0.00048, 3],
      [0.00048, 3],
      [-0.00479, 0],
      [0.0004, 3],
      [0.00044, 3],
      [0.00053, 3],
      [-0.00639, 0],
      [-0.00501, 0],
      [0.00043, 3],
      [0.00044, 3],
      [0.00388, 2],
      [0.00036, 3]
    ],
    "red_o_points": [],
    "y_categories": [
      "0 TO 6 MONTHS",
      "13 TO 24 MONTHS",
      "7 TO 12 MONTHS",
      "nan"
    ],
    "blue_o_points": [],
    "blue_x_points": [
      [0.00034, 3],
      [0.00041, 3],
      [0.00037, 3],
      [0.00966, 2],
      [0.0108, 2],
      [0.00031, 3],
      [0.00053, 3],
      [0.00052, 3],
      [0.00044, 3],
      [0.00048, 3]
    ]
  },
  "QA_lstPexPain[C5]": {
    "red_x_points": [
      [-0.00222, 1],
      [-0.00389, 2],
      [-0.00433, 2],
      [-0.00392, 2],
      [-0.00202, 1],
      [-0.00071, 1],
      [-0.00081, 1],
      [-0.00101, 1],
      [-0.00276, 1],
      [-0.00095, 1],
      [-0.00081, 1],
      [-0.00058, 1],
      [-0.00206, 1],
      [-0.01528, 2],
      [-0.005, 2],
      [-0.00419, 2],
      [-0.00567, 2],
      [-0.00399, 2],
      [-0.00509, 2],
      [-0.00192, 1],
      [-0.0017, 1],
      [-0.00209, 1],
      [-0.00436, 2],
      [-0.00542, 2],
      [-0.0019, 1],
      [-0.00591, 2],
      [-0.00395, 2],
      [-0.00399, 2],
      [-0.00273, 1],
      [-0.00262, 1],
      [-0.00078, 1],
      [-0.0022, 1]
    ],
    "red_o_points": [],
    "y_categories": ["NORM", "NPV", "nan"],
    "blue_o_points": [],
    "blue_x_points": [
      [0.01873, 0],
      [-0.00282, 2],
      [0.00041, 1],
      [-0.00044, 1],
      [-0.0003, 1],
      [0.00045, 1],
      [-0.00099, 1],
      [0.0175, 0],
      [-0.00091, 1],
      [0.03288, 0]
    ]
  },
  "QS_mulGraftRoot[T1]": {
    "red_x_points": [
      [0.0, 2],
      [-6e-5, 0],
      [-0.0001, 0],
      [-4e-5, 0],
      [0.0, 2],
      [-4e-5, 0],
      [-4e-5, 0],
      [-0.0001, 0],
      [0.0, 2],
      [-6e-5, 0],
      [-0.0001, 0],
      [-6e-5, 0],
      [0.0, 2],
      [8e-5, 1],
      [0.0, 2],
      [-0.0001, 0],
      [0.0, 2],
      [-4e-5, 0],
      [0.0, 2],
      [0.0, 2],
      [0.0, 2],
      [-6e-5, 0],
      [0.0, 2],
      [0.0, 2],
      [0.0, 2],
      [-4e-5, 0],
      [-0.0001, 0],
      [0.00019, 1],
      [0.0, 2],
      [-0.0001, 0],
      [0.0, 2]
    ],
    "red_o_points": [],
    "y_categories": ["N", "NOT APPLICABLE", "nan"],
    "blue_o_points": [],
    "blue_x_points": [
      [0.0001, 1],
      [0.0, 2],
      [0.00019, 1],
      [-4e-5, 0],
      [0.0001, 1],
      [0.0, 2],
      [0.00019, 1],
      [0.0, 2],
      [0.0, 2]
    ]
  },
  "QS_mulGraftNerve[IS]": {
    "red_x_points": [
      [-1e-5, 2],
      [-0.00017, 0],
      [-0.00017, 0],
      [-0.00014, 0],
      [-3e-5, 2],
      [-6e-5, 0],
      [-0.00015, 0],
      [-9e-5, 0],
      [-3e-5, 2],
      [-0.00011, 0],
      [-9e-5, 0],
      [-0.00015, 0],
      [0.0, 2],
      [0.00037, 1],
      [-1e-5, 2],
      [-0.00017, 0],
      [-3e-5, 2],
      [-0.00015, 0],
      [-1e-5, 2],
      [2e-5, 2],
      [2e-5, 2],
      [-0.0, 2],
      [-9e-5, 0],
      [-1e-5, 2],
      [2e-5, 2],
      [-3e-5, 2],
      [-0.00017, 0],
      [-0.00017, 0],
      [0.00017, 1],
      [-1e-5, 2],
      [-0.00012, 0],
      [-1e-5, 2]
    ],
    "red_o_points": [],
    "y_categories": ["N", "NOT APPLICABLE", "nan"],
    "blue_o_points": [],
    "blue_x_points": [
      [0.00037, 1],
      [2e-5, 2],
      [9e-5, 1],
      [-6e-5, 0],
      [-3e-5, 0],
      [0.00028, 1],
      [2e-5, 2],
      [0.00026, 1],
      [2e-5, 2],
      [-3e-5, 2]
    ]
  },
  "QS_mulGraftTrunk[MiddleTrunk]": {
    "red_x_points": [
      [-3e-5, 0],
      [-3e-5, 0],
      [-3e-5, 0],
      [-2e-5, 2],
      [-3e-5, 0],
      [-3e-5, 0],
      [-2e-5, 2],
      [-3e-5, 0],
      [-3e-5, 0],
      [8e-5, 1],
      [-3e-5, 0],
      [-2e-5, 2],
      [-2e-5, 2],
      [-2e-5, 2],
      [-2e-5, 2],
      [-2e-5, 2],
      [-3e-5, 0],
      [-2e-5, 2],
      [-2e-5, 2],
      [-3e-5, 0],
      [8e-5, 1],
      [-2e-5, 2],
      [-3e-5, 0],
      [-2e-5, 2]
    ],
    "red_o_points": [],
    "y_categories": ["N", "NOT APPLICABLE", "nan"],
    "blue_o_points": [],
    "blue_x_points": [
      [8e-5, 1],
      [-3e-5, 0],
      [-3e-5, 0],
      [-2e-5, 2],
      [8e-5, 1],
      [-2e-5, 2]
    ]
  },
  "QA_lstPexArthre[Shoulder]": {
    "red_x_points": [
      [-0.00045, 2],
      [-0.00182, 3],
      [-0.00159, 3],
      [-0.00212, 0],
      [-0.00389, 3],
      [-0.00357, 2],
      [-0.00154, 2],
      [0.00149, 1],
      [-0.00518, 3],
      [-0.00169, 2],
      [-0.00207, 2],
      [-0.00188, 2],
      [-0.0014, 2],
      [-0.00041, 3],
      [-0.00217, 3],
      [-0.00073, 2],
      [-0.00347, 3],
      [-0.00116, 3],
      [-0.00194, 3],
      [-0.00167, 2],
      [-0.0004, 1],
      [-0.00216, 2],
      [-0.0014, 3],
      [-0.00241, 3],
      [-0.00115, 2],
      [-0.00344, 3],
      [-0.00331, 3],
      [-0.00181, 3],
      [-0.00061, 3],
      [-0.00272, 3],
      [0.00073, 1],
      [-0.00317, 3]
    ],
    "red_o_points": [],
    "y_categories": ["NAIA", "NPV", "PV", "nan"],
    "blue_o_points": [],
    "blue_x_points": [
      [0.00018, 2],
      [-0.00116, 3],
      [-0.00025, 2],
      [0.00156, 2],
      [0.01542, 1],
      [-4e-5, 2],
      [0.01809, 1],
      [-0.0, 3],
      [0.00298, 2],
      [0.00159, 2]
    ]
  },
  "QS_mulGraftNerve[Ph]": {
    "red_x_points": [
      [-0.00016, 2],
      [-0.00018, 0],
      [-0.00048, 0],
      [-0.00039, 0],
      [-0.00012, 2],
      [-0.00039, 0],
      [-0.00033, 0],
      [-0.0003, 0],
      [-0.00021, 2],
      [-0.00052, 0],
      [-0.00047, 0],
      [-0.00048, 0],
      [-0.00016, 2],
      [0.00071, 1],
      [-0.00011, 2],
      [-0.00043, 0],
      [-0.00023, 2],
      [-0.00037, 0],
      [-0.00029, 2],
      [-0.0002, 2],
      [-7e-5, 2],
      [-0.0001, 2],
      [-0.00028, 0],
      [-8e-5, 2],
      [-0.00031, 2],
      [-0.00024, 2],
      [-0.00039, 0],
      [-0.00029, 0],
      [0.00032, 1],
      [5e-5, 2],
      [-0.00027, 0],
      [-0.00016, 2]
    ],
    "red_o_points": [],
    "y_categories": ["N", "NOT APPLICABLE", "nan"],
    "blue_o_points": [],
    "blue_x_points": [
      [0.00109, 1],
      [0.00014, 2],
      [0.00122, 1],
      [0.00033, 0],
      [-0.00032, 0],
      [0.00121, 1],
      [-5e-5, 2],
      [0.00091, 1],
      [-5e-5, 2],
      [4e-5, 2]
    ]
  },
  "QA_mulInjOrthesisType[ArmSling]": {
    "red_x_points": [
      [-0.00443, 2],
      [-0.00417, 2],
      [-0.0045, 2],
      [-0.00409, 2],
      [-0.00414, 2],
      [-0.00453, 2],
      [-0.00457, 2],
      [-0.00479, 2],
      [-0.00447, 2],
      [-0.00441, 2],
      [-0.00386, 2],
      [-0.00455, 2],
      [-0.00447, 2],
      [0.00767, 1],
      [-0.00601, 2],
      [-0.00474, 2],
      [-0.0055, 2],
      [-0.00783, 0],
      [0.01029, 1],
      [-0.00358, 2],
      [-0.00443, 2],
      [-0.01278, 0],
      [-0.00233, 3],
      [-0.00554, 2],
      [0.00538, 1],
      [-0.00464, 2],
      [-0.00441, 2],
      [-0.00419, 2],
      [-0.00706, 3],
      [4e-5, 3],
      [-0.00437, 2],
      [-0.00489, 2]
    ],
    "red_o_points": [],
    "y_categories": ["N", "NOT APPLICABLE", "Y", "nan"],
    "blue_o_points": [],
    "blue_x_points": [
      [0.00169, 2],
      [0.01592, 1],
      [0.01105, 1],
      [0.0245, 1],
      [-0.00326, 2],
      [0.00952, 1],
      [-0.00147, 2],
      [0.01033, 1],
      [-0.00209, 2],
      [0.00794, 3]
    ]
  },
  "QA_mulInjOrthesisType[ShoulderSupport]": {
    "red_x_points": [
      [-0.00425, 0],
      [-0.00411, 0],
      [-0.00399, 0],
      [-0.00426, 0],
      [-0.0044, 0],
      [-0.00432, 0],
      [-0.0044, 0],
      [-0.00459, 0],
      [-0.01189, 2],
      [-0.00419, 0],
      [-0.00411, 0],
      [-0.00422, 0],
      [-0.00427, 0],
      [0.00787, 1],
      [-0.00563, 0],
      [-0.00401, 0],
      [-0.0047, 0],
      [-0.00813, 2],
      [0.01012, 1],
      [-0.00316, 0],
      [-0.00431, 0],
      [-0.01197, 2],
      [-0.00153, 3],
      [-0.00521, 0],
      [0.00693, 1],
      [-0.00433, 0],
      [-0.00451, 0],
      [-0.00401, 0],
      [-0.0078, 3],
      [-0.00143, 3],
      [-0.00404, 0],
      [-0.0052, 0]
    ],
    "red_o_points": [],
    "y_categories": ["N", "NOT APPLICABLE", "Y", "nan"],
    "blue_o_points": [],
    "blue_x_points": [
      [0.00192, 0],
      [0.01539, 1],
      [0.01094, 1],
      [0.02154, 1],
      [-0.00272, 0],
      [0.00981, 1],
      [-0.00175, 0],
      [0.00955, 1],
      [-0.00112, 0],
      [0.00752, 3]
    ]
  },
  "QA_yonInjUnconscio": {
    "red_x_points": [
      [-0.00523, 1],
      [-0.00556, 1],
      [-0.00344, 2],
      [-0.0026, 2],
      [-0.00314, 2],
      [0.01421, 0],
      [-0.00622, 1],
      [-0.0031, 2],
      [-0.00352, 2],
      [-0.00349, 2],
      [-0.00348, 2],
      [-0.00793, 1],
      [-0.00554, 1],
      [-0.01411, 1],
      [-0.00457, 2],
      [-0.0033, 2],
      [-0.00395, 2],
      [-0.00604, 1],
      [0.00597, 0],
      [-0.0064, 1],
      [-0.00542, 1],
      [-0.00672, 1],
      [-0.00567, 1],
      [-0.00469, 2],
      [-0.00594, 1],
      [-0.00438, 2],
      [-0.0061, 1],
      [-0.00543, 1],
      [-0.00146, 2],
      [-0.00335, 2],
      [-0.00545, 1],
      [-0.00403, 2]
    ],
    "red_o_points": [],
    "y_categories": ["N", "Y", "nan"],
    "blue_o_points": [],
    "blue_x_points": [
      [4e-5, 2],
      [0.00579, 1],
      [0.01446, 0],
      [0.02077, 0],
      [0.01979, 0],
      [0.00032, 2],
      [-0.00138, 1],
      [0.00024, 2],
      [0.02232, 0],
      [-0.00095, 2]
    ]
  },
  "QA_lstInjTpbiSide": {
    "red_x_points": [
      [-0.00417, 1],
      [0.00083, 0],
      [0.0002, 0],
      [0.00055, 0],
      [0.00089, 0],
      [-0.00151, 1],
      [-0.0001, 0],
      [-0.00021, 0],
      [-0.00438, 1],
      [0.0, 0],
      [-0.00188, 1],
      [-0.00124, 1],
      [-0.00356, 1],
      [-0.01238, 0],
      [-0.00648, 1],
      [-0.00242, 1],
      [0.00116, 0],
      [-0.00212, 1],
      [-0.00604, 1],
      [4e-5, 0],
      [0.00061, 0],
      [2e-5, 0],
      [5e-5, 0],
      [0.00262, 0],
      [-0.0059, 1],
      [-0.00529, 1],
      [-0.00176, 1],
      [-0.00111, 1],
      [-0.01293, 0],
      [-0.00477, 1],
      [-0.00067, 0],
      [0.00254, 0]
    ],
    "red_o_points": [],
    "y_categories": ["L", "R", "nan"],
    "blue_o_points": [],
    "blue_x_points": [
      [-0.00367, 0],
      [0.00648, 0],
      [0.00645, 1],
      [0.00385, 0],
      [0.00107, 1],
      [0.00708, 1],
      [0.00274, 1],
      [0.00683, 1],
      [0.00574, 0],
      [0.00583, 0]
    ]
  },
  "QA_intPexWristFlex": {
    "red_x_points": [
      [-0.0003, 2],
      [-0.00084, 2],
      [-0.00077, 2],
      [-0.00117, 2],
      [-0.00064, 0],
      [-0.00483, 0],
      [-0.00354, 0],
      [-0.00096, 2],
      [-0.00137, 0],
      [-0.00146, 2],
      [-0.00184, 2],
      [-0.00204, 2],
      [-0.0016, 0],
      [0.00029, 2],
      [-0.00014, 2],
      [-0.0016, 2],
      [0.0, 2],
      [-0.00124, 2],
      [-0.0001, 2],
      [-0.00184, 0],
      [-0.00061, 0],
      [-0.00176, 0],
      [-0.00226, 0],
      [-6e-5, 2],
      [-6e-5, 2],
      [-0.00015, 2],
      [-0.00175, 2],
      [-0.00107, 2],
      [-0.01557, 1],
      [0.0, 1],
      [-0.00221, 0],
      [-0.00017, 2]
    ],
    "red_o_points": [],
    "y_categories": ["GREATER THAN OR EQUALS TO 60", "LESS THAN 60", "nan"],
    "blue_o_points": [],
    "blue_x_points": [
      [0.00131, 2],
      [0.0, 2],
      [0.00515, 0],
      [-0.00032, 2],
      [0.02392, 1],
      [0.00149, 2],
      [0.00027, 2],
      [0.00104, 2],
      [0.00114, 0],
      [0.00021, 2]
    ]
  },
  "QS_mulGraftTrunk[LowerTrunk]": {
    "red_x_points": [
      [1e-5, 2],
      [-8e-5, 0],
      [-8e-5, 0],
      [-9e-5, 0],
      [1e-5, 2],
      [-0.00013, 0],
      [-9e-5, 0],
      [-8e-5, 0],
      [-1e-5, 2],
      [-0.00013, 0],
      [-9e-5, 0],
      [-0.00013, 0],
      [-1e-5, 2],
      [0.0001, 1],
      [1e-5, 2],
      [-0.00013, 0],
      [1e-5, 2],
      [-9e-5, 0],
      [1e-5, 2],
      [1e-5, 2],
      [1e-5, 2],
      [1e-5, 2],
      [-8e-5, 0],
      [1e-5, 2],
      [1e-5, 2],
      [1e-5, 2],
      [-8e-5, 0],
      [-4e-5, 0],
      [0.0001, 1],
      [-1e-5, 2],
      [-9e-5, 0],
      [-1e-5, 2]
    ],
    "red_o_points": [],
    "y_categories": ["N", "NOT APPLICABLE", "nan"],
    "blue_o_points": [],
    "blue_x_points": [
      [0.0001, 1],
      [1e-5, 2],
      [0.00034, 1],
      [-0.00013, 0],
      [0.00014, 1],
      [1e-5, 2],
      [0.0001, 1],
      [1e-5, 2],
      [0.0, 2]
    ]
  },
  "QS_mulGraftRoot[T2]": {
    "red_x_points": [
      [-6e-5, 0],
      [-6e-5, 0],
      [-6e-5, 0],
      [1e-5, 2],
      [-6e-5, 0],
      [3e-5, 0],
      [-6e-5, 0],
      [-6e-5, 2],
      [3e-5, 0],
      [-6e-5, 0],
      [-7e-5, 2],
      [2e-5, 1],
      [1e-5, 2],
      [-6e-5, 0],
      [-6e-5, 2],
      [-6e-5, 0],
      [1e-5, 2],
      [-6e-5, 2],
      [1e-5, 2],
      [-7e-5, 2],
      [-0.0, 2],
      [1e-5, 2],
      [1e-5, 2],
      [-6e-5, 0],
      [-6e-5, 0],
      [2e-5, 1],
      [1e-5, 2],
      [-6e-5, 0],
      [1e-5, 2]
    ],
    "red_o_points": [],
    "y_categories": ["N", "NOT APPLICABLE", "nan"],
    "blue_o_points": [],
    "blue_x_points": [
      [2e-5, 1],
      [1e-5, 2],
      [0.00013, 1],
      [8e-5, 0],
      [3e-5, 0],
      [0.00013, 1],
      [1e-5, 2],
      [7e-5, 1],
      [1e-5, 2]
    ]
  },
  "QS_mulGraftRoot[C7]": {
    "red_x_points": [
      [-1e-5, 2],
      [-3e-5, 0],
      [-3e-5, 0],
      [-1e-5, 2],
      [-3e-5, 0],
      [-3e-5, 0],
      [-3e-5, 0],
      [-1e-5, 2],
      [-3e-5, 0],
      [-3e-5, 0],
      [-3e-5, 0],
      [-1e-5, 2],
      [8e-5, 1],
      [-3e-5, 0],
      [-3e-5, 0],
      [-1e-5, 2],
      [-1e-5, 2],
      [-3e-5, 0],
      [-1e-5, 2],
      [-1e-5, 2],
      [-3e-5, 0],
      [-3e-5, 0],
      [8e-5, 1],
      [-1e-5, 2]
    ],
    "red_o_points": [],
    "y_categories": ["N", "NOT APPLICABLE", "nan"],
    "blue_o_points": [],
    "blue_x_points": [
      [8e-5, 1],
      [8e-5, 1],
      [-3e-5, 0],
      [-3e-5, 0],
      [-1e-5, 2],
      [-1e-5, 2],
      [-1e-5, 2]
    ]
  },
  "QS_mulLysisSite[Trunk]": {
    "red_x_points": [
      [-0.00131, 3],
      [-0.00321, 0],
      [-0.00357, 0],
      [-0.00302, 0],
      [-0.00113, 3],
      [-0.00355, 0],
      [-0.00803, 2],
      [-0.00347, 0],
      [-0.00162, 3],
      [-0.00405, 0],
      [-0.00365, 0],
      [-0.00338, 0],
      [-0.00136, 3],
      [0.00804, 1],
      [-0.00114, 3],
      [-0.00341, 0],
      [-0.00128, 3],
      [-0.00814, 2],
      [-0.0016, 3],
      [-0.00128, 3],
      [-0.00103, 3],
      [-0.00123, 3],
      [-0.00316, 0],
      [-0.00155, 3],
      [-0.00148, 3],
      [-0.00123, 3],
      [-0.00358, 0],
      [-0.00304, 0],
      [0.008, 1],
      [-0.00114, 3],
      [-0.00708, 2],
      [-0.00135, 3]
    ],
    "red_o_points": [],
    "y_categories": ["N", "NOT APPLICABLE", "Y", "nan"],
    "blue_o_points": [],
    "blue_x_points": [
      [0.01088, 1],
      [-0.00049, 3],
      [0.01087, 1],
      [7e-5, 0],
      [-0.0012, 0],
      [0.01091, 1],
      [-0.00043, 3],
      [0.01225, 1],
      [-0.00062, 3],
      [-0.00062, 3]
    ]
  },
  "QA_equInjTbpiAge": {
    "red_x_points": [
      [0.00033, 1],
      [0.0002, 1],
      [-0.0003, 1],
      [-0.00074, 0],
      [0.00081, 1],
      [-0.00105, 0],
      [-0.00057, 1],
      [-0.00014, 1],
      [-0.0059, 0],
      [-0.00116, 0],
      [-0.00124, 0],
      [-0.00131, 1],
      [-0.0047, 0],
      [-0.0098, 1],
      [0.00107, 1],
      [-6e-5, 1],
      [0.00072, 1],
      [-0.00147, 0],
      [-0.00593, 0],
      [3e-5, 1],
      [-0.00491, 0],
      [0.00123, 1],
      [0.00019, 1],
      [0.00099, 1],
      [-0.00025, 1],
      [-0.00571, 0],
      [-0.00046, 1],
      [-6e-5, 1],
      [-0.01072, 1],
      [0.00077, 1],
      [-0.00083, 0],
      [0.00138, 1]
    ],
    "red_o_points": [],
    "y_categories": ["GREATER THAN OR EQUALS TO 30", "LESS THAN 30", "nan"],
    "blue_o_points": [],
    "blue_x_points": [
      [-0.00312, 1],
      [0.00226, 1],
      [0.00542, 0],
      [0.0017, 1],
      [0.0025, 0],
      [0.00627, 0],
      [0.00269, 1],
      [0.00614, 0],
      [0.00345, 1],
      [0.00252, 1]
    ]
  },
  "QS_mulTransfSite[PhMc]": {
    "red_x_points": [
      [-0.00059, 3],
      [-0.00289, 0],
      [-0.00243, 0],
      [-0.00285, 0],
      [-0.00061, 3],
      [-0.00286, 0],
      [-0.0023, 0],
      [-0.00623, 2],
      [-0.00078, 3],
      [-0.0027, 0],
      [-0.00306, 0],
      [-0.0024, 0],
      [-0.0008, 3],
      [0.00575, 1],
      [-0.0005, 3],
      [-0.00308, 0],
      [-0.00074, 3],
      [-0.00272, 0],
      [-0.00058, 3],
      [-0.00066, 3],
      [-0.00061, 3],
      [-0.00069, 3],
      [-0.00496, 2],
      [-0.00067, 3],
      [-0.00059, 3],
      [-0.00066, 3],
      [-0.00255, 0],
      [-0.00283, 0],
      [0.00686, 1],
      [-0.00047, 3],
      [-0.00236, 0],
      [-0.0006, 3]
    ],
    "red_o_points": [],
    "y_categories": ["N", "NOT APPLICABLE", "Y", "nan"],
    "blue_o_points": [],
    "blue_x_points": [
      [0.0076, 1],
      [5e-5, 3],
      [0.00711, 1],
      [-0.0012, 0],
      [-0.00098, 0],
      [0.00743, 1],
      [-0.00044, 3],
      [0.00672, 1],
      [-0.00031, 3],
      [-0.00011, 3]
    ]
  },
  "QS_mulLysisSite[Root]": {
    "red_x_points": [
      [-0.00049, 3],
      [-0.00186, 0],
      [-0.00527, 2],
      [-0.0019, 0],
      [-0.0006, 3],
      [-0.00219, 0],
      [-0.00205, 0],
      [-0.00189, 0],
      [-0.00072, 3],
      [-0.00181, 0],
      [-0.00197, 0],
      [-0.00187, 0],
      [-0.00062, 3],
      [0.00494, 1],
      [-0.00077, 3],
      [-0.00198, 0],
      [-0.00062, 3],
      [-0.00173, 0],
      [-0.00069, 3],
      [-0.00061, 3],
      [-0.0006, 3],
      [-0.00065, 3],
      [-0.00193, 0],
      [-0.00069, 3],
      [-0.00079, 3],
      [-0.0007, 3],
      [-0.00179, 0],
      [-0.00178, 0],
      [0.00487, 1],
      [-0.00057, 3],
      [-0.00468, 2],
      [-0.00062, 3]
    ],
    "red_o_points": [],
    "y_categories": ["N", "NOT APPLICABLE", "Y", "nan"],
    "blue_o_points": [],
    "blue_x_points": [
      [0.00659, 1],
      [-0.00039, 3],
      [0.00596, 1],
      [-0.00091, 0],
      [-0.00079, 0],
      [0.00584, 1],
      [-0.00038, 3],
      [0.00562, 1],
      [-0.00034, 3],
      [-0.00042, 3]
    ]
  },
  "QA_yonInjOrtsurg": {
    "red_x_points": [
      [-0.00142, 2],
      [-0.00022, 2],
      [0.0, 2],
      [1e-5, 2],
      [-0.0014, 2],
      [6e-5, 2],
      [0.00014, 2],
      [0.00027, 1],
      [-0.00161, 2],
      [-0.00132, 0],
      [0.00026, 1],
      [0.00029, 1],
      [-0.00146, 2],
      [-0.00502, 0],
      [0.00419, 1],
      [-8e-5, 2],
      [-0.00151, 2],
      [-0.00119, 0],
      [-0.00928, 0],
      [-0.00947, 0],
      [0.00337, 1],
      [-0.00132, 2],
      [0.00062, 1],
      [-0.00218, 2],
      [-0.00122, 2],
      [-0.00195, 2],
      [-0.00121, 0],
      [-0.00127, 0],
      [0.00017, 1],
      [-0.00164, 2],
      [0.00022, 1],
      [-0.00147, 2]
    ],
    "red_o_points": [],
    "y_categories": ["N", "Y", "nan"],
    "blue_o_points": [],
    "blue_x_points": [
      [0.00031, 2],
      [0.01014, 1],
      [0.0007, 2],
      [0.0009, 2],
      [0.00031, 2],
      [0.00049, 2],
      [-0.00056, 2],
      [0.00047, 2],
      [0.01064, 1],
      [-0.00055, 2]
    ]
  },
  "QS_mulGraftNerve[other]": {
    "red_x_points": [
      [-0.00026, 2],
      [-0.00064, 0],
      [-0.00065, 0],
      [-0.00064, 0],
      [-0.00015, 2],
      [-0.00058, 0],
      [-0.00066, 0],
      [-0.00049, 0],
      [-0.00015, 2],
      [-0.00065, 0],
      [-0.00068, 0],
      [-0.00071, 0],
      [-0.00028, 2],
      [0.00104, 1],
      [-0.00013, 2],
      [-0.00057, 0],
      [-0.00022, 2],
      [-0.00046, 0],
      [-0.00019, 2],
      [-0.00024, 2],
      [-9e-5, 2],
      [-0.00029, 2],
      [-0.00058, 0],
      [-0.00011, 2],
      [-0.00016, 2],
      [-0.00013, 2],
      [-0.00048, 0],
      [-0.00066, 0],
      [0.0009, 1],
      [-6e-5, 2],
      [-0.00054, 0],
      [-0.00021, 2]
    ],
    "red_o_points": [],
    "y_categories": ["N", "NOT APPLICABLE", "nan"],
    "blue_o_points": [],
    "blue_x_points": [
      [0.00158, 1],
      [3e-5, 2],
      [0.00143, 1],
      [0.0001, 0],
      [-0.00016, 0],
      [0.0015, 1],
      [1e-5, 2],
      [0.00165, 1],
      [-1e-5, 2],
      [-3e-5, 2]
    ]
  },
  "QS_mulGraftNerve[DS]": {
    "red_x_points": [
      [-1e-5, 2],
      [-2e-5, 0],
      [-7e-5, 0],
      [-1e-5, 2],
      [-0.00021, 0],
      [-2e-5, 0],
      [-2e-5, 0],
      [-1e-5, 2],
      [-7e-5, 0],
      [-7e-5, 0],
      [-7e-5, 0],
      [-1e-5, 2],
      [0.00015, 1],
      [-1e-5, 2],
      [-6e-5, 0],
      [-1e-5, 2],
      [-9e-5, 2],
      [-2e-5, 2],
      [-1e-5, 2],
      [-1e-5, 2],
      [-7e-5, 0],
      [1e-5, 2],
      [-2e-5, 2],
      [1e-5, 2],
      [-7e-5, 0],
      [-7e-5, 0],
      [0.00015, 1],
      [1e-5, 2],
      [-6e-5, 0],
      [-2e-5, 2]
    ],
    "red_o_points": [],
    "y_categories": ["N", "NOT APPLICABLE", "nan"],
    "blue_o_points": [],
    "blue_x_points": [
      [0.00015, 1],
      [1e-5, 2],
      [0.00022, 1],
      [8e-5, 0],
      [-2e-5, 0],
      [0.00014, 1],
      [-2e-5, 2],
      [0.00015, 1],
      [-1e-5, 2],
      [-1e-5, 2]
    ]
  },
  "QS_mulGraftNerve[LP]": {
    "red_x_points": [
      [-3e-5, 2],
      [-0.00018, 0],
      [-0.00012, 0],
      [-0.00018, 0],
      [-0.0, 2],
      [-0.00018, 0],
      [-0.00012, 0],
      [-0.00012, 0],
      [-4e-5, 2],
      [-6e-5, 0],
      [-9e-5, 0],
      [-7e-5, 0],
      [-3e-5, 2],
      [0.00034, 1],
      [1e-5, 2],
      [-0.00018, 0],
      [1e-5, 2],
      [-6e-5, 0],
      [-5e-5, 2],
      [-0.00013, 2],
      [-2e-5, 2],
      [-5e-5, 2],
      [-0.00015, 0],
      [-1e-5, 2],
      [-5e-5, 2],
      [-3e-5, 2],
      [-0.00012, 0],
      [-0.00015, 0],
      [0.00025, 1],
      [-1e-5, 2],
      [-9e-5, 0],
      [-2e-5, 2]
    ],
    "red_o_points": [],
    "y_categories": ["N", "NOT APPLICABLE", "nan"],
    "blue_o_points": [],
    "blue_x_points": [
      [0.00039, 1],
      [-0.0, 2],
      [0.00015, 1],
      [-6e-5, 0],
      [-0.00011, 0],
      [0.00019, 1],
      [-0.0, 2],
      [0.00033, 1],
      [1e-5, 2],
      [-1e-5, 2]
    ]
  },
  "QA_lstPexMuscstrength[WristFlex]": {
    "red_x_points": [
      [-0.00245, 1],
      [-0.00084, 2],
      [-0.00221, 1],
      [-0.00219, 1],
      [-0.00068, 0],
      [0.00065, 0],
      [0.00085, 0],
      [-0.00242, 1],
      [-0.00169, 0],
      [0.00106, 0],
      [0.00033, 0],
      [0.0004, 0],
      [-0.00209, 0],
      [-0.00134, 2],
      [-0.00027, 2],
      [-0.00105, 2],
      [-0.00069, 0],
      [-0.0009, 2],
      [-0.00066, 2],
      [-0.0032, 0],
      [-0.00257, 1],
      [-0.00269, 0],
      [-0.00231, 1],
      [-0.00014, 2],
      [-0.00481, 1],
      [-0.00089, 0],
      [0.00076, 0],
      [0.00057, 0],
      [-0.00049, 2],
      [-0.00265, 1],
      [-0.00252, 1],
      [-0.00026, 2]
    ],
    "red_o_points": [],
    "y_categories": ["GREATER THAN OR EQUALS TO 3", "LESS THAN 3", "nan"],
    "blue_o_points": [],
    "blue_x_points": [
      [0.00073, 0],
      [0.00093, 2],
      [0.00143, 0],
      [0.00292, 0],
      [0.00152, 0],
      [0.00136, 0],
      [0.00146, 0],
      [0.00136, 0],
      [0.00684, 1],
      [0.00473, 2]
    ]
  },
  "QS_mulNeuromadSite[C5]": {
    "red_x_points": [
      [-0.00027, 2],
      [-0.00078, 0],
      [-0.00077, 0],
      [-0.00073, 0],
      [-0.0003, 2],
      [-0.00079, 0],
      [-0.0007, 0],
      [-0.00097, 0],
      [-0.00069, 2],
      [-0.00126, 0],
      [-0.00111, 0],
      [-0.00072, 0],
      [-0.00051, 2],
      [0.00067, 1],
      [-0.00015, 2],
      [-0.00096, 0],
      [-0.00064, 2],
      [-0.00058, 0],
      [-0.00032, 2],
      [-0.0005, 2],
      [-8e-5, 2],
      [-0.00049, 2],
      [-0.00059, 0],
      [-9e-5, 2],
      [-0.00045, 2],
      [-0.00012, 2],
      [-0.00106, 0],
      [-0.00057, 0],
      [0.00117, 1],
      [-0.00016, 2],
      [-0.00073, 0],
      [-0.00031, 2]
    ],
    "red_o_points": [],
    "y_categories": ["N", "NOT APPLICABLE", "nan"],
    "blue_o_points": [],
    "blue_x_points": [
      [0.00251, 1],
      [0.00016, 2],
      [0.00208, 1],
      [0.00039, 0],
      [-0.00029, 0],
      [0.00278, 1],
      [-0.00017, 2],
      [0.00257, 1],
      [2e-5, 2],
      [-8e-5, 2]
    ]
  },
  "QS_mulNeuromadSite[C7]": {
    "red_x_points": [
      [-0.00033, 2],
      [-0.00106, 0],
      [-0.0013, 0],
      [-0.00113, 0],
      [-0.00023, 2],
      [-0.00178, 0],
      [-0.001, 0],
      [-0.00133, 0],
      [-0.00026, 2],
      [-0.00138, 0],
      [-0.00161, 0],
      [-0.00136, 0],
      [-0.0005, 2],
      [0.00102, 1],
      [-0.00019, 2],
      [-0.0015, 0],
      [-0.00014, 2],
      [-0.00083, 0],
      [-0.00034, 2],
      [-0.00061, 2],
      [-0.00011, 2],
      [-0.00041, 2],
      [-0.00107, 0],
      [-0.00028, 2],
      [-0.00041, 2],
      [-0.00027, 2],
      [-0.00129, 0],
      [-0.0012, 0],
      [0.00195, 1],
      [-0.00015, 2],
      [-0.00097, 0],
      [-0.00046, 2]
    ],
    "red_o_points": [],
    "y_categories": ["N", "NOT APPLICABLE", "nan"],
    "blue_o_points": [],
    "blue_x_points": [
      [0.00313, 1],
      [3e-5, 2],
      [0.00307, 1],
      [0.00033, 0],
      [-0.00058, 0],
      [0.00334, 1],
      [-0.00019, 2],
      [0.00332, 1],
      [-3e-5, 2],
      [2e-5, 2]
    ]
  },
  "QA_lstPexMuscstrength[WristExte]": {
    "red_x_points": [
      [0.00053, 1],
      [-0.00155, 2],
      [-0.00371, 1],
      [-0.00197, 1],
      [0.00062, 1],
      [0.00109, 0],
      [-0.00362, 1],
      [-0.00378, 1],
      [-0.00773, 0],
      [0.00252, 0],
      [0.00147, 0],
      [-0.00389, 1],
      [-0.006, 0],
      [-0.00086, 2],
      [-0.0002, 2],
      [-0.00146, 2],
      [-0.00433, 0],
      [-0.0016, 2],
      [-0.00023, 2],
      [-0.00917, 0],
      [0.00142, 1],
      [-0.01041, 0],
      [-0.00153, 1],
      [2e-5, 2],
      [-0.00723, 0],
      [0.0015, 1],
      [0.00213, 0],
      [0.00137, 0],
      [-0.00087, 2],
      [0.00038, 1],
      [-0.00255, 1],
      [1e-5, 2]
    ],
    "red_o_points": [],
    "y_categories": ["GREATER THAN OR EQUALS TO 3", "LESS THAN 3", "nan"],
    "blue_o_points": [],
    "blue_x_points": [
      [0.00083, 0],
      [0.00138, 2],
      [0.00024, 0],
      [0.00588, 0],
      [0.00441, 0],
      [0.00033, 1],
      [0.0078, 1],
      [0.00059, 0],
      [0.00914, 1],
      [0.00713, 2]
    ]
  },
  "QS_mulTransfSite[IMc]": {
    "red_x_points": [
      [-0.0012, 3],
      [-0.00941, 2],
      [-0.0032, 0],
      [-0.00377, 0],
      [-0.00116, 3],
      [-0.00435, 0],
      [-0.00374, 0],
      [-0.00377, 0],
      [-0.00192, 3],
      [-0.00412, 0],
      [-0.00415, 0],
      [-0.0034, 0],
      [-0.00196, 3],
      [0.01018, 1],
      [-0.00123, 3],
      [-0.00378, 0],
      [-0.00158, 3],
      [-0.00851, 2],
      [-0.00122, 3],
      [-0.00154, 3],
      [-0.00114, 3],
      [-0.0015, 3],
      [-0.00343, 0],
      [-0.00105, 3],
      [-0.00117, 3],
      [-0.00099, 3],
      [-0.00368, 0],
      [-0.00889, 2],
      [0.00983, 1],
      [-0.00104, 3],
      [-0.00885, 2],
      [-0.00106, 3]
    ],
    "red_o_points": [],
    "y_categories": ["N", "NOT APPLICABLE", "Y", "nan"],
    "blue_o_points": [],
    "blue_x_points": [
      [0.01266, 1],
      [-0.0004, 3],
      [0.01175, 1],
      [-0.00043, 0],
      [-0.0016, 0],
      [0.01303, 1],
      [-0.00043, 3],
      [0.01216, 1],
      [-0.00037, 3],
      [-0.00015, 3]
    ]
  },
  "QS_mulGraftNerve[SS]": {
    "red_x_points": [
      [-7e-5, 2],
      [-0.00036, 0],
      [-0.00035, 0],
      [-0.00025, 0],
      [-2e-5, 2],
      [-0.00048, 0],
      [-0.0004, 0],
      [-0.00023, 0],
      [-0.0001, 2],
      [-0.00039, 0],
      [-0.00052, 0],
      [-0.0003, 0],
      [1e-5, 2],
      [0.00056, 1],
      [-4e-5, 2],
      [-0.00054, 0],
      [-8e-5, 2],
      [-0.00051, 0],
      [-9e-5, 2],
      [-0.0001, 2],
      [-1e-5, 2],
      [-9e-5, 2],
      [-0.00043, 0],
      [-6e-5, 2],
      [-1e-5, 2],
      [-2e-5, 2],
      [-0.00045, 0],
      [-0.00039, 0],
      [0.00058, 1],
      [-2e-5, 2],
      [-0.00025, 0],
      [-3e-5, 2]
    ],
    "red_o_points": [],
    "y_categories": ["N", "NOT APPLICABLE", "nan"],
    "blue_o_points": [],
    "blue_x_points": [
      [0.00087, 1],
      [-2e-5, 2],
      [0.00084, 1],
      [-8e-5, 0],
      [-9e-5, 0],
      [0.00113, 1],
      [-5e-5, 2],
      [0.00058, 1],
      [-2e-5, 2],
      [0.0, 2]
    ]
  },
  "QA_yonPreOrtsurg": {
    "red_x_points": [
      [-0.00113, 0],
      [-0.00017, 2],
      [0.00017, 0],
      [2e-5, 0],
      [-0.00094, 0],
      [9e-5, 0],
      [0.00012, 0],
      [-3e-5, 0],
      [0.00095, 2],
      [9e-5, 0],
      [0.00014, 0],
      [-0.00082, 2],
      [-0.00207, 1],
      [8e-5, 0],
      [0.00168, 2],
      [0.00011, 0],
      [-0.00152, 0],
      [-0.0017, 1],
      [-0.00596, 1],
      [-0.00094, 0],
      [-0.00083, 0],
      [-0.0008, 0],
      [2e-5, 0],
      [-0.00247, 0],
      [-0.00116, 0],
      [-0.00166, 0],
      [-8e-5, 2],
      [-1e-5, 0],
      [-0.0, 2],
      [-0.00123, 0],
      [-0.00179, 1],
      [0.00189, 2]
    ],
    "red_o_points": [],
    "y_categories": ["N", "Y", "nan"],
    "blue_o_points": [],
    "blue_x_points": [
      [0.00011, 0],
      [0.00297, 2],
      [0.00028, 0],
      [0.00135, 0],
      [0.00137, 0],
      [0.00019, 0],
      [0.00172, 2],
      [4e-5, 0],
      [0.00175, 2],
      [0.0021, 2]
    ]
  },
  "QA_lstPexArthre[Index]": {
    "red_x_points": [
      [-0.00107, 0],
      [-0.0011, 2],
      [-0.00243, 2],
      [-0.00195, 0],
      [-0.0034, 2],
      [0.001, 1],
      [0.00149, 1],
      [-0.00283, 0],
      [-0.00491, 2],
      [0.00174, 1],
      [0.00141, 1],
      [-0.00432, 0],
      [0.00013, 1],
      [-0.00079, 2],
      [-0.00259, 2],
      [0.0015, 1],
      [-0.00293, 2],
      [-0.00152, 2],
      [-0.00175, 2],
      [-0.00032, 1],
      [-0.00305, 0],
      [-0.00075, 1],
      [-0.00068, 2],
      [-0.00241, 2],
      [-4e-5, 1],
      [-0.00319, 2],
      [-0.00161, 2],
      [-0.00118, 2],
      [-0.00079, 2],
      [-0.00239, 2],
      [-0.00394, 0],
      [-0.00259, 2]
    ],
    "red_o_points": [],
    "y_categories": ["NPV", "PV", "nan"],
    "blue_o_points": [],
    "blue_x_points": [
      [0.0007, 0],
      [-0.00075, 2],
      [0.00061, 1],
      [0.00471, 1],
      [0.00395, 1],
      [0.00065, 1],
      [0.01088, 0],
      [-0.00062, 2],
      [0.00537, 1],
      [0.00341, 1]
    ]
  },
  "QS_mulLysisRoot[C7]": {
    "red_x_points": [
      [-0.0007, 3],
      [-0.00189, 0],
      [-0.00477, 2],
      [-0.00154, 0],
      [-0.00054, 3],
      [-0.00139, 0],
      [-0.00172, 0],
      [-0.00194, 0],
      [-0.00119, 3],
      [-0.00186, 0],
      [-0.00172, 0],
      [-0.00162, 0],
      [-0.00097, 3],
      [0.00383, 1],
      [-0.00071, 3],
      [-0.00168, 0],
      [-0.00095, 3],
      [-0.00132, 0],
      [-0.00064, 3],
      [-0.00052, 3],
      [-0.00057, 3],
      [-0.00085, 3],
      [-0.00127, 0],
      [-0.0007, 3],
      [-0.00067, 3],
      [-0.00073, 3],
      [-0.00196, 0],
      [-0.00139, 0],
      [0.00345, 1],
      [-0.00064, 3],
      [-0.00146, 0],
      [-0.00059, 3]
    ],
    "red_o_points": [],
    "y_categories": ["N", "NOT APPLICABLE", "Y", "nan"],
    "blue_o_points": [],
    "blue_x_points": [
      [0.00473, 1],
      [1e-5, 3],
      [0.00394, 1],
      [-0.0003, 0],
      [-0.00064, 0],
      [0.00445, 1],
      [-0.00025, 3],
      [0.00504, 1],
      [-0.00017, 3],
      [-4e-5, 3]
    ]
  },
  "QA_lstPexPain[T1]": {
    "red_x_points": [
      [-0.00778, 1],
      [-0.00206, 2],
      [-0.0021, 2],
      [-0.00148, 2],
      [-0.00738, 1],
      [-0.00444, 0],
      [0.00126, 1],
      [0.00111, 1],
      [0.00527, 0],
      [0.00244, 1],
      [-0.00335, 0],
      [-0.00405, 0],
      [0.00605, 0],
      [-0.01118, 2],
      [-0.00424, 2],
      [-0.00287, 2],
      [-0.00418, 2],
      [-0.00169, 2],
      [-0.0045, 2],
      [0.00555, 0],
      [-0.00891, 1],
      [0.00668, 0],
      [-0.00211, 2],
      [-0.00507, 2],
      [-0.00807, 1],
      [-0.00541, 2],
      [-0.00313, 2],
      [-0.00239, 2],
      [-0.00319, 1],
      [-0.00887, 1],
      [0.00023, 1],
      [-0.00888, 1]
    ],
    "red_o_points": [],
    "y_categories": ["NORM", "NPV", "nan"],
    "blue_o_points": [],
    "blue_x_points": [
      [-4e-5, 1],
      [-0.00049, 2],
      [0.00418, 0],
      [0.00603, 1],
      [0.00743, 1],
      [0.00026, 1],
      [0.00978, 0],
      [0.0045, 0],
      [0.01026, 0],
      [0.01263, 0]
    ]
  },
  "QA_lstPexKine[Shoulder]": {
    "red_x_points": [
      [-0.00135, 1],
      [-0.00178, 2],
      [-0.0023, 2],
      [-0.00149, 2],
      [-0.00414, 2],
      [-0.00357, 1],
      [-0.0018, 1],
      [0.00298, 0],
      [-0.00547, 2],
      [-0.00235, 1],
      [-0.00238, 1],
      [-0.00232, 1],
      [-0.00163, 1],
      [-0.00097, 2],
      [-0.00361, 2],
      [-0.00085, 1],
      [-0.00403, 2],
      [-0.00146, 2],
      [-0.00313, 2],
      [-0.00188, 1],
      [-0.00091, 1],
      [-0.00182, 1],
      [-0.00149, 2],
      [-0.00337, 2],
      [-0.00096, 1],
      [-0.00446, 2],
      [-0.00334, 2],
      [-0.00265, 2],
      [-0.00141, 2],
      [-0.00361, 2],
      [-0.00073, 1],
      [-0.00394, 2]
    ],
    "red_o_points": [],
    "y_categories": ["NPV", "PV", "nan"],
    "blue_o_points": [],
    "blue_x_points": [
      [-0.0001, 1],
      [-0.0017, 2],
      [-0.00034, 1],
      [0.0008, 1],
      [0.01772, 0],
      [0.00013, 1],
      [0.02597, 0],
      [-0.00066, 2],
      [0.00017, 1],
      [0.00066, 1]
    ]
  },
  "QA_yonInjBpsurg": {
    "red_x_points": [
      [-0.00192, 1],
      [-0.00138, 1],
      [-0.00156, 1],
      [-0.00154, 1],
      [-0.00177, 1],
      [-0.00195, 1],
      [-0.00161, 1],
      [-0.00169, 1],
      [-0.00193, 1],
      [-0.00161, 1],
      [-0.00197, 1],
      [-0.00163, 1],
      [-0.00191, 1],
      [0.00386, 0],
      [-0.00185, 1],
      [-0.00168, 1],
      [-0.00209, 1],
      [-0.00133, 1],
      [-0.00164, 1],
      [-0.00203, 1],
      [-0.00147, 1],
      [-0.00175, 1],
      [-0.00115, 1],
      [-0.00221, 1],
      [-0.00184, 1],
      [-0.00185, 1],
      [-0.00156, 1],
      [-0.00151, 1],
      [0.0025, 0],
      [-0.00142, 1],
      [-0.00143, 1],
      [-0.00168, 1]
    ],
    "red_o_points": [],
    "y_categories": ["N", "Y", "nan"],
    "blue_o_points": [],
    "blue_x_points": [
      [0.00762, 0],
      [-0.0001, 1],
      [0.00696, 0],
      [-0.00141, 1],
      [-0.0017, 1],
      [0.00802, 0],
      [-0.00108, 1],
      [0.00806, 0],
      [-0.0006, 1],
      [-0.00061, 1]
    ]
  },
  "QA_equInjTbpiTime": {
    "red_x_points": [
      [-0.00123, 0],
      [-0.002, 0],
      [0.00385, 3],
      [-0.00231, 0],
      [-0.00339, 1],
      [-0.00474, 0],
      [-0.00487, 1],
      [-0.00374, 0],
      [2e-5, 3],
      [-0.004, 0],
      [-0.00332, 0],
      [0.00767, 3],
      [-0.00145, 0],
      [-0.02624, 2],
      [-0.00042, 3],
      [-0.00286, 0],
      [0.00047, 0],
      [-0.00139, 0],
      [-0.00959, 1],
      [0.00103, 3],
      [-0.00152, 0],
      [-0.00431, 1],
      [-0.00581, 2],
      [-0.00092, 3],
      [-0.00866, 1],
      [-0.0099, 2],
      [-0.00343, 0],
      [-0.00561, 2],
      [0.00079, 0],
      [0.00017, 0],
      [0.00458, 3],
      [-0.00548, 1]
    ],
    "red_o_points": [],
    "y_categories": [
      "0 TO 6 MONTHS",
      "13 TO 24 MONTHS",
      "25 MONTHS OR MORE",
      "7 TO 12 MONTHS",
      "nan"
    ],
    "blue_o_points": [],
    "blue_x_points": [
      [0.00227, 0],
      [0.00672, 0],
      [0.00277, 0],
      [0.01136, 3],
      [0.01106, 3],
      [0.00333, 0],
      [0.00413, 1],
      [0.00839, 3],
      [0.00613, 3],
      [0.00439, 0]
    ]
  },
  "QS_mulBpsurgeryType[Graft]": {
    "red_x_points": [
      [-0.0004, 3],
      [-0.00072, 0],
      [-0.00088, 0],
      [-0.00091, 0],
      [-0.00037, 3],
      [-0.00084, 0],
      [-0.00091, 0],
      [-0.00086, 0],
      [-0.00036, 3],
      [-0.00086, 0],
      [-0.00088, 0],
      [-0.00082, 0],
      [-0.00033, 3],
      [0.00195, 1],
      [-0.00034, 3],
      [-0.00305, 2],
      [-0.00029, 3],
      [-0.00068, 0],
      [-0.00032, 3],
      [-0.00018, 3],
      [-0.00031, 3],
      [-0.00034, 3],
      [-0.00084, 0],
      [-0.00034, 3],
      [-0.0003, 3],
      [-0.00034, 3],
      [-0.00077, 0],
      [-0.00083, 0],
      [0.00203, 1],
      [-0.00039, 3],
      [-0.00071, 0],
      [-0.0003, 3]
    ],
    "red_o_points": [],
    "y_categories": ["N", "NOT APPLICABLE", "Y", "nan"],
    "blue_o_points": [],
    "blue_x_points": [
      [0.00271, 1],
      [-0.0001, 3],
      [0.00255, 1],
      [4e-5, 0],
      [-0.00064, 0],
      [0.00243, 1],
      [-0.00027, 3],
      [0.00264, 1],
      [-7e-5, 3],
      [-0.00011, 3]
    ]
  },
  "QS_mulLysisRoot[C6]": {
    "red_x_points": [
      [-0.00099, 3],
      [-0.00311, 0],
      [-0.00774, 2],
      [-0.00327, 0],
      [-0.0007, 3],
      [-0.00314, 0],
      [-0.00326, 0],
      [-0.00325, 0],
      [-0.00104, 3],
      [-0.00375, 0],
      [-0.00368, 0],
      [-0.00309, 0],
      [-0.00111, 3],
      [0.00832, 1],
      [-0.00098, 3],
      [-0.00397, 0],
      [-0.00107, 3],
      [-0.0032, 0],
      [-0.00097, 3],
      [-0.00114, 3],
      [-0.00055, 3],
      [-0.00094, 3],
      [-0.00348, 0],
      [-0.00109, 3],
      [-0.00144, 3],
      [-0.00084, 3],
      [-0.00336, 0],
      [-0.00333, 0],
      [0.00704, 1],
      [-0.00061, 3],
      [-0.00726, 2],
      [-0.0007, 3]
    ],
    "red_o_points": [],
    "y_categories": ["N", "NOT APPLICABLE", "Y", "nan"],
    "blue_o_points": [],
    "blue_x_points": [
      [0.01058, 1],
      [3e-5, 3],
      [0.00885, 1],
      [-0.00095, 0],
      [-0.00157, 0],
      [0.00907, 1],
      [-0.0003, 3],
      [0.00955, 1],
      [-0.00049, 3],
      [-0.00023, 3]
    ]
  },
  "QA_lstPexPalle[Clavicle]": {
    "red_x_points": [
      [-0.00269, 3],
      [-0.00098, 3],
      [-0.00063, 3],
      [-0.00103, 3],
      [-0.00274, 3],
      [-0.00593, 2],
      [-0.0038, 2],
      [-0.00097, 3],
      [-0.00294, 3],
      [-0.0014, 3],
      [-0.00428, 2],
      [-0.00501, 2],
      [-0.0069, 0],
      [0.00056, 3],
      [-0.00292, 3],
      [-0.00097, 3],
      [-0.00279, 3],
      [-0.00073, 3],
      [-0.00239, 3],
      [-0.00885, 0],
      [-0.00831, 0],
      [-0.00082, 2],
      [-0.00084, 1],
      [-0.00289, 3],
      [-0.00163, 2],
      [-0.00304, 3],
      [-0.00127, 3],
      [-0.00092, 3],
      [-0.01541, 2],
      [-0.00238, 3],
      [0.00115, 0],
      [-0.00258, 3]
    ],
    "red_o_points": [],
    "y_categories": ["HYPO", "NAIA", "PT", "nan"],
    "blue_o_points": [],
    "blue_x_points": [
      [0.00134, 3],
      [-0.00133, 3],
      [0.00629, 0],
      [0.0001, 3],
      [0.01545, 0],
      [0.00134, 3],
      [0.02972, 1],
      [0.00113, 3],
      [0.00757, 2],
      [-0.00021, 3]
    ]
  },
  "QA_lstPexMuscstrength[ThumbOppo]": {
    "red_x_points": [
      [-0.00595, 1],
      [0.00063, 2],
      [-0.00404, 1],
      [-0.00343, 1],
      [-0.00666, 1],
      [0.00136, 0],
      [0.0008, 0],
      [-0.0048, 1],
      [0.00063, 0],
      [0.00081, 0],
      [0.00112, 0],
      [0.00094, 0],
      [0.00106, 0],
      [0.00041, 2],
      [0.00112, 2],
      [0.0006, 2],
      [0.00084, 0],
      [0.00043, 2],
      [0.00104, 2],
      [0.0009, 0],
      [-0.00659, 1],
      [0.00084, 0],
      [-0.00345, 1],
      [0.00132, 2],
      [0.00115, 2],
      [0.00118, 2],
      [0.00089, 0],
      [-0.0034, 1],
      [0.00072, 2],
      [-0.00663, 1],
      [-0.00441, 1],
      [0.00131, 2]
    ],
    "red_o_points": [],
    "y_categories": ["GREATER THAN OR EQUALS TO 3", "LESS THAN 3", "nan"],
    "blue_o_points": [],
    "blue_x_points": [
      [0.00029, 2],
      [0.00146, 2],
      [0.001, 0],
      [0.00211, 2],
      [0.00236, 0],
      [0.00127, 0],
      [0.00397, 0],
      [0.00111, 0],
      [0.00248, 2],
      [0.00204, 2]
    ]
  },
  "QS_mulGraftNerve[LT]": {
    "red_x_points": [
      [-0.0, 2],
      [-9e-5, 0],
      [-0.00011, 0],
      [-0.00015, 0],
      [-0.0001, 2],
      [-0.00022, 0],
      [-0.0001, 0],
      [-9e-5, 0],
      [-3e-5, 2],
      [-0.0001, 0],
      [-6e-5, 0],
      [-0.00017, 0],
      [2e-5, 2],
      [7e-5, 1],
      [-4e-5, 2],
      [-0.00012, 0],
      [-0.0, 2],
      [-0.00013, 0],
      [-7e-5, 2],
      [-0.0, 2],
      [-2e-5, 2],
      [-2e-5, 2],
      [-0.00012, 0],
      [-2e-5, 2],
      [-0.00016, 2],
      [-3e-5, 2],
      [-0.00012, 0],
      [-0.00016, 0],
      [0.00028, 1],
      [-5e-5, 2],
      [-8e-5, 0],
      [-0.00013, 2]
    ],
    "red_o_points": [],
    "y_categories": ["N", "NOT APPLICABLE", "nan"],
    "blue_o_points": [],
    "blue_x_points": [
      [0.00048, 1],
      [-2e-5, 2],
      [0.00017, 1],
      [3e-5, 0],
      [-4e-5, 0],
      [0.00042, 1],
      [2e-5, 2],
      [0.00033, 1],
      [-0.0, 2],
      [1e-5, 2]
    ]
  },
  "QA_lstPexTouch[T1]": {
    "red_x_points": [
      [-0.00836, 1],
      [-0.00192, 2],
      [0.00059, 1],
      [-0.00196, 2],
      [-0.00744, 1],
      [-0.00432, 0],
      [0.0015, 1],
      [0.00112, 1],
      [-0.00909, 1],
      [-0.00331, 0],
      [-0.00446, 0],
      [-0.00427, 0],
      [0.00515, 0],
      [-0.00635, 2],
      [-0.00331, 2],
      [-0.00315, 2],
      [-0.00887, 1],
      [-0.00155, 2],
      [-0.00368, 2],
      [0.0047, 0],
      [-0.00919, 1],
      [0.00569, 0],
      [-0.00238, 2],
      [-0.00331, 2],
      [-0.00821, 1],
      [0.00613, 0],
      [0.00184, 1],
      [-0.00254, 2],
      [-0.00192, 1],
      [-0.00376, 2],
      [0.00061, 1],
      [-0.00871, 1]
    ],
    "red_o_points": [],
    "y_categories": ["NORM", "NPV", "nan"],
    "blue_o_points": [],
    "blue_x_points": [
      [0.00063, 1],
      [0.00109, 2],
      [0.00135, 1],
      [0.00676, 1],
      [0.00769, 1],
      [0.00059, 1],
      [0.00937, 0],
      [0.00377, 0],
      [0.00959, 0],
      [0.01192, 0]
    ]
  },
  "QS_mulGraftNerve[MC]": {
    "red_x_points": [
      [-0.0, 2],
      [-0.00023, 0],
      [-0.00034, 0],
      [-0.00035, 0],
      [-1e-5, 2],
      [-0.00023, 0],
      [-0.00029, 0],
      [-0.00025, 0],
      [-8e-5, 2],
      [-0.00028, 0],
      [-0.00033, 0],
      [-0.00023, 0],
      [-1e-5, 2],
      [0.00061, 1],
      [-4e-5, 2],
      [-0.00027, 0],
      [-6e-5, 2],
      [-0.00032, 0],
      [-1e-5, 2],
      [0.0, 2],
      [-6e-5, 2],
      [-1e-5, 2],
      [-0.0002, 0],
      [-1e-5, 2],
      [0.0, 2],
      [-4e-5, 2],
      [-0.00026, 0],
      [-0.00029, 0],
      [0.00042, 1],
      [-2e-5, 2],
      [-0.00023, 0],
      [-3e-5, 2]
    ],
    "red_o_points": [],
    "y_categories": ["N", "NOT APPLICABLE", "nan"],
    "blue_o_points": [],
    "blue_x_points": [
      [0.00067, 1],
      [-3e-5, 2],
      [0.00053, 1],
      [-0.00015, 0],
      [-6e-5, 0],
      [0.00066, 1],
      [1e-5, 2],
      [0.00067, 1],
      [-1e-5, 2],
      [-1e-5, 2]
    ]
  },
  "QA_lstPexKine[Elbow]": {
    "red_x_points": [
      [-0.00222, 0],
      [-0.001, 2],
      [-0.00138, 2],
      [-0.00102, 2],
      [-0.00282, 2],
      [0.00068, 1],
      [0.00066, 1],
      [-0.00225, 0],
      [-0.00402, 2],
      [0.0012, 1],
      [0.0007, 1],
      [0.00046, 1],
      [0.00081, 1],
      [-0.00102, 2],
      [-0.00218, 2],
      [0.00097, 1],
      [-0.00279, 2],
      [-0.00091, 2],
      [-0.00187, 2],
      [-0.0002, 1],
      [-0.00319, 0],
      [-0.00014, 1],
      [-0.0008, 2],
      [-0.00211, 2],
      [0.00062, 1],
      [-0.00254, 2],
      [-0.00104, 2],
      [-0.0009, 2],
      [-0.00084, 2],
      [-0.00256, 2],
      [-0.00177, 0],
      [-0.00281, 2]
    ],
    "red_o_points": [],
    "y_categories": ["NPV", "PV", "nan"],
    "blue_o_points": [],
    "blue_x_points": [
      [0.00101, 1],
      [-0.0012, 2],
      [0.00042, 1],
      [0.0025, 1],
      [0.0015, 1],
      [0.00114, 1],
      [0.00825, 0],
      [-0.0003, 2],
      [0.00407, 1],
      [0.0045, 1]
    ]
  },
  "QS_mulGraftLevel[Trunk]": {
    "red_x_points": [
      [-0.00054, 3],
      [-0.00122, 0],
      [-0.00116, 0],
      [-0.00119, 0],
      [-0.0005, 3],
      [-0.00181, 0],
      [-0.00118, 0],
      [-0.00142, 0],
      [-0.00046, 3],
      [-0.00141, 0],
      [-0.00151, 0],
      [-0.00155, 0],
      [-0.00041, 3],
      [0.00273, 1],
      [-0.00063, 3],
      [-0.0044, 2],
      [-0.00043, 3],
      [-0.00122, 0],
      [-0.00055, 3],
      [-0.00042, 3],
      [-0.00038, 3],
      [-0.00046, 3],
      [-0.00121, 0],
      [-0.00047, 3],
      [-0.0004, 3],
      [-0.00051, 3],
      [-0.00125, 0],
      [-0.00135, 0],
      [0.00311, 1],
      [-0.00036, 3],
      [-0.00137, 0],
      [-0.00051, 3]
    ],
    "red_o_points": [],
    "y_categories": ["N", "NOT APPLICABLE", "Y", "nan"],
    "blue_o_points": [],
    "blue_x_points": [
      [0.00451, 1],
      [-0.0002, 3],
      [0.00429, 1],
      [3e-5, 0],
      [-0.00095, 0],
      [0.0034, 1],
      [-0.0001, 3],
      [0.00333, 1],
      [-4e-5, 3],
      [-0.00028, 3]
    ]
  },
  "QS_mulLysisTrunk[Lower]": {
    "red_x_points": [
      [2e-5, 2],
      [-6e-5, 0],
      [-6e-5, 0],
      [-6e-5, 0],
      [2e-5, 2],
      [-6e-5, 0],
      [-6e-5, 0],
      [-6e-5, 0],
      [-6e-5, 0],
      [-6e-5, 0],
      [2e-5, 2],
      [7e-5, 1],
      [-6e-5, 0],
      [2e-5, 2],
      [2e-5, 2],
      [2e-5, 2],
      [2e-5, 2],
      [-6e-5, 0],
      [2e-5, 2],
      [-6e-5, 0],
      [7e-5, 1],
      [2e-5, 2],
      [-6e-5, 0],
      [2e-5, 2]
    ],
    "red_o_points": [],
    "y_categories": ["N", "NOT APPLICABLE", "nan"],
    "blue_o_points": [],
    "blue_x_points": [
      [7e-5, 1],
      [2e-5, 2],
      [7e-5, 1],
      [7e-5, 1],
      [2e-5, 2],
      [7e-5, 1],
      [2e-5, 2],
      [2e-5, 2]
    ]
  },
  "QA_lstPexKine[Index]": {
    "red_x_points": [
      [-0.00238, 0],
      [-0.0006, 2],
      [-0.0015, 2],
      [-0.00107, 2],
      [-0.00281, 2],
      [0.00039, 1],
      [0.00061, 1],
      [-0.00244, 0],
      [-0.00514, 2],
      [0.00093, 1],
      [0.00054, 1],
      [0.00095, 1],
      [0.00027, 1],
      [-0.00079, 2],
      [-0.00221, 2],
      [0.00099, 1],
      [-0.00284, 2],
      [-0.00107, 2],
      [-0.00214, 2],
      [-0.00069, 1],
      [-0.00231, 0],
      [-0.00123, 1],
      [-0.00069, 2],
      [-0.00222, 2],
      [0.00022, 1],
      [-0.00353, 2],
      [-0.00144, 2],
      [-0.00069, 2],
      [-0.00086, 2],
      [-0.00242, 2],
      [-0.002, 0],
      [-0.00268, 2]
    ],
    "red_o_points": [],
    "y_categories": ["NPV", "PV", "nan"],
    "blue_o_points": [],
    "blue_x_points": [
      [0.00068, 1],
      [-0.00101, 2],
      [0.00039, 1],
      [0.00295, 1],
      [0.00242, 1],
      [0.00042, 1],
      [0.01114, 0],
      [-0.00012, 2],
      [0.00424, 1],
      [0.0041, 1]
    ]
  },
  "QA_lstPexMuscstrength[ElbowFlex]": {
    "red_x_points": [
      [-0.00196, 1],
      [-0.00186, 2],
      [-0.00278, 1],
      [-0.00226, 1],
      [-0.00218, 1],
      [0.00636, 0],
      [-0.00275, 1],
      [-0.00258, 1],
      [-0.00245, 1],
      [-0.00296, 1],
      [-0.00305, 1],
      [-0.00293, 1],
      [-0.00277, 1],
      [-0.00205, 2],
      [-0.00224, 2],
      [-0.0021, 2],
      [-0.00248, 1],
      [-0.00204, 2],
      [-0.00273, 2],
      [-0.00221, 1],
      [-0.00205, 1],
      [-0.00169, 1],
      [-0.00198, 1],
      [-0.0023, 2],
      [-0.00167, 0],
      [-0.00198, 1],
      [-0.00289, 1],
      [-0.00217, 1],
      [-0.00194, 2],
      [-0.00232, 1],
      [-0.00254, 1],
      [-0.0023, 2]
    ],
    "red_o_points": [],
    "y_categories": ["GREATER THAN OR EQUALS TO 3", "LESS THAN 3", "nan"],
    "blue_o_points": [],
    "blue_x_points": [
      [-0.00058, 2],
      [-0.00086, 2],
      [0.00765, 0],
      [-0.00087, 1],
      [0.01623, 0],
      [0.00808, 0],
      [-0.0005, 1],
      [0.00813, 0],
      [0.00065, 1],
      [0.00041, 1]
    ]
  },
  "QS_mulGraftRoot[C6]": {
    "red_x_points": [
      [-1e-5, 2],
      [-2e-5, 0],
      [-2e-5, 0],
      [-2e-5, 0],
      [-1e-5, 2],
      [-4e-5, 0],
      [-2e-5, 0],
      [-1e-5, 2],
      [-2e-5, 0],
      [9e-5, 1],
      [-1e-5, 2],
      [-1e-5, 2],
      [-2e-5, 0],
      [-4e-5, 2],
      [-4e-5, 2],
      [-1e-5, 2],
      [-4e-5, 2],
      [-2e-5, 0],
      [-2e-5, 0]
    ],
    "red_o_points": [],
    "y_categories": ["N", "NOT APPLICABLE", "nan"],
    "blue_o_points": [],
    "blue_x_points": [[0.00025, 1], [-2e-5, 0], [9e-5, 1], [-1e-5, 2]]
  },
  "QA_lstPexMuscstrength[FingersAddu]": {
    "red_x_points": [
      [0.0011, 0],
      [7e-5, 2],
      [-0.00346, 1],
      [-0.00319, 1],
      [-0.00523, 1],
      [0.00162, 0],
      [0.0011, 0],
      [-0.00352, 1],
      [0.00073, 0],
      [0.00128, 0],
      [0.00033, 2],
      [0.00139, 0],
      [0.0011, 0],
      [0.00012, 2],
      [0.00047, 2],
      [2e-5, 2],
      [0.00095, 0],
      [-4e-5, 2],
      [0.00038, 2],
      [0.00085, 0],
      [-0.00459, 1],
      [0.00074, 0],
      [-0.00321, 1],
      [0.00054, 2],
      [0.00048, 2],
      [0.00048, 2],
      [-2e-5, 2],
      [-0.00352, 1],
      [0.00013, 2],
      [-0.00523, 1],
      [-0.00366, 1],
      [0.00049, 2]
    ],
    "red_o_points": [],
    "y_categories": ["GREATER THAN OR EQUALS TO 3", "LESS THAN 3", "nan"],
    "blue_o_points": [],
    "blue_x_points": [
      [8e-5, 2],
      [0.00074, 2],
      [0.00114, 0],
      [0.00113, 2],
      [0.00256, 0],
      [0.00114, 0],
      [0.00239, 0],
      [0.00127, 0],
      [0.00109, 2],
      [0.00139, 2]
    ]
  },
  "QA_yonInjFracture": {
    "red_x_points": [
      [-0.00764, 0],
      [-0.00108, 2],
      [0.00102, 0],
      [-0.00154, 1],
      [-0.00776, 0],
      [0.0003, 0],
      [0.00034, 0],
      [-0.00176, 1],
      [0.00441, 2],
      [0.00095, 0],
      [-0.00275, 1],
      [-0.00387, 1],
      [-0.00863, 0],
      [-0.00069, 0],
      [0.00576, 1],
      [-0.00212, 1],
      [-0.00794, 0],
      [-0.00187, 1],
      [-0.00965, 0],
      [-0.00929, 0],
      [0.0058, 1],
      [-0.01049, 0],
      [-0.00119, 1],
      [-0.00827, 0],
      [-0.00944, 0],
      [-0.00949, 0],
      [0.00088, 0],
      [0.0006, 0],
      [-0.00784, 1],
      [0.00434, 2],
      [-0.00176, 1],
      [0.0045, 1]
    ],
    "red_o_points": [],
    "y_categories": ["N", "Y", "nan"],
    "blue_o_points": [],
    "blue_x_points": [
      [0.00188, 0],
      [0.01056, 1],
      [0.00094, 0],
      [0.0038, 0],
      [0.00275, 0],
      [0.00118, 1],
      [0.00957, 2],
      [0.00132, 0],
      [0.01247, 1],
      [0.0099, 2]
    ]
  },
  "QS_mulTransfSite[MeBr]": {
    "red_x_points": [
      [-6e-5, 2],
      [-3e-5, 0],
      [-3e-5, 0],
      [-5e-5, 2],
      [-2e-5, 0],
      [-0.0, 0],
      [-0.0, 0],
      [-7e-5, 2],
      [-1e-5, 0],
      [-2e-5, 0],
      [-1e-5, 0],
      [-6e-5, 2],
      [-5e-5, 2],
      [-2e-5, 0],
      [-7e-5, 2],
      [-5e-5, 2],
      [-5e-5, 2],
      [-6e-5, 2],
      [-6e-5, 2],
      [-0.0, 0],
      [-7e-5, 2],
      [-6e-5, 2],
      [-7e-5, 2],
      [-0.0, 0],
      [-0.0, 0],
      [-7e-5, 2],
      [-1e-5, 0]
    ],
    "red_o_points": [],
    "y_categories": ["N", "NOT APPLICABLE", "nan"],
    "blue_o_points": [],
    "blue_x_points": [
      [0.00014, 1],
      [0.00016, 1],
      [-2e-5, 0],
      [-0.0, 0],
      [0.00014, 1],
      [-5e-5, 2],
      [0.00032, 1],
      [-1e-5, 2]
    ]
  },
  "QS_mulGraftNerve[Ac]": {
    "red_x_points": [
      [-0.00032, 2],
      [-0.00118, 0],
      [-0.00101, 0],
      [-0.00132, 0],
      [-0.00022, 2],
      [-0.00104, 0],
      [-0.00152, 0],
      [-0.0011, 0],
      [-0.00043, 2],
      [-0.00163, 0],
      [-0.0013, 0],
      [-0.00147, 0],
      [-0.00044, 2],
      [0.00198, 1],
      [-0.00039, 2],
      [-0.00134, 0],
      [-0.00013, 2],
      [-0.00125, 0],
      [-5e-5, 2],
      [-0.00031, 2],
      [-0.00018, 2],
      [-0.0003, 2],
      [-0.00102, 0],
      [-0.00033, 2],
      [-0.0002, 2],
      [-0.00021, 2],
      [-0.00133, 0],
      [-0.00117, 0],
      [0.00204, 1],
      [-0.00033, 2],
      [-0.00098, 0],
      [-0.00019, 2]
    ],
    "red_o_points": [],
    "y_categories": ["N", "NOT APPLICABLE", "nan"],
    "blue_o_points": [],
    "blue_x_points": [
      [0.00349, 1],
      [0.00018, 2],
      [0.00242, 1],
      [-0.00052, 0],
      [-0.0004, 0],
      [0.00265, 1],
      [-3e-5, 2],
      [0.00334, 1],
      [2e-5, 2],
      [7e-5, 2]
    ]
  },
  "QA_lstPexMuscstrength[FingersAbdu]": {
    "red_x_points": [
      [0.00042, 2],
      [0.00045, 2],
      [-0.00366, 1],
      [-0.00289, 1],
      [-0.00148, 1],
      [0.00137, 0],
      [0.00103, 0],
      [-0.00334, 1],
      [-0.00434, 0],
      [0.00165, 0],
      [-6e-5, 2],
      [-0.00434, 1],
      [-0.00257, 0],
      [0.0002, 2],
      [0.0003, 2],
      [0.00036, 2],
      [-0.00276, 0],
      [0.00012, 2],
      [0.00063, 2],
      [-0.00554, 0],
      [-0.00103, 1],
      [-0.00549, 0],
      [-0.00228, 1],
      [0.00061, 2],
      [0.00044, 2],
      [0.00068, 2],
      [-0.00372, 1],
      [-0.00255, 1],
      [-5e-5, 2],
      [-0.00183, 1],
      [-0.00307, 1],
      [0.00041, 2]
    ],
    "red_o_points": [],
    "y_categories": ["GREATER THAN OR EQUALS TO 3", "LESS THAN 3", "nan"],
    "blue_o_points": [],
    "blue_x_points": [
      [0.0003, 2],
      [0.00066, 2],
      [0.00089, 0],
      [0.00289, 2],
      [0.00475, 0],
      [0.00077, 0],
      [0.00927, 1],
      [0.00087, 0],
      [0.00266, 2],
      [0.00254, 2]
    ]
  },
  "QS_mulNeuromadSite[C8]": {
    "red_x_points": [
      [-7e-5, 2],
      [-0.00224, 0],
      [-0.00216, 0],
      [-0.00222, 0],
      [-0.00029, 2],
      [-0.00258, 0],
      [-0.00221, 0],
      [-0.00236, 0],
      [-0.00074, 2],
      [-0.0023, 0],
      [-0.00232, 0],
      [-0.00221, 0],
      [-0.00063, 2],
      [0.00235, 1],
      [-0.00021, 2],
      [-0.00239, 0],
      [-0.00035, 2],
      [-0.00223, 0],
      [-0.00042, 2],
      [-0.00049, 2],
      [-0.00011, 2],
      [-0.00042, 2],
      [-0.00191, 0],
      [-0.00019, 2],
      [-0.00101, 2],
      [-0.00023, 2],
      [-0.00209, 0],
      [-0.00234, 0],
      [0.00318, 1],
      [-6e-5, 2],
      [-0.00179, 0],
      [-0.00019, 2]
    ],
    "red_o_points": [],
    "y_categories": ["N", "NOT APPLICABLE", "nan"],
    "blue_o_points": [],
    "blue_x_points": [
      [0.00561, 1],
      [0.00026, 2],
      [0.00452, 1],
      [9e-5, 0],
      [-0.00085, 0],
      [0.00469, 1],
      [-9e-5, 2],
      [0.00525, 1],
      [0.00018, 2],
      [0.00028, 2]
    ]
  },
  "QS_mulTransfSite[AcSsPA]": {
    "red_x_points": [
      [-0.00079, 3],
      [-0.00172, 0],
      [-0.00197, 0],
      [-0.00219, 0],
      [-0.0007, 3],
      [-0.00233, 0],
      [-0.00197, 0],
      [-0.00197, 0],
      [-0.00085, 3],
      [-0.00229, 0],
      [-0.00198, 0],
      [-0.00205, 0],
      [-0.00086, 3],
      [0.00378, 1],
      [-0.0006, 3],
      [-0.00211, 0],
      [-0.00097, 3],
      [-0.0046, 2],
      [-0.00088, 3],
      [-0.00073, 3],
      [-0.00071, 3],
      [-0.00078, 3],
      [-0.00187, 0],
      [-0.00065, 3],
      [-0.00078, 3],
      [-0.00065, 3],
      [-0.00193, 0],
      [-0.00205, 0],
      [0.00472, 1],
      [-0.00059, 3],
      [-0.00189, 0],
      [-0.00064, 3]
    ],
    "red_o_points": [],
    "y_categories": ["N", "NOT APPLICABLE", "Y", "nan"],
    "blue_o_points": [],
    "blue_x_points": [
      [0.0063, 1],
      [-0.00043, 3],
      [0.00579, 1],
      [-0.00025, 0],
      [-0.00107, 0],
      [0.00613, 1],
      [-0.00036, 3],
      [0.00514, 1],
      [-0.00049, 3],
      [-0.0003, 3]
    ]
  },
  "QA_lstPexMuscstrength[FingersFlex]": {
    "red_x_points": [
      [-1e-5, 0],
      [0.00019, 2],
      [-0.0021, 1],
      [-0.00175, 1],
      [0.00043, 0],
      [0.00036, 0],
      [0.00018, 0],
      [-0.00263, 1],
      [-5e-5, 0],
      [0.00042, 0],
      [0.00032, 0],
      [0.0003, 0],
      [-0.00376, 1],
      [0.00027, 2],
      [0.00056, 2],
      [0.00033, 2],
      [0.0003, 0],
      [9e-5, 2],
      [0.00055, 2],
      [-2e-5, 0],
      [-0.00442, 1],
      [6e-5, 0],
      [-0.00174, 1],
      [0.00056, 2],
      [0.00072, 2],
      [0.00074, 2],
      [0.00023, 0],
      [0.00024, 0],
      [0.00033, 2],
      [-0.00435, 1],
      [-0.00285, 1],
      [0.00069, 2]
    ],
    "red_o_points": [],
    "y_categories": ["GREATER THAN OR EQUALS TO 3", "LESS THAN 3", "nan"],
    "blue_o_points": [],
    "blue_x_points": [
      [0.00017, 2],
      [0.00081, 2],
      [0.00057, 0],
      [0.0013, 2],
      [0.00188, 0],
      [0.00033, 0],
      [0.0017, 0],
      [0.00036, 0],
      [0.00142, 2],
      [0.00128, 2]
    ]
  },
  "QA_lstPexPalle[Elbow]": {
    "red_x_points": [
      [-0.00192, 4],
      [-0.00093, 4],
      [-0.00105, 4],
      [-0.00107, 4],
      [-0.00202, 4],
      [-0.00416, 3],
      [-0.00227, 3],
      [-0.00128, 4],
      [-0.00127, 4],
      [-0.00119, 4],
      [0.00418, 1],
      [-0.00304, 3],
      [-0.00191, 1],
      [0.00013, 4],
      [-0.00138, 4],
      [-0.00085, 4],
      [-0.00144, 4],
      [-0.0007, 4],
      [-0.00096, 4],
      [0.00074, 3],
      [-0.00712, 0],
      [0.00049, 3],
      [-0.00316, 2],
      [-0.0012, 4],
      [-0.00064, 3],
      [-0.00159, 4],
      [-0.00116, 4],
      [-0.00096, 4],
      [-0.0114, 3],
      [-0.00149, 4],
      [-0.00427, 0],
      [-0.00141, 4]
    ],
    "red_o_points": [],
    "y_categories": ["ABS", "HYPO", "NAIA", "PT", "nan"],
    "blue_o_points": [],
    "blue_x_points": [
      [0.00109, 4],
      [-0.00055, 4],
      [0.00764, 1],
      [0.0003, 4],
      [0.01347, 1],
      [0.00139, 4],
      [0.00452, 3],
      [0.00098, 4],
      [0.00519, 3],
      [0.00035, 4]
    ]
  },
  "QA_lstPexMuscstrength[ScapulaAbducSuprot]": {
    "red_x_points": [
      [-0.00295, 0],
      [0.00041, 2],
      [-0.00206, 1],
      [-0.00077, 1],
      [-0.00317, 0],
      [-3e-5, 0],
      [-0.00209, 1],
      [-0.00243, 1],
      [0.00012, 1],
      [0.00013, 0],
      [-0.00028, 0],
      [-0.0033, 1],
      [-0.00101, 1],
      [0.00027, 2],
      [0.00058, 2],
      [0.00034, 2],
      [0.00071, 2],
      [0.00012, 2],
      [0.00068, 2],
      [-0.00643, 0],
      [0.00064, 1],
      [-0.00639, 0],
      [-0.00098, 1],
      [0.0006, 2],
      [-0.00564, 0],
      [0.00111, 2],
      [-0.00277, 1],
      [0.0003, 0],
      [0.00041, 2],
      [-0.00267, 0],
      [-0.00198, 1],
      [0.00079, 2]
    ],
    "red_o_points": [],
    "y_categories": ["GREATER THAN OR EQUALS TO 3", "LESS THAN 3", "nan"],
    "blue_o_points": [],
    "blue_x_points": [
      [0.00014, 2],
      [0.00104, 2],
      [0.00021, 0],
      [0.00377, 2],
      [0.00355, 0],
      [0.00023, 0],
      [0.00302, 2],
      [0.0003, 2],
      [0.00751, 1],
      [0.00273, 2]
    ]
  },
  "participant_code": {
    "red_x_points": [
      [-0.01876, 1],
      [-0.01929, 2],
      [-0.0187, 3],
      [-0.01829, 4],
      [-0.01906, 5],
      [-0.01894, 6],
      [-0.01906, 7],
      [-0.0187, 8],
      [-0.01811, 9],
      [-0.01858, 10],
      [-0.01823, 11],
      [-0.01853, 12],
      [-0.01876, 13],
      [-0.01864, 15],
      [-0.01864, 17],
      [-0.01906, 18],
      [-0.01858, 20],
      [-0.01817, 21],
      [-0.01858, 22],
      [-0.01864, 24],
      [-0.01841, 26],
      [-0.01953, 27],
      [-0.01953, 28],
      [-0.01841, 30],
      [-0.01853, 31],
      [-0.01823, 32],
      [-0.01917, 34],
      [-0.01817, 36],
      [-0.02029, 38],
      [-0.01917, 39],
      [-0.01806, 40],
      [-0.01764, 41]
    ],
    "red_o_points": [],
    "y_categories": [
      "P16554",
      "P18297",
      "P19283",
      "P19287",
      "P23391",
      "P30595",
      "P31645",
      "P31691",
      "P34778",
      "P35046",
      "P36328",
      "P43633",
      "P4544",
      "P46417",
      "P48965",
      "P53068",
      "P5497",
      "P59529",
      "P62483",
      "P64658",
      "P65202",
      "P66816",
      "P6751",
      "P7408",
      "P75566",
      "P76226",
      "P79971",
      "P82621",
      "P82990",
      "P84549",
      "P84932",
      "P85825",
      "P86989",
      "P8770",
      "P87791",
      "P90550",
      "P93159",
      "P94969",
      "P96710",
      "P97130",
      "P9744",
      "P98500",
      "nan"
    ],
    "blue_o_points": [],
    "blue_x_points": [
      [0.04107, 0],
      [0.03613, 14],
      [0.0374, 16],
      [0.03797, 19],
      [0.03924, 23],
      [0.03797, 25],
      [0.03924, 29],
      [0.04009, 33],
      [0.03839, 35],
      [0.0391, 37]
    ]
  },
  "QA_lstPexMuscstrength[ShoulderExrot]": {
    "red_x_points": [
      [-0.00106, 1],
      [0.0001, 2],
      [0.0005, 0],
      [-0.00091, 1],
      [8e-5, 2],
      [-0.00185, 1],
      [-0.00102, 1],
      [8e-5, 2],
      [-0.00097, 1],
      [-0.00122, 1],
      [-0.00134, 1],
      [2e-5, 2],
      [-0.00142, 1],
      [-3e-5, 2],
      [8e-5, 2],
      [0.00019, 2],
      [0.00021, 2],
      [9e-5, 2],
      [0.00014, 2],
      [-0.00133, 1],
      [-0.00098, 1],
      [-0.00125, 1],
      [0.00014, 2],
      [0.00012, 2],
      [0.00011, 2],
      [0.00018, 2],
      [-0.00076, 1],
      [0.00043, 0],
      [-6e-5, 2],
      [0.00013, 2],
      [-0.00093, 1],
      [8e-5, 2]
    ],
    "red_o_points": [],
    "y_categories": ["GREATER THAN OR EQUALS TO 3", "LESS THAN 3", "nan"],
    "blue_o_points": [],
    "blue_x_points": [
      [5e-5, 2],
      [0.00018, 2],
      [0.00362, 0],
      [0.00041, 2],
      [-3e-5, 1],
      [0.00256, 0],
      [0.00026, 2],
      [-2e-5, 1],
      [0.00035, 2],
      [0.0003, 2]
    ]
  },
  "QS_lstBpsurgSide": {
    "red_x_points": [
      [-0.00135, 3],
      [-0.00503, 0],
      [-0.00579, 0],
      [-0.00615, 0],
      [-0.00103, 3],
      [-0.00612, 2],
      [-0.00604, 0],
      [-0.00592, 0],
      [-0.00119, 3],
      [-0.00717, 0],
      [-0.00657, 2],
      [-0.00642, 2],
      [-0.00161, 3],
      [0.00945, 1],
      [-0.00064, 3],
      [-0.00695, 2],
      [-0.00125, 3],
      [-0.00608, 2],
      [-0.00132, 3],
      [-0.00176, 3],
      [-0.00126, 3],
      [-0.00146, 3],
      [-0.00573, 0],
      [-0.00101, 3],
      [-0.00147, 3],
      [-0.00122, 3],
      [-0.00554, 2],
      [-0.0049, 2],
      [0.01002, 1],
      [-0.0009, 3],
      [-0.00637, 0],
      [-0.00097, 3]
    ],
    "red_o_points": [],
    "y_categories": ["L", "NOT APPLICABLE", "R", "nan"],
    "blue_o_points": [],
    "blue_x_points": [
      [0.01323, 1],
      [0.00012, 3],
      [0.01303, 1],
      [0.00319, 0],
      [5e-5, 2],
      [0.01266, 1],
      [-0.00026, 3],
      [0.01386, 1],
      [-0.00033, 3],
      [-0.0004, 3]
    ]
  },
  "QS_mulGraftNerve[Ssr]": {
    "red_x_points": [
      [0.0, 2],
      [-4e-5, 0],
      [-4e-5, 0],
      [0.0, 2],
      [-4e-5, 0],
      [-4e-5, 0],
      [-4e-5, 0],
      [-4e-5, 0],
      [0.0, 2],
      [7e-5, 1],
      [0.0, 2],
      [-4e-5, 0],
      [0.0, 2],
      [0.0, 2],
      [0.0, 2],
      [0.0, 2],
      [-4e-5, 0],
      [0.0, 2],
      [0.0, 2],
      [-4e-5, 0],
      [-4e-5, 0],
      [7e-5, 1],
      [0.0, 2],
      [0.0, 2]
    ],
    "red_o_points": [],
    "y_categories": ["N", "NOT APPLICABLE", "nan"],
    "blue_o_points": [],
    "blue_x_points": [
      [0.0, 2],
      [7e-5, 1],
      [-4e-5, 0],
      [7e-5, 1],
      [0.0, 2],
      [7e-5, 1],
      [0.0, 2],
      [0.0, 2]
    ]
  },
  "QS_mulGraftNerve[MCA]": {
    "red_x_points": [
      [-1e-5, 2],
      [-5e-5, 0],
      [-0.00014, 0],
      [-0.00025, 0],
      [0.0, 2],
      [-0.00021, 0],
      [-0.00012, 0],
      [-0.00021, 0],
      [1e-5, 2],
      [-0.00014, 0],
      [-0.00021, 0],
      [0.0, 2],
      [8e-5, 1],
      [1e-5, 2],
      [-0.00019, 0],
      [-0.0, 2],
      [-0.00021, 0],
      [0.0, 2],
      [1e-5, 2],
      [1e-5, 2],
      [1e-5, 2],
      [-0.00016, 0],
      [1e-5, 2],
      [1e-5, 2],
      [1e-5, 2],
      [-0.00011, 0],
      [-0.00016, 0],
      [0.00036, 1],
      [0.0, 2],
      [-0.00012, 0],
      [1e-5, 2]
    ],
    "red_o_points": [],
    "y_categories": ["N", "NOT APPLICABLE", "nan"],
    "blue_o_points": [],
    "blue_x_points": [
      [0.00032, 1],
      [1e-5, 2],
      [0.00043, 1],
      [-4e-5, 0],
      [0.00036, 1],
      [1e-5, 2],
      [0.00019, 1],
      [1e-5, 2],
      [0.0, 2]
    ]
  },
  "QS_mulBpsurgeryType[Lysis]": {
    "red_x_points": [
      [-0.00159, 3],
      [-0.00514, 0],
      [-0.01284, 2],
      [-0.00579, 0],
      [-0.00164, 3],
      [-0.00574, 0],
      [-0.01176, 2],
      [-0.0051, 0],
      [-0.00214, 3],
      [-0.00592, 0],
      [-0.0052, 0],
      [-0.00483, 0],
      [-0.00225, 3],
      [0.01152, 1],
      [-0.00171, 3],
      [-0.00594, 0],
      [-0.00164, 3],
      [-0.01181, 2],
      [-0.00169, 3],
      [-0.00215, 3],
      [-0.00172, 3],
      [-0.00164, 3],
      [-0.00475, 0],
      [-0.00146, 3],
      [-0.00221, 3],
      [-0.00161, 3],
      [-0.00533, 0],
      [-0.00467, 0],
      [0.01254, 1],
      [-0.0015, 3],
      [-0.01174, 2],
      [-0.00146, 3]
    ],
    "red_o_points": [],
    "y_categories": ["N", "NOT APPLICABLE", "Y", "nan"],
    "blue_o_points": [],
    "blue_x_points": [
      [0.0186, 1],
      [-0.00021, 3],
      [0.0154, 1],
      [0.00018, 0],
      [-0.00109, 0],
      [0.01754, 1],
      [-0.00083, 3],
      [0.01733, 1],
      [-0.00055, 3],
      [-0.0005, 3]
    ]
  },
  "QS_mulGraftTrunk[UpperTrunk]": {
    "red_x_points": [
      [-0.00068, 3],
      [-0.00148, 0],
      [-0.00172, 0],
      [-0.00188, 0],
      [-0.00042, 3],
      [-0.00187, 0],
      [-0.00197, 0],
      [-0.00159, 0],
      [-0.00063, 3],
      [-0.00178, 0],
      [-0.00172, 0],
      [-0.00225, 0],
      [-0.00072, 3],
      [0.00442, 1],
      [-0.00041, 3],
      [-0.00547, 2],
      [-0.0006, 3],
      [-0.00175, 0],
      [-0.00054, 3],
      [-0.00067, 3],
      [-0.00039, 3],
      [-0.00042, 3],
      [-0.0019, 0],
      [-0.00055, 3],
      [-0.00052, 3],
      [-0.00051, 3],
      [-0.0016, 0],
      [-0.00157, 0],
      [0.00401, 1],
      [-0.00039, 3],
      [-0.00179, 0],
      [-0.00053, 3]
    ],
    "red_o_points": [],
    "y_categories": ["N", "NOT APPLICABLE", "Y", "nan"],
    "blue_o_points": [],
    "blue_x_points": [
      [0.00562, 1],
      [-9e-5, 3],
      [0.00554, 1],
      [-0.0005, 0],
      [-0.00111, 0],
      [0.0045, 1],
      [-0.00025, 3],
      [0.00497, 1],
      [-0.0003, 3],
      [-4e-5, 3]
    ]
  },
  "QA_mulInjTbpiCause[Motorcycle]": {
    "red_x_points": [
      [-0.00302, 0],
      [-0.00048, 1],
      [-0.00073, 1],
      [-0.00045, 1],
      [-0.0001, 1],
      [-0.00054, 1],
      [-0.00034, 1],
      [-0.00051, 1],
      [-6e-5, 1],
      [-0.00056, 1],
      [-0.00035, 1],
      [-0.00033, 1],
      [-0.00405, 0],
      [-0.02536, 1],
      [-0.00013, 1],
      [-0.00065, 1],
      [0.00016, 1],
      [-0.00043, 1],
      [-0.00029, 1],
      [-0.00646, 0],
      [0.0003, 1],
      [0.00089, 1],
      [-0.00027, 1],
      [-6e-5, 1],
      [0.0001, 1],
      [-0.00377, 0],
      [-0.00027, 1],
      [-0.00049, 1],
      [-0.02517, 1],
      [0.00011, 1],
      [-0.00032, 1],
      [-0.0002, 1]
    ],
    "red_o_points": [],
    "y_categories": ["N", "Y", "nan"],
    "blue_o_points": [],
    "blue_x_points": [
      [0.01164, 0],
      [5e-5, 1],
      [0.00968, 0],
      [-0.0007, 1],
      [-0.00034, 1],
      [0.01128, 0],
      [0.00185, 1],
      [0.01054, 0],
      [0.00242, 1],
      [0.00179, 1]
    ]
  },
  "QS_mulTransfSite[MeMc]": {
    "red_x_points": [[-5e-5, 0], [-5e-5, 0], [-5e-5, 2]],
    "red_o_points": [],
    "y_categories": ["N", "NOT APPLICABLE", "nan"],
    "blue_o_points": [],
    "blue_x_points": [[0.00015, 1]]
  },
  "QS_mulGraftNerve[Me]": {
    "red_x_points": [
      [1e-5, 2],
      [-0.00016, 0],
      [-0.00017, 0],
      [-0.00012, 0],
      [1e-5, 2],
      [-0.00022, 0],
      [-0.00022, 0],
      [-0.00014, 0],
      [-3e-5, 2],
      [-0.00022, 0],
      [-0.00022, 0],
      [-0.00019, 0],
      [-1e-5, 2],
      [0.0001, 1],
      [2e-5, 2],
      [-0.00032, 0],
      [-3e-5, 2],
      [-0.00017, 0],
      [0.0, 2],
      [-2e-5, 2],
      [1e-5, 2],
      [2e-5, 2],
      [-0.00017, 0],
      [3e-5, 2],
      [-1e-5, 2],
      [1e-5, 2],
      [-0.00022, 0],
      [-0.00022, 0],
      [0.00011, 1],
      [0.0, 2],
      [-0.00017, 0],
      [1e-5, 2]
    ],
    "red_o_points": [],
    "y_categories": ["N", "NOT APPLICABLE", "nan"],
    "blue_o_points": [],
    "blue_x_points": [
      [0.00078, 1],
      [3e-5, 2],
      [0.00011, 1],
      [-0.0001, 0],
      [-4e-5, 0],
      [0.00046, 1],
      [1e-5, 2],
      [0.00058, 1],
      [-1e-5, 2],
      [-0.0, 2]
    ]
  },
  "QS_mulGraftNerve[MP]": {
    "red_x_points": [
      [-3e-5, 2],
      [-0.00028, 0],
      [-0.00017, 0],
      [-0.00022, 0],
      [-8e-5, 2],
      [-0.00012, 0],
      [-0.00024, 0],
      [-0.00023, 0],
      [-9e-5, 2],
      [-0.00033, 0],
      [-0.00028, 0],
      [-0.00033, 0],
      [-4e-5, 2],
      [0.00025, 1],
      [-8e-5, 2],
      [-0.00032, 0],
      [-7e-5, 2],
      [-0.00027, 0],
      [-5e-5, 2],
      [-5e-5, 2],
      [-4e-5, 2],
      [-9e-5, 2],
      [-0.00022, 0],
      [-8e-5, 2],
      [-3e-5, 2],
      [-9e-5, 2],
      [-0.00027, 0],
      [-0.00028, 0],
      [0.00035, 1],
      [-5e-5, 2],
      [-0.00019, 0],
      [-4e-5, 2]
    ],
    "red_o_points": [],
    "y_categories": ["N", "NOT APPLICABLE", "nan"],
    "blue_o_points": [],
    "blue_x_points": [
      [0.00098, 1],
      [-5e-5, 2],
      [0.00059, 1],
      [-0.00013, 0],
      [-0.00017, 0],
      [0.00037, 1],
      [-5e-5, 2],
      [0.00065, 1],
      [-5e-5, 2],
      [-4e-5, 2]
    ]
  },
  "QS_mulGraftNerve[Ax]": {
    "red_x_points": [
      [-6e-5, 2],
      [-0.00029, 0],
      [-0.00033, 0],
      [-0.00029, 0],
      [-4e-5, 2],
      [-0.00029, 0],
      [-0.00017, 0],
      [-0.00024, 0],
      [-4e-5, 2],
      [-0.00029, 0],
      [-0.00025, 0],
      [-0.0004, 0],
      [-3e-5, 2],
      [0.00048, 1],
      [-0.00017, 2],
      [-0.00018, 0],
      [-7e-5, 2],
      [-0.00024, 0],
      [-7e-5, 2],
      [-5e-5, 2],
      [-2e-5, 2],
      [-0.0, 2],
      [-0.00032, 0],
      [-0.00019, 2],
      [-9e-5, 2],
      [-2e-5, 2],
      [-0.0003, 0],
      [-0.0003, 0],
      [0.00049, 1],
      [-1e-5, 2],
      [-0.00033, 0],
      [-9e-5, 2]
    ],
    "red_o_points": [],
    "y_categories": ["N", "NOT APPLICABLE", "nan"],
    "blue_o_points": [],
    "blue_x_points": [
      [0.00062, 1],
      [-0.00011, 2],
      [0.00082, 1],
      [7e-5, 0],
      [-0.00022, 0],
      [0.00068, 1],
      [1e-5, 2],
      [0.00075, 1],
      [1e-5, 2],
      [-3e-5, 2]
    ]
  },
  "QA_lstPexTouch[C7]": {
    "red_x_points": [
      [-0.00628, 1],
      [-0.00194, 2],
      [-0.00192, 1],
      [-0.00198, 2],
      [-0.00579, 1],
      [0.00256, 0],
      [-0.00217, 1],
      [-0.00189, 1],
      [0.00395, 0],
      [-0.00211, 1],
      [0.00215, 0],
      [-0.0028, 1],
      [-0.00629, 1],
      [-0.00801, 2],
      [-0.00333, 2],
      [-0.00217, 2],
      [-0.00656, 1],
      [-0.0018, 2],
      [-0.0035, 2],
      [0.00463, 0],
      [-0.00695, 1],
      [0.00401, 0],
      [-0.00242, 2],
      [-0.0036, 2],
      [0.00237, 0],
      [0.00509, 0],
      [-0.00206, 1],
      [-0.00207, 2],
      [-0.00167, 1],
      [-0.00261, 2],
      [-0.00195, 1],
      [-0.00658, 1]
    ],
    "red_o_points": [],
    "y_categories": ["NORM", "NPV", "nan"],
    "blue_o_points": [],
    "blue_x_points": [
      [9e-5, 1],
      [-0.00016, 2],
      [0.00093, 1],
      [0.00086, 1],
      [0.00868, 0],
      [0.00046, 1],
      [0.00813, 0],
      [0.00377, 0],
      [0.00803, 0],
      [0.00756, 0]
    ]
  },
  "QA_lstPexMuscstrength[ElbowExte]": {
    "red_x_points": [
      [-0.0004, 1],
      [-0.00122, 2],
      [0.00011, 1],
      [0.00045, 1],
      [-0.00047, 1],
      [-0.00589, 0],
      [0.00076, 1],
      [8e-5, 1],
      [-0.00046, 1],
      [-0.00429, 0],
      [-0.004, 0],
      [0.00047, 1],
      [-0.00015, 1],
      [-0.00049, 2],
      [-0.00142, 2],
      [-0.00252, 2],
      [-0.00104, 1],
      [-0.00065, 2],
      [-0.00237, 2],
      [-0.00436, 0],
      [-0.00076, 1],
      [-0.00479, 0],
      [0.00027, 1],
      [-0.00144, 2],
      [-0.00591, 0],
      [-0.00272, 0],
      [0.0007, 1],
      [-0.00144, 2],
      [-0.00057, 2],
      [-0.00068, 1],
      [0.00015, 1],
      [-0.00179, 2]
    ],
    "red_o_points": [],
    "y_categories": ["GREATER THAN OR EQUALS TO 3", "LESS THAN 3", "nan"],
    "blue_o_points": [],
    "blue_x_points": [
      [0.0001, 2],
      [-0.0004, 2],
      [0.00047, 0],
      [0.005, 1],
      [0.00539, 1],
      [0.0001, 0],
      [0.00469, 0],
      [0.00079, 0],
      [0.0076, 1],
      [0.00575, 1]
    ]
  },
  "QS_mulGraftNerve[MCF]": {
    "red_x_points": [
      [-6e-5, 2],
      [-8e-5, 0],
      [-6e-5, 0],
      [-7e-5, 0],
      [-6e-5, 2],
      [-9e-5, 0],
      [-6e-5, 0],
      [-0.0001, 0],
      [-5e-5, 2],
      [-0.0001, 0],
      [-0.0001, 0],
      [-0.0001, 0],
      [-3e-5, 2],
      [0.00019, 1],
      [-5e-5, 2],
      [-9e-5, 0],
      [-6e-5, 2],
      [-8e-5, 0],
      [1e-5, 2],
      [-3e-5, 2],
      [-6e-5, 2],
      [-4e-5, 2],
      [-9e-5, 0],
      [-3e-5, 2],
      [-6e-5, 2],
      [-3e-5, 2],
      [-6e-5, 0],
      [-0.0001, 0],
      [0.0002, 1],
      [-6e-5, 2],
      [-9e-5, 0],
      [-5e-5, 2]
    ],
    "red_o_points": [],
    "y_categories": ["N", "NOT APPLICABLE", "nan"],
    "blue_o_points": [],
    "blue_x_points": [
      [0.00019, 1],
      [-3e-5, 2],
      [0.00019, 1],
      [-5e-5, 0],
      [-0.0001, 0],
      [0.0002, 1],
      [-2e-5, 2],
      [0.00047, 1],
      [0.0, 2],
      [-6e-5, 2]
    ]
  },
  "QS_mulLysisSite[Nerve]": {
    "red_x_points": [
      [-0.00034, 3],
      [-0.00109, 0],
      [-0.00357, 2],
      [-0.00121, 0],
      [-0.0004, 3],
      [-0.00118, 0],
      [-0.00126, 0],
      [-0.00125, 0],
      [-0.00033, 3],
      [-0.00124, 0],
      [-0.00139, 0],
      [-0.00132, 0],
      [-0.00024, 3],
      [0.0033, 1],
      [-0.00038, 3],
      [-0.00097, 0],
      [-0.00041, 3],
      [-0.00121, 0],
      [-0.00039, 3],
      [-0.00031, 3],
      [-0.00033, 3],
      [-0.00033, 3],
      [-0.00125, 0],
      [-0.00038, 3],
      [-0.00041, 3],
      [-0.00034, 3],
      [-0.00125, 0],
      [-0.0012, 0],
      [0.00249, 1],
      [-0.00043, 3],
      [-0.00121, 0],
      [-0.00037, 3]
    ],
    "red_o_points": [],
    "y_categories": ["N", "NOT APPLICABLE", "Y", "nan"],
    "blue_o_points": [],
    "blue_x_points": [
      [0.00382, 1],
      [-0.00024, 3],
      [0.00341, 1],
      [-0.00049, 0],
      [-0.00083, 0],
      [0.00397, 1],
      [-0.00012, 3],
      [0.00389, 1],
      [-0.00022, 3],
      [-0.00025, 3]
    ]
  },
  "QS_mulGraftNerve[TD]": {
    "red_x_points": [
      [-6e-5, 2],
      [-0.00019, 0],
      [-0.00032, 0],
      [-0.00028, 0],
      [-6e-5, 2],
      [-0.00023, 0],
      [-0.0003, 0],
      [-0.00028, 0],
      [-5e-5, 2],
      [-0.00028, 0],
      [-0.0004, 0],
      [-0.00016, 0],
      [-4e-5, 2],
      [0.00034, 1],
      [-0.0, 2],
      [-0.00043, 0],
      [-2e-5, 2],
      [-0.00024, 0],
      [-1e-5, 2],
      [-1e-5, 2],
      [-5e-5, 2],
      [-8e-5, 2],
      [-0.00031, 0],
      [-0.0, 2],
      [-8e-5, 2],
      [-0.0, 2],
      [-0.0003, 0],
      [-0.00039, 0],
      [0.00066, 1],
      [-5e-5, 2],
      [-0.00033, 0],
      [-4e-5, 2]
    ],
    "red_o_points": [],
    "y_categories": ["N", "NOT APPLICABLE", "nan"],
    "blue_o_points": [],
    "blue_x_points": [
      [0.001, 1],
      [-1e-5, 2],
      [0.00058, 1],
      [-0.0002, 0],
      [-6e-5, 0],
      [0.00106, 1],
      [-5e-5, 2],
      [0.00034, 1],
      [0.0, 2],
      [1e-5, 2]
    ]
  },
  "QS_mulGraftLevel[other]": {
    "red_x_points": [
      [-0.00011, 0],
      [-0.00011, 0],
      [-0.00011, 0],
      [-0.0001, 1],
      [5e-5, 2]
    ],
    "red_o_points": [],
    "y_categories": ["N", "NOT APPLICABLE", "nan"],
    "blue_o_points": [],
    "blue_x_points": [[9e-5, 1], [0.0001, 0], [5e-5, 2], [5e-5, 2]]
  },
  "QS_mulGraftNerve[Ul]": {
    "red_x_points": [
      [-0.00014, 2],
      [-0.00075, 0],
      [-0.00083, 0],
      [-0.00053, 0],
      [-0.00022, 2],
      [-0.00071, 0],
      [-0.00068, 0],
      [-0.00085, 0],
      [-0.0004, 2],
      [-0.00049, 0],
      [-0.00077, 0],
      [-0.00062, 0],
      [-0.00029, 2],
      [0.00136, 1],
      [-0.00018, 2],
      [-0.00062, 0],
      [-0.00054, 2],
      [-0.00066, 0],
      [-0.00013, 2],
      [-0.00023, 2],
      [-0.00013, 2],
      [-0.00024, 2],
      [-0.00047, 0],
      [-0.00025, 2],
      [-0.00019, 2],
      [-0.00019, 2],
      [-0.00055, 0],
      [-0.0008, 0],
      [0.00106, 1],
      [-0.00014, 2],
      [-0.00063, 0],
      [-0.00023, 2]
    ],
    "red_o_points": [],
    "y_categories": ["N", "NOT APPLICABLE", "nan"],
    "blue_o_points": [],
    "blue_x_points": [
      [0.00149, 1],
      [-9e-5, 2],
      [0.0018, 1],
      [-0.0, 0],
      [-0.00047, 0],
      [0.00146, 1],
      [-0.0003, 2],
      [0.0019, 1],
      [-0.0001, 2],
      [-5e-5, 2]
    ]
  },
  "QS_mulTransfSite[AcMc]": {
    "red_x_points": [
      [-0.00036, 3],
      [-0.00124, 0],
      [-0.00106, 0],
      [-0.00115, 0],
      [-0.0004, 3],
      [-0.00141, 0],
      [-0.001, 0],
      [-0.00111, 0],
      [-0.00056, 3],
      [-0.0013, 0],
      [-0.00138, 0],
      [-0.00636, 2],
      [-0.00059, 3],
      [0.00256, 1],
      [-0.00018, 3],
      [-0.00119, 0],
      [-0.00039, 3],
      [-0.00115, 0],
      [-9e-5, 3],
      [-0.00056, 3],
      [-0.0002, 3],
      [-0.00034, 3],
      [-0.00126, 0],
      [-0.0002, 3],
      [-0.00029, 3],
      [-0.00014, 3],
      [-0.001, 0],
      [-0.00107, 0],
      [0.00297, 1],
      [-0.00022, 3],
      [-0.00115, 0],
      [-0.00035, 3]
    ],
    "red_o_points": [],
    "y_categories": ["N", "NOT APPLICABLE", "Y", "nan"],
    "blue_o_points": [],
    "blue_x_points": [
      [0.00387, 1],
      [-8e-5, 3],
      [0.00318, 1],
      [-0.00014, 0],
      [0.0001, 0],
      [0.00417, 1],
      [-0.00028, 3],
      [0.00366, 1],
      [-5e-5, 3],
      [-1e-5, 3]
    ]
  },
  "QS_mulTransfSite[Other]": {
    "red_x_points": [
      [-0.00247, 3],
      [-0.01066, 0],
      [-0.01031, 0],
      [-0.01047, 0],
      [-0.00253, 3],
      [-0.01151, 0],
      [-0.01095, 0],
      [-0.01041, 0],
      [-0.00245, 3],
      [-0.01111, 0],
      [-0.01125, 0],
      [-0.01064, 0],
      [-0.00222, 3],
      [0.01592, 1],
      [-0.00215, 3],
      [-0.01066, 0],
      [-0.00238, 3],
      [-0.01016, 0],
      [-0.00281, 3],
      [-0.00251, 3],
      [-0.00209, 3],
      [-0.00233, 3],
      [-0.01003, 0],
      [-0.00232, 3],
      [-0.00218, 3],
      [-0.00214, 3],
      [-0.01053, 0],
      [-0.01039, 0],
      [0.01547, 1],
      [-0.00218, 3],
      [-0.01011, 0],
      [-0.0023, 3]
    ],
    "red_o_points": [],
    "y_categories": ["N", "NOT APPLICABLE", "Y", "nan"],
    "blue_o_points": [],
    "blue_x_points": [
      [0.02125, 1],
      [-0.00131, 3],
      [0.0185, 1],
      [-0.00477, 0],
      [0.03464, 2],
      [0.01774, 1],
      [-0.00105, 3],
      [0.01855, 1],
      [-0.00094, 3],
      [-0.0006, 3]
    ]
  },
  "QA_lstPexTouch[C8]": {
    "red_x_points": [
      [-0.00664, 1],
      [-0.00178, 2],
      [-0.00196, 1],
      [-0.00187, 2],
      [-0.00582, 1],
      [0.00215, 0],
      [-0.0021, 1],
      [-0.0024, 1],
      [0.00477, 0],
      [-0.00261, 1],
      [0.00268, 0],
      [0.00175, 0],
      [-0.00699, 1],
      [-0.00971, 2],
      [-0.00304, 2],
      [-0.00234, 2],
      [-0.00634, 1],
      [-0.00135, 2],
      [-0.00282, 2],
      [0.00505, 0],
      [-0.00713, 1],
      [0.00377, 0],
      [-0.00205, 2],
      [-0.00285, 2],
      [0.00317, 0],
      [0.00487, 0],
      [-0.00207, 1],
      [-0.00237, 2],
      [-0.00466, 1],
      [-0.00332, 2],
      [-0.00189, 1],
      [-0.00734, 1]
    ],
    "red_o_points": [],
    "y_categories": ["NORM", "NPV", "nan"],
    "blue_o_points": [],
    "blue_x_points": [
      [0.00674, 0],
      [-0.00056, 2],
      [0.00021, 1],
      [0.00105, 1],
      [0.00439, 0],
      [-0.00023, 1],
      [0.00637, 0],
      [0.00432, 0],
      [0.00751, 0],
      [0.00817, 0]
    ]
  },
  "QS_mulLysisNerve[Ssr]": {
    "red_x_points": [
      [-0.00031, 3],
      [-0.0011, 0],
      [-0.00378, 2],
      [-0.00129, 0],
      [-0.00052, 3],
      [-0.00131, 0],
      [-0.0011, 0],
      [-0.00143, 0],
      [-0.00039, 3],
      [-0.00146, 0],
      [-0.0013, 0],
      [-0.00091, 0],
      [-0.00045, 3],
      [0.00269, 1],
      [-0.00054, 3],
      [-0.00139, 0],
      [-0.00029, 3],
      [-0.00129, 0],
      [-0.00047, 3],
      [-0.0004, 3],
      [-0.00029, 3],
      [-0.00034, 3],
      [-0.00115, 0],
      [-0.00057, 3],
      [-0.00035, 3],
      [-0.00049, 3],
      [-0.00098, 0],
      [-0.00126, 0],
      [0.00344, 1],
      [-0.00049, 3],
      [-0.00111, 0],
      [-0.00034, 3]
    ],
    "red_o_points": [],
    "y_categories": ["N", "NOT APPLICABLE", "Y", "nan"],
    "blue_o_points": [],
    "blue_x_points": [
      [0.00398, 1],
      [-0.00015, 3],
      [0.00327, 1],
      [-0.00043, 0],
      [-0.00019, 0],
      [0.00346, 1],
      [-0.00011, 3],
      [0.00299, 1],
      [-0.00015, 3],
      [-0.00025, 3]
    ]
  },
  "QS_mulTransfSite[AcSsAA]": {
    "red_x_points": [
      [-0.00203, 3],
      [-0.01304, 2],
      [-0.00321, 0],
      [-0.01193, 2],
      [-0.00184, 3],
      [-0.01561, 2],
      [-0.0028, 0],
      [-0.00351, 0],
      [-0.00181, 3],
      [-0.0032, 0],
      [-0.0134, 2],
      [-0.00318, 0],
      [-0.00226, 3],
      [0.01464, 1],
      [-0.00179, 3],
      [-0.01281, 2],
      [-0.00175, 3],
      [-0.00345, 0],
      [-0.00203, 3],
      [-0.00164, 3],
      [-0.00159, 3],
      [-0.00161, 3],
      [-0.01242, 2],
      [-0.00176, 3],
      [-0.00192, 3],
      [-0.00196, 3],
      [-0.00306, 0],
      [-0.01226, 2],
      [0.01475, 1],
      [-0.00154, 3],
      [-0.00281, 0],
      [-0.00182, 3]
    ],
    "red_o_points": [],
    "y_categories": ["N", "NOT APPLICABLE", "Y", "nan"],
    "blue_o_points": [],
    "blue_x_points": [
      [0.01832, 1],
      [-0.00036, 3],
      [0.01763, 1],
      [0.00097, 0],
      [0.00136, 0],
      [0.01646, 1],
      [-0.00052, 3],
      [0.01661, 1],
      [-0.00088, 3],
      [-0.00027, 3]
    ]
  },
  "QS_mulLysisRoot[C5]": {
    "red_x_points": [
      [-0.00097, 3],
      [-0.00292, 0],
      [-0.00574, 2],
      [-0.00274, 0],
      [-0.00078, 3],
      [-0.00276, 0],
      [-0.00214, 0],
      [-0.00251, 0],
      [-0.00114, 3],
      [-0.0026, 0],
      [-0.0029, 0],
      [-0.00281, 0],
      [-0.00102, 3],
      [0.00534, 1],
      [-0.00064, 3],
      [-0.00281, 0],
      [-0.00114, 3],
      [-0.00234, 0],
      [-0.00094, 3],
      [-0.00123, 3],
      [-0.0007, 3],
      [-0.00127, 3],
      [-0.0024, 0],
      [-0.00079, 3],
      [-0.00117, 3],
      [-0.00079, 3],
      [-0.00246, 0],
      [-0.00259, 0],
      [0.00602, 1],
      [-0.00084, 3],
      [-0.0055, 2],
      [-0.00092, 3]
    ],
    "red_o_points": [],
    "y_categories": ["N", "NOT APPLICABLE", "Y", "nan"],
    "blue_o_points": [],
    "blue_x_points": [
      [0.00718, 1],
      [-0.00021, 3],
      [0.00721, 1],
      [-0.00053, 0],
      [-0.00143, 0],
      [0.0083, 1],
      [-0.0006, 3],
      [0.00921, 1],
      [-0.00046, 3],
      [-0.00027, 3]
    ]
  },
  "QS_mulNeuromadSite[C6]": {
    "red_x_points": [
      [-6e-5, 2],
      [-0.00123, 0],
      [-0.00115, 0],
      [-0.00121, 0],
      [-0.00027, 2],
      [-0.00158, 0],
      [-0.00108, 0],
      [-0.0013, 0],
      [-0.00028, 2],
      [-0.00136, 0],
      [-0.00132, 0],
      [-0.00134, 0],
      [-0.00055, 2],
      [0.00165, 1],
      [-0.00012, 2],
      [-0.00138, 0],
      [-0.00053, 2],
      [-0.00098, 0],
      [-0.00032, 2],
      [-0.0003, 2],
      [-5e-5, 2],
      [-0.00039, 2],
      [-0.00122, 0],
      [-0.00025, 2],
      [-0.00036, 2],
      [-0.00028, 2],
      [-0.00113, 0],
      [-0.00118, 0],
      [0.00167, 1],
      [-0.00021, 2],
      [-0.00114, 0],
      [-0.0002, 2]
    ],
    "red_o_points": [],
    "y_categories": ["N", "NOT APPLICABLE", "nan"],
    "blue_o_points": [],
    "blue_x_points": [
      [0.00381, 1],
      [3e-5, 2],
      [0.00309, 1],
      [-0.00036, 0],
      [-0.00056, 0],
      [0.00279, 1],
      [-0.00012, 2],
      [0.00368, 1],
      [-4e-5, 2],
      [0.00026, 2]
    ]
  },
  "QS_mulNeuromadSite[T1]": {
    "red_x_points": [
      [-0.00022, 2],
      [-0.00148, 0],
      [-0.00148, 0],
      [-0.00162, 0],
      [-0.00041, 2],
      [-0.00141, 0],
      [-0.00108, 0],
      [-0.00144, 0],
      [-0.00055, 2],
      [-0.00201, 0],
      [-0.00193, 0],
      [-0.00144, 0],
      [-0.00028, 2],
      [0.00197, 1],
      [-0.00019, 2],
      [-0.00146, 0],
      [-0.00038, 2],
      [-0.00143, 0],
      [-0.00012, 2],
      [-0.00014, 2],
      [-0.00014, 2],
      [-0.00039, 2],
      [-0.00131, 0],
      [-6e-5, 2],
      [6e-5, 2],
      [-0.0003, 2],
      [-0.00151, 0],
      [-0.00143, 0],
      [0.00249, 1],
      [-0.00025, 2],
      [-0.00133, 0],
      [-0.00016, 2]
    ],
    "red_o_points": [],
    "y_categories": ["N", "NOT APPLICABLE", "nan"],
    "blue_o_points": [],
    "blue_x_points": [
      [0.00427, 1],
      [0.00014, 2],
      [0.00264, 1],
      [-0.00034, 0],
      [-0.00061, 0],
      [0.00358, 1],
      [4e-5, 2],
      [0.00343, 1],
      [8e-5, 2],
      [0.00031, 2]
    ]
  },
  "QS_mulGraftNerve[FI]": {
    "red_x_points": [
      [-0.00049, 2],
      [-0.00069, 0],
      [-0.00076, 0],
      [-0.00074, 0],
      [-0.00027, 2],
      [-0.00095, 0],
      [-0.00076, 0],
      [-0.00065, 0],
      [-0.00054, 2],
      [-0.00096, 0],
      [-0.00093, 0],
      [-0.00074, 0],
      [-0.0004, 2],
      [0.00153, 1],
      [-0.00024, 2],
      [-0.00089, 0],
      [-0.00026, 2],
      [-0.001, 0],
      [-0.00019, 2],
      [-0.00055, 2],
      [-0.00014, 2],
      [-0.00027, 2],
      [-0.00073, 0],
      [-0.0002, 2],
      [-0.00057, 2],
      [-0.00018, 2],
      [-0.00074, 0],
      [-0.00049, 0],
      [0.00127, 1],
      [-0.00029, 2],
      [-0.00078, 0],
      [-0.00018, 2]
    ],
    "red_o_points": [],
    "y_categories": ["N", "NOT APPLICABLE", "nan"],
    "blue_o_points": [],
    "blue_x_points": [
      [0.00256, 1],
      [9e-5, 2],
      [0.00193, 1],
      [4e-5, 0],
      [-0.00044, 0],
      [0.0024, 1],
      [-0.00013, 2],
      [0.00178, 1],
      [-9e-5, 2],
      [-0.00021, 2]
    ]
  },
  "QA_lstPexMuscstrength[ShoulderAbduc]": {
    "red_x_points": [
      [-0.00292, 1],
      [-0.00231, 1],
      [-0.00234, 1],
      [-0.00241, 1],
      [-0.00285, 1],
      [-0.0028, 1],
      [-0.00258, 1],
      [-0.00277, 1],
      [-0.00247, 1],
      [-0.00271, 1],
      [-0.00251, 1],
      [-0.00251, 1],
      [-0.00283, 1],
      [0.00012, 2],
      [0.00112, 2],
      [0.00123, 2],
      [0.00119, 2],
      [0.00119, 2],
      [0.00076, 2],
      [-0.0026, 1],
      [-0.0026, 1],
      [-0.00285, 1],
      [-0.00246, 1],
      [0.00109, 2],
      [-0.00309, 1],
      [-0.00271, 1],
      [-0.0023, 1],
      [-0.00211, 1],
      [0.00029, 2],
      [-0.00283, 1],
      [-0.00254, 1],
      [0.00125, 2]
    ],
    "red_o_points": [],
    "y_categories": ["GREATER THAN OR EQUALS TO 3", "LESS THAN 3", "nan"],
    "blue_o_points": [],
    "blue_x_points": [
      [0.00079, 2],
      [0.00133, 2],
      [0.01462, 0],
      [0.00193, 2],
      [-0.00166, 1],
      [0.01461, 0],
      [0.0015, 2],
      [-0.00069, 1],
      [-0.00161, 1],
      [-0.00183, 1]
    ]
  },
  "QS_mulNeuromadSite[T2]": {
    "red_x_points": [
      [-0.00024, 2],
      [-0.00249, 0],
      [-0.00225, 0],
      [-0.00225, 0],
      [-0.00041, 2],
      [-0.00257, 0],
      [-0.00191, 0],
      [-0.00237, 0],
      [-0.00043, 2],
      [-0.00294, 0],
      [-0.00258, 0],
      [-0.00242, 0],
      [-0.0004, 2],
      [0.00317, 1],
      [-0.00019, 2],
      [-0.00275, 0],
      [-0.00063, 2],
      [-0.00236, 0],
      [-0.00025, 2],
      [-0.00055, 2],
      [-0.00012, 2],
      [-0.00048, 2],
      [-0.00207, 0],
      [-0.00018, 2],
      [-0.00066, 2],
      [-0.00029, 2],
      [-0.0022, 0],
      [-0.00196, 0],
      [0.0036, 1],
      [-0.00015, 2],
      [-0.0019, 0],
      [-0.00034, 2]
    ],
    "red_o_points": [],
    "y_categories": ["N", "NOT APPLICABLE", "nan"],
    "blue_o_points": [],
    "blue_x_points": [
      [0.00614, 1],
      [0.00045, 2],
      [0.00528, 1],
      [-0.00039, 0],
      [-0.00093, 0],
      [0.00531, 1],
      [-0.00014, 2],
      [0.00573, 1],
      [5e-5, 2],
      [0.00021, 2]
    ]
  },
  "QS_mulGraftLevel[Root]": {
    "red_x_points": [
      [1e-5, 2],
      [-0.0, 0],
      [-7e-5, 1],
      [1e-5, 2],
      [-0.0, 0],
      [1e-5, 2],
      [-0.0, 0],
      [1e-5, 2],
      [-0.0, 0],
      [1e-5, 2],
      [1e-5, 2],
      [1e-5, 2],
      [-7e-5, 1]
    ],
    "red_o_points": [],
    "y_categories": ["N", "NOT APPLICABLE", "nan"],
    "blue_o_points": [],
    "blue_x_points": [[1e-5, 2], [-0.0, 0], [1e-5, 2], [1e-5, 2], [1e-5, 2]]
  },
  "QS_mulNeuromadSite[C4]": {
    "red_x_points": [
      [-0.00022, 2],
      [-0.00204, 0],
      [-0.00185, 0],
      [-0.00199, 0],
      [-0.00044, 2],
      [-0.00228, 0],
      [-0.00105, 0],
      [-0.00191, 0],
      [-0.0005, 2],
      [-0.00195, 0],
      [-0.00231, 0],
      [-0.00194, 0],
      [-0.00037, 2],
      [0.00286, 1],
      [-0.00026, 2],
      [-0.00243, 0],
      [-0.00054, 2],
      [-0.00195, 0],
      [-0.00032, 2],
      [-0.00036, 2],
      [-0.00021, 2],
      [-0.00048, 2],
      [-0.00194, 0],
      [-0.00029, 2],
      [-0.00055, 2],
      [-0.00032, 2],
      [-0.00177, 0],
      [-0.00199, 0],
      [0.00349, 1],
      [-0.00024, 2],
      [-0.00166, 0],
      [-0.00016, 2]
    ],
    "red_o_points": [],
    "y_categories": ["N", "NOT APPLICABLE", "nan"],
    "blue_o_points": [],
    "blue_x_points": [
      [0.00487, 1],
      [0.00016, 2],
      [0.00447, 1],
      [-0.00026, 0],
      [-0.00086, 0],
      [0.00423, 1],
      [-0.00016, 2],
      [0.0044, 1],
      [-0.00017, 2],
      [0.00026, 2]
    ]
  },
  "QS_mulGraftNerve[Ra]": {
    "red_x_points": [
      [-0.0, 2],
      [-0.00028, 0],
      [-0.00015, 0],
      [-0.00025, 0],
      [-3e-5, 2],
      [-0.00023, 0],
      [-0.00016, 0],
      [-0.00012, 0],
      [-0.0, 2],
      [-0.00022, 0],
      [-0.00018, 0],
      [-0.00016, 0],
      [-1e-5, 2],
      [0.00012, 1],
      [-2e-5, 2],
      [-0.00021, 0],
      [-3e-5, 2],
      [-0.00019, 0],
      [-1e-5, 2],
      [-0.0, 2],
      [1e-5, 2],
      [-1e-5, 2],
      [-0.00013, 0],
      [3e-5, 2],
      [-1e-5, 2],
      [-2e-5, 2],
      [-0.00016, 0],
      [-0.00014, 0],
      [0.00032, 1],
      [3e-5, 2],
      [-0.00013, 0],
      [1e-5, 2]
    ],
    "red_o_points": [],
    "y_categories": ["N", "NOT APPLICABLE", "nan"],
    "blue_o_points": [],
    "blue_x_points": [
      [0.00058, 1],
      [6e-5, 2],
      [0.00048, 1],
      [-6e-5, 0],
      [-0.0001, 0],
      [0.00026, 1],
      [-0.0, 2],
      [0.00025, 1],
      [-0.0, 2],
      [2e-5, 2]
    ]
  },
  "QS_mulTransfSite[Oberlin]": {
    "red_x_points": [
      [-0.00205, 3],
      [-0.01334, 0],
      [-0.01445, 0],
      [-0.01304, 0],
      [-0.00224, 3],
      [-0.00392, 2],
      [-0.00286, 2],
      [-0.01446, 0],
      [-0.00225, 3],
      [-0.00353, 2],
      [-0.00293, 2],
      [-0.00332, 2],
      [-0.00171, 3],
      [0.01702, 1],
      [-0.00188, 3],
      [-0.00288, 2],
      [-0.00213, 3],
      [-0.01349, 0],
      [-0.00165, 3],
      [-0.00219, 3],
      [-0.00167, 3],
      [-0.00186, 3],
      [-0.0134, 0],
      [-0.00193, 3],
      [-0.00242, 3],
      [-0.00199, 3],
      [-0.00243, 2],
      [-0.01242, 0],
      [0.0162, 1],
      [-0.00178, 3],
      [-0.01401, 0],
      [-0.00186, 3]
    ],
    "red_o_points": [],
    "y_categories": ["N", "NOT APPLICABLE", "Y", "nan"],
    "blue_o_points": [],
    "blue_x_points": [
      [0.02052, 1],
      [-0.00069, 3],
      [0.01813, 1],
      [0.00224, 2],
      [0.00104, 2],
      [0.01867, 1],
      [-0.00082, 3],
      [0.01778, 1],
      [-0.00065, 3],
      [-0.00046, 3]
    ]
  },
  "QS_mulTransfSite[IAx]": {
    "red_x_points": [
      [-1e-5, 2],
      [-9e-5, 0],
      [-4e-5, 0],
      [-9e-5, 0],
      [-1e-5, 2],
      [-5e-5, 0],
      [-4e-5, 0],
      [-9e-5, 0],
      [-4e-5, 0],
      [-5e-5, 0],
      [-2e-5, 2],
      [8e-5, 1],
      [-1e-5, 2],
      [-5e-5, 0],
      [-1e-5, 2],
      [-4e-5, 0],
      [-1e-5, 2],
      [-1e-5, 2],
      [-2e-5, 2],
      [-1e-5, 2],
      [-4e-5, 0],
      [-1e-5, 2],
      [-1e-5, 2],
      [-5e-5, 0],
      [-4e-5, 0],
      [0.00018, 1],
      [-2e-5, 2],
      [-4e-5, 0],
      [-1e-5, 2]
    ],
    "red_o_points": [],
    "y_categories": ["N", "NOT APPLICABLE", "nan"],
    "blue_o_points": [],
    "blue_x_points": [
      [0.0001, 1],
      [-2e-5, 2],
      [0.00018, 1],
      [-4e-5, 0],
      [8e-5, 1],
      [-1e-5, 2],
      [8e-5, 1],
      [-1e-5, 2]
    ]
  },
  "QA_lstPexPalle[Ulna]": {
    "red_x_points": [
      [-0.00153, 3],
      [-0.00034, 3],
      [-0.00022, 3],
      [-0.00035, 3],
      [-0.0012, 3],
      [0.00143, 2],
      [-0.00402, 1],
      [-0.00051, 3],
      [-0.00105, 3],
      [-0.00041, 3],
      [0.00139, 2],
      [0.00141, 2],
      [-0.00575, 1],
      [-0.00024, 3],
      [-0.00086, 3],
      [-0.00032, 3],
      [-0.00086, 3],
      [-0.00029, 3],
      [-0.00075, 3],
      [0.00221, 2],
      [-0.00604, 0],
      [0.00178, 2],
      [-0.00223, 0],
      [-0.00087, 3],
      [0.00207, 2],
      [-0.00108, 3],
      [-0.00035, 3],
      [-0.00034, 3],
      [0.00111, 2],
      [-0.00117, 3],
      [-0.00264, 0],
      [-0.00105, 3]
    ],
    "red_o_points": [],
    "y_categories": ["ABS", "HYPO", "PT", "nan"],
    "blue_o_points": [],
    "blue_x_points": [
      [-6e-5, 3],
      [-0.00045, 3],
      [0.00117, 2],
      [-0.00018, 3],
      [0.00407, 2],
      [-2e-5, 3],
      [0.00518, 2],
      [-7e-5, 3],
      [0.00559, 2],
      [0.00054, 3]
    ]
  }
}
