{
  "QA_lstPexPain[C8]": {
    "red_x_points": [
      [-0.00882, 1],
      [-0.00246, 2],
      [-0.00295, 2],
      [-0.00221, 2],
      [-0.009, 1],
      [0.00085, 0],
      [-0.00049, 1],
      [-0.00121, 1],
      [0.00724, 0],
      [-4e-5, 0],
      [0.00029, 0],
      [0.00052, 0],
      [-0.00949, 1],
      [-0.01308, 2],
      [-0.00412, 2],
      [-0.00353, 2],
      [-0.00411, 2],
      [-0.00194, 2],
      [-0.00442, 2],
      [0.00689, 0],
      [-0.01012, 1],
      [0.00683, 0],
      [-0.00259, 2],
      [-0.00482, 2],
      [0.0052, 0],
      [-0.00545, 2],
      [-0.00479, 2],
      [-0.00259, 2],
      [-0.00719, 1],
      [-0.01115, 1],
      [-0.00147, 1],
      [-0.00935, 1]
    ],
    "red_o_points": [],
    "y_categories": ["NORM", "NPV", "nan"],
    "blue_o_points": [],
    "blue_x_points": [
      [0.00918, 0],
      [-0.00094, 2],
      [0.00056, 1],
      [0.00819, 1],
      [0.00371, 0],
      [-0.00015, 1],
      [0.01, 0],
      [0.00591, 0],
      [0.01173, 0],
      [0.01375, 0]
    ]
  },
  "QA_lstPexMuscstrength[ElbowFlex]": {
    "red_x_points": [
      [-0.0025, 1],
      [-0.0027, 2],
      [-0.00353, 1],
      [-0.00305, 1],
      [-0.00281, 1],
      [0.0085, 0],
      [-0.00418, 1],
      [-0.00402, 1],
      [-0.0033, 1],
      [-0.00431, 1],
      [-0.0035, 1],
      [-0.00455, 1],
      [-0.00374, 1],
      [-0.00301, 2],
      [-0.00276, 2],
      [-0.00327, 2],
      [-0.00337, 1],
      [-0.00244, 2],
      [-0.0033, 2],
      [-0.00335, 1],
      [-0.00296, 1],
      [-0.00279, 1],
      [-0.00306, 1],
      [-0.00267, 2],
      [0.00197, 0],
      [-0.00224, 1],
      [-0.00423, 1],
      [-0.00303, 1],
      [-0.0026, 2],
      [-0.00255, 1],
      [-0.00358, 1],
      [-0.00298, 2]
    ],
    "red_o_points": [],
    "y_categories": ["GREATER THAN OR EQUALS TO 3", "LESS THAN 3", "nan"],
    "blue_o_points": [],
    "blue_x_points": [
      [-0.00071, 2],
      [-0.00104, 2],
      [0.00959, 0],
      [-0.00013, 1],
      [0.02278, 0],
      [0.01136, 0],
      [-0.00174, 1],
      [0.01054, 0],
      [0.00069, 1],
      [0.00023, 1]
    ]
  },
  "QS_mulLysisTrunk[Upper]": {
    "red_x_points": [
      [-0.00184, 3],
      [-0.00507, 0],
      [-0.00509, 0],
      [-0.00526, 0],
      [-0.00172, 3],
      [-0.00594, 0],
      [-0.01306, 2],
      [-0.00444, 0],
      [-0.00231, 3],
      [-0.00605, 0],
      [-0.00594, 0],
      [-0.0049, 0],
      [-0.00193, 3],
      [0.01015, 1],
      [-0.00112, 3],
      [-0.00555, 0],
      [-0.00193, 3],
      [-0.01084, 2],
      [-0.00162, 3],
      [-0.00166, 3],
      [-0.00132, 3],
      [-0.00189, 3],
      [-0.00451, 0],
      [-0.00148, 3],
      [-0.00164, 3],
      [-0.00108, 3],
      [-0.00516, 0],
      [-0.00471, 0],
      [0.01226, 1],
      [-0.00112, 3],
      [-0.0108, 2],
      [-0.00199, 3]
    ],
    "red_o_points": [],
    "y_categories": ["N", "NOT APPLICABLE", "Y", "nan"],
    "blue_o_points": [],
    "blue_x_points": [
      [0.01773, 1],
      [-0.00024, 3],
      [0.01429, 1],
      [0.00116, 0],
      [-0.00122, 0],
      [0.01502, 1],
      [-0.00016, 3],
      [0.01544, 1],
      [-0.00043, 3],
      [0.00015, 3]
    ]
  },
  "QS_mulBpsurgeryType[Transf]": {
    "red_x_points": [
      [-6e-5, 3],
      [-0.00045, 2],
      [-0.00204, 0],
      [-0.00031, 2],
      [-7e-5, 3],
      [-0.00039, 2],
      [-0.00019, 2],
      [-0.00031, 2],
      [-0.00011, 3],
      [-0.00033, 2],
      [-0.00038, 2],
      [-0.00025, 2],
      [-9e-5, 3],
      [0.00097, 1],
      [-0.00015, 3],
      [-0.00012, 2],
      [-6e-5, 3],
      [-0.00039, 2],
      [-0.0001, 3],
      [-0.00016, 3],
      [-8e-5, 3],
      [-1e-5, 3],
      [-0.00035, 2],
      [-0.00014, 3],
      [-2e-5, 3],
      [-0.0001, 3],
      [-0.00026, 2],
      [-0.0004, 2],
      [0.00071, 1],
      [-8e-5, 3],
      [-0.00034, 2],
      [-7e-5, 3]
    ],
    "red_o_points": [],
    "y_categories": ["N", "NOT APPLICABLE", "Y", "nan"],
    "blue_o_points": [],
    "blue_x_points": [
      [0.00131, 1],
      [1e-5, 3],
      [0.00086, 1],
      [0.00023, 2],
      [7e-5, 2],
      [0.00084, 1],
      [-3e-5, 3],
      [0.00068, 1],
      [-6e-5, 3],
      [-6e-5, 3]
    ]
  },
  "QS_equBpsurgTime": {
    "red_x_points": [
      [0.00065, 3],
      [-0.00616, 0],
      [0.0054, 2],
      [-0.00612, 0],
      [0.00054, 3],
      [-0.01012, 0],
      [-0.00714, 1],
      [-0.00713, 1],
      [0.00051, 3],
      [-0.00868, 1],
      [-0.00814, 0],
      [0.00874, 2],
      [0.00056, 3],
      [0.00054, 3],
      [0.00058, 3],
      [-0.00843, 1],
      [0.00046, 3],
      [0.00457, 2],
      [0.00052, 3],
      [0.0006, 3],
      [0.00066, 3],
      [0.00054, 3],
      [-0.00575, 0],
      [0.00053, 3],
      [0.00057, 3],
      [0.00058, 3],
      [-0.0082, 0],
      [-0.00568, 0],
      [0.00063, 3],
      [0.0006, 3],
      [0.00471, 2],
      [0.00044, 3]
    ],
    "red_o_points": [],
    "y_categories": [
      "0 TO 6 MONTHS",
      "13 TO 24 MONTHS",
      "7 TO 12 MONTHS",
      "nan"
    ],
    "blue_o_points": [],
    "blue_x_points": [
      [0.00053, 3],
      [0.00052, 3],
      [0.00043, 3],
      [0.01283, 2],
      [0.01396, 2],
      [0.00044, 3],
      [0.00069, 3],
      [0.00041, 3],
      [0.00072, 3],
      [0.00063, 3]
    ]
  },
  "QA_equInjTbpiTime": {
    "red_x_points": [
      [-0.00084, 0],
      [-0.00259, 0],
      [0.00656, 3],
      [-0.00366, 0],
      [-0.0042, 1],
      [-0.00743, 0],
      [-0.00642, 1],
      [-0.00456, 0],
      [-0.00143, 3],
      [-0.00551, 0],
      [-0.00479, 0],
      [0.01074, 3],
      [-0.00104, 0],
      [-0.03189, 2],
      [-0.00113, 3],
      [-0.00403, 0],
      [-0.00011, 0],
      [-0.00218, 0],
      [-0.01224, 1],
      [-0.00024, 3],
      [-0.00189, 0],
      [-0.00585, 1],
      [-0.00743, 2],
      [-0.0007, 3],
      [-0.01188, 1],
      [-0.01264, 2],
      [-0.0059, 0],
      [-0.0068, 2],
      [0.00062, 0],
      [-9e-5, 0],
      [0.00543, 3],
      [-0.00722, 1]
    ],
    "red_o_points": [],
    "y_categories": [
      "0 TO 6 MONTHS",
      "13 TO 24 MONTHS",
      "25 MONTHS OR MORE",
      "7 TO 12 MONTHS",
      "nan"
    ],
    "blue_o_points": [],
    "blue_x_points": [
      [0.00323, 0],
      [0.00973, 0],
      [0.00341, 0],
      [0.01546, 3],
      [0.01582, 3],
      [0.00363, 0],
      [0.00542, 1],
      [0.01001, 3],
      [0.00865, 3],
      [0.00678, 0]
    ]
  },
  "QS_mulNeuromadSite[T2]": {
    "red_x_points": [
      [-0.00035, 2],
      [-0.00134, 0],
      [-0.00191, 0],
      [-0.00163, 0],
      [-0.0003, 2],
      [-0.00142, 0],
      [-0.0015, 0],
      [-0.00169, 0],
      [-0.0006, 2],
      [-0.00207, 0],
      [-0.00204, 0],
      [-0.00158, 0],
      [-0.00048, 2],
      [0.00097, 1],
      [-0.00039, 2],
      [-0.00173, 0],
      [-0.00054, 2],
      [-0.00133, 0],
      [-0.00036, 2],
      [-0.00064, 2],
      [4e-5, 2],
      [-0.00039, 2],
      [-0.00153, 0],
      [-0.00026, 2],
      [-0.00027, 2],
      [-0.00011, 2],
      [-0.00118, 0],
      [-0.00134, 0],
      [0.00239, 1],
      [-0.00016, 2],
      [-0.00087, 0],
      [-0.00064, 2]
    ],
    "red_o_points": [],
    "y_categories": ["N", "NOT APPLICABLE", "nan"],
    "blue_o_points": [],
    "blue_x_points": [
      [0.00392, 1],
      [0.00022, 2],
      [0.00327, 1],
      [0.00117, 0],
      [-0.00032, 0],
      [0.00371, 1],
      [-0.00022, 2],
      [0.00319, 1],
      [3e-5, 2],
      [4e-5, 2]
    ]
  },
  "QA_lstPexMuscstrength[FingersAddu]": {
    "red_x_points": [
      [0.00141, 0],
      [-4e-5, 2],
      [-0.00434, 1],
      [-0.00381, 1],
      [-0.00569, 1],
      [0.00139, 0],
      [0.0015, 0],
      [-0.00469, 1],
      [0.00118, 0],
      [0.00135, 0],
      [4e-5, 2],
      [0.00182, 0],
      [0.00129, 0],
      [7e-5, 2],
      [0.00038, 2],
      [-0.00011, 2],
      [0.00143, 0],
      [5e-5, 2],
      [0.00025, 2],
      [0.00123, 0],
      [-0.00543, 1],
      [0.00135, 0],
      [-0.00385, 1],
      [0.00029, 2],
      [0.00052, 2],
      [0.00028, 2],
      [0.00022, 2],
      [-0.00414, 1],
      [0.00016, 2],
      [-0.00598, 1],
      [-0.00434, 1],
      [0.00019, 2]
    ],
    "red_o_points": [],
    "y_categories": ["GREATER THAN OR EQUALS TO 3", "LESS THAN 3", "nan"],
    "blue_o_points": [],
    "blue_x_points": [
      [0.00016, 2],
      [0.00055, 2],
      [0.00143, 0],
      [0.00103, 2],
      [0.00341, 0],
      [0.00123, 0],
      [0.00465, 0],
      [0.00126, 0],
      [0.00102, 2],
      [0.0011, 2]
    ]
  },
  "QS_mulNeuromadSite[T1]": {
    "red_x_points": [
      [-0.00012, 2],
      [-0.00096, 0],
      [-0.00087, 0],
      [-0.00083, 0],
      [-0.00023, 2],
      [-0.00118, 0],
      [-0.00118, 0],
      [-0.00096, 0],
      [-0.00022, 2],
      [-0.00125, 0],
      [-0.00129, 0],
      [-0.00113, 0],
      [-0.00016, 2],
      [0.00126, 1],
      [-0.0003, 2],
      [-0.00119, 0],
      [-0.00025, 2],
      [-0.00103, 0],
      [-0.0002, 2],
      [-0.00015, 2],
      [-6e-5, 2],
      [-0.00012, 2],
      [-0.00095, 0],
      [-0.00026, 2],
      [-0.00025, 2],
      [-0.00019, 2],
      [-0.00084, 0],
      [-0.00063, 0],
      [0.00133, 1],
      [-0.00015, 2],
      [-0.00078, 0],
      [-0.00029, 2]
    ],
    "red_o_points": [],
    "y_categories": ["N", "NOT APPLICABLE", "nan"],
    "blue_o_points": [],
    "blue_x_points": [
      [0.00269, 1],
      [0.0, 2],
      [0.00168, 1],
      [0.00045, 0],
      [-0.00038, 0],
      [0.00173, 1],
      [-0.00012, 2],
      [0.00226, 1],
      [3e-5, 2],
      [0.00032, 2]
    ]
  },
  "QA_yonInjFracture": {
    "red_x_points": [
      [-0.00847, 0],
      [-0.0009, 2],
      [0.00069, 0],
      [-0.00143, 1],
      [-0.00856, 0],
      [0.00063, 0],
      [0.00061, 0],
      [-0.00224, 1],
      [0.00537, 2],
      [0.0009, 0],
      [-0.00226, 1],
      [-0.0048, 1],
      [-0.00889, 0],
      [-0.00145, 0],
      [0.00562, 1],
      [-0.00199, 1],
      [-0.00916, 0],
      [-0.00228, 1],
      [-0.01024, 0],
      [-0.00937, 0],
      [0.00484, 1],
      [-0.00977, 0],
      [-0.001, 1],
      [-0.00934, 0],
      [-0.00929, 0],
      [-0.00981, 0],
      [0.00073, 0],
      [0.00058, 0],
      [-0.00697, 1],
      [0.00531, 2],
      [-0.0031, 1],
      [0.00454, 1]
    ],
    "red_o_points": [],
    "y_categories": ["N", "Y", "nan"],
    "blue_o_points": [],
    "blue_x_points": [
      [0.00175, 0],
      [0.01018, 1],
      [0.00098, 0],
      [0.00425, 0],
      [0.00333, 0],
      [0.00145, 1],
      [0.01143, 2],
      [0.00097, 0],
      [0.01133, 1],
      [0.01224, 2]
    ]
  },
  "QS_mulGraftNerve[Ac]": {
    "red_x_points": [
      [4e-5, 2],
      [-0.00051, 0],
      [-0.00046, 0],
      [-0.00045, 0],
      [-8e-5, 2],
      [-0.00057, 0],
      [-0.00057, 0],
      [-0.00056, 0],
      [-5e-5, 2],
      [-0.00066, 0],
      [-0.00074, 0],
      [-0.00067, 0],
      [3e-5, 2],
      [0.0006, 1],
      [4e-5, 2],
      [-0.00053, 0],
      [-0.00013, 2],
      [-0.00057, 0],
      [-1e-5, 2],
      [-4e-5, 2],
      [0.0001, 2],
      [-4e-5, 2],
      [-0.00036, 0],
      [-6e-5, 2],
      [-1e-5, 2],
      [-4e-5, 2],
      [-0.0005, 0],
      [-0.00039, 0],
      [0.00058, 1],
      [-2e-5, 2],
      [-0.00049, 0],
      [-5e-5, 2]
    ],
    "red_o_points": [],
    "y_categories": ["N", "NOT APPLICABLE", "nan"],
    "blue_o_points": [],
    "blue_x_points": [
      [0.00102, 1],
      [0.00014, 2],
      [0.001, 1],
      [-0.00018, 0],
      [-9e-5, 0],
      [0.00109, 1],
      [5e-5, 2],
      [0.00092, 1],
      [2e-5, 2],
      [0.00015, 2]
    ]
  },
  "QS_mulGraftNerve[Me]": {
    "red_x_points": [
      [-1e-5, 2],
      [-6e-5, 0],
      [-4e-5, 0],
      [-9e-5, 0],
      [-1e-5, 2],
      [-9e-5, 0],
      [-0.0001, 0],
      [-6e-5, 0],
      [-2e-5, 2],
      [-0.0001, 0],
      [-0.0001, 0],
      [-0.0001, 0],
      [-0.0, 2],
      [9e-5, 1],
      [0.0, 2],
      [-9e-5, 0],
      [0.0, 2],
      [-6e-5, 0],
      [-1e-5, 2],
      [-1e-5, 2],
      [-1e-5, 2],
      [-1e-5, 2],
      [-0.0001, 0],
      [-0.0, 2],
      [-1e-5, 2],
      [-1e-5, 2],
      [-0.0001, 0],
      [-6e-5, 0],
      [0.0002, 1],
      [-1e-5, 2],
      [-6e-5, 0],
      [-1e-5, 2]
    ],
    "red_o_points": [],
    "y_categories": ["N", "NOT APPLICABLE", "nan"],
    "blue_o_points": [],
    "blue_x_points": [
      [0.0002, 1],
      [-1e-5, 2],
      [0.0002, 1],
      [-6e-5, 0],
      [-4e-5, 0],
      [0.00025, 1],
      [0.0, 2],
      [9e-5, 1],
      [-0.0, 2],
      [-1e-5, 2]
    ]
  },
  "QS_mulGraftNerve[LT]": {
    "red_x_points": [
      [-0.0, 0],
      [-2e-5, 2],
      [-0.0, 0],
      [-0.0, 0],
      [-2e-5, 2],
      [-2e-5, 2],
      [-2e-5, 2],
      [-2e-5, 2],
      [-2e-5, 2],
      [-2e-5, 2]
    ],
    "red_o_points": [],
    "y_categories": ["N", "NOT APPLICABLE", "nan"],
    "blue_o_points": [],
    "blue_x_points": [
      [-0.0, 0],
      [-0.0, 0],
      [-2e-5, 2],
      [0.00012, 1],
      [-2e-5, 2]
    ]
  },
  "QS_mulNeuromadSite[C8]": {
    "red_x_points": [
      [-0.00052, 2],
      [-0.00219, 0],
      [-0.00202, 0],
      [-0.00222, 0],
      [-0.00049, 2],
      [-0.00285, 0],
      [-0.00231, 0],
      [-0.00234, 0],
      [-0.00129, 2],
      [-0.00229, 0],
      [-0.00278, 0],
      [-0.00215, 0],
      [-0.00092, 2],
      [0.00281, 1],
      [-0.00023, 2],
      [-0.00251, 0],
      [-0.00095, 2],
      [-0.0021, 0],
      [-0.00084, 2],
      [-0.00124, 2],
      [-0.00041, 2],
      [-0.00127, 2],
      [-0.00199, 0],
      [-0.00031, 2],
      [-0.00129, 2],
      [-0.00038, 2],
      [-0.00244, 0],
      [-0.00179, 0],
      [0.00276, 1],
      [-0.00032, 2],
      [-0.00197, 0],
      [-0.00052, 2]
    ],
    "red_o_points": [],
    "y_categories": ["N", "NOT APPLICABLE", "nan"],
    "blue_o_points": [],
    "blue_x_points": [
      [0.00575, 1],
      [9e-5, 2],
      [0.00596, 1],
      [0.00095, 0],
      [-0.00061, 0],
      [0.00614, 1],
      [-0.00028, 2],
      [0.00558, 1],
      [-0.00012, 2],
      [0.00015, 2]
    ]
  },
  "QS_mulGraftNerve[Ph]": {
    "red_x_points": [
      [-0.00011, 2],
      [-0.00031, 0],
      [-0.00021, 0],
      [-0.00032, 0],
      [-0.00011, 2],
      [-0.00033, 0],
      [-0.00038, 0],
      [-0.00024, 0],
      [-5e-5, 2],
      [-0.00025, 0],
      [-0.00016, 0],
      [-0.00035, 0],
      [-9e-5, 2],
      [0.00071, 1],
      [-0.0001, 2],
      [-0.00033, 0],
      [-8e-5, 2],
      [-0.0002, 0],
      [-0.00041, 2],
      [-7e-5, 2],
      [-0.0001, 2],
      [-4e-5, 2],
      [-0.00025, 0],
      [-5e-5, 2],
      [-0.00028, 2],
      [-5e-5, 2],
      [-0.00034, 0],
      [-0.00034, 0],
      [0.00057, 1],
      [-0.0, 2],
      [-0.00026, 0],
      [-4e-5, 2]
    ],
    "red_o_points": [],
    "y_categories": ["N", "NOT APPLICABLE", "nan"],
    "blue_o_points": [],
    "blue_x_points": [
      [0.00109, 1],
      [-0.00012, 2],
      [0.00039, 1],
      [0.00011, 0],
      [-5e-5, 0],
      [0.00063, 1],
      [-3e-5, 2],
      [0.00053, 1],
      [-5e-5, 2],
      [2e-5, 2]
    ]
  },
  "QS_mulTransfSite[AcSsPA]": {
    "red_x_points": [
      [-0.00015, 3],
      [-0.00165, 0],
      [-0.00128, 0],
      [-0.00145, 0],
      [-0.00014, 3],
      [-0.00161, 0],
      [-0.00115, 0],
      [-0.00148, 0],
      [-0.00014, 3],
      [-0.00145, 0],
      [-0.00163, 0],
      [-0.00136, 0],
      [-0.00026, 3],
      [0.00338, 1],
      [-0.00011, 3],
      [-0.00133, 0],
      [-0.00032, 3],
      [-0.00343, 2],
      [-0.0002, 3],
      [-0.00034, 3],
      [-9e-5, 3],
      [-0.00013, 3],
      [-0.00132, 0],
      [-0.00023, 3],
      [-0.00032, 3],
      [-0.00012, 3],
      [-0.00166, 0],
      [-0.00116, 0],
      [0.00258, 1],
      [-8e-5, 3],
      [-0.0013, 0],
      [-0.00019, 3]
    ],
    "red_o_points": [],
    "y_categories": ["N", "NOT APPLICABLE", "Y", "nan"],
    "blue_o_points": [],
    "blue_x_points": [
      [0.00391, 1],
      [0.00013, 3],
      [0.00321, 1],
      [-0.00058, 0],
      [-0.00057, 0],
      [0.00287, 1],
      [-0.00018, 3],
      [0.00376, 1],
      [1e-5, 3],
      [7e-5, 3]
    ]
  },
  "QA_lstPexMuscstrength[FingersFlex]": {
    "red_x_points": [
      [0.00011, 0],
      [0.00047, 2],
      [-0.00177, 1],
      [-0.00127, 1],
      [0.0001, 0],
      [0.00018, 0],
      [-2e-5, 0],
      [-0.00266, 1],
      [-0.00035, 0],
      [0.00025, 0],
      [0.00013, 0],
      [0.00025, 0],
      [-0.00382, 1],
      [0.00033, 2],
      [0.00039, 2],
      [0.00031, 2],
      [-1e-5, 0],
      [0.00032, 2],
      [0.00052, 2],
      [-8e-5, 0],
      [-0.00393, 1],
      [-0.0002, 0],
      [-0.00125, 1],
      [0.00071, 2],
      [0.00081, 2],
      [0.00086, 2],
      [9e-5, 0],
      [0.00011, 0],
      [0.00043, 2],
      [-0.00413, 1],
      [-0.00243, 1],
      [0.00035, 2]
    ],
    "red_o_points": [],
    "y_categories": ["GREATER THAN OR EQUALS TO 3", "LESS THAN 3", "nan"],
    "blue_o_points": [],
    "blue_x_points": [
      [0.00026, 2],
      [0.00072, 2],
      [0.00034, 0],
      [0.00138, 2],
      [0.00126, 0],
      [0.00026, 0],
      [0.00165, 0],
      [0.00017, 0],
      [0.00168, 2],
      [0.00144, 2]
    ]
  },
  "QA_lstPexMuscstrength[ScapulaAbducSuprot]": {
    "red_x_points": [
      [-0.00401, 0],
      [5e-5, 2],
      [-0.00225, 1],
      [-0.0008, 1],
      [-0.00379, 0],
      [-0.00017, 0],
      [-0.00207, 1],
      [-0.00249, 1],
      [0.00024, 1],
      [0.00068, 0],
      [-0.0006, 0],
      [-0.00399, 1],
      [-0.00045, 1],
      [0.00011, 2],
      [0.00056, 2],
      [0.00027, 2],
      [0.0012, 2],
      [3e-5, 2],
      [0.00047, 2],
      [-0.00861, 0],
      [0.00038, 1],
      [-0.00769, 0],
      [-0.00089, 1],
      [0.00096, 2],
      [-0.00702, 0],
      [0.00141, 2],
      [-0.00268, 1],
      [0.00031, 0],
      [0.00024, 2],
      [-0.00336, 0],
      [-0.00192, 1],
      [0.00071, 2]
    ],
    "red_o_points": [],
    "y_categories": ["GREATER THAN OR EQUALS TO 3", "LESS THAN 3", "nan"],
    "blue_o_points": [],
    "blue_x_points": [
      [0.00028, 2],
      [0.00092, 2],
      [0.00043, 0],
      [0.00285, 2],
      [0.00542, 0],
      [0.00016, 0],
      [0.00474, 2],
      [0.00037, 2],
      [0.00975, 1],
      [0.00414, 2]
    ]
  },
  "participant_code": {
    "red_x_points": [
      [-0.02723, 1],
      [-0.025, 2],
      [-0.02435, 3],
      [-0.02505, 4],
      [-0.0247, 5],
      [-0.02552, 6],
      [-0.02511, 7],
      [-0.02505, 8],
      [-0.02511, 9],
      [-0.02523, 10],
      [-0.02558, 11],
      [-0.02535, 12],
      [-0.02352, 13],
      [-0.02505, 15],
      [-0.02517, 17],
      [-0.0247, 18],
      [-0.02494, 20],
      [-0.02488, 21],
      [-0.02429, 22],
      [-0.02376, 24],
      [-0.02441, 26],
      [-0.02588, 27],
      [-0.02541, 28],
      [-0.02588, 30],
      [-0.0257, 31],
      [-0.02505, 32],
      [-0.02482, 34],
      [-0.02588, 36],
      [-0.02494, 38],
      [-0.0257, 39],
      [-0.02535, 40],
      [-0.02452, 41]
    ],
    "red_o_points": [],
    "y_categories": [
      "P16554",
      "P18297",
      "P19283",
      "P19287",
      "P23391",
      "P30595",
      "P31645",
      "P31691",
      "P34778",
      "P35046",
      "P36328",
      "P43633",
      "P4544",
      "P46417",
      "P48965",
      "P53068",
      "P5497",
      "P59529",
      "P62483",
      "P64658",
      "P65202",
      "P66816",
      "P6751",
      "P7408",
      "P75566",
      "P76226",
      "P79971",
      "P82621",
      "P82990",
      "P84549",
      "P84932",
      "P85825",
      "P86989",
      "P8770",
      "P87791",
      "P90550",
      "P93159",
      "P94969",
      "P96710",
      "P97130",
      "P9744",
      "P98500",
      "nan"
    ],
    "blue_o_points": [],
    "blue_x_points": [
      [0.05222, 0],
      [0.05194, 14],
      [0.04926, 16],
      [0.05152, 19],
      [0.05124, 23],
      [0.0542, 25],
      [0.05067, 29],
      [0.04997, 33],
      [0.05829, 35],
      [0.0511, 37]
    ]
  },
  "QA_lstPexTouch[T1]": {
    "red_x_points": [
      [-0.00875, 1],
      [-0.00235, 2],
      [0.0005, 1],
      [-0.00218, 2],
      [-0.00882, 1],
      [-0.00798, 0],
      [0.00145, 1],
      [0.00166, 1],
      [-0.0106, 1],
      [-0.0049, 0],
      [-0.00349, 0],
      [-0.00709, 0],
      [0.0067, 0],
      [-0.00675, 2],
      [-0.00371, 2],
      [-0.00323, 2],
      [-0.00971, 1],
      [-0.00216, 2],
      [-0.00436, 2],
      [0.00636, 0],
      [-0.01143, 1],
      [0.00758, 0],
      [-0.00309, 2],
      [-0.00436, 2],
      [-0.00991, 1],
      [0.00754, 0],
      [0.00277, 1],
      [-0.00279, 2],
      [-0.00211, 1],
      [-0.00547, 2],
      [-9e-5, 1],
      [-0.0105, 1]
    ],
    "red_o_points": [],
    "y_categories": ["NORM", "NPV", "nan"],
    "blue_o_points": [],
    "blue_x_points": [
      [0.00027, 1],
      [0.00099, 2],
      [0.00115, 1],
      [0.00717, 1],
      [0.01032, 1],
      [0.00062, 1],
      [0.01177, 0],
      [0.00365, 0],
      [0.01055, 0],
      [0.01366, 0]
    ]
  },
  "QA_mulInjOrthesisType[ArmSling]": {
    "red_x_points": [
      [-0.00589, 2],
      [-0.00575, 2],
      [-0.00613, 2],
      [-0.0056, 2],
      [-0.00584, 2],
      [-0.00627, 2],
      [-0.00604, 2],
      [-0.00568, 2],
      [-0.00553, 2],
      [-0.00665, 2],
      [-0.00565, 2],
      [-0.00648, 2],
      [-0.00581, 2],
      [0.01061, 1],
      [-0.00751, 2],
      [-0.00636, 2],
      [-0.00694, 2],
      [-0.00974, 0],
      [0.01272, 1],
      [-0.00535, 2],
      [-0.00591, 2],
      [-0.01735, 0],
      [-0.00334, 3],
      [-0.00741, 2],
      [0.00599, 1],
      [-0.0061, 2],
      [-0.00607, 2],
      [-0.0052, 2],
      [-0.01218, 3],
      [-0.00131, 3],
      [-0.00578, 2],
      [-0.00687, 2]
    ],
    "red_o_points": [],
    "y_categories": ["N", "NOT APPLICABLE", "Y", "nan"],
    "blue_o_points": [],
    "blue_x_points": [
      [0.00345, 2],
      [0.02001, 1],
      [0.01524, 1],
      [0.03195, 1],
      [-0.0042, 2],
      [0.01316, 1],
      [-0.00276, 2],
      [0.01439, 1],
      [-0.0014, 2],
      [0.01105, 3]
    ]
  },
  "QS_mulGraftNerve[Ul]": {
    "red_x_points": [
      [-3e-5, 2],
      [-9e-5, 0],
      [-4e-5, 0],
      [-0.0001, 0],
      [-1e-5, 2],
      [-0.00012, 0],
      [-6e-5, 0],
      [-0.00013, 0],
      [-3e-5, 2],
      [-0.00013, 0],
      [-6e-5, 0],
      [-6e-5, 0],
      [-3e-5, 2],
      [0.00021, 1],
      [-1e-5, 2],
      [-0.00013, 0],
      [-2e-5, 2],
      [-0.0001, 0],
      [-3e-5, 2],
      [-3e-5, 2],
      [-2e-5, 2],
      [-9e-5, 0],
      [-3e-5, 2],
      [-0.00017, 2],
      [-3e-5, 2],
      [-7e-5, 0],
      [0.00019, 1],
      [-3e-5, 2],
      [-6e-5, 0],
      [-3e-5, 2]
    ],
    "red_o_points": [],
    "y_categories": ["N", "NOT APPLICABLE", "nan"],
    "blue_o_points": [],
    "blue_x_points": [
      [0.00031, 1],
      [-3e-5, 2],
      [0.0002, 1],
      [-9e-5, 0],
      [-5e-5, 0],
      [0.0004, 1],
      [-3e-5, 2],
      [0.00016, 1],
      [0.0, 2],
      [-1e-5, 2]
    ]
  },
  "QA_mulInjOrthesisType[ShoulderSupport]": {
    "red_x_points": [
      [-0.00617, 0],
      [-0.00614, 0],
      [-0.00634, 0],
      [-0.00622, 0],
      [-0.00599, 0],
      [-0.00614, 0],
      [-0.00618, 0],
      [-0.00609, 0],
      [-0.01739, 2],
      [-0.0068, 0],
      [-0.00591, 0],
      [-0.00672, 0],
      [-0.00591, 0],
      [0.01307, 1],
      [-0.0074, 0],
      [-0.00658, 0],
      [-0.00685, 0],
      [-0.01288, 2],
      [0.01489, 1],
      [-0.00506, 0],
      [-0.00635, 0],
      [-0.01834, 2],
      [-0.00358, 3],
      [-0.00733, 0],
      [0.00972, 1],
      [-0.00637, 0],
      [-0.00665, 0],
      [-0.0057, 0],
      [-0.01126, 3],
      [-0.00248, 3],
      [-0.00588, 0],
      [-0.0073, 0]
    ],
    "red_o_points": [],
    "y_categories": ["N", "NOT APPLICABLE", "Y", "nan"],
    "blue_o_points": [],
    "blue_x_points": [
      [0.00333, 0],
      [0.02189, 1],
      [0.01601, 1],
      [0.03269, 1],
      [-0.00436, 0],
      [0.01623, 1],
      [-0.00249, 0],
      [0.01517, 1],
      [-0.00195, 0],
      [0.01103, 3]
    ]
  },
  "QA_yonInjUnconscio": {
    "red_x_points": [
      [-0.00464, 1],
      [-0.00669, 1],
      [-0.00452, 2],
      [-0.00372, 2],
      [-0.00401, 2],
      [0.01767, 0],
      [-0.00711, 1],
      [-0.00452, 2],
      [-0.00426, 2],
      [-0.00495, 2],
      [-0.00508, 2],
      [-0.00955, 1],
      [-0.00589, 1],
      [-0.01659, 1],
      [-0.00662, 2],
      [-0.00407, 2],
      [-0.00351, 2],
      [-0.0069, 1],
      [0.00321, 0],
      [-0.00793, 1],
      [-0.00553, 1],
      [-0.00682, 1],
      [-0.0061, 1],
      [-0.00551, 2],
      [-0.00695, 1],
      [-0.00495, 2],
      [-0.00714, 1],
      [-0.00613, 1],
      [-0.00154, 2],
      [-0.00402, 2],
      [-0.00695, 1],
      [-0.0043, 2]
    ],
    "red_o_points": [],
    "y_categories": ["N", "Y", "nan"],
    "blue_o_points": [],
    "blue_x_points": [
      [0.00057, 2],
      [0.00752, 1],
      [0.01474, 0],
      [0.02375, 0],
      [0.02552, 0],
      [0.00065, 2],
      [-0.00158, 1],
      [0.00088, 2],
      [0.02565, 0],
      [-0.00023, 2]
    ]
  },
  "QS_mulTransfSite[Other]": {
    "red_x_points": [
      [-0.00183, 3],
      [-0.01311, 0],
      [-0.01258, 0],
      [-0.01312, 0],
      [-0.00229, 3],
      [-0.01359, 0],
      [-0.01338, 0],
      [-0.01314, 0],
      [-0.00205, 3],
      [-0.01419, 0],
      [-0.01422, 0],
      [-0.013, 0],
      [-0.00215, 3],
      [0.01885, 1],
      [-0.00205, 3],
      [-0.01358, 0],
      [-0.00238, 3],
      [-0.01318, 0],
      [-0.00242, 3],
      [-0.00188, 3],
      [-0.00195, 3],
      [-0.00185, 3],
      [-0.01234, 0],
      [-0.00175, 3],
      [-0.00281, 3],
      [-0.00194, 3],
      [-0.01358, 0],
      [-0.01259, 0],
      [0.02085, 1],
      [-0.00187, 3],
      [-0.01259, 0],
      [-0.00191, 3]
    ],
    "red_o_points": [],
    "y_categories": ["N", "NOT APPLICABLE", "Y", "nan"],
    "blue_o_points": [],
    "blue_x_points": [
      [0.02165, 1],
      [-0.00081, 3],
      [0.02098, 1],
      [-0.00587, 0],
      [0.04404, 2],
      [0.01976, 1],
      [-0.00039, 3],
      [0.02211, 1],
      [-0.0005, 3],
      [-0.0008, 3]
    ]
  },
  "QA_lstInjTpbiSide": {
    "red_x_points": [
      [-0.00388, 1],
      [0.00104, 0],
      [-0.00049, 0],
      [0.00027, 0],
      [-0.00052, 0],
      [-0.00069, 1],
      [-0.00129, 0],
      [-0.00222, 0],
      [-0.00429, 1],
      [-0.00195, 0],
      [-0.00143, 1],
      [-0.00187, 1],
      [-0.00376, 1],
      [-0.01253, 0],
      [-0.00837, 1],
      [-0.00267, 1],
      [0.00103, 0],
      [-0.0029, 1],
      [-0.00805, 1],
      [-0.0001, 0],
      [0.00058, 0],
      [-0.00031, 0],
      [2e-5, 0],
      [0.00277, 0],
      [-0.00801, 1],
      [-0.00538, 1],
      [-0.00146, 1],
      [-0.00036, 1],
      [-0.01477, 0],
      [-0.00532, 1],
      [-0.00134, 0],
      [0.00174, 0]
    ],
    "red_o_points": [],
    "y_categories": ["L", "R", "nan"],
    "blue_o_points": [],
    "blue_x_points": [
      [-0.00455, 0],
      [0.00817, 0],
      [0.00835, 1],
      [0.00495, 0],
      [0.00395, 1],
      [0.00933, 1],
      [0.00324, 1],
      [0.00713, 1],
      [0.00621, 0],
      [0.00653, 0]
    ]
  },
  "QA_lstPexArthre[Shoulder]": {
    "red_x_points": [
      [-0.00108, 2],
      [-0.00193, 3],
      [-0.00256, 3],
      [-0.00261, 0],
      [-0.00435, 3],
      [-0.0041, 2],
      [-0.00135, 2],
      [0.0011, 1],
      [-0.00634, 3],
      [-0.00186, 2],
      [-0.00235, 2],
      [-0.00273, 2],
      [-0.0015, 2],
      [-0.00066, 3],
      [-0.00237, 3],
      [-0.00138, 2],
      [-0.00395, 3],
      [-0.00145, 3],
      [-0.00227, 3],
      [-0.00214, 2],
      [-0.00068, 1],
      [-0.00254, 2],
      [-0.0018, 3],
      [-0.00259, 3],
      [-0.00178, 2],
      [-0.00426, 3],
      [-0.00466, 3],
      [-0.00257, 3],
      [-0.00046, 3],
      [-0.00212, 3],
      [0.00114, 1],
      [-0.0039, 3]
    ],
    "red_o_points": [],
    "y_categories": ["NAIA", "NPV", "PV", "nan"],
    "blue_o_points": [],
    "blue_x_points": [
      [0.0004, 2],
      [-0.00053, 3],
      [-0.00023, 2],
      [0.00219, 2],
      [0.01875, 1],
      [-0.00026, 2],
      [0.02033, 1],
      [-0.00019, 3],
      [0.00315, 2],
      [0.0021, 2]
    ]
  },
  "QA_lstPexPain[C5]": {
    "red_x_points": [
      [-0.00199, 1],
      [-0.0039, 2],
      [-0.00398, 2],
      [-0.00394, 2],
      [-0.00219, 1],
      [-0.00075, 1],
      [-0.00057, 1],
      [-0.00081, 1],
      [-0.00279, 1],
      [-0.0008, 1],
      [-0.00084, 1],
      [-0.00073, 1],
      [-0.00202, 1],
      [-0.01387, 2],
      [-0.00553, 2],
      [-0.00421, 2],
      [-0.00517, 2],
      [-0.00365, 2],
      [-0.00497, 2],
      [-0.00206, 1],
      [-0.0018, 1],
      [-0.00214, 1],
      [-0.00497, 2],
      [-0.00543, 2],
      [-0.00202, 1],
      [-0.00609, 2],
      [-0.00352, 2],
      [-0.00339, 2],
      [-0.00455, 1],
      [-0.00378, 1],
      [-0.00058, 1],
      [-0.00242, 1]
    ],
    "red_o_points": [],
    "y_categories": ["NORM", "NPV", "nan"],
    "blue_o_points": [],
    "blue_x_points": [
      [0.02019, 0],
      [-0.00277, 2],
      [2e-5, 1],
      [-0.0002, 1],
      [-0.00042, 1],
      [0.0, 1],
      [-0.00052, 1],
      [0.01643, 0],
      [-0.0012, 1],
      [0.03678, 0]
    ]
  },
  "QS_mulBpsurgeryType[Lysis]": {
    "red_x_points": [
      [-0.00153, 3],
      [-0.00448, 0],
      [-0.01131, 2],
      [-0.00548, 0],
      [-0.00165, 3],
      [-0.00558, 0],
      [-0.01271, 2],
      [-0.00487, 0],
      [-0.00189, 3],
      [-0.00545, 0],
      [-0.00557, 0],
      [-0.00447, 0],
      [-0.00202, 3],
      [0.01126, 1],
      [-0.00162, 3],
      [-0.00542, 0],
      [-0.00166, 3],
      [-0.01092, 2],
      [-0.0028, 3],
      [-0.00199, 3],
      [-0.00151, 3],
      [-0.00138, 3],
      [-0.00519, 0],
      [-0.00192, 3],
      [-0.0026, 3],
      [-0.00181, 3],
      [-0.00485, 0],
      [-0.00435, 0],
      [0.012, 1],
      [-0.00143, 3],
      [-0.01116, 2],
      [-0.00184, 3]
    ],
    "red_o_points": [],
    "y_categories": ["N", "NOT APPLICABLE", "Y", "nan"],
    "blue_o_points": [],
    "blue_x_points": [
      [0.01793, 1],
      [-0.0002, 3],
      [0.01641, 1],
      [0.00178, 0],
      [-0.00036, 0],
      [0.01512, 1],
      [-0.001, 3],
      [0.0156, 1],
      [-0.00041, 3],
      [3e-5, 3]
    ]
  },
  "QS_mulLysisSite[Trunk]": {
    "red_x_points": [
      [-0.00094, 3],
      [-0.00376, 0],
      [-0.00325, 0],
      [-0.00356, 0],
      [-0.00092, 3],
      [-0.00432, 0],
      [-0.00843, 2],
      [-0.00314, 0],
      [-0.00118, 3],
      [-0.00325, 0],
      [-0.00401, 0],
      [-0.00358, 0],
      [-0.00106, 3],
      [0.0067, 1],
      [-0.00046, 3],
      [-0.00366, 0],
      [-0.00097, 3],
      [-0.0073, 2],
      [-0.00127, 3],
      [-0.00134, 3],
      [-0.00071, 3],
      [-0.0012, 3],
      [-0.00308, 0],
      [-0.00061, 3],
      [-0.00119, 3],
      [-0.00059, 3],
      [-0.00352, 0],
      [-0.0031, 0],
      [0.00765, 1],
      [-0.00066, 3],
      [-0.0074, 2],
      [-0.00069, 3]
    ],
    "red_o_points": [],
    "y_categories": ["N", "NOT APPLICABLE", "Y", "nan"],
    "blue_o_points": [],
    "blue_x_points": [
      [0.01142, 1],
      [0.00033, 3],
      [0.00893, 1],
      [0.00053, 0],
      [-0.00099, 0],
      [0.0099, 1],
      [-0.00042, 3],
      [0.00979, 1],
      [-0.00031, 3],
      [-2e-5, 3]
    ]
  },
  "QA_lstPexTouch[C8]": {
    "red_x_points": [
      [-0.00696, 1],
      [-0.0025, 2],
      [-0.00255, 1],
      [-0.00286, 2],
      [-0.00648, 1],
      [0.00295, 0],
      [-0.00255, 1],
      [-0.00288, 1],
      [0.00464, 0],
      [-0.00294, 1],
      [0.00307, 0],
      [0.00252, 0],
      [-0.00836, 1],
      [-0.01329, 2],
      [-0.00466, 2],
      [-0.00326, 2],
      [-0.00768, 1],
      [-0.00216, 2],
      [-0.00481, 2],
      [0.00627, 0],
      [-0.00775, 1],
      [0.00474, 0],
      [-0.00232, 2],
      [-0.00417, 2],
      [0.00347, 0],
      [0.00585, 0],
      [-0.00257, 1],
      [-0.00238, 2],
      [-0.00713, 1],
      [-0.0037, 2],
      [-0.00214, 1],
      [-0.007, 1]
    ],
    "red_o_points": [],
    "y_categories": ["NORM", "NPV", "nan"],
    "blue_o_points": [],
    "blue_x_points": [
      [0.01036, 0],
      [-0.00053, 2],
      [0.00012, 1],
      [0.00132, 1],
      [0.00583, 0],
      [0.00034, 1],
      [0.00859, 0],
      [0.00483, 0],
      [0.0077, 0],
      [0.00987, 0]
    ]
  },
  "QS_mulGraftTrunk[UpperTrunk]": {
    "red_x_points": [
      [-0.00037, 3],
      [-0.00101, 0],
      [-0.00119, 0],
      [-0.00126, 0],
      [-0.00037, 3],
      [-0.00117, 0],
      [-0.00103, 0],
      [-0.00115, 0],
      [-0.00036, 3],
      [-0.00131, 0],
      [-0.00132, 0],
      [-0.00131, 0],
      [-0.0003, 3],
      [0.00272, 1],
      [-0.00033, 3],
      [-0.00442, 2],
      [-0.00046, 3],
      [-0.00124, 0],
      [-0.00088, 3],
      [-0.00035, 3],
      [-0.0003, 3],
      [-0.00026, 3],
      [-0.00144, 0],
      [-0.00043, 3],
      [-0.00049, 3],
      [-0.00046, 3],
      [-0.0014, 0],
      [-0.00121, 0],
      [0.00211, 1],
      [-0.00046, 3],
      [-0.00108, 0],
      [-0.00041, 3]
    ],
    "red_o_points": [],
    "y_categories": ["N", "NOT APPLICABLE", "Y", "nan"],
    "blue_o_points": [],
    "blue_x_points": [
      [0.00366, 1],
      [-0.00028, 3],
      [0.00384, 1],
      [0.00065, 0],
      [-0.00099, 0],
      [0.00307, 1],
      [-0.0001, 3],
      [0.00366, 1],
      [-6e-5, 3],
      [9e-5, 3]
    ]
  },
  "QS_mulTransfSite[PhMc]": {
    "red_x_points": [
      [-0.001, 3],
      [-0.00293, 0],
      [-0.00319, 0],
      [-0.00351, 0],
      [-0.00106, 3],
      [-0.00369, 0],
      [-0.00327, 0],
      [-0.00775, 2],
      [-0.00132, 3],
      [-0.00314, 0],
      [-0.00338, 0],
      [-0.00275, 0],
      [-0.0012, 3],
      [0.00691, 1],
      [-0.00097, 3],
      [-0.00361, 0],
      [-0.00125, 3],
      [-0.00318, 0],
      [-0.00112, 3],
      [-0.00129, 3],
      [-0.00097, 3],
      [-0.0009, 3],
      [-0.00594, 2],
      [-0.00118, 3],
      [-0.00159, 3],
      [-0.00115, 3],
      [-0.00319, 0],
      [-0.00301, 0],
      [0.00743, 1],
      [-0.00094, 3],
      [-0.00297, 0],
      [-0.00114, 3]
    ],
    "red_o_points": [],
    "y_categories": ["N", "NOT APPLICABLE", "Y", "nan"],
    "blue_o_points": [],
    "blue_x_points": [
      [0.01012, 1],
      [-0.00042, 3],
      [0.00806, 1],
      [-0.00046, 0],
      [-0.00158, 0],
      [0.01007, 1],
      [-0.00056, 3],
      [0.00953, 1],
      [-0.00043, 3],
      [-8e-5, 3]
    ]
  },
  "QA_mulInjTbpiCause[Motorcycle]": {
    "red_x_points": [
      [-0.00245, 0],
      [-0.00045, 1],
      [-0.00058, 1],
      [-0.00042, 1],
      [-0.0002, 1],
      [-0.00036, 1],
      [-0.00025, 1],
      [-0.00041, 1],
      [0.00054, 1],
      [-0.00046, 1],
      [-8e-5, 1],
      [-4e-5, 1],
      [-0.00495, 0],
      [-0.03263, 1],
      [-0.00048, 1],
      [-0.00075, 1],
      [-7e-5, 1],
      [-0.00046, 1],
      [-0.00129, 1],
      [-0.00761, 0],
      [0.00038, 1],
      [0.00147, 1],
      [-0.00018, 1],
      [-0.00052, 1],
      [-0.00013, 1],
      [-0.00642, 0],
      [-0.00028, 1],
      [-0.00016, 1],
      [-0.0329, 1],
      [-8e-5, 1],
      [-0.00023, 1],
      [-0.00063, 1]
    ],
    "red_o_points": [],
    "y_categories": ["N", "Y", "nan"],
    "blue_o_points": [],
    "blue_x_points": [
      [0.01564, 0],
      [-0.00028, 1],
      [0.0126, 0],
      [-0.00097, 1],
      [5e-5, 1],
      [0.01386, 0],
      [0.00276, 1],
      [0.01242, 0],
      [0.00297, 1],
      [0.00257, 1]
    ]
  },
  "QS_mulLysisSite[Root]": {
    "red_x_points": [
      [-0.00064, 3],
      [-0.00164, 0],
      [-0.0049, 2],
      [-0.00161, 0],
      [-0.00048, 3],
      [-0.00184, 0],
      [-0.00156, 0],
      [-0.00152, 0],
      [-0.00079, 3],
      [-0.00148, 0],
      [-0.00165, 0],
      [-0.00135, 0],
      [-0.00053, 3],
      [0.00284, 1],
      [-0.00082, 3],
      [-0.00157, 0],
      [-0.00046, 3],
      [-0.0016, 0],
      [-0.00051, 3],
      [-0.00079, 3],
      [-0.00055, 3],
      [-0.00049, 3],
      [-0.00165, 0],
      [-0.00065, 3],
      [-0.00048, 3],
      [-0.00046, 3],
      [-0.00176, 0],
      [-0.00157, 0],
      [0.00433, 1],
      [-0.00043, 3],
      [-0.00525, 2],
      [-0.00058, 3]
    ],
    "red_o_points": [],
    "y_categories": ["N", "NOT APPLICABLE", "Y", "nan"],
    "blue_o_points": [],
    "blue_x_points": [
      [0.00577, 1],
      [-0.0003, 3],
      [0.00507, 1],
      [-0.00013, 0],
      [-0.00072, 0],
      [0.00545, 1],
      [-0.00027, 3],
      [0.00514, 1],
      [-0.0004, 3],
      [-0.00034, 3]
    ]
  },
  "QA_yonInjOrtsurg": {
    "red_x_points": [
      [-0.00125, 2],
      [-0.00023, 2],
      [-0.0, 2],
      [-2e-5, 2],
      [-0.00121, 2],
      [0.0003, 2],
      [0.00012, 2],
      [0.00047, 1],
      [-0.00152, 2],
      [-0.00161, 0],
      [0.00021, 1],
      [0.00019, 1],
      [-0.00136, 2],
      [-0.00632, 0],
      [0.00441, 1],
      [3e-5, 2],
      [-0.00149, 2],
      [-0.00188, 0],
      [-0.01165, 0],
      [-0.01055, 0],
      [0.00425, 1],
      [-0.00168, 2],
      [0.00053, 1],
      [-0.00221, 2],
      [-0.00118, 2],
      [-0.00181, 2],
      [-0.00162, 0],
      [-0.00144, 0],
      [0.00018, 1],
      [-0.00207, 2],
      [0.00031, 1],
      [-0.0015, 2]
    ],
    "red_o_points": [],
    "y_categories": ["N", "Y", "nan"],
    "blue_o_points": [],
    "blue_x_points": [
      [0.00042, 2],
      [0.01182, 1],
      [0.0008, 2],
      [0.00105, 2],
      [0.00038, 2],
      [0.00077, 2],
      [-0.0006, 2],
      [0.00069, 2],
      [0.01136, 1],
      [-0.00086, 2]
    ]
  },
  "QS_mulGraftLevel[Trunk]": {
    "red_x_points": [
      [-0.00045, 3],
      [-0.001, 0],
      [-0.00134, 0],
      [-0.0012, 0],
      [-0.00049, 3],
      [-0.00111, 0],
      [-0.00107, 0],
      [-0.00104, 0],
      [-0.00044, 3],
      [-0.00126, 0],
      [-0.00116, 0],
      [-0.00106, 0],
      [-0.00037, 3],
      [0.00203, 1],
      [-0.00043, 3],
      [-0.00405, 2],
      [-0.00035, 3],
      [-0.00097, 0],
      [-0.00034, 3],
      [-0.00041, 3],
      [-0.00028, 3],
      [-0.00039, 3],
      [-0.00118, 0],
      [-0.00052, 3],
      [-0.00041, 3],
      [-0.00048, 3],
      [-0.00124, 0],
      [-0.0011, 0],
      [0.00335, 1],
      [-0.00029, 3],
      [-0.00114, 0],
      [-0.00029, 3]
    ],
    "red_o_points": [],
    "y_categories": ["N", "NOT APPLICABLE", "Y", "nan"],
    "blue_o_points": [],
    "blue_x_points": [
      [0.00426, 1],
      [-0.00011, 3],
      [0.0032, 1],
      [-0.00039, 0],
      [-0.00069, 0],
      [0.00345, 1],
      [-0.0002, 3],
      [0.00339, 1],
      [-0.00017, 3],
      [-0.00027, 3]
    ]
  },
  "QS_mulGraftNerve[FI]": {
    "red_x_points": [
      [-3e-5, 2],
      [-0.00032, 0],
      [-0.00026, 0],
      [-0.0003, 0],
      [-5e-5, 2],
      [-0.00044, 0],
      [-0.00015, 0],
      [-0.00024, 0],
      [-6e-5, 2],
      [-0.00038, 0],
      [-0.00049, 0],
      [-0.00052, 0],
      [-3e-5, 2],
      [0.00056, 1],
      [-4e-5, 2],
      [-0.00034, 0],
      [-3e-5, 2],
      [-0.00036, 0],
      [-5e-5, 2],
      [-2e-5, 2],
      [-4e-5, 2],
      [-5e-5, 2],
      [-0.00022, 0],
      [-5e-5, 2],
      [-1e-5, 2],
      [-5e-5, 2],
      [-0.00033, 0],
      [-0.00039, 0],
      [0.00053, 1],
      [-4e-5, 2],
      [-0.00025, 0],
      [-2e-5, 2]
    ],
    "red_o_points": [],
    "y_categories": ["N", "NOT APPLICABLE", "nan"],
    "blue_o_points": [],
    "blue_x_points": [
      [0.00097, 1],
      [-4e-5, 2],
      [0.00063, 1],
      [-6e-5, 0],
      [-0.00017, 0],
      [0.00058, 1],
      [0.0, 2],
      [0.00082, 1],
      [2e-5, 2],
      [2e-5, 2]
    ]
  },
  "QS_mulGraftNerve[other]": {
    "red_x_points": [
      [-3e-5, 2],
      [-0.00018, 0],
      [-0.00014, 0],
      [-0.00019, 0],
      [-7e-5, 2],
      [-0.0002, 0],
      [-0.00024, 0],
      [-0.00015, 0],
      [-0.00018, 2],
      [-0.00025, 0],
      [-0.00031, 0],
      [-0.00016, 0],
      [-0.00023, 2],
      [0.00024, 1],
      [-0.0001, 2],
      [-0.00011, 0],
      [-2e-5, 2],
      [-0.00016, 0],
      [-9e-5, 2],
      [-0.00024, 2],
      [-4e-5, 2],
      [-0.00023, 2],
      [-0.00018, 0],
      [-7e-5, 2],
      [-7e-5, 2],
      [-3e-5, 2],
      [-0.00021, 0],
      [-0.0001, 0],
      [0.0004, 1],
      [-7e-5, 2],
      [-0.0001, 0],
      [-0.0001, 2]
    ],
    "red_o_points": [],
    "y_categories": ["N", "NOT APPLICABLE", "nan"],
    "blue_o_points": [],
    "blue_x_points": [
      [0.00047, 1],
      [4e-5, 2],
      [0.00072, 1],
      [-8e-5, 0],
      [-0.00011, 0],
      [0.00067, 1],
      [-4e-5, 2],
      [0.00068, 1],
      [-4e-5, 2],
      [-3e-5, 2]
    ]
  },
  "QS_mulTransfSite[AcSsAA]": {
    "red_x_points": [
      [-0.00181, 3],
      [-0.01337, 2],
      [-0.00325, 0],
      [-0.01323, 2],
      [-0.00176, 3],
      [-0.01861, 2],
      [-0.00322, 0],
      [-0.00321, 0],
      [-0.00182, 3],
      [-0.00305, 0],
      [-0.01473, 2],
      [-0.00369, 0],
      [-0.00152, 3],
      [0.01448, 1],
      [-0.00173, 3],
      [-0.01637, 2],
      [-0.00173, 3],
      [-0.00296, 0],
      [-0.00232, 3],
      [-0.0018, 3],
      [-0.00146, 3],
      [-0.00184, 3],
      [-0.01278, 2],
      [-0.00158, 3],
      [-0.00278, 3],
      [-0.00185, 3],
      [-0.00308, 0],
      [-0.01316, 2],
      [0.01637, 1],
      [-0.00185, 3],
      [-0.00327, 0],
      [-0.00145, 3]
    ],
    "red_o_points": [],
    "y_categories": ["N", "NOT APPLICABLE", "Y", "nan"],
    "blue_o_points": [],
    "blue_x_points": [
      [0.0201, 1],
      [0.0001, 3],
      [0.01826, 1],
      [0.00174, 0],
      [0.00087, 0],
      [0.01837, 1],
      [-0.0007, 3],
      [0.01876, 1],
      [-0.00076, 3],
      [-0.00043, 3]
    ]
  },
  "QS_mulGraftNerve[MP]": {
    "red_x_points": [
      [-1e-5, 2],
      [-4e-5, 0],
      [-1e-5, 2],
      [-4e-5, 0],
      [-4e-5, 0],
      [-4e-5, 0],
      [-1e-5, 2],
      [-4e-5, 0],
      [-4e-5, 0],
      [-4e-5, 0],
      [-1e-5, 2],
      [-1e-5, 2],
      [-4e-5, 0],
      [-4e-5, 0],
      [-1e-5, 2],
      [-1e-5, 2],
      [-4e-5, 0],
      [-1e-5, 2],
      [-1e-5, 2],
      [-1e-5, 2],
      [-4e-5, 0],
      [-4e-5, 0],
      [0.00011, 1],
      [-4e-5, 0]
    ],
    "red_o_points": [],
    "y_categories": ["N", "NOT APPLICABLE", "nan"],
    "blue_o_points": [],
    "blue_x_points": [
      [0.00011, 1],
      [-1e-5, 2],
      [0.00011, 1],
      [-4e-5, 0],
      [0.00011, 1],
      [-1e-5, 2],
      [0.00011, 1]
    ]
  },
  "QS_mulGraftNerve[Ax]": {
    "red_x_points": [
      [0.0, 2],
      [-3e-5, 0],
      [-2e-5, 0],
      [-4e-5, 2],
      [-3e-5, 0],
      [-3e-5, 0],
      [-2e-5, 0],
      [-3e-5, 0],
      [-3e-5, 0],
      [-2e-5, 0],
      [-4e-5, 2],
      [0.00011, 1],
      [-4e-5, 2],
      [-3e-5, 0],
      [-4e-5, 2],
      [-4e-5, 2],
      [-4e-5, 2],
      [-4e-5, 2],
      [-8e-5, 0],
      [-4e-5, 2],
      [-4e-5, 2],
      [-4e-5, 2],
      [-3e-5, 0],
      [-2e-5, 0],
      [-7e-5, 1],
      [-4e-5, 2],
      [-3e-5, 0],
      [-4e-5, 2]
    ],
    "red_o_points": [],
    "y_categories": ["N", "NOT APPLICABLE", "nan"],
    "blue_o_points": [],
    "blue_x_points": [
      [0.00028, 1],
      [0.00011, 1],
      [-2e-5, 0],
      [-3e-5, 0],
      [-4e-5, 2],
      [0.00011, 1],
      [0.0, 2],
      [0.00013, 2]
    ]
  },
  "QS_mulGraftNerve[Ra]": {
    "red_x_points": [
      [-3e-5, 2],
      [-3e-5, 0],
      [-3e-5, 0],
      [-3e-5, 2],
      [-3e-5, 0],
      [-3e-5, 0],
      [-3e-5, 0],
      [-3e-5, 2],
      [-3e-5, 0],
      [-3e-5, 0],
      [-3e-5, 0],
      [-3e-5, 2],
      [-3e-5, 2],
      [-3e-5, 2],
      [-3e-5, 2],
      [-3e-5, 2],
      [-3e-5, 2],
      [-3e-5, 0],
      [-3e-5, 2],
      [-3e-5, 2],
      [-3e-5, 0],
      [-3e-5, 0],
      [-3e-5, 2],
      [-3e-5, 2]
    ],
    "red_o_points": [],
    "y_categories": ["N", "NOT APPLICABLE", "nan"],
    "blue_o_points": [],
    "blue_x_points": [
      [0.00014, 1],
      [0.00014, 1],
      [-3e-5, 0],
      [-3e-5, 0],
      [0.00014, 1],
      [-3e-5, 2],
      [0.00014, 1],
      [-3e-5, 2]
    ]
  },
  "QS_mulNeuromadSite[C5]": {
    "red_x_points": [
      [-0.00028, 2],
      [-0.00052, 0],
      [-0.00051, 0],
      [-0.00065, 0],
      [-0.00013, 2],
      [-0.00072, 0],
      [-0.00065, 0],
      [-0.00041, 0],
      [-0.00051, 2],
      [-0.0007, 0],
      [-0.00061, 0],
      [-0.00036, 0],
      [-0.00047, 2],
      [0.00079, 1],
      [-0.00028, 2],
      [-0.00059, 0],
      [-0.00053, 2],
      [-0.00058, 0],
      [-0.00045, 2],
      [-0.00029, 2],
      [-0.00022, 2],
      [-0.00043, 2],
      [-0.00054, 0],
      [-0.00027, 2],
      [-0.00047, 2],
      [-0.00017, 2],
      [-0.00048, 0],
      [-0.00058, 0],
      [0.00112, 1],
      [-0.0002, 2],
      [-0.00046, 0],
      [-0.00027, 2]
    ],
    "red_o_points": [],
    "y_categories": ["N", "NOT APPLICABLE", "nan"],
    "blue_o_points": [],
    "blue_x_points": [
      [0.00144, 1],
      [-5e-5, 2],
      [0.00177, 1],
      [5e-5, 0],
      [-0.00036, 0],
      [0.00169, 1],
      [-0.00013, 2],
      [0.00169, 1],
      [-8e-5, 2],
      [-0.00011, 2]
    ]
  },
  "QS_mulNeuromadSite[C7]": {
    "red_x_points": [
      [-0.00014, 2],
      [-0.00103, 0],
      [-0.00087, 0],
      [-0.00105, 0],
      [-0.0003, 2],
      [-0.00084, 0],
      [-0.00097, 0],
      [-0.00121, 0],
      [-0.00038, 2],
      [-0.00117, 0],
      [-0.0014, 0],
      [-0.00085, 0],
      [-0.00028, 2],
      [0.0012, 1],
      [-0.00023, 2],
      [-0.00091, 0],
      [-0.00047, 2],
      [-0.00103, 0],
      [-0.00034, 2],
      [-0.00037, 2],
      [-5e-5, 2],
      [-0.0004, 2],
      [-0.00108, 0],
      [-0.00013, 2],
      [-0.00032, 2],
      [-0.00022, 2],
      [-0.00108, 0],
      [-0.00093, 0],
      [0.0018, 1],
      [-8e-5, 2],
      [-0.00078, 0],
      [-0.00036, 2]
    ],
    "red_o_points": [],
    "y_categories": ["N", "NOT APPLICABLE", "nan"],
    "blue_o_points": [],
    "blue_x_points": [
      [0.00261, 1],
      [-1e-5, 2],
      [0.00189, 1],
      [0.00051, 0],
      [-0.00029, 0],
      [0.00202, 1],
      [-0.00013, 2],
      [0.00288, 1],
      [0.0, 2],
      [7e-5, 2]
    ]
  },
  "QS_mulLysisRoot[C5]": {
    "red_x_points": [
      [-0.00095, 3],
      [-0.00294, 0],
      [-0.00775, 2],
      [-0.003, 0],
      [-0.00108, 3],
      [-0.00324, 0],
      [-0.00242, 0],
      [-0.00288, 0],
      [-0.00134, 3],
      [-0.00354, 0],
      [-0.00343, 0],
      [-0.00255, 0],
      [-0.00129, 3],
      [0.00595, 1],
      [-0.00096, 3],
      [-0.00293, 0],
      [-0.00118, 3],
      [-0.00258, 0],
      [-0.00106, 3],
      [-0.00141, 3],
      [-0.00109, 3],
      [-0.00112, 3],
      [-0.00283, 0],
      [-0.0011, 3],
      [-0.00153, 3],
      [-0.00087, 3],
      [-0.00271, 0],
      [-0.00273, 0],
      [0.00703, 1],
      [-0.00091, 3],
      [-0.0064, 2],
      [-0.00109, 3]
    ],
    "red_o_points": [],
    "y_categories": ["N", "NOT APPLICABLE", "Y", "nan"],
    "blue_o_points": [],
    "blue_x_points": [
      [0.0102, 1],
      [-0.00026, 3],
      [0.00851, 1],
      [0.0004, 0],
      [-0.00045, 0],
      [0.00865, 1],
      [-0.00057, 3],
      [0.00861, 1],
      [-0.00041, 3],
      [-0.00042, 3]
    ]
  },
  "QS_mulGraftNerve[TD]": {
    "red_x_points": [
      [-1e-5, 2],
      [-6e-5, 0],
      [-1e-5, 2],
      [-6e-5, 0],
      [-6e-5, 0],
      [-6e-5, 0],
      [-1e-5, 2],
      [-6e-5, 0],
      [-6e-5, 0],
      [-1e-5, 2],
      [0.0001, 1],
      [-6e-5, 0],
      [-1e-5, 2],
      [-6e-5, 0],
      [-1e-5, 2],
      [-6e-5, 0],
      [-1e-5, 2],
      [-1e-5, 2],
      [-6e-5, 0],
      [-6e-5, 0],
      [0.0001, 1],
      [-1e-5, 2],
      [-6e-5, 0],
      [-1e-5, 2]
    ],
    "red_o_points": [],
    "y_categories": ["N", "NOT APPLICABLE", "nan"],
    "blue_o_points": [],
    "blue_x_points": [
      [0.0001, 1],
      [-1e-5, 2],
      [0.0001, 1],
      [0.0001, 1],
      [0.0001, 1],
      [-1e-5, 2],
      [-1e-5, 2]
    ]
  },
  "QS_mulGraftNerve[SS]": {
    "red_x_points": [
      [1e-5, 2],
      [-0.00014, 0],
      [-0.0001, 0],
      [-0.0001, 0],
      [1e-5, 2],
      [-8e-5, 0],
      [-0.00014, 0],
      [-0.0001, 0],
      [2e-5, 2],
      [-0.0001, 0],
      [-0.0001, 0],
      [-4e-5, 0],
      [2e-5, 2],
      [0.00018, 1],
      [1e-5, 2],
      [-4e-5, 0],
      [-0.0, 2],
      [2e-5, 2],
      [2e-5, 2],
      [2e-5, 2],
      [-0.00014, 0],
      [1e-5, 2],
      [1e-5, 2],
      [2e-5, 2],
      [-0.00014, 0],
      [-0.0001, 0],
      [7e-5, 1],
      [2e-5, 2],
      [-0.00014, 0],
      [1e-5, 2]
    ],
    "red_o_points": [],
    "y_categories": ["N", "NOT APPLICABLE", "nan"],
    "blue_o_points": [],
    "blue_x_points": [
      [0.00018, 1],
      [1e-5, 2],
      [0.00018, 1],
      [-4e-5, 0],
      [1e-5, 2],
      [0.00023, 1],
      [1e-5, 2],
      [2e-5, 2]
    ]
  },
  "QS_mulNeuromadSite[C6]": {
    "red_x_points": [
      [-0.00013, 2],
      [-0.00085, 0],
      [-0.00061, 0],
      [-0.00072, 0],
      [-0.00014, 2],
      [-0.00081, 0],
      [-0.00074, 0],
      [-0.0009, 0],
      [-0.00038, 2],
      [-0.00094, 0],
      [-0.00095, 0],
      [-0.0008, 0],
      [-0.00034, 2],
      [0.00102, 1],
      [-0.00011, 2],
      [-0.00095, 0],
      [-0.00021, 2],
      [-0.00081, 0],
      [-0.00032, 2],
      [-0.00013, 2],
      [-0.00019, 2],
      [-6e-5, 2],
      [-0.0007, 0],
      [-0.00017, 2],
      [-0.0003, 2],
      [-0.00017, 2],
      [-0.00044, 0],
      [-0.00061, 0],
      [0.00108, 1],
      [-0.00014, 2],
      [-0.00084, 0],
      [-0.00014, 2]
    ],
    "red_o_points": [],
    "y_categories": ["N", "NOT APPLICABLE", "nan"],
    "blue_o_points": [],
    "blue_x_points": [
      [0.00213, 1],
      [-9e-5, 2],
      [0.0016, 1],
      [0.00021, 0],
      [9e-5, 0],
      [0.0018, 1],
      [4e-5, 2],
      [0.0017, 1],
      [0.00015, 2],
      [-0.00013, 2]
    ]
  },
  "QS_mulLysisSite[Nerve]": {
    "red_x_points": [
      [-0.00025, 3],
      [-0.00051, 0],
      [-0.00217, 2],
      [-0.00039, 0],
      [-0.0001, 3],
      [-0.00063, 0],
      [-0.00069, 0],
      [-0.00041, 0],
      [-0.00025, 3],
      [-0.00071, 0],
      [-0.00066, 0],
      [-0.00051, 0],
      [-0.00025, 3],
      [0.00118, 1],
      [-6e-5, 3],
      [-0.00073, 0],
      [-0.00017, 3],
      [-0.00041, 0],
      [-0.00034, 3],
      [-0.00033, 3],
      [-0.00022, 3],
      [-0.0002, 3],
      [-0.0006, 0],
      [-0.00023, 3],
      [-0.00027, 3],
      [-0.00015, 3],
      [-0.00039, 0],
      [-0.00052, 0],
      [0.00134, 1],
      [-0.00019, 3],
      [-0.00053, 0],
      [-0.00016, 3]
    ],
    "red_o_points": [],
    "y_categories": ["N", "NOT APPLICABLE", "Y", "nan"],
    "blue_o_points": [],
    "blue_x_points": [
      [0.00165, 1],
      [-0.0001, 3],
      [0.00218, 1],
      [0.00027, 0],
      [-0.0003, 0],
      [0.00201, 1],
      [-6e-5, 3],
      [0.00115, 1],
      [-5e-5, 3],
      [-0.00017, 3]
    ]
  },
  "QS_mulTransfSite[IMc]": {
    "red_x_points": [
      [-0.00141, 3],
      [-0.01146, 2],
      [-0.0042, 0],
      [-0.00479, 0],
      [-0.00138, 3],
      [-0.00506, 0],
      [-0.00408, 0],
      [-0.00469, 0],
      [-0.0016, 3],
      [-0.00476, 0],
      [-0.00481, 0],
      [-0.00423, 0],
      [-0.00167, 3],
      [0.01028, 1],
      [-0.00134, 3],
      [-0.00454, 0],
      [-0.00124, 3],
      [-0.01062, 2],
      [-0.00122, 3],
      [-0.00174, 3],
      [-0.00115, 3],
      [-0.0017, 3],
      [-0.00372, 0],
      [-0.00114, 3],
      [-0.00158, 3],
      [-0.00115, 3],
      [-0.00438, 0],
      [-0.00999, 2],
      [0.01237, 1],
      [-0.00129, 3],
      [-0.01043, 2],
      [-0.00118, 3]
    ],
    "red_o_points": [],
    "y_categories": ["N", "NOT APPLICABLE", "Y", "nan"],
    "blue_o_points": [],
    "blue_x_points": [
      [0.01688, 1],
      [-0.00012, 3],
      [0.01446, 1],
      [6e-5, 0],
      [-0.00144, 0],
      [0.01469, 1],
      [-0.00078, 3],
      [0.01323, 1],
      [-0.00044, 3],
      [-0.00015, 3]
    ]
  },
  "QS_mulLysisRoot[C7]": {
    "red_x_points": [
      [-0.00033, 3],
      [-0.00121, 0],
      [-0.0035, 2],
      [-0.001, 0],
      [-0.00039, 3],
      [-0.00123, 0],
      [-0.00097, 0],
      [-0.00115, 0],
      [-0.00044, 3],
      [-0.0011, 0],
      [-0.00103, 0],
      [-0.00133, 0],
      [-0.00022, 3],
      [0.00271, 1],
      [-0.00037, 3],
      [-0.00126, 0],
      [-0.00028, 3],
      [-0.0009, 0],
      [-0.00035, 3],
      [-0.00036, 3],
      [-0.00025, 3],
      [-0.00022, 3],
      [-0.00122, 0],
      [-0.00035, 3],
      [-0.00031, 3],
      [-0.00027, 3],
      [-0.00104, 0],
      [-0.00108, 0],
      [0.00209, 1],
      [-0.00021, 3],
      [-0.00103, 0],
      [-0.00034, 3]
    ],
    "red_o_points": [],
    "y_categories": ["N", "NOT APPLICABLE", "Y", "nan"],
    "blue_o_points": [],
    "blue_x_points": [
      [0.00439, 1],
      [-1e-5, 3],
      [0.00344, 1],
      [-0.00033, 0],
      [-0.00059, 0],
      [0.00281, 1],
      [-0.0002, 3],
      [0.00307, 1],
      [-0.00018, 3],
      [-0.0, 3]
    ]
  },
  "QS_lstBpsurgSide": {
    "red_x_points": [
      [-0.00135, 3],
      [-0.00634, 0],
      [-0.00688, 0],
      [-0.00689, 0],
      [-0.00142, 3],
      [-0.00719, 2],
      [-0.00759, 0],
      [-0.00666, 0],
      [-0.00212, 3],
      [-0.00886, 0],
      [-0.00589, 2],
      [-0.00634, 2],
      [-0.00207, 3],
      [0.01013, 1],
      [-0.00143, 3],
      [-0.00705, 2],
      [-0.00154, 3],
      [-0.00722, 2],
      [-0.00176, 3],
      [-0.00204, 3],
      [-0.00171, 3],
      [-0.00134, 3],
      [-0.00616, 0],
      [-0.00153, 3],
      [-0.00182, 3],
      [-0.00123, 3],
      [-0.00571, 2],
      [-0.00509, 2],
      [0.01152, 1],
      [-0.00141, 3],
      [-0.00774, 0],
      [-0.00171, 3]
    ],
    "red_o_points": [],
    "y_categories": ["L", "NOT APPLICABLE", "R", "nan"],
    "blue_o_points": [],
    "blue_x_points": [
      [0.01528, 1],
      [3e-5, 3],
      [0.01436, 1],
      [0.00273, 0],
      [0.00108, 2],
      [0.01454, 1],
      [-0.00069, 3],
      [0.01479, 1],
      [-0.00052, 3],
      [0.00018, 3]
    ]
  },
  "QA_lstPexPain[T1]": {
    "red_x_points": [
      [-0.00868, 1],
      [-0.00211, 2],
      [-0.0022, 2],
      [-0.00134, 2],
      [-0.00847, 1],
      [-0.00626, 0],
      [0.00141, 1],
      [0.00095, 1],
      [0.00616, 0],
      [0.00246, 1],
      [-0.00381, 0],
      [-0.00667, 0],
      [0.00632, 0],
      [-0.01245, 2],
      [-0.00593, 2],
      [-0.00293, 2],
      [-0.00451, 2],
      [-0.00195, 2],
      [-0.00487, 2],
      [0.00663, 0],
      [-0.00945, 1],
      [0.00636, 0],
      [-0.00242, 2],
      [-0.00551, 2],
      [-0.01006, 1],
      [-0.00585, 2],
      [-0.00348, 2],
      [-0.00211, 2],
      [-0.00411, 1],
      [-0.01009, 1],
      [0.00024, 1],
      [-0.0096, 1]
    ],
    "red_o_points": [],
    "y_categories": ["NORM", "NPV", "nan"],
    "blue_o_points": [],
    "blue_x_points": [
      [0.00033, 1],
      [-0.00039, 2],
      [0.0049, 0],
      [0.007, 1],
      [0.01121, 1],
      [0.0003, 1],
      [0.01169, 0],
      [0.00458, 0],
      [0.01197, 0],
      [0.01399, 0]
    ]
  },
  "QS_mulTransfSite[AcMc]": {
    "red_x_points": [
      [-0.00028, 3],
      [-0.00091, 0],
      [-0.0006, 0],
      [-0.00095, 0],
      [-0.00029, 3],
      [-0.00086, 0],
      [-0.00072, 0],
      [-0.00102, 0],
      [-0.00025, 3],
      [-0.0009, 0],
      [-0.0009, 0],
      [-0.00563, 2],
      [-0.00034, 3],
      [0.00188, 1],
      [-0.00036, 3],
      [-0.00082, 0],
      [-0.00032, 3],
      [-0.0009, 0],
      [-0.00046, 3],
      [-0.00047, 3],
      [-0.00018, 3],
      [-0.00038, 3],
      [-0.00091, 0],
      [-0.0003, 3],
      [-0.00061, 3],
      [-0.00037, 3],
      [-0.00078, 0],
      [-0.00075, 0],
      [0.00154, 1],
      [-0.00033, 3],
      [-0.00072, 0],
      [-0.00025, 3]
    ],
    "red_o_points": [],
    "y_categories": ["N", "NOT APPLICABLE", "Y", "nan"],
    "blue_o_points": [],
    "blue_x_points": [
      [0.00382, 1],
      [-2e-5, 3],
      [0.00216, 1],
      [-1e-5, 0],
      [0.00048, 0],
      [0.00247, 1],
      [-0.0004, 3],
      [0.00296, 1],
      [-0.00022, 3],
      [1e-5, 3]
    ]
  },
  "QA_lstPexKine[Shoulder]": {
    "red_x_points": [
      [-0.00173, 1],
      [-0.00194, 2],
      [-0.00259, 2],
      [-0.0022, 2],
      [-0.00457, 2],
      [-0.0051, 1],
      [-0.00257, 1],
      [0.00394, 0],
      [-0.00568, 2],
      [-0.00345, 1],
      [-0.00265, 1],
      [-0.0042, 1],
      [-0.0019, 1],
      [-0.00128, 2],
      [-0.00365, 2],
      [-0.00134, 1],
      [-0.00409, 2],
      [-0.0022, 2],
      [-0.00295, 2],
      [-0.00306, 1],
      [-0.00183, 1],
      [-0.0028, 1],
      [-0.00173, 2],
      [-0.00381, 2],
      [-0.0017, 1],
      [-0.00414, 2],
      [-0.00366, 2],
      [-0.00299, 2],
      [-0.00132, 2],
      [-0.00365, 2],
      [-0.00135, 1],
      [-0.00403, 2]
    ],
    "red_o_points": [],
    "y_categories": ["NPV", "PV", "nan"],
    "blue_o_points": [],
    "blue_x_points": [
      [-3e-5, 1],
      [-0.00177, 2],
      [-0.00011, 1],
      [0.00033, 1],
      [0.02563, 0],
      [-0.00011, 1],
      [0.03089, 0],
      [-0.00023, 2],
      [-8e-5, 1],
      [0.00055, 1]
    ]
  },
  "QA_yonInjBpsurg": {
    "red_x_points": [
      [-0.00218, 1],
      [-0.00154, 1],
      [-0.00191, 1],
      [-0.00175, 1],
      [-0.00217, 1],
      [-0.00179, 1],
      [-0.00165, 1],
      [-0.00189, 1],
      [-0.00248, 1],
      [-0.00237, 1],
      [-0.00199, 1],
      [-0.00171, 1],
      [-0.00227, 1],
      [0.00434, 0],
      [-0.00225, 1],
      [-0.00211, 1],
      [-0.0027, 1],
      [-0.00124, 1],
      [-0.00179, 1],
      [-0.00256, 1],
      [-0.00175, 1],
      [-0.0021, 1],
      [-0.00128, 1],
      [-0.00227, 1],
      [-0.00239, 1],
      [-0.00261, 1],
      [-0.00186, 1],
      [-0.00169, 1],
      [0.00513, 0],
      [-0.00187, 1],
      [-0.00174, 1],
      [-0.00231, 1]
    ],
    "red_o_points": [],
    "y_categories": ["N", "Y", "nan"],
    "blue_o_points": [],
    "blue_x_points": [
      [0.00992, 0],
      [-0.00036, 1],
      [0.0077, 0],
      [-0.00133, 1],
      [-0.00192, 1],
      [0.00944, 0],
      [-0.00133, 1],
      [0.00877, 0],
      [-0.00104, 1],
      [-0.00091, 1]
    ]
  },
  "QA_equInjTbpiAge": {
    "red_x_points": [
      [0.00069, 1],
      [0.00036, 1],
      [-0.00044, 1],
      [-0.00047, 0],
      [0.00082, 1],
      [-0.00092, 0],
      [-0.00038, 1],
      [-0.00044, 1],
      [-0.00815, 0],
      [-0.00127, 0],
      [-0.00126, 0],
      [-0.00093, 1],
      [-0.00651, 0],
      [-0.01281, 1],
      [0.00098, 1],
      [-0.00028, 1],
      [0.00092, 1],
      [-0.00161, 0],
      [-0.00627, 0],
      [0.0015, 1],
      [-0.00708, 0],
      [0.00158, 1],
      [9e-5, 1],
      [0.00093, 1],
      [-4e-5, 1],
      [-0.00789, 0],
      [-0.00076, 1],
      [-5e-5, 1],
      [-0.01197, 1],
      [0.001, 1],
      [-0.00065, 0],
      [0.00112, 1]
    ],
    "red_o_points": [],
    "y_categories": ["GREATER THAN OR EQUALS TO 30", "LESS THAN 30", "nan"],
    "blue_o_points": [],
    "blue_x_points": [
      [-0.00367, 1],
      [0.00277, 1],
      [0.00704, 0],
      [0.00153, 1],
      [0.00295, 0],
      [0.00723, 0],
      [0.00354, 1],
      [0.00667, 0],
      [0.00471, 1],
      [0.00399, 1]
    ]
  },
  "QA_lstPexMuscstrength[FingersAbdu]": {
    "red_x_points": [
      [9e-5, 2],
      [0.00038, 2],
      [-0.00431, 1],
      [-0.00317, 1],
      [-0.00105, 1],
      [0.00133, 0],
      [0.00127, 0],
      [-0.00401, 1],
      [-0.00816, 0],
      [0.00176, 0],
      [0.00059, 2],
      [-0.00617, 1],
      [-0.00559, 0],
      [0.00028, 2],
      [0.00064, 2],
      [0.00039, 2],
      [-0.0034, 0],
      [6e-5, 2],
      [0.00045, 2],
      [-0.00832, 0],
      [-0.00075, 1],
      [-0.00922, 0],
      [-0.00282, 1],
      [0.00053, 2],
      [0.00105, 2],
      [0.00137, 2],
      [-0.00512, 1],
      [-0.00307, 1],
      [0.00036, 2],
      [-0.00115, 1],
      [-0.00398, 1],
      [0.00069, 2]
    ],
    "red_o_points": [],
    "y_categories": ["GREATER THAN OR EQUALS TO 3", "LESS THAN 3", "nan"],
    "blue_o_points": [],
    "blue_x_points": [
      [0.00034, 2],
      [0.00093, 2],
      [0.00092, 0],
      [0.00337, 2],
      [0.00734, 0],
      [0.00116, 0],
      [0.01472, 1],
      [0.00104, 0],
      [0.00401, 2],
      [0.00426, 2]
    ]
  },
  "QS_mulBpsurgeryType[Graft]": {
    "red_x_points": [
      [-0.00022, 3],
      [-0.0005, 0],
      [-0.00043, 0],
      [-0.00049, 0],
      [-0.00012, 3],
      [-0.0005, 0],
      [-0.0005, 0],
      [-0.00049, 0],
      [-0.00012, 3],
      [-0.00042, 0],
      [-0.00038, 0],
      [-0.00037, 0],
      [-0.00025, 3],
      [0.00123, 1],
      [-0.00019, 3],
      [-0.00186, 2],
      [-0.00013, 3],
      [-0.00045, 0],
      [-0.0001, 3],
      [-0.00025, 3],
      [-0.00011, 3],
      [-0.00021, 3],
      [-0.00045, 0],
      [-3e-5, 3],
      [-0.00024, 3],
      [-0.0002, 3],
      [-0.00051, 0],
      [-0.00056, 0],
      [0.00072, 1],
      [-0.00017, 3],
      [-0.00046, 0],
      [-0.00013, 3]
    ],
    "red_o_points": [],
    "y_categories": ["N", "NOT APPLICABLE", "Y", "nan"],
    "blue_o_points": [],
    "blue_x_points": [
      [0.00176, 1],
      [-2e-5, 3],
      [0.00155, 1],
      [-0.00015, 0],
      [-0.00029, 0],
      [0.00159, 1],
      [-9e-5, 3],
      [0.00139, 1],
      [-2e-5, 3],
      [-0.0001, 3]
    ]
  },
  "QA_lstPexMuscstrength[WristExte]": {
    "red_x_points": [
      [0.00153, 1],
      [-0.00148, 2],
      [-0.00471, 1],
      [-0.00158, 1],
      [0.00135, 1],
      [0.0003, 0],
      [-0.00393, 1],
      [-0.00354, 1],
      [-0.01008, 0],
      [0.00211, 0],
      [-0.00016, 0],
      [-0.00547, 1],
      [-0.00636, 0],
      [-0.00103, 2],
      [-0.00074, 2],
      [-0.00127, 2],
      [-0.00516, 0],
      [-0.00208, 2],
      [-0.00032, 2],
      [-0.01303, 0],
      [0.00148, 1],
      [-0.01272, 0],
      [-0.00157, 1],
      [-0.00096, 2],
      [-0.00963, 0],
      [0.00219, 1],
      [0.00185, 0],
      [0.00068, 0],
      [-0.00141, 2],
      [0.00121, 1],
      [-0.0037, 1],
      [-0.0008, 2]
    ],
    "red_o_points": [],
    "y_categories": ["GREATER THAN OR EQUALS TO 3", "LESS THAN 3", "nan"],
    "blue_o_points": [],
    "blue_x_points": [
      [0.00062, 0],
      [0.00149, 2],
      [0.0005, 0],
      [0.00896, 0],
      [0.00597, 0],
      [0.00073, 1],
      [0.01086, 1],
      [0.00066, 0],
      [0.01227, 1],
      [0.00843, 2]
    ]
  },
  "QS_mulLysisRoot[C6]": {
    "red_x_points": [
      [-0.00071, 3],
      [-0.00169, 0],
      [-0.00517, 2],
      [-0.0018, 0],
      [-0.00067, 3],
      [-0.00178, 0],
      [-0.00198, 0],
      [-0.00158, 0],
      [-0.00082, 3],
      [-0.00181, 0],
      [-0.0022, 0],
      [-0.00135, 0],
      [-0.00072, 3],
      [0.00372, 1],
      [-0.00084, 3],
      [-0.00156, 0],
      [-0.00087, 3],
      [-0.00149, 0],
      [-0.00065, 3],
      [-0.0008, 3],
      [-0.00057, 3],
      [-0.00059, 3],
      [-0.00149, 0],
      [-0.00076, 3],
      [-0.00076, 3],
      [-0.00049, 3],
      [-0.00187, 0],
      [-0.00187, 0],
      [0.00383, 1],
      [-0.00051, 3],
      [-0.00516, 2],
      [-0.00062, 3]
    ],
    "red_o_points": [],
    "y_categories": ["N", "NOT APPLICABLE", "Y", "nan"],
    "blue_o_points": [],
    "blue_x_points": [
      [0.00637, 1],
      [-0.00045, 3],
      [0.00542, 1],
      [0.00014, 0],
      [-0.00026, 0],
      [0.00494, 1],
      [-0.00017, 3],
      [0.00589, 1],
      [-0.00038, 3],
      [-0.00026, 3]
    ]
  },
  "QA_lstPexPalle[Clavicle]": {
    "red_x_points": [
      [-0.00366, 3],
      [-0.00132, 3],
      [-0.00133, 3],
      [-0.00146, 3],
      [-0.00353, 3],
      [-0.00952, 2],
      [-0.00582, 2],
      [-0.00166, 3],
      [-0.00416, 3],
      [-0.00266, 3],
      [-0.00669, 2],
      [-0.00827, 2],
      [-0.00898, 0],
      [0.00019, 3],
      [-0.00335, 3],
      [-0.00196, 3],
      [-0.0035, 3],
      [-0.00114, 3],
      [-0.00284, 3],
      [-0.01062, 0],
      [-0.00847, 0],
      [-0.00255, 2],
      [0.00061, 1],
      [-0.0036, 3],
      [-0.00475, 2],
      [-0.00336, 3],
      [-0.00248, 3],
      [-0.00171, 3],
      [-0.0202, 2],
      [-0.00276, 3],
      [0.00147, 0],
      [-0.00368, 3]
    ],
    "red_o_points": [],
    "y_categories": ["HYPO", "NAIA", "PT", "nan"],
    "blue_o_points": [],
    "blue_x_points": [
      [0.00168, 3],
      [-0.00111, 3],
      [0.0101, 0],
      [1e-5, 3],
      [0.02251, 0],
      [0.00195, 3],
      [0.03771, 1],
      [0.00177, 3],
      [0.01101, 2],
      [-0.00054, 3]
    ]
  },
  "QA_lstPexTouch[C7]": {
    "red_x_points": [
      [-0.00895, 1],
      [-0.00146, 2],
      [-0.0016, 1],
      [-0.00145, 2],
      [-0.00812, 1],
      [0.00188, 0],
      [-0.00223, 1],
      [-0.00228, 1],
      [0.00609, 0],
      [-0.00264, 1],
      [0.00159, 0],
      [-0.00332, 1],
      [-0.00984, 1],
      [-0.00723, 2],
      [-0.00405, 2],
      [-0.0024, 2],
      [-0.00857, 1],
      [-0.00178, 2],
      [-0.00411, 2],
      [0.00672, 0],
      [-0.01011, 1],
      [0.00594, 0],
      [-0.00213, 2],
      [-0.00376, 2],
      [0.00322, 0],
      [0.00537, 0],
      [-0.00166, 1],
      [-0.0018, 2],
      [-0.00196, 1],
      [-0.00405, 2],
      [-0.00264, 1],
      [-0.00853, 1]
    ],
    "red_o_points": [],
    "y_categories": ["NORM", "NPV", "nan"],
    "blue_o_points": [],
    "blue_x_points": [
      [0.00014, 1],
      [7e-5, 2],
      [0.00089, 1],
      [0.00204, 1],
      [0.00941, 0],
      [0.00078, 1],
      [0.00855, 0],
      [0.00324, 0],
      [0.01014, 0],
      [0.0115, 0]
    ]
  },
  "QA_lstPexMuscstrength[ShoulderAbduc]": {
    "red_x_points": [
      [-0.00313, 1],
      [-0.00254, 1],
      [-0.00222, 1],
      [-0.00268, 1],
      [-0.00291, 1],
      [-0.00278, 1],
      [-0.00263, 1],
      [-0.00279, 1],
      [-0.00272, 1],
      [-0.0026, 1],
      [-0.00251, 1],
      [-0.00279, 1],
      [-0.00312, 1],
      [0.00043, 2],
      [0.00095, 2],
      [0.00105, 2],
      [0.00097, 2],
      [0.00122, 2],
      [0.00088, 2],
      [-0.0032, 1],
      [-0.00281, 1],
      [-0.00301, 1],
      [-0.00257, 1],
      [0.00125, 2],
      [-0.00389, 1],
      [-0.00268, 1],
      [-0.00265, 1],
      [-0.00241, 1],
      [0.00071, 2],
      [-0.00291, 1],
      [-0.00272, 1],
      [0.00096, 2]
    ],
    "red_o_points": [],
    "y_categories": ["GREATER THAN OR EQUALS TO 3", "LESS THAN 3", "nan"],
    "blue_o_points": [],
    "blue_x_points": [
      [0.00099, 2],
      [0.00155, 2],
      [0.01639, 0],
      [0.00188, 2],
      [-0.00193, 1],
      [0.01598, 0],
      [0.00193, 2],
      [-0.00105, 1],
      [-0.00172, 1],
      [-0.00182, 1]
    ]
  },
  "QA_lstPexMuscstrength[ThumbOppo]": {
    "red_x_points": [
      [-0.00618, 1],
      [0.00102, 2],
      [-0.00509, 1],
      [-0.00402, 1],
      [-0.00736, 1],
      [0.00115, 0],
      [0.00109, 0],
      [-0.00553, 1],
      [0.00102, 0],
      [0.00089, 0],
      [0.00107, 0],
      [0.00129, 0],
      [0.00111, 0],
      [0.00054, 2],
      [0.00069, 2],
      [0.00069, 2],
      [0.00129, 0],
      [0.00086, 2],
      [0.00089, 2],
      [0.00123, 0],
      [-0.0064, 1],
      [0.00117, 0],
      [-0.00433, 1],
      [0.00074, 2],
      [0.00149, 2],
      [0.00116, 2],
      [0.00084, 0],
      [-0.00411, 1],
      [0.00085, 2],
      [-0.00748, 1],
      [-0.00548, 1],
      [0.00077, 2]
    ],
    "red_o_points": [],
    "y_categories": ["GREATER THAN OR EQUALS TO 3", "LESS THAN 3", "nan"],
    "blue_o_points": [],
    "blue_x_points": [
      [0.00066, 2],
      [0.00127, 2],
      [0.00126, 0],
      [0.00298, 2],
      [0.0036, 0],
      [0.00151, 0],
      [0.00426, 0],
      [0.00141, 0],
      [0.00204, 2],
      [0.00237, 2]
    ]
  },
  "QS_mulGraftNerve[IS]": {
    "red_x_points": [
      [-0.0, 2],
      [-4e-5, 0],
      [-4e-5, 0],
      [-9e-5, 0],
      [-9e-5, 0],
      [-4e-5, 0],
      [-0.0, 2],
      [-4e-5, 0],
      [-4e-5, 0],
      [-9e-5, 0],
      [8e-5, 1],
      [-4e-5, 0],
      [-4e-5, 0],
      [-0.0, 2],
      [-3e-5, 2],
      [-0.0, 2],
      [-3e-5, 2],
      [-4e-5, 0],
      [-0.0, 2],
      [-0.0, 2],
      [-9e-5, 0],
      [-4e-5, 0],
      [8e-5, 1],
      [-0.0, 2],
      [-4e-5, 0],
      [-0.0001, 2]
    ],
    "red_o_points": [],
    "y_categories": ["N", "NOT APPLICABLE", "nan"],
    "blue_o_points": [],
    "blue_x_points": [
      [8e-5, 1],
      [0.00019, 1],
      [6e-5, 0],
      [-4e-5, 0],
      [8e-5, 1],
      [-3e-5, 2],
      [0.00019, 1],
      [-0.0, 2],
      [-0.0, 2]
    ]
  },
  "QS_mulGraftNerve[MC]": {
    "red_x_points": [
      [-5e-5, 2],
      [-7e-5, 0],
      [-0.00013, 0],
      [-6e-5, 0],
      [1e-5, 2],
      [-0.00016, 0],
      [-5e-5, 0],
      [-0.00013, 0],
      [-6e-5, 2],
      [-0.0001, 0],
      [-7e-5, 0],
      [-0.00013, 0],
      [-8e-5, 2],
      [7e-5, 1],
      [-4e-5, 2],
      [-0.00011, 0],
      [-6e-5, 2],
      [-0.0001, 0],
      [-4e-5, 2],
      [-3e-5, 2],
      [1e-5, 2],
      [-7e-5, 2],
      [-7e-5, 0],
      [-4e-5, 2],
      [-4e-5, 2],
      [-3e-5, 2],
      [-0.00013, 0],
      [-0.0001, 0],
      [0.0002, 1],
      [-4e-5, 2],
      [-0.00013, 0],
      [1e-5, 2]
    ],
    "red_o_points": [],
    "y_categories": ["N", "NOT APPLICABLE", "nan"],
    "blue_o_points": [],
    "blue_x_points": [
      [0.00018, 1],
      [-3e-5, 2],
      [0.00012, 1],
      [-5e-5, 0],
      [-5e-5, 0],
      [0.00036, 1],
      [-2e-5, 2],
      [0.0003, 1],
      [1e-5, 2],
      [-1e-5, 2]
    ]
  },
  "QS_mulNeuromadSite[C4]": {
    "red_x_points": [
      [-0.00026, 2],
      [-0.00165, 0],
      [-0.00138, 0],
      [-0.00172, 0],
      [-0.00023, 2],
      [-0.00192, 0],
      [-0.00166, 0],
      [-0.00181, 0],
      [-0.00041, 2],
      [-0.00169, 0],
      [-0.00182, 0],
      [-0.00146, 0],
      [-0.00023, 2],
      [0.00237, 1],
      [-0.00025, 2],
      [-0.00181, 0],
      [-0.00015, 2],
      [-0.00155, 0],
      [-0.00044, 2],
      [-0.00035, 2],
      [-0.0001, 2],
      [-0.00028, 2],
      [-0.00144, 0],
      [-0.00025, 2],
      [-0.00038, 2],
      [-0.00031, 2],
      [-0.00155, 0],
      [-0.00125, 0],
      [0.00213, 1],
      [-0.00022, 2],
      [-0.00127, 0],
      [-0.00019, 2]
    ],
    "red_o_points": [],
    "y_categories": ["N", "NOT APPLICABLE", "nan"],
    "blue_o_points": [],
    "blue_x_points": [
      [0.00494, 1],
      [6e-5, 2],
      [0.00387, 1],
      [9e-5, 0],
      [-0.0003, 0],
      [0.0033, 1],
      [-0.00027, 2],
      [0.00332, 1],
      [-0.00014, 2],
      [0.00015, 2]
    ]
  },
  "QS_mulLysisNerve[Ssr]": {
    "red_x_points": [
      [-0.00023, 3],
      [-0.00062, 0],
      [-0.00284, 2],
      [-0.00063, 0],
      [-0.00026, 3],
      [-0.00068, 0],
      [-0.00073, 0],
      [-0.00066, 0],
      [-0.00028, 3],
      [-0.00067, 0],
      [-0.00087, 0],
      [-0.00075, 0],
      [-0.00026, 3],
      [0.0019, 1],
      [-0.00025, 3],
      [-0.00065, 0],
      [-0.00018, 3],
      [-0.00073, 0],
      [-0.00023, 3],
      [-0.00035, 3],
      [-0.00018, 3],
      [-0.00023, 3],
      [-0.00077, 0],
      [-0.0004, 3],
      [-0.00034, 3],
      [-0.00021, 3],
      [-0.00079, 0],
      [-0.00051, 0],
      [0.00191, 1],
      [-0.00019, 3],
      [-0.00066, 0],
      [-0.00028, 3]
    ],
    "red_o_points": [],
    "y_categories": ["N", "NOT APPLICABLE", "Y", "nan"],
    "blue_o_points": [],
    "blue_x_points": [
      [0.00223, 1],
      [-0.0002, 3],
      [0.00187, 1],
      [0.00012, 0],
      [-0.00046, 0],
      [0.00184, 1],
      [-0.00012, 3],
      [0.00208, 1],
      [-6e-5, 3],
      [-0.00011, 3]
    ]
  },
  "QS_mulTransfSite[Oberlin]": {
    "red_x_points": [
      [-0.00274, 3],
      [-0.01719, 0],
      [-0.0175, 0],
      [-0.01799, 0],
      [-0.00281, 3],
      [-0.00322, 2],
      [-0.00313, 2],
      [-0.01781, 0],
      [-0.00288, 3],
      [-0.00339, 2],
      [-0.00325, 2],
      [-0.00261, 2],
      [-0.00273, 3],
      [0.01986, 1],
      [-0.00289, 3],
      [-0.00295, 2],
      [-0.00268, 3],
      [-0.01784, 0],
      [-0.00275, 3],
      [-0.00271, 3],
      [-0.00246, 3],
      [-0.00256, 3],
      [-0.01735, 0],
      [-0.00286, 3],
      [-0.00292, 3],
      [-0.00267, 3],
      [-0.00279, 2],
      [-0.01617, 0],
      [0.02169, 1],
      [-0.00265, 3],
      [-0.01694, 0],
      [-0.0028, 3]
    ],
    "red_o_points": [],
    "y_categories": ["N", "NOT APPLICABLE", "Y", "nan"],
    "blue_o_points": [],
    "blue_x_points": [
      [0.0266, 1],
      [-0.00124, 3],
      [0.02272, 1],
      [0.00252, 2],
      [0.00085, 2],
      [0.02483, 1],
      [-0.00108, 3],
      [0.02414, 1],
      [-0.00115, 3],
      [-0.00048, 3]
    ]
  },
  "QA_lstPexKine[Index]": {
    "red_x_points": [
      [-0.00226, 0],
      [-0.00083, 2],
      [-0.00176, 2],
      [-0.00102, 2],
      [-0.00342, 2],
      [0.00054, 1],
      [0.00094, 1],
      [-0.00278, 0],
      [-0.00475, 2],
      [0.00131, 1],
      [0.00047, 1],
      [0.00093, 1],
      [0.00031, 1],
      [-0.00071, 2],
      [-0.0025, 2],
      [0.00095, 1],
      [-0.00291, 2],
      [-0.00103, 2],
      [-0.00217, 2],
      [-4e-5, 1],
      [-0.0044, 0],
      [-0.00091, 1],
      [-0.00081, 2],
      [-0.00227, 2],
      [0.00035, 1],
      [-0.0038, 2],
      [-0.00137, 2],
      [-0.00067, 2],
      [-0.00092, 2],
      [-0.00308, 2],
      [-0.00287, 0],
      [-0.00293, 2]
    ],
    "red_o_points": [],
    "y_categories": ["NPV", "PV", "nan"],
    "blue_o_points": [],
    "blue_x_points": [
      [0.00069, 1],
      [-0.00084, 2],
      [0.00044, 1],
      [0.00308, 1],
      [0.00198, 1],
      [0.00076, 1],
      [0.01022, 0],
      [-0.0002, 2],
      [0.00547, 1],
      [0.00442, 1]
    ]
  }
}
