{
  "QA_lstPexMuscstrength[ElbowFlex]": {
    "red_x_points": [
      [-0.00383, 1],
      [0.00055, 2],
      [-0.00173, 1],
      [-0.00178, 1],
      [0.00164, 0],
      [-0.0014, 1],
      [-0.00189, 1],
      [-0.00374, 1],
      [-0.0016, 1],
      [-0.00164, 1],
      [-0.00167, 1],
      [-0.00336, 1],
      [0.00083, 2],
      [0.00314, 2],
      [0.00049, 2],
      [-0.00355, 1],
      [0.00032, 2],
      [0.00045, 0],
      [-0.00325, 1],
      [-0.00335, 1],
      [-0.00371, 1],
      [-0.00192, 1],
      [0.00287, 2],
      [0.00074, 0],
      [-0.00379, 1],
      [-0.00155, 1],
      [-0.00353, 1],
      [-0.00161, 1],
      [-0.0037, 1],
      [0.00085, 2],
      [-0.00199, 1]
    ],
    "red_o_points": [],
    "y_categories": ["GREATER THAN OR EQUALS TO 3", "LESS THAN 3", "nan"],
    "blue_o_points": [],
    "blue_x_points": [
      [0.00057, 2],
      [0.00576, 2],
      [0.0041, 0],
      [0.00073, 1],
      [0.00463, 2],
      [0.00476, 0],
      [0.00528, 0]
    ]
  },
  "QS_mulLysisTrunk[Upper]": {
    "red_x_points": [
      [-0.00208, 3],
      [-0.00362, 0],
      [-0.00367, 0],
      [-0.0036, 0],
      [-0.0035, 0],
      [-0.00633, 2],
      [-0.00353, 0],
      [-0.00222, 3],
      [-0.00351, 0],
      [-0.00385, 0],
      [-0.00368, 0],
      [-0.00227, 3],
      [0.00938, 1],
      [-0.0018, 3],
      [-0.0035, 0],
      [-0.00237, 3],
      [-0.00641, 2],
      [-0.00374, 0],
      [-0.00216, 3],
      [-0.00217, 3],
      [-0.00242, 3],
      [-0.0036, 0],
      [-0.00213, 3],
      [-0.00222, 3],
      [-0.00233, 3],
      [-0.00343, 0],
      [-0.00207, 3],
      [-0.00364, 0],
      [-0.00223, 3],
      [0.01029, 1],
      [-0.00553, 2]
    ],
    "red_o_points": [],
    "y_categories": ["N", "NOT APPLICABLE", "Y", "nan"],
    "blue_o_points": [],
    "blue_x_points": [
      [0.01442, 1],
      [-0.00078, 3],
      [0.01128, 1],
      [-0.0018, 0],
      [-0.00094, 3],
      [0.01339, 1],
      [0.01224, 1]
    ]
  },
  "QS_mulBpsurgeryType[Transf]": {
    "red_x_points": [
      [-0.00035, 3],
      [-0.00049, 2],
      [-0.00121, 0],
      [-0.00054, 2],
      [-0.00055, 2],
      [-0.00054, 2],
      [-0.00046, 2],
      [-0.00035, 3],
      [-0.00062, 2],
      [-0.00055, 2],
      [-0.00048, 2],
      [-0.00029, 3],
      [0.00136, 1],
      [-0.00033, 3],
      [-0.00057, 2],
      [-0.00033, 3],
      [-0.0004, 2],
      [-0.00039, 2],
      [-0.00037, 3],
      [-0.00036, 3],
      [-0.00045, 3],
      [-0.00054, 2],
      [-0.00034, 3],
      [-0.00029, 3],
      [-0.00035, 3],
      [-0.00059, 2],
      [-0.0003, 3],
      [-0.00059, 2],
      [-0.00031, 3],
      [0.00171, 1],
      [-0.00053, 2]
    ],
    "red_o_points": [],
    "y_categories": ["N", "NOT APPLICABLE", "Y", "nan"],
    "blue_o_points": [],
    "blue_x_points": [
      [0.00203, 1],
      [-0.00014, 3],
      [0.00165, 1],
      [-0.00059, 2],
      [-6e-5, 3],
      [0.00209, 1],
      [0.00156, 1]
    ]
  },
  "QS_mulNeuromadSite[T1]": {
    "red_x_points": [
      [-0.00146, 2],
      [-0.00455, 0],
      [-0.00428, 0],
      [-0.00427, 0],
      [-0.00406, 0],
      [-0.00439, 0],
      [-0.00407, 0],
      [-0.00147, 2],
      [-0.00412, 0],
      [-0.0042, 0],
      [-0.0043, 0],
      [-0.00178, 2],
      [0.00755, 1],
      [-0.00114, 2],
      [-0.00419, 0],
      [-0.00136, 2],
      [-0.00462, 0],
      [-0.00406, 0],
      [-0.00146, 2],
      [-0.00152, 2],
      [-0.00146, 2],
      [-0.0039, 0],
      [-0.00101, 2],
      [-0.00146, 2],
      [-0.00136, 2],
      [-0.00416, 0],
      [-0.00141, 2],
      [-0.00451, 0],
      [-0.00084, 2],
      [0.00952, 1],
      [-0.0039, 0]
    ],
    "red_o_points": [],
    "y_categories": ["N", "NOT APPLICABLE", "nan"],
    "blue_o_points": [],
    "blue_x_points": [
      [0.01314, 1],
      [9e-5, 2],
      [0.01043, 1],
      [-0.0004, 0],
      [-0.00012, 2],
      [0.00781, 1],
      [0.0112, 1]
    ]
  },
  "QS_mulNeuromadSite[T2]": {
    "red_x_points": [
      [-0.00173, 2],
      [-0.00562, 0],
      [-0.00553, 0],
      [-0.0055, 0],
      [-0.00557, 0],
      [-0.00471, 0],
      [-0.00499, 0],
      [-0.00158, 2],
      [-0.00511, 0],
      [-0.00534, 0],
      [-0.00512, 0],
      [-0.00194, 2],
      [0.00894, 1],
      [-0.00162, 2],
      [-0.00568, 0],
      [-0.00196, 2],
      [-0.00471, 0],
      [-0.00533, 0],
      [-0.00204, 2],
      [-0.00164, 2],
      [-0.00139, 2],
      [-0.00459, 0],
      [-0.00187, 2],
      [-0.00178, 2],
      [-0.0018, 2],
      [-0.00489, 0],
      [-0.00172, 2],
      [-0.00558, 0],
      [-0.00154, 2],
      [0.00863, 1],
      [-0.00527, 0]
    ],
    "red_o_points": [],
    "y_categories": ["N", "NOT APPLICABLE", "nan"],
    "blue_o_points": [],
    "blue_x_points": [
      [0.0191, 1],
      [0.0003, 2],
      [0.01216, 1],
      [2e-5, 0],
      [-8e-5, 2],
      [0.01205, 1],
      [0.01346, 1]
    ]
  },
  "QA_mulInjOrthesisType[ShoulderSupport]": {
    "red_x_points": [
      [-0.01188, 0],
      [-0.01084, 0],
      [-0.01163, 0],
      [-0.01098, 0],
      [-0.01096, 0],
      [-0.01139, 0],
      [-0.01056, 0],
      [-0.01461, 2],
      [-0.01088, 0],
      [-0.01128, 0],
      [-0.01091, 0],
      [-0.01233, 0],
      [0.0306, 1],
      [-0.01168, 0],
      [-0.01052, 0],
      [-0.0114, 0],
      [-0.01323, 2],
      [-0.01073, 0],
      [-0.01206, 0],
      [-0.0126, 0],
      [-0.01364, 2],
      [-0.01337, 3],
      [-0.01176, 0],
      [0.03226, 1],
      [-0.01133, 0],
      [-0.01064, 0],
      [-0.01204, 0],
      [-0.01086, 0],
      [-0.01387, 3],
      [-0.01652, 3],
      [-0.01089, 0]
    ],
    "red_o_points": [],
    "y_categories": ["N", "NOT APPLICABLE", "Y", "nan"],
    "blue_o_points": [],
    "blue_x_points": [
      [-0.00587, 0],
      [0.03329, 1],
      [0.02865, 1],
      [0.03535, 1],
      [0.03255, 1],
      [0.02751, 1],
      [0.02827, 1]
    ]
  },
  "QS_mulGraftRoot[T1]": {
    "red_x_points": [
      [1e-5, 2],
      [-5e-5, 0],
      [-5e-5, 0],
      [-5e-5, 0],
      [1e-5, 2],
      [-5e-5, 0],
      [-5e-5, 0],
      [-5e-5, 0],
      [1e-5, 2],
      [9e-5, 1],
      [1e-5, 2],
      [-5e-5, 0],
      [1e-5, 2],
      [-5e-5, 0],
      [1e-5, 2],
      [1e-5, 2],
      [-5e-5, 0],
      [1e-5, 2],
      [1e-5, 2],
      [1e-5, 2],
      [1e-5, 2],
      [1e-5, 2],
      [-5e-5, 0]
    ],
    "red_o_points": [],
    "y_categories": ["N", "NOT APPLICABLE", "nan"],
    "blue_o_points": [],
    "blue_x_points": [[1e-5, 2], [9e-5, 1], [1e-5, 2], [9e-5, 1]]
  },
  "QS_mulGraftTrunk[MiddleTrunk]": {
    "red_x_points": [
      [-0.0, 2],
      [-6e-5, 0],
      [-1e-5, 0],
      [-6e-5, 0],
      [-5e-5, 0],
      [-6e-5, 0],
      [-6e-5, 0],
      [-3e-5, 2],
      [-6e-5, 0],
      [-6e-5, 0],
      [-5e-5, 0],
      [-0.0, 2],
      [-3e-5, 2],
      [-6e-5, 0],
      [-3e-5, 2],
      [-1e-5, 0],
      [-1e-5, 0],
      [-3e-5, 2],
      [-3e-5, 2],
      [-3e-5, 2],
      [-6e-5, 0],
      [-0.0, 2],
      [-3e-5, 2],
      [-3e-5, 2],
      [-1e-5, 0],
      [-3e-5, 2],
      [-6e-5, 0],
      [-0.0, 2],
      [0.00011, 1],
      [-6e-5, 0]
    ],
    "red_o_points": [],
    "y_categories": ["N", "NOT APPLICABLE", "nan"],
    "blue_o_points": [],
    "blue_x_points": [
      [0.00015, 1],
      [-0.0, 2],
      [-1e-5, 0],
      [-3e-5, 2],
      [0.00027, 1],
      [0.00011, 1]
    ]
  },
  "QS_mulGraftNerve[Ac]": {
    "red_x_points": [
      [-0.00051, 2],
      [-0.00177, 0],
      [-0.00138, 0],
      [-0.00133, 0],
      [-0.00144, 0],
      [-0.00138, 0],
      [-0.00142, 0],
      [-0.00041, 2],
      [-0.0014, 0],
      [-0.00123, 0],
      [-0.00141, 0],
      [-0.00062, 2],
      [0.00215, 1],
      [-0.00029, 2],
      [-0.00144, 0],
      [-0.00049, 2],
      [-0.00113, 0],
      [-0.00164, 0],
      [-0.00047, 2],
      [-0.00048, 2],
      [-0.00019, 2],
      [-0.00095, 0],
      [-0.00026, 2],
      [-0.00029, 2],
      [-0.00048, 2],
      [-0.0014, 0],
      [-0.00043, 2],
      [-0.0013, 0],
      [-0.00027, 2],
      [0.00237, 1],
      [-0.00128, 0]
    ],
    "red_o_points": [],
    "y_categories": ["N", "NOT APPLICABLE", "nan"],
    "blue_o_points": [],
    "blue_x_points": [
      [0.00542, 1],
      [-0.00012, 2],
      [0.00303, 1],
      [-4e-5, 0],
      [-1e-5, 2],
      [0.003, 1],
      [0.00319, 1]
    ]
  },
  "QS_mulNeuromadSite[C8]": {
    "red_x_points": [
      [-0.00075, 2],
      [-0.00367, 0],
      [-0.00359, 0],
      [-0.00376, 0],
      [-0.00341, 0],
      [-0.00383, 0],
      [-0.00398, 0],
      [-0.00134, 2],
      [-0.0041, 0],
      [-0.0038, 0],
      [-0.00399, 0],
      [-0.00176, 2],
      [0.00558, 1],
      [-0.00098, 2],
      [-0.00401, 0],
      [-0.00149, 2],
      [-0.00405, 0],
      [-0.00401, 0],
      [-0.00115, 2],
      [-0.00106, 2],
      [-0.00082, 2],
      [-0.0036, 0],
      [-0.00092, 2],
      [-0.00109, 2],
      [-0.00117, 2],
      [-0.00352, 0],
      [-0.00102, 2],
      [-0.00383, 0],
      [-0.00075, 2],
      [0.00809, 1],
      [-0.0036, 0]
    ],
    "red_o_points": [],
    "y_categories": ["N", "NOT APPLICABLE", "nan"],
    "blue_o_points": [],
    "blue_x_points": [
      [0.0139, 1],
      [0.00041, 2],
      [0.00896, 1],
      [-5e-5, 0],
      [8e-5, 2],
      [0.00734, 1],
      [0.00871, 1]
    ]
  },
  "QS_mulGraftNerve[Ph]": {
    "red_x_points": [
      [-0.00023, 2],
      [-0.00086, 0],
      [-0.00081, 0],
      [-0.00092, 0],
      [-0.00071, 0],
      [-0.00081, 0],
      [-0.00079, 0],
      [-0.00018, 2],
      [-0.00078, 0],
      [-0.00066, 0],
      [-0.00058, 0],
      [-0.00018, 2],
      [0.00062, 1],
      [-0.00012, 2],
      [-0.00078, 0],
      [-0.00027, 2],
      [-0.00073, 0],
      [-0.00094, 0],
      [-0.00025, 2],
      [-0.00019, 2],
      [-8e-5, 2],
      [-0.00075, 0],
      [-0.00021, 2],
      [-0.00014, 2],
      [-0.00025, 2],
      [-0.00089, 0],
      [-0.00025, 2],
      [-0.00101, 0],
      [-0.00024, 2],
      [0.00126, 1],
      [-0.00081, 0]
    ],
    "red_o_points": [],
    "y_categories": ["N", "NOT APPLICABLE", "nan"],
    "blue_o_points": [],
    "blue_x_points": [
      [0.00284, 1],
      [0.00017, 2],
      [0.00167, 1],
      [0.00014, 0],
      [0.00012, 2],
      [0.00151, 1],
      [0.00215, 1]
    ]
  },
  "QS_mulTransfSite[AcSsPA]": {
    "red_x_points": [
      [-0.00074, 3],
      [-0.00137, 0],
      [-0.00135, 0],
      [-0.00127, 0],
      [-0.00109, 0],
      [-0.00125, 0],
      [-0.00119, 0],
      [-0.00063, 3],
      [-0.00143, 0],
      [-0.00143, 0],
      [-0.00137, 0],
      [-0.00067, 3],
      [0.00313, 1],
      [-0.00064, 3],
      [-0.00128, 0],
      [-0.00078, 3],
      [-0.00262, 2],
      [-0.0012, 0],
      [-0.00076, 3],
      [-0.00082, 3],
      [-0.00077, 3],
      [-0.00139, 0],
      [-0.00058, 3],
      [-0.00064, 3],
      [-0.00083, 3],
      [-0.00134, 0],
      [-0.0008, 3],
      [-0.00126, 0],
      [-0.00087, 3],
      [0.00289, 1],
      [-0.00112, 0]
    ],
    "red_o_points": [],
    "y_categories": ["N", "NOT APPLICABLE", "Y", "nan"],
    "blue_o_points": [],
    "blue_x_points": [
      [0.00465, 1],
      [-0.0003, 3],
      [0.00307, 1],
      [-0.00067, 0],
      [-0.00034, 3],
      [0.00411, 1],
      [0.00445, 1]
    ]
  },
  "QA_lstPexPalle[Elbow]": {
    "red_x_points": [
      [0.0001, 4],
      [0.0001, 4],
      [6e-5, 4],
      [0.0001, 4],
      [-0.00087, 3],
      [-0.00047, 3],
      [0.00017, 4],
      [0.00014, 4],
      [0.00011, 4],
      [0.00016, 1],
      [-0.00057, 3],
      [0.00041, 1],
      [0.00089, 4],
      [7e-5, 4],
      [9e-5, 4],
      [9e-5, 4],
      [0.00013, 4],
      [0.00043, 1],
      [-0.00051, 3],
      [-0.00056, 0],
      [-0.00042, 3],
      [-0.00042, 2],
      [0.00015, 4],
      [-0.00303, 3],
      [0.00011, 4],
      [0.0001, 4],
      [-0.00091, 3],
      [0.00013, 4],
      [6e-5, 4],
      [-0.01376, 3],
      [-0.00038, 0]
    ],
    "red_o_points": [],
    "y_categories": ["ABS", "HYPO", "NAIA", "PT", "nan"],
    "blue_o_points": [],
    "blue_x_points": [
      [0.00115, 4],
      [0.00031, 4],
      [0.00657, 1],
      [0.00062, 4],
      [0.00055, 4],
      [0.0012, 4],
      [0.00155, 4]
    ]
  },
  "QA_lstPexMuscstrength[ScapulaAbducSuprot]": {
    "red_x_points": [
      [-0.00063, 0],
      [0.00023, 2],
      [-0.0001, 1],
      [-0.00031, 1],
      [-0.00025, 0],
      [-0.00022, 1],
      [-0.00033, 1],
      [-0.00066, 1],
      [-0.0004, 0],
      [-8e-5, 0],
      [-0.00056, 1],
      [-0.0009, 1],
      [0.00011, 2],
      [0.00032, 2],
      [0.00014, 2],
      [0.00055, 2],
      [8e-5, 2],
      [-0.00037, 0],
      [-0.00036, 0],
      [-0.00055, 1],
      [-0.00042, 0],
      [-0.00026, 1],
      [0.00026, 2],
      [-0.0005, 0],
      [0.00043, 2],
      [-0.00055, 1],
      [-0.00036, 1],
      [-0.00014, 0],
      [0.0004, 2],
      [8e-5, 2]
    ],
    "red_o_points": [],
    "y_categories": ["GREATER THAN OR EQUALS TO 3", "LESS THAN 3", "nan"],
    "blue_o_points": [],
    "blue_x_points": [
      [0.00012, 2],
      [0.00087, 2],
      [4e-5, 0],
      [0.00113, 2],
      [0.00073, 2],
      [4e-5, 0],
      [0.00011, 2]
    ]
  },
  "participant_code": {
    "red_x_points": [
      [-0.01792, 1],
      [-0.0182, 2],
      [-0.01806, 3],
      [-0.01796, 4],
      [-0.0175, 5],
      [-0.01717, 6],
      [-0.01866, 7],
      [-0.01834, 8],
      [-0.01801, 9],
      [-0.01652, 10],
      [-0.01801, 11],
      [-0.01824, 12],
      [-0.01731, 14],
      [-0.01731, 16],
      [-0.01736, 17],
      [-0.0182, 19],
      [-0.01731, 20],
      [-0.01829, 22],
      [-0.0174, 23],
      [-0.01796, 25],
      [-0.01764, 26],
      [-0.01838, 27],
      [-0.01773, 28],
      [-0.01754, 29],
      [-0.01787, 30],
      [-0.01647, 32],
      [-0.01745, 33],
      [-0.01736, 34],
      [-0.01764, 35],
      [-0.01792, 36],
      [-0.01773, 37]
    ],
    "red_o_points": [],
    "y_categories": [
      "P16554",
      "P18297",
      "P19283",
      "P19287",
      "P23391",
      "P31645",
      "P31691",
      "P34778",
      "P35046",
      "P36328",
      "P43633",
      "P4544",
      "P46417",
      "P48965",
      "P53068",
      "P5497",
      "P59529",
      "P62483",
      "P64658",
      "P65202",
      "P66816",
      "P6751",
      "P7408",
      "P75566",
      "P76226",
      "P79971",
      "P82621",
      "P82990",
      "P84932",
      "P85825",
      "P86989",
      "P8770",
      "P87791",
      "P90550",
      "P93159",
      "P94969",
      "P96710",
      "P9744",
      "nan"
    ],
    "blue_o_points": [],
    "blue_x_points": [
      [0.0535, 0],
      [0.05243, 13],
      [0.05136, 15],
      [0.05442, 18],
      [0.05151, 21],
      [0.0509, 24],
      [0.04798, 31]
    ]
  },
  "QA_lstPexMuscstrength[ShoulderExrot]": {
    "red_x_points": [
      [-0.00172, 1],
      [0.00031, 2],
      [0.00199, 0],
      [-0.0015, 1],
      [-0.00141, 1],
      [-0.00153, 1],
      [0.00034, 2],
      [-0.0012, 1],
      [-0.00132, 1],
      [-0.00131, 1],
      [0.0003, 2],
      [-0.00141, 1],
      [3e-5, 2],
      [0.00033, 2],
      [0.0003, 2],
      [0.00031, 2],
      [0.00025, 2],
      [-0.00228, 1],
      [-0.00169, 1],
      [-0.00151, 1],
      [-0.00126, 1],
      [0.00028, 2],
      [0.00023, 2],
      [0.00029, 2],
      [0.00034, 2],
      [-0.00182, 1],
      [0.00031, 2],
      [0.00169, 0],
      [0.00027, 2],
      [3e-5, 2],
      [-0.00156, 1]
    ],
    "red_o_points": [],
    "y_categories": ["GREATER THAN OR EQUALS TO 3", "LESS THAN 3", "nan"],
    "blue_o_points": [],
    "blue_x_points": [
      [-1e-5, 2],
      [0.00035, 2],
      [0.00335, 0],
      [0.0008, 2],
      [0.00028, 2],
      [0.00306, 0],
      [0.00022, 1]
    ]
  },
  "QA_mulInjOrthesisType[ArmSling]": {
    "red_x_points": [
      [-0.00978, 2],
      [-0.01015, 2],
      [-0.01001, 2],
      [-0.00978, 2],
      [-0.00933, 2],
      [-0.00986, 2],
      [-0.01012, 2],
      [-0.00996, 2],
      [-0.01032, 2],
      [-0.00975, 2],
      [-0.01013, 2],
      [-0.01043, 2],
      [0.02617, 1],
      [-0.01001, 2],
      [-0.00991, 2],
      [-0.01045, 2],
      [-0.01154, 0],
      [-0.01004, 2],
      [-0.01007, 2],
      [-0.0099, 2],
      [-0.01226, 0],
      [-0.01163, 3],
      [-0.01017, 2],
      [0.02765, 1],
      [-0.01048, 2],
      [-0.01014, 2],
      [-0.00992, 2],
      [-0.00985, 2],
      [-0.01216, 3],
      [-0.01694, 3],
      [-0.009, 2]
    ],
    "red_o_points": [],
    "y_categories": ["N", "NOT APPLICABLE", "Y", "nan"],
    "blue_o_points": [],
    "blue_x_points": [
      [-0.00418, 2],
      [0.02986, 1],
      [0.02641, 1],
      [0.03229, 1],
      [0.02968, 1],
      [0.02335, 1],
      [0.02856, 1]
    ]
  },
  "QS_mulGraftNerve[Ul]": {
    "red_x_points": [
      [-0.00019, 2],
      [-0.00067, 0],
      [-0.00101, 0],
      [-0.00071, 0],
      [-0.00058, 0],
      [-0.00058, 0],
      [-0.00068, 0],
      [-0.00015, 2],
      [-0.00065, 0],
      [-0.00065, 0],
      [-0.00067, 0],
      [-0.00011, 2],
      [0.00083, 1],
      [-1e-5, 2],
      [-0.00079, 0],
      [-0.00026, 2],
      [-0.00061, 0],
      [-0.00072, 0],
      [-7e-5, 2],
      [-0.00015, 2],
      [-1e-5, 2],
      [-0.00058, 0],
      [-0.00014, 2],
      [-0.00035, 2],
      [-7e-5, 2],
      [-0.00068, 0],
      [-2e-5, 2],
      [-0.00088, 0],
      [-0.0, 2],
      [0.0018, 1],
      [-0.00059, 0]
    ],
    "red_o_points": [],
    "y_categories": ["N", "NOT APPLICABLE", "nan"],
    "blue_o_points": [],
    "blue_x_points": [
      [0.00206, 1],
      [6e-5, 2],
      [0.0016, 1],
      [7e-5, 0],
      [6e-5, 2],
      [0.00146, 1],
      [0.00149, 1]
    ]
  },
  "QA_lstPexPain[C6]": {
    "red_x_points": [
      [-0.00056, 1],
      [-4e-5, 2],
      [-4e-5, 2],
      [-0.0018, 0],
      [0.00011, 1],
      [8e-5, 1],
      [-0.00096, 0],
      [4e-5, 1],
      [5e-5, 1],
      [0.00011, 1],
      [-0.00059, 1],
      [-0.00078, 2],
      [0.00067, 2],
      [-0.00015, 2],
      [0.00028, 2],
      [-3e-5, 2],
      [0.00021, 1],
      [-0.00099, 0],
      [-0.00059, 1],
      [-0.00075, 1],
      [-4e-5, 2],
      [0.00061, 2],
      [-0.00577, 0],
      [0.00027, 2],
      [-0.0003, 2],
      [-0.00059, 1],
      [-9e-5, 2],
      [-0.00069, 1],
      [4e-5, 1],
      [3e-5, 1]
    ],
    "red_o_points": [],
    "y_categories": ["NORM", "NPV", "nan"],
    "blue_o_points": [],
    "blue_x_points": [
      [0.00015, 1],
      [0.00081, 2],
      [0.00117, 1],
      [0.00181, 1],
      [0.00102, 2],
      [0.00111, 1],
      [0.00119, 1]
    ]
  },
  "QA_yonInjUnconscio": {
    "red_x_points": [
      [-0.00325, 1],
      [-0.00349, 1],
      [-0.00181, 2],
      [-0.00197, 2],
      [0.00709, 0],
      [-0.00366, 1],
      [-0.00232, 2],
      [-0.00463, 2],
      [-0.00244, 2],
      [-0.00164, 2],
      [-0.00364, 1],
      [-0.00406, 1],
      [-0.02296, 1],
      [-0.00488, 2],
      [-0.00237, 2],
      [-0.00445, 2],
      [-0.00312, 1],
      [0.00787, 0],
      [-0.00326, 1],
      [-0.00355, 1],
      [-0.00307, 1],
      [-0.00366, 1],
      [-0.00403, 2],
      [-0.00716, 1],
      [-0.00437, 2],
      [-0.00421, 1],
      [0.00772, 0],
      [-0.0032, 1],
      [-0.00489, 2],
      [-0.00072, 2],
      [-0.00406, 1]
    ],
    "red_o_points": [],
    "y_categories": ["N", "Y", "nan"],
    "blue_o_points": [],
    "blue_x_points": [
      [0.00131, 2],
      [-0.00088, 1],
      [0.013, 0],
      [0.01843, 0],
      [0.022, 0],
      [0.00216, 2],
      [0.00221, 2]
    ]
  },
  "QS_mulGraftNerve[Sc]": {
    "red_x_points": [
      [-0.0, 2],
      [-5e-5, 0],
      [-5e-5, 0],
      [-5e-5, 0],
      [-5e-5, 0],
      [-5e-5, 0],
      [-0.0, 2],
      [-5e-5, 0],
      [-5e-5, 0],
      [-0.0, 2],
      [-5e-5, 0],
      [-0.0, 2],
      [-5e-5, 0],
      [-0.0, 2],
      [-0.0, 2],
      [-0.0, 2],
      [-0.0, 2],
      [-5e-5, 0],
      [-0.0, 2],
      [-5e-5, 0],
      [-0.0, 2],
      [0.00011, 1],
      [-5e-5, 0]
    ],
    "red_o_points": [],
    "y_categories": ["N", "NOT APPLICABLE", "nan"],
    "blue_o_points": [],
    "blue_x_points": [[-0.0, 2], [-0.0, 2], [0.00011, 1], [0.00011, 1]]
  },
  "QS_mulGraftNerve[MCA]": {
    "red_x_points": [
      [-3e-5, 2],
      [-0.00011, 0],
      [-5e-5, 0],
      [-6e-5, 0],
      [-7e-5, 0],
      [-6e-5, 0],
      [-0.00013, 0],
      [-9e-5, 2],
      [-0.00013, 0],
      [-0.00013, 0],
      [-0.0001, 0],
      [-8e-5, 2],
      [0.00027, 1],
      [-4e-5, 2],
      [-7e-5, 0],
      [-7e-5, 2],
      [-0.0001, 0],
      [-0.00011, 0],
      [-6e-5, 2],
      [-4e-5, 2],
      [-7e-5, 2],
      [-0.00011, 0],
      [-0.00019, 2],
      [-3e-5, 2],
      [-8e-5, 2],
      [-8e-5, 0],
      [-6e-5, 2],
      [-8e-5, 0],
      [-4e-5, 2],
      [0.00018, 1],
      [-8e-5, 0]
    ],
    "red_o_points": [],
    "y_categories": ["N", "NOT APPLICABLE", "nan"],
    "blue_o_points": [],
    "blue_x_points": [
      [0.00038, 1],
      [-3e-5, 2],
      [0.00018, 1],
      [3e-5, 0],
      [-2e-5, 2],
      [0.00029, 1],
      [0.00048, 1]
    ]
  },
  "QA_lstPexInspectio[SurgicalScar]": {
    "red_x_points": [
      [0.00207, 1],
      [0.00099, 1],
      [-0.00041, 0],
      [0.00089, 1],
      [-0.00344, 2],
      [-0.00038, 0],
      [0.00086, 1],
      [0.00191, 1],
      [0.00096, 1],
      [-0.00224, 2],
      [0.00099, 1],
      [-0.00252, 0],
      [-0.00093, 1],
      [-0.0053, 2],
      [0.00131, 1],
      [0.00231, 1],
      [-0.00109, 0],
      [-0.00294, 2],
      [-0.00478, 2],
      [-0.00372, 2],
      [0.00201, 1],
      [0.00077, 1],
      [-0.00487, 2],
      [-0.01156, 2],
      [0.00211, 1],
      [0.00086, 1],
      [-0.00462, 2],
      [-0.00235, 2],
      [0.00187, 1],
      [-0.00139, 1],
      [-0.00237, 2]
    ],
    "red_o_points": [],
    "y_categories": ["ABS", "NAIA", "PT", "nan"],
    "blue_o_points": [],
    "blue_x_points": [
      [-9e-5, 1],
      [0.00372, 1],
      [0.00434, 0],
      [0.00331, 1],
      [0.00534, 1],
      [0.00044, 1],
      [0.0047, 0]
    ]
  },
  "QA_intPexWristFlex": {
    "red_x_points": [[0.00061, 2], [-0.00013, 1], [-3e-5, 0], [-0.01701, 1]],
    "red_o_points": [],
    "y_categories": ["GREATER THAN OR EQUALS TO 60", "LESS THAN 60", "nan"],
    "blue_o_points": [],
    "blue_x_points": [
      [0.00173, 2],
      [0.00655, 0],
      [7e-5, 2],
      [0.0017, 2],
      [0.0014, 2]
    ]
  },
  "QS_mulGraftNerve[Me]": {
    "red_x_points": [
      [-0.00026, 2],
      [-0.00044, 0],
      [-0.00052, 0],
      [-0.00047, 0],
      [-0.00032, 0],
      [-0.00055, 0],
      [-0.00049, 0],
      [-0.00029, 2],
      [-0.0006, 0],
      [-0.00053, 0],
      [-0.00042, 0],
      [-0.00032, 2],
      [0.00054, 1],
      [-0.0002, 2],
      [-0.00048, 0],
      [-0.00024, 2],
      [-0.00039, 0],
      [-0.00042, 0],
      [-0.00031, 2],
      [-0.00029, 2],
      [-0.00025, 2],
      [-0.00042, 0],
      [-0.00029, 2],
      [-0.00027, 2],
      [-0.00018, 2],
      [-0.00039, 0],
      [-0.00024, 2],
      [-0.0003, 0],
      [-0.0002, 2],
      [0.00103, 1],
      [-0.00049, 0]
    ],
    "red_o_points": [],
    "y_categories": ["N", "NOT APPLICABLE", "nan"],
    "blue_o_points": [],
    "blue_x_points": [
      [0.00257, 1],
      [-5e-5, 2],
      [0.00083, 1],
      [0.00019, 0],
      [-5e-5, 2],
      [0.00119, 1],
      [0.00145, 1]
    ]
  },
  "QS_mulGraftNerve[LP]": {
    "red_x_points": [
      [-4e-5, 0],
      [-5e-5, 0],
      [-4e-5, 0],
      [-5e-5, 0],
      [-5e-5, 2],
      [-5e-5, 0],
      [-5e-5, 0],
      [-4e-5, 2],
      [-5e-5, 2],
      [-5e-5, 0],
      [-5e-5, 2],
      [-4e-5, 0],
      [-5e-5, 2],
      [-5e-5, 2],
      [-5e-5, 2],
      [0.00011, 1]
    ],
    "red_o_points": [],
    "y_categories": ["N", "NOT APPLICABLE", "nan"],
    "blue_o_points": [],
    "blue_x_points": [[0.00011, 1], [0.00027, 1]]
  },
  "QS_mulBpsurgeryType[Lysis]": {
    "red_x_points": [
      [-0.00281, 3],
      [-0.00449, 0],
      [-0.00793, 2],
      [-0.00507, 0],
      [-0.00507, 0],
      [-0.00837, 2],
      [-0.00494, 0],
      [-0.00258, 3],
      [-0.00495, 0],
      [-0.00492, 0],
      [-0.00483, 0],
      [-0.00275, 3],
      [0.01474, 1],
      [-0.00268, 3],
      [-0.00506, 0],
      [-0.00277, 3],
      [-0.00818, 2],
      [-0.0052, 0],
      [-0.00266, 3],
      [-0.00265, 3],
      [-0.00241, 3],
      [-0.00514, 0],
      [-0.00307, 3],
      [-0.0024, 3],
      [-0.0027, 3],
      [-0.00428, 0],
      [-0.00253, 3],
      [-0.00468, 0],
      [-0.00243, 3],
      [0.01405, 1],
      [-0.00819, 2]
    ],
    "red_o_points": [],
    "y_categories": ["N", "NOT APPLICABLE", "Y", "nan"],
    "blue_o_points": [],
    "blue_x_points": [
      [0.01929, 1],
      [-0.00058, 3],
      [0.01518, 1],
      [-0.00193, 0],
      [-0.00075, 3],
      [0.01586, 1],
      [0.01521, 1]
    ]
  },
  "QS_mulLysisSite[Trunk]": {
    "red_x_points": [
      [-0.00183, 3],
      [-0.00277, 0],
      [-0.00301, 0],
      [-0.00273, 0],
      [-0.00336, 0],
      [-0.00458, 2],
      [-0.00306, 0],
      [-0.00164, 3],
      [-0.00282, 0],
      [-0.00286, 0],
      [-0.00267, 0],
      [-0.00184, 3],
      [0.00817, 1],
      [-0.00188, 3],
      [-0.00266, 0],
      [-0.00208, 3],
      [-0.00461, 2],
      [-0.00299, 0],
      [-0.00176, 3],
      [-0.00168, 3],
      [-0.00148, 3],
      [-0.00267, 0],
      [-0.00192, 3],
      [-0.00195, 3],
      [-0.00189, 3],
      [-0.00275, 0],
      [-0.0017, 3],
      [-0.00277, 0],
      [-0.00185, 3],
      [0.00798, 1],
      [-0.00457, 2]
    ],
    "red_o_points": [],
    "y_categories": ["N", "NOT APPLICABLE", "Y", "nan"],
    "blue_o_points": [],
    "blue_x_points": [
      [0.01147, 1],
      [-0.00086, 3],
      [0.01, 1],
      [-0.00187, 0],
      [-0.00073, 3],
      [0.00875, 1],
      [0.00992, 1]
    ]
  },
  "QS_mulGraftTrunk[UpperTrunk]": {
    "red_x_points": [
      [-0.0007, 3],
      [-0.00119, 0],
      [-0.00126, 0],
      [-0.00153, 0],
      [-0.00145, 0],
      [-0.00156, 0],
      [-0.00146, 0],
      [-0.00079, 3],
      [-0.00135, 0],
      [-0.00142, 0],
      [-0.00133, 0],
      [-0.0008, 3],
      [0.00347, 1],
      [-0.00077, 3],
      [-0.00398, 2],
      [-0.00095, 3],
      [-0.00125, 0],
      [-0.0014, 0],
      [-0.00075, 3],
      [-0.00072, 3],
      [-0.00075, 3],
      [-0.00126, 0],
      [-0.00072, 3],
      [-0.00084, 3],
      [-0.00093, 3],
      [-0.00155, 0],
      [-0.00089, 3],
      [-0.00146, 0],
      [-0.00083, 3],
      [0.00344, 1],
      [-0.00135, 0]
    ],
    "red_o_points": [],
    "y_categories": ["N", "NOT APPLICABLE", "Y", "nan"],
    "blue_o_points": [],
    "blue_x_points": [
      [0.00595, 1],
      [-0.00029, 3],
      [0.00466, 1],
      [3e-5, 0],
      [-0.00018, 3],
      [0.00351, 1],
      [0.00493, 1]
    ]
  },
  "QS_mulTransfSite[PhMc]": {
    "red_x_points": [
      [-0.00154, 3],
      [-0.00261, 0],
      [-0.00259, 0],
      [-0.00249, 0],
      [-0.00281, 0],
      [-0.00257, 0],
      [-0.00465, 2],
      [-0.00139, 3],
      [-0.00268, 0],
      [-0.00249, 0],
      [-0.00264, 0],
      [-0.00145, 3],
      [0.00709, 1],
      [-0.00135, 3],
      [-0.00257, 0],
      [-0.00174, 3],
      [-0.00263, 0],
      [-0.00263, 0],
      [-0.00153, 3],
      [-0.00148, 3],
      [-0.00133, 3],
      [-0.00458, 2],
      [-0.001, 3],
      [-0.00148, 3],
      [-0.00131, 3],
      [-0.00257, 0],
      [-0.00117, 3],
      [-0.00254, 0],
      [-0.00113, 3],
      [0.00684, 1],
      [-0.00231, 0]
    ],
    "red_o_points": [],
    "y_categories": ["N", "NOT APPLICABLE", "Y", "nan"],
    "blue_o_points": [],
    "blue_x_points": [
      [0.01039, 1],
      [-0.0004, 3],
      [0.00726, 1],
      [-0.0016, 0],
      [-0.00012, 3],
      [0.00824, 1],
      [0.00777, 1]
    ]
  },
  "QA_mulInjTbpiCause[Motorcycle]": {
    "red_x_points": [
      [0.00065, 0],
      [-0.00069, 1],
      [-0.00135, 1],
      [-0.00104, 1],
      [-0.00094, 1],
      [-0.00062, 1],
      [-0.001, 1],
      [-0.00065, 1],
      [-0.00081, 1],
      [-0.00073, 1],
      [-0.00086, 1],
      [-0.00057, 0],
      [-0.02971, 1],
      [-0.0008, 1],
      [-0.00112, 1],
      [-0.00091, 1],
      [-0.00097, 1],
      [-0.00102, 1],
      [0.00051, 0],
      [-0.00051, 1],
      [-0.0005, 1],
      [-0.00078, 1],
      [-0.00078, 1],
      [-0.00125, 1],
      [0.00122, 0],
      [-0.00082, 1],
      [-0.00044, 1],
      [-0.00141, 1],
      [-0.00085, 1],
      [-0.02808, 1],
      [-0.00068, 1]
    ],
    "red_o_points": [],
    "y_categories": ["N", "Y", "nan"],
    "blue_o_points": [],
    "blue_x_points": [
      [0.014, 0],
      [-0.00047, 1],
      [0.0121, 0],
      [-0.00132, 1],
      [0.00095, 1],
      [0.01304, 0],
      [0.01388, 0]
    ]
  },
  "QS_mulLysisSite[Root]": {
    "red_x_points": [
      [-0.00069, 3],
      [-0.00071, 0],
      [-0.00168, 2],
      [-0.00059, 0],
      [-0.00074, 0],
      [-0.00076, 0],
      [-0.00048, 0],
      [-0.00068, 3],
      [-0.00051, 0],
      [-0.00063, 0],
      [-0.00064, 0],
      [-0.00053, 3],
      [0.00221, 1],
      [-0.00044, 3],
      [-0.00077, 0],
      [-0.00066, 3],
      [-0.00067, 0],
      [-0.00077, 0],
      [-0.0006, 3],
      [-0.0006, 3],
      [-0.00054, 3],
      [-0.0007, 0],
      [-0.00054, 3],
      [-0.0005, 3],
      [-0.00048, 3],
      [-0.00068, 0],
      [-0.00049, 3],
      [-0.00065, 0],
      [-0.00052, 3],
      [0.00283, 1],
      [-0.00203, 2]
    ],
    "red_o_points": [],
    "y_categories": ["N", "NOT APPLICABLE", "Y", "nan"],
    "blue_o_points": [],
    "blue_x_points": [
      [0.00246, 1],
      [-0.00031, 3],
      [0.00303, 1],
      [-0.00069, 0],
      [-0.00023, 3],
      [0.00259, 1],
      [0.00282, 1]
    ]
  },
  "QA_yonInjOrtsurg": {
    "red_x_points": [
      [-0.00319, 2],
      [-0.00011, 2],
      [9e-5, 2],
      [-4e-5, 2],
      [3e-5, 2],
      [2e-5, 2],
      [-0.00016, 1],
      [-0.00326, 2],
      [-6e-5, 0],
      [-0.0, 1],
      [-0.00016, 1],
      [-0.0034, 2],
      [-0.00331, 0],
      [0.00042, 1],
      [-0.00018, 2],
      [-0.00438, 2],
      [-4e-5, 0],
      [2e-5, 2],
      [0.00321, 0],
      [0.00051, 1],
      [-0.00354, 2],
      [-3e-5, 1],
      [-0.00455, 2],
      [-0.00411, 2],
      [-0.00324, 2],
      [-6e-5, 0],
      [-0.00019, 1],
      [-6e-5, 0],
      [-0.00413, 2],
      [-0.00142, 1],
      [-0.0, 1]
    ],
    "red_o_points": [],
    "y_categories": ["N", "Y", "nan"],
    "blue_o_points": [],
    "blue_x_points": [
      [0.00045, 2],
      [0.005, 1],
      [0.00046, 2],
      [0.00029, 2],
      [0.01453, 0],
      [0.00057, 2],
      [0.0006, 2]
    ]
  },
  "QS_mulGraftLevel[Trunk]": {
    "red_x_points": [
      [-0.00051, 3],
      [-0.00084, 0],
      [-0.00078, 0],
      [-0.00086, 0],
      [-0.00077, 0],
      [-0.0008, 0],
      [-0.00066, 0],
      [-0.0006, 3],
      [-0.00083, 0],
      [-0.00063, 0],
      [-0.00078, 0],
      [-0.00055, 3],
      [0.00198, 1],
      [-0.00046, 3],
      [-0.00271, 2],
      [-0.00052, 3],
      [-0.00075, 0],
      [-0.00074, 0],
      [-0.00048, 3],
      [-0.00052, 3],
      [-0.0006, 3],
      [-0.00075, 0],
      [-0.00058, 3],
      [-0.00064, 3],
      [-0.00049, 3],
      [-0.00082, 0],
      [-0.00056, 3],
      [-0.00079, 0],
      [-0.00061, 3],
      [0.00237, 1],
      [-0.00073, 0]
    ],
    "red_o_points": [],
    "y_categories": ["N", "NOT APPLICABLE", "Y", "nan"],
    "blue_o_points": [],
    "blue_x_points": [
      [0.0031, 1],
      [-0.00014, 3],
      [0.00298, 1],
      [-0.00018, 0],
      [-0.00012, 3],
      [0.00298, 1],
      [0.00276, 1]
    ]
  },
  "QS_mulGraftNerve[FI]": {
    "red_x_points": [
      [-0.00023, 2],
      [-0.00099, 0],
      [-0.001, 0],
      [-0.00091, 0],
      [-0.00097, 0],
      [-0.00085, 0],
      [-0.00101, 0],
      [-0.00045, 2],
      [-0.00106, 0],
      [-0.001, 0],
      [-0.00091, 0],
      [-0.00042, 2],
      [0.00171, 1],
      [-0.00045, 2],
      [-0.0011, 0],
      [-0.00043, 2],
      [-0.00104, 0],
      [-0.00084, 0],
      [-0.00033, 2],
      [-0.00031, 2],
      [-0.0004, 2],
      [-0.00104, 0],
      [-0.00029, 2],
      [-0.00036, 2],
      [-0.00058, 2],
      [-0.00086, 0],
      [-0.00043, 2],
      [-0.00104, 0],
      [-0.00045, 2],
      [0.0023, 1],
      [-0.001, 0]
    ],
    "red_o_points": [],
    "y_categories": ["N", "NOT APPLICABLE", "nan"],
    "blue_o_points": [],
    "blue_x_points": [
      [0.00378, 1],
      [-6e-5, 2],
      [0.00231, 1],
      [-0.00015, 0],
      [-7e-5, 2],
      [0.00227, 1],
      [0.00255, 1]
    ]
  },
  "QS_mulGraftNerve[other]": {
    "red_x_points": [
      [-0.00044, 2],
      [-0.00176, 0],
      [-0.00195, 0],
      [-0.00156, 0],
      [-0.00167, 0],
      [-0.00149, 0],
      [-0.00178, 0],
      [-0.00061, 2],
      [-0.00168, 0],
      [-0.00154, 0],
      [-0.00152, 0],
      [-0.00058, 2],
      [0.00257, 1],
      [-0.00068, 2],
      [-0.00178, 0],
      [-0.00079, 2],
      [-0.00162, 0],
      [-0.00151, 0],
      [-0.00054, 2],
      [-0.00054, 2],
      [-0.0004, 2],
      [-0.00133, 0],
      [-0.00065, 2],
      [-0.00061, 2],
      [-0.00071, 2],
      [-0.00125, 0],
      [-0.00041, 2],
      [-0.00128, 0],
      [-0.00048, 2],
      [0.0033, 1],
      [-0.00171, 0]
    ],
    "red_o_points": [],
    "y_categories": ["N", "NOT APPLICABLE", "nan"],
    "blue_o_points": [],
    "blue_x_points": [
      [0.00543, 1],
      [1e-5, 2],
      [0.00308, 1],
      [8e-5, 0],
      [2e-5, 2],
      [0.00295, 1],
      [0.00527, 1]
    ]
  },
  "QS_mulTransfSite[AcSsAA]": {
    "red_x_points": [
      [-0.00242, 3],
      [-0.00818, 2],
      [-0.00299, 0],
      [-0.00799, 2],
      [-0.00826, 2],
      [-0.00292, 0],
      [-0.00291, 0],
      [-0.00262, 3],
      [-0.00241, 0],
      [-0.00742, 2],
      [-0.00287, 0],
      [-0.00264, 3],
      [0.01318, 1],
      [-0.00245, 3],
      [-0.00843, 2],
      [-0.00239, 3],
      [-0.00284, 0],
      [-0.00321, 0],
      [-0.00255, 3],
      [-0.00236, 3],
      [-0.00228, 3],
      [-0.00749, 2],
      [-0.00257, 3],
      [-0.0023, 3],
      [-0.00265, 3],
      [-0.00308, 0],
      [-0.00276, 3],
      [-0.00758, 2],
      [-0.00237, 3],
      [0.01335, 1],
      [-0.00274, 0]
    ],
    "red_o_points": [],
    "y_categories": ["N", "NOT APPLICABLE", "Y", "nan"],
    "blue_o_points": [],
    "blue_x_points": [
      [0.0165, 1],
      [-0.00127, 3],
      [0.01367, 1],
      [-0.00036, 0],
      [-0.00097, 3],
      [0.01371, 1],
      [0.01466, 1]
    ]
  },
  "QS_mulGraftNerve[DS]": {
    "red_x_points": [
      [-3e-5, 2],
      [-6e-5, 0],
      [-9e-5, 0],
      [-3e-5, 0],
      [-4e-5, 0],
      [-6e-5, 0],
      [-8e-5, 0],
      [-3e-5, 2],
      [-9e-5, 0],
      [-8e-5, 0],
      [-9e-5, 0],
      [-3e-5, 2],
      [-1e-5, 2],
      [-3e-5, 0],
      [-2e-5, 2],
      [-1e-5, 0],
      [-2e-5, 2],
      [-3e-5, 2],
      [-2e-5, 2],
      [-1e-5, 0],
      [-2e-5, 2],
      [-3e-5, 2],
      [-3e-5, 2],
      [-9e-5, 0],
      [-2e-5, 2],
      [-6e-5, 0],
      [-3e-5, 2],
      [0.0001, 1],
      [-9e-5, 0]
    ],
    "red_o_points": [],
    "y_categories": ["N", "NOT APPLICABLE", "nan"],
    "blue_o_points": [],
    "blue_x_points": [
      [0.00015, 1],
      [-2e-5, 2],
      [-3e-5, 0],
      [-2e-5, 2],
      [0.0001, 1],
      [0.00045, 1]
    ]
  },
  "QS_mulGraftNerve[MP]": {
    "red_x_points": [
      [3e-5, 2],
      [-3e-5, 0],
      [-3e-5, 0],
      [-3e-5, 0],
      [-3e-5, 0],
      [-3e-5, 0],
      [-3e-5, 0],
      [-3e-5, 0],
      [-3e-5, 0],
      [-3e-5, 0],
      [9e-5, 1],
      [3e-5, 2],
      [-3e-5, 0],
      [3e-5, 2],
      [-3e-5, 0],
      [-3e-5, 0],
      [3e-5, 2],
      [-3e-5, 0],
      [3e-5, 2],
      [3e-5, 2],
      [-3e-5, 0],
      [3e-5, 2],
      [-3e-5, 0]
    ],
    "red_o_points": [],
    "y_categories": ["N", "NOT APPLICABLE", "nan"],
    "blue_o_points": [],
    "blue_x_points": [[3e-5, 2], [-3e-5, 0], [3e-5, 2], [9e-5, 1], [9e-5, 1]]
  },
  "QS_mulGraftNerve[Ax]": {
    "red_x_points": [
      [-9e-5, 2],
      [-0.00025, 0],
      [-0.00044, 0],
      [-0.00022, 0],
      [-0.00021, 0],
      [-0.00016, 0],
      [-0.00031, 0],
      [-0.00028, 2],
      [-0.00037, 0],
      [-0.00038, 0],
      [-0.00025, 0],
      [-5e-5, 2],
      [0.00036, 1],
      [-0.00011, 2],
      [-0.00019, 0],
      [-0.00019, 2],
      [-0.00031, 0],
      [-0.00042, 0],
      [-0.00012, 2],
      [-0.0001, 2],
      [-7e-5, 2],
      [-0.00016, 0],
      [-0.00022, 2],
      [-9e-5, 2],
      [-0.00021, 2],
      [-0.00032, 0],
      [-0.00011, 2],
      [-0.00032, 0],
      [-0.0002, 2],
      [0.00068, 1],
      [-0.00022, 0]
    ],
    "red_o_points": [],
    "y_categories": ["N", "NOT APPLICABLE", "nan"],
    "blue_o_points": [],
    "blue_x_points": [
      [0.00096, 1],
      [-3e-5, 2],
      [0.00081, 1],
      [-1e-5, 0],
      [9e-5, 2],
      [0.00075, 1],
      [0.00079, 1]
    ]
  },
  "QA_lstPexMuscstrength[WristFlex]": {
    "red_x_points": [
      [-0.00315, 1],
      [-0.00036, 2],
      [-0.00139, 1],
      [-0.00107, 1],
      [0.00018, 0],
      [0.00054, 0],
      [-0.00175, 1],
      [-0.00135, 0],
      [0.00069, 0],
      [0.00025, 0],
      [0.00044, 0],
      [-0.00128, 0],
      [-0.00078, 2],
      [0.00176, 2],
      [-3e-5, 2],
      [-0.0013, 0],
      [-4e-5, 2],
      [0.00043, 0],
      [-0.00114, 0],
      [-0.00225, 1],
      [-0.00158, 0],
      [-0.00152, 1],
      [0.0011, 2],
      [-0.00932, 1],
      [-0.0016, 0],
      [0.00036, 0],
      [-0.00228, 1],
      [0.00032, 0],
      [0.00204, 2],
      [-0.00011, 2],
      [-0.0012, 1]
    ],
    "red_o_points": [],
    "y_categories": ["GREATER THAN OR EQUALS TO 3", "LESS THAN 3", "nan"],
    "blue_o_points": [],
    "blue_x_points": [
      [0.00042, 0],
      [0.00322, 2],
      [0.00145, 0],
      [0.00273, 0],
      [0.0035, 2],
      [0.0016, 0],
      [0.00144, 0]
    ]
  },
  "QS_mulNeuromadSite[C5]": {
    "red_x_points": [
      [-0.0014, 2],
      [-0.00385, 0],
      [-0.00406, 0],
      [-0.00396, 0],
      [-0.00419, 0],
      [-0.00378, 0],
      [-0.00396, 0],
      [-0.00134, 2],
      [-0.0039, 0],
      [-0.00377, 0],
      [-0.00389, 0],
      [-0.00173, 2],
      [0.00603, 1],
      [-0.00141, 2],
      [-0.00377, 0],
      [-0.00165, 2],
      [-0.00396, 0],
      [-0.00413, 0],
      [-0.00139, 2],
      [-0.00124, 2],
      [-0.00124, 2],
      [-0.0035, 0],
      [-0.00126, 2],
      [-0.00189, 2],
      [-0.00143, 2],
      [-0.00332, 0],
      [-0.0013, 2],
      [-0.00358, 0],
      [-0.00137, 2],
      [0.00724, 1],
      [-0.00368, 0]
    ],
    "red_o_points": [],
    "y_categories": ["N", "NOT APPLICABLE", "nan"],
    "blue_o_points": [],
    "blue_x_points": [
      [0.01327, 1],
      [0.00014, 2],
      [0.00859, 1],
      [0.00052, 0],
      [8e-5, 2],
      [0.00922, 1],
      [0.01037, 1]
    ]
  },
  "QS_mulNeuromadSite[C7]": {
    "red_x_points": [
      [-0.00074, 2],
      [-0.00224, 0],
      [-0.0024, 0],
      [-0.00239, 0],
      [-0.00267, 0],
      [-0.00228, 0],
      [-0.00223, 0],
      [-0.00077, 2],
      [-0.00222, 0],
      [-0.00213, 0],
      [-0.00219, 0],
      [-0.00102, 2],
      [0.00347, 1],
      [-0.00063, 2],
      [-0.00216, 0],
      [-0.00094, 2],
      [-0.00197, 0],
      [-0.00246, 0],
      [-0.00094, 2],
      [-0.0009, 2],
      [-0.00063, 2],
      [-0.00189, 0],
      [-0.00065, 2],
      [-0.00097, 2],
      [-0.00086, 2],
      [-0.00173, 0],
      [-0.00082, 2],
      [-0.00232, 0],
      [-0.00052, 2],
      [0.00432, 1],
      [-0.00234, 0]
    ],
    "red_o_points": [],
    "y_categories": ["N", "NOT APPLICABLE", "nan"],
    "blue_o_points": [],
    "blue_x_points": [
      [0.00786, 1],
      [0.00013, 2],
      [0.0044, 1],
      [-8e-5, 0],
      [-0.00011, 2],
      [0.00496, 1],
      [0.00552, 1]
    ]
  },
  "QA_lstPexMuscstrength[WristExte]": {
    "red_x_points": [
      [-0.00279, 1],
      [-0.0003, 2],
      [-0.001, 1],
      [-0.00119, 1],
      [0.0004, 0],
      [-0.00225, 1],
      [-0.00183, 1],
      [-0.00249, 0],
      [0.00098, 0],
      [0.0004, 0],
      [-0.00141, 1],
      [-0.00148, 0],
      [-0.00227, 2],
      [0.00225, 2],
      [-0.00024, 2],
      [-0.00157, 0],
      [-0.00011, 2],
      [0.0006, 0],
      [-0.00142, 0],
      [-0.00249, 1],
      [-0.00198, 0],
      [-0.00118, 1],
      [0.00139, 2],
      [-0.00118, 0],
      [-0.00341, 1],
      [0.00044, 0],
      [-0.00247, 1],
      [0.00057, 0],
      [0.00227, 2],
      [-0.00247, 2],
      [-0.00099, 1]
    ],
    "red_o_points": [],
    "y_categories": ["GREATER THAN OR EQUALS TO 3", "LESS THAN 3", "nan"],
    "blue_o_points": [],
    "blue_x_points": [
      [0.00123, 0],
      [0.00424, 2],
      [0.00064, 0],
      [0.00272, 0],
      [0.0049, 2],
      [0.00094, 1],
      [0.00106, 0]
    ]
  },
  "QA_lstPexMuscstrength[ElbowExte]": {
    "red_x_points": [
      [-0.00317, 1],
      [-0.0001, 2],
      [0.0, 1],
      [2e-5, 1],
      [-0.00147, 0],
      [0.00013, 1],
      [2e-5, 1],
      [-0.00368, 1],
      [-0.00132, 0],
      [-0.00037, 0],
      [9e-5, 1],
      [-0.00256, 1],
      [3e-5, 2],
      [0.00329, 2],
      [-0.00018, 2],
      [-0.00242, 1],
      [3e-5, 2],
      [0.00028, 1],
      [-0.00217, 0],
      [-0.00277, 1],
      [-0.00351, 0],
      [0.0, 1],
      [0.00269, 2],
      [-0.00303, 0],
      [-0.0032, 0],
      [0.00024, 1],
      [-0.00198, 1],
      [-0.0001, 2],
      [-0.00252, 1],
      [3e-5, 2],
      [-1e-5, 1]
    ],
    "red_o_points": [],
    "y_categories": ["GREATER THAN OR EQUALS TO 3", "LESS THAN 3", "nan"],
    "blue_o_points": [],
    "blue_x_points": [
      [0.00011, 2],
      [0.007, 2],
      [2e-5, 0],
      [0.00154, 1],
      [0.00746, 2],
      [2e-5, 0],
      [5e-5, 0]
    ]
  },
  "QA_intPexForearmSupin": {
    "red_x_points": [
      [1e-5, 2],
      [7e-5, 0],
      [1e-5, 2],
      [1e-5, 2],
      [-0.00023, 1],
      [-0.00014, 1],
      [1e-5, 2],
      [-0.00013, 1],
      [1e-5, 2],
      [1e-5, 2],
      [1e-5, 2],
      [9e-5, 0],
      [0.0005, 2],
      [-0.0, 2],
      [-0.0, 2],
      [1e-5, 2],
      [-0.0, 2],
      [-0.00023, 1],
      [-0.00013, 1],
      [0.00013, 0],
      [-9e-5, 1],
      [-9e-5, 1],
      [5e-5, 2],
      [5e-5, 2],
      [1e-5, 2],
      [-0.0, 2],
      [-0.00027, 1],
      [1e-5, 2],
      [4e-5, 2],
      [-0.01642, 1],
      [7e-5, 0]
    ],
    "red_o_points": [],
    "y_categories": ["GREATER THAN OR EQUALS TO 80", "LESS THAN 80", "nan"],
    "blue_o_points": [],
    "blue_x_points": [
      [0.00143, 2],
      [5e-5, 2],
      [0.00611, 0],
      [7e-5, 2],
      [0.00012, 2],
      [0.00128, 2],
      [0.00146, 2]
    ]
  },
  "QS_mulGraftNerve[SS]": {
    "red_x_points": [
      [-8e-5, 2],
      [-0.0003, 0],
      [-0.00015, 0],
      [-0.0001, 0],
      [-0.00013, 0],
      [-0.00023, 0],
      [-0.0002, 0],
      [-8e-5, 2],
      [-0.00018, 0],
      [-0.00023, 0],
      [-8e-5, 0],
      [-8e-5, 2],
      [0.0003, 1],
      [-4e-5, 2],
      [-0.00023, 0],
      [-4e-5, 2],
      [-0.00017, 0],
      [-0.0002, 0],
      [-0.0001, 2],
      [-0.0001, 2],
      [-6e-5, 2],
      [-0.00019, 0],
      [-0.0001, 2],
      [-9e-5, 2],
      [-8e-5, 2],
      [-0.00012, 0],
      [-7e-5, 2],
      [-0.00017, 0],
      [-8e-5, 2],
      [0.00027, 1],
      [-0.00012, 0]
    ],
    "red_o_points": [],
    "y_categories": ["N", "NOT APPLICABLE", "nan"],
    "blue_o_points": [],
    "blue_x_points": [
      [0.00059, 1],
      [4e-5, 2],
      [0.00055, 1],
      [-1e-5, 0],
      [-6e-5, 2],
      [0.00055, 1],
      [0.00043, 1]
    ]
  },
  "QS_mulGraftNerve[MCF]": {
    "red_x_points": [
      [-6e-5, 2],
      [-9e-5, 0],
      [-9e-5, 0],
      [-9e-5, 0],
      [-9e-5, 0],
      [-0.00014, 0],
      [-8e-5, 2],
      [-5e-5, 0],
      [-0.00014, 0],
      [-9e-5, 0],
      [-1e-5, 2],
      [0.0003, 1],
      [-8e-5, 2],
      [-5e-5, 0],
      [-6e-5, 2],
      [-0.00014, 0],
      [-8e-5, 2],
      [-2e-5, 2],
      [-8e-5, 2],
      [-0.00014, 0],
      [-8e-5, 2],
      [-8e-5, 2],
      [-8e-5, 2],
      [-9e-5, 0],
      [-6e-5, 2],
      [-9e-5, 0],
      [-8e-5, 2],
      [0.0003, 1],
      [-0.00014, 0]
    ],
    "red_o_points": [],
    "y_categories": ["N", "NOT APPLICABLE", "nan"],
    "blue_o_points": [],
    "blue_x_points": [
      [0.0003, 1],
      [-3e-5, 2],
      [0.00021, 1],
      [-3e-5, 2],
      [0.0003, 1],
      [0.0001, 1]
    ]
  },
  "QS_mulNeuromadSite[C6]": {
    "red_x_points": [
      [-0.00082, 2],
      [-0.00223, 0],
      [-0.00237, 0],
      [-0.00231, 0],
      [-0.00233, 0],
      [-0.00243, 0],
      [-0.00233, 0],
      [-0.00105, 2],
      [-0.0025, 0],
      [-0.00254, 0],
      [-0.00226, 0],
      [-0.00094, 2],
      [0.00321, 1],
      [-0.00088, 2],
      [-0.00246, 0],
      [-0.00111, 2],
      [-0.00209, 0],
      [-0.00246, 0],
      [-0.00092, 2],
      [-0.00095, 2],
      [-0.00077, 2],
      [-0.00196, 0],
      [-0.00098, 2],
      [-0.00081, 2],
      [-0.00096, 2],
      [-0.00231, 0],
      [-0.0009, 2],
      [-0.00224, 0],
      [-0.00059, 2],
      [0.00384, 1],
      [-0.00208, 0]
    ],
    "red_o_points": [],
    "y_categories": ["N", "NOT APPLICABLE", "nan"],
    "blue_o_points": [],
    "blue_x_points": [
      [0.00884, 1],
      [0.00011, 2],
      [0.00528, 1],
      [0.00015, 0],
      [-0.0001, 2],
      [0.00554, 1],
      [0.0057, 1]
    ]
  },
  "QS_mulLysisSite[Nerve]": {
    "red_x_points": [
      [-0.00032, 3],
      [-0.00026, 0],
      [-0.00105, 2],
      [-0.00034, 0],
      [-0.00028, 0],
      [-0.00032, 0],
      [-0.00028, 0],
      [-0.0003, 3],
      [-0.00035, 0],
      [-0.00028, 0],
      [-0.0004, 0],
      [-0.00027, 3],
      [0.00128, 1],
      [-0.0003, 3],
      [-0.0003, 0],
      [-0.00024, 3],
      [-0.0003, 0],
      [-0.00036, 0],
      [-0.00027, 3],
      [-0.00031, 3],
      [-0.00039, 3],
      [-0.00035, 0],
      [-0.00026, 3],
      [-0.00026, 3],
      [-0.00024, 3],
      [-0.00035, 0],
      [-0.00026, 3],
      [-0.00038, 0],
      [-0.0003, 3],
      [0.00143, 1],
      [-0.00026, 0]
    ],
    "red_o_points": [],
    "y_categories": ["N", "NOT APPLICABLE", "Y", "nan"],
    "blue_o_points": [],
    "blue_x_points": [
      [0.00112, 1],
      [-0.0001, 3],
      [0.00154, 1],
      [-0.00041, 0],
      [-0.00015, 3],
      [0.0011, 1],
      [0.00133, 1]
    ]
  },
  "QS_mulGraftNerve[TD]": {
    "red_x_points": [
      [-0.0, 2],
      [-9e-5, 0],
      [-5e-5, 0],
      [-9e-5, 0],
      [-9e-5, 0],
      [-0.00041, 0],
      [-9e-5, 0],
      [-8e-5, 2],
      [-5e-5, 0],
      [-9e-5, 0],
      [-5e-5, 0],
      [-0.00012, 2],
      [6e-5, 1],
      [0.0, 2],
      [-3e-5, 0],
      [-8e-5, 2],
      [-0.00029, 0],
      [-9e-5, 0],
      [0.0, 2],
      [0.0, 2],
      [-8e-5, 2],
      [-5e-5, 0],
      [-0.0, 2],
      [-0.00015, 2],
      [0.0, 2],
      [-9e-5, 0],
      [0.0, 2],
      [-9e-5, 0],
      [0.00016, 1],
      [-9e-5, 0]
    ],
    "red_o_points": [],
    "y_categories": ["N", "NOT APPLICABLE", "nan"],
    "blue_o_points": [],
    "blue_x_points": [
      [0.00016, 1],
      [0.0, 2],
      [0.00028, 1],
      [6e-5, 0],
      [9e-5, 2],
      [0.00025, 1],
      [0.00041, 1]
    ]
  },
  "QS_mulLysisRoot[C7]": {
    "red_x_points": [
      [-0.00034, 3],
      [-0.00066, 0],
      [-0.00172, 2],
      [-0.00066, 0],
      [-0.00064, 0],
      [-0.00075, 0],
      [-0.00072, 0],
      [-0.00038, 3],
      [-0.0007, 0],
      [-0.00073, 0],
      [-0.00061, 0],
      [-0.00036, 3],
      [0.00185, 1],
      [-0.00028, 3],
      [-0.00067, 0],
      [-0.00039, 3],
      [-0.00055, 0],
      [-0.00053, 0],
      [-0.00043, 3],
      [-0.00042, 3],
      [-0.00032, 3],
      [-0.00079, 0],
      [-0.0004, 3],
      [-0.00043, 3],
      [-0.00032, 3],
      [-0.00079, 0],
      [-0.00036, 3],
      [-0.00069, 0],
      [-0.0003, 3],
      [0.00198, 1],
      [-0.00056, 0]
    ],
    "red_o_points": [],
    "y_categories": ["N", "NOT APPLICABLE", "Y", "nan"],
    "blue_o_points": [],
    "blue_x_points": [
      [0.0027, 1],
      [-0.00015, 3],
      [0.00182, 1],
      [-0.00061, 0],
      [-0.00022, 3],
      [0.00226, 1],
      [0.00257, 1]
    ]
  },
  "QS_mulTransfSite[IMc]": {
    "red_x_points": [
      [-0.00267, 3],
      [-0.00745, 2],
      [-0.00495, 0],
      [-0.00427, 0],
      [-0.00406, 0],
      [-0.00391, 0],
      [-0.00429, 0],
      [-0.00207, 3],
      [-0.00402, 0],
      [-0.00459, 0],
      [-0.00404, 0],
      [-0.0027, 3],
      [0.01229, 1],
      [-0.00241, 3],
      [-0.00394, 0],
      [-0.00295, 3],
      [-0.00783, 2],
      [-0.00452, 0],
      [-0.00239, 3],
      [-0.00216, 3],
      [-0.0023, 3],
      [-0.00365, 0],
      [-0.00236, 3],
      [-0.00221, 3],
      [-0.00251, 3],
      [-0.00442, 0],
      [-0.00249, 3],
      [-0.00717, 2],
      [-0.00222, 3],
      [0.01181, 1],
      [-0.00646, 2]
    ],
    "red_o_points": [],
    "y_categories": ["N", "NOT APPLICABLE", "Y", "nan"],
    "blue_o_points": [],
    "blue_x_points": [
      [0.01784, 1],
      [-0.00096, 3],
      [0.0135, 1],
      [-0.00156, 0],
      [-0.00065, 3],
      [0.01253, 1],
      [0.01465, 1]
    ]
  },
  "QA_lstPexTouch[T1]": {
    "red_x_points": [
      [-0.00142, 1],
      [-7e-5, 2],
      [0.00054, 1],
      [-0.00011, 2],
      [-0.00259, 0],
      [0.00072, 1],
      [0.00085, 1],
      [-0.00211, 1],
      [-0.00266, 0],
      [-0.00154, 0],
      [-0.00172, 0],
      [-0.00322, 0],
      [-0.00867, 2],
      [0.00258, 2],
      [-0.00039, 2],
      [-0.0013, 1],
      [1e-5, 2],
      [0.00094, 1],
      [-0.00302, 0],
      [-0.0016, 1],
      [-0.00276, 0],
      [-0.00015, 2],
      [0.00277, 2],
      [-0.00132, 1],
      [-0.00391, 0],
      [0.00084, 1],
      [-0.00366, 0],
      [-0.00021, 2],
      [-0.00375, 0],
      [0.0006, 1],
      [0.00053, 1]
    ],
    "red_o_points": [],
    "y_categories": ["NORM", "NPV", "nan"],
    "blue_o_points": [],
    "blue_x_points": [
      [0.00108, 1],
      [0.00459, 2],
      [0.00099, 1],
      [0.00335, 1],
      [0.00693, 2],
      [0.00077, 1],
      [0.00483, 0]
    ]
  },
  "QS_mulTransfSite[AcMc]": {
    "red_x_points": [
      [-0.00046, 3],
      [-0.00095, 0],
      [-0.00069, 0],
      [-0.00095, 0],
      [-0.00104, 0],
      [-0.00103, 0],
      [-0.00084, 0],
      [-0.00046, 3],
      [-0.00071, 0],
      [-0.00104, 0],
      [-0.00204, 2],
      [-0.0006, 3],
      [0.00255, 1],
      [-0.00042, 3],
      [-0.00079, 0],
      [-0.00049, 3],
      [-0.00083, 0],
      [-0.001, 0],
      [-0.0005, 3],
      [-0.00044, 3],
      [-0.00068, 3],
      [-0.00094, 0],
      [-0.00051, 3],
      [-0.00052, 3],
      [-0.00059, 3],
      [-0.001, 0],
      [-0.0007, 3],
      [-0.00082, 0],
      [-0.00065, 3],
      [0.00253, 1],
      [-0.00075, 0]
    ],
    "red_o_points": [],
    "y_categories": ["N", "NOT APPLICABLE", "Y", "nan"],
    "blue_o_points": [],
    "blue_x_points": [
      [0.00407, 1],
      [-0.00012, 3],
      [0.00255, 1],
      [-0.00067, 0],
      [-0.00034, 3],
      [0.00344, 1],
      [0.00277, 1]
    ]
  },
  "QS_mulTransfSite[Other]": {
    "red_x_points": [
      [-0.00055, 3],
      [-0.00108, 0],
      [-0.0009, 0],
      [-0.00079, 0],
      [-0.00102, 0],
      [-0.0009, 0],
      [-0.00081, 0],
      [-0.00058, 3],
      [-0.0011, 0],
      [-0.00086, 0],
      [-0.00076, 0],
      [-0.00054, 3],
      [0.00275, 1],
      [-0.00053, 3],
      [-0.00099, 0],
      [-0.00062, 3],
      [-0.00088, 0],
      [-0.00383, 2],
      [-0.00051, 3],
      [-0.00049, 3],
      [-0.00058, 3],
      [-0.00089, 0],
      [-0.00046, 3],
      [-0.00073, 3],
      [-0.00066, 3],
      [-0.00082, 0],
      [-0.00061, 3],
      [-0.00086, 0],
      [-0.00045, 3],
      [0.00297, 1],
      [-0.00083, 0]
    ],
    "red_o_points": [],
    "y_categories": ["N", "NOT APPLICABLE", "Y", "nan"],
    "blue_o_points": [],
    "blue_x_points": [
      [0.00324, 1],
      [-0.00022, 3],
      [0.00343, 1],
      [-0.0, 0],
      [-3e-5, 3],
      [0.00262, 1],
      [0.00348, 1]
    ]
  },
  "QA_yonInjBpsurg": {
    "red_x_points": [
      [-0.00279, 1],
      [-0.00289, 1],
      [-0.00294, 1],
      [-0.00313, 1],
      [-0.00282, 1],
      [-0.00282, 1],
      [-0.00302, 1],
      [-0.00259, 1],
      [-0.003, 1],
      [-0.0029, 1],
      [-0.00282, 1],
      [-0.00328, 1],
      [0.00613, 0],
      [-0.00296, 1],
      [-0.00289, 1],
      [-0.00311, 1],
      [-0.00267, 1],
      [-0.00305, 1],
      [-0.00268, 1],
      [-0.00293, 1],
      [-0.00248, 1],
      [-0.00251, 1],
      [-0.00263, 1],
      [-0.00308, 1],
      [-0.00311, 1],
      [-0.00254, 1],
      [-0.00307, 1],
      [-0.00285, 1],
      [-0.00283, 1],
      [0.00842, 0],
      [-0.00286, 1]
    ],
    "red_o_points": [],
    "y_categories": ["N", "Y", "nan"],
    "blue_o_points": [],
    "blue_x_points": [
      [0.01451, 0],
      [-0.00088, 1],
      [0.01015, 0],
      [-0.00233, 1],
      [-0.00068, 1],
      [0.01013, 0],
      [0.01077, 0]
    ]
  },
  "QA_equInjTbpiAge": {
    "red_x_points": [
      [-0.00091, 1],
      [-0.00013, 1],
      [-6e-5, 1],
      [-0.00033, 0],
      [-0.00113, 0],
      [0.00018, 1],
      [-5e-5, 1],
      [0.0009, 0],
      [-0.00032, 0],
      [-0.00013, 0],
      [-2e-5, 1],
      [0.00082, 0],
      [-0.01287, 1],
      [-0.00098, 1],
      [-0.00021, 1],
      [-0.001, 1],
      [8e-5, 0],
      [-0.00138, 0],
      [-0.00077, 1],
      [0.00055, 0],
      [-0.00095, 1],
      [-1e-5, 1],
      [-0.00116, 1],
      [-0.00287, 1],
      [0.00101, 0],
      [-3e-5, 1],
      [-0.00112, 1],
      [-5e-5, 1],
      [-0.00093, 1],
      [-0.01216, 1],
      [-0.00013, 0]
    ],
    "red_o_points": [],
    "y_categories": ["GREATER THAN OR EQUALS TO 30", "LESS THAN 30", "nan"],
    "blue_o_points": [],
    "blue_x_points": [
      [-0.00311, 1],
      [-0.00148, 1],
      [0.00659, 0],
      [0.00104, 1],
      [0.00509, 0],
      [0.00712, 0],
      [0.00671, 0]
    ]
  },
  "QS_mulLysisNerve[Ssr]": {
    "red_x_points": [
      [-0.00041, 3],
      [-0.00045, 0],
      [-0.00098, 2],
      [-0.00042, 0],
      [-0.00042, 0],
      [-0.00048, 0],
      [-0.00046, 0],
      [-0.00031, 3],
      [-0.00038, 0],
      [-0.00032, 0],
      [-0.00036, 0],
      [-0.00032, 3],
      [0.00125, 1],
      [-0.00032, 3],
      [-0.00037, 0],
      [-0.00048, 3],
      [-0.00027, 0],
      [-0.00048, 0],
      [-0.00029, 3],
      [-0.00038, 3],
      [-0.00025, 3],
      [-0.00037, 0],
      [-0.00036, 3],
      [-0.0003, 3],
      [-0.00033, 3],
      [-0.00049, 0],
      [-0.00036, 3],
      [-0.00044, 0],
      [-0.00033, 3],
      [0.00174, 1],
      [-0.00034, 0]
    ],
    "red_o_points": [],
    "y_categories": ["N", "NOT APPLICABLE", "Y", "nan"],
    "blue_o_points": [],
    "blue_x_points": [
      [0.0018, 1],
      [-8e-5, 3],
      [0.00136, 1],
      [-0.00048, 0],
      [-0.00019, 3],
      [0.00137, 1],
      [0.00144, 1]
    ]
  },
  "QS_mulBpsurgeryType[Graft]": {
    "red_x_points": [
      [-0.00025, 3],
      [-0.00035, 0],
      [-0.00037, 0],
      [-0.0004, 0],
      [-0.0004, 0],
      [-0.00042, 0],
      [-0.00049, 0],
      [-0.00034, 3],
      [-0.00029, 0],
      [-0.00024, 0],
      [-0.00036, 0],
      [-0.0003, 3],
      [0.00092, 1],
      [-0.00018, 3],
      [-0.00142, 2],
      [-0.00017, 3],
      [-0.00025, 0],
      [-0.00035, 0],
      [-0.00032, 3],
      [-0.00022, 3],
      [-0.00039, 3],
      [-0.00034, 0],
      [-0.00021, 3],
      [-0.00027, 3],
      [-0.00033, 3],
      [-0.00046, 0],
      [-0.00025, 3],
      [-0.00039, 0],
      [-0.00022, 3],
      [0.00109, 1],
      [-0.0003, 0]
    ],
    "red_o_points": [],
    "y_categories": ["N", "NOT APPLICABLE", "Y", "nan"],
    "blue_o_points": [],
    "blue_x_points": [
      [0.00189, 1],
      [-9e-5, 3],
      [0.00099, 1],
      [-2e-5, 0],
      [-0.00012, 3],
      [0.0014, 1],
      [0.00138, 1]
    ]
  },
  "QS_mulLysisRoot[C5]": {
    "red_x_points": [
      [-0.00138, 3],
      [-0.00263, 0],
      [-0.00417, 2],
      [-0.00229, 0],
      [-0.00237, 0],
      [-0.00236, 0],
      [-0.00267, 0],
      [-0.00106, 3],
      [-0.00277, 0],
      [-0.0024, 0],
      [-0.00224, 0],
      [-0.00132, 3],
      [0.00718, 1],
      [-0.00143, 3],
      [-0.0027, 0],
      [-0.00153, 3],
      [-0.00238, 0],
      [-0.0026, 0],
      [-0.00124, 3],
      [-0.00153, 3],
      [-0.00144, 3],
      [-0.00209, 0],
      [-0.00133, 3],
      [-0.00139, 3],
      [-0.00165, 3],
      [-0.00242, 0],
      [-0.00161, 3],
      [-0.00221, 0],
      [-0.00131, 3],
      [0.00761, 1],
      [-0.00423, 2]
    ],
    "red_o_points": [],
    "y_categories": ["N", "NOT APPLICABLE", "Y", "nan"],
    "blue_o_points": [],
    "blue_x_points": [
      [0.00979, 1],
      [-0.00055, 3],
      [0.00767, 1],
      [-0.002, 0],
      [-0.00065, 3],
      [0.00722, 1],
      [0.00777, 1]
    ]
  },
  "QS_mulLysisRoot[C6]": {
    "red_x_points": [
      [-0.00107, 3],
      [-0.00221, 0],
      [-0.00355, 2],
      [-0.00217, 0],
      [-0.00204, 0],
      [-0.00192, 0],
      [-0.00203, 0],
      [-0.00133, 3],
      [-0.00214, 0],
      [-0.00207, 0],
      [-0.00222, 0],
      [-0.00124, 3],
      [0.00579, 1],
      [-0.00122, 3],
      [-0.00217, 0],
      [-0.00143, 3],
      [-0.00193, 0],
      [-0.00241, 0],
      [-0.00129, 3],
      [-0.0011, 3],
      [-0.00109, 3],
      [-0.00195, 0],
      [-0.00126, 3],
      [-0.00112, 3],
      [-0.00104, 3],
      [-0.0021, 0],
      [-0.00103, 3],
      [-0.00211, 0],
      [-0.00115, 3],
      [0.00618, 1],
      [-0.00361, 2]
    ],
    "red_o_points": [],
    "y_categories": ["N", "NOT APPLICABLE", "Y", "nan"],
    "blue_o_points": [],
    "blue_x_points": [
      [0.00825, 1],
      [-0.00054, 3],
      [0.00703, 1],
      [-0.0014, 0],
      [-0.00038, 3],
      [0.00703, 1],
      [0.00665, 1]
    ]
  },
  "QA_lstPexPalle[Clavicle]": {
    "red_x_points": [
      [-0.0, 3],
      [2e-5, 3],
      [2e-5, 3],
      [2e-5, 3],
      [-0.00036, 2],
      [-0.0001, 2],
      [2e-5, 3],
      [2e-5, 3],
      [9e-5, 3],
      [-0.00015, 2],
      [-0.0001, 2],
      [0.0, 0],
      [0.00064, 3],
      [2e-5, 3],
      [2e-5, 3],
      [2e-5, 3],
      [2e-5, 3],
      [0.0, 0],
      [6e-5, 0],
      [-9e-5, 2],
      [-5e-5, 1],
      [2e-5, 3],
      [-0.0038, 2],
      [2e-5, 3],
      [-0.0, 3],
      [-0.00031, 2],
      [-0.0, 3],
      [-0.0, 3],
      [-0.01584, 2],
      [6e-5, 0]
    ],
    "red_o_points": [],
    "y_categories": ["HYPO", "NAIA", "PT", "nan"],
    "blue_o_points": [],
    "blue_x_points": [
      [0.00146, 3],
      [0.00022, 3],
      [0.00746, 0],
      [0.00049, 3],
      [0.00042, 3],
      [0.00151, 3],
      [0.00135, 3]
    ]
  },
  "QS_mulGraftNerve[LT]": {
    "red_x_points": [
      [-4e-5, 2],
      [-6e-5, 0],
      [-1e-5, 0],
      [-1e-5, 0],
      [-2e-5, 0],
      [-7e-5, 0],
      [-6e-5, 0],
      [-6e-5, 0],
      [-7e-5, 0],
      [-5e-5, 0],
      [-5e-5, 2],
      [-4e-5, 2],
      [-7e-5, 0],
      [-5e-5, 2],
      [-5e-5, 0],
      [-2e-5, 0],
      [-5e-5, 2],
      [-5e-5, 2],
      [-5e-5, 0],
      [-4e-5, 2],
      [-3e-5, 2],
      [-5e-5, 2],
      [-2e-5, 0],
      [-4e-5, 2],
      [-7e-5, 0],
      [-3e-5, 2],
      [0.00012, 1],
      [-7e-5, 0]
    ],
    "red_o_points": [],
    "y_categories": ["N", "NOT APPLICABLE", "nan"],
    "blue_o_points": [],
    "blue_x_points": [
      [0.0005, 1],
      [0.00012, 1],
      [-3e-5, 2],
      [0.00012, 1],
      [0.00012, 1]
    ]
  },
  "QA_lstPexMuscstrength[ShoulderAbduc]": {
    "red_x_points": [
      [-0.00604, 1],
      [-0.00589, 1],
      [-0.00553, 1],
      [-0.00581, 1],
      [-0.0058, 1],
      [-0.00607, 1],
      [-0.00595, 1],
      [-0.00572, 1],
      [-0.00625, 1],
      [-0.00572, 1],
      [-0.00564, 1],
      [-0.00511, 1],
      [0.00238, 2],
      [0.00497, 2],
      [0.00424, 2],
      [0.00476, 2],
      [0.00427, 2],
      [-0.00594, 1],
      [-0.00575, 1],
      [-0.0061, 1],
      [-0.00601, 1],
      [-0.00564, 1],
      [0.00469, 2],
      [-0.00783, 1],
      [-0.00613, 1],
      [-0.00555, 1],
      [-0.00589, 1],
      [-0.00548, 1],
      [-0.00571, 1],
      [0.00362, 2],
      [-0.00526, 1]
    ],
    "red_o_points": [],
    "y_categories": ["GREATER THAN OR EQUALS TO 3", "LESS THAN 3", "nan"],
    "blue_o_points": [],
    "blue_x_points": [
      [0.00373, 2],
      [0.00484, 2],
      [0.02426, 0],
      [0.00594, 2],
      [0.00507, 2],
      [0.02473, 0],
      [-0.00196, 1]
    ]
  },
  "QS_mulNeuromadSite[C4]": {
    "red_x_points": [
      [-0.00057, 2],
      [-0.00178, 0],
      [-0.00234, 0],
      [-0.00201, 0],
      [-0.00203, 0],
      [-0.00201, 0],
      [-0.00168, 0],
      [-0.00052, 2],
      [-0.00187, 0],
      [-0.00205, 0],
      [-0.00189, 0],
      [-0.00053, 2],
      [0.00344, 1],
      [-0.00037, 2],
      [-0.00213, 0],
      [-0.00062, 2],
      [-0.00161, 0],
      [-0.002, 0],
      [-0.00054, 2],
      [-0.00056, 2],
      [-0.00045, 2],
      [-0.00157, 0],
      [-0.00072, 2],
      [-0.00086, 2],
      [-0.00063, 2],
      [-0.00198, 0],
      [-0.00059, 2],
      [-0.00247, 0],
      [-0.00051, 2],
      [0.00376, 1],
      [-0.00147, 0]
    ],
    "red_o_points": [],
    "y_categories": ["N", "NOT APPLICABLE", "nan"],
    "blue_o_points": [],
    "blue_x_points": [
      [0.00685, 1],
      [-1e-5, 2],
      [0.00389, 1],
      [0.00025, 0],
      [-3e-5, 2],
      [0.00453, 1],
      [0.00496, 1]
    ]
  },
  "QS_lstBpsurgSide": {
    "red_x_points": [
      [-0.0035, 3],
      [-0.00616, 0],
      [-0.00635, 0],
      [-0.006, 0],
      [-0.01181, 2],
      [-0.0056, 0],
      [-0.00641, 0],
      [-0.00343, 3],
      [-0.00582, 0],
      [-0.01154, 2],
      [-0.01228, 2],
      [-0.00335, 3],
      [0.01858, 1],
      [-0.00356, 3],
      [-0.01318, 2],
      [-0.00352, 3],
      [-0.01158, 2],
      [-0.01257, 2],
      [-0.00296, 3],
      [-0.00334, 3],
      [-0.00312, 3],
      [-0.00565, 0],
      [-0.00259, 3],
      [-0.00373, 3],
      [-0.00355, 3],
      [-0.01113, 2],
      [-0.00358, 3],
      [-0.01109, 2],
      [-0.00302, 3],
      [0.01996, 1],
      [-0.00614, 0]
    ],
    "red_o_points": [],
    "y_categories": ["L", "NOT APPLICABLE", "R", "nan"],
    "blue_o_points": [],
    "blue_x_points": [
      [0.03007, 1],
      [-0.0008, 3],
      [0.01886, 1],
      [0.00183, 0],
      [-0.00085, 3],
      [0.02241, 1],
      [0.02344, 1]
    ]
  },
  "QS_mulGraftNerve[IS]": {
    "red_x_points": [
      [-0.00011, 2],
      [-0.00043, 0],
      [-0.00055, 0],
      [-0.00043, 0],
      [-0.00028, 0],
      [-0.00046, 0],
      [-0.00044, 0],
      [-0.00025, 2],
      [-0.00039, 0],
      [-0.00042, 0],
      [-0.00037, 0],
      [-0.00023, 2],
      [0.00102, 1],
      [-0.00012, 2],
      [-0.00017, 0],
      [-0.00015, 2],
      [-0.00027, 0],
      [-0.00038, 0],
      [-0.00018, 2],
      [-0.00013, 2],
      [-0.00016, 2],
      [-0.00038, 0],
      [-0.0002, 2],
      [-0.00014, 2],
      [-0.00018, 2],
      [-0.00034, 0],
      [-0.00017, 2],
      [-0.00047, 0],
      [-0.0001, 2],
      [0.00076, 1],
      [-0.00031, 0]
    ],
    "red_o_points": [],
    "y_categories": ["N", "NOT APPLICABLE", "nan"],
    "blue_o_points": [],
    "blue_x_points": [
      [0.00131, 1],
      [-0.00013, 2],
      [0.00099, 1],
      [-0.00013, 0],
      [-0.0001, 2],
      [0.00091, 1],
      [0.00121, 1]
    ]
  },
  "QS_mulGraftNerve[MC]": {
    "red_x_points": [
      [-7e-5, 2],
      [-0.00029, 0],
      [-0.00032, 0],
      [-0.0004, 0],
      [-0.00027, 0],
      [-0.00022, 0],
      [-0.00027, 0],
      [-0.0002, 2],
      [-0.0003, 0],
      [-0.00025, 0],
      [-0.00024, 0],
      [-8e-5, 2],
      [0.00038, 1],
      [-8e-5, 2],
      [-0.00036, 0],
      [-0.00022, 2],
      [-0.00025, 0],
      [-0.0003, 0],
      [-8e-5, 2],
      [-0.00011, 2],
      [-4e-5, 2],
      [-0.00027, 0],
      [-0.00018, 2],
      [-4e-5, 2],
      [-0.00014, 2],
      [-0.00029, 0],
      [-3e-5, 2],
      [-0.00027, 0],
      [-1e-5, 2],
      [0.00085, 1],
      [-0.00028, 0]
    ],
    "red_o_points": [],
    "y_categories": ["N", "NOT APPLICABLE", "nan"],
    "blue_o_points": [],
    "blue_x_points": [
      [0.0012, 1],
      [6e-5, 2],
      [0.00059, 1],
      [-3e-5, 0],
      [4e-5, 2],
      [0.00055, 1],
      [0.00097, 1]
    ]
  },
  "QA_yonPreOrtsurg": {
    "red_x_points": [
      [-0.00451, 0],
      [-0.00012, 2],
      [-7e-5, 0],
      [-0.00013, 0],
      [-0.00015, 0],
      [-3e-5, 0],
      [-8e-5, 0],
      [-0.00024, 2],
      [-8e-5, 0],
      [-7e-5, 0],
      [-3e-5, 2],
      [0.00526, 1],
      [-0.00093, 0],
      [-0.00052, 2],
      [-0.00017, 0],
      [-0.00475, 0],
      [0.00031, 1],
      [-8e-5, 0],
      [-0.00383, 0],
      [-0.00393, 0],
      [-0.00424, 0],
      [-0.00022, 0],
      [-0.00481, 0],
      [-0.00529, 0],
      [-0.00461, 0],
      [-0.0002, 2],
      [-0.00044, 2],
      [-0.00014, 0],
      [-0.00051, 2],
      [-0.00041, 2],
      [-6e-5, 1]
    ],
    "red_o_points": [],
    "y_categories": ["N", "Y", "nan"],
    "blue_o_points": [],
    "blue_x_points": [
      [6e-5, 0],
      [0.002, 2],
      [-6e-5, 0],
      [-1e-5, 0],
      [0.01811, 1],
      [-3e-5, 0],
      [2e-5, 0]
    ]
  },
  "QS_mulGraftNerve[Ra]": {
    "red_x_points": [
      [-0.00013, 2],
      [-0.0004, 0],
      [-0.00054, 0],
      [-0.00049, 0],
      [-0.00038, 0],
      [-0.00046, 0],
      [-0.00048, 0],
      [-0.00013, 2],
      [-0.00043, 0],
      [-0.00046, 0],
      [-0.00035, 0],
      [-0.00018, 2],
      [0.00091, 1],
      [-0.00021, 2],
      [-0.00052, 0],
      [-0.00019, 2],
      [-0.00045, 0],
      [-0.0005, 0],
      [-0.00024, 2],
      [-0.00017, 2],
      [-0.00022, 2],
      [-0.00037, 0],
      [-0.00015, 2],
      [-0.00023, 2],
      [-6e-5, 2],
      [-0.00045, 0],
      [-0.00023, 2],
      [-0.00062, 0],
      [-0.00018, 2],
      [0.0012, 1],
      [-0.00051, 0]
    ],
    "red_o_points": [],
    "y_categories": ["N", "NOT APPLICABLE", "nan"],
    "blue_o_points": [],
    "blue_x_points": [
      [0.00106, 1],
      [-8e-5, 2],
      [0.00129, 1],
      [-8e-5, 0],
      [-8e-5, 2],
      [0.00119, 1],
      [0.00151, 1]
    ]
  },
  "QS_mulTransfSite[Oberlin]": {
    "red_x_points": [
      [-0.00378, 3],
      [-0.01034, 0],
      [-0.01143, 0],
      [-0.0108, 0],
      [-0.00501, 2],
      [-0.00473, 2],
      [-0.01079, 0],
      [-0.00387, 3],
      [-0.00468, 2],
      [-0.00496, 2],
      [-0.00434, 2],
      [-0.00421, 3],
      [0.0193, 1],
      [-0.00369, 3],
      [-0.00501, 2],
      [-0.00419, 3],
      [-0.01018, 0],
      [-0.0046, 2],
      [-0.00387, 3],
      [-0.00345, 3],
      [-0.00286, 3],
      [-0.01059, 0],
      [-0.00363, 3],
      [-0.00357, 3],
      [-0.00371, 3],
      [-0.00477, 2],
      [-0.00403, 3],
      [-0.0102, 0],
      [-0.00342, 3],
      [0.01777, 1],
      [-0.01064, 0]
    ],
    "red_o_points": [],
    "y_categories": ["N", "NOT APPLICABLE", "Y", "nan"],
    "blue_o_points": [],
    "blue_x_points": [
      [0.02736, 1],
      [-0.00164, 3],
      [0.01932, 1],
      [-8e-5, 2],
      [-0.00143, 3],
      [0.02021, 1],
      [0.02147, 1]
    ]
  },
  "QS_mulGraftNerve[Ssr]": {
    "red_x_points": [
      [0.0, 0],
      [-7e-5, 2],
      [0.0, 0],
      [0.0, 0],
      [0.0, 0],
      [-7e-5, 2],
      [-0.0001, 1],
      [2e-5, 2],
      [-5e-5, 2],
      [3e-5, 0],
      [0.0, 0],
      [-7e-5, 2],
      [-7e-5, 2],
      [-7e-5, 2],
      [-0.0001, 1]
    ],
    "red_o_points": [],
    "y_categories": ["N", "NOT APPLICABLE", "nan"],
    "blue_o_points": [],
    "blue_x_points": [
      [0.00013, 1],
      [2e-5, 2],
      [4e-5, 0],
      [2e-5, 2],
      [0.00013, 1]
    ]
  },
  "QA_lstPexKine[Index]": {
    "red_x_points": [
      [-0.00151, 0],
      [-0.00042, 2],
      [-0.00026, 2],
      [-0.00012, 2],
      [3e-5, 1],
      [0.00019, 1],
      [-0.00115, 0],
      [0.00024, 2],
      [0.00026, 1],
      [4e-5, 1],
      [0.00029, 1],
      [-0.00034, 1],
      [-8e-5, 2],
      [0.00042, 2],
      [0.00027, 1],
      [3e-5, 2],
      [-0.00013, 2],
      [7e-5, 1],
      [-0.00033, 1],
      [-0.00107, 0],
      [-0.00038, 1],
      [-0.00041, 2],
      [0.0002, 2],
      [-0.00047, 1],
      [0.00043, 2],
      [-0.00048, 2],
      [-0.0006, 1],
      [-8e-5, 2],
      [-0.0004, 1],
      [-4e-5, 2],
      [-0.00037, 0]
    ],
    "red_o_points": [],
    "y_categories": ["NPV", "PV", "nan"],
    "blue_o_points": [],
    "blue_x_points": [
      [0.00035, 1],
      [0.00093, 2],
      [5e-5, 1],
      [0.00149, 1],
      [0.00056, 2],
      [0.00015, 1],
      [-3e-5, 2]
    ]
  }
}
