{
  "QS_mulLysisTrunk[Upper]": {
    "red_x_points": [
      [-0.0016, 3],
      [-0.00286, 0],
      [-0.00293, 0],
      [-0.00273, 0],
      [-0.00225, 0],
      [-0.00476, 2],
      [-0.00263, 0],
      [-0.00169, 3],
      [-0.0023, 0],
      [-0.00257, 0],
      [-0.00265, 0],
      [-0.00162, 3],
      [0.00739, 1],
      [-0.00148, 3],
      [-0.00257, 0],
      [-0.00178, 3],
      [-0.00497, 2],
      [-0.00258, 0],
      [-0.00176, 3],
      [-0.00141, 3],
      [-0.0016, 3],
      [-0.00253, 0],
      [-0.00164, 3],
      [-0.0017, 3],
      [-0.00162, 3],
      [-0.00263, 0],
      [-0.00155, 3],
      [-0.00279, 0],
      [-0.00179, 3],
      [0.00752, 1],
      [-0.00412, 2]
    ],
    "red_o_points": [],
    "y_categories": ["N", "NOT APPLICABLE", "Y", "nan"],
    "blue_o_points": [],
    "blue_x_points": [
      [0.01056, 1],
      [-0.00055, 3],
      [0.00864, 1],
      [-0.00096, 0],
      [-0.00066, 3],
      [0.00773, 1],
      [0.00956, 1]
    ]
  },
  "QS_mulBpsurgeryType[Transf]": {
    "red_x_points": [
      [-0.00055, 3],
      [-0.00064, 2],
      [-0.00177, 0],
      [-0.00058, 2],
      [-0.00065, 2],
      [-0.00064, 2],
      [-0.00074, 2],
      [-0.0006, 3],
      [-0.00064, 2],
      [-0.0007, 2],
      [-0.0007, 2],
      [-0.00045, 3],
      [0.00288, 1],
      [-0.00046, 3],
      [-0.00072, 2],
      [-0.00046, 3],
      [-0.00059, 2],
      [-0.00055, 2],
      [-0.00052, 3],
      [-0.00054, 3],
      [-0.00059, 3],
      [-0.00056, 2],
      [-0.00059, 3],
      [-0.00057, 3],
      [-0.00047, 3],
      [-0.00061, 2],
      [-0.00053, 3],
      [-0.00078, 2],
      [-0.00047, 3],
      [0.00188, 1],
      [-0.00057, 2]
    ],
    "red_o_points": [],
    "y_categories": ["N", "NOT APPLICABLE", "Y", "nan"],
    "blue_o_points": [],
    "blue_x_points": [
      [0.00294, 1],
      [-0.00019, 3],
      [0.00214, 1],
      [-0.00052, 2],
      [-0.00026, 3],
      [0.00258, 1],
      [0.00171, 1]
    ]
  },
  "QS_mulTransfSite[MPAx]": {
    "red_x_points": [
      [-3e-5, 2],
      [-2e-5, 0],
      [-2e-5, 0],
      [-2e-5, 0],
      [-2e-5, 0],
      [-2e-5, 0],
      [-2e-5, 0],
      [-2e-5, 0],
      [-3e-5, 2],
      [0.00011, 1],
      [-3e-5, 2],
      [-2e-5, 0],
      [-3e-5, 2],
      [-2e-5, 0],
      [-3e-5, 2],
      [-3e-5, 2],
      [-3e-5, 2],
      [-2e-5, 0],
      [-3e-5, 2],
      [-3e-5, 2],
      [-3e-5, 2],
      [-3e-5, 2],
      [-2e-5, 0]
    ],
    "red_o_points": [],
    "y_categories": ["N", "NOT APPLICABLE", "nan"],
    "blue_o_points": [],
    "blue_x_points": [
      [0.00011, 1],
      [-2e-5, 0],
      [-3e-5, 2],
      [0.00011, 1],
      [0.00011, 1]
    ]
  },
  "QS_mulNeuromadSite[T2]": {
    "red_x_points": [
      [-0.00168, 2],
      [-0.00391, 0],
      [-0.00517, 0],
      [-0.00417, 0],
      [-0.00432, 0],
      [-0.00474, 0],
      [-0.00378, 0],
      [-0.00142, 2],
      [-0.00442, 0],
      [-0.00429, 0],
      [-0.00452, 0],
      [-0.0016, 2],
      [0.00958, 1],
      [-0.00151, 2],
      [-0.00464, 0],
      [-0.00191, 2],
      [-0.00455, 0],
      [-0.00457, 0],
      [-0.0017, 2],
      [-0.00159, 2],
      [-0.00206, 2],
      [-0.00422, 0],
      [-0.00154, 2],
      [-0.00218, 2],
      [-0.00178, 2],
      [-0.00412, 0],
      [-0.00159, 2],
      [-0.00466, 0],
      [-0.00145, 2],
      [0.00839, 1],
      [-0.00384, 0]
    ],
    "red_o_points": [],
    "y_categories": ["N", "NOT APPLICABLE", "nan"],
    "blue_o_points": [],
    "blue_x_points": [
      [0.01514, 1],
      [-0.00025, 2],
      [0.01022, 1],
      [-0.00027, 0],
      [-0.00034, 2],
      [0.01022, 1],
      [0.01149, 1]
    ]
  },
  "QS_mulGraftRoot[T1]": {
    "red_x_points": [
      [-3e-5, 2],
      [-8e-5, 0],
      [-3e-5, 0],
      [-8e-5, 0],
      [-8e-5, 0],
      [-8e-5, 0],
      [-8e-5, 0],
      [-8e-5, 2],
      [-8e-5, 0],
      [-8e-5, 0],
      [-3e-5, 0],
      [-8e-5, 2],
      [0.0001, 1],
      [-8e-5, 2],
      [-8e-5, 0],
      [-8e-5, 2],
      [-5e-5, 0],
      [-8e-5, 2],
      [-3e-5, 2],
      [-8e-5, 0],
      [-3e-5, 2],
      [-8e-5, 2],
      [-5e-5, 2],
      [-5e-5, 0],
      [-8e-5, 2],
      [-8e-5, 0],
      [-5e-5, 2],
      [0.00023, 1]
    ],
    "red_o_points": [],
    "y_categories": ["N", "NOT APPLICABLE", "nan"],
    "blue_o_points": [],
    "blue_x_points": [
      [0.00023, 1],
      [-3e-5, 2],
      [0.00023, 1],
      [-3e-5, 0],
      [0.00012, 1],
      [0.00023, 1]
    ]
  },
  "QS_mulGraftTrunk[MiddleTrunk]": {
    "red_x_points": [
      [-0.00012, 2],
      [-0.00025, 0],
      [-0.00016, 0],
      [-0.00017, 0],
      [-0.00017, 0],
      [-0.0002, 0],
      [-0.00016, 0],
      [-0.00011, 2],
      [-0.0003, 0],
      [-0.0003, 0],
      [-0.0002, 0],
      [-6e-5, 2],
      [0.00036, 1],
      [-0.00013, 2],
      [-0.00022, 0],
      [-0.0001, 2],
      [-0.0002, 0],
      [-0.00025, 0],
      [-0.00011, 2],
      [-0.0001, 2],
      [-4e-5, 2],
      [-0.00022, 0],
      [-8e-5, 2],
      [-0.00013, 2],
      [-7e-5, 2],
      [-0.00017, 0],
      [-0.00013, 2],
      [-0.00025, 0],
      [-0.00011, 2],
      [0.00073, 1],
      [-0.00023, 0]
    ],
    "red_o_points": [],
    "y_categories": ["N", "NOT APPLICABLE", "nan"],
    "blue_o_points": [],
    "blue_x_points": [
      [0.00054, 1],
      [-2e-5, 2],
      [0.00052, 1],
      [-6e-5, 0],
      [-3e-5, 2],
      [0.00073, 1],
      [0.00053, 1]
    ]
  },
  "QS_mulGraftTrunk[LowerTrunk]": {
    "red_x_points": [
      [-4e-5, 2],
      [-0.00012, 0],
      [-6e-5, 0],
      [-0.00012, 0],
      [-0.00017, 0],
      [-0.00011, 0],
      [-0.0001, 0],
      [2e-5, 2],
      [-0.00014, 0],
      [-0.00012, 0],
      [-8e-5, 0],
      [3e-5, 2],
      [0.00019, 1],
      [-6e-5, 2],
      [5e-5, 0],
      [-4e-5, 2],
      [-6e-5, 0],
      [-6e-5, 0],
      [-4e-5, 2],
      [1e-5, 2],
      [-2e-5, 2],
      [-9e-5, 0],
      [-2e-5, 2],
      [-2e-5, 2],
      [-1e-5, 2],
      [-0.00012, 0],
      [-2e-5, 2],
      [-0.00016, 0],
      [3e-5, 2],
      [9e-5, 1],
      [-0.00012, 0]
    ],
    "red_o_points": [],
    "y_categories": ["N", "NOT APPLICABLE", "nan"],
    "blue_o_points": [],
    "blue_x_points": [
      [0.00037, 1],
      [2e-5, 2],
      [0.00033, 1],
      [6e-5, 0],
      [2e-5, 2],
      [0.00018, 1]
    ]
  },
  "QS_mulGraftNerve[Ph]": {
    "red_x_points": [
      [-0.00059, 2],
      [-0.00162, 0],
      [-0.00153, 0],
      [-0.00155, 0],
      [-0.00177, 0],
      [-0.00142, 0],
      [-0.00147, 0],
      [-0.00056, 2],
      [-0.00152, 0],
      [-0.00139, 0],
      [-0.0015, 0],
      [-0.00068, 2],
      [0.00285, 1],
      [-0.00042, 2],
      [-0.00177, 0],
      [-0.00056, 2],
      [-0.00167, 0],
      [-0.00153, 0],
      [-0.00061, 2],
      [-0.00048, 2],
      [-0.00056, 2],
      [-0.00161, 0],
      [-0.00058, 2],
      [-0.00089, 2],
      [-0.00065, 2],
      [-0.00161, 0],
      [-0.00053, 2],
      [-0.00178, 0],
      [-0.00045, 2],
      [0.00361, 1],
      [-0.00142, 0]
    ],
    "red_o_points": [],
    "y_categories": ["N", "NOT APPLICABLE", "nan"],
    "blue_o_points": [],
    "blue_x_points": [
      [0.00589, 1],
      [-3e-5, 2],
      [0.00418, 1],
      [-0.00029, 0],
      [-3e-5, 2],
      [0.00318, 1],
      [0.00364, 1]
    ]
  },
  "QA_mulInjOrthesisType[ArmSling]": {
    "red_x_points": [
      [-0.00941, 2],
      [-0.00847, 2],
      [-0.00858, 2],
      [-0.00835, 2],
      [-0.00827, 2],
      [-0.00894, 2],
      [-0.00929, 2],
      [-0.00941, 2],
      [-0.00889, 2],
      [-0.00792, 2],
      [-0.00891, 2],
      [-0.00938, 2],
      [0.0239, 1],
      [-0.00874, 2],
      [-0.00836, 2],
      [-0.00946, 2],
      [-0.01036, 0],
      [-0.00872, 2],
      [-0.0091, 2],
      [-0.00924, 2],
      [-0.01115, 0],
      [-0.01068, 3],
      [-0.00923, 2],
      [0.02574, 1],
      [-0.00948, 2],
      [-0.00838, 2],
      [-0.00971, 2],
      [-0.00891, 2],
      [-0.01141, 3],
      [-0.01617, 3],
      [-0.00821, 2]
    ],
    "red_o_points": [],
    "y_categories": ["N", "NOT APPLICABLE", "Y", "nan"],
    "blue_o_points": [],
    "blue_x_points": [
      [-0.00388, 2],
      [0.02456, 1],
      [0.02428, 1],
      [0.02816, 1],
      [0.02532, 1],
      [0.02076, 1],
      [0.0228, 1]
    ]
  },
  "QS_mulGraftRoot[C4]": {
    "red_x_points": [
      [-2e-5, 2],
      [-3e-5, 0],
      [-3e-5, 0],
      [-3e-5, 0],
      [-3e-5, 0],
      [-3e-5, 0],
      [-3e-5, 0],
      [-2e-5, 2],
      [-3e-5, 0],
      [-3e-5, 0],
      [-3e-5, 0],
      [-2e-5, 2],
      [0.0001, 1],
      [-3e-5, 0],
      [-2e-5, 2],
      [-3e-5, 0],
      [-2e-5, 2],
      [-3e-5, 0],
      [-2e-5, 2],
      [-3e-5, 0],
      [-3e-5, 0],
      [-2e-5, 2],
      [0.0001, 1]
    ],
    "red_o_points": [],
    "y_categories": ["N", "NOT APPLICABLE", "nan"],
    "blue_o_points": [],
    "blue_x_points": [
      [0.0001, 1],
      [-2e-5, 2],
      [0.0001, 1],
      [-3e-5, 0],
      [0.0001, 1]
    ]
  },
  "QA_lstPexPain[C6]": {
    "red_x_points": [
      [-0.00017, 1],
      [-5e-5, 2],
      [-0.00012, 2],
      [-0.00012, 2],
      [-0.00095, 0],
      [4e-5, 1],
      [0.00014, 1],
      [-0.00048, 0],
      [2e-5, 1],
      [4e-5, 1],
      [0.0002, 1],
      [-0.00012, 1],
      [-0.00081, 2],
      [1e-5, 2],
      [-0.0001, 2],
      [2e-5, 2],
      [-7e-5, 2],
      [0.00021, 1],
      [-0.0004, 0],
      [-0.00015, 1],
      [-0.00021, 1],
      [-9e-5, 2],
      [0.00016, 2],
      [-0.00504, 0],
      [-0.00011, 2],
      [-0.00018, 2],
      [-0.00021, 1],
      [-6e-5, 2],
      [-0.00013, 1],
      [6e-5, 1],
      [6e-5, 1]
    ],
    "red_o_points": [],
    "y_categories": ["NORM", "NPV", "nan"],
    "blue_o_points": [],
    "blue_x_points": [
      [0.00019, 1],
      [0.00028, 2],
      [0.00106, 1],
      [0.00147, 1],
      [0.00013, 2],
      [0.00117, 1],
      [0.00096, 1]
    ]
  },
  "QS_mulGraftLevel[Nerve]": {
    "red_x_points": [
      [1e-5, 2],
      [-0.00021, 0],
      [-0.00017, 0],
      [-0.00012, 0],
      [-0.00019, 0],
      [-0.00017, 0],
      [-0.00017, 0],
      [-1e-5, 2],
      [-0.00014, 0],
      [-8e-5, 0],
      [-0.0001, 0],
      [0.0, 2],
      [9e-5, 1],
      [5e-5, 2],
      [-0.00012, 0],
      [-7e-5, 2],
      [-0.0001, 0],
      [-0.00012, 0],
      [0.0, 2],
      [0.0, 2],
      [1e-5, 2],
      [-0.00012, 0],
      [0.0, 2],
      [0.0, 2],
      [-9e-5, 2],
      [-0.00017, 0],
      [0.0, 2],
      [-9e-5, 0],
      [6e-5, 2],
      [0.00032, 1],
      [-0.00027, 0]
    ],
    "red_o_points": [],
    "y_categories": ["N", "NOT APPLICABLE", "nan"],
    "blue_o_points": [],
    "blue_x_points": [
      [0.00021, 1],
      [5e-5, 2],
      [0.00023, 1],
      [-1e-5, 0],
      [5e-5, 2],
      [0.00049, 1],
      [0.0004, 1]
    ]
  },
  "QA_lstPexInspectio[SurgicalScar]": {
    "red_x_points": [
      [0.00151, 1],
      [0.00081, 1],
      [0.0003, 0],
      [0.0009, 1],
      [-0.00312, 2],
      [0.00026, 0],
      [0.00076, 1],
      [0.00154, 1],
      [0.00079, 1],
      [-0.00245, 2],
      [0.00087, 1],
      [-0.00092, 0],
      [-0.00097, 1],
      [-0.00483, 2],
      [0.00099, 1],
      [0.00164, 1],
      [-0.00013, 0],
      [-0.00311, 2],
      [-0.00371, 2],
      [-0.00386, 2],
      [0.00158, 1],
      [0.00069, 1],
      [-0.00417, 2],
      [-0.00919, 2],
      [0.00141, 1],
      [0.0008, 1],
      [-0.0041, 2],
      [-0.00252, 2],
      [0.00159, 1],
      [-0.00091, 1],
      [-0.00216, 2]
    ],
    "red_o_points": [],
    "y_categories": ["ABS", "NAIA", "PT", "nan"],
    "blue_o_points": [],
    "blue_x_points": [
      [2e-5, 1],
      [0.00293, 1],
      [0.00442, 0],
      [0.00245, 1],
      [0.00306, 1],
      [0.00026, 1],
      [0.00496, 0]
    ]
  },
  "QA_intPexWristFlex": {
    "red_x_points": [[0.00063, 2], [-0.014, 1]],
    "red_o_points": [],
    "y_categories": ["GREATER THAN OR EQUALS TO 60", "LESS THAN 60", "nan"],
    "blue_o_points": [],
    "blue_x_points": [[0.00132, 2], [0.0056, 0], [0.00106, 2], [0.00115, 2]]
  },
  "QS_mulGraftNerve[Me]": {
    "red_x_points": [
      [-0.00031, 2],
      [-0.00098, 0],
      [-0.00112, 0],
      [-0.00116, 0],
      [-0.00107, 0],
      [-0.00105, 0],
      [-0.00112, 0],
      [-0.00028, 2],
      [-0.00128, 0],
      [-0.00106, 0],
      [-0.00094, 0],
      [-0.00033, 2],
      [0.00166, 1],
      [-0.00044, 2],
      [-0.00114, 0],
      [-0.00057, 2],
      [-0.00082, 0],
      [-0.00111, 0],
      [-0.00054, 2],
      [-0.00027, 2],
      [-0.00041, 2],
      [-0.00096, 0],
      [-0.00042, 2],
      [-0.00028, 2],
      [-0.00047, 2],
      [-0.00102, 0],
      [-0.00031, 2],
      [-0.00109, 0],
      [-0.00047, 2],
      [0.00217, 1],
      [-0.00101, 0]
    ],
    "red_o_points": [],
    "y_categories": ["N", "NOT APPLICABLE", "nan"],
    "blue_o_points": [],
    "blue_x_points": [
      [0.00402, 1],
      [3e-5, 2],
      [0.00289, 1],
      [-0.00018, 0],
      [7e-5, 2],
      [0.00269, 1],
      [0.00298, 1]
    ]
  },
  "QS_mulGraftRoot[T2]": {
    "red_x_points": [
      [1e-5, 2],
      [-2e-5, 0],
      [-2e-5, 0],
      [-2e-5, 0],
      [-2e-5, 0],
      [-2e-5, 0],
      [1e-5, 2],
      [2e-5, 1],
      [1e-5, 2],
      [-2e-5, 0],
      [1e-5, 2],
      [-2e-5, 0],
      [-2e-5, 0],
      [1e-5, 2],
      [1e-5, 2],
      [-2e-5, 0],
      [1e-5, 2],
      [1e-5, 2],
      [-2e-5, 0],
      [1e-5, 2],
      [-2e-5, 0],
      [1e-5, 2],
      [2e-5, 1]
    ],
    "red_o_points": [],
    "y_categories": ["N", "NOT APPLICABLE", "nan"],
    "blue_o_points": [],
    "blue_x_points": [[1e-5, 2], [-2e-5, 0], [1e-5, 2], [2e-5, 1]]
  },
  "QS_mulGraftRoot[C7]": {
    "red_x_points": [
      [-2e-5, 2],
      [-3e-5, 0],
      [-3e-5, 0],
      [-3e-5, 0],
      [-3e-5, 0],
      [-2e-5, 2],
      [-3e-5, 0],
      [-2e-5, 2],
      [-2e-5, 2],
      [-3e-5, 0],
      [-2e-5, 2],
      [-3e-5, 0],
      [-3e-5, 0],
      [-2e-5, 2],
      [-2e-5, 2],
      [-2e-5, 2],
      [-2e-5, 2],
      [-2e-5, 2],
      [-2e-5, 2],
      [-3e-5, 0],
      [-3e-5, 0],
      [0.00011, 1],
      [-3e-5, 0]
    ],
    "red_o_points": [],
    "y_categories": ["N", "NOT APPLICABLE", "nan"],
    "blue_o_points": [],
    "blue_x_points": [
      [0.00011, 1],
      [-2e-5, 2],
      [-3e-5, 0],
      [-2e-5, 2],
      [0.00011, 1],
      [0.00011, 1]
    ]
  },
  "QS_mulLysisSite[Trunk]": {
    "red_x_points": [
      [-0.00185, 3],
      [-0.00287, 0],
      [-0.00318, 0],
      [-0.00321, 0],
      [-0.0034, 0],
      [-0.0049, 2],
      [-0.00309, 0],
      [-0.00188, 3],
      [-0.00306, 0],
      [-0.00298, 0],
      [-0.0025, 0],
      [-0.00176, 3],
      [0.0078, 1],
      [-0.00218, 3],
      [-0.00295, 0],
      [-0.00204, 3],
      [-0.00508, 2],
      [-0.00276, 0],
      [-0.00221, 3],
      [-0.00175, 3],
      [-0.00187, 3],
      [-0.0027, 0],
      [-0.00197, 3],
      [-0.00205, 3],
      [-0.00198, 3],
      [-0.00304, 0],
      [-0.00187, 3],
      [-0.00306, 0],
      [-0.00188, 3],
      [0.0082, 1],
      [-0.00446, 2]
    ],
    "red_o_points": [],
    "y_categories": ["N", "NOT APPLICABLE", "Y", "nan"],
    "blue_o_points": [],
    "blue_x_points": [
      [0.01143, 1],
      [-0.00095, 3],
      [0.01029, 1],
      [-0.00162, 0],
      [-0.00079, 3],
      [0.01, 1],
      [0.01063, 1]
    ]
  },
  "QS_mulTransfSite[PhMc]": {
    "red_x_points": [
      [-0.00111, 3],
      [-0.00252, 0],
      [-0.00284, 0],
      [-0.00229, 0],
      [-0.00285, 0],
      [-0.0024, 0],
      [-0.00462, 2],
      [-0.00112, 3],
      [-0.00235, 0],
      [-0.00249, 0],
      [-0.00253, 0],
      [-0.00124, 3],
      [0.006, 1],
      [-0.00125, 3],
      [-0.00242, 0],
      [-0.00142, 3],
      [-0.0024, 0],
      [-0.00295, 0],
      [-0.00123, 3],
      [-0.00134, 3],
      [-0.0013, 3],
      [-0.00389, 2],
      [-0.00104, 3],
      [-0.00147, 3],
      [-0.00108, 3],
      [-0.0026, 0],
      [-0.00117, 3],
      [-0.00274, 0],
      [-0.00117, 3],
      [0.00701, 1],
      [-0.00202, 0]
    ],
    "red_o_points": [],
    "y_categories": ["N", "NOT APPLICABLE", "Y", "nan"],
    "blue_o_points": [],
    "blue_x_points": [
      [0.00972, 1],
      [-0.00045, 3],
      [0.00731, 1],
      [-0.00113, 0],
      [-0.0004, 3],
      [0.00738, 1],
      [0.00718, 1]
    ]
  },
  "QS_mulLysisRoot[C6]": {
    "red_x_points": [
      [-0.00133, 3],
      [-0.00252, 0],
      [-0.00448, 2],
      [-0.00249, 0],
      [-0.00249, 0],
      [-0.00252, 0],
      [-0.00256, 0],
      [-0.00152, 3],
      [-0.0028, 0],
      [-0.00257, 0],
      [-0.00243, 0],
      [-0.00139, 3],
      [0.00762, 1],
      [-0.00131, 3],
      [-0.00257, 0],
      [-0.00112, 3],
      [-0.00238, 0],
      [-0.00247, 0],
      [-0.00144, 3],
      [-0.00121, 3],
      [-0.00111, 3],
      [-0.00255, 0],
      [-0.00148, 3],
      [-0.00132, 3],
      [-0.00147, 3],
      [-0.00257, 0],
      [-0.00133, 3],
      [-0.00283, 0],
      [-0.00154, 3],
      [0.00677, 1],
      [-0.00424, 2]
    ],
    "red_o_points": [],
    "y_categories": ["N", "NOT APPLICABLE", "Y", "nan"],
    "blue_o_points": [],
    "blue_x_points": [
      [0.00942, 1],
      [-0.0006, 3],
      [0.0078, 1],
      [-0.00219, 0],
      [-0.00065, 3],
      [0.00812, 1],
      [0.00956, 1]
    ]
  },
  "QA_yonInjOrtsurg": {
    "red_x_points": [
      [-0.00326, 2],
      [-0.0004, 2],
      [0.0, 2],
      [-5e-5, 2],
      [2e-5, 2],
      [4e-5, 2],
      [-0.00035, 1],
      [-0.00372, 2],
      [-9e-5, 0],
      [-0.00038, 1],
      [-0.00017, 1],
      [-0.00338, 2],
      [-0.00263, 0],
      [0.0008, 1],
      [-9e-5, 2],
      [-0.00344, 2],
      [0.00013, 0],
      [-3e-5, 2],
      [0.00345, 0],
      [0.00038, 1],
      [-0.00344, 2],
      [-0.00035, 1],
      [-0.00481, 2],
      [-0.00334, 2],
      [-0.00354, 2],
      [8e-5, 0],
      [-0.00019, 1],
      [-1e-5, 0],
      [-0.00375, 2],
      [-0.00108, 1],
      [-0.00027, 1]
    ],
    "red_o_points": [],
    "y_categories": ["N", "Y", "nan"],
    "blue_o_points": [],
    "blue_x_points": [
      [0.00036, 2],
      [0.0044, 1],
      [0.00029, 2],
      [0.00031, 2],
      [0.01433, 0],
      [0.00047, 2],
      [0.00033, 2]
    ]
  },
  "QS_mulGraftNerve[other]": {
    "red_x_points": [
      [-0.00062, 2],
      [-0.0018, 0],
      [-0.00171, 0],
      [-0.00161, 0],
      [-0.00169, 0],
      [-0.00165, 0],
      [-0.00177, 0],
      [-0.00058, 2],
      [-0.00175, 0],
      [-0.00174, 0],
      [-0.00168, 0],
      [-0.00066, 2],
      [0.00315, 1],
      [-0.00055, 2],
      [-0.00162, 0],
      [-0.00073, 2],
      [-0.00173, 0],
      [-0.00237, 0],
      [-0.00073, 2],
      [-0.00052, 2],
      [-0.00055, 2],
      [-0.00172, 0],
      [-0.00049, 2],
      [-0.00072, 2],
      [-0.00068, 2],
      [-0.00181, 0],
      [-0.00071, 2],
      [-0.00186, 0],
      [-0.00043, 2],
      [0.00389, 1],
      [-0.00171, 0]
    ],
    "red_o_points": [],
    "y_categories": ["N", "NOT APPLICABLE", "nan"],
    "blue_o_points": [],
    "blue_x_points": [
      [0.00601, 1],
      [-7e-5, 2],
      [0.00466, 1],
      [-0.00034, 0],
      [0.00015, 2],
      [0.00429, 1],
      [0.00399, 1]
    ]
  },
  "QS_mulGraftNerve[DS]": {
    "red_x_points": [
      [0.0, 2],
      [-0.00015, 0],
      [-0.00013, 0],
      [-0.00013, 0],
      [-0.00016, 0],
      [-0.00014, 0],
      [-7e-5, 0],
      [-5e-5, 2],
      [-0.00016, 0],
      [-0.00013, 0],
      [-0.00011, 0],
      [-5e-5, 2],
      [9e-5, 1],
      [-7e-5, 2],
      [-0.00021, 0],
      [-0.0, 2],
      [-0.00012, 0],
      [-0.00013, 0],
      [-5e-5, 2],
      [-5e-5, 2],
      [-3e-5, 2],
      [-0.00017, 0],
      [-5e-5, 2],
      [-7e-5, 2],
      [-7e-5, 2],
      [-0.00017, 0],
      [-1e-5, 2],
      [-0.00016, 0],
      [-7e-5, 2],
      [0.00036, 1],
      [-0.00013, 0]
    ],
    "red_o_points": [],
    "y_categories": ["N", "NOT APPLICABLE", "nan"],
    "blue_o_points": [],
    "blue_x_points": [
      [0.00033, 1],
      [0.00011, 2],
      [0.00024, 1],
      [-2e-5, 0],
      [9e-5, 2],
      [0.00024, 1],
      [0.00051, 1]
    ]
  },
  "QS_mulGraftNerve[LP]": {
    "red_x_points": [
      [-4e-5, 2],
      [-0.00016, 0],
      [-0.00025, 0],
      [-0.00016, 0],
      [-0.00016, 0],
      [-8e-5, 0],
      [-0.0001, 0],
      [-3e-5, 2],
      [-0.00013, 0],
      [-7e-5, 0],
      [-0.00013, 0],
      [-5e-5, 2],
      [0.00018, 1],
      [-0.00012, 2],
      [-0.00011, 0],
      [-0.00012, 2],
      [-6e-5, 0],
      [-0.00011, 0],
      [-4e-5, 2],
      [-5e-5, 2],
      [-2e-5, 2],
      [-9e-5, 0],
      [-0.0001, 2],
      [-2e-5, 2],
      [-4e-5, 2],
      [-0.00016, 0],
      [-2e-5, 2],
      [-0.00011, 0],
      [-0.00013, 2],
      [0.00024, 1],
      [-0.00016, 0]
    ],
    "red_o_points": [],
    "y_categories": ["N", "NOT APPLICABLE", "nan"],
    "blue_o_points": [],
    "blue_x_points": [
      [0.00073, 1],
      [-0.00011, 2],
      [0.00023, 1],
      [6e-5, 0],
      [-2e-5, 2],
      [0.00035, 1],
      [0.00037, 1]
    ]
  },
  "QA_lstPexMuscstrength[WristFlex]": {
    "red_x_points": [
      [-0.00369, 1],
      [-0.00026, 2],
      [-0.00137, 1],
      [-0.00145, 1],
      [0.00046, 0],
      [0.00045, 0],
      [-0.00158, 1],
      [-0.00197, 0],
      [0.00072, 0],
      [0.00052, 0],
      [0.00075, 0],
      [-0.00156, 0],
      [-0.00064, 2],
      [0.00236, 2],
      [-0.00039, 2],
      [-0.00139, 0],
      [-0.00017, 2],
      [0.00037, 0],
      [-0.00129, 0],
      [-0.00307, 1],
      [-0.00172, 0],
      [-0.00162, 1],
      [0.00139, 2],
      [-0.00764, 1],
      [-0.00147, 0],
      [0.00046, 0],
      [-0.0034, 1],
      [0.00042, 0],
      [0.00247, 2],
      [-0.0003, 2],
      [-0.00106, 1]
    ],
    "red_o_points": [],
    "y_categories": ["GREATER THAN OR EQUALS TO 3", "LESS THAN 3", "nan"],
    "blue_o_points": [],
    "blue_x_points": [
      [0.00068, 0],
      [0.00411, 2],
      [0.00106, 0],
      [0.00202, 0],
      [0.00477, 2],
      [0.0014, 0],
      [0.00141, 0]
    ]
  },
  "QS_mulNeuromadSite[C5]": {
    "red_x_points": [
      [-0.00103, 2],
      [-0.00405, 0],
      [-0.0037, 0],
      [-0.00384, 0],
      [-0.00433, 0],
      [-0.00376, 0],
      [-0.00381, 0],
      [-0.00114, 2],
      [-0.00378, 0],
      [-0.0034, 0],
      [-0.00332, 0],
      [-0.00136, 2],
      [0.00573, 1],
      [-0.00081, 2],
      [-0.00371, 0],
      [-0.0013, 2],
      [-0.00391, 0],
      [-0.00402, 0],
      [-0.00135, 2],
      [-0.0011, 2],
      [-0.00122, 2],
      [-0.00318, 0],
      [-0.00089, 2],
      [-0.00156, 2],
      [-0.00114, 2],
      [-0.00354, 0],
      [-0.00079, 2],
      [-0.00377, 0],
      [-0.00086, 2],
      [0.00884, 1],
      [-0.0037, 0]
    ],
    "red_o_points": [],
    "y_categories": ["N", "NOT APPLICABLE", "nan"],
    "blue_o_points": [],
    "blue_x_points": [
      [0.01175, 1],
      [6e-5, 2],
      [0.00885, 1],
      [-0.00044, 0],
      [6e-5, 2],
      [0.00826, 1],
      [0.00929, 1]
    ]
  },
  "QS_mulNeuromadSite[C7]": {
    "red_x_points": [
      [-0.00086, 2],
      [-0.00266, 0],
      [-0.00291, 0],
      [-0.00265, 0],
      [-0.0027, 0],
      [-0.00264, 0],
      [-0.00268, 0],
      [-0.00098, 2],
      [-0.00306, 0],
      [-0.00273, 0],
      [-0.00292, 0],
      [-0.00118, 2],
      [0.00444, 1],
      [-0.0008, 2],
      [-0.00296, 0],
      [-0.00133, 2],
      [-0.00272, 0],
      [-0.00248, 0],
      [-0.00114, 2],
      [-0.00081, 2],
      [-0.00104, 2],
      [-0.00274, 0],
      [-0.00093, 2],
      [-0.00125, 2],
      [-0.00115, 2],
      [-0.00266, 0],
      [-0.00099, 2],
      [-0.0025, 0],
      [-0.00084, 2],
      [0.0057, 1],
      [-0.00252, 0]
    ],
    "red_o_points": [],
    "y_categories": ["N", "NOT APPLICABLE", "nan"],
    "blue_o_points": [],
    "blue_x_points": [
      [0.00817, 1],
      [-0.0003, 2],
      [0.00741, 1],
      [-0.00022, 0],
      [5e-5, 2],
      [0.00705, 1],
      [0.00778, 1]
    ]
  },
  "QA_lstPexMuscstrength[ShoulderInrot]": {
    "red_x_points": [
      [-0.00155, 1],
      [0.00011, 2],
      [0.00031, 0],
      [-0.00125, 1],
      [0.00041, 0],
      [-0.00081, 1],
      [0.00019, 2],
      [-0.00116, 1],
      [0.00036, 0],
      [0.00013, 2],
      [0.0002, 2],
      [-0.00139, 1],
      [0.00021, 2],
      [0.00016, 2],
      [5e-5, 2],
      [0.00025, 2],
      [7e-5, 2],
      [-0.00095, 1],
      [0.00052, 0],
      [-0.00075, 1],
      [0.00022, 0],
      [8e-5, 2],
      [9e-5, 2],
      [0.00015, 2],
      [0.00014, 2],
      [-0.00113, 1],
      [0.0001, 2],
      [-0.001, 1],
      [0.00013, 2],
      [0.00016, 2],
      [0.00027, 0]
    ],
    "red_o_points": [],
    "y_categories": ["GREATER THAN OR EQUALS TO 3", "LESS THAN 3", "nan"],
    "blue_o_points": [],
    "blue_x_points": [
      [0.0001, 2],
      [0.00023, 2],
      [0.00071, 0],
      [0.00035, 2],
      [0.0002, 2],
      [0.00075, 0],
      [0.00092, 0]
    ]
  },
  "QS_mulTransfSite[IMc]": {
    "red_x_points": [
      [-0.00305, 3],
      [-0.00743, 2],
      [-0.00446, 0],
      [-0.00407, 0],
      [-0.00429, 0],
      [-0.00456, 0],
      [-0.0044, 0],
      [-0.00279, 3],
      [-0.00435, 0],
      [-0.00411, 0],
      [-0.00432, 0],
      [-0.00266, 3],
      [0.01105, 1],
      [-0.00237, 3],
      [-0.00438, 0],
      [-0.00294, 3],
      [-0.0075, 2],
      [-0.00466, 0],
      [-0.00257, 3],
      [-0.00272, 3],
      [-0.00302, 3],
      [-0.00412, 0],
      [-0.00288, 3],
      [-0.00289, 3],
      [-0.00267, 3],
      [-0.00424, 0],
      [-0.00308, 3],
      [-0.00753, 2],
      [-0.00264, 3],
      [0.01357, 1],
      [-0.00701, 2]
    ],
    "red_o_points": [],
    "y_categories": ["N", "NOT APPLICABLE", "Y", "nan"],
    "blue_o_points": [],
    "blue_x_points": [
      [0.01656, 1],
      [-0.00052, 3],
      [0.01412, 1],
      [-0.00178, 0],
      [-0.00118, 3],
      [0.01672, 1],
      [0.01544, 1]
    ]
  },
  "QS_mulGraftNerve[SS]": {
    "red_x_points": [
      [-0.0001, 2],
      [-0.0003, 0],
      [-0.00049, 0],
      [-0.0004, 0],
      [-0.00048, 0],
      [-0.00029, 0],
      [-0.00033, 0],
      [-0.00012, 2],
      [-0.00047, 0],
      [-0.00034, 0],
      [-0.00032, 0],
      [-0.00011, 2],
      [0.00062, 1],
      [-0.00011, 2],
      [-0.00037, 0],
      [-0.00014, 2],
      [-0.0004, 0],
      [-0.00042, 0],
      [-9e-5, 2],
      [-0.0001, 2],
      [-6e-5, 2],
      [-0.0003, 0],
      [-5e-5, 2],
      [-0.0002, 2],
      [-8e-5, 2],
      [-0.00037, 0],
      [-8e-5, 2],
      [-0.00041, 0],
      [-0.0001, 2],
      [0.00069, 1],
      [-0.00029, 0]
    ],
    "red_o_points": [],
    "y_categories": ["N", "NOT APPLICABLE", "nan"],
    "blue_o_points": [],
    "blue_x_points": [
      [0.00156, 1],
      [-2e-5, 2],
      [0.00108, 1],
      [-7e-5, 0],
      [-8e-5, 2],
      [0.00094, 1],
      [0.00101, 1]
    ]
  },
  "QA_yonPreOrtsurg": {
    "red_x_points": [
      [-0.00347, 0],
      [-0.00021, 2],
      [-2e-5, 0],
      [-0.00012, 0],
      [-2e-5, 0],
      [-2e-5, 0],
      [-3e-5, 0],
      [-0.00019, 2],
      [-4e-5, 0],
      [-2e-5, 0],
      [-9e-5, 2],
      [0.00493, 1],
      [-0.00092, 0],
      [-0.00031, 2],
      [-0.00028, 0],
      [-0.00398, 0],
      [0.00015, 1],
      [-2e-5, 0],
      [-0.00364, 0],
      [-0.00332, 0],
      [-0.00373, 0],
      [-0.00013, 0],
      [-0.004, 0],
      [-0.00498, 0],
      [-0.00422, 0],
      [-0.00016, 2],
      [-0.00029, 2],
      [-5e-5, 0],
      [-0.00024, 2],
      [-0.0003, 2],
      [2e-5, 1]
    ],
    "red_o_points": [],
    "y_categories": ["N", "Y", "nan"],
    "blue_o_points": [],
    "blue_x_points": [
      [1e-5, 0],
      [0.00229, 2],
      [-5e-5, 0],
      [-0.00012, 0],
      [0.01575, 1],
      [-9e-5, 0],
      [0.0, 0]
    ]
  },
  "QA_lstPexMuscstrength[FingersAddu]": {
    "red_x_points": [
      [-0.00016, 0],
      [6e-5, 2],
      [-5e-5, 1],
      [-0.00015, 1],
      [-0.0, 0],
      [1e-5, 0],
      [-0.00017, 1],
      [-0.00015, 0],
      [-5e-5, 0],
      [2e-5, 2],
      [-4e-5, 0],
      [-0.00011, 0],
      [3e-5, 2],
      [6e-5, 2],
      [8e-5, 2],
      [-0.00016, 0],
      [3e-5, 2],
      [-1e-5, 0],
      [-5e-5, 0],
      [-0.00031, 1],
      [-9e-5, 0],
      [-0.00015, 1],
      [0.00012, 2],
      [3e-5, 2],
      [7e-5, 2],
      [2e-5, 2],
      [5e-5, 2],
      [-5e-5, 1],
      [0.00015, 2],
      [0.00011, 2],
      [-4e-5, 1]
    ],
    "red_o_points": [],
    "y_categories": ["GREATER THAN OR EQUALS TO 3", "LESS THAN 3", "nan"],
    "blue_o_points": [],
    "blue_x_points": [
      [9e-5, 2],
      [0.0001, 0],
      [0.00011, 2],
      [0.00019, 2],
      [-4e-5, 0],
      [1e-5, 0]
    ]
  },
  "QS_mulLysisRoot[C7]": {
    "red_x_points": [
      [-0.00057, 3],
      [-0.00111, 0],
      [-0.00226, 2],
      [-0.00115, 0],
      [-0.00126, 0],
      [-0.00118, 0],
      [-0.00095, 0],
      [-0.00062, 3],
      [-0.00128, 0],
      [-0.00112, 0],
      [-0.00102, 0],
      [-0.00053, 3],
      [0.00313, 1],
      [-0.00061, 3],
      [-0.00132, 0],
      [-0.0008, 3],
      [-0.00124, 0],
      [-0.00106, 0],
      [-0.00057, 3],
      [-0.00047, 3],
      [-0.00063, 3],
      [-0.00099, 0],
      [-0.00048, 3],
      [-0.00059, 3],
      [-0.00049, 3],
      [-0.00093, 0],
      [-0.00067, 3],
      [-0.00117, 0],
      [-0.00065, 3],
      [0.00304, 1],
      [-0.00105, 0]
    ],
    "red_o_points": [],
    "y_categories": ["N", "NOT APPLICABLE", "Y", "nan"],
    "blue_o_points": [],
    "blue_x_points": [
      [0.00377, 1],
      [-0.00011, 3],
      [0.0035, 1],
      [-0.00087, 0],
      [-0.00031, 3],
      [0.00344, 1],
      [0.0037, 1]
    ]
  },
  "QS_mulTransfSite[PhAc]": {
    "red_x_points": [
      [-0.0, 2],
      [-5e-5, 0],
      [-5e-5, 0],
      [-5e-5, 0],
      [-5e-5, 0],
      [-5e-5, 0],
      [-0.0, 2],
      [-5e-5, 0],
      [-5e-5, 0],
      [-5e-5, 0],
      [0.00011, 1],
      [-0.0, 2],
      [-5e-5, 0],
      [-0.0, 2],
      [-0.0, 2],
      [-0.0, 2],
      [-0.0, 2],
      [-5e-5, 0],
      [-0.0, 2],
      [-0.0, 2],
      [-0.0, 2],
      [-5e-5, 0],
      [-5e-5, 0]
    ],
    "red_o_points": [],
    "y_categories": ["N", "NOT APPLICABLE", "nan"],
    "blue_o_points": [],
    "blue_x_points": [[0.00011, 1], [-0.0, 2], [0.00011, 1], [0.00011, 1]]
  },
  "QA_yonInjBpsurg": {
    "red_x_points": [
      [-0.00304, 1],
      [-0.00252, 1],
      [-0.00357, 1],
      [-0.00257, 1],
      [-0.00334, 1],
      [-0.00269, 1],
      [-0.00278, 1],
      [-0.00264, 1],
      [-0.00313, 1],
      [-0.00287, 1],
      [-0.00267, 1],
      [-0.00297, 1],
      [0.00707, 0],
      [-0.00262, 1],
      [-0.00266, 1],
      [-0.00282, 1],
      [-0.00241, 1],
      [-0.00315, 1],
      [-0.00361, 1],
      [-0.00283, 1],
      [-0.00274, 1],
      [-0.00209, 1],
      [-0.00276, 1],
      [-0.00283, 1],
      [-0.00276, 1],
      [-0.00267, 1],
      [-0.00273, 1],
      [-0.00263, 1],
      [-0.00266, 1],
      [0.008, 0],
      [-0.00261, 1]
    ],
    "red_o_points": [],
    "y_categories": ["N", "Y", "nan"],
    "blue_o_points": [],
    "blue_x_points": [
      [0.01494, 0],
      [-0.00105, 1],
      [0.00975, 0],
      [-0.00238, 1],
      [-0.00082, 1],
      [0.01032, 0],
      [0.00901, 0]
    ]
  },
  "QS_mulNeuromadSite[T1]": {
    "red_x_points": [
      [-0.00095, 2],
      [-0.0031, 0],
      [-0.00369, 0],
      [-0.0032, 0],
      [-0.00321, 0],
      [-0.00357, 0],
      [-0.00315, 0],
      [-0.00094, 2],
      [-0.00328, 0],
      [-0.0031, 0],
      [-0.00302, 0],
      [-0.00142, 2],
      [0.00519, 1],
      [-0.00087, 2],
      [-0.00292, 0],
      [-0.00108, 2],
      [-0.00315, 0],
      [-0.00277, 0],
      [-0.00088, 2],
      [-0.00087, 2],
      [-0.0007, 2],
      [-0.00281, 0],
      [-0.00107, 2],
      [-0.00136, 2],
      [-0.00112, 2],
      [-0.00344, 0],
      [-0.00078, 2],
      [-0.0033, 0],
      [-0.00085, 2],
      [0.00625, 1],
      [-0.00291, 0]
    ],
    "red_o_points": [],
    "y_categories": ["N", "NOT APPLICABLE", "nan"],
    "blue_o_points": [],
    "blue_x_points": [
      [0.01099, 1],
      [-0.00012, 2],
      [0.00663, 1],
      [1e-5, 0],
      [-6e-5, 2],
      [0.00739, 1],
      [0.00896, 1]
    ]
  },
  "QS_mulBpsurgeryType[Graft]": {
    "red_x_points": [
      [-0.00021, 3],
      [-0.00056, 0],
      [-0.00054, 0],
      [-0.00051, 0],
      [-0.00056, 0],
      [-0.00041, 0],
      [-0.00045, 0],
      [-0.00034, 3],
      [-0.00061, 0],
      [-0.00047, 0],
      [-0.00049, 0],
      [-0.00039, 3],
      [0.0012, 1],
      [-0.00025, 3],
      [-0.00164, 2],
      [-0.00027, 3],
      [-0.00058, 0],
      [-0.00053, 0],
      [-0.00025, 3],
      [-0.00031, 3],
      [-0.00035, 3],
      [-0.00053, 0],
      [-0.00037, 3],
      [-0.00034, 3],
      [-0.00042, 3],
      [-0.0006, 0],
      [-0.00034, 3],
      [-0.00047, 0],
      [-0.00043, 3],
      [0.0018, 1],
      [-0.00048, 0]
    ],
    "red_o_points": [],
    "y_categories": ["N", "NOT APPLICABLE", "Y", "nan"],
    "blue_o_points": [],
    "blue_x_points": [
      [0.00197, 1],
      [-6e-5, 3],
      [0.00215, 1],
      [-0.00066, 0],
      [-2e-5, 3],
      [0.00185, 1],
      [0.00208, 1]
    ]
  },
  "QS_mulLysisSite[Root]": {
    "red_x_points": [
      [-0.00077, 3],
      [-0.00108, 0],
      [-0.00227, 2],
      [-0.00122, 0],
      [-0.00104, 0],
      [-0.00098, 0],
      [-0.00111, 0],
      [-0.00078, 3],
      [-0.00097, 0],
      [-0.00097, 0],
      [-0.00099, 0],
      [-0.0007, 3],
      [0.00343, 1],
      [-0.00065, 3],
      [-0.00104, 0],
      [-0.0008, 3],
      [-0.00117, 0],
      [-0.00085, 0],
      [-0.00075, 3],
      [-0.00071, 3],
      [-0.00072, 3],
      [-0.00102, 0],
      [-0.00062, 3],
      [-0.00064, 3],
      [-0.00057, 3],
      [-0.00081, 0],
      [-0.00065, 3],
      [-0.00123, 0],
      [-0.00044, 3],
      [0.00371, 1],
      [-0.00254, 2]
    ],
    "red_o_points": [],
    "y_categories": ["N", "NOT APPLICABLE", "Y", "nan"],
    "blue_o_points": [],
    "blue_x_points": [
      [0.0037, 1],
      [-0.00019, 3],
      [0.00349, 1],
      [-0.00105, 0],
      [-0.0004, 3],
      [0.00381, 1],
      [0.00404, 1]
    ]
  },
  "QA_lstPexPalle[Clavicle]": {
    "red_x_points": [
      [0.0001, 3],
      [3e-5, 3],
      [1e-5, 3],
      [-0.0, 3],
      [-8e-5, 2],
      [-0.00016, 2],
      [0.0001, 3],
      [3e-5, 3],
      [3e-5, 3],
      [-7e-5, 2],
      [-0.00017, 2],
      [-0.00017, 0],
      [0.00074, 3],
      [6e-5, 3],
      [1e-5, 3],
      [7e-5, 3],
      [-6e-5, 0],
      [-0.00017, 0],
      [-3e-5, 0],
      [-0.0003, 2],
      [-0.00017, 1],
      [7e-5, 3],
      [-0.00322, 2],
      [3e-5, 3],
      [3e-5, 3],
      [-0.00018, 2],
      [3e-5, 3],
      [3e-5, 3],
      [-0.01652, 2],
      [7e-5, 0]
    ],
    "red_o_points": [],
    "y_categories": ["HYPO", "NAIA", "PT", "nan"],
    "blue_o_points": [],
    "blue_x_points": [
      [0.00154, 3],
      [0.00049, 3],
      [0.00712, 0],
      [0.00027, 3],
      [0.00026, 3],
      [0.00156, 3],
      [0.00179, 3]
    ]
  },
  "QS_mulGraftNerve[LT]": {
    "red_x_points": [
      [-0.00016, 2],
      [-0.00014, 0],
      [-0.0002, 0],
      [-0.00012, 0],
      [-0.00018, 0],
      [-0.0002, 0],
      [-0.00019, 0],
      [-0.00015, 2],
      [-0.00027, 0],
      [-0.00017, 0],
      [-0.00016, 0],
      [-0.00016, 2],
      [0.00033, 1],
      [-0.00013, 2],
      [-0.00016, 0],
      [-8e-5, 2],
      [-0.00028, 0],
      [-0.0001, 0],
      [-9e-5, 2],
      [-9e-5, 2],
      [-0.00013, 2],
      [-0.00015, 0],
      [-0.00016, 2],
      [-9e-5, 2],
      [-0.00015, 2],
      [-0.00032, 0],
      [-0.00012, 2],
      [-0.00032, 0],
      [-8e-5, 2],
      [0.00038, 1],
      [-0.00017, 0]
    ],
    "red_o_points": [],
    "y_categories": ["N", "NOT APPLICABLE", "nan"],
    "blue_o_points": [],
    "blue_x_points": [
      [0.00123, 1],
      [-3e-5, 2],
      [0.00032, 1],
      [-1e-5, 0],
      [0.00012, 2],
      [0.00041, 1],
      [0.0009, 1]
    ]
  },
  "QS_mulLysisRoot[C5]": {
    "red_x_points": [
      [-0.00138, 3],
      [-0.00214, 0],
      [-0.00405, 2],
      [-0.0023, 0],
      [-0.00229, 0],
      [-0.00218, 0],
      [-0.00224, 0],
      [-0.00113, 3],
      [-0.00213, 0],
      [-0.00231, 0],
      [-0.00215, 0],
      [-0.00134, 3],
      [0.00781, 1],
      [-0.00111, 3],
      [-0.00202, 0],
      [-0.00146, 3],
      [-0.00225, 0],
      [-0.00234, 0],
      [-0.00118, 3],
      [-0.00114, 3],
      [-0.00111, 3],
      [-0.00221, 0],
      [-0.00136, 3],
      [-0.00128, 3],
      [-0.00114, 3],
      [-0.00239, 0],
      [-0.0014, 3],
      [-0.00218, 0],
      [-0.00091, 3],
      [0.00617, 1],
      [-0.00381, 2]
    ],
    "red_o_points": [],
    "y_categories": ["N", "NOT APPLICABLE", "Y", "nan"],
    "blue_o_points": [],
    "blue_x_points": [
      [0.00826, 1],
      [-0.00047, 3],
      [0.00668, 1],
      [-0.00167, 0],
      [-0.00066, 3],
      [0.00703, 1],
      [0.00671, 1]
    ]
  },
  "QS_mulGraftNerve[IS]": {
    "red_x_points": [
      [-0.00018, 2],
      [-0.00066, 0],
      [-0.00052, 0],
      [-0.00042, 0],
      [-0.00055, 0],
      [-0.00059, 0],
      [-0.00059, 0],
      [-0.00011, 2],
      [-0.00056, 0],
      [-0.00041, 0],
      [-0.00036, 0],
      [-0.00015, 2],
      [0.00089, 1],
      [-0.00017, 2],
      [-0.00053, 0],
      [-7e-5, 2],
      [-0.00043, 0],
      [-0.00059, 0],
      [-0.00014, 2],
      [-0.00011, 2],
      [-0.00014, 2],
      [-0.00051, 0],
      [-5e-5, 2],
      [-0.00013, 2],
      [-0.00012, 2],
      [-0.0004, 0],
      [-0.00021, 2],
      [-0.00061, 0],
      [-0.00016, 2],
      [0.00084, 1],
      [-0.00051, 0]
    ],
    "red_o_points": [],
    "y_categories": ["N", "NOT APPLICABLE", "nan"],
    "blue_o_points": [],
    "blue_x_points": [
      [0.00205, 1],
      [0.0, 2],
      [0.00161, 1],
      [-0.00015, 0],
      [2e-5, 2],
      [0.00069, 1],
      [0.00108, 1]
    ]
  },
  "QS_mulGraftNerve[MC]": {
    "red_x_points": [
      [-0.00015, 2],
      [-0.00022, 0],
      [-0.0003, 0],
      [-0.00029, 0],
      [-0.0004, 0],
      [-0.0003, 0],
      [-0.00033, 0],
      [-0.00011, 2],
      [-0.0003, 0],
      [-0.00038, 0],
      [-0.00028, 0],
      [-0.00011, 2],
      [0.00044, 1],
      [-0.0002, 2],
      [-0.00035, 0],
      [-0.0002, 2],
      [-0.0002, 0],
      [-0.00048, 0],
      [-0.00012, 2],
      [-0.0001, 2],
      [-4e-5, 2],
      [-0.00025, 0],
      [-0.0002, 2],
      [-7e-5, 2],
      [-0.0002, 2],
      [-0.00025, 0],
      [-0.00012, 2],
      [-0.00035, 0],
      [-0.00012, 2],
      [0.0005, 1],
      [-0.0003, 0]
    ],
    "red_o_points": [],
    "y_categories": ["N", "NOT APPLICABLE", "nan"],
    "blue_o_points": [],
    "blue_x_points": [
      [0.00189, 1],
      [3e-5, 2],
      [0.00067, 1],
      [-6e-5, 0],
      [-4e-5, 2],
      [0.00073, 1],
      [0.0009, 1]
    ]
  },
  "QS_mulGraftRoot[C8]": {
    "red_x_points": [
      [-7e-5, 2],
      [-0.00017, 0],
      [-0.00019, 0],
      [-0.00017, 0],
      [-0.0002, 0],
      [-0.0002, 0],
      [-0.00017, 0],
      [-0.00013, 2],
      [-0.00019, 0],
      [-0.00022, 0],
      [-8e-5, 0],
      [-0.00011, 2],
      [0.00038, 1],
      [-8e-5, 2],
      [-0.00015, 0],
      [-0.00014, 2],
      [-0.00017, 0],
      [-8e-5, 0],
      [-0.00013, 2],
      [-0.00013, 2],
      [-0.00013, 2],
      [-8e-5, 0],
      [-0.00013, 2],
      [-7e-5, 2],
      [-0.00013, 2],
      [-0.00017, 0],
      [-0.00011, 2],
      [-0.00017, 0],
      [-0.0001, 2],
      [0.0006, 1],
      [-0.0002, 0]
    ],
    "red_o_points": [],
    "y_categories": ["N", "NOT APPLICABLE", "nan"],
    "blue_o_points": [],
    "blue_x_points": [
      [0.00073, 1],
      [-4e-5, 2],
      [0.00034, 1],
      [-0.00011, 0],
      [-0.00011, 2],
      [0.00044, 1],
      [0.00055, 1]
    ]
  },
  "QS_mulTransfSite[MeMc]": {
    "red_x_points": [
      [-1e-5, 2],
      [-3e-5, 0],
      [-3e-5, 0],
      [-3e-5, 0],
      [-3e-5, 0],
      [-3e-5, 0],
      [-3e-5, 0],
      [-3e-5, 0],
      [-3e-5, 0],
      [9e-5, 1],
      [-1e-5, 2],
      [-3e-5, 0],
      [-1e-5, 2],
      [-3e-5, 0],
      [-3e-5, 0],
      [-1e-5, 2],
      [-1e-5, 2],
      [-3e-5, 0],
      [-1e-5, 2],
      [-1e-5, 2],
      [-3e-5, 0],
      [-1e-5, 2],
      [9e-5, 1]
    ],
    "red_o_points": [],
    "y_categories": ["N", "NOT APPLICABLE", "nan"],
    "blue_o_points": [],
    "blue_x_points": [[-1e-5, 2], [-3e-5, 0], [-1e-5, 2], [9e-5, 1]]
  },
  "QA_lstPexKine[Index]": {
    "red_x_points": [
      [-0.00085, 0],
      [-0.00041, 2],
      [-0.00039, 2],
      [-0.00041, 2],
      [7e-5, 1],
      [0.00022, 1],
      [-0.00092, 0],
      [3e-5, 2],
      [0.00023, 1],
      [3e-5, 1],
      [0.00021, 1],
      [-0.00038, 1],
      [-7e-5, 2],
      [0.00015, 2],
      [0.00031, 1],
      [-0.00011, 2],
      [-6e-5, 2],
      [0.00025, 1],
      [-0.00037, 1],
      [-0.00069, 0],
      [-0.00021, 1],
      [-0.00059, 2],
      [0.00031, 2],
      [-0.00018, 1],
      [4e-5, 2],
      [-0.00036, 2],
      [-0.00044, 1],
      [-0.00022, 2],
      [-3e-5, 1],
      [-0.00013, 2],
      [-0.00054, 0]
    ],
    "red_o_points": [],
    "y_categories": ["NPV", "PV", "nan"],
    "blue_o_points": [],
    "blue_x_points": [
      [0.00028, 1],
      [0.00066, 2],
      [0.00013, 1],
      [0.00122, 1],
      [0.00029, 2],
      [0.00024, 1],
      [6e-5, 2]
    ]
  },
  "QA_lstPexMuscstrength[ElbowFlex]": {
    "red_x_points": [
      [-0.0039, 1],
      [0.00032, 2],
      [-0.00138, 1],
      [-0.00176, 1],
      [0.00188, 0],
      [-0.00158, 1],
      [-0.00171, 1],
      [-0.00424, 1],
      [-0.00148, 1],
      [-0.00183, 1],
      [-0.00183, 1],
      [-0.00387, 1],
      [0.00067, 2],
      [0.00365, 2],
      [0.00028, 2],
      [-0.004, 1],
      [0.00045, 2],
      [0.00144, 0],
      [-0.00395, 1],
      [-0.00418, 1],
      [-0.00422, 1],
      [-0.00144, 1],
      [0.00364, 2],
      [-0.0009, 0],
      [-0.00419, 1],
      [-0.0015, 1],
      [-0.00381, 1],
      [-0.00172, 1],
      [-0.00396, 1],
      [0.00053, 2],
      [-0.00179, 1]
    ],
    "red_o_points": [],
    "y_categories": ["GREATER THAN OR EQUALS TO 3", "LESS THAN 3", "nan"],
    "blue_o_points": [],
    "blue_x_points": [
      [0.00026, 2],
      [0.00621, 2],
      [0.00401, 0],
      [0.00078, 1],
      [0.00547, 2],
      [0.00504, 0],
      [0.0047, 0]
    ]
  },
  "QS_mulGraftRoot[C6]": {
    "red_x_points": [
      [-1e-5, 2],
      [-1e-5, 0],
      [-0.00013, 0],
      [-1e-5, 0],
      [-1e-5, 0],
      [-2e-5, 2],
      [-2e-5, 0],
      [-4e-5, 0],
      [-1e-5, 0],
      [-4e-5, 2],
      [-1e-5, 2],
      [-1e-5, 0],
      [-1e-5, 2],
      [-2e-5, 0],
      [-4e-5, 2],
      [-1e-5, 2],
      [-0.00012, 2],
      [-4e-5, 0],
      [-1e-5, 0]
    ],
    "red_o_points": [],
    "y_categories": ["N", "NOT APPLICABLE", "nan"],
    "blue_o_points": [],
    "blue_x_points": [[0.00019, 1], [8e-5, 1], [0.00025, 1]]
  },
  "QA_yonInjDisloc": {
    "red_x_points": [
      [-4e-5, 2],
      [-5e-5, 2],
      [-5e-5, 2],
      [-3e-5, 2],
      [-4e-5, 2],
      [-2e-5, 2],
      [-4e-5, 2],
      [-5e-5, 2],
      [-5e-5, 2],
      [-5e-5, 2],
      [-4e-5, 2],
      [-5e-5, 2],
      [-3e-5, 2],
      [-5e-5, 2],
      [-4e-5, 2],
      [-4e-5, 2],
      [-3e-5, 2],
      [-5e-5, 2],
      [-4e-5, 2],
      [-3e-5, 2],
      [-5e-5, 2],
      [-5e-5, 2],
      [-5e-5, 2],
      [-4e-5, 2],
      [-3e-5, 2],
      [-2e-5, 2],
      [-5e-5, 2],
      [-4e-5, 2],
      [-0.00014, 1]
    ],
    "red_o_points": [],
    "y_categories": ["N", "Y", "nan"],
    "blue_o_points": [],
    "blue_x_points": [
      [-4e-5, 2],
      [-3e-5, 2],
      [-2e-5, 2],
      [-2e-5, 2],
      [0.00046, 0],
      [-2e-5, 2]
    ]
  },
  "QA_lstPexInspectio[ScapulaAlata]": {
    "red_x_points": [
      [-0.00011, 1],
      [-0.00021, 1],
      [-0.0002, 1],
      [-0.00018, 1],
      [-0.00021, 1],
      [-0.00022, 1],
      [-0.00018, 1],
      [-9e-5, 1],
      [-0.00024, 1],
      [-0.00018, 1],
      [-0.0002, 1],
      [-6e-5, 1],
      [-0.0007, 1],
      [-0.00013, 1],
      [-0.00016, 1],
      [-0.00011, 1],
      [-0.00016, 1],
      [-0.00023, 1],
      [-0.00246, 0],
      [-0.00011, 1],
      [-9e-5, 1],
      [-0.00018, 1],
      [-0.00011, 1],
      [-0.00019, 1],
      [-0.0002, 1],
      [-0.00016, 1],
      [-0.00013, 1],
      [-0.00015, 1],
      [-0.00015, 1],
      [-0.00039, 1],
      [-0.00017, 1]
    ],
    "red_o_points": [],
    "y_categories": ["ABS", "NAIA", "PT", "nan"],
    "blue_o_points": [],
    "blue_x_points": [
      [-5e-5, 1],
      [-5e-5, 1],
      [-0.00015, 1],
      [-0.00028, 1],
      [0.0002, 1],
      [-0.00022, 1],
      [0.00529, 2]
    ]
  },
  "QS_mulTransfSite[MeBr]": {
    "red_x_points": [
      [-3e-5, 2],
      [-3e-5, 0],
      [-3e-5, 0],
      [-3e-5, 0],
      [-3e-5, 0],
      [-3e-5, 2],
      [-3e-5, 0],
      [-3e-5, 0],
      [-3e-5, 0],
      [-3e-5, 2],
      [0.0001, 1],
      [-3e-5, 2],
      [-3e-5, 2],
      [-3e-5, 0],
      [-3e-5, 2],
      [-3e-5, 2],
      [-3e-5, 2],
      [-3e-5, 0],
      [-3e-5, 2],
      [-3e-5, 2],
      [-3e-5, 0],
      [0.0001, 1],
      [-3e-5, 0]
    ],
    "red_o_points": [],
    "y_categories": ["N", "NOT APPLICABLE", "nan"],
    "blue_o_points": [],
    "blue_x_points": [
      [0.0001, 1],
      [-3e-5, 2],
      [-3e-5, 0],
      [0.0001, 1],
      [0.0001, 1]
    ]
  },
  "QS_mulGraftNerve[Ac]": {
    "red_x_points": [
      [-0.00051, 2],
      [-0.00138, 0],
      [-0.00144, 0],
      [-0.00165, 0],
      [-0.00159, 0],
      [-0.00147, 0],
      [-0.00135, 0],
      [-0.00039, 2],
      [-0.00178, 0],
      [-0.00163, 0],
      [-0.00146, 0],
      [-0.00072, 2],
      [0.00237, 1],
      [-0.0002, 2],
      [-0.00177, 0],
      [-0.00056, 2],
      [-0.0015, 0],
      [-0.00164, 0],
      [-0.00043, 2],
      [-0.00034, 2],
      [-0.00076, 2],
      [-0.0015, 0],
      [-0.0003, 2],
      [-0.00066, 2],
      [-0.00052, 2],
      [-0.00152, 0],
      [-0.00043, 2],
      [-0.00134, 0],
      [-0.00025, 2],
      [0.0029, 1],
      [-0.00157, 0]
    ],
    "red_o_points": [],
    "y_categories": ["N", "NOT APPLICABLE", "nan"],
    "blue_o_points": [],
    "blue_x_points": [
      [0.00467, 1],
      [4e-5, 2],
      [0.00366, 1],
      [-9e-5, 0],
      [8e-5, 2],
      [0.00357, 1],
      [0.00372, 1]
    ]
  },
  "QA_lstPexMuscstrength[FingersAbdu]": {
    "red_x_points": [
      [5e-5, 2],
      [7e-5, 2],
      [-0.00013, 1],
      [-0.00011, 1],
      [-8e-5, 0],
      [-4e-5, 0],
      [-0.00022, 1],
      [-0.0, 0],
      [-1e-5, 0],
      [0.0001, 2],
      [-0.00021, 1],
      [-9e-5, 0],
      [7e-5, 2],
      [0.0001, 2],
      [6e-5, 2],
      [-8e-5, 0],
      [4e-5, 2],
      [-6e-5, 0],
      [-9e-5, 0],
      [-0.0002, 1],
      [2e-5, 0],
      [-0.00011, 1],
      [3e-5, 2],
      [7e-5, 2],
      [7e-5, 2],
      [-0.00023, 1],
      [0.0001, 2],
      [-0.00019, 1],
      [7e-5, 2],
      [7e-5, 2],
      [-0.00013, 1]
    ],
    "red_o_points": [],
    "y_categories": ["GREATER THAN OR EQUALS TO 3", "LESS THAN 3", "nan"],
    "blue_o_points": [],
    "blue_x_points": [
      [0.00011, 2],
      [-3e-5, 0],
      [0.00029, 2],
      [9e-5, 2],
      [7e-5, 0]
    ]
  },
  "QS_mulNeuromadSite[C8]": {
    "red_x_points": [
      [-0.00112, 2],
      [-0.00322, 0],
      [-0.00396, 0],
      [-0.00343, 0],
      [-0.00336, 0],
      [-0.00345, 0],
      [-0.00329, 0],
      [-0.00112, 2],
      [-0.00361, 0],
      [-0.00325, 0],
      [-0.00301, 0],
      [-0.00133, 2],
      [0.00538, 1],
      [-0.00109, 2],
      [-0.00386, 0],
      [-0.00142, 2],
      [-0.00311, 0],
      [-0.00376, 0],
      [-0.00123, 2],
      [-0.00105, 2],
      [-0.00099, 2],
      [-0.00316, 0],
      [-0.00116, 2],
      [-0.00137, 2],
      [-0.0016, 2],
      [-0.00327, 0],
      [-0.00105, 2],
      [-0.00333, 0],
      [-0.00095, 2],
      [0.00655, 1],
      [-0.00329, 0]
    ],
    "red_o_points": [],
    "y_categories": ["N", "NOT APPLICABLE", "nan"],
    "blue_o_points": [],
    "blue_x_points": [
      [0.01143, 1],
      [-8e-5, 2],
      [0.0077, 1],
      [0.00015, 0],
      [4e-5, 2],
      [0.00704, 1],
      [0.00905, 1]
    ]
  },
  "QS_mulTransfSite[AcSsPA]": {
    "red_x_points": [
      [-0.00061, 3],
      [-0.00181, 0],
      [-0.0015, 0],
      [-0.00166, 0],
      [-0.0018, 0],
      [-0.00176, 0],
      [-0.00143, 0],
      [-0.00085, 3],
      [-0.00168, 0],
      [-0.00153, 0],
      [-0.00156, 0],
      [-0.00082, 3],
      [0.00383, 1],
      [-0.00082, 3],
      [-0.00163, 0],
      [-0.00089, 3],
      [-0.00303, 2],
      [-0.0015, 0],
      [-0.00071, 3],
      [-0.00066, 3],
      [-0.00053, 3],
      [-0.00157, 0],
      [-0.00055, 3],
      [-0.00086, 3],
      [-0.00083, 3],
      [-0.0014, 0],
      [-0.00078, 3],
      [-0.00132, 0],
      [-0.00066, 3],
      [0.00395, 1],
      [-0.00154, 0]
    ],
    "red_o_points": [],
    "y_categories": ["N", "NOT APPLICABLE", "Y", "nan"],
    "blue_o_points": [],
    "blue_x_points": [
      [0.00519, 1],
      [-0.00044, 3],
      [0.00515, 1],
      [-0.00097, 0],
      [-0.00035, 3],
      [0.00436, 1],
      [0.00507, 1]
    ]
  },
  "QA_lstPexPalle[Elbow]": {
    "red_x_points": [
      [0.0001, 4],
      [0.0001, 4],
      [5e-5, 4],
      [9e-5, 4],
      [-0.00041, 3],
      [-0.00028, 3],
      [0.0001, 4],
      [5e-5, 4],
      [8e-5, 4],
      [0.00018, 1],
      [-0.00042, 3],
      [0.00016, 1],
      [0.00075, 4],
      [9e-5, 4],
      [7e-5, 4],
      [8e-5, 4],
      [9e-5, 4],
      [0.00053, 1],
      [-0.00069, 3],
      [-0.0004, 0],
      [-0.00049, 3],
      [-0.00046, 2],
      [0.0001, 4],
      [-0.0029, 3],
      [0.00012, 4],
      [5e-5, 4],
      [-0.00053, 3],
      [6e-5, 4],
      [0.00011, 4],
      [-0.01132, 3],
      [-0.00042, 0]
    ],
    "red_o_points": [],
    "y_categories": ["ABS", "HYPO", "NAIA", "PT", "nan"],
    "blue_o_points": [],
    "blue_x_points": [
      [0.00101, 4],
      [0.00021, 4],
      [0.00587, 1],
      [0.00037, 4],
      [0.00041, 4],
      [0.00115, 4],
      [0.00125, 4]
    ]
  },
  "QS_mulGraftRoot[C5]": {
    "red_x_points": [
      [-1e-5, 0],
      [-1e-5, 0],
      [-8e-5, 2],
      [-8e-5, 2],
      [-1e-5, 0],
      [-8e-5, 2],
      [-8e-5, 2],
      [-1e-5, 0]
    ],
    "red_o_points": [],
    "y_categories": ["N", "NOT APPLICABLE", "nan"],
    "blue_o_points": [],
    "blue_x_points": [[0.00012, 1], [-1e-5, 0], [0.00012, 1], [0.00012, 1]]
  },
  "QA_lstPexMuscstrength[ScapulaAbducSuprot]": {
    "red_x_points": [
      [-0.00047, 0],
      [0.0002, 2],
      [-0.00029, 1],
      [-0.00035, 1],
      [-4e-5, 0],
      [-0.00039, 1],
      [-0.00039, 1],
      [-0.00067, 1],
      [-5e-5, 0],
      [6e-5, 0],
      [-0.00041, 1],
      [-0.00091, 1],
      [0.00018, 2],
      [0.00029, 2],
      [0.00018, 2],
      [0.00057, 2],
      [9e-5, 2],
      [-0.00019, 0],
      [-0.00033, 0],
      [-0.00089, 1],
      [-0.00067, 0],
      [-0.00025, 1],
      [0.00039, 2],
      [-0.00055, 0],
      [0.00053, 2],
      [-0.00042, 1],
      [-0.00096, 1],
      [-6e-5, 0],
      [0.00033, 2],
      [0.00016, 2],
      [-0.00035, 1]
    ],
    "red_o_points": [],
    "y_categories": ["GREATER THAN OR EQUALS TO 3", "LESS THAN 3", "nan"],
    "blue_o_points": [],
    "blue_x_points": [
      [0.0001, 2],
      [0.00063, 2],
      [0.00012, 0],
      [0.00078, 2],
      [0.0007, 2],
      [0.00018, 0],
      [5e-5, 2]
    ]
  },
  "participant_code": {
    "red_x_points": [
      [-0.01493, 1],
      [-0.0147, 2],
      [-0.01432, 3],
      [-0.01432, 4],
      [-0.01367, 5],
      [-0.01474, 6],
      [-0.0153, 7],
      [-0.014, 8],
      [-0.01348, 9],
      [-0.01428, 10],
      [-0.01479, 11],
      [-0.01484, 12],
      [-0.01451, 14],
      [-0.01423, 16],
      [-0.01493, 17],
      [-0.01395, 19],
      [-0.01493, 20],
      [-0.01498, 22],
      [-0.01442, 23],
      [-0.01423, 25],
      [-0.01423, 26],
      [-0.01474, 27],
      [-0.01516, 28],
      [-0.01428, 29],
      [-0.01479, 30],
      [-0.01423, 32],
      [-0.01418, 33],
      [-0.01367, 34],
      [-0.01451, 35],
      [-0.01442, 36],
      [-0.01479, 37]
    ],
    "red_o_points": [],
    "y_categories": [
      "P16554",
      "P18297",
      "P19283",
      "P19287",
      "P23391",
      "P31645",
      "P31691",
      "P34778",
      "P35046",
      "P36328",
      "P43633",
      "P4544",
      "P46417",
      "P48965",
      "P53068",
      "P5497",
      "P59529",
      "P62483",
      "P64658",
      "P65202",
      "P66816",
      "P6751",
      "P7408",
      "P75566",
      "P76226",
      "P79971",
      "P82621",
      "P82990",
      "P84932",
      "P85825",
      "P86989",
      "P8770",
      "P87791",
      "P90550",
      "P93159",
      "P94969",
      "P96710",
      "P9744",
      "nan"
    ],
    "blue_o_points": [],
    "blue_x_points": [
      [0.04139, 0],
      [0.04308, 13],
      [0.04507, 15],
      [0.04277, 18],
      [0.04093, 21],
      [0.04277, 24],
      [0.04354, 31]
    ]
  },
  "QA_lstPexTouch[T1]": {
    "red_x_points": [
      [-0.00172, 1],
      [-0.00028, 2],
      [0.00058, 1],
      [-0.00035, 2],
      [-0.00146, 0],
      [0.00055, 1],
      [0.00064, 1],
      [-0.00231, 1],
      [-0.0019, 0],
      [-0.00115, 0],
      [-0.00164, 0],
      [-0.00245, 0],
      [-0.00706, 2],
      [0.00282, 2],
      [-0.00036, 2],
      [-0.00185, 1],
      [-0.00027, 2],
      [0.00092, 1],
      [-0.00213, 0],
      [-0.00237, 1],
      [-0.00225, 0],
      [-0.00033, 2],
      [0.00339, 2],
      [-0.00211, 1],
      [-0.0029, 0],
      [0.00083, 1],
      [-0.00317, 0],
      [-0.00047, 2],
      [-0.00297, 0],
      [0.00027, 1],
      [0.00036, 1]
    ],
    "red_o_points": [],
    "y_categories": ["NORM", "NPV", "nan"],
    "blue_o_points": [],
    "blue_x_points": [
      [0.00078, 1],
      [0.00571, 2],
      [0.00071, 1],
      [0.00217, 1],
      [0.00477, 2],
      [0.00071, 1],
      [0.00377, 0]
    ]
  },
  "QS_mulGraftNerve[Ul]": {
    "red_x_points": [
      [-0.00048, 2],
      [-0.00086, 0],
      [-0.00071, 0],
      [-0.00085, 0],
      [-0.00077, 0],
      [-0.00078, 0],
      [-0.00073, 0],
      [-0.00032, 2],
      [-0.00078, 0],
      [-0.00081, 0],
      [-0.00086, 0],
      [-0.00052, 2],
      [0.00124, 1],
      [-0.00041, 2],
      [-0.00105, 0],
      [-0.00053, 2],
      [-0.00081, 0],
      [-0.00097, 0],
      [-0.00043, 2],
      [-0.00027, 2],
      [-0.00044, 2],
      [-0.00067, 0],
      [-0.00034, 2],
      [-0.00034, 2],
      [-0.00037, 2],
      [-0.00076, 0],
      [-0.00046, 2],
      [-0.00089, 0],
      [-0.00031, 2],
      [0.00205, 1],
      [-0.00065, 0]
    ],
    "red_o_points": [],
    "y_categories": ["N", "NOT APPLICABLE", "nan"],
    "blue_o_points": [],
    "blue_x_points": [
      [0.00308, 1],
      [-2e-5, 2],
      [0.00187, 1],
      [-0.0004, 0],
      [6e-5, 2],
      [0.00209, 1],
      [0.00214, 1]
    ]
  },
  "QS_mulGraftNerve[Ssr]": {
    "red_x_points": [
      [-7e-5, 2],
      [-0.00019, 0],
      [-0.0001, 0],
      [-0.00016, 0],
      [-0.00016, 0],
      [-0.00019, 0],
      [-0.00021, 0],
      [-5e-5, 2],
      [-0.00017, 0],
      [-0.00021, 0],
      [-0.00021, 0],
      [-7e-5, 2],
      [0.00028, 1],
      [-5e-5, 2],
      [-0.00011, 0],
      [-3e-5, 2],
      [-0.0001, 0],
      [-0.00021, 0],
      [-4e-5, 2],
      [-4e-5, 2],
      [-4e-5, 2],
      [-0.00017, 0],
      [-6e-5, 2],
      [-5e-5, 2],
      [-8e-5, 2],
      [-0.00018, 0],
      [-5e-5, 2],
      [-0.00011, 0],
      [-2e-5, 2],
      [0.0005, 1],
      [-0.00013, 0]
    ],
    "red_o_points": [],
    "y_categories": ["N", "NOT APPLICABLE", "nan"],
    "blue_o_points": [],
    "blue_x_points": [
      [0.0005, 1],
      [-3e-5, 2],
      [0.00066, 1],
      [-0.00011, 0],
      [-3e-5, 2],
      [0.00033, 1],
      [0.00031, 1]
    ]
  },
  "QS_mulLysisDivision[PDivisionMTrunk]": {
    "red_x_points": [
      [-1e-5, 2],
      [-3e-5, 0],
      [-3e-5, 0],
      [-3e-5, 0],
      [-3e-5, 0],
      [-3e-5, 0],
      [-1e-5, 2],
      [-3e-5, 0],
      [-3e-5, 0],
      [-3e-5, 0],
      [-1e-5, 2],
      [-1e-5, 2],
      [-3e-5, 0],
      [-3e-5, 0],
      [-3e-5, 0],
      [-1e-5, 2],
      [-1e-5, 2],
      [-1e-5, 2],
      [-1e-5, 2],
      [-3e-5, 0],
      [-1e-5, 2],
      [0.00011, 1],
      [-3e-5, 0]
    ],
    "red_o_points": [],
    "y_categories": ["N", "NOT APPLICABLE", "nan"],
    "blue_o_points": [],
    "blue_x_points": [[-1e-5, 2], [-3e-5, 0], [0.00011, 1]]
  },
  "QS_mulGraftNerve[MCA]": {
    "red_x_points": [
      [-6e-5, 2],
      [-0.00017, 0],
      [-0.0003, 0],
      [-0.00026, 0],
      [-0.0003, 0],
      [-0.00021, 0],
      [-0.00027, 0],
      [-5e-5, 2],
      [-0.0003, 0],
      [-0.00018, 0],
      [-0.00021, 0],
      [-0.00011, 2],
      [0.00055, 1],
      [-0.00019, 2],
      [-0.00012, 0],
      [-0.00021, 2],
      [-0.00024, 0],
      [-0.00028, 0],
      [-0.00011, 2],
      [-9e-5, 2],
      [-6e-5, 2],
      [-0.00019, 0],
      [-0.00019, 2],
      [-8e-5, 2],
      [-8e-5, 2],
      [-0.00023, 0],
      [-0.00011, 2],
      [-0.0003, 0],
      [-4e-5, 2],
      [0.00032, 1],
      [-0.00011, 0]
    ],
    "red_o_points": [],
    "y_categories": ["N", "NOT APPLICABLE", "nan"],
    "blue_o_points": [],
    "blue_x_points": [
      [0.00099, 1],
      [-8e-5, 2],
      [0.00075, 1],
      [-4e-5, 0],
      [-2e-5, 2],
      [0.00059, 1],
      [0.0006, 1]
    ]
  },
  "QS_mulGraftTrunk[UpperTrunk]": {
    "red_x_points": [
      [-0.00068, 3],
      [-0.00218, 0],
      [-0.00212, 0],
      [-0.0019, 0],
      [-0.00193, 0],
      [-0.00187, 0],
      [-0.00195, 0],
      [-0.00078, 3],
      [-0.00193, 0],
      [-0.00192, 0],
      [-0.00189, 0],
      [-0.00078, 3],
      [0.00493, 1],
      [-0.00098, 3],
      [-0.00422, 2],
      [-0.00094, 3],
      [-0.00208, 0],
      [-0.00218, 0],
      [-0.00086, 3],
      [-0.00087, 3],
      [-0.00092, 3],
      [-0.00195, 0],
      [-0.00104, 3],
      [-0.00095, 3],
      [-0.00079, 3],
      [-0.00195, 0],
      [-0.00079, 3],
      [-0.00202, 0],
      [-0.00075, 3],
      [0.00507, 1],
      [-0.002, 0]
    ],
    "red_o_points": [],
    "y_categories": ["N", "NOT APPLICABLE", "Y", "nan"],
    "blue_o_points": [],
    "blue_x_points": [
      [0.00596, 1],
      [-0.00022, 3],
      [0.00555, 1],
      [-0.00049, 0],
      [-9e-5, 3],
      [0.00597, 1],
      [0.00554, 1]
    ]
  },
  "QA_lstPexKine[Elbow]": {
    "red_x_points": [
      [-0.00089, 0],
      [-0.0003, 2],
      [-0.00056, 2],
      [-0.00033, 2],
      [5e-5, 1],
      [0.00039, 1],
      [-0.00115, 0],
      [-7e-5, 2],
      [0.00045, 1],
      [0.00043, 1],
      [-5e-5, 1],
      [-0.00014, 2],
      [-6e-5, 2],
      [0.00022, 1],
      [-0.00021, 2],
      [-0.00014, 2],
      [0.00029, 1],
      [2e-5, 1],
      [-0.0002, 0],
      [-3e-5, 1],
      [-0.00033, 2],
      [-0.00012, 2],
      [0.00024, 1],
      [-0.00023, 2],
      [-0.00075, 2],
      [-2e-5, 1],
      [-0.00028, 2],
      [0.00012, 1],
      [-0.00011, 2],
      [-0.00045, 0]
    ],
    "red_o_points": [],
    "y_categories": ["NPV", "PV", "nan"],
    "blue_o_points": [],
    "blue_x_points": [
      [0.00039, 1],
      [2e-5, 2],
      [6e-5, 1],
      [0.00164, 1],
      [0.0, 2],
      [0.00027, 1],
      [0.0, 2]
    ]
  },
  "QA_mulInjTbpiCause[Motorcycle]": {
    "red_x_points": [
      [0.00203, 0],
      [-0.00084, 1],
      [-0.00115, 1],
      [-0.00067, 1],
      [-0.00147, 1],
      [-0.00081, 1],
      [-0.00087, 1],
      [-0.00077, 1],
      [-0.00114, 1],
      [-0.00079, 1],
      [-0.00077, 1],
      [0.00039, 0],
      [-0.02573, 1],
      [-0.00092, 1],
      [-0.00101, 1],
      [-0.00103, 1],
      [-0.0009, 1],
      [-0.0013, 1],
      [0.0008, 0],
      [-0.00055, 1],
      [-0.00077, 1],
      [-0.00095, 1],
      [-0.00067, 1],
      [-0.00183, 1],
      [0.00115, 0],
      [-0.00067, 1],
      [-0.00074, 1],
      [-0.00107, 1],
      [-0.00066, 1],
      [-0.02525, 1],
      [-0.00071, 1]
    ],
    "red_o_points": [],
    "y_categories": ["N", "Y", "nan"],
    "blue_o_points": [],
    "blue_x_points": [
      [0.01292, 0],
      [-0.00054, 1],
      [0.01241, 0],
      [-0.00151, 1],
      [0.00034, 1],
      [0.01153, 0],
      [0.0111, 0]
    ]
  },
  "QA_yonInjUnconscio": {
    "red_x_points": [
      [-0.00238, 1],
      [-0.00297, 1],
      [-0.00139, 2],
      [-0.00167, 2],
      [0.0057, 0],
      [-0.00265, 1],
      [-0.00171, 2],
      [-0.0034, 2],
      [-0.00155, 2],
      [-0.00118, 2],
      [-0.0026, 1],
      [-0.00326, 1],
      [-0.01693, 1],
      [-0.0034, 2],
      [-0.00137, 2],
      [-0.00341, 2],
      [-0.00273, 1],
      [0.00464, 0],
      [-0.00243, 1],
      [-0.00234, 1],
      [-0.00258, 1],
      [-0.0031, 1],
      [-0.0028, 2],
      [-0.00475, 1],
      [-0.00294, 2],
      [-0.00256, 1],
      [0.00609, 0],
      [-0.00248, 1],
      [-0.00312, 2],
      [-0.00054, 2],
      [-0.00289, 1]
    ],
    "red_o_points": [],
    "y_categories": ["N", "Y", "nan"],
    "blue_o_points": [],
    "blue_x_points": [
      [0.0008, 2],
      [-0.00021, 1],
      [0.00953, 0],
      [0.01393, 0],
      [0.0147, 0],
      [0.00184, 2],
      [0.00181, 2]
    ]
  },
  "QS_mulGraftLevel[Trunk]": {
    "red_x_points": [
      [-0.00066, 3],
      [-0.00123, 0],
      [-0.00136, 0],
      [-0.00112, 0],
      [-0.00107, 0],
      [-0.001, 0],
      [-0.0011, 0],
      [-0.00066, 3],
      [-0.00113, 0],
      [-0.00098, 0],
      [-0.00098, 0],
      [-0.00071, 3],
      [0.00244, 1],
      [-0.00057, 3],
      [-0.00308, 2],
      [-0.00069, 3],
      [-0.00076, 0],
      [-0.00084, 0],
      [-0.0007, 3],
      [-0.00054, 3],
      [-0.00054, 3],
      [-0.00096, 0],
      [-0.00053, 3],
      [-0.0007, 3],
      [-0.0007, 3],
      [-0.00102, 0],
      [-0.0005, 3],
      [-0.00128, 0],
      [-0.00052, 3],
      [0.00231, 1],
      [-0.00115, 0]
    ],
    "red_o_points": [],
    "y_categories": ["N", "NOT APPLICABLE", "Y", "nan"],
    "blue_o_points": [],
    "blue_x_points": [
      [0.00433, 1],
      [-0.00016, 3],
      [0.00366, 1],
      [-0.00043, 0],
      [-0.00023, 3],
      [0.00357, 1],
      [0.00334, 1]
    ]
  },
  "QS_mulGraftNerve[Sc]": {
    "red_x_points": [
      [-1e-5, 0],
      [-1e-5, 0],
      [-1e-5, 0],
      [-1e-5, 0],
      [0.0, 0],
      [-7e-5, 2],
      [-1e-5, 0],
      [-1e-5, 0],
      [-1e-5, 0],
      [-1e-5, 2],
      [-1e-5, 2],
      [-8e-5, 2],
      [-1e-5, 2],
      [-7e-5, 2],
      [-1e-5, 2],
      [-1e-5, 0],
      [-1e-5, 2],
      [-1e-5, 0],
      [7e-5, 1],
      [-1e-5, 0]
    ],
    "red_o_points": [],
    "y_categories": ["N", "NOT APPLICABLE", "nan"],
    "blue_o_points": [],
    "blue_x_points": [[0.00025, 1], [7e-5, 1], [0.0, 0]]
  },
  "QS_mulGraftNerve[MP]": {
    "red_x_points": [
      [-8e-5, 2],
      [-0.00026, 0],
      [-0.00014, 0],
      [-9e-5, 0],
      [-9e-5, 0],
      [-9e-5, 0],
      [-0.00014, 0],
      [-4e-5, 2],
      [-9e-5, 0],
      [-0.00011, 0],
      [-7e-5, 0],
      [-0.00011, 2],
      [-5e-5, 1],
      [-0.0, 2],
      [-0.00023, 0],
      [-4e-5, 2],
      [-0.0001, 0],
      [-0.00014, 0],
      [-0.00011, 2],
      [-8e-5, 2],
      [-4e-5, 2],
      [-0.00012, 0],
      [-0.00011, 2],
      [-4e-5, 2],
      [-8e-5, 2],
      [-0.00012, 0],
      [-9e-5, 2],
      [-0.00012, 0],
      [0.0, 2],
      [9e-5, 1],
      [-9e-5, 0]
    ],
    "red_o_points": [],
    "y_categories": ["N", "NOT APPLICABLE", "nan"],
    "blue_o_points": [],
    "blue_x_points": [
      [0.00052, 1],
      [0.00014, 2],
      [0.00019, 1],
      [-2e-5, 0],
      [0.00017, 2],
      [0.00027, 1],
      [0.00034, 1]
    ]
  },
  "QS_mulGraftNerve[Ax]": {
    "red_x_points": [
      [-0.00032, 2],
      [-0.00055, 0],
      [-0.00048, 0],
      [-0.00057, 0],
      [-0.00083, 0],
      [-0.00068, 0],
      [-0.00072, 0],
      [-0.00031, 2],
      [-0.00055, 0],
      [-0.00048, 0],
      [-0.00057, 0],
      [-0.00041, 2],
      [0.00069, 1],
      [-0.00034, 2],
      [-0.00041, 0],
      [-0.00035, 2],
      [-0.00052, 0],
      [-0.00068, 0],
      [-0.00043, 2],
      [-0.00039, 2],
      [-0.0002, 2],
      [-0.00045, 0],
      [-0.00035, 2],
      [-0.00026, 2],
      [-0.00043, 2],
      [-0.00038, 0],
      [-0.00031, 2],
      [-0.0005, 0],
      [-0.00019, 2],
      [0.00136, 1],
      [-0.0004, 0]
    ],
    "red_o_points": [],
    "y_categories": ["N", "NOT APPLICABLE", "nan"],
    "blue_o_points": [],
    "blue_x_points": [
      [0.00255, 1],
      [-0.00015, 2],
      [0.00166, 1],
      [-0.0, 0],
      [-0.00012, 2],
      [0.00165, 1],
      [0.00155, 1]
    ]
  },
  "QA_lstPexMuscstrength[ElbowExte]": {
    "red_x_points": [
      [-0.00275, 1],
      [-0.00019, 2],
      [-4e-5, 1],
      [2e-5, 1],
      [-0.00077, 0],
      [9e-5, 1],
      [5e-5, 1],
      [-0.00286, 1],
      [-0.00113, 0],
      [-0.00054, 0],
      [9e-5, 1],
      [-0.00223, 1],
      [0.00013, 2],
      [0.00332, 2],
      [-8e-5, 2],
      [-0.00265, 1],
      [-7e-5, 2],
      [9e-5, 1],
      [-0.00216, 0],
      [-0.00236, 1],
      [-0.0029, 0],
      [0.00015, 1],
      [0.00379, 2],
      [-0.00266, 0],
      [-0.00332, 0],
      [-0.0, 1],
      [-0.00236, 1],
      [-0.00017, 2],
      [-0.00276, 1],
      [6e-5, 2],
      [-0.0001, 1]
    ],
    "red_o_points": [],
    "y_categories": ["GREATER THAN OR EQUALS TO 3", "LESS THAN 3", "nan"],
    "blue_o_points": [],
    "blue_x_points": [
      [0.00023, 2],
      [0.00578, 2],
      [0.0005, 0],
      [0.00108, 1],
      [0.00579, 2],
      [0.00017, 0],
      [0.00013, 0]
    ]
  },
  "QA_intPexForearmSupin": {
    "red_x_points": [
      [2e-5, 2],
      [5e-5, 0],
      [2e-5, 2],
      [-0.00032, 1],
      [-8e-5, 1],
      [1e-5, 2],
      [-0.00022, 1],
      [7e-5, 2],
      [1e-5, 2],
      [3e-5, 2],
      [-4e-5, 0],
      [0.00048, 2],
      [3e-5, 2],
      [2e-5, 2],
      [9e-5, 2],
      [2e-5, 2],
      [-0.00071, 1],
      [-0.00023, 1],
      [0.00012, 0],
      [-0.00027, 1],
      [-0.00013, 1],
      [3e-5, 2],
      [3e-5, 2],
      [3e-5, 2],
      [7e-5, 2],
      [-0.00057, 1],
      [7e-5, 2],
      [8e-5, 2],
      [-0.01269, 1],
      [5e-5, 0]
    ],
    "red_o_points": [],
    "y_categories": ["GREATER THAN OR EQUALS TO 80", "LESS THAN 80", "nan"],
    "blue_o_points": [],
    "blue_x_points": [
      [0.00114, 2],
      [8e-5, 2],
      [0.00528, 0],
      [0.00033, 2],
      [0.00034, 2],
      [0.00128, 2],
      [0.00109, 2]
    ]
  },
  "QA_intPexShoulderExrot": {
    "red_x_points": [
      [5e-5, 2],
      [-6e-5, 1],
      [-6e-5, 0],
      [-6e-5, 1],
      [-6e-5, 0],
      [5e-5, 2],
      [5e-5, 2],
      [-6e-5, 1],
      [-6e-5, 1]
    ],
    "red_o_points": [],
    "y_categories": ["GREATER THAN OR EQUALS TO 60", "LESS THAN 60", "nan"],
    "blue_o_points": [],
    "blue_x_points": [[5e-5, 2], [5e-5, 2]]
  },
  "QS_mulGraftNerve[MCF]": {
    "red_x_points": [
      [-2e-5, 2],
      [-0.00014, 0],
      [-0.00026, 0],
      [-8e-5, 0],
      [-8e-5, 0],
      [-0.00013, 0],
      [-0.00014, 0],
      [-2e-5, 2],
      [-9e-5, 0],
      [-0.00014, 0],
      [-9e-5, 0],
      [0.0, 2],
      [0.00016, 1],
      [-0.0, 2],
      [-8e-5, 0],
      [-4e-5, 2],
      [-0.00026, 0],
      [-9e-5, 0],
      [-2e-5, 2],
      [-2e-5, 2],
      [-1e-5, 2],
      [-9e-5, 0],
      [-3e-5, 2],
      [-4e-5, 2],
      [-1e-5, 2],
      [-6e-5, 0],
      [-5e-5, 2],
      [-0.00014, 0],
      [-2e-5, 2],
      [0.00038, 1],
      [-0.00012, 0]
    ],
    "red_o_points": [],
    "y_categories": ["N", "NOT APPLICABLE", "nan"],
    "blue_o_points": [],
    "blue_x_points": [
      [0.00022, 1],
      [-0.0, 2],
      [0.00027, 1],
      [-4e-5, 0],
      [2e-5, 2],
      [0.00026, 1],
      [0.00044, 1]
    ]
  },
  "QS_mulLysisSite[Nerve]": {
    "red_x_points": [
      [-0.00036, 3],
      [-0.00087, 0],
      [-0.00178, 2],
      [-0.00086, 0],
      [-0.00087, 0],
      [-0.00076, 0],
      [-0.00078, 0],
      [-0.00044, 3],
      [-0.00105, 0],
      [-0.00087, 0],
      [-0.00089, 0],
      [-0.0005, 3],
      [0.00282, 1],
      [-0.00053, 3],
      [-0.00087, 0],
      [-0.00052, 3],
      [-0.00084, 0],
      [-0.00088, 0],
      [-0.00052, 3],
      [-0.0004, 3],
      [-0.00037, 3],
      [-0.00081, 0],
      [-0.00064, 3],
      [-0.00044, 3],
      [-0.00053, 3],
      [-0.00079, 0],
      [-0.00041, 3],
      [-0.0005, 0],
      [-0.00048, 3],
      [0.00199, 1],
      [-0.00104, 0]
    ],
    "red_o_points": [],
    "y_categories": ["N", "NOT APPLICABLE", "Y", "nan"],
    "blue_o_points": [],
    "blue_x_points": [
      [0.003, 1],
      [-0.00024, 3],
      [0.00305, 1],
      [-0.0008, 0],
      [-0.00018, 3],
      [0.0027, 1],
      [0.00257, 1]
    ]
  },
  "QS_mulGraftNerve[TD]": {
    "red_x_points": [
      [-0.00036, 2],
      [-0.00045, 0],
      [-0.00046, 0],
      [-0.0005, 0],
      [-0.00066, 0],
      [-0.00055, 0],
      [-0.00038, 0],
      [-0.00041, 2],
      [-0.00048, 0],
      [-0.00039, 0],
      [-0.0005, 0],
      [-0.00032, 2],
      [0.00063, 1],
      [-0.00016, 2],
      [-0.00055, 0],
      [-0.0003, 2],
      [-0.00044, 0],
      [-0.00056, 0],
      [-0.00024, 2],
      [-0.00026, 2],
      [-0.00028, 2],
      [-0.00039, 0],
      [-0.00028, 2],
      [-0.00041, 2],
      [-0.00036, 2],
      [-0.0004, 0],
      [-0.00025, 2],
      [-0.00047, 0],
      [-0.0002, 2],
      [0.0011, 1],
      [-0.00051, 0]
    ],
    "red_o_points": [],
    "y_categories": ["N", "NOT APPLICABLE", "nan"],
    "blue_o_points": [],
    "blue_x_points": [
      [0.00194, 1],
      [-4e-5, 2],
      [0.00117, 1],
      [-0.00012, 0],
      [-0.00011, 2],
      [0.00152, 1],
      [0.00142, 1]
    ]
  },
  "QS_mulGraftLevel[other]": {
    "red_x_points": [
      [-3e-5, 0],
      [-3e-5, 0],
      [-3e-5, 0],
      [-3e-5, 0],
      [-3e-5, 0],
      [-3e-5, 0],
      [-3e-5, 0],
      [-3e-5, 2],
      [-3e-5, 2],
      [-3e-5, 0],
      [-3e-5, 2],
      [-3e-5, 0],
      [-3e-5, 0],
      [-3e-5, 2],
      [-3e-5, 2],
      [-3e-5, 2],
      [-3e-5, 2],
      [-3e-5, 0],
      [-3e-5, 2],
      [-3e-5, 0],
      [-3e-5, 2],
      [0.00012, 1],
      [-3e-5, 0]
    ],
    "red_o_points": [],
    "y_categories": ["N", "NOT APPLICABLE", "nan"],
    "blue_o_points": [],
    "blue_x_points": [
      [0.00012, 1],
      [0.00012, 1],
      [-3e-5, 0],
      [-3e-5, 2],
      [0.00012, 1]
    ]
  },
  "QS_lstBpsurgSide": {
    "red_x_points": [
      [-0.00322, 3],
      [-0.00468, 0],
      [-0.00445, 0],
      [-0.00501, 0],
      [-0.01052, 2],
      [-0.00461, 0],
      [-0.00462, 0],
      [-0.00323, 3],
      [-0.005, 0],
      [-0.00934, 2],
      [-0.00907, 2],
      [-0.00313, 3],
      [0.01686, 1],
      [-0.0031, 3],
      [-0.00982, 2],
      [-0.00339, 3],
      [-0.00959, 2],
      [-0.00978, 2],
      [-0.00304, 3],
      [-0.0032, 3],
      [-0.00344, 3],
      [-0.00417, 0],
      [-0.00311, 3],
      [-0.00306, 3],
      [-0.00331, 3],
      [-0.00985, 2],
      [-0.00329, 3],
      [-0.01011, 2],
      [-0.00287, 3],
      [0.01703, 1],
      [-0.00441, 0]
    ],
    "red_o_points": [],
    "y_categories": ["L", "NOT APPLICABLE", "R", "nan"],
    "blue_o_points": [],
    "blue_x_points": [
      [0.0233, 1],
      [-0.00128, 3],
      [0.01853, 1],
      [0.00081, 0],
      [-0.00088, 3],
      [0.01944, 1],
      [0.02029, 1]
    ]
  },
  "QS_mulTransfSite[AcMc]": {
    "red_x_points": [
      [-0.0007, 3],
      [-0.00118, 0],
      [-0.00131, 0],
      [-0.00116, 0],
      [-0.00119, 0],
      [-0.00141, 0],
      [-0.0013, 0],
      [-0.00081, 3],
      [-0.00129, 0],
      [-0.00123, 0],
      [-0.00261, 2],
      [-0.00078, 3],
      [0.00285, 1],
      [-0.00086, 3],
      [-0.00118, 0],
      [-0.00092, 3],
      [-0.00122, 0],
      [-0.0011, 0],
      [-0.00074, 3],
      [-0.00079, 3],
      [-0.00068, 3],
      [-0.00125, 0],
      [-0.00086, 3],
      [-0.00078, 3],
      [-0.00074, 3],
      [-0.00133, 0],
      [-0.00081, 3],
      [-0.00123, 0],
      [-0.00083, 3],
      [0.0041, 1],
      [-0.00109, 0]
    ],
    "red_o_points": [],
    "y_categories": ["N", "NOT APPLICABLE", "Y", "nan"],
    "blue_o_points": [],
    "blue_x_points": [
      [0.00495, 1],
      [-9e-5, 3],
      [0.00361, 1],
      [-0.00096, 0],
      [-0.00033, 3],
      [0.00433, 1],
      [0.00397, 1]
    ]
  },
  "QS_mulTransfSite[Other]": {
    "red_x_points": [
      [-0.00074, 3],
      [-0.00121, 0],
      [-0.00121, 0],
      [-0.00118, 0],
      [-0.00094, 0],
      [-0.00102, 0],
      [-0.00126, 0],
      [-0.00082, 3],
      [-0.00118, 0],
      [-0.00107, 0],
      [-0.00108, 0],
      [-0.00068, 3],
      [0.00289, 1],
      [-0.00062, 3],
      [-0.00118, 0],
      [-0.00075, 3],
      [-0.00102, 0],
      [-0.00252, 2],
      [-0.00061, 3],
      [-0.00065, 3],
      [-0.00094, 3],
      [-0.00123, 0],
      [-0.0007, 3],
      [-0.00075, 3],
      [-0.00076, 3],
      [-0.00099, 0],
      [-0.00074, 3],
      [-0.00095, 0],
      [-0.00076, 3],
      [0.00271, 1],
      [-0.00138, 0]
    ],
    "red_o_points": [],
    "y_categories": ["N", "NOT APPLICABLE", "Y", "nan"],
    "blue_o_points": [],
    "blue_x_points": [
      [0.00456, 1],
      [-0.00028, 3],
      [0.00391, 1],
      [-0.00089, 0],
      [-0.00041, 3],
      [0.0038, 1],
      [0.00426, 1]
    ]
  },
  "QA_mulInjOrthesisType[ShoulderSupport]": {
    "red_x_points": [
      [-0.01051, 0],
      [-0.01006, 0],
      [-0.00987, 0],
      [-0.00938, 0],
      [-0.00974, 0],
      [-0.01005, 0],
      [-0.00973, 0],
      [-0.0122, 2],
      [-0.01007, 0],
      [-0.0098, 0],
      [-0.01018, 0],
      [-0.01022, 0],
      [0.02594, 1],
      [-0.01032, 0],
      [-0.00977, 0],
      [-0.01041, 0],
      [-0.01168, 2],
      [-0.00947, 0],
      [-0.01059, 0],
      [-0.01005, 0],
      [-0.01204, 2],
      [-0.01165, 3],
      [-0.01006, 0],
      [0.02912, 1],
      [-0.01027, 0],
      [-0.0096, 0],
      [-0.00953, 0],
      [-0.00987, 0],
      [-0.0122, 3],
      [-0.01591, 3],
      [-0.00914, 0]
    ],
    "red_o_points": [],
    "y_categories": ["N", "NOT APPLICABLE", "Y", "nan"],
    "blue_o_points": [],
    "blue_x_points": [
      [-0.0037, 0],
      [0.02818, 1],
      [0.02509, 1],
      [0.03256, 1],
      [0.02882, 1],
      [0.02542, 1],
      [0.02562, 1]
    ]
  },
  "QA_equInjTbpiAge": {
    "red_x_points": [
      [-0.00054, 1],
      [-7e-5, 1],
      [0.0001, 1],
      [2e-5, 0],
      [-0.00129, 0],
      [0.00026, 1],
      [6e-5, 1],
      [0.00054, 0],
      [-0.00123, 0],
      [-0.00076, 0],
      [8e-5, 1],
      [0.00031, 0],
      [-0.01202, 1],
      [-0.001, 1],
      [-0.00021, 1],
      [-0.00077, 1],
      [-0.00054, 0],
      [-0.00069, 0],
      [-0.00087, 1],
      [0.00041, 0],
      [-0.00059, 1],
      [-0.0, 1],
      [-0.0008, 1],
      [-0.00203, 1],
      [0.00058, 0],
      [0.0001, 1],
      [-0.0008, 1],
      [0.00015, 1],
      [-0.0006, 1],
      [-0.0105, 1],
      [-0.00014, 0]
    ],
    "red_o_points": [],
    "y_categories": ["GREATER THAN OR EQUALS TO 30", "LESS THAN 30", "nan"],
    "blue_o_points": [],
    "blue_x_points": [
      [-0.00365, 1],
      [-0.00111, 1],
      [0.00574, 0],
      [0.00103, 1],
      [0.00462, 0],
      [0.00615, 0],
      [0.00675, 0]
    ]
  },
  "QS_mulLysisNerve[Ssr]": {
    "red_x_points": [
      [-0.0007, 3],
      [-0.0009, 0],
      [-0.00207, 2],
      [-0.00064, 0],
      [-0.0008, 0],
      [-0.00081, 0],
      [-0.00069, 0],
      [-0.00062, 3],
      [-0.00072, 0],
      [-0.00083, 0],
      [-0.00071, 0],
      [-0.00064, 3],
      [0.00258, 1],
      [-0.00057, 3],
      [-0.00091, 0],
      [-0.00067, 3],
      [-0.00088, 0],
      [-0.00073, 0],
      [-0.00062, 3],
      [-0.00049, 3],
      [-0.00051, 3],
      [-0.00073, 0],
      [-0.00065, 3],
      [-0.0005, 3],
      [-0.00069, 3],
      [-0.00076, 0],
      [-0.00043, 3],
      [-0.00079, 0],
      [-0.00067, 3],
      [0.00249, 1],
      [-0.0007, 0]
    ],
    "red_o_points": [],
    "y_categories": ["N", "NOT APPLICABLE", "Y", "nan"],
    "blue_o_points": [],
    "blue_x_points": [
      [0.00342, 1],
      [-0.00023, 3],
      [0.00256, 1],
      [-0.00087, 0],
      [-0.00015, 3],
      [0.00307, 1],
      [0.00286, 1]
    ]
  },
  "QS_mulTransfSite[AcSsAA]": {
    "red_x_points": [
      [-0.00255, 3],
      [-0.00667, 2],
      [-0.00357, 0],
      [-0.00682, 2],
      [-0.0073, 2],
      [-0.00323, 0],
      [-0.00331, 0],
      [-0.00219, 3],
      [-0.00339, 0],
      [-0.00703, 2],
      [-0.00321, 0],
      [-0.00258, 3],
      [0.01135, 1],
      [-0.00243, 3],
      [-0.00766, 2],
      [-0.00247, 3],
      [-0.00322, 0],
      [-0.00317, 0],
      [-0.00255, 3],
      [-0.0023, 3],
      [-0.0026, 3],
      [-0.00701, 2],
      [-0.0025, 3],
      [-0.00278, 3],
      [-0.00273, 3],
      [-0.00285, 0],
      [-0.00231, 3],
      [-0.00676, 2],
      [-0.00238, 3],
      [0.01307, 1],
      [-0.00355, 0]
    ],
    "red_o_points": [],
    "y_categories": ["N", "NOT APPLICABLE", "Y", "nan"],
    "blue_o_points": [],
    "blue_x_points": [
      [0.01701, 1],
      [-0.00112, 3],
      [0.01396, 1],
      [-0.00115, 0],
      [-0.00075, 3],
      [0.0137, 1],
      [0.01429, 1]
    ]
  },
  "QA_lstPexMuscstrength[WristExte]": {
    "red_x_points": [
      [-0.00265, 1],
      [-0.00025, 2],
      [-0.00155, 1],
      [-0.00128, 1],
      [0.00065, 0],
      [-0.00195, 1],
      [-0.00191, 1],
      [-0.00159, 0],
      [0.00115, 0],
      [0.00082, 0],
      [-0.00155, 1],
      [-0.00138, 0],
      [-0.00181, 2],
      [0.00189, 2],
      [-0.00031, 2],
      [-0.00089, 0],
      [-0.00018, 2],
      [0.00068, 0],
      [-0.00105, 0],
      [-0.00275, 1],
      [-0.00147, 0],
      [-0.0014, 1],
      [0.00178, 2],
      [-0.0013, 0],
      [-0.00356, 1],
      [0.0008, 0],
      [-0.00323, 1],
      [0.00062, 0],
      [0.00193, 2],
      [-0.002, 2],
      [-0.00135, 1]
    ],
    "red_o_points": [],
    "y_categories": ["GREATER THAN OR EQUALS TO 3", "LESS THAN 3", "nan"],
    "blue_o_points": [],
    "blue_x_points": [
      [0.00153, 0],
      [0.00347, 2],
      [0.00092, 0],
      [0.00292, 0],
      [0.00411, 2],
      [0.00069, 1],
      [0.00106, 0]
    ]
  },
  "QS_mulNeuromadSite[C6]": {
    "red_x_points": [
      [-0.0008, 2],
      [-0.00283, 0],
      [-0.0023, 0],
      [-0.00252, 0],
      [-0.00277, 0],
      [-0.00222, 0],
      [-0.00233, 0],
      [-0.00091, 2],
      [-0.00261, 0],
      [-0.00251, 0],
      [-0.00221, 0],
      [-0.00104, 2],
      [0.00482, 1],
      [-0.00078, 2],
      [-0.00263, 0],
      [-0.00079, 2],
      [-0.00267, 0],
      [-0.00281, 0],
      [-0.00087, 2],
      [-0.00069, 2],
      [-0.00055, 2],
      [-0.0024, 0],
      [-0.00061, 2],
      [-0.00111, 2],
      [-0.00087, 2],
      [-0.00238, 0],
      [-0.00074, 2],
      [-0.00283, 0],
      [-0.00047, 2],
      [0.00479, 1],
      [-0.0022, 0]
    ],
    "red_o_points": [],
    "y_categories": ["N", "NOT APPLICABLE", "nan"],
    "blue_o_points": [],
    "blue_x_points": [
      [0.00838, 1],
      [-0.0, 2],
      [0.00627, 1],
      [-0.00049, 0],
      [0.00013, 2],
      [0.00601, 1],
      [0.00595, 1]
    ]
  },
  "QS_mulBpsurgeryType[Lysis]": {
    "red_x_points": [
      [-0.00237, 3],
      [-0.00397, 0],
      [-0.00756, 2],
      [-0.0041, 0],
      [-0.00437, 0],
      [-0.0078, 2],
      [-0.00412, 0],
      [-0.00253, 3],
      [-0.00412, 0],
      [-0.00399, 0],
      [-0.00414, 0],
      [-0.0027, 3],
      [0.01084, 1],
      [-0.00224, 3],
      [-0.0045, 0],
      [-0.00281, 3],
      [-0.00756, 2],
      [-0.00406, 0],
      [-0.00237, 3],
      [-0.00236, 3],
      [-0.00212, 3],
      [-0.00378, 0],
      [-0.00226, 3],
      [-0.0023, 3],
      [-0.00258, 3],
      [-0.0041, 0],
      [-0.00235, 3],
      [-0.00444, 0],
      [-0.00225, 3],
      [0.01164, 1],
      [-0.0066, 2]
    ],
    "red_o_points": [],
    "y_categories": ["N", "NOT APPLICABLE", "Y", "nan"],
    "blue_o_points": [],
    "blue_x_points": [
      [0.01668, 1],
      [-0.00073, 3],
      [0.01362, 1],
      [-0.00167, 0],
      [-0.0006, 3],
      [0.01357, 1],
      [0.01512, 1]
    ]
  },
  "QA_lstPexMuscstrength[ShoulderAbduc]": {
    "red_x_points": [
      [-0.00411, 1],
      [-0.00434, 1],
      [-0.00398, 1],
      [-0.00426, 1],
      [-0.00447, 1],
      [-0.00441, 1],
      [-0.00408, 1],
      [-0.00413, 1],
      [-0.00494, 1],
      [-0.00388, 1],
      [-0.00445, 1],
      [-0.00461, 1],
      [0.00364, 2],
      [0.00382, 2],
      [0.00378, 2],
      [0.00394, 2],
      [0.00375, 2],
      [-0.00461, 1],
      [-0.00423, 1],
      [-0.00447, 1],
      [-0.00431, 1],
      [-0.00481, 1],
      [0.00399, 2],
      [-0.00548, 1],
      [-0.00475, 1],
      [-0.00417, 1],
      [-0.00457, 1],
      [-0.00443, 1],
      [-0.00469, 1],
      [0.00261, 2],
      [-0.00427, 1]
    ],
    "red_o_points": [],
    "y_categories": ["GREATER THAN OR EQUALS TO 3", "LESS THAN 3", "nan"],
    "blue_o_points": [],
    "blue_x_points": [
      [0.00323, 2],
      [0.0044, 2],
      [0.01739, 0],
      [0.00494, 2],
      [0.00442, 2],
      [0.01791, 0],
      [-0.00141, 1]
    ]
  },
  "QA_lstPexMuscstrength[ShoulderExrot]": {
    "red_x_points": [
      [-0.00136, 1],
      [0.00017, 2],
      [0.00175, 0],
      [-0.00137, 1],
      [-0.00149, 1],
      [-0.00151, 1],
      [0.00025, 2],
      [-0.00128, 1],
      [-0.00132, 1],
      [-0.00128, 1],
      [0.00018, 2],
      [-0.0014, 1],
      [-0.0005, 2],
      [0.00023, 2],
      [0.00014, 2],
      [0.00013, 2],
      [0.00018, 2],
      [-0.00145, 1],
      [-0.00149, 1],
      [-0.00131, 1],
      [-0.0013, 1],
      [0.0002, 2],
      [0.00016, 2],
      [0.00019, 2],
      [0.00018, 2],
      [-0.00116, 1],
      [0.00029, 2],
      [0.00188, 0],
      [0.00011, 2],
      [-0.00048, 2],
      [-0.0012, 1]
    ],
    "red_o_points": [],
    "y_categories": ["GREATER THAN OR EQUALS TO 3", "LESS THAN 3", "nan"],
    "blue_o_points": [],
    "blue_x_points": [
      [-2e-5, 2],
      [0.00023, 2],
      [0.00371, 0],
      [0.00039, 2],
      [0.00017, 2],
      [0.00312, 0],
      [0.00024, 1]
    ]
  },
  "QS_mulGraftLevel[Root]": {
    "red_x_points": [
      [0.0, 2],
      [-5e-5, 0],
      [-9e-5, 0],
      [-9e-5, 0],
      [-9e-5, 0],
      [-9e-5, 0],
      [-5e-5, 0],
      [0.0, 2],
      [-9e-5, 0],
      [-5e-5, 0],
      [0.0, 2],
      [7e-5, 1],
      [0.0, 2],
      [-5e-5, 0],
      [-0.0, 2],
      [-9e-5, 0],
      [-5e-5, 0],
      [0.0, 2],
      [-0.0, 2],
      [0.0, 2],
      [-5e-5, 0],
      [1e-5, 2],
      [0.0, 2],
      [0.0, 2],
      [-5e-5, 0],
      [0.0, 2],
      [-9e-5, 0],
      [1e-5, 2],
      [7e-5, 1],
      [-5e-5, 0]
    ],
    "red_o_points": [],
    "y_categories": ["N", "NOT APPLICABLE", "nan"],
    "blue_o_points": [],
    "blue_x_points": [
      [0.00023, 1],
      [0.0, 2],
      [0.00023, 1],
      [0.0, 2],
      [0.00023, 1]
    ]
  },
  "QS_mulNeuromadSite[C4]": {
    "red_x_points": [
      [-0.00103, 2],
      [-0.00236, 0],
      [-0.00231, 0],
      [-0.00217, 0],
      [-0.00231, 0],
      [-0.00231, 0],
      [-0.00222, 0],
      [-0.00097, 2],
      [-0.00228, 0],
      [-0.00222, 0],
      [-0.00201, 0],
      [-0.00096, 2],
      [0.00353, 1],
      [-0.00101, 2],
      [-0.00213, 0],
      [-0.00127, 2],
      [-0.00196, 0],
      [-0.00262, 0],
      [-0.00099, 2],
      [-0.00095, 2],
      [-0.00092, 2],
      [-0.00217, 0],
      [-0.00083, 2],
      [-0.00113, 2],
      [-0.00102, 2],
      [-0.00195, 0],
      [-0.00091, 2],
      [-0.00217, 0],
      [-0.00055, 2],
      [0.00502, 1],
      [-0.00228, 0]
    ],
    "red_o_points": [],
    "y_categories": ["N", "NOT APPLICABLE", "nan"],
    "blue_o_points": [],
    "blue_x_points": [
      [0.00775, 1],
      [-0.00026, 2],
      [0.00597, 1],
      [-0.0002, 0],
      [-0.00025, 2],
      [0.00564, 1],
      [0.00607, 1]
    ]
  },
  "QS_mulGraftNerve[Ra]": {
    "red_x_points": [
      [-0.00021, 2],
      [-0.00087, 0],
      [-0.0011, 0],
      [-0.00094, 0],
      [-0.00087, 0],
      [-0.00096, 0],
      [-0.00097, 0],
      [-0.00015, 2],
      [-0.00092, 0],
      [-0.00092, 0],
      [-0.00104, 0],
      [-0.00031, 2],
      [0.00152, 1],
      [-0.00028, 2],
      [-0.00099, 0],
      [-0.0003, 2],
      [-0.00101, 0],
      [-0.00092, 0],
      [-0.00011, 2],
      [-0.00018, 2],
      [-9e-5, 2],
      [-0.00085, 0],
      [-0.00027, 2],
      [-5e-5, 2],
      [-0.00012, 2],
      [-0.00103, 0],
      [-0.00017, 2],
      [-0.00098, 0],
      [-0.00012, 2],
      [0.00178, 1],
      [-0.00089, 0]
    ],
    "red_o_points": [],
    "y_categories": ["N", "NOT APPLICABLE", "nan"],
    "blue_o_points": [],
    "blue_x_points": [
      [0.00378, 1],
      [3e-5, 2],
      [0.00187, 1],
      [-0.00015, 0],
      [0.00017, 2],
      [0.00178, 1],
      [0.0021, 1]
    ]
  },
  "QS_mulTransfSite[Oberlin]": {
    "red_x_points": [
      [-0.00237, 3],
      [-0.00855, 0],
      [-0.00935, 0],
      [-0.00824, 0],
      [-0.00418, 2],
      [-0.0039, 2],
      [-0.00807, 0],
      [-0.00253, 3],
      [-0.00373, 2],
      [-0.00433, 2],
      [-0.00374, 2],
      [-0.00295, 3],
      [0.01491, 1],
      [-0.00261, 3],
      [-0.00372, 2],
      [-0.00258, 3],
      [-0.00867, 0],
      [-0.00428, 2],
      [-0.00258, 3],
      [-0.00268, 3],
      [-0.00227, 3],
      [-0.00808, 0],
      [-0.00248, 3],
      [-0.00306, 3],
      [-0.00269, 3],
      [-0.0039, 2],
      [-0.00265, 3],
      [-0.00862, 0],
      [-0.0027, 3],
      [0.01494, 1],
      [-0.00872, 0]
    ],
    "red_o_points": [],
    "y_categories": ["N", "NOT APPLICABLE", "Y", "nan"],
    "blue_o_points": [],
    "blue_x_points": [
      [0.02078, 1],
      [-0.00102, 3],
      [0.01653, 1],
      [0.00017, 2],
      [-0.00087, 3],
      [0.01604, 1],
      [0.01561, 1]
    ]
  },
  "QA_intPexForearmProna": {
    "red_x_points": [
      [8e-5, 2],
      [-0.00042, 0],
      [6e-5, 2],
      [9e-5, 2],
      [-0.00093, 0],
      [-0.00042, 0],
      [8e-5, 2],
      [-0.00049, 0],
      [0.0001, 2],
      [2e-5, 2],
      [6e-5, 2],
      [-0.00049, 0],
      [8e-5, 2],
      [8e-5, 2],
      [7e-5, 2],
      [9e-5, 2],
      [8e-5, 2],
      [-0.00078, 0],
      [-0.00065, 0],
      [-0.00042, 0],
      [-0.00049, 0],
      [-0.00047, 0],
      [0.0001, 2],
      [5e-5, 2],
      [6e-5, 2],
      [0.0001, 2],
      [0.00028, 1],
      [0.00013, 2],
      [5e-5, 2],
      [0.00051, 1],
      [-0.00042, 0]
    ],
    "red_o_points": [],
    "y_categories": ["GREATER THAN OR EQUALS TO 80", "LESS THAN 80", "nan"],
    "blue_o_points": [],
    "blue_x_points": [
      [9e-5, 2],
      [5e-5, 2],
      [0.00132, 1],
      [0.00033, 2],
      [0.00021, 2],
      [5e-5, 2],
      [2e-5, 2]
    ]
  },
  "QS_mulGraftNerve[FI]": {
    "red_x_points": [
      [-0.00023, 2],
      [-0.00111, 0],
      [-0.00118, 0],
      [-0.00114, 0],
      [-0.00142, 0],
      [-0.00112, 0],
      [-0.00108, 0],
      [-0.00015, 2],
      [-0.00106, 0],
      [-0.00102, 0],
      [-0.00118, 0],
      [-0.00035, 2],
      [0.00171, 1],
      [-0.0001, 2],
      [-0.00121, 0],
      [-0.00032, 2],
      [-0.00113, 0],
      [-0.00111, 0],
      [-0.00025, 2],
      [-0.00022, 2],
      [-0.00035, 2],
      [-0.00105, 0],
      [-0.00016, 2],
      [-0.00016, 2],
      [-0.00037, 2],
      [-0.00091, 0],
      [-0.00028, 2],
      [-0.00129, 0],
      [-0.0002, 2],
      [0.0021, 1],
      [-0.00132, 0]
    ],
    "red_o_points": [],
    "y_categories": ["N", "NOT APPLICABLE", "nan"],
    "blue_o_points": [],
    "blue_x_points": [
      [0.00386, 1],
      [0.00012, 2],
      [0.0023, 1],
      [-0.00024, 0],
      [0.00039, 2],
      [0.00229, 1],
      [0.00362, 1]
    ]
  },
  "QA_lstPexPalle[Ulna]": {
    "red_x_points": [
      [2e-5, 3],
      [2e-5, 3],
      [2e-5, 3],
      [2e-5, 3],
      [-5e-5, 1],
      [7e-5, 3],
      [2e-5, 3],
      [-2e-5, 2],
      [-2e-5, 2],
      [-0.00014, 1],
      [2e-5, 3],
      [2e-5, 3],
      [2e-5, 3],
      [2e-5, 3],
      [-2e-5, 2],
      [-2e-5, 2],
      [-5e-5, 0],
      [-0.00011, 2],
      [-5e-5, 0],
      [-0.00011, 2],
      [7e-5, 3],
      [-0.00011, 2],
      [2e-5, 3]
    ],
    "red_o_points": [],
    "y_categories": ["ABS", "HYPO", "PT", "nan"],
    "blue_o_points": [],
    "blue_x_points": [[7e-5, 3], [-2e-5, 2], [2e-5, 3], [7e-5, 3]]
  }
}
