{
  "QA_lstPexPain[C8]": {
    "red_x_points": [
      [-0.00913, 1],
      [-0.00289, 2],
      [-0.00377, 2],
      [-0.00227, 2],
      [-0.00835, 1],
      [0.00052, 0],
      [-0.00068, 1],
      [-0.00168, 1],
      [0.0069, 0],
      [-0.00034, 0],
      [0.0005, 0],
      [-7e-5, 0],
      [-0.01016, 1],
      [-0.01363, 2],
      [-0.00541, 2],
      [-0.00389, 2],
      [-0.00572, 2],
      [-0.00266, 2],
      [-0.00658, 2],
      [0.00736, 0],
      [-0.00912, 1],
      [0.00666, 0],
      [-0.0028, 2],
      [-0.00568, 2],
      [0.0045, 0],
      [-0.00597, 2],
      [-0.00444, 2],
      [-0.00274, 2],
      [-0.0076, 1],
      [-0.01049, 1],
      [-0.00222, 1],
      [-0.00942, 1]
    ],
    "red_o_points": [],
    "y_categories": ["NORM", "NPV", "nan"],
    "blue_o_points": [],
    "blue_x_points": [
      [0.01088, 0],
      [-0.00215, 2],
      [0.0008, 1],
      [0.01084, 1],
      [0.00494, 0],
      [0.00029, 1],
      [0.01172, 0],
      [0.00501, 0],
      [0.01164, 0],
      [0.01465, 0]
    ]
  },
  "QS_mulLysisRoot[C6]": {
    "red_x_points": [
      [-0.00056, 3],
      [-0.002, 0],
      [-0.00577, 2],
      [-0.00238, 0],
      [-0.00063, 3],
      [-0.00219, 0],
      [-0.00222, 0],
      [-0.00215, 0],
      [-0.00095, 3],
      [-0.00231, 0],
      [-0.00231, 0],
      [-0.00171, 0],
      [-0.00082, 3],
      [0.00418, 1],
      [-0.001, 3],
      [-0.00243, 0],
      [-0.00047, 3],
      [-0.00226, 0],
      [-0.00065, 3],
      [-0.00117, 3],
      [-0.00058, 3],
      [-0.00058, 3],
      [-0.00188, 0],
      [-0.00071, 3],
      [-0.00062, 3],
      [-0.00051, 3],
      [-0.00193, 0],
      [-0.00229, 0],
      [0.00533, 1],
      [-0.00051, 3],
      [-0.00633, 2],
      [-0.00043, 3]
    ],
    "red_o_points": [],
    "y_categories": ["N", "NOT APPLICABLE", "Y", "nan"],
    "blue_o_points": [],
    "blue_x_points": [
      [0.00688, 1],
      [-0.0002, 3],
      [0.00603, 1],
      [6e-5, 0],
      [0.0001, 0],
      [0.00566, 1],
      [-0.00025, 3],
      [0.00682, 1],
      [-0.00028, 3],
      [-0.00013, 3]
    ]
  },
  "QS_mulLysisTrunk[Upper]": {
    "red_x_points": [
      [-0.00176, 3],
      [-0.00472, 0],
      [-0.00429, 0],
      [-0.00518, 0],
      [-0.00125, 3],
      [-0.0055, 0],
      [-0.01194, 2],
      [-0.00499, 0],
      [-0.00192, 3],
      [-0.0049, 0],
      [-0.00556, 0],
      [-0.00473, 0],
      [-0.00181, 3],
      [0.00903, 1],
      [-0.00113, 3],
      [-0.00523, 0],
      [-0.00132, 3],
      [-0.00967, 2],
      [-0.0008, 3],
      [-0.00194, 3],
      [-0.00136, 3],
      [-0.0014, 3],
      [-0.00469, 0],
      [-0.00114, 3],
      [-0.00172, 3],
      [-0.00108, 3],
      [-0.00463, 0],
      [-0.00429, 0],
      [0.01051, 1],
      [-0.00128, 3],
      [-0.01021, 2],
      [-0.00116, 3]
    ],
    "red_o_points": [],
    "y_categories": ["N", "NOT APPLICABLE", "Y", "nan"],
    "blue_o_points": [],
    "blue_x_points": [
      [0.01622, 1],
      [6e-5, 3],
      [0.01331, 1],
      [0.00058, 0],
      [-0.00132, 0],
      [0.01371, 1],
      [-0.00064, 3],
      [0.01443, 1],
      [-0.00022, 3],
      [0.00041, 3]
    ]
  },
  "QS_mulBpsurgeryType[Transf]": {
    "red_x_points": [
      [-8e-5, 3],
      [-0.00032, 2],
      [-0.0029, 0],
      [-0.00036, 2],
      [-0.00011, 3],
      [-0.00034, 2],
      [-0.00038, 2],
      [-0.00027, 2],
      [-5e-5, 3],
      [-0.00033, 2],
      [-0.00035, 2],
      [-0.0003, 2],
      [-0.00012, 3],
      [0.00094, 1],
      [-0.00012, 3],
      [-0.00034, 2],
      [-0.0001, 3],
      [-0.0003, 2],
      [-9e-5, 3],
      [-0.0001, 3],
      [-9e-5, 3],
      [-4e-5, 3],
      [-0.00034, 2],
      [-0.00011, 3],
      [-9e-5, 3],
      [-0.00011, 3],
      [-0.0003, 2],
      [-0.00028, 2],
      [0.00084, 1],
      [-7e-5, 3],
      [-0.00021, 2],
      [-0.00013, 3]
    ],
    "red_o_points": [],
    "y_categories": ["N", "NOT APPLICABLE", "Y", "nan"],
    "blue_o_points": [],
    "blue_x_points": [
      [0.00142, 1],
      [-2e-5, 3],
      [0.00095, 1],
      [0.00044, 2],
      [0.00012, 2],
      [0.00068, 1],
      [-6e-5, 3],
      [0.00107, 1],
      [-8e-5, 3],
      [-2e-5, 3]
    ]
  },
  "QS_equBpsurgTime": {
    "red_x_points": [
      [0.00071, 3],
      [-0.00693, 0],
      [0.0063, 2],
      [-0.00725, 0],
      [0.00058, 3],
      [-0.01175, 0],
      [-0.00753, 1],
      [-0.00804, 1],
      [0.00058, 3],
      [-0.00944, 1],
      [-0.00917, 0],
      [0.00909, 2],
      [0.00068, 3],
      [0.00089, 3],
      [0.00076, 3],
      [-0.00741, 1],
      [0.00067, 3],
      [0.00524, 2],
      [0.00062, 3],
      [0.00059, 3],
      [0.00066, 3],
      [0.00067, 3],
      [-0.00665, 0],
      [0.00078, 3],
      [0.00058, 3],
      [0.00072, 3],
      [-0.00865, 0],
      [-0.00691, 0],
      [0.00074, 3],
      [0.00072, 3],
      [0.00536, 2],
      [0.00074, 3]
    ],
    "red_o_points": [],
    "y_categories": [
      "0 TO 6 MONTHS",
      "13 TO 24 MONTHS",
      "7 TO 12 MONTHS",
      "nan"
    ],
    "blue_o_points": [],
    "blue_x_points": [
      [0.00059, 3],
      [0.00063, 3],
      [0.00049, 3],
      [0.01317, 2],
      [0.01486, 2],
      [0.0006, 3],
      [0.00085, 3],
      [0.00047, 3],
      [0.00092, 3],
      [0.00071, 3]
    ]
  },
  "QA_lstPexMuscstrength[FingersAddu]": {
    "red_x_points": [
      [0.00163, 0],
      [-2e-5, 2],
      [-0.0049, 1],
      [-0.00398, 1],
      [-0.00594, 1],
      [0.002, 0],
      [0.0015, 0],
      [-0.00554, 1],
      [0.00127, 0],
      [0.00166, 0],
      [0.00035, 2],
      [0.00247, 0],
      [0.00161, 0],
      [3e-5, 2],
      [0.00028, 2],
      [-0.00012, 2],
      [0.00167, 0],
      [-0.00026, 2],
      [0.00037, 2],
      [0.00139, 0],
      [-0.00643, 1],
      [0.00163, 0],
      [-0.00463, 1],
      [0.00045, 2],
      [0.00028, 2],
      [0.00031, 2],
      [-0.00013, 2],
      [-0.00422, 1],
      [0.00017, 2],
      [-0.00624, 1],
      [-0.00574, 1],
      [0.00021, 2]
    ],
    "red_o_points": [],
    "y_categories": ["GREATER THAN OR EQUALS TO 3", "LESS THAN 3", "nan"],
    "blue_o_points": [],
    "blue_x_points": [
      [0.00013, 2],
      [0.00062, 2],
      [0.00181, 0],
      [0.00115, 2],
      [0.00438, 0],
      [0.00153, 0],
      [0.00414, 0],
      [0.00149, 0],
      [0.0011, 2],
      [0.00114, 2]
    ]
  },
  "QA_yonInjFracture": {
    "red_x_points": [
      [-0.00934, 0],
      [-0.00073, 2],
      [0.00095, 0],
      [-0.00112, 1],
      [-0.0086, 0],
      [0.00035, 0],
      [0.00017, 0],
      [-0.00242, 1],
      [0.0059, 2],
      [0.00048, 0],
      [-0.00221, 1],
      [-0.00546, 1],
      [-0.01038, 0],
      [-0.00098, 0],
      [0.00614, 1],
      [-0.00215, 1],
      [-0.00842, 0],
      [-0.00254, 1],
      [-0.01213, 0],
      [-0.01256, 0],
      [0.00578, 1],
      [-0.01289, 0],
      [-0.00106, 1],
      [-0.01022, 0],
      [-0.01175, 0],
      [-0.01242, 0],
      [0.00069, 0],
      [0.00025, 0],
      [-0.01183, 1],
      [0.00514, 2],
      [-0.0023, 1],
      [0.00486, 1]
    ],
    "red_o_points": [],
    "y_categories": ["N", "Y", "nan"],
    "blue_o_points": [],
    "blue_x_points": [
      [0.00319, 0],
      [0.01266, 1],
      [0.00155, 0],
      [0.00444, 0],
      [0.0047, 0],
      [0.00175, 1],
      [0.01246, 2],
      [0.00137, 0],
      [0.01555, 1],
      [0.01197, 2]
    ]
  },
  "QS_mulGraftNerve[Ac]": {
    "red_x_points": [
      [-3e-5, 2],
      [-0.00041, 0],
      [-4e-5, 0],
      [-0.00029, 0],
      [-5e-5, 2],
      [-0.00039, 0],
      [-0.00011, 0],
      [-0.00026, 0],
      [-0.00011, 2],
      [-0.00023, 0],
      [-0.00026, 0],
      [-0.00018, 0],
      [-8e-5, 2],
      [0.00013, 1],
      [-4e-5, 2],
      [-0.00019, 0],
      [-9e-5, 2],
      [-0.00025, 0],
      [0.0, 2],
      [-0.0001, 2],
      [-2e-5, 2],
      [-0.0001, 2],
      [-0.00013, 0],
      [-0.0, 2],
      [-1e-5, 2],
      [-3e-5, 2],
      [-0.00019, 0],
      [-0.00019, 0],
      [0.00025, 1],
      [0.0, 2],
      [-0.00012, 0],
      [-9e-5, 2]
    ],
    "red_o_points": [],
    "y_categories": ["N", "NOT APPLICABLE", "nan"],
    "blue_o_points": [],
    "blue_x_points": [
      [0.00084, 1],
      [4e-5, 2],
      [0.00052, 1],
      [7e-5, 0],
      [-6e-5, 0],
      [0.00037, 1],
      [-1e-5, 2],
      [0.00063, 1],
      [-2e-5, 2],
      [-2e-5, 2]
    ]
  },
  "QS_mulNeuromadSite[C8]": {
    "red_x_points": [
      [-0.00017, 2],
      [-0.00265, 0],
      [-0.00232, 0],
      [-0.00278, 0],
      [-0.00031, 2],
      [-0.00296, 0],
      [-0.00236, 0],
      [-0.00279, 0],
      [-0.00096, 2],
      [-0.00335, 0],
      [-0.00328, 0],
      [-0.00254, 0],
      [-0.00039, 2],
      [0.00253, 1],
      [-0.00036, 2],
      [-0.0029, 0],
      [-0.00051, 2],
      [-0.00226, 0],
      [-0.00037, 2],
      [-0.00069, 2],
      [-0.00017, 2],
      [-0.0005, 2],
      [-0.00227, 0],
      [-0.00033, 2],
      [-0.0015, 2],
      [-0.00035, 2],
      [-0.00308, 0],
      [-0.00147, 0],
      [0.00337, 1],
      [-0.0003, 2],
      [-0.00216, 0],
      [-0.00053, 2]
    ],
    "red_o_points": [],
    "y_categories": ["N", "NOT APPLICABLE", "nan"],
    "blue_o_points": [],
    "blue_x_points": [
      [0.00693, 1],
      [0.00034, 2],
      [0.00539, 1],
      [0.00045, 0],
      [-0.00074, 0],
      [0.00617, 1],
      [-0.0001, 2],
      [0.00685, 1],
      [0.00014, 2],
      [0.0002, 2]
    ]
  },
  "QS_mulGraftNerve[Ph]": {
    "red_x_points": [
      [-6e-5, 2],
      [-0.00029, 0],
      [-0.00019, 0],
      [-0.0003, 0],
      [-5e-5, 2],
      [-0.00041, 0],
      [-0.00031, 0],
      [-0.00033, 0],
      [-8e-5, 2],
      [-0.00031, 0],
      [-0.00043, 0],
      [-0.00025, 0],
      [-3e-5, 2],
      [-5e-5, 1],
      [-0.0001, 2],
      [-0.00019, 0],
      [-6e-5, 2],
      [-3e-5, 0],
      [-0.0001, 2],
      [-4e-5, 2],
      [-8e-5, 2],
      [-6e-5, 2],
      [-0.00032, 0],
      [-0.00012, 2],
      [-6e-5, 2],
      [-6e-5, 2],
      [-0.00028, 0],
      [-0.0003, 0],
      [0.00014, 1],
      [-4e-5, 2],
      [-0.00018, 0],
      [0.0, 2]
    ],
    "red_o_points": [],
    "y_categories": ["N", "NOT APPLICABLE", "nan"],
    "blue_o_points": [],
    "blue_x_points": [
      [0.00103, 1],
      [5e-5, 2],
      [0.00051, 1],
      [7e-5, 0],
      [-3e-5, 0],
      [0.00051, 1],
      [-7e-5, 2],
      [0.00091, 1],
      [-2e-5, 2],
      [-2e-5, 2]
    ]
  },
  "QS_mulTransfSite[AcSsPA]": {
    "red_x_points": [
      [-0.00031, 3],
      [-0.00142, 0],
      [-0.00117, 0],
      [-0.0014, 0],
      [-0.00056, 3],
      [-0.002, 0],
      [-0.00131, 0],
      [-0.00129, 0],
      [-0.00043, 3],
      [-0.00173, 0],
      [-0.00201, 0],
      [-0.00136, 0],
      [-0.00013, 3],
      [0.00272, 1],
      [-0.00036, 3],
      [-0.0012, 0],
      [-0.00036, 3],
      [-0.00378, 2],
      [-0.00045, 3],
      [-0.00041, 3],
      [-0.00011, 3],
      [-0.00029, 3],
      [-0.00112, 0],
      [-0.00041, 3],
      [-0.00024, 3],
      [-0.00045, 3],
      [-0.00091, 0],
      [-0.00096, 0],
      [0.0021, 1],
      [-0.00029, 3],
      [-0.00122, 0],
      [-0.00081, 3]
    ],
    "red_o_points": [],
    "y_categories": ["N", "NOT APPLICABLE", "Y", "nan"],
    "blue_o_points": [],
    "blue_x_points": [
      [0.00448, 1],
      [6e-5, 3],
      [0.00338, 1],
      [0.00033, 0],
      [-0.00086, 0],
      [0.00334, 1],
      [-0.00015, 3],
      [0.00391, 1],
      [-9e-5, 3],
      [-0.00013, 3]
    ]
  },
  "QA_lstPexMuscstrength[FingersFlex]": {
    "red_x_points": [
      [0.00023, 0],
      [0.00048, 2],
      [-0.00288, 1],
      [-0.00196, 1],
      [0.00061, 0],
      [0.00043, 0],
      [0.00054, 0],
      [-0.0031, 1],
      [0.00029, 0],
      [0.00036, 0],
      [0.00037, 0],
      [0.00046, 0],
      [-0.00589, 1],
      [0.00026, 2],
      [0.00062, 2],
      [0.00026, 2],
      [0.0003, 0],
      [0.00037, 2],
      [0.00074, 2],
      [0.00029, 0],
      [-0.00526, 1],
      [5e-5, 0],
      [-0.00219, 1],
      [0.00049, 2],
      [0.00106, 2],
      [0.00084, 2],
      [0.00042, 0],
      [0.00041, 0],
      [0.00035, 2],
      [-0.00507, 1],
      [-0.00329, 1],
      [0.00059, 2]
    ],
    "red_o_points": [],
    "y_categories": ["GREATER THAN OR EQUALS TO 3", "LESS THAN 3", "nan"],
    "blue_o_points": [],
    "blue_x_points": [
      [0.00016, 2],
      [0.00078, 2],
      [0.00064, 0],
      [0.00186, 2],
      [0.00134, 0],
      [0.00059, 0],
      [0.00207, 0],
      [0.00057, 0],
      [0.00172, 2],
      [0.00123, 2]
    ]
  },
  "participant_code": {
    "red_x_points": [
      [-0.02529, 1],
      [-0.02494, 2],
      [-0.0257, 3],
      [-0.02535, 4],
      [-0.02547, 5],
      [-0.02505, 6],
      [-0.02417, 7],
      [-0.02417, 8],
      [-0.02464, 9],
      [-0.02417, 10],
      [-0.02411, 11],
      [-0.02505, 12],
      [-0.02564, 13],
      [-0.02494, 15],
      [-0.02505, 17],
      [-0.02447, 18],
      [-0.02505, 20],
      [-0.02458, 21],
      [-0.025, 22],
      [-0.02423, 24],
      [-0.02529, 26],
      [-0.02429, 27],
      [-0.02364, 28],
      [-0.02635, 30],
      [-0.02464, 31],
      [-0.02635, 32],
      [-0.02452, 34],
      [-0.02394, 36],
      [-0.02617, 38],
      [-0.02488, 39],
      [-0.02523, 40],
      [-0.02511, 41]
    ],
    "red_o_points": [],
    "y_categories": [
      "P16554",
      "P18297",
      "P19283",
      "P19287",
      "P23391",
      "P30595",
      "P31645",
      "P31691",
      "P34778",
      "P35046",
      "P36328",
      "P43633",
      "P4544",
      "P46417",
      "P48965",
      "P53068",
      "P5497",
      "P59529",
      "P62483",
      "P64658",
      "P65202",
      "P66816",
      "P6751",
      "P7408",
      "P75566",
      "P76226",
      "P79971",
      "P82621",
      "P82990",
      "P84549",
      "P84932",
      "P85825",
      "P86989",
      "P8770",
      "P87791",
      "P90550",
      "P93159",
      "P94969",
      "P96710",
      "P97130",
      "P9744",
      "P98500",
      "nan"
    ],
    "blue_o_points": [],
    "blue_x_points": [
      [0.05222, 0],
      [0.04983, 14],
      [0.05307, 16],
      [0.05335, 19],
      [0.05011, 23],
      [0.05265, 25],
      [0.05011, 29],
      [0.05279, 33],
      [0.05095, 35],
      [0.0535, 37]
    ]
  },
  "QS_mulNeuromadSite[T2]": {
    "red_x_points": [
      [-0.00017, 2],
      [-0.00115, 0],
      [-0.00137, 0],
      [-0.00169, 0],
      [-0.00012, 2],
      [-0.00163, 0],
      [-0.00127, 0],
      [-0.00178, 0],
      [-0.00034, 2],
      [-0.00216, 0],
      [-0.00188, 0],
      [-0.00142, 0],
      [-0.00031, 2],
      [0.00156, 1],
      [-0.00016, 2],
      [-0.00142, 0],
      [-0.00023, 2],
      [-0.00142, 0],
      [-0.00078, 2],
      [-0.00035, 2],
      [-6e-5, 2],
      [-0.00022, 2],
      [-0.00125, 0],
      [-0.0002, 2],
      [-0.00031, 2],
      [-0.00016, 2],
      [-0.00162, 0],
      [-0.00112, 0],
      [0.00183, 1],
      [8e-5, 2],
      [-0.00106, 0],
      [-0.00023, 2]
    ],
    "red_o_points": [],
    "y_categories": ["N", "NOT APPLICABLE", "nan"],
    "blue_o_points": [],
    "blue_x_points": [
      [0.0041, 1],
      [0.00036, 2],
      [0.00343, 1],
      [0.00028, 0],
      [-0.00033, 0],
      [0.0034, 1],
      [-2e-5, 2],
      [0.00347, 1],
      [-6e-5, 2],
      [0.00032, 2]
    ]
  },
  "QA_mulInjOrthesisType[ArmSling]": {
    "red_x_points": [
      [-0.00668, 2],
      [-0.00632, 2],
      [-0.00666, 2],
      [-0.00619, 2],
      [-0.00618, 2],
      [-0.00636, 2],
      [-0.00612, 2],
      [-0.00635, 2],
      [-0.00633, 2],
      [-0.00764, 2],
      [-0.00656, 2],
      [-0.00707, 2],
      [-0.00664, 2],
      [0.01092, 1],
      [-0.00851, 2],
      [-0.00687, 2],
      [-0.00745, 2],
      [-0.01164, 0],
      [0.0135, 1],
      [-0.00641, 2],
      [-0.00608, 2],
      [-0.0187, 0],
      [-0.00227, 3],
      [-0.0085, 2],
      [0.00706, 1],
      [-0.00691, 2],
      [-0.00654, 2],
      [-0.00558, 2],
      [-0.01123, 3],
      [-0.00032, 3],
      [-0.00592, 2],
      [-0.0072, 2]
    ],
    "red_o_points": [],
    "y_categories": ["N", "NOT APPLICABLE", "Y", "nan"],
    "blue_o_points": [],
    "blue_x_points": [
      [0.00266, 2],
      [0.02086, 1],
      [0.01623, 1],
      [0.03378, 1],
      [-0.00426, 2],
      [0.015, 1],
      [-0.00321, 2],
      [0.01384, 1],
      [-0.00185, 2],
      [0.01396, 3]
    ]
  },
  "QS_mulGraftNerve[Ul]": {
    "red_x_points": [
      [-6e-5, 2],
      [-0.00012, 0],
      [-3e-5, 0],
      [-8e-5, 0],
      [-3e-5, 2],
      [-0.00018, 0],
      [-0.00018, 0],
      [-0.00014, 0],
      [-2e-5, 2],
      [-6e-5, 0],
      [-0.00024, 0],
      [-0.0002, 0],
      [-6e-5, 2],
      [0.00016, 1],
      [-3e-5, 2],
      [-8e-5, 0],
      [-0.0001, 2],
      [-0.00015, 0],
      [-3e-5, 2],
      [-6e-5, 2],
      [-6e-5, 2],
      [0.0, 2],
      [-8e-5, 0],
      [-3e-5, 2],
      [-4e-5, 2],
      [-2e-5, 2],
      [-0.00021, 0],
      [-0.00014, 0],
      [0.00011, 1],
      [-8e-5, 2],
      [-6e-5, 0],
      [-3e-5, 2]
    ],
    "red_o_points": [],
    "y_categories": ["N", "NOT APPLICABLE", "nan"],
    "blue_o_points": [],
    "blue_x_points": [
      [0.00029, 1],
      [1e-5, 2],
      [0.0003, 1],
      [0.00014, 0],
      [-9e-5, 0],
      [0.00046, 1],
      [-2e-5, 2],
      [0.00026, 1],
      [-2e-5, 2],
      [2e-5, 2]
    ]
  },
  "QA_mulInjOrthesisType[ShoulderSupport]": {
    "red_x_points": [
      [-0.00673, 0],
      [-0.0066, 0],
      [-0.00666, 0],
      [-0.0065, 0],
      [-0.0069, 0],
      [-0.00653, 0],
      [-0.00648, 0],
      [-0.00671, 0],
      [-0.02052, 2],
      [-0.00657, 0],
      [-0.00653, 0],
      [-0.00632, 0],
      [-0.00627, 0],
      [0.01392, 1],
      [-0.00823, 0],
      [-0.00698, 0],
      [-0.00746, 0],
      [-0.01183, 2],
      [0.01397, 1],
      [-0.00551, 0],
      [-0.0063, 0],
      [-0.01825, 2],
      [-0.00255, 3],
      [-0.00803, 0],
      [0.011, 1],
      [-0.00724, 0],
      [-0.00662, 0],
      [-0.00574, 0],
      [-0.00909, 3],
      [-0.00165, 3],
      [-0.00633, 0],
      [-0.00767, 0]
    ],
    "red_o_points": [],
    "y_categories": ["N", "NOT APPLICABLE", "Y", "nan"],
    "blue_o_points": [],
    "blue_x_points": [
      [0.00134, 0],
      [0.02253, 1],
      [0.01513, 1],
      [0.03247, 1],
      [-0.00372, 0],
      [0.01718, 1],
      [-0.00171, 0],
      [0.01624, 1],
      [-0.00187, 0],
      [0.01305, 3]
    ]
  },
  "QA_yonInjUnconscio": {
    "red_x_points": [
      [-0.00603, 1],
      [-0.0068, 1],
      [-0.00411, 2],
      [-0.00349, 2],
      [-0.00482, 2],
      [0.01733, 0],
      [-0.00768, 1],
      [-0.00421, 2],
      [-0.00546, 2],
      [-0.00504, 2],
      [-0.00472, 2],
      [-0.01129, 1],
      [-0.00745, 1],
      [-0.01839, 1],
      [-0.00674, 2],
      [-0.00411, 2],
      [-0.00504, 2],
      [-0.00729, 1],
      [0.00491, 0],
      [-0.00853, 1],
      [-0.00626, 1],
      [-0.00825, 1],
      [-0.00579, 1],
      [-0.00668, 2],
      [-0.00827, 1],
      [-0.00563, 2],
      [-0.00857, 1],
      [-0.0066, 1],
      [-0.00209, 2],
      [-0.00456, 2],
      [-0.00846, 1],
      [-0.00569, 2]
    ],
    "red_o_points": [],
    "y_categories": ["N", "Y", "nan"],
    "blue_o_points": [],
    "blue_x_points": [
      [0.00011, 2],
      [0.0095, 1],
      [0.01742, 0],
      [0.02795, 0],
      [0.02574, 0],
      [0.00066, 2],
      [-0.00223, 1],
      [0.0007, 2],
      [0.03229, 0],
      [-0.00051, 2]
    ]
  },
  "QS_mulTransfSite[Other]": {
    "red_x_points": [
      [-0.00191, 3],
      [-0.01466, 0],
      [-0.01425, 0],
      [-0.01421, 0],
      [-0.00224, 3],
      [-0.01529, 0],
      [-0.01511, 0],
      [-0.01398, 0],
      [-0.00256, 3],
      [-0.01431, 0],
      [-0.01606, 0],
      [-0.01544, 0],
      [-0.00224, 3],
      [0.02133, 1],
      [-0.0025, 3],
      [-0.01459, 0],
      [-0.00226, 3],
      [-0.01435, 0],
      [-0.00244, 3],
      [-0.0024, 3],
      [-0.00208, 3],
      [-0.00231, 3],
      [-0.01342, 0],
      [-0.00194, 3],
      [-0.00275, 3],
      [-0.00216, 3],
      [-0.01404, 0],
      [-0.01468, 0],
      [0.02105, 1],
      [-0.00202, 3],
      [-0.01384, 0],
      [-0.00224, 3]
    ],
    "red_o_points": [],
    "y_categories": ["N", "NOT APPLICABLE", "Y", "nan"],
    "blue_o_points": [],
    "blue_x_points": [
      [0.02428, 1],
      [-0.00074, 3],
      [0.01996, 1],
      [-0.00568, 0],
      [0.04785, 2],
      [0.02079, 1],
      [-0.00086, 3],
      [0.02346, 1],
      [-0.00086, 3],
      [-0.00059, 3]
    ]
  },
  "QA_lstInjTpbiSide": {
    "red_x_points": [
      [-0.00463, 1],
      [0.00103, 0],
      [-0.00036, 0],
      [0.00027, 0],
      [-0.00107, 0],
      [-0.00258, 1],
      [-0.00159, 0],
      [-0.0009, 0],
      [-0.00348, 1],
      [-0.00089, 0],
      [-0.00203, 1],
      [-0.00129, 1],
      [-0.00421, 1],
      [-0.01345, 0],
      [-0.00891, 1],
      [-0.0026, 1],
      [0.0007, 0],
      [-0.00257, 1],
      [-0.01, 1],
      [0.00011, 0],
      [3e-5, 0],
      [-0.00126, 0],
      [-0.00026, 0],
      [0.00355, 0],
      [-0.00766, 1],
      [-0.00697, 1],
      [-0.00192, 1],
      [-0.00077, 1],
      [-0.01386, 0],
      [-0.0062, 1],
      [-0.00126, 0],
      [0.0032, 0]
    ],
    "red_o_points": [],
    "y_categories": ["L", "R", "nan"],
    "blue_o_points": [],
    "blue_x_points": [
      [-0.003, 0],
      [0.00887, 0],
      [0.00787, 1],
      [0.00531, 0],
      [0.00283, 1],
      [0.00802, 1],
      [0.00437, 1],
      [0.00795, 1],
      [0.00674, 0],
      [0.00761, 0]
    ]
  },
  "QA_lstPexArthre[Shoulder]": {
    "red_x_points": [
      [-0.00093, 2],
      [-0.00161, 3],
      [-0.00248, 3],
      [-0.00275, 0],
      [-0.00362, 3],
      [-0.00471, 2],
      [-0.00162, 2],
      [0.00117, 1],
      [-0.00716, 3],
      [-0.00241, 2],
      [-0.00226, 2],
      [-0.00402, 2],
      [-0.0016, 2],
      [-0.0005, 3],
      [-0.00252, 3],
      [-0.00115, 2],
      [-0.00357, 3],
      [-0.00148, 3],
      [-0.0022, 3],
      [-0.00249, 2],
      [-7e-5, 1],
      [-0.00263, 2],
      [-0.00176, 3],
      [-0.00191, 3],
      [-0.00176, 2],
      [-0.00523, 3],
      [-0.00411, 3],
      [-0.00275, 3],
      [-0.00072, 3],
      [-0.00303, 3],
      [0.00046, 1],
      [-0.00306, 3]
    ],
    "red_o_points": [],
    "y_categories": ["NAIA", "NPV", "PV", "nan"],
    "blue_o_points": [],
    "blue_x_points": [
      [7e-5, 2],
      [-0.00088, 3],
      [-0.00024, 2],
      [0.00258, 2],
      [0.02021, 1],
      [-2e-5, 2],
      [0.02037, 1],
      [-0.0001, 3],
      [0.00219, 2],
      [0.00084, 2]
    ]
  },
  "QA_lstPexPain[C5]": {
    "red_x_points": [
      [-0.00231, 1],
      [-0.00416, 2],
      [-0.00473, 2],
      [-0.00429, 2],
      [-0.00208, 1],
      [-0.00088, 1],
      [-0.00092, 1],
      [-0.00104, 1],
      [-0.00266, 1],
      [-0.00137, 1],
      [-0.00116, 1],
      [-0.00105, 1],
      [-0.00208, 1],
      [-0.01608, 2],
      [-0.00631, 2],
      [-0.00438, 2],
      [-0.00595, 2],
      [-0.00434, 2],
      [-0.00593, 2],
      [-0.00241, 1],
      [-0.00205, 1],
      [-0.00214, 1],
      [-0.0057, 2],
      [-0.00623, 2],
      [-0.00232, 1],
      [-0.00751, 2],
      [-0.00429, 2],
      [-0.00414, 2],
      [-0.00484, 1],
      [-0.00369, 1],
      [-0.00065, 1],
      [-0.00264, 1]
    ],
    "red_o_points": [],
    "y_categories": ["NORM", "NPV", "nan"],
    "blue_o_points": [],
    "blue_x_points": [
      [0.02313, 0],
      [-0.0035, 2],
      [0.00025, 1],
      [-0.00029, 1],
      [-0.00057, 1],
      [0.00018, 1],
      [-0.00115, 1],
      [0.01962, 0],
      [-0.00114, 1],
      [0.03877, 0]
    ]
  },
  "QS_mulBpsurgeryType[Lysis]": {
    "red_x_points": [
      [-0.00179, 3],
      [-0.00554, 0],
      [-0.01286, 2],
      [-0.00606, 0],
      [-0.00191, 3],
      [-0.00536, 0],
      [-0.01353, 2],
      [-0.00487, 0],
      [-0.00256, 3],
      [-0.00558, 0],
      [-0.00544, 0],
      [-0.00399, 0],
      [-0.00235, 3],
      [0.01284, 1],
      [-0.00182, 3],
      [-0.00628, 0],
      [-0.002, 3],
      [-0.01114, 2],
      [-0.00267, 3],
      [-0.00259, 3],
      [-0.00158, 3],
      [-0.00191, 3],
      [-0.00485, 0],
      [-0.00194, 3],
      [-0.0026, 3],
      [-0.00205, 3],
      [-0.00492, 0],
      [-0.00496, 0],
      [0.01315, 1],
      [-0.00143, 3],
      [-0.01285, 2],
      [-0.00206, 3]
    ],
    "red_o_points": [],
    "y_categories": ["N", "NOT APPLICABLE", "Y", "nan"],
    "blue_o_points": [],
    "blue_x_points": [
      [0.0183, 1],
      [0.0002, 3],
      [0.01585, 1],
      [0.00128, 0],
      [-0.00014, 0],
      [0.01684, 1],
      [-0.00083, 3],
      [0.01681, 1],
      [-0.00073, 3],
      [-0.00048, 3]
    ]
  },
  "QS_mulLysisSite[Trunk]": {
    "red_x_points": [
      [-0.00119, 3],
      [-0.00321, 0],
      [-0.00302, 0],
      [-0.00331, 0],
      [-0.00106, 3],
      [-0.00369, 0],
      [-0.0092, 2],
      [-0.0033, 0],
      [-0.00164, 3],
      [-0.00319, 0],
      [-0.00344, 0],
      [-0.00323, 0],
      [-0.00154, 3],
      [0.00856, 1],
      [-0.00116, 3],
      [-0.00352, 0],
      [-0.00161, 3],
      [-0.00778, 2],
      [-0.00128, 3],
      [-0.00157, 3],
      [-0.00104, 3],
      [-0.00103, 3],
      [-0.00322, 0],
      [-0.00107, 3],
      [-0.00154, 3],
      [-0.00119, 3],
      [-0.00341, 0],
      [-0.00329, 0],
      [0.00837, 1],
      [-0.00102, 3],
      [-0.00765, 2],
      [-0.00133, 3]
    ],
    "red_o_points": [],
    "y_categories": ["N", "NOT APPLICABLE", "Y", "nan"],
    "blue_o_points": [],
    "blue_x_points": [
      [0.0121, 1],
      [-0.00015, 3],
      [0.01037, 1],
      [0.0006, 0],
      [-0.00049, 0],
      [0.00996, 1],
      [-0.00065, 3],
      [0.00974, 1],
      [-0.00047, 3],
      [-0.00044, 3]
    ]
  },
  "QS_mulGraftTrunk[UpperTrunk]": {
    "red_x_points": [
      [-0.00025, 3],
      [-0.00142, 0],
      [-0.00136, 0],
      [-0.00145, 0],
      [-0.00027, 3],
      [-0.00143, 0],
      [-0.00136, 0],
      [-0.00134, 0],
      [-0.00035, 3],
      [-0.00148, 0],
      [-0.00148, 0],
      [-0.00129, 0],
      [-0.00027, 3],
      [0.00269, 1],
      [-0.00042, 3],
      [-0.00445, 2],
      [-0.00041, 3],
      [-0.00128, 0],
      [-0.00045, 3],
      [-0.00023, 3],
      [-0.00017, 3],
      [-0.00033, 3],
      [-0.00126, 0],
      [-0.00039, 3],
      [-0.00052, 3],
      [-0.00038, 3],
      [-0.00145, 0],
      [-0.00115, 0],
      [0.00257, 1],
      [-0.0002, 3],
      [-0.00143, 0],
      [-0.00031, 3]
    ],
    "red_o_points": [],
    "y_categories": ["N", "NOT APPLICABLE", "Y", "nan"],
    "blue_o_points": [],
    "blue_x_points": [
      [0.0051, 1],
      [-6e-5, 3],
      [0.00302, 1],
      [0.00082, 0],
      [-0.00105, 0],
      [0.00369, 1],
      [-0.00012, 3],
      [0.0038, 1],
      [-0.00014, 3],
      [-4e-5, 3]
    ]
  },
  "QS_mulTransfSite[PhMc]": {
    "red_x_points": [
      [-0.00088, 3],
      [-0.00301, 0],
      [-0.00267, 0],
      [-0.00267, 0],
      [-0.00068, 3],
      [-0.00344, 0],
      [-0.00288, 0],
      [-0.00716, 2],
      [-0.00062, 3],
      [-0.00291, 0],
      [-0.00307, 0],
      [-0.00318, 0],
      [-0.00093, 3],
      [0.00523, 1],
      [-0.0007, 3],
      [-0.00298, 0],
      [-0.00122, 3],
      [-0.0025, 0],
      [-0.00094, 3],
      [-0.00097, 3],
      [-0.00052, 3],
      [-0.00073, 3],
      [-0.00503, 2],
      [-0.00101, 3],
      [-0.0014, 3],
      [-0.00065, 3],
      [-0.00271, 0],
      [-0.00238, 0],
      [0.00615, 1],
      [-0.00055, 3],
      [-0.0024, 0],
      [-0.0009, 3]
    ],
    "red_o_points": [],
    "y_categories": ["N", "NOT APPLICABLE", "Y", "nan"],
    "blue_o_points": [],
    "blue_x_points": [
      [0.01002, 1],
      [-0.00027, 3],
      [0.00713, 1],
      [0.00017, 0],
      [-0.00104, 0],
      [0.00699, 1],
      [-0.00041, 3],
      [0.00883, 1],
      [-4e-5, 3],
      [0.0, 3]
    ]
  },
  "QA_mulInjTbpiCause[Motorcycle]": {
    "red_x_points": [
      [-0.00302, 0],
      [-0.00053, 1],
      [-0.00064, 1],
      [-0.00054, 1],
      [-5e-5, 1],
      [-0.0005, 1],
      [-0.00024, 1],
      [-0.00063, 1],
      [0.00084, 1],
      [-0.00052, 1],
      [-0.00049, 1],
      [-6e-5, 1],
      [-0.00693, 0],
      [-0.03803, 1],
      [-0.00028, 1],
      [-0.0006, 1],
      [-0.00041, 1],
      [-0.00043, 1],
      [-0.00136, 1],
      [-0.01231, 0],
      [0.00019, 1],
      [0.00215, 1],
      [-0.00031, 1],
      [-0.00036, 1],
      [-0.00135, 1],
      [-0.00728, 0],
      [-0.0003, 1],
      [-0.00034, 1],
      [-0.03474, 1],
      [-0.0002, 1],
      [-0.00019, 1],
      [-0.00048, 1]
    ],
    "red_o_points": [],
    "y_categories": ["N", "Y", "nan"],
    "blue_o_points": [],
    "blue_x_points": [
      [0.01759, 0],
      [-0.00059, 1],
      [0.01329, 0],
      [-0.00114, 1],
      [1e-5, 1],
      [0.01586, 0],
      [0.00375, 1],
      [0.01489, 0],
      [0.00528, 1],
      [0.00368, 1]
    ]
  },
  "QS_mulLysisSite[Root]": {
    "red_x_points": [
      [-0.00028, 3],
      [-0.00137, 0],
      [-0.0051, 2],
      [-0.00116, 0],
      [-0.00032, 3],
      [-0.00141, 0],
      [-0.0011, 0],
      [-0.00126, 0],
      [-0.00048, 3],
      [-0.00119, 0],
      [-0.00132, 0],
      [-0.00086, 0],
      [-0.00035, 3],
      [0.00294, 1],
      [-0.00056, 3],
      [-0.00132, 0],
      [-0.00028, 3],
      [-0.00084, 0],
      [-0.00025, 3],
      [-0.00052, 3],
      [-0.00041, 3],
      [-0.00022, 3],
      [-0.00123, 0],
      [-0.00043, 3],
      [-0.00031, 3],
      [-0.00023, 3],
      [-0.00107, 0],
      [-0.00128, 0],
      [0.00287, 1],
      [-0.00032, 3],
      [-0.00514, 2],
      [-0.00042, 3]
    ],
    "red_o_points": [],
    "y_categories": ["N", "NOT APPLICABLE", "Y", "nan"],
    "blue_o_points": [],
    "blue_x_points": [
      [0.00453, 1],
      [-0.00011, 3],
      [0.0032, 1],
      [0.00045, 0],
      [3e-5, 0],
      [0.00369, 1],
      [-0.00024, 3],
      [0.00433, 1],
      [-0.00029, 3],
      [-0.00016, 3]
    ]
  },
  "QA_lstPexMuscstrength[ThumbOppo]": {
    "red_x_points": [
      [-0.00654, 1],
      [0.0007, 2],
      [-0.00492, 1],
      [-0.004, 1],
      [-0.00768, 1],
      [0.00129, 0],
      [0.00122, 0],
      [-0.00536, 1],
      [0.00077, 0],
      [0.00135, 0],
      [0.00122, 0],
      [0.00122, 0],
      [0.00145, 0],
      [0.00041, 2],
      [0.00104, 2],
      [0.00052, 2],
      [0.00085, 0],
      [0.00052, 2],
      [0.00097, 2],
      [0.00082, 0],
      [-0.00777, 1],
      [0.00074, 0],
      [-0.00443, 1],
      [0.00111, 2],
      [0.00147, 2],
      [0.00129, 2],
      [0.00131, 0],
      [-0.00418, 1],
      [0.00075, 2],
      [-0.00822, 1],
      [-0.00537, 1],
      [0.0014, 2]
    ],
    "red_o_points": [],
    "y_categories": ["GREATER THAN OR EQUALS TO 3", "LESS THAN 3", "nan"],
    "blue_o_points": [],
    "blue_x_points": [
      [0.0006, 2],
      [0.00176, 2],
      [0.00158, 0],
      [0.00239, 2],
      [0.00366, 0],
      [0.00117, 0],
      [0.00513, 0],
      [0.00146, 0],
      [0.00295, 2],
      [0.00247, 2]
    ]
  },
  "QS_mulGraftLevel[Trunk]": {
    "red_x_points": [
      [-0.00027, 3],
      [-0.00076, 0],
      [-0.00063, 0],
      [-0.00087, 0],
      [-0.00021, 3],
      [-0.00104, 0],
      [-0.00071, 0],
      [-0.00071, 0],
      [-0.00037, 3],
      [-0.00109, 0],
      [-0.0009, 0],
      [-0.00079, 0],
      [-0.00025, 3],
      [0.00144, 1],
      [-0.00025, 3],
      [-0.0032, 2],
      [-0.00042, 3],
      [-0.00061, 0],
      [-0.00016, 3],
      [-0.00029, 3],
      [-0.00021, 3],
      [-0.00017, 3],
      [-0.0007, 0],
      [-0.00027, 3],
      [-0.00014, 3],
      [-0.0002, 3],
      [-0.00072, 0],
      [-0.00067, 0],
      [0.00194, 1],
      [-0.0001, 3],
      [-0.00059, 0],
      [-0.00022, 3]
    ],
    "red_o_points": [],
    "y_categories": ["N", "NOT APPLICABLE", "Y", "nan"],
    "blue_o_points": [],
    "blue_x_points": [
      [0.00291, 1],
      [-0.00011, 3],
      [0.00184, 1],
      [0.00042, 0],
      [-0.00056, 0],
      [0.002, 1],
      [-6e-5, 3],
      [0.00184, 1],
      [-7e-5, 3],
      [-3e-5, 3]
    ]
  },
  "QS_mulGraftNerve[FI]": {
    "red_x_points": [
      [-3e-5, 2],
      [-0.00033, 0],
      [-0.00036, 0],
      [-0.00027, 0],
      [-0.00011, 2],
      [-0.00036, 0],
      [-0.00033, 0],
      [-0.00045, 0],
      [-0.00012, 2],
      [-0.00036, 0],
      [-0.00036, 0],
      [-0.00031, 0],
      [-0.00016, 2],
      [0.00054, 1],
      [-8e-5, 2],
      [-0.00032, 0],
      [-0.00011, 2],
      [-0.00025, 0],
      [-0.0003, 2],
      [-0.00015, 2],
      [4e-5, 2],
      [-0.00018, 2],
      [-0.00029, 0],
      [-0.00013, 2],
      [-2e-5, 2],
      [-9e-5, 2],
      [-0.00037, 0],
      [-0.00025, 0],
      [0.00044, 1],
      [-5e-5, 2],
      [-0.00025, 0],
      [-0.00013, 2]
    ],
    "red_o_points": [],
    "y_categories": ["N", "NOT APPLICABLE", "nan"],
    "blue_o_points": [],
    "blue_x_points": [
      [0.00137, 1],
      [-0.00011, 2],
      [0.00083, 1],
      [2e-5, 0],
      [-0.00013, 0],
      [0.00073, 1],
      [-2e-5, 2],
      [0.00093, 1],
      [-0.0, 2],
      [-7e-5, 2]
    ]
  },
  "QS_mulGraftNerve[other]": {
    "red_x_points": [
      [-1e-5, 2],
      [-0.0003, 0],
      [-0.0003, 0],
      [-0.0003, 0],
      [-4e-5, 2],
      [-0.00042, 0],
      [-0.0003, 0],
      [-0.00026, 0],
      [2e-5, 2],
      [-0.00041, 0],
      [-0.00048, 0],
      [-0.00043, 0],
      [-4e-5, 2],
      [0.00041, 1],
      [-4e-5, 2],
      [-0.00026, 0],
      [1e-5, 2],
      [-0.00024, 0],
      [-0.00028, 2],
      [1e-5, 2],
      [-3e-5, 2],
      [-4e-5, 2],
      [-0.00014, 0],
      [-4e-5, 2],
      [-1e-5, 2],
      [-1e-5, 2],
      [-0.0003, 0],
      [-0.00042, 0],
      [0.00046, 1],
      [-1e-5, 2],
      [-0.00031, 0],
      [-3e-5, 2]
    ],
    "red_o_points": [],
    "y_categories": ["N", "NOT APPLICABLE", "nan"],
    "blue_o_points": [],
    "blue_x_points": [
      [0.00101, 1],
      [-1e-5, 2],
      [0.00039, 1],
      [0.00017, 0],
      [-5e-5, 0],
      [0.00052, 1],
      [3e-5, 2],
      [0.00056, 1],
      [1e-5, 2],
      [-1e-5, 2]
    ]
  },
  "QS_mulTransfSite[AcSsAA]": {
    "red_x_points": [
      [-0.00211, 3],
      [-0.01631, 2],
      [-0.00442, 0],
      [-0.01555, 2],
      [-0.00217, 3],
      [-0.01997, 2],
      [-0.00365, 0],
      [-0.00327, 0],
      [-0.00226, 3],
      [-0.00416, 0],
      [-0.01752, 2],
      [-0.00388, 0],
      [-0.00243, 3],
      [0.01841, 1],
      [-0.00201, 3],
      [-0.01656, 2],
      [-0.00243, 3],
      [-0.00451, 0],
      [-0.00299, 3],
      [-0.00232, 3],
      [-0.00207, 3],
      [-0.00182, 3],
      [-0.01554, 2],
      [-0.00233, 3],
      [-0.00325, 3],
      [-0.00191, 3],
      [-0.00374, 0],
      [-0.01525, 2],
      [0.01838, 1],
      [-0.00181, 3],
      [-0.0039, 0],
      [-0.00198, 3]
    ],
    "red_o_points": [],
    "y_categories": ["N", "NOT APPLICABLE", "Y", "nan"],
    "blue_o_points": [],
    "blue_x_points": [
      [0.02404, 1],
      [-0.00026, 3],
      [0.02149, 1],
      [0.00178, 0],
      [0.00166, 0],
      [0.02042, 1],
      [-0.00089, 3],
      [0.01954, 1],
      [-0.00077, 3],
      [-0.00044, 3]
    ]
  },
  "QS_mulGraftNerve[Ax]": {
    "red_x_points": [
      [0.0, 2],
      [-6e-5, 0],
      [-6e-5, 0],
      [0.0, 2],
      [-4e-5, 0],
      [-4e-5, 0],
      [-6e-5, 0],
      [-0.0, 2],
      [-4e-5, 0],
      [-4e-5, 0],
      [-4e-5, 0],
      [0.0, 2],
      [7e-5, 1],
      [-0.0, 2],
      [-0.0001, 0],
      [0.0, 2],
      [-4e-5, 0],
      [0.0, 2],
      [0.0, 2],
      [-4e-5, 0],
      [-1e-5, 2],
      [-0.00013, 2],
      [-0.0, 2],
      [-4e-5, 0],
      [-4e-5, 0],
      [7e-5, 1],
      [-1e-5, 2],
      [-4e-5, 0],
      [-0.0, 2]
    ],
    "red_o_points": [],
    "y_categories": ["N", "NOT APPLICABLE", "nan"],
    "blue_o_points": [],
    "blue_x_points": [
      [7e-5, 1],
      [0.0, 2],
      [7e-5, 1],
      [2e-5, 0],
      [7e-5, 1],
      [0.00022, 1],
      [0.0, 2],
      [-0.0, 2]
    ]
  },
  "QS_mulNeuromadSite[C5]": {
    "red_x_points": [
      [-0.00013, 2],
      [-0.00068, 0],
      [-0.00037, 0],
      [-0.00043, 0],
      [-0.00021, 2],
      [-0.00056, 0],
      [-0.00043, 0],
      [-0.00063, 0],
      [-0.00017, 2],
      [-0.0006, 0],
      [-0.00065, 0],
      [-0.00025, 0],
      [-5e-5, 2],
      [0.00043, 1],
      [-0.00011, 2],
      [-0.00048, 0],
      [-0.00022, 2],
      [-0.00039, 0],
      [-9e-5, 2],
      [-9e-5, 2],
      [-6e-5, 2],
      [-0.00011, 2],
      [-0.00042, 0],
      [-0.00023, 2],
      [-5e-5, 2],
      [-0.00011, 2],
      [-0.00051, 0],
      [-0.00026, 0],
      [0.0007, 1],
      [-0.00012, 2],
      [-0.00035, 0],
      [-0.00026, 2]
    ],
    "red_o_points": [],
    "y_categories": ["N", "NOT APPLICABLE", "nan"],
    "blue_o_points": [],
    "blue_x_points": [
      [0.00136, 1],
      [0.00014, 2],
      [0.00085, 1],
      [0.00016, 0],
      [-7e-5, 0],
      [0.00107, 1],
      [2e-5, 2],
      [0.00103, 1],
      [2e-5, 2],
      [0.00018, 2]
    ]
  },
  "QS_mulNeuromadSite[C7]": {
    "red_x_points": [
      [-0.00019, 2],
      [-0.00086, 0],
      [-0.00053, 0],
      [-0.00086, 0],
      [-0.00017, 2],
      [-0.00083, 0],
      [-0.00076, 0],
      [-0.00076, 0],
      [-0.00026, 2],
      [-0.00082, 0],
      [-0.00096, 0],
      [-0.00054, 0],
      [-0.00018, 2],
      [0.00137, 1],
      [-9e-5, 2],
      [-0.00097, 0],
      [-0.00024, 2],
      [-0.00062, 0],
      [-0.00013, 2],
      [-0.00022, 2],
      [-0.0001, 2],
      [-0.00021, 2],
      [-0.00065, 0],
      [-0.0001, 2],
      [-0.00012, 2],
      [-7e-5, 2],
      [-0.00081, 0],
      [-0.00087, 0],
      [0.00068, 1],
      [-7e-5, 2],
      [-0.00092, 0],
      [-0.00026, 2]
    ],
    "red_o_points": [],
    "y_categories": ["N", "NOT APPLICABLE", "nan"],
    "blue_o_points": [],
    "blue_x_points": [
      [0.00199, 1],
      [2e-5, 2],
      [0.00194, 1],
      [-0.00012, 0],
      [-0.00018, 0],
      [0.00263, 1],
      [-7e-5, 2],
      [0.00186, 1],
      [5e-5, 2],
      [5e-5, 2]
    ]
  },
  "QA_lstPexMuscstrength[WristExte]": {
    "red_x_points": [
      [0.00083, 1],
      [-0.00124, 2],
      [-0.00367, 1],
      [-0.0018, 1],
      [0.00082, 1],
      [0.0008, 0],
      [-0.00346, 1],
      [-0.00561, 1],
      [-0.01146, 0],
      [0.00217, 0],
      [0.00033, 0],
      [-0.00568, 1],
      [-0.00799, 0],
      [-0.00099, 2],
      [-0.00024, 2],
      [-0.00178, 2],
      [-0.00453, 0],
      [-0.00254, 2],
      [-0.0004, 2],
      [-0.01265, 0],
      [0.00141, 1],
      [-0.01359, 0],
      [-0.00211, 1],
      [-0.00029, 2],
      [-0.00906, 0],
      [0.00237, 1],
      [0.00234, 0],
      [0.00127, 0],
      [-0.0012, 2],
      [0.00093, 1],
      [-0.00354, 1],
      [-0.00069, 2]
    ],
    "red_o_points": [],
    "y_categories": ["GREATER THAN OR EQUALS TO 3", "LESS THAN 3", "nan"],
    "blue_o_points": [],
    "blue_x_points": [
      [0.00083, 0],
      [0.00113, 2],
      [0.00048, 0],
      [0.00812, 0],
      [0.00606, 0],
      [0.00056, 1],
      [0.01132, 1],
      [0.00048, 0],
      [0.01282, 1],
      [0.00949, 2]
    ]
  },
  "QS_mulGraftNerve[TD]": {
    "red_x_points": [
      [-1e-5, 0],
      [-1e-5, 0],
      [-1e-5, 0],
      [-1e-5, 2],
      [-3e-5, 0],
      [-3e-5, 0],
      [-1e-5, 2],
      [-0.00013, 0],
      [-0.00013, 0],
      [-3e-5, 0],
      [-3e-5, 0],
      [-1e-5, 2],
      [-1e-5, 2],
      [-6e-5, 2],
      [-6e-5, 2],
      [-1e-5, 0],
      [-1e-5, 2],
      [-6e-5, 2],
      [2e-5, 2],
      [-1e-5, 0],
      [9e-5, 1],
      [-1e-5, 2],
      [-3e-5, 0],
      [-1e-5, 2]
    ],
    "red_o_points": [],
    "y_categories": ["N", "NOT APPLICABLE", "nan"],
    "blue_o_points": [],
    "blue_x_points": [
      [0.00014, 1],
      [-3e-5, 0],
      [0.00014, 1],
      [0.00019, 1],
      [3e-5, 2]
    ]
  },
  "QS_mulGraftNerve[SS]": {
    "red_x_points": [
      [-0.00021, 0],
      [-7e-5, 0],
      [-1e-5, 2],
      [-7e-5, 0],
      [-1e-5, 2],
      [-1e-5, 2],
      [-1e-5, 2]
    ],
    "red_o_points": [],
    "y_categories": ["N", "NOT APPLICABLE", "nan"],
    "blue_o_points": [],
    "blue_x_points": [[0.00013, 1], [-1e-5, 2], [0.00019, 1]]
  },
  "QS_mulLysisSite[Nerve]": {
    "red_x_points": [
      [-0.00018, 3],
      [-0.00062, 0],
      [-0.00308, 2],
      [-0.00054, 0],
      [-8e-5, 3],
      [-0.00039, 0],
      [-0.00047, 0],
      [-0.00049, 0],
      [-0.00024, 3],
      [-0.00057, 0],
      [-0.00068, 0],
      [-0.00057, 0],
      [-0.00021, 3],
      [0.00109, 1],
      [-0.00035, 3],
      [-0.00044, 0],
      [-0.00013, 3],
      [-0.00043, 0],
      [-0.00015, 3],
      [-8e-5, 3],
      [-0.00015, 3],
      [-0.00019, 3],
      [-0.00046, 0],
      [-0.00017, 3],
      [-0.0001, 3],
      [-0.00019, 3],
      [-0.00055, 0],
      [-0.00053, 0],
      [0.00154, 1],
      [-0.00017, 3],
      [-0.00057, 0],
      [-0.0001, 3]
    ],
    "red_o_points": [],
    "y_categories": ["N", "NOT APPLICABLE", "Y", "nan"],
    "blue_o_points": [],
    "blue_x_points": [
      [0.00229, 1],
      [-0.00013, 3],
      [0.00136, 1],
      [0.0003, 0],
      [0.00028, 0],
      [0.00148, 1],
      [-9e-5, 3],
      [0.00126, 1],
      [-9e-5, 3],
      [7e-5, 3]
    ]
  },
  "QS_mulTransfSite[IMc]": {
    "red_x_points": [
      [-0.00122, 3],
      [-0.01048, 2],
      [-0.00329, 0],
      [-0.0039, 0],
      [-0.00124, 3],
      [-0.00396, 0],
      [-0.00338, 0],
      [-0.00392, 0],
      [-0.00139, 3],
      [-0.00369, 0],
      [-0.00403, 0],
      [-0.00328, 0],
      [-0.00118, 3],
      [0.00929, 1],
      [-0.00155, 3],
      [-0.00325, 0],
      [-0.00129, 3],
      [-0.01015, 2],
      [-0.00196, 3],
      [-0.00122, 3],
      [-0.00116, 3],
      [-0.00148, 3],
      [-0.00339, 0],
      [-0.00117, 3],
      [-0.00176, 3],
      [-0.00119, 3],
      [-0.00387, 0],
      [-0.00929, 2],
      [0.00986, 1],
      [-0.00088, 3],
      [-0.01012, 2],
      [-0.00135, 3]
    ],
    "red_o_points": [],
    "y_categories": ["N", "NOT APPLICABLE", "Y", "nan"],
    "blue_o_points": [],
    "blue_x_points": [
      [0.01625, 1],
      [-0.00016, 3],
      [0.01169, 1],
      [0.00148, 0],
      [-0.0016, 0],
      [0.01149, 1],
      [-0.00046, 3],
      [0.01139, 1],
      [-0.0005, 3],
      [-0.00035, 3]
    ]
  },
  "QS_mulLysisRoot[C7]": {
    "red_x_points": [
      [-0.00011, 3],
      [-0.00105, 0],
      [-0.00328, 2],
      [-0.00078, 0],
      [-0.00014, 3],
      [-0.00097, 0],
      [-0.0009, 0],
      [-0.00088, 0],
      [-0.00021, 3],
      [-0.0009, 0],
      [-0.00089, 0],
      [-0.00083, 0],
      [-0.00018, 3],
      [0.00155, 1],
      [-0.00018, 3],
      [-0.00079, 0],
      [-0.00018, 3],
      [-0.00076, 0],
      [-0.00025, 3],
      [-0.00017, 3],
      [-0.00015, 3],
      [-0.00014, 3],
      [-0.00094, 0],
      [-0.00024, 3],
      [-8e-5, 3],
      [-0.00016, 3],
      [-0.00089, 0],
      [-0.00087, 0],
      [0.00208, 1],
      [-0.00021, 3],
      [-0.00083, 0],
      [-0.00014, 3]
    ],
    "red_o_points": [],
    "y_categories": ["N", "NOT APPLICABLE", "Y", "nan"],
    "blue_o_points": [],
    "blue_x_points": [
      [0.00339, 1],
      [-0.00018, 3],
      [0.00221, 1],
      [0.00014, 0],
      [-0.00027, 0],
      [0.00204, 1],
      [-1e-5, 3],
      [0.00198, 1],
      [-5e-5, 3],
      [-6e-5, 3]
    ]
  },
  "QS_lstBpsurgSide": {
    "red_x_points": [
      [-0.00115, 3],
      [-0.00583, 0],
      [-0.00645, 0],
      [-0.00638, 0],
      [-0.00125, 3],
      [-0.00631, 2],
      [-0.00775, 0],
      [-0.00765, 0],
      [-0.00166, 3],
      [-0.00863, 0],
      [-0.0066, 2],
      [-0.0068, 2],
      [-0.00176, 3],
      [0.00945, 1],
      [-0.00111, 3],
      [-0.00736, 2],
      [-0.00211, 3],
      [-0.00746, 2],
      [-0.00165, 3],
      [-0.00157, 3],
      [-0.00126, 3],
      [-0.00123, 3],
      [-0.00599, 0],
      [-0.00139, 3],
      [-0.00148, 3],
      [-0.00124, 3],
      [-0.00627, 2],
      [-0.00506, 2],
      [0.01041, 1],
      [-0.00123, 3],
      [-0.00668, 0],
      [-0.00159, 3]
    ],
    "red_o_points": [],
    "y_categories": ["L", "NOT APPLICABLE", "R", "nan"],
    "blue_o_points": [],
    "blue_x_points": [
      [0.01608, 1],
      [0.0001, 3],
      [0.01312, 1],
      [0.00424, 0],
      [0.00086, 2],
      [0.0145, 1],
      [-0.00021, 3],
      [0.01367, 1],
      [-0.00025, 3],
      [-0.00032, 3]
    ]
  },
  "QA_lstPexPain[T1]": {
    "red_x_points": [
      [-0.00784, 1],
      [-0.00224, 2],
      [-0.00309, 2],
      [-0.00229, 2],
      [-0.00804, 1],
      [-0.00608, 0],
      [0.001, 1],
      [0.00217, 1],
      [0.00683, 0],
      [0.00241, 1],
      [-0.00338, 0],
      [-0.00615, 0],
      [0.00671, 0],
      [-0.01207, 2],
      [-0.00505, 2],
      [-0.00343, 2],
      [-0.00364, 2],
      [-0.00218, 2],
      [-0.00497, 2],
      [0.00515, 0],
      [-0.01051, 1],
      [0.00594, 0],
      [-0.00374, 2],
      [-0.00523, 2],
      [-0.00972, 1],
      [-0.00517, 2],
      [-0.00414, 2],
      [-0.0028, 2],
      [-0.00585, 1],
      [-0.01273, 1],
      [0.00042, 1],
      [-0.01093, 1]
    ],
    "red_o_points": [],
    "y_categories": ["NORM", "NPV", "nan"],
    "blue_o_points": [],
    "blue_x_points": [
      [0.00032, 1],
      [-0.00037, 2],
      [0.00576, 0],
      [0.00786, 1],
      [0.01162, 1],
      [-2e-5, 1],
      [0.01093, 0],
      [0.00553, 0],
      [0.01331, 0],
      [0.01568, 0]
    ]
  },
  "QS_mulTransfSite[AcMc]": {
    "red_x_points": [
      [-0.00042, 3],
      [-0.00056, 0],
      [-0.00035, 0],
      [-0.00055, 0],
      [-0.00036, 3],
      [-0.00049, 0],
      [-0.00073, 0],
      [-0.00055, 0],
      [-0.0007, 3],
      [-0.00073, 0],
      [-0.00077, 0],
      [-0.00644, 2],
      [-0.00047, 3],
      [0.00206, 1],
      [-0.00034, 3],
      [-0.00055, 0],
      [-0.00036, 3],
      [-0.00059, 0],
      [-0.00025, 3],
      [-0.00067, 3],
      [-0.00025, 3],
      [-0.00058, 3],
      [-0.00066, 0],
      [-0.00039, 3],
      [-0.00035, 3],
      [-0.0003, 3],
      [-0.00065, 0],
      [-0.00075, 0],
      [0.00131, 1],
      [-0.00024, 3],
      [-0.00041, 0],
      [-0.00028, 3]
    ],
    "red_o_points": [],
    "y_categories": ["N", "NOT APPLICABLE", "Y", "nan"],
    "blue_o_points": [],
    "blue_x_points": [
      [0.0028, 1],
      [-0.00022, 3],
      [0.0026, 1],
      [0.00054, 0],
      [0.00045, 0],
      [0.00265, 1],
      [-0.00022, 3],
      [0.0031, 1],
      [-0.00035, 3],
      [-0.0001, 3]
    ]
  },
  "QA_lstPexKine[Shoulder]": {
    "red_x_points": [
      [-0.00186, 1],
      [-0.00253, 2],
      [-0.00298, 2],
      [-0.00213, 2],
      [-0.00479, 2],
      [-0.00436, 1],
      [-0.00242, 1],
      [0.00344, 0],
      [-0.00632, 2],
      [-0.00263, 1],
      [-0.00263, 1],
      [-0.00449, 1],
      [-0.00298, 1],
      [-0.00115, 2],
      [-0.00424, 2],
      [-0.00134, 1],
      [-0.00446, 2],
      [-0.0022, 2],
      [-0.00387, 2],
      [-0.00353, 1],
      [-0.00207, 1],
      [-0.00363, 1],
      [-0.00174, 2],
      [-0.0037, 2],
      [-0.00246, 1],
      [-0.00649, 2],
      [-0.00406, 2],
      [-0.00266, 2],
      [-0.00101, 2],
      [-0.00425, 2],
      [-0.00167, 1],
      [-0.0044, 2]
    ],
    "red_o_points": [],
    "y_categories": ["NPV", "PV", "nan"],
    "blue_o_points": [],
    "blue_x_points": [
      [-6e-5, 1],
      [-0.00219, 2],
      [-0.00041, 1],
      [0.001, 1],
      [0.02409, 0],
      [-0.00028, 1],
      [0.03789, 0],
      [-0.00036, 2],
      [-0.00038, 1],
      [4e-5, 1]
    ]
  },
  "QA_yonInjBpsurg": {
    "red_x_points": [
      [-0.0023, 1],
      [-0.00164, 1],
      [-0.00157, 1],
      [-0.00161, 1],
      [-0.00203, 1],
      [-0.00192, 1],
      [-0.00211, 1],
      [-0.00192, 1],
      [-0.00263, 1],
      [-0.00229, 1],
      [-0.00164, 1],
      [-0.00193, 1],
      [-0.00213, 1],
      [0.00545, 0],
      [-0.0019, 1],
      [-0.00165, 1],
      [-0.00243, 1],
      [-0.00176, 1],
      [-0.00213, 1],
      [-0.0024, 1],
      [-0.0021, 1],
      [-0.00211, 1],
      [-0.0014, 1],
      [-0.00205, 1],
      [-0.00236, 1],
      [-0.00207, 1],
      [-0.00174, 1],
      [-0.00181, 1],
      [0.00348, 0],
      [-0.00176, 1],
      [-0.00163, 1],
      [-0.00185, 1]
    ],
    "red_o_points": [],
    "y_categories": ["N", "Y", "nan"],
    "blue_o_points": [],
    "blue_x_points": [
      [0.00955, 0],
      [-0.00058, 1],
      [0.00914, 0],
      [-0.00166, 1],
      [-0.00211, 1],
      [0.00838, 0],
      [-0.00124, 1],
      [0.00925, 0],
      [-0.00099, 1],
      [-0.00058, 1]
    ]
  },
  "QA_lstPexTouch[C8]": {
    "red_x_points": [
      [-0.00775, 1],
      [-0.00315, 2],
      [-0.0033, 1],
      [-0.00289, 2],
      [-0.00769, 1],
      [0.00281, 0],
      [-0.00355, 1],
      [-0.00378, 1],
      [0.00588, 0],
      [-0.00405, 1],
      [0.00347, 0],
      [0.00334, 0],
      [-0.00791, 1],
      [-0.01328, 2],
      [-0.0038, 2],
      [-0.00317, 2],
      [-0.00787, 1],
      [-0.00237, 2],
      [-0.00432, 2],
      [0.0064, 0],
      [-0.00821, 1],
      [0.00481, 0],
      [-0.00308, 2],
      [-0.00374, 2],
      [0.00401, 0],
      [0.00648, 0],
      [-0.00327, 1],
      [-0.00261, 2],
      [-0.00689, 1],
      [-0.00411, 2],
      [-0.00336, 1],
      [-0.00914, 1]
    ],
    "red_o_points": [],
    "y_categories": ["NORM", "NPV", "nan"],
    "blue_o_points": [],
    "blue_x_points": [
      [0.00985, 0],
      [-0.00108, 2],
      [0.00082, 1],
      [0.00194, 1],
      [0.00723, 0],
      [0.00024, 1],
      [0.00898, 0],
      [0.00498, 0],
      [0.00891, 0],
      [0.01123, 0]
    ]
  },
  "QA_lstPexMuscstrength[FingersAbdu]": {
    "red_x_points": [
      [0.00032, 2],
      [0.00027, 2],
      [-0.00491, 1],
      [-0.00258, 1],
      [-0.0005, 1],
      [0.00172, 0],
      [0.00104, 0],
      [-0.00389, 1],
      [-0.00759, 0],
      [0.00191, 0],
      [0.00028, 2],
      [-0.00702, 1],
      [-0.00451, 0],
      [0.00022, 2],
      [0.00065, 2],
      [9e-5, 2],
      [-0.00337, 0],
      [0.0002, 2],
      [0.00064, 2],
      [-0.00663, 0],
      [-0.00085, 1],
      [-0.00824, 0],
      [-0.00232, 1],
      [0.00065, 2],
      [0.00059, 2],
      [0.00076, 2],
      [-0.0048, 1],
      [-0.00264, 1],
      [0.00019, 2],
      [-0.00049, 1],
      [-0.00378, 1],
      [0.0005, 2]
    ],
    "red_o_points": [],
    "y_categories": ["GREATER THAN OR EQUALS TO 3", "LESS THAN 3", "nan"],
    "blue_o_points": [],
    "blue_x_points": [
      [0.00021, 2],
      [0.00088, 2],
      [0.00093, 0],
      [0.00324, 2],
      [0.00776, 0],
      [0.00066, 0],
      [0.01246, 1],
      [0.00102, 0],
      [0.0032, 2],
      [0.00277, 2]
    ]
  },
  "QS_mulBpsurgeryType[Graft]": {
    "red_x_points": [
      [-0.00017, 3],
      [-0.00058, 0],
      [-0.00039, 0],
      [-0.00054, 0],
      [-0.00015, 3],
      [-0.00058, 0],
      [-0.00066, 0],
      [-0.00053, 0],
      [-0.00021, 3],
      [-0.00058, 0],
      [-0.00042, 0],
      [-0.00058, 0],
      [-0.00018, 3],
      [0.00109, 1],
      [-0.00012, 3],
      [-0.00237, 2],
      [-0.00024, 3],
      [-0.00045, 0],
      [-0.00015, 3],
      [-0.00019, 3],
      [-0.00015, 3],
      [-0.00015, 3],
      [-0.00053, 0],
      [-0.00018, 3],
      [-0.0002, 3],
      [-0.00024, 3],
      [-0.00063, 0],
      [-0.0006, 0],
      [0.00135, 1],
      [-0.00021, 3],
      [-0.00054, 0],
      [-0.00018, 3]
    ],
    "red_o_points": [],
    "y_categories": ["N", "NOT APPLICABLE", "Y", "nan"],
    "blue_o_points": [],
    "blue_x_points": [
      [0.00188, 1],
      [-0.00011, 3],
      [0.00145, 1],
      [0.00043, 0],
      [-0.00054, 0],
      [0.00215, 1],
      [-7e-5, 3],
      [0.00125, 1],
      [-4e-5, 3],
      [-1e-5, 3]
    ]
  },
  "QS_mulLysisRoot[C5]": {
    "red_x_points": [
      [-0.00058, 3],
      [-0.00243, 0],
      [-0.00748, 2],
      [-0.00251, 0],
      [-0.0007, 3],
      [-0.0031, 0],
      [-0.00221, 0],
      [-0.00241, 0],
      [-0.00104, 3],
      [-0.00256, 0],
      [-0.00264, 0],
      [-0.00218, 0],
      [-0.00097, 3],
      [0.00538, 1],
      [-0.00121, 3],
      [-0.00283, 0],
      [-0.00055, 3],
      [-0.00226, 0],
      [-0.00072, 3],
      [-0.00129, 3],
      [-0.00062, 3],
      [-0.00064, 3],
      [-0.00195, 0],
      [-0.00112, 3],
      [-0.00082, 3],
      [-0.0006, 3],
      [-0.00249, 0],
      [-0.00211, 0],
      [0.00502, 1],
      [-0.00063, 3],
      [-0.00725, 2],
      [-0.0007, 3]
    ],
    "red_o_points": [],
    "y_categories": ["N", "NOT APPLICABLE", "Y", "nan"],
    "blue_o_points": [],
    "blue_x_points": [
      [0.00908, 1],
      [-0.0001, 3],
      [0.00607, 1],
      [0.00059, 0],
      [0.0003, 0],
      [0.00676, 1],
      [-0.00012, 3],
      [0.00786, 1],
      [-0.00041, 3],
      [0.00011, 3]
    ]
  },
  "QS_mulNeuromadSite[C6]": {
    "red_x_points": [
      [-0.00017, 2],
      [-0.00041, 0],
      [-0.00063, 0],
      [-0.0006, 0],
      [-0.00012, 2],
      [-0.00074, 0],
      [-0.00059, 0],
      [-0.00063, 0],
      [-0.00024, 2],
      [-0.00056, 0],
      [-0.00079, 0],
      [-0.00068, 0],
      [-0.00015, 2],
      [0.00063, 1],
      [-0.0001, 2],
      [-0.00045, 0],
      [-0.00017, 2],
      [-0.00033, 0],
      [-0.00044, 2],
      [-0.00014, 2],
      [-5e-5, 2],
      [-0.00018, 2],
      [-0.00042, 0],
      [-0.00016, 2],
      [-0.00026, 2],
      [-0.00019, 2],
      [-0.00058, 0],
      [-0.00044, 0],
      [0.00061, 1],
      [-0.00011, 2],
      [-0.0005, 0],
      [-0.00016, 2]
    ],
    "red_o_points": [],
    "y_categories": ["N", "NOT APPLICABLE", "nan"],
    "blue_o_points": [],
    "blue_x_points": [
      [0.00201, 1],
      [-0.00012, 2],
      [0.00123, 1],
      [0.00026, 0],
      [-0.00014, 0],
      [0.00136, 1],
      [-0.00011, 2],
      [0.00186, 1],
      [-8e-5, 2],
      [-0.0001, 2]
    ]
  },
  "QS_mulNeuromadSite[T1]": {
    "red_x_points": [
      [-0.0001, 2],
      [-0.00147, 0],
      [-0.00103, 0],
      [-0.0012, 0],
      [-0.00022, 2],
      [-0.00127, 0],
      [-0.00111, 0],
      [-0.0011, 0],
      [-0.00035, 2],
      [-0.00145, 0],
      [-0.00112, 0],
      [-0.00109, 0],
      [-0.00019, 2],
      [0.00153, 1],
      [-0.00029, 2],
      [-0.00128, 0],
      [-0.00021, 2],
      [-0.0011, 0],
      [-0.0004, 2],
      [-0.00029, 2],
      [-0.00015, 2],
      [-0.00023, 2],
      [-0.00103, 0],
      [-0.00026, 2],
      [-0.0002, 2],
      [-0.00019, 2],
      [-0.00117, 0],
      [-0.00107, 0],
      [0.00179, 1],
      [-0.00015, 2],
      [-0.00106, 0],
      [-0.00033, 2]
    ],
    "red_o_points": [],
    "y_categories": ["N", "NOT APPLICABLE", "nan"],
    "blue_o_points": [],
    "blue_x_points": [
      [0.00312, 1],
      [0.00011, 2],
      [0.00213, 1],
      [0.00025, 0],
      [-0.00032, 0],
      [0.00286, 1],
      [-8e-5, 2],
      [0.00237, 1],
      [-8e-5, 2],
      [-0.00011, 2]
    ]
  },
  "QA_lstPexTouch[C7]": {
    "red_x_points": [
      [-0.00777, 1],
      [-0.00184, 2],
      [-0.00245, 1],
      [-0.00207, 2],
      [-0.00754, 1],
      [0.00181, 0],
      [-0.00279, 1],
      [-0.00265, 1],
      [0.00554, 0],
      [-0.0029, 1],
      [0.00229, 0],
      [-0.00386, 1],
      [-0.00927, 1],
      [-0.0066, 2],
      [-0.00469, 2],
      [-0.00192, 2],
      [-0.00818, 1],
      [-0.00188, 2],
      [-0.00488, 2],
      [0.0065, 0],
      [-0.00923, 1],
      [0.00536, 0],
      [-0.00245, 2],
      [-0.00445, 2],
      [0.00278, 0],
      [0.00619, 0],
      [-0.00195, 1],
      [-0.00222, 2],
      [-0.00251, 1],
      [-0.00401, 2],
      [-0.00247, 1],
      [-0.00803, 1]
    ],
    "red_o_points": [],
    "y_categories": ["NORM", "NPV", "nan"],
    "blue_o_points": [],
    "blue_x_points": [
      [-5e-5, 1],
      [-0.00056, 2],
      [0.00105, 1],
      [0.00205, 1],
      [0.01045, 0],
      [0.00087, 1],
      [0.00999, 0],
      [0.00346, 0],
      [0.00976, 0],
      [0.00996, 0]
    ]
  },
  "QA_lstPexMuscstrength[ShoulderAbduc]": {
    "red_x_points": [
      [-0.00345, 1],
      [-0.00247, 1],
      [-0.00285, 1],
      [-0.00305, 1],
      [-0.00318, 1],
      [-0.0035, 1],
      [-0.00316, 1],
      [-0.00318, 1],
      [-0.0035, 1],
      [-0.0032, 1],
      [-0.00303, 1],
      [-0.00318, 1],
      [-0.00331, 1],
      [0.00095, 2],
      [0.00129, 2],
      [0.00126, 2],
      [0.00091, 2],
      [0.00095, 2],
      [0.00074, 2],
      [-0.00336, 1],
      [-0.00346, 1],
      [-0.00321, 1],
      [-0.00286, 1],
      [0.00099, 2],
      [-0.00367, 1],
      [-0.00283, 1],
      [-0.00275, 1],
      [-0.00281, 1],
      [0.00122, 2],
      [-0.00336, 1],
      [-0.00292, 1],
      [0.00095, 2]
    ],
    "red_o_points": [],
    "y_categories": ["GREATER THAN OR EQUALS TO 3", "LESS THAN 3", "nan"],
    "blue_o_points": [],
    "blue_x_points": [
      [0.00117, 2],
      [0.00143, 2],
      [0.0186, 0],
      [0.00198, 2],
      [-0.00248, 1],
      [0.01709, 0],
      [0.00183, 2],
      [-0.00141, 1],
      [-0.00217, 1],
      [-0.00189, 1]
    ]
  },
  "QS_mulGraftNerve[LT]": {
    "red_x_points": [
      [-2e-5, 2],
      [-6e-5, 0],
      [-2e-5, 2],
      [-6e-5, 0],
      [-6e-5, 0],
      [-6e-5, 0],
      [-2e-5, 2],
      [-6e-5, 0],
      [-6e-5, 0],
      [-6e-5, 0],
      [-2e-5, 2],
      [0.0001, 1],
      [-2e-5, 2],
      [-2e-5, 2],
      [-6e-5, 0],
      [-2e-5, 2],
      [-2e-5, 2],
      [-2e-5, 2],
      [-6e-5, 0],
      [-6e-5, 0],
      [0.0001, 1],
      [-2e-5, 2],
      [-6e-5, 0],
      [-2e-5, 2]
    ],
    "red_o_points": [],
    "y_categories": ["N", "NOT APPLICABLE", "nan"],
    "blue_o_points": [],
    "blue_x_points": [
      [0.0001, 1],
      [-2e-5, 2],
      [0.0001, 1],
      [0.0001, 1],
      [0.0001, 1],
      [-2e-5, 2]
    ]
  },
  "QA_lstPexTouch[T1]": {
    "red_x_points": [
      [-0.01024, 1],
      [-0.00224, 2],
      [0.00113, 1],
      [-0.00192, 2],
      [-0.01147, 1],
      [-0.0074, 0],
      [0.00171, 1],
      [0.00125, 1],
      [-0.01299, 1],
      [-0.00599, 0],
      [-0.0036, 0],
      [-0.00802, 0],
      [0.00878, 0],
      [-0.00766, 2],
      [-0.00426, 2],
      [-0.0027, 2],
      [-0.01081, 1],
      [-0.00187, 2],
      [-0.00479, 2],
      [0.00759, 0],
      [-0.01234, 1],
      [0.00903, 0],
      [-0.0022, 2],
      [-0.00489, 2],
      [-0.01207, 1],
      [0.00902, 0],
      [0.00272, 1],
      [-0.00214, 2],
      [-0.00233, 1],
      [-0.00528, 2],
      [0.00043, 1],
      [-0.01213, 1]
    ],
    "red_o_points": [],
    "y_categories": ["NORM", "NPV", "nan"],
    "blue_o_points": [],
    "blue_x_points": [
      [0.0004, 1],
      [0.00125, 2],
      [0.00065, 1],
      [0.00778, 1],
      [0.01022, 1],
      [0.00027, 1],
      [0.01299, 0],
      [0.00521, 0],
      [0.01288, 0],
      [0.01443, 0]
    ]
  },
  "QA_equInjTbpiTime": {
    "red_x_points": [
      [-0.00184, 0],
      [-0.00312, 0],
      [0.00703, 3],
      [-0.00368, 0],
      [-0.00429, 1],
      [-0.00832, 0],
      [-0.00658, 1],
      [-0.00483, 0],
      [-0.00058, 3],
      [-0.00708, 0],
      [-0.00585, 0],
      [0.01053, 3],
      [-0.00244, 0],
      [-0.03998, 2],
      [-0.00058, 3],
      [-0.0042, 0],
      [-0.00057, 0],
      [-0.00227, 0],
      [-0.01595, 1],
      [0.00122, 3],
      [-0.00278, 0],
      [-0.00721, 1],
      [-0.00761, 2],
      [0.00031, 3],
      [-0.01385, 1],
      [-0.01468, 2],
      [-0.00677, 0],
      [-0.0075, 2],
      [0.00102, 0],
      [-0.00095, 0],
      [0.00658, 3],
      [-0.0081, 1]
    ],
    "red_o_points": [],
    "y_categories": [
      "0 TO 6 MONTHS",
      "13 TO 24 MONTHS",
      "25 MONTHS OR MORE",
      "7 TO 12 MONTHS",
      "nan"
    ],
    "blue_o_points": [],
    "blue_x_points": [
      [0.00406, 0],
      [0.0117, 0],
      [0.0041, 0],
      [0.01893, 3],
      [0.01732, 3],
      [0.0048, 0],
      [0.00567, 1],
      [0.01231, 3],
      [0.01016, 3],
      [0.00907, 0]
    ]
  },
  "QS_mulNeuromadSite[C4]": {
    "red_x_points": [
      [-0.00017, 2],
      [-0.00109, 0],
      [-0.00092, 0],
      [-0.00114, 0],
      [-0.00013, 2],
      [-0.00116, 0],
      [-0.00093, 0],
      [-0.00121, 0],
      [-0.00029, 2],
      [-0.0016, 0],
      [-0.00124, 0],
      [-0.00112, 0],
      [-0.00037, 2],
      [0.00119, 1],
      [-0.00022, 2],
      [-0.00131, 0],
      [-0.00048, 2],
      [-0.00111, 0],
      [-0.00042, 2],
      [-0.00029, 2],
      [-6e-5, 2],
      [-0.00039, 2],
      [-0.00103, 0],
      [-0.0002, 2],
      [-0.0008, 2],
      [-0.00019, 2],
      [-0.00152, 0],
      [-0.00103, 0],
      [0.00144, 1],
      [-0.00018, 2],
      [-0.00118, 0],
      [-0.00042, 2]
    ],
    "red_o_points": [],
    "y_categories": ["N", "NOT APPLICABLE", "nan"],
    "blue_o_points": [],
    "blue_x_points": [
      [0.00338, 1],
      [0.00025, 2],
      [0.00267, 1],
      [0.00059, 0],
      [-0.00037, 0],
      [0.00296, 1],
      [-3e-5, 2],
      [0.0031, 1],
      [-8e-5, 2],
      [2e-5, 2]
    ]
  },
  "QS_mulLysisNerve[Ssr]": {
    "red_x_points": [
      [-0.00026, 3],
      [-0.00066, 0],
      [-0.00299, 2],
      [-0.00073, 0],
      [-7e-5, 3],
      [-0.00091, 0],
      [-0.00059, 0],
      [-0.00053, 0],
      [-0.00021, 3],
      [-0.0008, 0],
      [-0.00069, 0],
      [-0.00076, 0],
      [-0.00022, 3],
      [0.00164, 1],
      [-0.00022, 3],
      [-0.00074, 0],
      [-0.00019, 3],
      [-0.00068, 0],
      [-3e-5, 3],
      [-0.00036, 3],
      [-0.00013, 3],
      [-0.00011, 3],
      [-0.00057, 0],
      [-0.00028, 3],
      [-2e-5, 3],
      [-9e-5, 3],
      [-0.00056, 0],
      [-0.00075, 0],
      [0.00119, 1],
      [-0.00013, 3],
      [-0.00064, 0],
      [-0.00014, 3]
    ],
    "red_o_points": [],
    "y_categories": ["N", "NOT APPLICABLE", "Y", "nan"],
    "blue_o_points": [],
    "blue_x_points": [
      [0.00197, 1],
      [-8e-5, 3],
      [0.00132, 1],
      [0.0, 0],
      [-0.00021, 0],
      [0.00199, 1],
      [-5e-5, 3],
      [0.00247, 1],
      [3e-5, 3],
      [-6e-5, 3]
    ]
  },
  "QS_mulTransfSite[Oberlin]": {
    "red_x_points": [
      [-0.00235, 3],
      [-0.01734, 0],
      [-0.01804, 0],
      [-0.01674, 0],
      [-0.00233, 3],
      [-0.00413, 2],
      [-0.00325, 2],
      [-0.01774, 0],
      [-0.00286, 3],
      [-0.00346, 2],
      [-0.00408, 2],
      [-0.00383, 2],
      [-0.00257, 3],
      [0.02183, 1],
      [-0.00234, 3],
      [-0.00325, 2],
      [-0.00232, 3],
      [-0.0172, 0],
      [-0.00333, 3],
      [-0.00299, 3],
      [-0.00271, 3],
      [-0.00239, 3],
      [-0.01741, 0],
      [-0.00227, 3],
      [-0.00257, 3],
      [-0.00265, 3],
      [-0.00365, 2],
      [-0.01808, 0],
      [0.01858, 1],
      [-0.00212, 3],
      [-0.0179, 0],
      [-0.00223, 3]
    ],
    "red_o_points": [],
    "y_categories": ["N", "NOT APPLICABLE", "Y", "nan"],
    "blue_o_points": [],
    "blue_x_points": [
      [0.02671, 1],
      [-0.00087, 3],
      [0.02261, 1],
      [0.00315, 2],
      [0.00196, 2],
      [0.02256, 1],
      [-0.00099, 3],
      [0.0242, 1],
      [-0.00073, 3],
      [0.00012, 3]
    ]
  },
  "QA_lstPexMuscstrength[ElbowFlex]": {
    "red_x_points": [
      [-0.00347, 1],
      [-0.00234, 2],
      [-0.0041, 1],
      [-0.0034, 1],
      [-0.00327, 1],
      [0.00889, 0],
      [-0.00403, 1],
      [-0.00421, 1],
      [-0.00367, 1],
      [-0.00434, 1],
      [-0.00387, 1],
      [-0.0049, 1],
      [-0.00396, 1],
      [-0.00232, 2],
      [-0.00256, 2],
      [-0.00291, 2],
      [-0.00401, 1],
      [-0.0031, 2],
      [-0.00307, 2],
      [-0.00398, 1],
      [-0.00342, 1],
      [-0.00337, 1],
      [-0.00323, 1],
      [-0.00349, 2],
      [0.00289, 0],
      [-0.00172, 1],
      [-0.00407, 1],
      [-0.0038, 1],
      [-0.00269, 2],
      [-0.00298, 1],
      [-0.00425, 1],
      [-0.00244, 2]
    ],
    "red_o_points": [],
    "y_categories": ["GREATER THAN OR EQUALS TO 3", "LESS THAN 3", "nan"],
    "blue_o_points": [],
    "blue_x_points": [
      [-0.00057, 2],
      [-0.00047, 2],
      [0.0109, 0],
      [-0.00127, 1],
      [0.02348, 0],
      [0.01218, 0],
      [-0.00143, 1],
      [0.01199, 0],
      [0.00029, 1],
      [-0.00036, 1]
    ]
  },
  "QA_lstPexKine[Index]": {
    "red_x_points": [
      [-0.00182, 0],
      [-0.00069, 2],
      [-0.00203, 2],
      [-0.00073, 2],
      [-0.00356, 2],
      [0.00025, 1],
      [0.00076, 1],
      [-0.00313, 0],
      [-0.00585, 2],
      [0.00103, 1],
      [0.00039, 1],
      [0.00056, 1],
      [-0.00042, 1],
      [-0.00036, 2],
      [-0.002, 2],
      [0.00048, 1],
      [-0.0026, 2],
      [-0.00107, 2],
      [-0.0018, 2],
      [-0.00111, 1],
      [-0.00203, 0],
      [-0.00169, 1],
      [-0.00055, 2],
      [-0.00196, 2],
      [-0.00049, 1],
      [-0.00431, 2],
      [-0.00139, 2],
      [-0.00045, 2],
      [-0.00072, 2],
      [-0.0021, 2],
      [-0.00279, 0],
      [-0.00262, 2]
    ],
    "red_o_points": [],
    "y_categories": ["NPV", "PV", "nan"],
    "blue_o_points": [],
    "blue_x_points": [
      [0.00044, 1],
      [-0.00061, 2],
      [0.00029, 1],
      [0.00407, 1],
      [0.00211, 1],
      [0.00057, 1],
      [0.01401, 0],
      [-0.00012, 2],
      [0.00442, 1],
      [0.00384, 1]
    ]
  },
  "QA_lstPexPalle[Clavicle]": {
    "red_x_points": [
      [-0.00359, 3],
      [-0.00128, 3],
      [-0.00162, 3],
      [-0.00146, 3],
      [-0.00365, 3],
      [-0.0097, 2],
      [-0.00652, 2],
      [-0.00159, 3],
      [-0.00442, 3],
      [-0.00272, 3],
      [-0.00644, 2],
      [-0.00927, 2],
      [-0.00992, 0],
      [7e-5, 3],
      [-0.00354, 3],
      [-0.00142, 3],
      [-0.00336, 3],
      [-0.00092, 3],
      [-0.00296, 3],
      [-0.01187, 0],
      [-0.00767, 0],
      [-0.00272, 2],
      [0.00099, 1],
      [-0.00327, 3],
      [-0.00555, 2],
      [-0.00372, 3],
      [-0.00228, 3],
      [-0.0017, 3],
      [-0.02158, 2],
      [-0.00257, 3],
      [0.00083, 0],
      [-0.00345, 3]
    ],
    "red_o_points": [],
    "y_categories": ["HYPO", "NAIA", "PT", "nan"],
    "blue_o_points": [],
    "blue_x_points": [
      [0.00204, 3],
      [-0.0015, 3],
      [0.01005, 0],
      [3e-5, 3],
      [0.02142, 0],
      [0.00214, 3],
      [0.0424, 1],
      [0.00116, 3],
      [0.0096, 2],
      [-0.001, 3]
    ]
  }
}
