{
  "QA_lstPexMuscstrength[ElbowFlex]": {
    "red_x_points": [
      [-0.00987, 1],
      [0.00038, 2],
      [-0.0096, 1],
      [-0.00909, 1],
      [-0.01, 1],
      [-0.0099, 1],
      [-0.0094, 1],
      [-0.00954, 1],
      [-0.00952, 1],
      [-0.01027, 1],
      [-0.01037, 1],
      [-0.00981, 1],
      [-0.00038, 2],
      [-0.00104, 2],
      [0.0016, 2],
      [-0.00972, 1],
      [-0.00981, 1],
      [-0.01022, 1],
      [-0.00971, 1],
      [-0.00964, 1],
      [-0.00017, 2],
      [-0.00947, 1],
      [-0.00974, 1],
      [-0.00977, 1],
      [-0.009, 1],
      [0.00113, 2],
      [-0.00874, 1],
      [-0.00975, 1],
      [0.00029, 2]
    ],
    "red_o_points": [],
    "y_categories": ["GREATER THAN OR EQUALS TO 3", "LESS THAN 3", "nan"],
    "blue_o_points": [],
    "blue_x_points": [
      [0.00169, 2],
      [-0.00836, 1],
      [0.04755, 0],
      [-0.00901, 1],
      [0.0031, 2],
      [0.00264, 2],
      [0.03627, 0],
      [-0.00864, 1],
      [-0.00909, 1],
      [0.00226, 2],
      [0.04566, 0],
      [0.03628, 0],
      [0.0422, 0],
      [0.03781, 0],
      [-0.00922, 1]
    ]
  },
  "QS_mulGraftNerve[other]": {
    "red_x_points": [
      [-6e-5, 2],
      [-0.00055, 0],
      [-0.00042, 0],
      [-0.00024, 0],
      [-0.0004, 0],
      [-0.00026, 0],
      [-0.00036, 0],
      [-4e-5, 2],
      [-0.00055, 0],
      [-0.00034, 0],
      [-1e-5, 2],
      [-0.00032, 0],
      [-4e-5, 2],
      [-0.00035, 0],
      [-0.00056, 0],
      [-2e-5, 2],
      [3e-5, 2],
      [-0.00012, 2],
      [-0.00029, 0],
      [-7e-5, 2],
      [-4e-5, 2],
      [-6e-5, 2],
      [-0.0004, 0],
      [-0.00041, 0],
      [-0.00015, 2],
      [0.00084, 1],
      [-3e-5, 2],
      [-0.00029, 0],
      [1e-5, 2]
    ],
    "red_o_points": [],
    "y_categories": ["N", "NOT APPLICABLE", "nan"],
    "blue_o_points": [],
    "blue_x_points": [
      [0.00194, 1],
      [-4e-5, 2],
      [-0.00024, 0],
      [-0.00021, 0],
      [0.0001, 2],
      [0.00107, 1],
      [0.00065, 1],
      [-7e-5, 0],
      [2e-5, 2],
      [0.00017, 2],
      [-0.00017, 0],
      [0.00123, 1],
      [2e-5, 2],
      [0.00102, 1],
      [-1e-5, 2]
    ]
  },
  "QS_mulGraftRoot[C6]": {
    "red_x_points": [
      [-5e-5, 0],
      [-5e-5, 0],
      [-5e-5, 0],
      [2e-5, 2],
      [-5e-5, 0],
      [2e-5, 2],
      [2e-5, 2],
      [-5e-5, 0],
      [-5e-5, 0],
      [2e-5, 2]
    ],
    "red_o_points": [],
    "y_categories": ["N", "NOT APPLICABLE", "nan"],
    "blue_o_points": [],
    "blue_x_points": [[0.00015, 1], [2e-5, 2], [2e-5, 2]]
  },
  "QS_mulBpsurgeryType[Transf]": {
    "red_x_points": [
      [-0.00013, 3],
      [-0.00109, 2],
      [-0.0035, 0],
      [-0.00072, 2],
      [-0.00104, 2],
      [-0.00069, 2],
      [-0.00089, 2],
      [-0.00019, 3],
      [-0.00101, 2],
      [-0.00081, 2],
      [-0.00016, 3],
      [-0.00087, 2],
      [-0.00029, 3],
      [-0.00119, 2],
      [-0.00095, 2],
      [-7e-5, 3],
      [-0.00014, 3],
      [-0.00011, 3],
      [-0.00065, 2],
      [-0.00022, 3],
      [-0.00023, 3],
      [-0.00017, 3],
      [-0.00094, 2],
      [-0.00082, 2],
      [-0.00021, 3],
      [0.00261, 1],
      [-0.00026, 3],
      [-0.00069, 2],
      [-0.00011, 3]
    ],
    "red_o_points": [],
    "y_categories": ["N", "NOT APPLICABLE", "Y", "nan"],
    "blue_o_points": [],
    "blue_x_points": [
      [0.00554, 1],
      [-1e-5, 3],
      [-0.00062, 2],
      [-0.00055, 2],
      [-3e-5, 3],
      [0.00287, 1],
      [0.00287, 1],
      [-0.00067, 2],
      [-7e-5, 3],
      [-3e-5, 3],
      [-0.00054, 2],
      [0.0037, 1],
      [-0.00012, 3],
      [0.0033, 1],
      [-0.0001, 3]
    ]
  },
  "QS_mulGraftTrunk[MiddleTrunk]": {
    "red_x_points": [
      [-8e-5, 0],
      [2e-5, 2],
      [-8e-5, 0],
      [-8e-5, 0],
      [5e-5, 1],
      [2e-5, 2]
    ],
    "red_o_points": [],
    "y_categories": ["N", "NOT APPLICABLE", "nan"],
    "blue_o_points": [],
    "blue_x_points": [[5e-5, 1], [2e-5, 2], [5e-5, 1], [2e-5, 2]]
  },
  "QS_mulLysisTrunk[Upper]": {
    "red_x_points": [
      [-0.00064, 3],
      [-0.00523, 0],
      [-0.00343, 0],
      [-0.00325, 0],
      [-0.00348, 0],
      [-0.01439, 2],
      [-0.00399, 0],
      [-0.00102, 3],
      [-0.00359, 0],
      [-0.00348, 0],
      [-0.00081, 3],
      [-0.00356, 0],
      [-0.00092, 3],
      [-0.00521, 0],
      [-0.01268, 2],
      [-0.00083, 3],
      [-0.00071, 3],
      [-0.00067, 3],
      [-0.00341, 0],
      [-0.00066, 3],
      [-0.0009, 3],
      [-0.00102, 3],
      [-0.00362, 0],
      [-0.00356, 0],
      [-0.00087, 3],
      [0.01316, 1],
      [-0.0008, 3],
      [-0.01168, 2],
      [-0.00093, 3]
    ],
    "red_o_points": [],
    "y_categories": ["N", "NOT APPLICABLE", "Y", "nan"],
    "blue_o_points": [],
    "blue_x_points": [
      [0.02282, 1],
      [-0.00049, 3],
      [-0.00129, 0],
      [-0.00177, 0],
      [0.00037, 3],
      [0.02076, 1],
      [0.01469, 1],
      [-0.00212, 0],
      [-0.00042, 3],
      [-2e-5, 3],
      [-0.00207, 0],
      [0.01619, 1],
      [-0.00035, 3],
      [0.01647, 1],
      [-0.00056, 3]
    ]
  },
  "QS_mulGraftNerve[Ac]": {
    "red_x_points": [
      [-7e-5, 2],
      [-0.00065, 0],
      [-0.00032, 0],
      [-0.00027, 0],
      [-0.0003, 0],
      [-0.00029, 0],
      [-0.00034, 0],
      [-2e-5, 2],
      [-0.00029, 0],
      [-0.00025, 0],
      [-4e-5, 2],
      [-0.00035, 0],
      [-0.0001, 2],
      [-0.00053, 0],
      [-0.00048, 0],
      [-0.0001, 2],
      [-4e-5, 2],
      [-0.00012, 2],
      [-0.0002, 0],
      [-4e-5, 2],
      [-8e-5, 2],
      [-0.00011, 2],
      [-0.0004, 0],
      [-0.0004, 0],
      [-0.0001, 2],
      [0.00087, 1],
      [-7e-5, 2],
      [-0.00027, 0],
      [-0.00011, 2]
    ],
    "red_o_points": [],
    "y_categories": ["N", "NOT APPLICABLE", "nan"],
    "blue_o_points": [],
    "blue_x_points": [
      [0.00158, 1],
      [-1e-5, 2],
      [-0.00024, 0],
      [-0.00023, 0],
      [-2e-5, 2],
      [0.0016, 1],
      [0.00104, 1],
      [-0.00033, 0],
      [-5e-5, 2],
      [-5e-5, 2],
      [-0.00025, 0],
      [0.00121, 1],
      [-6e-5, 2],
      [0.00132, 1],
      [-4e-5, 2]
    ]
  },
  "QS_mulNeuromadSite[C8]": {
    "red_x_points": [
      [-0.00018, 2],
      [-0.00145, 0],
      [-0.0012, 0],
      [-0.00093, 0],
      [-0.00101, 0],
      [-0.00086, 0],
      [-0.00105, 0],
      [-0.0002, 2],
      [-0.00106, 0],
      [-0.00089, 0],
      [-0.00029, 2],
      [-0.00085, 0],
      [-0.00013, 2],
      [-0.00143, 0],
      [-0.00174, 0],
      [-0.00033, 2],
      [-0.00011, 2],
      [-0.00028, 2],
      [-0.00094, 0],
      [-0.00025, 2],
      [-0.00019, 2],
      [-0.00018, 2],
      [-0.00102, 0],
      [-0.00088, 0],
      [-0.00021, 2],
      [0.00299, 1],
      [-0.00022, 2],
      [-0.00081, 0],
      [-0.00019, 2]
    ],
    "red_o_points": [],
    "y_categories": ["N", "NOT APPLICABLE", "nan"],
    "blue_o_points": [],
    "blue_x_points": [
      [0.00456, 1],
      [-0.0002, 2],
      [-0.00052, 0],
      [-0.00058, 0],
      [0.00015, 2],
      [0.00419, 1],
      [0.00288, 1],
      [-0.0008, 0],
      [-0.00017, 2],
      [6e-5, 2],
      [-0.00058, 0],
      [0.00318, 1],
      [-0.00011, 2],
      [0.00405, 1],
      [-0.00018, 2]
    ]
  },
  "QS_mulGraftNerve[Ph]": {
    "red_x_points": [
      [-5e-5, 2],
      [-0.00036, 0],
      [-0.00031, 0],
      [-0.00022, 0],
      [-0.00026, 0],
      [-0.00031, 0],
      [-0.00014, 0],
      [-4e-5, 2],
      [-0.00024, 0],
      [-0.00024, 0],
      [-2e-5, 2],
      [-0.00023, 0],
      [-0.00014, 2],
      [-0.00037, 0],
      [-0.00033, 0],
      [-4e-5, 2],
      [-4e-5, 2],
      [-5e-5, 2],
      [-0.00023, 0],
      [-2e-5, 2],
      [-6e-5, 2],
      [-4e-5, 2],
      [-0.00027, 0],
      [-0.00026, 0],
      [-5e-5, 2],
      [0.00086, 1],
      [-4e-5, 2],
      [-0.00025, 0],
      [-0.00012, 2]
    ],
    "red_o_points": [],
    "y_categories": ["N", "NOT APPLICABLE", "nan"],
    "blue_o_points": [],
    "blue_x_points": [
      [0.00139, 1],
      [-5e-5, 2],
      [-0.00018, 0],
      [-0.00031, 0],
      [-2e-5, 2],
      [0.00112, 1],
      [0.00083, 1],
      [-0.00024, 0],
      [-5e-5, 2],
      [-4e-5, 2],
      [-0.00013, 0],
      [0.00078, 1],
      [-2e-5, 2],
      [0.00078, 1],
      [-3e-5, 2]
    ]
  },
  "QS_mulTransfSite[AcSsPA]": {
    "red_x_points": [
      [-0.00014, 3],
      [-0.0018, 0],
      [-0.00116, 0],
      [-0.00112, 0],
      [-0.00123, 0],
      [-0.00079, 0],
      [-0.00126, 0],
      [-0.00018, 3],
      [-0.00119, 0],
      [-0.00088, 0],
      [-0.0001, 3],
      [-0.00125, 0],
      [-0.00027, 3],
      [-0.00161, 0],
      [-0.00378, 2],
      [-0.0001, 3],
      [-0.00016, 3],
      [-0.00011, 3],
      [-0.00093, 0],
      [-0.00025, 3],
      [-0.00013, 3],
      [-0.00026, 3],
      [-0.00128, 0],
      [-0.0012, 0],
      [-0.00019, 3],
      [0.00286, 1],
      [-0.00014, 3],
      [-0.00107, 0],
      [-0.00011, 3]
    ],
    "red_o_points": [],
    "y_categories": ["N", "NOT APPLICABLE", "Y", "nan"],
    "blue_o_points": [],
    "blue_x_points": [
      [0.00636, 1],
      [-7e-5, 3],
      [-0.00062, 0],
      [-0.00094, 0],
      [-1e-5, 3],
      [0.00509, 1],
      [0.0031, 1],
      [-0.00085, 0],
      [-0.0001, 3],
      [-8e-5, 3],
      [-0.0007, 0],
      [0.00428, 1],
      [-0.0, 3],
      [0.00446, 1],
      [-9e-5, 3]
    ]
  },
  "QA_lstPexMuscstrength[ScapulaElev]": {
    "red_x_points": [
      [-0.00055, 0],
      [-0.00043, 2],
      [-0.00073, 2],
      [-0.0006, 2],
      [-0.00262, 1],
      [0.00033, 0],
      [-0.00081, 2],
      [-0.00527, 1],
      [0.00128, 0],
      [-0.00061, 2],
      [-0.00041, 0],
      [-0.00047, 2],
      [-0.00018, 2],
      [-0.00098, 2],
      [0.00012, 0],
      [-0.00044, 0],
      [-0.00043, 0],
      [-0.0006, 0],
      [-0.00034, 2],
      [0.00028, 2],
      [-0.00018, 2],
      [-0.00042, 2],
      [0.00044, 0],
      [0.00089, 0],
      [-0.0001, 2],
      [-0.00041, 2],
      [-0.00015, 2],
      [-0.00135, 1],
      [-0.00011, 2]
    ],
    "red_o_points": [],
    "y_categories": ["GREATER THAN OR EQUALS TO 3", "LESS THAN 3", "nan"],
    "blue_o_points": [],
    "blue_x_points": [
      [-0.0004, 2],
      [7e-5, 2],
      [0.00134, 0],
      [0.00335, 0],
      [0.00047, 2],
      [1e-5, 2],
      [1e-5, 0],
      [-8e-5, 2],
      [0.00406, 0],
      [0.00046, 2],
      [0.00164, 0],
      [0.0014, 0],
      [0.00064, 2],
      [0.00139, 0],
      [0.00047, 2]
    ]
  },
  "QA_lstPexMuscstrength[ScapulaAbducSuprot]": {
    "red_x_points": [
      [0.00187, 0],
      [-0.00131, 2],
      [-0.00804, 1],
      [-0.00089, 2],
      [-0.00921, 1],
      [-0.00959, 1],
      [-0.00961, 1],
      [-0.00627, 1],
      [0.01084, 0],
      [-0.01006, 1],
      [-0.00655, 1],
      [-0.00148, 2],
      [-0.00082, 2],
      [-0.0017, 2],
      [-0.00031, 2],
      [0.00315, 0],
      [-0.00612, 1],
      [0.00208, 0],
      [-0.00821, 1],
      [-0.00142, 2],
      [-0.00088, 2],
      [-0.00081, 2],
      [-0.01089, 1],
      [0.00824, 0],
      [-0.00025, 2],
      [0.00019, 2],
      [0.00311, 0],
      [-0.00657, 1],
      [-0.00062, 2]
    ],
    "red_o_points": [],
    "y_categories": ["GREATER THAN OR EQUALS TO 3", "LESS THAN 3", "nan"],
    "blue_o_points": [],
    "blue_x_points": [
      [0.00024, 2],
      [0.008, 0],
      [0.01404, 0],
      [0.01551, 0],
      [0.00046, 2],
      [0.00025, 2],
      [0.00324, 0],
      [0.00114, 2],
      [0.00235, 2],
      [0.0003, 2],
      [0.01393, 0],
      [0.00379, 0],
      [0.00431, 0],
      [0.00028, 2],
      [0.0043, 1]
    ]
  },
  "participant_code": {
    "red_x_points": [
      [-0.0255, 1],
      [-0.02461, 2],
      [-0.02543, 3],
      [-0.02537, 4],
      [-0.0253, 5],
      [-0.02585, 8],
      [-0.02496, 9],
      [-0.02578, 10],
      [-0.02516, 11],
      [-0.02516, 13],
      [-0.02626, 14],
      [-0.02564, 18],
      [-0.0253, 19],
      [-0.02633, 20],
      [-0.02461, 23],
      [-0.02605, 26],
      [-0.02543, 28],
      [-0.02482, 29],
      [-0.02612, 30],
      [-0.02489, 31],
      [-0.02591, 32],
      [-0.0266, 34],
      [-0.02708, 36],
      [-0.02578, 38],
      [-0.0255, 39],
      [-0.0253, 40],
      [-0.02496, 41],
      [-0.02653, 42],
      [-0.02489, 43]
    ],
    "red_o_points": [],
    "y_categories": [
      "P16554",
      "P18297",
      "P19283",
      "P19287",
      "P23172",
      "P23391",
      "P30595",
      "P31645",
      "P31691",
      "P34778",
      "P35046",
      "P36328",
      "P43633",
      "P4544",
      "P46417",
      "P48965",
      "P53068",
      "P5497",
      "P58556",
      "P59529",
      "P62483",
      "P64658",
      "P65202",
      "P66816",
      "P6751",
      "P7408",
      "P75566",
      "P76226",
      "P79971",
      "P82621",
      "P82990",
      "P84549",
      "P84932",
      "P85825",
      "P86989",
      "P8770",
      "P87791",
      "P90550",
      "P93159",
      "P94969",
      "P96710",
      "P97130",
      "P9744",
      "P98500",
      "nan"
    ],
    "blue_o_points": [],
    "blue_x_points": [
      [0.04941, 0],
      [0.04901, 6],
      [0.05098, 7],
      [0.04914, 12],
      [0.04783, 15],
      [0.04849, 16],
      [0.04993, 17],
      [0.04744, 21],
      [0.05085, 22],
      [0.04796, 24],
      [0.05085, 25],
      [0.04888, 27],
      [0.04901, 33],
      [0.05072, 35],
      [0.05059, 37]
    ]
  },
  "QS_mulNeuromadSite[T2]": {
    "red_x_points": [
      [-0.00013, 2],
      [-0.00203, 0],
      [-0.00122, 0],
      [-0.00121, 0],
      [-0.0012, 0],
      [-0.00101, 0],
      [-0.0014, 0],
      [-0.00016, 2],
      [-0.00131, 0],
      [-0.00109, 0],
      [-0.00016, 2],
      [-0.00145, 0],
      [-0.00021, 2],
      [-0.00219, 0],
      [-0.00201, 0],
      [-0.00016, 2],
      [-0.0001, 2],
      [-0.00014, 2],
      [-0.00123, 0],
      [-0.00011, 2],
      [-0.00023, 2],
      [-0.0002, 2],
      [-0.00126, 0],
      [-0.00138, 0],
      [-0.00032, 2],
      [0.0032, 1],
      [-0.00021, 2],
      [-0.00103, 0],
      [-0.00025, 2]
    ],
    "red_o_points": [],
    "y_categories": ["N", "NOT APPLICABLE", "nan"],
    "blue_o_points": [],
    "blue_x_points": [
      [0.00668, 1],
      [-0.0001, 2],
      [-0.00077, 0],
      [-0.00063, 0],
      [-3e-5, 2],
      [0.00551, 1],
      [0.00333, 1],
      [-0.00114, 0],
      [-0.0001, 2],
      [-1e-5, 2],
      [-0.0008, 0],
      [0.00457, 1],
      [-0.00016, 2],
      [0.0039, 1],
      [-6e-5, 2]
    ]
  },
  "QA_yonInjTbi": {
    "red_x_points": [
      [0.00731, 0],
      [-0.00229, 2],
      [-0.00168, 0],
      [-0.00145, 0],
      [-0.00138, 2],
      [0.00071, 1],
      [-0.0018, 0],
      [-0.01087, 2],
      [-0.00329, 2],
      [0.00099, 1],
      [-0.00446, 1],
      [-0.00473, 0],
      [0.00823, 0],
      [0.00056, 1],
      [-0.00032, 1],
      [-0.00526, 1],
      [-0.00424, 1],
      [-0.00483, 1],
      [0.00053, 1],
      [-0.00539, 1],
      [0.00763, 0],
      [-0.00569, 1],
      [0.00107, 1],
      [0.00093, 1],
      [-0.00488, 1],
      [-0.00059, 2],
      [-0.01063, 2],
      [0.00021, 1],
      [-0.00654, 1]
    ],
    "red_o_points": [],
    "y_categories": ["N", "Y", "nan"],
    "blue_o_points": [],
    "blue_x_points": [
      [0.00055, 0],
      [-0.00309, 1],
      [0.00202, 1],
      [0.00208, 1],
      [0.01162, 0],
      [-2e-5, 1],
      [0.00361, 1],
      [0.01258, 0],
      [0.0111, 0],
      [0.00204, 1],
      [-3e-5, 2],
      [-0.00368, 1],
      [2e-5, 2],
      [0.01332, 0]
    ]
  },
  "QA_mulInjOrthesisType[ArmSling]": {
    "red_x_points": [
      [-0.00671, 2],
      [-0.00718, 2],
      [-0.00656, 2],
      [-0.00674, 2],
      [-0.00678, 2],
      [-0.00663, 2],
      [-0.0067, 2],
      [-0.00709, 2],
      [-0.00664, 2],
      [-0.00685, 2],
      [-0.00676, 2],
      [-0.00687, 2],
      [-0.00689, 2],
      [-0.00652, 2],
      [-0.01972, 0],
      [-0.00696, 2],
      [-0.00664, 2],
      [-0.02095, 0],
      [-0.0205, 3],
      [-0.00654, 2],
      [-0.00697, 2],
      [-0.00648, 2],
      [-0.00677, 2],
      [-0.00676, 2],
      [-0.0209, 3],
      [-0.02132, 3],
      [-0.02034, 3],
      [-0.00678, 2],
      [-0.00656, 2]
    ],
    "red_o_points": [],
    "y_categories": ["N", "NOT APPLICABLE", "Y", "nan"],
    "blue_o_points": [],
    "blue_x_points": [
      [-0.00642, 2],
      [-0.00678, 2],
      [-0.00638, 2],
      [-0.00628, 2],
      [0.04114, 1],
      [0.04016, 1],
      [0.04021, 1],
      [0.03876, 1],
      [-0.0064, 2],
      [0.04022, 1],
      [-0.00644, 2],
      [0.04086, 1],
      [0.0418, 1],
      [0.0408, 1],
      [-0.00612, 2]
    ]
  },
  "QS_mulGraftNerve[Ul]": {
    "red_x_points": [
      [-1e-5, 2],
      [-0.00014, 0],
      [-9e-5, 0],
      [-0.00011, 0],
      [-5e-5, 0],
      [-5e-5, 0],
      [-0.00011, 0],
      [-2e-5, 2],
      [-9e-5, 0],
      [-5e-5, 0],
      [-1e-5, 2],
      [-2e-5, 0],
      [-2e-5, 2],
      [-0.00018, 0],
      [-5e-5, 0],
      [-1e-5, 2],
      [-1e-5, 2],
      [0.0, 2],
      [-2e-5, 0],
      [-1e-5, 2],
      [-3e-5, 2],
      [-1e-5, 2],
      [-5e-5, 0],
      [-5e-5, 0],
      [-1e-5, 2],
      [8e-5, 1],
      [-2e-5, 2],
      [-5e-5, 0],
      [-1e-5, 2]
    ],
    "red_o_points": [],
    "y_categories": ["N", "NOT APPLICABLE", "nan"],
    "blue_o_points": [],
    "blue_x_points": [
      [0.00038, 1],
      [-2e-5, 2],
      [-2e-5, 0],
      [-5e-5, 0],
      [-1e-5, 2],
      [0.00032, 1],
      [0.00013, 1],
      [-5e-5, 0],
      [-1e-5, 2],
      [-1e-5, 2],
      [-5e-5, 0],
      [0.00022, 1],
      [0.0, 2],
      [0.00035, 1],
      [-1e-5, 2]
    ]
  },
  "QA_mulInjOrthesisType[ShoulderSupport]": {
    "red_x_points": [
      [-0.00623, 0],
      [-0.00597, 0],
      [-0.00615, 0],
      [-0.02269, 2],
      [-0.00586, 0],
      [-0.00617, 0],
      [-0.00576, 0],
      [-0.0229, 2],
      [-0.00573, 0],
      [-0.00572, 0],
      [-0.00581, 0],
      [-0.00624, 0],
      [-0.00603, 0],
      [-0.00604, 0],
      [-0.02301, 2],
      [-0.00561, 0],
      [-0.00607, 0],
      [-0.02282, 2],
      [-0.02322, 3],
      [-0.00555, 0],
      [-0.0061, 0],
      [-0.00592, 0],
      [-0.00589, 0],
      [-0.0059, 0],
      [-0.02357, 3],
      [-0.02334, 3],
      [-0.02213, 3],
      [-0.00598, 0],
      [-0.00597, 0]
    ],
    "red_o_points": [],
    "y_categories": ["N", "NOT APPLICABLE", "Y", "nan"],
    "blue_o_points": [],
    "blue_x_points": [
      [-0.00557, 0],
      [-0.00581, 0],
      [-0.00554, 0],
      [-0.00595, 0],
      [0.04353, 1],
      [0.04444, 1],
      [0.0406, 1],
      [0.04333, 1],
      [-0.00563, 0],
      [0.04311, 1],
      [-0.00608, 0],
      [0.04294, 1],
      [0.04641, 1],
      [0.0442, 1],
      [-0.00561, 0]
    ]
  },
  "QA_yonInjUnconscio": {
    "red_x_points": [
      [-0.01216, 1],
      [-0.01232, 1],
      [-0.0017, 2],
      [-0.0021, 2],
      [-0.00155, 2],
      [-0.01228, 1],
      [-0.0018, 2],
      [-0.00216, 2],
      [-0.00208, 2],
      [-0.01326, 1],
      [-0.01244, 1],
      [-0.0142, 1],
      [-0.00264, 2],
      [-0.0023, 2],
      [-0.00974, 1],
      [-0.01219, 1],
      [-0.01177, 1],
      [-0.00954, 1],
      [-0.01002, 1],
      [-0.01218, 1],
      [-0.00259, 2],
      [-0.00188, 2],
      [-0.01329, 1],
      [-0.01245, 1],
      [-0.00255, 2],
      [-0.00219, 2],
      [-0.00255, 2],
      [-0.01236, 1],
      [-0.00235, 2]
    ],
    "red_o_points": [],
    "y_categories": ["N", "Y", "nan"],
    "blue_o_points": [],
    "blue_x_points": [
      [-0.00117, 2],
      [-0.00115, 2],
      [0.0435, 0],
      [-0.00096, 2],
      [-0.00729, 1],
      [-0.00806, 1],
      [0.03049, 0],
      [0.03911, 0],
      [-0.00148, 2],
      [0.03611, 0],
      [0.0453, 0],
      [-0.00162, 2],
      [-0.00788, 1],
      [-0.00162, 2],
      [0.04736, 0]
    ]
  },
  "QA_lstPexPalle[Elbow]": {
    "red_x_points": [
      [-0.00051, 4],
      [-0.00291, 4],
      [-0.00194, 4],
      [-0.00125, 3],
      [-0.00349, 4],
      [-0.00111, 3],
      [-0.00288, 4],
      [-0.00032, 4],
      [-0.00373, 4],
      [-0.00083, 3],
      [-0.00357, 1],
      [-0.00406, 4],
      [-0.00058, 4],
      [-0.00386, 4],
      [-0.00147, 4],
      [0.00069, 3],
      [-0.00754, 0],
      [0.00041, 3],
      [-0.00654, 2],
      [0.00045, 3],
      [-0.00035, 4],
      [-0.00045, 4],
      [-0.00391, 4],
      [-0.00388, 4],
      [-0.00035, 4],
      [-0.02447, 3],
      [-0.00033, 4],
      [-0.00533, 0],
      [-0.00041, 4]
    ],
    "red_o_points": [],
    "y_categories": ["ABS", "HYPO", "NAIA", "PT", "nan"],
    "blue_o_points": [],
    "blue_x_points": [
      [0.00439, 4],
      [-0.00017, 4],
      [0.00332, 3],
      [0.02862, 1],
      [-5e-5, 4],
      [0.00432, 4],
      [0.00896, 1],
      [-0.00249, 4],
      [0.00039, 4],
      [0.00016, 4],
      [0.02195, 1],
      [0.00425, 4],
      [0.00205, 3],
      [0.00465, 4],
      [0.00418, 3]
    ]
  },
  "QA_lstPexInspectio[Swelling]": {
    "red_x_points": [
      [0.00147, 1],
      [-0.00249, 1],
      [0.00157, 0],
      [-0.00159, 1],
      [-0.00067, 2],
      [0.0015, 0],
      [-0.00281, 1],
      [0.0012, 1],
      [-0.00607, 1],
      [-0.00586, 1],
      [-0.00658, 2],
      [-0.00373, 1],
      [-0.0045, 0],
      [-0.00444, 1],
      [-0.00124, 1],
      [-0.00333, 0],
      [-0.00649, 2],
      [0.0016, 1],
      [-0.00238, 1],
      [0.00142, 1],
      [-0.00444, 0],
      [0.00105, 1],
      [-0.00427, 1],
      [0.00308, 0],
      [0.00153, 1],
      [-0.00553, 0],
      [-0.00787, 2],
      [0.00061, 0],
      [0.00159, 1]
    ],
    "red_o_points": [],
    "y_categories": ["ABS", "NAIA", "PT", "nan"],
    "blue_o_points": [],
    "blue_x_points": [
      [0.00221, 1],
      [0.00303, 1],
      [0.00796, 0],
      [0.01125, 0],
      [0.00432, 1],
      [0.00242, 1],
      [-0.0, 0],
      [-0.00226, 1],
      [0.00426, 0],
      [0.00403, 1],
      [0.01318, 2],
      [0.00158, 1],
      [0.00311, 1],
      [-0.00057, 0],
      [0.00315, 1]
    ]
  },
  "QA_lstPexInspectio[SurgicalScar]": {
    "red_x_points": [
      [-0.00435, 1],
      [-0.00445, 1],
      [-0.00634, 0],
      [-0.00352, 1],
      [-0.00601, 1],
      [-0.00935, 0],
      [-0.00559, 1],
      [-0.0036, 1],
      [-0.00836, 1],
      [-0.0081, 1],
      [-0.0069, 0],
      [-0.00733, 1],
      [-0.00172, 2],
      [-0.00804, 1],
      [-0.00463, 0],
      [0.00416, 2],
      [0.0032, 2],
      [-0.00684, 1],
      [-0.00406, 1],
      [-0.00395, 1],
      [-0.00279, 2],
      [-0.00313, 1],
      [-0.00808, 1],
      [0.01198, 2],
      [-0.00306, 1],
      [-0.00404, 1],
      [-0.00239, 1],
      [0.0055, 2],
      [-0.00269, 1]
    ],
    "red_o_points": [],
    "y_categories": ["ABS", "NAIA", "PT", "nan"],
    "blue_o_points": [],
    "blue_x_points": [
      [-0.00086, 1],
      [0.01049, 2],
      [0.02182, 2],
      [0.02601, 2],
      [0.00099, 1],
      [0.0001, 1],
      [0.00146, 0],
      [-0.00479, 1],
      [0.00287, 1],
      [0.00168, 1],
      [0.02142, 2],
      [-0.00068, 1],
      [0.01028, 2],
      [0.00342, 0],
      [0.01029, 2]
    ]
  },
  "QA_intPexWristFlex": {
    "red_x_points": [
      [-0.00014, 2],
      [-0.00072, 2],
      [-0.0005, 2],
      [-0.00047, 2],
      [-0.0007, 2],
      [-0.00071, 0],
      [-0.00079, 2],
      [0.00051, 0],
      [-0.00105, 2],
      [-0.0009, 2],
      [-0.00016, 0],
      [-0.00086, 2],
      [-7e-5, 2],
      [-0.00093, 2],
      [-0.0004, 2],
      [-0.00036, 0],
      [-0.00013, 0],
      [-0.00012, 0],
      [-0.00034, 0],
      [-5e-5, 2],
      [-7e-5, 2],
      [-8e-5, 2],
      [-0.00105, 2],
      [-0.00098, 2],
      [-4e-5, 2],
      [-0.02359, 1],
      [-0.00378, 1],
      [-0.00046, 0],
      [-0.00019, 2]
    ],
    "red_o_points": [],
    "y_categories": ["GREATER THAN OR EQUALS TO 60", "LESS THAN 60", "nan"],
    "blue_o_points": [],
    "blue_x_points": [
      [0.00441, 2],
      [0.00344, 0],
      [0.00075, 0],
      [-0.00083, 2],
      [5e-5, 2],
      [0.00388, 2],
      [0.00565, 0],
      [-0.00063, 2],
      [0.00013, 2],
      [0.00016, 2],
      [0.01205, 1],
      [0.00459, 2],
      [0.00053, 2],
      [0.00451, 2],
      [0.00045, 0]
    ]
  },
  "QS_mulGraftNerve[Me]": {
    "red_x_points": [
      [-0.0, 2],
      [-0.00015, 0],
      [-0.00011, 0],
      [-0.00012, 0],
      [-0.00016, 0],
      [-5e-5, 0],
      [-0.00016, 0],
      [-1e-5, 2],
      [-0.00013, 0],
      [-0.00015, 0],
      [-1e-5, 2],
      [-9e-5, 0],
      [-2e-5, 2],
      [-0.00014, 0],
      [-0.00012, 0],
      [-2e-5, 2],
      [-1e-5, 2],
      [-0.0, 2],
      [-0.00012, 0],
      [-1e-5, 2],
      [-2e-5, 2],
      [-1e-5, 2],
      [-0.00013, 0],
      [-0.0001, 0],
      [-2e-5, 2],
      [0.00028, 1],
      [-3e-5, 2],
      [-7e-5, 0],
      [-1e-5, 2]
    ],
    "red_o_points": [],
    "y_categories": ["N", "NOT APPLICABLE", "nan"],
    "blue_o_points": [],
    "blue_x_points": [
      [0.0005, 1],
      [-2e-5, 2],
      [-0.0001, 0],
      [-5e-5, 0],
      [1e-5, 2],
      [0.00046, 1],
      [0.0002, 1],
      [-5e-5, 0],
      [-1e-5, 2],
      [-0.0, 2],
      [-5e-5, 0],
      [0.00041, 1],
      [0.0, 2],
      [0.00041, 1],
      [-0.0, 2]
    ]
  },
  "QS_mulGraftRoot[T2]": {
    "red_x_points": [
      [-1e-5, 0],
      [-1e-5, 0],
      [-1e-5, 0],
      [-1e-5, 0],
      [-0.0, 2],
      [-1e-5, 0],
      [-0.0, 2],
      [-1e-5, 0],
      [-0.0, 2],
      [-1e-5, 0],
      [-0.0, 2],
      [-0.0, 2],
      [-0.0, 2],
      [-0.0, 2],
      [-1e-5, 0],
      [-1e-5, 0],
      [-1e-5, 0]
    ],
    "red_o_points": [],
    "y_categories": ["N", "NOT APPLICABLE", "nan"],
    "blue_o_points": [],
    "blue_x_points": [
      [0.00015, 1],
      [-0.0, 2],
      [-1e-5, 0],
      [-0.0, 2],
      [-1e-5, 0]
    ]
  },
  "QS_mulGraftNerve[Ax]": {
    "red_x_points": [
      [-2e-5, 2],
      [-0.00035, 0],
      [-0.00032, 0],
      [-0.0002, 0],
      [-0.00024, 0],
      [-0.0002, 0],
      [-0.00031, 0],
      [-8e-5, 2],
      [-0.00028, 0],
      [-0.00019, 0],
      [-3e-5, 2],
      [-0.00027, 0],
      [-7e-5, 2],
      [-0.0003, 0],
      [-0.00025, 0],
      [-4e-5, 2],
      [-4e-5, 2],
      [-5e-5, 2],
      [-0.00024, 0],
      [-4e-5, 2],
      [-6e-5, 2],
      [-4e-5, 2],
      [-0.00025, 0],
      [-0.00031, 0],
      [-3e-5, 2],
      [0.00056, 1],
      [-7e-5, 2],
      [-0.00021, 0],
      [-4e-5, 2]
    ],
    "red_o_points": [],
    "y_categories": ["N", "NOT APPLICABLE", "nan"],
    "blue_o_points": [],
    "blue_x_points": [
      [0.00115, 1],
      [-1e-5, 2],
      [-0.00023, 0],
      [-0.00016, 0],
      [-0.0, 2],
      [0.00087, 1],
      [0.00074, 1],
      [-0.00025, 0],
      [-5e-5, 2],
      [-5e-5, 2],
      [-0.0002, 0],
      [0.00113, 1],
      [-3e-5, 2],
      [0.00109, 1],
      [-1e-5, 2]
    ]
  },
  "QS_mulBpsurgeryType[Lysis]": {
    "red_x_points": [
      [-0.00067, 3],
      [-0.00413, 0],
      [-0.01515, 2],
      [-0.01411, 2],
      [-0.00304, 0],
      [-0.01615, 2],
      [-0.00312, 0],
      [-0.00096, 3],
      [-0.00366, 0],
      [-0.00259, 0],
      [-0.00085, 3],
      [-0.00326, 0],
      [-0.0011, 3],
      [-0.00446, 0],
      [-0.0147, 2],
      [-0.00093, 3],
      [-0.00087, 3],
      [-0.00077, 3],
      [-0.003, 0],
      [-0.00081, 3],
      [-0.00117, 3],
      [-0.00115, 3],
      [-0.00301, 0],
      [-0.00286, 0],
      [-0.00111, 3],
      [0.01749, 1],
      [-0.00101, 3],
      [-0.01424, 2],
      [-0.00112, 3]
    ],
    "red_o_points": [],
    "y_categories": ["N", "NOT APPLICABLE", "Y", "nan"],
    "blue_o_points": [],
    "blue_x_points": [
      [0.02852, 1],
      [-0.0002, 3],
      [-0.00092, 0],
      [-0.00148, 0],
      [-8e-5, 3],
      [0.0234, 1],
      [0.01767, 1],
      [-0.00173, 0],
      [-0.00061, 3],
      [-0.00025, 3],
      [-0.00105, 0],
      [0.01999, 1],
      [-0.00053, 3],
      [0.02051, 1],
      [-0.00073, 3]
    ]
  },
  "QS_mulLysisSite[Trunk]": {
    "red_x_points": [
      [-0.00059, 3],
      [-0.00453, 0],
      [-0.00326, 0],
      [-0.00335, 0],
      [-0.0037, 0],
      [-0.01323, 2],
      [-0.00336, 0],
      [-0.0007, 3],
      [-0.00334, 0],
      [-0.00317, 0],
      [-0.00073, 3],
      [-0.00377, 0],
      [-0.00091, 3],
      [-0.00454, 0],
      [-0.01276, 2],
      [-0.00084, 3],
      [-0.00061, 3],
      [-0.00056, 3],
      [-0.00323, 0],
      [-0.00073, 3],
      [-0.00081, 3],
      [-0.00062, 3],
      [-0.00368, 0],
      [-0.00374, 0],
      [-0.00088, 3],
      [0.01419, 1],
      [-0.00065, 3],
      [-0.01195, 2],
      [-0.0009, 3]
    ],
    "red_o_points": [],
    "y_categories": ["N", "NOT APPLICABLE", "Y", "nan"],
    "blue_o_points": [],
    "blue_x_points": [
      [0.02194, 1],
      [-0.00023, 3],
      [-0.00183, 0],
      [-0.00246, 0],
      [-0.00022, 3],
      [0.01821, 1],
      [0.0144, 1],
      [-0.0026, 0],
      [-0.00014, 3],
      [-0.00018, 3],
      [-0.00195, 0],
      [0.01643, 1],
      [-0.00052, 3],
      [0.01663, 1],
      [-0.00049, 3]
    ]
  },
  "QS_mulGraftTrunk[UpperTrunk]": {
    "red_x_points": [
      [-0.00033, 3],
      [-0.00176, 0],
      [-0.00168, 0],
      [-0.00162, 0],
      [-0.00164, 0],
      [-0.00112, 0],
      [-0.00152, 0],
      [-0.00033, 3],
      [-0.00171, 0],
      [-0.00116, 0],
      [-0.00042, 3],
      [-0.00176, 0],
      [-0.00036, 3],
      [-0.00794, 2],
      [-0.00156, 0],
      [-0.00041, 3],
      [-0.00034, 3],
      [-0.00044, 3],
      [-0.00124, 0],
      [-0.00029, 3],
      [-0.00039, 3],
      [-0.00041, 3],
      [-0.00167, 0],
      [-0.0015, 0],
      [-0.00049, 3],
      [0.00446, 1],
      [-0.00031, 3],
      [-0.00126, 0],
      [-0.0004, 3]
    ],
    "red_o_points": [],
    "y_categories": ["N", "NOT APPLICABLE", "Y", "nan"],
    "blue_o_points": [],
    "blue_x_points": [
      [0.00976, 1],
      [-0.00017, 3],
      [-0.00074, 0],
      [-0.00026, 0],
      [-0.00017, 3],
      [0.00671, 1],
      [0.00474, 1],
      [-0.0009, 0],
      [-0.00016, 3],
      [-0.00022, 3],
      [-0.00064, 0],
      [0.00635, 1],
      [-0.00024, 3],
      [0.00585, 1],
      [-0.00032, 3]
    ]
  },
  "QS_mulTransfSite[PhMc]": {
    "red_x_points": [
      [-0.00024, 3],
      [-0.00337, 0],
      [-0.0024, 0],
      [-0.00217, 0],
      [-0.00223, 0],
      [-0.00191, 0],
      [-0.00777, 2],
      [-0.0007, 3],
      [-0.00251, 0],
      [-0.00202, 0],
      [-0.00044, 3],
      [-0.00236, 0],
      [-0.00044, 3],
      [-0.00321, 0],
      [-0.00306, 0],
      [-0.00081, 3],
      [-0.00029, 3],
      [-0.00048, 3],
      [-0.00613, 2],
      [-0.00036, 3],
      [-0.00038, 3],
      [-0.00045, 3],
      [-0.00217, 0],
      [-0.00234, 0],
      [-0.00062, 3],
      [0.00721, 1],
      [-0.00056, 3],
      [-0.00194, 0],
      [-0.00054, 3]
    ],
    "red_o_points": [],
    "y_categories": ["N", "NOT APPLICABLE", "Y", "nan"],
    "blue_o_points": [],
    "blue_x_points": [
      [0.01343, 1],
      [-0.00028, 3],
      [-0.00123, 0],
      [-0.00122, 0],
      [7e-5, 3],
      [0.01183, 1],
      [0.00787, 1],
      [-0.0017, 0],
      [-0.0002, 3],
      [-9e-5, 3],
      [-0.00112, 0],
      [0.00942, 1],
      [-0.00041, 3],
      [0.00861, 1],
      [-0.00028, 3]
    ]
  },
  "QS_mulLysisSite[Root]": {
    "red_x_points": [
      [-0.0005, 3],
      [-0.00212, 0],
      [-0.00687, 2],
      [-0.00152, 0],
      [-0.00154, 0],
      [-0.00165, 0],
      [-0.0014, 0],
      [-0.00031, 3],
      [-0.00174, 0],
      [-0.00142, 0],
      [-0.0003, 3],
      [-0.0019, 0],
      [-0.00053, 3],
      [-0.00176, 0],
      [-0.00201, 0],
      [-0.00035, 3],
      [-0.00034, 3],
      [-0.00035, 3],
      [-0.00145, 0],
      [-0.00031, 3],
      [-0.00047, 3],
      [-0.00038, 3],
      [-0.00181, 0],
      [-0.00164, 0],
      [-0.00049, 3],
      [0.00637, 1],
      [-0.00039, 3],
      [-0.00634, 2],
      [-0.00041, 3]
    ],
    "red_o_points": [],
    "y_categories": ["N", "NOT APPLICABLE", "Y", "nan"],
    "blue_o_points": [],
    "blue_x_points": [
      [0.01015, 1],
      [-0.00018, 3],
      [-0.00067, 0],
      [-0.00105, 0],
      [-0.00019, 3],
      [0.00818, 1],
      [0.00615, 1],
      [-0.00137, 0],
      [-0.00023, 3],
      [-0.00014, 3],
      [-0.00066, 0],
      [0.00695, 1],
      [-0.00021, 3],
      [0.00742, 1],
      [-0.00019, 3]
    ]
  },
  "QA_lstPexInspectio[ShoulderSubdisloc]": {
    "red_x_points": [
      [-0.00161, 1],
      [-0.00385, 1],
      [0.00242, 0],
      [-0.00279, 1],
      [-0.00531, 1],
      [-0.00193, 2],
      [-0.00475, 1],
      [-0.00241, 1],
      [-0.00681, 1],
      [-0.00624, 1],
      [-0.00163, 2],
      [-0.00592, 1],
      [-0.00189, 1],
      [-0.00657, 1],
      [-0.00283, 1],
      [-0.00365, 2],
      [-0.00109, 2],
      [-0.00037, 1],
      [-0.00349, 1],
      [-0.00078, 1],
      [-0.01048, 0],
      [0.0029, 2],
      [-0.00113, 2],
      [-0.00084, 2],
      [-0.00133, 1],
      [-0.01063, 2],
      [-0.00158, 1],
      [-0.00089, 2],
      [-0.00184, 1]
    ],
    "red_o_points": [],
    "y_categories": ["ABS", "NAIA", "PT", "nan"],
    "blue_o_points": [],
    "blue_x_points": [
      [0.00312, 1],
      [0.00662, 2],
      [0.02638, 0],
      [0.00492, 2],
      [0.0014, 1],
      [0.00441, 1],
      [0.00409, 0],
      [-0.00309, 1],
      [0.0097, 2],
      [0.00092, 1],
      [0.0237, 0],
      [0.0018, 1],
      [0.00215, 1],
      [-0.00045, 2],
      [0.00168, 1]
    ]
  },
  "QS_mulGraftLevel[Trunk]": {
    "red_x_points": [
      [-0.00018, 3],
      [-0.00214, 0],
      [-0.00135, 0],
      [-0.00131, 0],
      [-0.00156, 0],
      [-0.00114, 0],
      [-0.00141, 0],
      [-0.00045, 3],
      [-0.0012, 0],
      [-0.00113, 0],
      [-0.00032, 3],
      [-0.00148, 0],
      [-0.00053, 3],
      [-0.00648, 2],
      [-0.00182, 0],
      [-0.00028, 3],
      [-0.00027, 3],
      [-0.00015, 3],
      [-0.00137, 0],
      [-0.00036, 3],
      [-0.0005, 3],
      [-0.00038, 3],
      [-0.00155, 0],
      [-0.00141, 0],
      [-0.00036, 3],
      [0.00459, 1],
      [-0.00036, 3],
      [-0.00124, 0],
      [-0.00037, 3]
    ],
    "red_o_points": [],
    "y_categories": ["N", "NOT APPLICABLE", "Y", "nan"],
    "blue_o_points": [],
    "blue_x_points": [
      [0.00752, 1],
      [-0.00026, 3],
      [-0.00063, 0],
      [-0.00079, 0],
      [3e-5, 3],
      [0.00658, 1],
      [0.0045, 1],
      [-0.00066, 0],
      [-0.00029, 3],
      [4e-5, 3],
      [-0.0006, 0],
      [0.00566, 1],
      [-0.0002, 3],
      [0.00583, 1],
      [-0.00024, 3]
    ]
  },
  "QA_lstPexPain[C7]": {
    "red_x_points": [
      [-0.00255, 1],
      [-0.00376, 2],
      [-0.00241, 2],
      [-0.00174, 1],
      [-0.00464, 2],
      [-0.00337, 1],
      [-0.0019, 1],
      [-0.00588, 0],
      [-0.00512, 1],
      [0.00654, 0],
      [-0.00129, 1],
      [-0.00616, 2],
      [0.0016, 2],
      [-0.00614, 2],
      [-0.0022, 2],
      [-0.0058, 0],
      [-0.00068, 1],
      [-0.00497, 0],
      [-0.00387, 2],
      [-0.00479, 0],
      [0.00178, 2],
      [0.00253, 2],
      [-0.00644, 2],
      [-0.00695, 2],
      [-0.00459, 0],
      [-0.0022, 1],
      [-0.00144, 1],
      [-0.00224, 1],
      [-0.00166, 1]
    ],
    "red_o_points": [],
    "y_categories": ["NORM", "NPV", "nan"],
    "blue_o_points": [],
    "blue_x_points": [
      [1e-5, 1],
      [0.00417, 1],
      [0.01505, 0],
      [0.02024, 0],
      [0.00647, 2],
      [0.00024, 2],
      [-5e-5, 1],
      [0.00115, 1],
      [0.00545, 2],
      [0.00559, 2],
      [0.01497, 0],
      [-5e-5, 1],
      [-0.00078, 0],
      [0.00207, 0],
      [0.00581, 1]
    ]
  },
  "QS_mulTransfSite[AcSsAA]": {
    "red_x_points": [
      [-0.00047, 3],
      [-0.00125, 2],
      [-0.00484, 0],
      [-0.00439, 0],
      [-0.00035, 2],
      [-0.00601, 0],
      [-0.00445, 0],
      [-0.00052, 3],
      [-0.00604, 0],
      [-0.00618, 0],
      [-0.0003, 3],
      [-0.0046, 0],
      [-0.00051, 3],
      [-0.0004, 2],
      [-0.00297, 0],
      [-0.00077, 3],
      [-0.0002, 3],
      [-0.00066, 3],
      [-0.00039, 2],
      [-0.00052, 3],
      [-0.00045, 3],
      [-0.0004, 3],
      [-0.00499, 0],
      [0.00033, 2],
      [-0.00032, 3],
      [0.00584, 1],
      [-0.00055, 3],
      [-0.00392, 0],
      [-0.00052, 3]
    ],
    "red_o_points": [],
    "y_categories": ["N", "NOT APPLICABLE", "Y", "nan"],
    "blue_o_points": [],
    "blue_x_points": [
      [0.01415, 1],
      [-0.00023, 3],
      [0.00624, 2],
      [0.00735, 2],
      [-3e-5, 3],
      [0.00687, 1],
      [0.00595, 1],
      [-0.00229, 0],
      [-0.0002, 3],
      [-0.0001, 3],
      [-0.00198, 0],
      [0.00761, 1],
      [-0.00046, 3],
      [0.00803, 1],
      [-0.00012, 3]
    ]
  },
  "QS_mulGraftNerve[DS]": {
    "red_x_points": [
      [1e-5, 2],
      [-7e-5, 0],
      [-7e-5, 0],
      [-0.0001, 0],
      [-7e-5, 0],
      [-0.00014, 0],
      [-0.00011, 0],
      [1e-5, 2],
      [-0.00016, 0],
      [-0.00014, 0],
      [-0.0, 2],
      [-0.00014, 0],
      [-0.0, 2],
      [-7e-5, 0],
      [-0.0001, 0],
      [1e-5, 2],
      [1e-5, 2],
      [-0.0, 2],
      [-0.00014, 0],
      [2e-5, 2],
      [-1e-5, 2],
      [-0.0, 2],
      [-0.00014, 0],
      [-0.0001, 0],
      [-0.0, 2],
      [0.00028, 1],
      [1e-5, 2],
      [-8e-5, 0],
      [-0.0, 2]
    ],
    "red_o_points": [],
    "y_categories": ["N", "NOT APPLICABLE", "nan"],
    "blue_o_points": [],
    "blue_x_points": [
      [0.00036, 1],
      [1e-5, 2],
      [-3e-5, 0],
      [-0.00014, 0],
      [-0.0, 2],
      [0.00045, 1],
      [0.00019, 1],
      [-7e-5, 0],
      [1e-5, 2],
      [-0.0, 2],
      [-7e-5, 0],
      [0.00036, 1],
      [2e-5, 2],
      [0.00019, 1],
      [-0.0, 2]
    ]
  },
  "QS_mulGraftNerve[MP]": {
    "red_x_points": [
      [0.0, 2],
      [-3e-5, 0],
      [-9e-5, 0],
      [-3e-5, 0],
      [-3e-5, 0],
      [-3e-5, 0],
      [3e-5, 2],
      [-3e-5, 0],
      [-3e-5, 0],
      [0.0, 2],
      [-9e-5, 0],
      [2e-5, 2],
      [-3e-5, 0],
      [-9e-5, 0],
      [0.0, 2],
      [0.0, 2],
      [-6e-5, 0],
      [3e-5, 2],
      [3e-5, 2],
      [-9e-5, 0],
      [-9e-5, 0],
      [0.0, 2],
      [0.00014, 1],
      [3e-5, 2],
      [-3e-5, 0],
      [2e-5, 2]
    ],
    "red_o_points": [],
    "y_categories": ["N", "NOT APPLICABLE", "nan"],
    "blue_o_points": [],
    "blue_x_points": [
      [9e-5, 1],
      [3e-5, 2],
      [-3e-5, 0],
      [-3e-5, 0],
      [3e-5, 2],
      [0.00014, 1],
      [2e-5, 2],
      [3e-5, 2],
      [-3e-5, 0],
      [9e-5, 1],
      [0.0, 2],
      [9e-5, 1],
      [0.0, 2]
    ]
  },
  "QS_mulLysisSite[Nerve]": {
    "red_x_points": [
      [-0.00054, 3],
      [-0.00362, 0],
      [-0.01058, 2],
      [-0.01002, 2],
      [-0.00298, 0],
      [-0.00275, 0],
      [-0.00299, 0],
      [-0.00063, 3],
      [-0.00286, 0],
      [-0.00315, 0],
      [-0.00065, 3],
      [-0.00309, 0],
      [-0.00079, 3],
      [-0.00436, 0],
      [-0.00434, 0],
      [-0.00065, 3],
      [-0.00039, 3],
      [-0.00058, 3],
      [-0.00265, 0],
      [-0.00054, 3],
      [-0.00069, 3],
      [-0.00071, 3],
      [-0.00292, 0],
      [-0.0031, 0],
      [-0.00068, 3],
      [0.01098, 1],
      [-0.00068, 3],
      [-0.00283, 0],
      [-0.00096, 3]
    ],
    "red_o_points": [],
    "y_categories": ["N", "NOT APPLICABLE", "Y", "nan"],
    "blue_o_points": [],
    "blue_x_points": [
      [0.01865, 1],
      [-0.00035, 3],
      [-0.00159, 0],
      [-0.00196, 0],
      [-0.00015, 3],
      [0.01485, 1],
      [0.01048, 1],
      [-0.00229, 0],
      [-0.00037, 3],
      [-0.00031, 3],
      [-0.00198, 0],
      [0.01201, 1],
      [-0.00031, 3],
      [0.01338, 1],
      [-0.00032, 3]
    ]
  },
  "QS_mulGraftNerve[LP]": {
    "red_x_points": [
      [5e-5, 2],
      [-9e-5, 0],
      [-9e-5, 0],
      [-5e-5, 0],
      [-9e-5, 0],
      [-4e-5, 0],
      [3e-5, 2],
      [-4e-5, 0],
      [2e-5, 2],
      [5e-5, 2],
      [-9e-5, 0],
      [-9e-5, 0],
      [2e-5, 2]
    ],
    "red_o_points": [],
    "y_categories": ["N", "NOT APPLICABLE", "nan"],
    "blue_o_points": [],
    "blue_x_points": [[0.00031, 1], [5e-5, 2], [5e-5, 2]]
  },
  "QA_lstPexMuscstrength[WristFlex]": {
    "red_x_points": [
      [-0.00168, 1],
      [-0.00125, 2],
      [-0.00306, 1],
      [0.00123, 0],
      [-0.00338, 1],
      [0.00028, 0],
      [-0.00283, 1],
      [-0.00077, 0],
      [0.00196, 0],
      [3e-5, 0],
      [-0.00176, 0],
      [0.00072, 0],
      [-0.00219, 2],
      [-0.00245, 2],
      [-0.00054, 2],
      [-0.00614, 0],
      [0.00019, 1],
      [-0.00878, 0],
      [-0.00144, 1],
      [-0.00561, 0],
      [-0.00193, 2],
      [-0.00093, 0],
      [0.00073, 0],
      [0.00098, 0],
      [-0.00229, 2],
      [-0.00185, 2],
      [-0.00208, 1],
      [-0.00089, 1],
      [-0.00284, 2]
    ],
    "red_o_points": [],
    "y_categories": ["GREATER THAN OR EQUALS TO 3", "LESS THAN 3", "nan"],
    "blue_o_points": [],
    "blue_x_points": [
      [0.00134, 0],
      [0.00308, 0],
      [0.00128, 0],
      [0.00263, 0],
      [0.00177, 2],
      [1e-5, 2],
      [-0.0, 0],
      [0.00133, 0],
      [0.00355, 0],
      [0.00145, 2],
      [0.00166, 0],
      [0.00101, 0],
      [0.01523, 1],
      [0.00066, 0],
      [0.01357, 1]
    ]
  },
  "QS_mulNeuromadSite[C5]": {
    "red_x_points": [
      [3e-5, 2],
      [-0.00137, 0],
      [-0.00102, 0],
      [-0.00093, 0],
      [-0.00102, 0],
      [-0.00073, 0],
      [-0.00099, 0],
      [-0.00012, 2],
      [-0.00119, 0],
      [-0.00077, 0],
      [3e-5, 2],
      [-0.00105, 0],
      [-0.00012, 2],
      [-0.00136, 0],
      [-0.00112, 0],
      [5e-5, 2],
      [4e-5, 2],
      [-8e-5, 2],
      [-0.00082, 0],
      [5e-5, 2],
      [-0.00011, 2],
      [-8e-5, 2],
      [-0.0011, 0],
      [-0.00088, 0],
      [-0.0001, 2],
      [0.00188, 1],
      [-0.00015, 2],
      [-0.00061, 0],
      [-9e-5, 2]
    ],
    "red_o_points": [],
    "y_categories": ["N", "NOT APPLICABLE", "nan"],
    "blue_o_points": [],
    "blue_x_points": [
      [0.00455, 1],
      [-4e-5, 2],
      [-0.00027, 0],
      [-0.00054, 0],
      [0.00012, 2],
      [0.0041, 1],
      [0.00143, 1],
      [-0.00057, 0],
      [2e-5, 2],
      [2e-5, 2],
      [-0.00037, 0],
      [0.00257, 1],
      [5e-5, 2],
      [0.00267, 1],
      [-4e-5, 2]
    ]
  },
  "QS_mulNeuromadSite[C7]": {
    "red_x_points": [
      [0.00011, 2],
      [-0.00098, 0],
      [-0.00057, 0],
      [-0.00065, 0],
      [-0.00062, 0],
      [-0.00052, 0],
      [-0.00064, 0],
      [-2e-5, 2],
      [-0.00082, 0],
      [-0.00052, 0],
      [6e-5, 2],
      [-0.00073, 0],
      [-6e-5, 2],
      [-0.00084, 0],
      [-0.00092, 0],
      [6e-5, 2],
      [3e-5, 2],
      [6e-5, 2],
      [-0.00056, 0],
      [6e-5, 2],
      [2e-5, 2],
      [3e-5, 2],
      [-0.00065, 0],
      [-0.00072, 0],
      [-5e-5, 2],
      [0.00137, 1],
      [0.0, 2],
      [-0.00048, 0],
      [-8e-5, 2]
    ],
    "red_o_points": [],
    "y_categories": ["N", "NOT APPLICABLE", "nan"],
    "blue_o_points": [],
    "blue_x_points": [
      [0.00349, 1],
      [0.0001, 2],
      [-0.00039, 0],
      [-0.00055, 0],
      [8e-5, 2],
      [0.00175, 1],
      [0.00116, 1],
      [-0.00028, 0],
      [7e-5, 2],
      [1e-5, 2],
      [-0.0003, 0],
      [0.00181, 1],
      [6e-5, 2],
      [0.00158, 1],
      [6e-5, 2]
    ]
  },
  "QS_mulLysisRoot[C5]": {
    "red_x_points": [
      [-0.00042, 3],
      [-0.00277, 0],
      [-0.00737, 2],
      [-0.00223, 0],
      [-0.00207, 0],
      [-0.00186, 0],
      [-0.00212, 0],
      [-0.0005, 3],
      [-0.00248, 0],
      [-0.00199, 0],
      [-0.00031, 3],
      [-0.00255, 0],
      [-0.00058, 3],
      [-0.0026, 0],
      [-0.00317, 0],
      [-0.00059, 3],
      [-0.0004, 3],
      [-0.00037, 3],
      [-0.00189, 0],
      [-0.00041, 3],
      [-0.00053, 3],
      [-0.0007, 3],
      [-0.00223, 0],
      [-0.00209, 0],
      [-0.00057, 3],
      [0.00768, 1],
      [-0.00047, 3],
      [-0.0069, 2],
      [-0.00052, 3]
    ],
    "red_o_points": [],
    "y_categories": ["N", "NOT APPLICABLE", "Y", "nan"],
    "blue_o_points": [],
    "blue_x_points": [
      [0.01304, 1],
      [-0.00033, 3],
      [-0.00102, 0],
      [-0.00152, 0],
      [0.00018, 3],
      [0.00954, 1],
      [0.00794, 1],
      [-0.00154, 0],
      [-0.00024, 3],
      [-0.00013, 3],
      [-0.00102, 0],
      [0.00913, 1],
      [-0.00021, 3],
      [0.00945, 1],
      [-0.00027, 3]
    ]
  },
  "QS_mulGraftNerve[TD]": {
    "red_x_points": [
      [3e-5, 2],
      [-0.00018, 0],
      [-0.00012, 0],
      [-5e-5, 0],
      [-7e-5, 0],
      [-9e-5, 0],
      [-3e-5, 0],
      [-1e-5, 2],
      [-8e-5, 0],
      [-9e-5, 0],
      [-0.0, 2],
      [-0.00012, 0],
      [1e-5, 2],
      [-0.00018, 0],
      [-0.00012, 0],
      [-0.0, 2],
      [0.0, 2],
      [-0.0, 2],
      [-6e-5, 0],
      [0.0, 2],
      [1e-5, 2],
      [3e-5, 2],
      [-8e-5, 0],
      [-0.00014, 0],
      [1e-5, 2],
      [0.00023, 1],
      [0.0, 2],
      [-7e-5, 0],
      [4e-5, 2]
    ],
    "red_o_points": [],
    "y_categories": ["N", "NOT APPLICABLE", "nan"],
    "blue_o_points": [],
    "blue_x_points": [
      [0.00061, 1],
      [3e-5, 2],
      [-7e-5, 0],
      [-6e-5, 0],
      [1e-5, 2],
      [0.00023, 1],
      [0.00019, 1],
      [-3e-5, 0],
      [2e-5, 2],
      [1e-5, 2],
      [-9e-5, 0],
      [0.0001, 1],
      [-0.0, 2],
      [0.00019, 1],
      [-0.0, 2]
    ]
  },
  "QA_intPexForearmSupin": {
    "red_x_points": [
      [-0.00105, 2],
      [-0.00367, 0],
      [-0.00075, 2],
      [-0.0003, 2],
      [-0.00092, 2],
      [0.00418, 1],
      [-0.00102, 2],
      [0.00166, 1],
      [-0.00131, 2],
      [-0.00117, 2],
      [-0.00579, 0],
      [-0.0067, 0],
      [-0.00064, 2],
      [-0.00121, 2],
      [-0.00023, 2],
      [0.00394, 1],
      [-0.00628, 0],
      [0.00112, 1],
      [0.00133, 1],
      [-0.00057, 2],
      [-0.00062, 2],
      [-0.00077, 2],
      [-0.00151, 2],
      [-0.00142, 2],
      [-1e-5, 2],
      [-0.02121, 1],
      [-0.00023, 2],
      [-0.00343, 0],
      [-0.00087, 2]
    ],
    "red_o_points": [],
    "y_categories": ["GREATER THAN OR EQUALS TO 80", "LESS THAN 80", "nan"],
    "blue_o_points": [],
    "blue_x_points": [
      [0.00345, 2],
      [0.0072, 1],
      [0.00828, 1],
      [-0.00101, 2],
      [4e-5, 2],
      [0.00419, 2],
      [0.00551, 0],
      [-0.00055, 2],
      [-0.00048, 2],
      [0.0001, 2],
      [0.00847, 1],
      [0.00374, 2],
      [0.00017, 2],
      [0.00415, 2],
      [0.00621, 1]
    ]
  },
  "QS_mulGraftNerve[SS]": {
    "red_x_points": [
      [2e-5, 2],
      [-0.00016, 0],
      [-0.00016, 0],
      [-0.00012, 0],
      [-0.00017, 0],
      [-0.00012, 0],
      [-0.00018, 0],
      [-0.0, 2],
      [-0.00019, 0],
      [-0.00027, 0],
      [-3e-5, 2],
      [-0.0002, 0],
      [2e-5, 2],
      [-0.00025, 0],
      [-0.00023, 0],
      [-1e-5, 2],
      [-1e-5, 2],
      [0.0, 2],
      [-0.00014, 0],
      [-3e-5, 2],
      [-6e-5, 2],
      [-1e-5, 2],
      [-0.00014, 0],
      [-0.00022, 0],
      [-6e-5, 2],
      [0.00034, 1],
      [-4e-5, 2],
      [-0.00015, 0],
      [-3e-5, 2]
    ],
    "red_o_points": [],
    "y_categories": ["N", "NOT APPLICABLE", "nan"],
    "blue_o_points": [],
    "blue_x_points": [
      [0.00088, 1],
      [2e-5, 2],
      [-9e-5, 0],
      [-0.00011, 0],
      [-1e-5, 2],
      [0.00085, 1],
      [0.00045, 1],
      [-0.00015, 0],
      [-2e-5, 2],
      [4e-5, 2],
      [-3e-5, 0],
      [0.00045, 1],
      [0.0, 2],
      [0.0003, 1],
      [-0.0, 2]
    ]
  },
  "QA_lstPexArthre[Index]": {
    "red_x_points": [
      [-0.01236, 0],
      [-0.00521, 2],
      [-0.00332, 2],
      [-0.00703, 0],
      [-0.00949, 0],
      [0.00758, 1],
      [-0.00824, 0],
      [0.00038, 2],
      [0.00929, 1],
      [-0.01294, 0],
      [0.00323, 1],
      [-0.00682, 2],
      [0.00027, 2],
      [0.00927, 1],
      [-0.00302, 2],
      [0.00348, 1],
      [-0.00909, 0],
      [0.00285, 1],
      [-0.00454, 2],
      [-0.01037, 0],
      [0.00021, 2],
      [0.00023, 2],
      [-0.00662, 2],
      [-0.00593, 2],
      [0.0025, 1],
      [-0.00116, 2],
      [0.00011, 2],
      [-0.0062, 0],
      [0.00013, 2]
    ],
    "red_o_points": [],
    "y_categories": ["NPV", "PV", "nan"],
    "blue_o_points": [],
    "blue_x_points": [
      [-0.00017, 0],
      [0.00093, 2],
      [0.01273, 1],
      [0.01416, 1],
      [0.00199, 2],
      [-0.00028, 2],
      [0.00239, 1],
      [0.01187, 1],
      [0.00135, 2],
      [0.00109, 2],
      [0.01195, 1],
      [0.00234, 1],
      [0.00501, 1],
      [-0.00017, 2],
      [0.00758, 1]
    ]
  },
  "QS_mulTransfSite[IMc]": {
    "red_x_points": [
      [-0.00114, 3],
      [-0.01708, 2],
      [-0.00326, 0],
      [-0.01497, 2],
      [-0.00307, 0],
      [-0.0028, 0],
      [-0.00317, 0],
      [-0.00134, 3],
      [-0.00277, 0],
      [-0.00286, 0],
      [-0.00124, 3],
      [-0.00297, 0],
      [-0.00135, 3],
      [-0.00455, 0],
      [-0.01468, 2],
      [-0.00139, 3],
      [-0.00102, 3],
      [-0.00107, 3],
      [-0.00291, 0],
      [-0.001, 3],
      [-0.00148, 3],
      [-0.0012, 3],
      [-0.0028, 0],
      [-0.01688, 2],
      [-0.00126, 3],
      [0.01836, 1],
      [-0.00126, 3],
      [-0.01587, 2],
      [-0.00143, 3]
    ],
    "red_o_points": [],
    "y_categories": ["N", "NOT APPLICABLE", "Y", "nan"],
    "blue_o_points": [],
    "blue_x_points": [
      [0.02888, 1],
      [-0.00085, 3],
      [-0.0009, 0],
      [-0.00034, 0],
      [-0.00072, 3],
      [0.02489, 1],
      [0.02026, 1],
      [-0.00223, 0],
      [-0.00074, 3],
      [-0.00077, 3],
      [-0.00086, 0],
      [0.02241, 1],
      [-0.00082, 3],
      [0.02122, 1],
      [-0.00094, 3]
    ]
  },
  "QS_mulLysisRoot[C7]": {
    "red_x_points": [
      [-0.00021, 3],
      [-0.00109, 0],
      [-0.00424, 2],
      [-0.00114, 0],
      [-0.00109, 0],
      [-0.00078, 0],
      [-0.00114, 0],
      [-0.0003, 3],
      [-0.00092, 0],
      [-0.00071, 0],
      [-0.00014, 3],
      [-0.00106, 0],
      [-0.00042, 3],
      [-0.00139, 0],
      [-0.00083, 0],
      [-0.00018, 3],
      [-0.00022, 3],
      [-0.00023, 3],
      [-0.00078, 0],
      [-0.00018, 3],
      [-0.00038, 3],
      [-0.00039, 3],
      [-0.00099, 0],
      [-0.00078, 0],
      [-0.00045, 3],
      [0.00288, 1],
      [-0.0004, 3],
      [-0.00067, 0],
      [-0.00041, 3]
    ],
    "red_o_points": [],
    "y_categories": ["N", "NOT APPLICABLE", "Y", "nan"],
    "blue_o_points": [],
    "blue_x_points": [
      [0.00607, 1],
      [-0.0003, 3],
      [-0.00033, 0],
      [-0.00056, 0],
      [-0.00013, 3],
      [0.00411, 1],
      [0.0032, 1],
      [-0.00078, 0],
      [-0.00025, 3],
      [-0.00013, 3],
      [-0.00033, 0],
      [0.00414, 1],
      [-0.00012, 3],
      [0.00423, 1],
      [-0.00017, 3]
    ]
  },
  "QS_lstBpsurgSide": {
    "red_x_points": [
      [-0.00086, 3],
      [-0.01035, 0],
      [-0.00999, 0],
      [-0.00872, 0],
      [-0.01031, 0],
      [-0.0109, 0],
      [-0.00961, 0],
      [-0.00077, 3],
      [-0.0119, 0],
      [0.0002, 2],
      [-0.00074, 3],
      [-0.00092, 2],
      [-0.0011, 3],
      [-0.00043, 2],
      [-0.00198, 2],
      [-0.00096, 3],
      [-0.00066, 3],
      [-0.00065, 3],
      [-0.00745, 0],
      [-0.00058, 3],
      [-0.00092, 3],
      [-0.0009, 3],
      [-6e-5, 2],
      [0.0003, 2],
      [-0.00093, 3],
      [0.01264, 1],
      [-0.001, 3],
      [-0.0092, 0],
      [-0.00102, 3]
    ],
    "red_o_points": [],
    "y_categories": ["L", "NOT APPLICABLE", "R", "nan"],
    "blue_o_points": [],
    "blue_x_points": [
      [0.02175, 1],
      [-0.00045, 3],
      [0.00375, 2],
      [0.00484, 2],
      [0.0002, 3],
      [0.01726, 1],
      [0.01418, 1],
      [-0.00302, 0],
      [-0.00036, 3],
      [-0.0003, 3],
      [0.00294, 2],
      [0.01524, 1],
      [-0.00039, 3],
      [0.01459, 1],
      [-0.00046, 3]
    ]
  },
  "QS_mulLysisRoot[C6]": {
    "red_x_points": [
      [-0.00067, 3],
      [-0.00405, 0],
      [-0.01025, 2],
      [-0.00284, 0],
      [-0.0027, 0],
      [-0.00245, 0],
      [-0.00292, 0],
      [-0.00079, 3],
      [-0.00306, 0],
      [-0.00268, 0],
      [-0.00071, 3],
      [-0.00318, 0],
      [-0.00064, 3],
      [-0.00376, 0],
      [-0.00373, 0],
      [-0.00068, 3],
      [-0.00055, 3],
      [-0.00068, 3],
      [-0.00259, 0],
      [-0.00083, 3],
      [-0.00054, 3],
      [-0.00073, 3],
      [-0.00309, 0],
      [-0.0028, 0],
      [-0.00075, 3],
      [0.0097, 1],
      [-0.00099, 3],
      [-0.00927, 2],
      [-0.00092, 3]
    ],
    "red_o_points": [],
    "y_categories": ["N", "NOT APPLICABLE", "Y", "nan"],
    "blue_o_points": [],
    "blue_x_points": [
      [0.01926, 1],
      [-0.00056, 3],
      [-0.00144, 0],
      [-0.00186, 0],
      [-6e-5, 3],
      [0.01362, 1],
      [0.01079, 1],
      [-0.00185, 0],
      [-0.00013, 3],
      [-0.00017, 3],
      [-0.0016, 0],
      [0.01211, 1],
      [-0.00062, 3],
      [0.01217, 1],
      [-0.00052, 3]
    ]
  },
  "QS_mulTransfSite[AcMc]": {
    "red_x_points": [
      [-0.00023, 3],
      [-0.00251, 0],
      [-0.00158, 0],
      [-0.00114, 0],
      [-0.00157, 0],
      [-0.00122, 0],
      [-0.00173, 0],
      [-0.00033, 3],
      [-0.00166, 0],
      [-0.00905, 2],
      [-0.00021, 3],
      [-0.00149, 0],
      [-0.00037, 3],
      [-0.00197, 0],
      [-0.00231, 0],
      [-0.0005, 3],
      [-0.0002, 3],
      [-0.00044, 3],
      [-0.00141, 0],
      [-0.00049, 3],
      [-0.00018, 3],
      [-0.00026, 3],
      [-0.00156, 0],
      [-0.00167, 0],
      [-0.00026, 3],
      [0.00434, 1],
      [-0.00039, 3],
      [-0.0014, 0],
      [-0.00034, 3]
    ],
    "red_o_points": [],
    "y_categories": ["N", "NOT APPLICABLE", "Y", "nan"],
    "blue_o_points": [],
    "blue_x_points": [
      [0.0096, 1],
      [-0.00013, 3],
      [0.00142, 0],
      [0.00084, 0],
      [-0.0001, 3],
      [0.00694, 1],
      [0.00439, 1],
      [-0.0011, 0],
      [-0.00017, 3],
      [1e-5, 3],
      [2e-5, 0],
      [0.00534, 1],
      [-0.00024, 3],
      [0.00566, 1],
      [-0.00032, 3]
    ]
  },
  "QS_mulTransfSite[Other]": {
    "red_x_points": [
      [-0.00139, 3],
      [-0.0093, 0],
      [-0.00786, 0],
      [-0.00761, 0],
      [-0.00817, 0],
      [-0.00827, 0],
      [-0.00804, 0],
      [-0.00146, 3],
      [-0.00891, 0],
      [-0.00833, 0],
      [-0.00146, 3],
      [-0.00883, 0],
      [-0.00147, 3],
      [-0.00928, 0],
      [-0.00839, 0],
      [-0.00161, 3],
      [-0.00138, 3],
      [-0.00121, 3],
      [-0.00755, 0],
      [-0.00144, 3],
      [-0.00161, 3],
      [-0.00139, 3],
      [-0.00869, 0],
      [-0.0087, 0],
      [-0.00148, 3],
      [0.01793, 1],
      [-0.00133, 3],
      [-0.00807, 0],
      [-0.00138, 3]
    ],
    "red_o_points": [],
    "y_categories": ["N", "NOT APPLICABLE", "Y", "nan"],
    "blue_o_points": [],
    "blue_x_points": [
      [0.02905, 1],
      [-0.001, 3],
      [-0.00712, 0],
      [-0.0075, 0],
      [-0.00084, 3],
      [0.02318, 1],
      [0.01988, 1],
      [-0.00658, 0],
      [-0.00074, 3],
      [-0.00082, 3],
      [0.04032, 2],
      [0.02124, 1],
      [-0.00099, 3],
      [0.01973, 1],
      [-0.00111, 3]
    ]
  },
  "QA_yonInjBpsurg": {
    "red_x_points": [
      [-0.00058, 1],
      [-0.00054, 1],
      [-0.00039, 1],
      [-0.00048, 1],
      [-0.00061, 1],
      [-0.00042, 1],
      [-0.00068, 1],
      [-0.00064, 1],
      [-0.00069, 1],
      [-0.00041, 1],
      [-0.00046, 1],
      [-0.00033, 1],
      [-0.00076, 1],
      [-0.00066, 1],
      [-0.00048, 1],
      [-0.00046, 1],
      [-0.00046, 1],
      [-0.00039, 1],
      [-0.00035, 1],
      [-0.00045, 1],
      [-0.0008, 1],
      [-0.00063, 1],
      [-0.00039, 1],
      [-0.00039, 1],
      [-0.00072, 1],
      [0.00197, 0],
      [-0.00064, 1],
      [-0.00035, 1],
      [-0.0007, 1]
    ],
    "red_o_points": [],
    "y_categories": ["N", "Y", "nan"],
    "blue_o_points": [],
    "blue_x_points": [
      [0.00464, 0],
      [-0.00045, 1],
      [-0.00049, 1],
      [-0.00067, 1],
      [-0.00043, 1],
      [0.00302, 0],
      [0.00283, 0],
      [-0.00048, 1],
      [-0.00048, 1],
      [-0.00018, 1],
      [-0.00047, 1],
      [0.00386, 0],
      [-0.0003, 1],
      [0.00271, 0],
      [-0.00025, 1]
    ]
  },
  "QA_lstPexTouch[C8]": {
    "red_x_points": [
      [-0.00283, 1],
      [-0.00435, 2],
      [-0.00254, 1],
      [-0.00195, 1],
      [-0.00556, 2],
      [-0.00378, 1],
      [-0.00298, 1],
      [-0.00302, 0],
      [-0.00635, 1],
      [0.00957, 0],
      [-0.0015, 1],
      [-0.00902, 2],
      [-0.00121, 2],
      [-0.00772, 2],
      [-0.00319, 2],
      [-0.00227, 0],
      [-0.00174, 1],
      [-0.00219, 0],
      [-0.00389, 2],
      [-0.00215, 0],
      [-0.00161, 2],
      [-0.00498, 0],
      [-0.00575, 1],
      [-0.00775, 2],
      [-0.0026, 0],
      [-0.00609, 1],
      [-0.00099, 2],
      [-0.00213, 1],
      [-0.00167, 1]
    ],
    "red_o_points": [],
    "y_categories": ["NORM", "NPV", "nan"],
    "blue_o_points": [],
    "blue_x_points": [
      [0.00383, 0],
      [0.00643, 1],
      [0.01922, 0],
      [0.02073, 0],
      [0.00476, 2],
      [0.00089, 2],
      [-0.0013, 1],
      [0.00919, 1],
      [0.00423, 2],
      [0.01699, 0],
      [-0.00021, 1],
      [-2e-5, 0],
      [0.00315, 0],
      [0.00433, 0]
    ]
  },
  "QS_mulNeuromadSite[T1]": {
    "red_x_points": [
      [-8e-5, 2],
      [-0.00126, 0],
      [-0.00048, 0],
      [-0.00058, 0],
      [-0.00058, 0],
      [-0.00061, 0],
      [-0.00061, 0],
      [-0.00015, 2],
      [-0.00071, 0],
      [-0.00056, 0],
      [-4e-5, 2],
      [-0.00077, 0],
      [2e-5, 2],
      [-0.0014, 0],
      [-0.00128, 0],
      [-2e-5, 2],
      [-7e-5, 2],
      [-2e-5, 2],
      [-0.00071, 0],
      [-2e-5, 2],
      [-3e-5, 2],
      [-7e-5, 2],
      [-0.0007, 0],
      [-0.00066, 0],
      [-0.00014, 2],
      [0.00188, 1],
      [-0.00011, 2],
      [-0.00059, 0],
      [-6e-5, 2]
    ],
    "red_o_points": [],
    "y_categories": ["N", "NOT APPLICABLE", "nan"],
    "blue_o_points": [],
    "blue_x_points": [
      [0.00336, 1],
      [-1e-5, 2],
      [-0.00046, 0],
      [-0.00058, 0],
      [0.00017, 2],
      [0.00313, 1],
      [0.0014, 1],
      [-0.00032, 0],
      [7e-5, 2],
      [7e-5, 2],
      [-0.00041, 0],
      [0.00221, 1],
      [8e-5, 2],
      [0.00171, 1],
      [-3e-5, 2]
    ]
  },
  "QS_mulBpsurgeryType[Graft]": {
    "red_x_points": [
      [-0.00014, 3],
      [-0.00117, 0],
      [-0.00091, 0],
      [-0.00103, 0],
      [-0.0009, 0],
      [-0.00087, 0],
      [-0.00108, 0],
      [-0.00013, 3],
      [-0.00084, 0],
      [-0.00089, 0],
      [-0.00015, 3],
      [-0.00109, 0],
      [-0.00019, 3],
      [-0.00508, 2],
      [-0.00102, 0],
      [-0.00013, 3],
      [-0.00017, 3],
      [-0.00016, 3],
      [-0.00085, 0],
      [-0.00013, 3],
      [-0.00012, 3],
      [-0.00012, 3],
      [-0.00096, 0],
      [-0.00099, 0],
      [-0.00022, 3],
      [0.00303, 1],
      [-0.0002, 3],
      [-0.00094, 0],
      [-0.00018, 3]
    ],
    "red_o_points": [],
    "y_categories": ["N", "NOT APPLICABLE", "Y", "nan"],
    "blue_o_points": [],
    "blue_x_points": [
      [0.0042, 1],
      [-9e-5, 3],
      [-0.00026, 0],
      [-0.00031, 0],
      [-0.0001, 3],
      [0.0041, 1],
      [0.00362, 1],
      [-0.00052, 0],
      [-0.00013, 3],
      [-8e-5, 3],
      [-0.00055, 0],
      [0.00395, 1],
      [-5e-5, 3],
      [0.00398, 1],
      [-0.00012, 3]
    ]
  },
  "QA_lstPexMuscstrength[WristExte]": {
    "red_x_points": [
      [-0.0054, 1],
      [-0.00354, 2],
      [-0.00347, 1],
      [-0.00327, 1],
      [-0.00475, 1],
      [-0.00556, 1],
      [-0.00426, 1],
      [-0.00089, 0],
      [0.00565, 0],
      [-0.00725, 1],
      [-0.0002, 0],
      [0.00489, 0],
      [-0.00243, 2],
      [-0.00596, 2],
      [-0.00194, 2],
      [-0.00126, 0],
      [-0.00171, 1],
      [-0.00148, 0],
      [-0.00452, 1],
      [-0.00493, 1],
      [-0.00215, 2],
      [-0.00544, 1],
      [0.0048, 0],
      [0.00423, 0],
      [-0.00204, 2],
      [-0.00088, 2],
      [-0.00319, 1],
      [-0.00251, 1],
      [-0.00182, 2]
    ],
    "red_o_points": [],
    "y_categories": ["GREATER THAN OR EQUALS TO 3", "LESS THAN 3", "nan"],
    "blue_o_points": [],
    "blue_x_points": [
      [0.00209, 0],
      [0.00307, 1],
      [0.00732, 0],
      [0.00817, 0],
      [0.00154, 2],
      [-0.00013, 2],
      [0.00087, 0],
      [0.00698, 0],
      [0.01362, 0],
      [0.00044, 2],
      [0.00613, 0],
      [-0.0003, 1],
      [0.00591, 0],
      [0.00153, 0],
      [0.00399, 1]
    ]
  },
  "QS_mulNeuromadSite[C6]": {
    "red_x_points": [
      [-4e-5, 2],
      [-0.00053, 0],
      [-0.00057, 0],
      [-0.00039, 0],
      [-0.00052, 0],
      [-0.00036, 0],
      [-0.00051, 0],
      [-2e-5, 2],
      [-0.00051, 0],
      [-0.00036, 0],
      [1e-5, 2],
      [-0.00061, 0],
      [0.0, 2],
      [-0.00072, 0],
      [-0.0006, 0],
      [-0.0, 2],
      [-0.0, 2],
      [-1e-5, 2],
      [-0.00041, 0],
      [-5e-5, 2],
      [-1e-5, 2],
      [-8e-5, 2],
      [-0.00047, 0],
      [-0.00045, 0],
      [-6e-5, 2],
      [0.00105, 1],
      [-2e-5, 2],
      [-0.00035, 0],
      [-4e-5, 2]
    ],
    "red_o_points": [],
    "y_categories": ["N", "NOT APPLICABLE", "nan"],
    "blue_o_points": [],
    "blue_x_points": [
      [0.00282, 1],
      [-4e-5, 2],
      [-0.0002, 0],
      [-0.00039, 0],
      [8e-5, 2],
      [0.00153, 1],
      [0.0008, 1],
      [-0.00029, 0],
      [-0.0, 2],
      [6e-5, 2],
      [-0.0002, 0],
      [0.00105, 1],
      [0.0, 2],
      [0.00141, 1],
      [-0.0, 2]
    ]
  },
  "QA_lstPexPalle[Clavicle]": {
    "red_x_points": [
      [-0.00019, 3],
      [-0.0015, 3],
      [-0.00087, 3],
      [0.00138, 2],
      [-0.00156, 3],
      [0.00255, 2],
      [-0.00137, 3],
      [-8e-5, 3],
      [-0.00215, 3],
      [0.00283, 2],
      [-0.01169, 0],
      [-0.00206, 3],
      [6e-5, 3],
      [-0.00208, 3],
      [-0.00055, 3],
      [-0.01348, 0],
      [-0.01279, 0],
      [0.00999, 2],
      [-0.00315, 1],
      [-0.0146, 1],
      [-7e-5, 3],
      [-0.00027, 3],
      [-0.00201, 3],
      [-0.00195, 3],
      [-8e-5, 3],
      [-0.0209, 2],
      [9e-5, 3],
      [-0.00153, 0],
      [-0.0, 3]
    ],
    "red_o_points": [],
    "y_categories": ["HYPO", "NAIA", "PT", "nan"],
    "blue_o_points": [],
    "blue_x_points": [
      [0.00404, 3],
      [0.0005, 3],
      [0.00596, 2],
      [0.00615, 2],
      [0.00079, 3],
      [0.00383, 3],
      [0.00509, 0],
      [-0.00144, 3],
      [0.0006, 3],
      [0.00057, 3],
      [0.008, 0],
      [0.00385, 3],
      [0.01543, 2],
      [0.00428, 3],
      [0.02036, 2]
    ]
  },
  "QS_mulGraftNerve[LT]": {
    "red_x_points": [
      [0.0, 2],
      [-0.00027, 0],
      [-8e-5, 0],
      [-0.0001, 0],
      [-0.0001, 0],
      [-0.00011, 0],
      [-0.00015, 0],
      [-2e-5, 2],
      [-0.0001, 0],
      [-0.00016, 0],
      [-4e-5, 2],
      [-0.00021, 0],
      [-4e-5, 2],
      [-0.00022, 0],
      [-0.00012, 0],
      [-4e-5, 2],
      [1e-5, 2],
      [-0.0, 2],
      [-0.0001, 0],
      [-1e-5, 2],
      [-2e-5, 2],
      [-1e-5, 2],
      [-5e-5, 0],
      [-5e-5, 0],
      [-3e-5, 2],
      [0.00016, 1],
      [1e-5, 2],
      [-8e-5, 0],
      [-4e-5, 2]
    ],
    "red_o_points": [],
    "y_categories": ["N", "NOT APPLICABLE", "nan"],
    "blue_o_points": [],
    "blue_x_points": [
      [0.00077, 1],
      [0.0, 2],
      [-3e-5, 0],
      [-3e-5, 0],
      [0.0, 2],
      [0.00047, 1],
      [0.00023, 1],
      [-8e-5, 0],
      [-6e-5, 2],
      [1e-5, 2],
      [0.00038, 1],
      [-0.0, 2],
      [0.00033, 1],
      [-1e-5, 2]
    ]
  },
  "QA_lstPexMuscstrength[ShoulderAbduc]": {
    "red_x_points": [
      [-0.00025, 1],
      [-0.00015, 1],
      [-0.00017, 1],
      [-0.00017, 1],
      [-9e-5, 1],
      [-0.00018, 1],
      [-0.00019, 1],
      [-0.00018, 1],
      [-0.00033, 1],
      [-0.00011, 1],
      [-0.00019, 1],
      [-0.00014, 1],
      [0.00011, 2],
      [5e-5, 2],
      [0.00014, 2],
      [-0.00024, 1],
      [-0.00017, 1],
      [-0.00028, 1],
      [-0.00014, 1],
      [0.00012, 2],
      [0.00011, 2],
      [-0.00021, 1],
      [-0.00011, 1],
      [-0.00019, 1],
      [-0.00018, 1],
      [0.00018, 2],
      [-0.00037, 1],
      [-0.00014, 1],
      [0.00015, 2]
    ],
    "red_o_points": [],
    "y_categories": ["GREATER THAN OR EQUALS TO 3", "LESS THAN 3", "nan"],
    "blue_o_points": [],
    "blue_x_points": [
      [0.00013, 2],
      [-0.0002, 1],
      [-0.00022, 1],
      [-0.00027, 1],
      [0.00016, 2],
      [0.00011, 2],
      [0.00136, 0],
      [0.00017, 2],
      [0.00016, 2],
      [0.00014, 2],
      [-0.00023, 1],
      [0.00244, 0],
      [-0.00021, 1],
      [-7e-5, 1],
      [-0.00016, 1]
    ]
  },
  "QA_yonInjPhysio": {
    "red_x_points": [
      [-0.00758, 0],
      [0.00053, 0],
      [5e-5, 0],
      [9e-5, 0],
      [-0.0014, 2],
      [0.00018, 0],
      [0.00046, 0],
      [-0.00595, 0],
      [0.00081, 0],
      [-0.00581, 1],
      [-0.00523, 0],
      [0.00081, 0],
      [-0.00788, 0],
      [-0.00404, 1],
      [-0.00114, 1],
      [0.00361, 1],
      [-0.00615, 0],
      [0.00343, 1],
      [0.00035, 0],
      [-0.00568, 0],
      [0.0038, 1],
      [0.00372, 1],
      [0.00103, 0],
      [-0.00644, 1],
      [-0.00887, 2],
      [-0.01158, 1],
      [-0.00827, 2],
      [0.0001, 0],
      [0.00442, 1]
    ],
    "red_o_points": [],
    "y_categories": ["N", "Y", "nan"],
    "blue_o_points": [],
    "blue_x_points": [
      [0.0046, 0],
      [0.00758, 1],
      [0.00425, 0],
      [0.00546, 0],
      [0.0075, 1],
      [0.00458, 0],
      [0.00243, 0],
      [0.00175, 0],
      [-0.00085, 0],
      [0.00655, 1],
      [0.00408, 0],
      [0.00291, 0],
      [0.00596, 1],
      [-0.00219, 1],
      [0.00801, 1]
    ]
  },
  "QA_lstPexTouch[C7]": {
    "red_x_points": [
      [-0.00216, 1],
      [-0.0072, 2],
      [-0.00324, 1],
      [-0.00306, 1],
      [-0.00895, 2],
      [-0.00457, 1],
      [-0.00423, 1],
      [-0.00337, 0],
      [-0.00632, 1],
      [-0.00677, 1],
      [-0.00096, 1],
      [-0.01106, 2],
      [-0.00225, 2],
      [-0.01077, 2],
      [-0.00502, 2],
      [-0.00241, 0],
      [-0.00156, 1],
      [-0.00296, 0],
      [-0.00669, 2],
      [-0.00245, 0],
      [-0.00174, 2],
      [-0.00527, 0],
      [-0.00612, 1],
      [-0.01043, 2],
      [-0.0039, 0],
      [-0.00304, 1],
      [-0.00058, 2],
      [-0.00246, 1],
      [0.00027, 1]
    ],
    "red_o_points": [],
    "y_categories": ["NORM", "NPV", "nan"],
    "blue_o_points": [],
    "blue_x_points": [
      [-0.00013, 1],
      [0.00733, 1],
      [0.0314, 0],
      [0.03834, 0],
      [0.00595, 2],
      [0.00033, 2],
      [1e-5, 1],
      [-0.00253, 1],
      [0.00795, 1],
      [0.00502, 2],
      [0.02859, 0],
      [0.00015, 1],
      [0.00011, 0],
      [0.00264, 0],
      [0.00409, 0]
    ]
  },
  "QA_lstPexMuscstrength[ShoulderExrot]": {
    "red_x_points": [
      [-0.00018, 1],
      [-0.00051, 2],
      [-0.00173, 0],
      [-0.00019, 2],
      [0.00037, 1],
      [0.00032, 1],
      [-0.00033, 2],
      [-3e-5, 1],
      [0.00046, 1],
      [-0.00132, 2],
      [-9e-5, 1],
      [-0.00105, 2],
      [3e-5, 2],
      [-0.00113, 2],
      [-0.00069, 2],
      [-0.00025, 1],
      [-0.0, 1],
      [-0.00023, 1],
      [-0.00039, 2],
      [-3e-5, 2],
      [0.0, 2],
      [2e-5, 2],
      [0.00109, 1],
      [-0.0067, 0],
      [8e-5, 2],
      [-4e-5, 2],
      [9e-5, 2],
      [0.00013, 1]
    ],
    "red_o_points": [],
    "y_categories": ["GREATER THAN OR EQUALS TO 3", "LESS THAN 3", "nan"],
    "blue_o_points": [],
    "blue_x_points": [
      [0.00014, 2],
      [0.00351, 1],
      [0.00373, 1],
      [0.0006, 0],
      [0.00032, 2],
      [0.00025, 2],
      [0.00287, 1],
      [0.00071, 0],
      [9e-5, 2],
      [6e-5, 2]
    ]
  },
  "QS_mulGraftNerve[IS]": {
    "red_x_points": [
      [1e-5, 2],
      [-0.00012, 0],
      [-5e-5, 0],
      [-4e-5, 0],
      [-9e-5, 0],
      [-9e-5, 0],
      [-9e-5, 0],
      [2e-5, 2],
      [-9e-5, 0],
      [-9e-5, 0],
      [1e-5, 2],
      [-0.00012, 0],
      [-1e-5, 2],
      [-0.00012, 0],
      [-0.0002, 0],
      [-0.0, 2],
      [1e-5, 2],
      [2e-5, 2],
      [-4e-5, 0],
      [1e-5, 2],
      [-2e-5, 2],
      [-2e-5, 2],
      [-9e-5, 0],
      [-9e-5, 0],
      [1e-5, 2],
      [0.0002, 1],
      [1e-5, 2],
      [-9e-5, 0],
      [-2e-5, 2]
    ],
    "red_o_points": [],
    "y_categories": ["N", "NOT APPLICABLE", "nan"],
    "blue_o_points": [],
    "blue_x_points": [
      [0.00049, 1],
      [1e-5, 2],
      [-5e-5, 0],
      [-4e-5, 0],
      [0.0, 2],
      [0.00033, 1],
      [9e-5, 1],
      [-7e-5, 0],
      [2e-5, 2],
      [0.0, 2],
      [-5e-5, 0],
      [0.00013, 1],
      [2e-5, 2],
      [0.00022, 1],
      [2e-5, 2]
    ]
  },
  "QS_mulGraftNerve[MC]": {
    "red_x_points": [
      [-2e-5, 2],
      [-8e-5, 0],
      [-6e-5, 0],
      [-4e-5, 0],
      [-0.00011, 0],
      [-4e-5, 0],
      [-0.00011, 0],
      [-1e-5, 2],
      [-0.0001, 0],
      [-6e-5, 0],
      [-3e-5, 2],
      [-6e-5, 0],
      [-5e-5, 2],
      [-9e-5, 0],
      [-5e-5, 0],
      [-3e-5, 2],
      [-2e-5, 2],
      [-3e-5, 2],
      [-0.00011, 2],
      [-5e-5, 2],
      [0.0, 2],
      [-7e-5, 0],
      [-0.00011, 0],
      [-3e-5, 2],
      [0.0001, 1],
      [-2e-5, 2],
      [-5e-5, 0],
      [-0.00015, 2]
    ],
    "red_o_points": [],
    "y_categories": ["N", "NOT APPLICABLE", "nan"],
    "blue_o_points": [],
    "blue_x_points": [
      [0.00055, 1],
      [0.0, 2],
      [-6e-5, 0],
      [-1e-5, 0],
      [-3e-5, 2],
      [0.00035, 1],
      [0.00023, 1],
      [-3e-5, 0],
      [1e-5, 2],
      [-3e-5, 2],
      [-6e-5, 0],
      [0.00023, 1],
      [-0.0, 2],
      [0.00037, 1],
      [-3e-5, 2]
    ]
  },
  "QS_mulLysisNerve[Ssr]": {
    "red_x_points": [
      [-0.00034, 3],
      [-0.0042, 0],
      [-0.00756, 2],
      [-0.00788, 2],
      [-0.00257, 0],
      [-0.00208, 0],
      [-0.00239, 0],
      [-0.00044, 3],
      [-0.00276, 0],
      [-0.00209, 0],
      [-0.00049, 3],
      [-0.00288, 0],
      [-0.00069, 3],
      [-0.0038, 0],
      [-0.00386, 0],
      [-0.00029, 3],
      [-0.00036, 3],
      [-0.00055, 3],
      [-0.00189, 0],
      [-0.00037, 3],
      [-0.00072, 3],
      [-0.00061, 3],
      [-0.00297, 0],
      [-0.0028, 0],
      [-0.00054, 3],
      [0.00879, 1],
      [-0.00054, 3],
      [-0.00208, 0],
      [-0.00071, 3]
    ],
    "red_o_points": [],
    "y_categories": ["N", "NOT APPLICABLE", "Y", "nan"],
    "blue_o_points": [],
    "blue_x_points": [
      [0.01598, 1],
      [-0.00033, 3],
      [-0.00144, 0],
      [-0.00152, 0],
      [-5e-5, 3],
      [0.0139, 1],
      [0.00844, 1],
      [-0.0018, 0],
      [-0.00017, 3],
      [-9e-5, 3],
      [-0.00149, 0],
      [0.0096, 1],
      [-0.00025, 3],
      [0.00915, 1],
      [-0.00027, 3]
    ]
  },
  "QS_mulNeuromadSite[C4]": {
    "red_x_points": [
      [-5e-5, 2],
      [-0.0005, 0],
      [-0.00025, 0],
      [-0.00029, 0],
      [-0.00022, 0],
      [-0.00029, 0],
      [-0.00028, 0],
      [-2e-5, 2],
      [-0.00026, 0],
      [-0.00028, 0],
      [-5e-5, 2],
      [-0.00029, 0],
      [-5e-5, 2],
      [-0.00049, 0],
      [-0.00036, 0],
      [-9e-5, 2],
      [-3e-5, 2],
      [-5e-5, 2],
      [-0.00031, 0],
      [-6e-5, 2],
      [-7e-5, 2],
      [-3e-5, 2],
      [-0.00032, 0],
      [-0.00029, 0],
      [-8e-5, 2],
      [0.00098, 1],
      [-2e-5, 2],
      [-0.00027, 0],
      [-5e-5, 2]
    ],
    "red_o_points": [],
    "y_categories": ["N", "NOT APPLICABLE", "nan"],
    "blue_o_points": [],
    "blue_x_points": [
      [0.00128, 1],
      [-1e-5, 2],
      [-0.00019, 0],
      [-0.00024, 0],
      [2e-5, 2],
      [0.00119, 1],
      [0.00088, 1],
      [-0.00024, 0],
      [-1e-5, 2],
      [-3e-5, 2],
      [-0.00022, 0],
      [0.00103, 1],
      [-6e-5, 2],
      [0.00102, 1],
      [-6e-5, 2]
    ]
  },
  "QS_mulGraftNerve[Ra]": {
    "red_x_points": [
      [0.0, 2],
      [-0.00037, 0],
      [-0.00028, 0],
      [-0.00013, 0],
      [-0.00016, 0],
      [-0.00027, 0],
      [-0.00024, 0],
      [-5e-5, 2],
      [-0.00025, 0],
      [-0.00027, 0],
      [-2e-5, 2],
      [-0.00023, 0],
      [-3e-5, 2],
      [-0.00023, 0],
      [-0.00041, 0],
      [8e-5, 2],
      [1e-5, 2],
      [1e-5, 2],
      [-0.00021, 0],
      [1e-5, 2],
      [-5e-5, 2],
      [-3e-5, 2],
      [-0.0003, 0],
      [-0.00028, 0],
      [-5e-5, 2],
      [0.00045, 1],
      [-2e-5, 2],
      [-0.00026, 0],
      [-4e-5, 2]
    ],
    "red_o_points": [],
    "y_categories": ["N", "NOT APPLICABLE", "nan"],
    "blue_o_points": [],
    "blue_x_points": [
      [0.0008, 1],
      [-2e-5, 2],
      [-8e-5, 0],
      [-0.0001, 0],
      [4e-5, 2],
      [0.00083, 1],
      [0.00052, 1],
      [-0.00024, 0],
      [-3e-5, 2],
      [1e-5, 2],
      [-6e-5, 0],
      [0.0009, 1],
      [0.0001, 2],
      [0.0009, 1],
      [5e-5, 2]
    ]
  },
  "QS_mulTransfSite[Oberlin]": {
    "red_x_points": [
      [-0.00115, 3],
      [-0.02143, 0],
      [-0.02231, 0],
      [-0.01935, 0],
      [-0.02123, 0],
      [0.00286, 2],
      [-0.02139, 0],
      [-0.00163, 3],
      [0.00295, 2],
      [0.00239, 2],
      [-0.00096, 3],
      [0.0024, 2],
      [-0.0017, 3],
      [0.00191, 2],
      [-0.02054, 0],
      [-0.0011, 3],
      [-0.00116, 3],
      [-0.00108, 3],
      [-0.01912, 0],
      [-0.00104, 3],
      [-0.0018, 3],
      [-0.00179, 3],
      [0.0025, 2],
      [-0.02141, 0],
      [-0.0017, 3],
      [0.02537, 1],
      [-0.00176, 3],
      [-0.0205, 0],
      [-0.00178, 3]
    ],
    "red_o_points": [],
    "y_categories": ["N", "NOT APPLICABLE", "Y", "nan"],
    "blue_o_points": [],
    "blue_x_points": [
      [0.03684, 1],
      [-0.00115, 3],
      [0.00437, 2],
      [0.00572, 2],
      [-0.00048, 3],
      [0.03045, 1],
      [0.02642, 1],
      [0.00378, 2],
      [-0.0008, 3],
      [-0.00077, 3],
      [0.00456, 2],
      [0.02935, 1],
      [-0.00074, 3],
      [0.02904, 1],
      [-0.00104, 3]
    ]
  },
  "QA_intPexForearmProna": {
    "red_x_points": [
      [-0.00012, 2],
      [-0.00109, 0],
      [-0.00056, 2],
      [-0.00033, 2],
      [-0.00039, 2],
      [-0.00224, 0],
      [-0.00062, 2],
      [-0.01702, 0],
      [-0.00047, 2],
      [-0.00051, 2],
      [-0.01701, 0],
      [-0.00172, 0],
      [-0.00026, 2],
      [-0.00031, 2],
      [9e-5, 2],
      [-0.0177, 0],
      [-0.0168, 0],
      [-0.01622, 0],
      [-0.00139, 0],
      [-7e-5, 2],
      [-0.00011, 2],
      [-0.00011, 2],
      [-0.00037, 2],
      [-0.00041, 2],
      [0.00067, 2],
      [0.00072, 1],
      [0.00045, 2],
      [-0.00212, 0],
      [-6e-5, 2]
    ],
    "red_o_points": [],
    "y_categories": ["GREATER THAN OR EQUALS TO 80", "LESS THAN 80", "nan"],
    "blue_o_points": [],
    "blue_x_points": [
      [-0.00028, 2],
      [0.04614, 1],
      [-0.00047, 0],
      [-0.00031, 2],
      [0.00115, 2],
      [7e-5, 2],
      [0.00147, 1],
      [0.00023, 2],
      [0.00058, 2],
      [0.00122, 2],
      [-0.00065, 0],
      [0.0001, 2],
      [0.00122, 2],
      [0.00013, 2],
      [0.04547, 1]
    ]
  },
  "QA_yonInjChesttube": {
    "red_x_points": [
      [-0.00213, 2],
      [-0.00201, 2],
      [0.00177, 0],
      [-0.00153, 2],
      [-0.0027, 2],
      [0.00111, 0],
      [-0.00354, 1],
      [-0.00175, 2],
      [-0.00244, 2],
      [-0.00253, 2],
      [0.00116, 0],
      [0.00218, 0],
      [-0.00351, 2],
      [-0.00201, 2],
      [0.00077, 0],
      [0.00114, 0],
      [0.00109, 0],
      [0.0013, 0],
      [-0.00287, 1],
      [-0.00151, 2],
      [-0.01521, 1],
      [-0.0025, 2],
      [-0.00256, 2],
      [0.0021, 0],
      [-0.00199, 2],
      [-0.00022, 2],
      [-0.00246, 2],
      [0.00074, 0],
      [-0.00268, 2]
    ],
    "red_o_points": [],
    "y_categories": ["N", "Y", "nan"],
    "blue_o_points": [],
    "blue_x_points": [
      [0.00028, 1],
      [-0.00105, 2],
      [0.00295, 0],
      [0.00362, 0],
      [-0.00178, 2],
      [-3e-5, 2],
      [3e-5, 0],
      [0.00496, 0],
      [0.01447, 0],
      [0.01331, 0],
      [0.00253, 0],
      [-2e-5, 2],
      [0.0038, 0],
      [-4e-5, 2],
      [-0.00022, 2]
    ]
  },
  "QA_yonPexPain": {
    "red_x_points": [
      [-0.00742, 1],
      [-0.00043, 1],
      [-0.00058, 1],
      [-0.00076, 1],
      [-0.00049, 1],
      [-0.00162, 0],
      [-0.00026, 1],
      [-0.00699, 1],
      [-0.00295, 0],
      [-0.0006, 1],
      [-0.00479, 1],
      [-0.00127, 0],
      [-0.00912, 1],
      [-9e-5, 1],
      [-0.00028, 1],
      [0.00674, 0],
      [-0.00508, 1],
      [0.00512, 0],
      [-0.00052, 1],
      [0.00876, 0],
      [-0.01969, 2],
      [-0.00898, 1],
      [-4e-5, 1],
      [-0.00068, 1],
      [-0.0152, 2],
      [-0.00098, 1],
      [-0.00768, 1],
      [-0.00023, 1],
      [-0.00943, 1]
    ],
    "red_o_points": [],
    "y_categories": ["N", "Y", "nan"],
    "blue_o_points": [],
    "blue_x_points": [
      [-0.00019, 1],
      [0.02404, 0],
      [0.003, 0],
      [0.00192, 1],
      [-0.00486, 1],
      [0.00055, 2],
      [2e-5, 1],
      [0.00291, 1],
      [0.02579, 0],
      [0.01944, 0],
      [0.00139, 1],
      [0.00098, 0],
      [0.0112, 0],
      [-0.00026, 1],
      [-0.0004, 1]
    ]
  },
  "QS_mulGraftNerve[FI]": {
    "red_x_points": [
      [2e-5, 2],
      [-0.0003, 0],
      [-0.00023, 0],
      [-0.00014, 0],
      [-0.00027, 0],
      [-7e-5, 0],
      [-0.00021, 0],
      [2e-5, 2],
      [-0.00025, 0],
      [-0.00014, 0],
      [-5e-5, 2],
      [-0.00018, 0],
      [2e-5, 2],
      [-0.00031, 0],
      [-0.00026, 0],
      [-0.00016, 2],
      [-2e-5, 2],
      [-0.00015, 2],
      [-8e-5, 0],
      [-9e-5, 2],
      [-1e-5, 2],
      [-2e-5, 2],
      [-0.00027, 0],
      [-0.0002, 0],
      [1e-5, 2],
      [0.00033, 1],
      [-4e-5, 2],
      [-9e-5, 0],
      [-2e-5, 2]
    ],
    "red_o_points": [],
    "y_categories": ["N", "NOT APPLICABLE", "nan"],
    "blue_o_points": [],
    "blue_x_points": [
      [0.00123, 1],
      [-3e-5, 2],
      [0.0, 0],
      [-5e-5, 0],
      [3e-5, 2],
      [0.00059, 1],
      [0.00048, 1],
      [-0.00014, 0],
      [-3e-5, 2],
      [2e-5, 2],
      [-3e-5, 0],
      [0.00065, 1],
      [-9e-5, 2],
      [0.00057, 1],
      [-6e-5, 2]
    ]
  },
  "QA_lstPexPalle[Ulna]": {
    "red_x_points": [
      [-0.00082, 4],
      [-0.00272, 4],
      [-0.0021, 4],
      [-0.00675, 2],
      [-0.00302, 4],
      [-0.01117, 1],
      [-0.003, 4],
      [-0.00065, 4],
      [-0.00375, 4],
      [0.01156, 3],
      [-0.00821, 1],
      [-0.00365, 4],
      [-0.00068, 4],
      [-0.00327, 4],
      [-0.00149, 4],
      [0.00422, 3],
      [-0.00843, 0],
      [0.00295, 3],
      [-0.00826, 0],
      [0.00412, 3],
      [-0.00061, 4],
      [-0.00066, 4],
      [-0.00395, 4],
      [-0.00296, 4],
      [-0.00039, 4],
      [0.00292, 3],
      [-0.00045, 4],
      [-0.00682, 0],
      [-0.00078, 4]
    ],
    "red_o_points": [],
    "y_categories": ["ABS", "HYPO", "NAIA", "PT", "nan"],
    "blue_o_points": [],
    "blue_x_points": [
      [-0.00049, 4],
      [-0.00027, 4],
      [0.01525, 3],
      [0.01846, 3],
      [-8e-5, 4],
      [-0.00022, 4],
      [0.00222, 3],
      [-0.00288, 4],
      [-7e-5, 4],
      [0.00016, 4],
      [0.01395, 3],
      [-0.00024, 4],
      [0.00434, 3],
      [-9e-5, 4],
      [0.00878, 3]
    ]
  }
}
