{
  "QA_lstPexPain[C8]": {
    "red_x_points": [
      [-0.00954, 1],
      [-0.00195, 2],
      [-0.00234, 2],
      [-0.00206, 2],
      [-0.00873, 1],
      [0.00067, 0],
      [-0.0011, 1],
      [-0.00091, 1],
      [0.00623, 0],
      [0.0004, 0],
      [0.00068, 0],
      [0.00101, 0],
      [-0.0086, 1],
      [-0.0122, 2],
      [-0.00419, 2],
      [-0.00261, 2],
      [-0.00371, 2],
      [-0.00157, 2],
      [-0.00439, 2],
      [0.00694, 0],
      [-0.01135, 1],
      [0.00669, 0],
      [-0.00269, 2],
      [-0.00437, 2],
      [0.00499, 0],
      [-0.00497, 2],
      [-0.00405, 2],
      [-0.00212, 2],
      [-0.00794, 1],
      [-0.01092, 1],
      [-0.00173, 1],
      [-0.00967, 1]
    ],
    "red_o_points": [],
    "y_categories": ["NORM", "NPV", "nan"],
    "blue_o_points": [],
    "blue_x_points": [
      [0.00923, 0],
      [-0.00097, 2],
      [0.00066, 1],
      [0.00752, 1],
      [0.00374, 0],
      [0.00059, 1],
      [0.00995, 0],
      [0.0045, 0],
      [0.01156, 0],
      [0.014, 0]
    ]
  },
  "QS_mulLysisRoot[C6]": {
    "red_x_points": [
      [-0.00087, 3],
      [-0.00285, 0],
      [-0.00656, 2],
      [-0.00254, 0],
      [-0.00092, 3],
      [-0.00284, 0],
      [-0.00273, 0],
      [-0.00276, 0],
      [-0.00126, 3],
      [-0.0028, 0],
      [-0.00327, 0],
      [-0.00276, 0],
      [-0.00104, 3],
      [0.00643, 1],
      [-0.00078, 3],
      [-0.00335, 0],
      [-0.00101, 3],
      [-0.00274, 0],
      [-0.00125, 3],
      [-0.00143, 3],
      [-0.00082, 3],
      [-0.00112, 3],
      [-0.00284, 0],
      [-0.00099, 3],
      [-0.00069, 3],
      [-0.00086, 3],
      [-0.0029, 0],
      [-0.00255, 0],
      [0.00638, 1],
      [-0.00089, 3],
      [-0.00627, 2],
      [-0.00084, 3]
    ],
    "red_o_points": [],
    "y_categories": ["N", "NOT APPLICABLE", "Y", "nan"],
    "blue_o_points": [],
    "blue_x_points": [
      [0.00938, 1],
      [-0.0003, 3],
      [0.00822, 1],
      [-0.00027, 0],
      [-0.00141, 0],
      [0.00806, 1],
      [-0.00036, 3],
      [0.00848, 1],
      [-0.00039, 3],
      [-0.00044, 3]
    ]
  },
  "QS_mulLysisTrunk[Upper]": {
    "red_x_points": [
      [-0.00162, 3],
      [-0.00378, 0],
      [-0.00349, 0],
      [-0.00399, 0],
      [-0.00164, 3],
      [-0.0042, 0],
      [-0.00969, 2],
      [-0.00376, 0],
      [-0.00189, 3],
      [-0.00425, 0],
      [-0.00413, 0],
      [-0.00377, 0],
      [-0.00182, 3],
      [0.00723, 1],
      [-0.00147, 3],
      [-0.00373, 0],
      [-0.00153, 3],
      [-0.00822, 2],
      [-0.00173, 3],
      [-0.00188, 3],
      [-0.00122, 3],
      [-0.00158, 3],
      [-0.00401, 0],
      [-0.00164, 3],
      [-0.00261, 3],
      [-0.00139, 3],
      [-0.00383, 0],
      [-0.0034, 0],
      [0.00947, 1],
      [-0.00116, 3],
      [-0.00826, 2],
      [-0.00165, 3]
    ],
    "red_o_points": [],
    "y_categories": ["N", "NOT APPLICABLE", "Y", "nan"],
    "blue_o_points": [],
    "blue_x_points": [
      [0.01407, 1],
      [-0.00029, 3],
      [0.01216, 1],
      [0.00075, 0],
      [-0.00099, 0],
      [0.01163, 1],
      [-0.00079, 3],
      [0.01172, 1],
      [-0.00052, 3],
      [3e-5, 3]
    ]
  },
  "QS_mulBpsurgeryType[Transf]": {
    "red_x_points": [
      [-8e-5, 3],
      [-0.00035, 2],
      [-0.00183, 0],
      [-0.00032, 2],
      [-9e-5, 3],
      [-0.00042, 2],
      [-0.00038, 2],
      [-0.00027, 2],
      [-0.00014, 3],
      [-0.00035, 2],
      [-0.0004, 2],
      [-0.00027, 2],
      [-8e-5, 3],
      [0.00068, 1],
      [-0.00018, 3],
      [-0.00031, 2],
      [-0.00012, 3],
      [-0.00027, 2],
      [-9e-5, 3],
      [-0.00013, 3],
      [-5e-5, 3],
      [-3e-5, 3],
      [-0.00043, 2],
      [-0.00017, 3],
      [-5e-5, 3],
      [-6e-5, 3],
      [-0.00036, 2],
      [-0.00033, 2],
      [0.00096, 1],
      [-3e-5, 3],
      [-0.00032, 2],
      [-6e-5, 3]
    ],
    "red_o_points": [],
    "y_categories": ["N", "NOT APPLICABLE", "Y", "nan"],
    "blue_o_points": [],
    "blue_x_points": [
      [0.00145, 1],
      [-2e-5, 3],
      [0.00079, 1],
      [0.00013, 2],
      [-4e-5, 2],
      [0.00109, 1],
      [-5e-5, 3],
      [0.00107, 1],
      [-3e-5, 3],
      [1e-5, 3]
    ]
  },
  "QS_equBpsurgTime": {
    "red_x_points": [
      [0.00076, 3],
      [-0.0071, 0],
      [0.00579, 2],
      [-0.00632, 0],
      [0.00072, 3],
      [-0.01023, 0],
      [-0.00802, 1],
      [-0.00762, 1],
      [0.00069, 3],
      [-0.00901, 1],
      [-0.00856, 0],
      [0.00937, 2],
      [0.00079, 3],
      [0.00073, 3],
      [0.00064, 3],
      [-0.00815, 1],
      [0.00063, 3],
      [0.00478, 2],
      [0.00059, 3],
      [0.00059, 3],
      [0.00064, 3],
      [0.0006, 3],
      [-0.00608, 0],
      [0.00069, 3],
      [0.00071, 3],
      [0.0005, 3],
      [-0.00782, 0],
      [-0.00632, 0],
      [0.00062, 3],
      [0.00067, 3],
      [0.00541, 2],
      [0.00073, 3]
    ],
    "red_o_points": [],
    "y_categories": [
      "0 TO 6 MONTHS",
      "13 TO 24 MONTHS",
      "7 TO 12 MONTHS",
      "nan"
    ],
    "blue_o_points": [],
    "blue_x_points": [
      [0.00051, 3],
      [0.0006, 3],
      [0.00062, 3],
      [0.01333, 2],
      [0.01342, 2],
      [0.0004, 3],
      [0.00074, 3],
      [0.00049, 3],
      [0.00089, 3],
      [0.0008, 3]
    ]
  },
  "QA_equInjTbpiTime": {
    "red_x_points": [
      [-0.00116, 0],
      [-0.0022, 0],
      [0.00511, 3],
      [-0.0029, 0],
      [-0.00394, 1],
      [-0.0055, 0],
      [-0.00577, 1],
      [-0.00419, 0],
      [-0.00094, 3],
      [-0.00564, 0],
      [-0.00439, 0],
      [0.00913, 3],
      [-0.00159, 0],
      [-0.02817, 2],
      [-0.00081, 3],
      [-0.003, 0],
      [0.00043, 0],
      [-0.00227, 0],
      [-0.0101, 1],
      [8e-5, 3],
      [-0.00145, 0],
      [-0.00477, 1],
      [-0.00576, 2],
      [-0.00061, 3],
      [-0.00903, 1],
      [-0.01021, 2],
      [-0.00434, 0],
      [-0.00566, 2],
      [0.00075, 0],
      [0.00043, 0],
      [0.00522, 3],
      [-0.00689, 1]
    ],
    "red_o_points": [],
    "y_categories": [
      "0 TO 6 MONTHS",
      "13 TO 24 MONTHS",
      "25 MONTHS OR MORE",
      "7 TO 12 MONTHS",
      "nan"
    ],
    "blue_o_points": [],
    "blue_x_points": [
      [0.00252, 0],
      [0.00762, 0],
      [0.00259, 0],
      [0.01448, 3],
      [0.01307, 3],
      [0.00285, 0],
      [0.00332, 1],
      [0.00868, 3],
      [0.0076, 3],
      [0.00668, 0]
    ]
  },
  "QS_mulNeuromadSite[T2]": {
    "red_x_points": [
      [-0.0003, 2],
      [-0.00146, 0],
      [-0.00136, 0],
      [-0.00142, 0],
      [-0.00014, 2],
      [-0.00149, 0],
      [-0.00116, 0],
      [-0.00156, 0],
      [-0.00072, 2],
      [-0.0021, 0],
      [-0.00236, 0],
      [-0.00188, 0],
      [-0.00079, 2],
      [0.00186, 1],
      [-0.00017, 2],
      [-0.00168, 0],
      [-0.00043, 2],
      [-0.0013, 0],
      [-0.00053, 2],
      [-0.00051, 2],
      [-0.00015, 2],
      [-0.00022, 2],
      [-0.00141, 0],
      [-6e-5, 2],
      [-0.0002, 2],
      [-0.00026, 2],
      [-0.00151, 0],
      [-0.0013, 0],
      [0.00214, 1],
      [-0.00029, 2],
      [-0.00115, 0],
      [-0.0003, 2]
    ],
    "red_o_points": [],
    "y_categories": ["N", "NOT APPLICABLE", "nan"],
    "blue_o_points": [],
    "blue_x_points": [
      [0.00343, 1],
      [7e-5, 2],
      [0.00337, 1],
      [0.00037, 0],
      [-0.0003, 0],
      [0.0044, 1],
      [-0.00012, 2],
      [0.00397, 1],
      [-0.0, 2],
      [0.00017, 2]
    ]
  },
  "QA_lstPexMuscstrength[FingersAddu]": {
    "red_x_points": [
      [0.00129, 0],
      [0.00017, 2],
      [-0.00397, 1],
      [-0.00391, 1],
      [-0.00721, 1],
      [0.00203, 0],
      [0.00134, 0],
      [-0.00465, 1],
      [0.00125, 0],
      [0.00175, 0],
      [0.0001, 2],
      [0.00148, 0],
      [0.00131, 0],
      [0.00013, 2],
      [0.00048, 2],
      [0.00028, 2],
      [0.00121, 0],
      [0.0002, 2],
      [0.00033, 2],
      [0.00169, 0],
      [-0.00646, 1],
      [0.00141, 0],
      [-0.00447, 1],
      [0.0004, 2],
      [0.00055, 2],
      [0.00068, 2],
      [0.00024, 2],
      [-0.00432, 1],
      [8e-5, 2],
      [-0.006, 1],
      [-0.00433, 1],
      [0.00037, 2]
    ],
    "red_o_points": [],
    "y_categories": ["GREATER THAN OR EQUALS TO 3", "LESS THAN 3", "nan"],
    "blue_o_points": [],
    "blue_x_points": [
      [0.00017, 2],
      [0.00064, 2],
      [0.00151, 0],
      [0.00057, 2],
      [0.0031, 0],
      [0.00121, 0],
      [0.00426, 0],
      [0.00181, 0],
      [0.00159, 2],
      [0.00136, 2]
    ]
  },
  "QS_mulNeuromadSite[T1]": {
    "red_x_points": [
      [-0.00017, 2],
      [-0.00102, 0],
      [-0.00134, 0],
      [-0.00145, 0],
      [-0.00019, 2],
      [-0.00151, 0],
      [-0.00128, 0],
      [-0.00127, 0],
      [-0.00023, 2],
      [-0.00144, 0],
      [-0.00125, 0],
      [-0.0012, 0],
      [-0.00025, 2],
      [0.00178, 1],
      [-0.00011, 2],
      [-0.0014, 0],
      [-0.00031, 2],
      [-0.00086, 0],
      [-0.00027, 2],
      [-0.0002, 2],
      [-4e-5, 2],
      [-0.00031, 2],
      [-0.00113, 0],
      [-0.00022, 2],
      [-0.00044, 2],
      [-0.00024, 2],
      [-0.00113, 0],
      [-0.00129, 0],
      [0.00182, 1],
      [-0.00022, 2],
      [-0.00108, 0],
      [-0.00026, 2]
    ],
    "red_o_points": [],
    "y_categories": ["N", "NOT APPLICABLE", "nan"],
    "blue_o_points": [],
    "blue_x_points": [
      [0.00327, 1],
      [-0.00011, 2],
      [0.00266, 1],
      [0.00037, 0],
      [-0.00049, 0],
      [0.00303, 1],
      [-5e-5, 2],
      [0.0029, 1],
      [-0.0001, 2],
      [-0.00012, 2]
    ]
  },
  "QA_yonInjFracture": {
    "red_x_points": [
      [-0.00885, 0],
      [-0.00116, 2],
      [0.00109, 0],
      [-0.00118, 1],
      [-0.00819, 0],
      [0.00052, 0],
      [0.0008, 0],
      [-0.00315, 1],
      [0.00548, 2],
      [0.00096, 0],
      [-0.00265, 1],
      [-0.0052, 1],
      [-0.00967, 0],
      [-0.00088, 0],
      [0.00627, 1],
      [-0.00191, 1],
      [-0.00854, 0],
      [-0.00276, 1],
      [-0.00994, 0],
      [-0.01083, 0],
      [0.00598, 1],
      [-0.01025, 0],
      [-0.00097, 1],
      [-0.01023, 0],
      [-0.01132, 0],
      [-0.01, 0],
      [0.00128, 0],
      [0.0005, 0],
      [-0.00876, 1],
      [0.00484, 2],
      [-0.00359, 1],
      [0.00486, 1]
    ],
    "red_o_points": [],
    "y_categories": ["N", "Y", "nan"],
    "blue_o_points": [],
    "blue_x_points": [
      [0.00219, 0],
      [0.01136, 1],
      [0.0015, 0],
      [0.00511, 0],
      [0.00436, 0],
      [0.00109, 1],
      [0.01029, 2],
      [0.00088, 0],
      [0.01275, 1],
      [0.01241, 2]
    ]
  },
  "QS_mulGraftNerve[Ac]": {
    "red_x_points": [
      [-9e-5, 2],
      [-0.00042, 0],
      [-0.00044, 0],
      [-0.00051, 0],
      [-9e-5, 2],
      [-0.00058, 0],
      [-0.00049, 0],
      [-0.00044, 0],
      [-0.00019, 2],
      [-0.00076, 0],
      [-0.00058, 0],
      [-0.00046, 0],
      [-0.0002, 2],
      [0.00085, 1],
      [-0.00011, 2],
      [-0.00056, 0],
      [-0.00026, 2],
      [-0.00062, 0],
      [-6e-5, 2],
      [-0.00017, 2],
      [-0.00016, 2],
      [-0.00016, 2],
      [-0.00038, 0],
      [-8e-5, 2],
      [-2e-5, 2],
      [-0.0001, 2],
      [-0.00065, 0],
      [-0.0005, 0],
      [0.00079, 1],
      [-3e-5, 2],
      [-0.00046, 0],
      [-7e-5, 2]
    ],
    "red_o_points": [],
    "y_categories": ["N", "NOT APPLICABLE", "nan"],
    "blue_o_points": [],
    "blue_x_points": [
      [0.00153, 1],
      [0.0, 2],
      [0.00093, 1],
      [0.00011, 0],
      [-0.00022, 0],
      [0.00099, 1],
      [-0.0001, 2],
      [0.00137, 1],
      [-4e-5, 2],
      [5e-5, 2]
    ]
  },
  "QS_mulGraftTrunk[LowerTrunk]": {
    "red_x_points": [
      [-6e-5, 0],
      [-2e-5, 2],
      [-6e-5, 0],
      [-2e-5, 2],
      [-6e-5, 0],
      [-6e-5, 0],
      [-2e-5, 2],
      [-2e-5, 2],
      [9e-5, 1],
      [-2e-5, 2]
    ],
    "red_o_points": [],
    "y_categories": ["N", "NOT APPLICABLE", "nan"],
    "blue_o_points": [],
    "blue_x_points": [[9e-5, 1], [9e-5, 1], [-2e-5, 2]]
  },
  "QA_lstPexMuscstrength[FingersAbdu]": {
    "red_x_points": [
      [0.00031, 2],
      [3e-5, 2],
      [-0.0032, 1],
      [-0.00235, 1],
      [-0.00021, 1],
      [0.00156, 0],
      [0.0009, 0],
      [-0.00258, 1],
      [-0.00704, 0],
      [0.00208, 0],
      [-8e-5, 2],
      [-0.00454, 1],
      [-0.00457, 0],
      [-3e-5, 2],
      [0.00017, 2],
      [-0.00013, 2],
      [-0.00308, 0],
      [-9e-5, 2],
      [0.00036, 2],
      [-0.00769, 0],
      [-0.00083, 1],
      [-0.00813, 0],
      [-0.00234, 1],
      [0.00023, 2],
      [0.00076, 2],
      [0.0003, 2],
      [-0.00381, 1],
      [-0.00301, 1],
      [-5e-5, 2],
      [-0.00061, 1],
      [-0.00252, 1],
      [-2e-5, 2]
    ],
    "red_o_points": [],
    "y_categories": ["GREATER THAN OR EQUALS TO 3", "LESS THAN 3", "nan"],
    "blue_o_points": [],
    "blue_x_points": [
      [-5e-5, 2],
      [0.00053, 2],
      [0.00107, 0],
      [0.00249, 2],
      [0.006, 0],
      [0.00082, 0],
      [0.01384, 1],
      [0.00089, 0],
      [0.0036, 2],
      [0.00327, 2]
    ]
  },
  "QS_mulNeuromadSite[C8]": {
    "red_x_points": [
      [-0.00051, 2],
      [-0.00238, 0],
      [-0.00197, 0],
      [-0.002, 0],
      [-0.00032, 2],
      [-0.00294, 0],
      [-0.00202, 0],
      [-0.0019, 0],
      [-0.00072, 2],
      [-0.00272, 0],
      [-0.00265, 0],
      [-0.00242, 0],
      [-0.00094, 2],
      [0.00284, 1],
      [-0.00011, 2],
      [-0.00256, 0],
      [-0.00067, 2],
      [-0.00233, 0],
      [-0.00058, 2],
      [-0.00077, 2],
      [-0.00021, 2],
      [-0.00069, 2],
      [-0.00207, 0],
      [-7e-5, 2],
      [-0.00053, 2],
      [-0.00027, 2],
      [-0.00261, 0],
      [-0.00172, 0],
      [0.00224, 1],
      [-0.00042, 2],
      [-0.00192, 0],
      [-0.00024, 2]
    ],
    "red_o_points": [],
    "y_categories": ["N", "NOT APPLICABLE", "nan"],
    "blue_o_points": [],
    "blue_x_points": [
      [0.00606, 1],
      [0.0001, 2],
      [0.00569, 1],
      [0.00023, 0],
      [-0.00037, 0],
      [0.00575, 1],
      [4e-5, 2],
      [0.00493, 1],
      [-5e-5, 2],
      [0.00068, 2]
    ]
  },
  "QS_mulGraftNerve[Ph]": {
    "red_x_points": [
      [-5e-5, 2],
      [-0.00066, 0],
      [-0.00039, 0],
      [-0.00048, 0],
      [-5e-5, 2],
      [-0.00054, 0],
      [-0.00046, 0],
      [-0.00062, 0],
      [-0.00011, 2],
      [-0.00061, 0],
      [-0.00048, 0],
      [-0.00045, 0],
      [-5e-5, 2],
      [0.00061, 1],
      [-8e-5, 2],
      [-0.00041, 0],
      [-2e-5, 2],
      [-0.00054, 0],
      [-7e-5, 2],
      [-0.00014, 2],
      [-2e-5, 2],
      [-0.0001, 2],
      [-0.00035, 0],
      [-0.00012, 2],
      [-8e-5, 2],
      [-0.00013, 2],
      [-0.0005, 0],
      [-0.00024, 0],
      [0.00075, 1],
      [-0.0, 2],
      [-0.00017, 0],
      [-8e-5, 2]
    ],
    "red_o_points": [],
    "y_categories": ["N", "NOT APPLICABLE", "nan"],
    "blue_o_points": [],
    "blue_x_points": [
      [0.00133, 1],
      [-1e-5, 2],
      [0.001, 1],
      [-9e-5, 0],
      [-8e-5, 0],
      [0.00115, 1],
      [-0.0001, 2],
      [0.0012, 1],
      [-4e-5, 2],
      [2e-5, 2]
    ]
  },
  "QS_mulTransfSite[AcSsPA]": {
    "red_x_points": [
      [-0.0004, 3],
      [-0.00193, 0],
      [-0.00182, 0],
      [-0.00203, 0],
      [-0.0005, 3],
      [-0.0023, 0],
      [-0.00169, 0],
      [-0.00203, 0],
      [-0.00075, 3],
      [-0.00215, 0],
      [-0.00217, 0],
      [-0.00229, 0],
      [-0.00061, 3],
      [0.00398, 1],
      [-0.00056, 3],
      [-0.00202, 0],
      [-0.0007, 3],
      [-0.00473, 2],
      [-0.00052, 3],
      [-0.0005, 3],
      [-0.00042, 3],
      [-0.00059, 3],
      [-0.00143, 0],
      [-0.00059, 3],
      [-0.00063, 3],
      [-0.00065, 3],
      [-0.00166, 0],
      [-0.00171, 0],
      [0.00486, 1],
      [-0.00061, 3],
      [-0.00171, 0],
      [-0.00066, 3]
    ],
    "red_o_points": [],
    "y_categories": ["N", "NOT APPLICABLE", "Y", "nan"],
    "blue_o_points": [],
    "blue_x_points": [
      [0.00599, 1],
      [-0.00016, 3],
      [0.00459, 1],
      [-0.001, 0],
      [-0.00085, 0],
      [0.00509, 1],
      [-5e-5, 3],
      [0.0055, 1],
      [-7e-5, 3],
      [-0.00026, 3]
    ]
  },
  "QA_lstPexMuscstrength[FingersFlex]": {
    "red_x_points": [
      [0.00025, 0],
      [0.00035, 2],
      [-0.00215, 1],
      [-0.00149, 1],
      [0.00047, 0],
      [0.00028, 0],
      [0.00025, 0],
      [-0.00317, 1],
      [5e-5, 0],
      [0.00024, 0],
      [0.00037, 0],
      [0.00032, 0],
      [-0.00405, 1],
      [0.00027, 2],
      [0.00041, 2],
      [0.00027, 2],
      [0.00027, 0],
      [0.00036, 2],
      [0.00046, 2],
      [0.00026, 0],
      [-0.0034, 1],
      [4e-5, 0],
      [-0.00198, 1],
      [0.00048, 2],
      [0.00056, 2],
      [0.00054, 2],
      [0.00036, 0],
      [0.00022, 0],
      [0.00031, 2],
      [-0.00472, 1],
      [-0.0026, 1],
      [0.00048, 2]
    ],
    "red_o_points": [],
    "y_categories": ["GREATER THAN OR EQUALS TO 3", "LESS THAN 3", "nan"],
    "blue_o_points": [],
    "blue_x_points": [
      [0.00013, 2],
      [0.00062, 2],
      [0.00036, 0],
      [0.00119, 2],
      [0.00107, 0],
      [0.00038, 0],
      [0.00154, 0],
      [0.00032, 0],
      [0.00164, 2],
      [0.0017, 2]
    ]
  },
  "QA_lstPexMuscstrength[ScapulaAbducSuprot]": {
    "red_x_points": [
      [-0.00391, 0],
      [0.0002, 2],
      [-0.00203, 1],
      [-0.00164, 1],
      [-0.00404, 0],
      [-0.00033, 0],
      [-0.00312, 1],
      [-0.00219, 1],
      [-0.00028, 1],
      [0.00032, 0],
      [-0.00053, 0],
      [-0.00419, 1],
      [-0.00045, 1],
      [0.00022, 2],
      [0.00069, 2],
      [0.00046, 2],
      [0.00147, 2],
      [0.0001, 2],
      [0.00085, 2],
      [-0.00643, 0],
      [0.00036, 1],
      [-0.00745, 0],
      [-0.00093, 1],
      [0.00067, 2],
      [-0.00687, 0],
      [0.00127, 2],
      [-0.00389, 1],
      [0.00018, 0],
      [0.00013, 2],
      [-0.00443, 0],
      [-0.00228, 1],
      [0.001, 2]
    ],
    "red_o_points": [],
    "y_categories": ["GREATER THAN OR EQUALS TO 3", "LESS THAN 3", "nan"],
    "blue_o_points": [],
    "blue_x_points": [
      [0.00037, 2],
      [0.0015, 2],
      [0.00056, 0],
      [0.00464, 2],
      [0.00538, 0],
      [0.00037, 0],
      [0.00413, 2],
      [0.00045, 2],
      [0.00902, 1],
      [0.00369, 2]
    ]
  },
  "participant_code": {
    "red_x_points": [
      [-0.02252, 1],
      [-0.02153, 2],
      [-0.02252, 3],
      [-0.02211, 4],
      [-0.02147, 5],
      [-0.02276, 6],
      [-0.02247, 7],
      [-0.0217, 8],
      [-0.02264, 9],
      [-0.02194, 10],
      [-0.02211, 11],
      [-0.02258, 12],
      [-0.02129, 13],
      [-0.02182, 15],
      [-0.02264, 17],
      [-0.02229, 18],
      [-0.02153, 20],
      [-0.023, 21],
      [-0.02341, 22],
      [-0.02182, 24],
      [-0.02294, 26],
      [-0.02182, 27],
      [-0.02247, 28],
      [-0.02158, 30],
      [-0.02247, 31],
      [-0.02288, 32],
      [-0.02217, 34],
      [-0.02182, 36],
      [-0.02247, 38],
      [-0.02276, 39],
      [-0.02211, 40],
      [-0.02176, 41]
    ],
    "red_o_points": [],
    "y_categories": [
      "P16554",
      "P18297",
      "P19283",
      "P19287",
      "P23391",
      "P30595",
      "P31645",
      "P31691",
      "P34778",
      "P35046",
      "P36328",
      "P43633",
      "P4544",
      "P46417",
      "P48965",
      "P53068",
      "P5497",
      "P59529",
      "P62483",
      "P64658",
      "P65202",
      "P66816",
      "P6751",
      "P7408",
      "P75566",
      "P76226",
      "P79971",
      "P82621",
      "P82990",
      "P84549",
      "P84932",
      "P85825",
      "P86989",
      "P8770",
      "P87791",
      "P90550",
      "P93159",
      "P94969",
      "P96710",
      "P97130",
      "P9744",
      "P98500",
      "nan"
    ],
    "blue_o_points": [],
    "blue_x_points": [
      [0.04743, 0],
      [0.047, 14],
      [0.04827, 16],
      [0.04601, 19],
      [0.04517, 23],
      [0.04686, 25],
      [0.04587, 29],
      [0.04545, 33],
      [0.04616, 35],
      [0.04757, 37]
    ]
  },
  "QA_lstPexTouch[T1]": {
    "red_x_points": [
      [-0.00858, 1],
      [-0.00232, 2],
      [0.00061, 1],
      [-0.00177, 2],
      [-0.0096, 1],
      [-0.00807, 0],
      [0.00146, 1],
      [0.00122, 1],
      [-0.01079, 1],
      [-0.00578, 0],
      [-0.00413, 0],
      [-0.00749, 0],
      [0.00695, 0],
      [-0.00777, 2],
      [-0.00416, 2],
      [-0.00358, 2],
      [-0.00964, 1],
      [-0.00165, 2],
      [-0.00391, 2],
      [0.006, 0],
      [-0.00993, 1],
      [0.00723, 0],
      [-0.00223, 2],
      [-0.00417, 2],
      [-0.01034, 1],
      [0.00796, 0],
      [0.00317, 1],
      [-0.00257, 2],
      [-0.00246, 1],
      [-0.00497, 2],
      [0.00027, 1],
      [-0.00961, 1]
    ],
    "red_o_points": [],
    "y_categories": ["NORM", "NPV", "nan"],
    "blue_o_points": [],
    "blue_x_points": [
      [0.00066, 1],
      [0.0004, 2],
      [0.00101, 1],
      [0.00743, 1],
      [0.01097, 1],
      [0.00061, 1],
      [0.01111, 0],
      [0.00497, 0],
      [0.01173, 0],
      [0.01423, 0]
    ]
  },
  "QA_mulInjOrthesisType[ArmSling]": {
    "red_x_points": [
      [-0.00515, 2],
      [-0.0054, 2],
      [-0.00551, 2],
      [-0.00529, 2],
      [-0.00516, 2],
      [-0.00554, 2],
      [-0.0052, 2],
      [-0.00604, 2],
      [-0.00528, 2],
      [-0.00578, 2],
      [-0.00566, 2],
      [-0.00537, 2],
      [-0.0052, 2],
      [0.01029, 1],
      [-0.00693, 2],
      [-0.00583, 2],
      [-0.00646, 2],
      [-0.00987, 0],
      [0.01087, 1],
      [-0.00474, 2],
      [-0.00545, 2],
      [-0.01617, 0],
      [-0.00263, 3],
      [-0.00649, 2],
      [0.00789, 1],
      [-0.00558, 2],
      [-0.00584, 2],
      [-0.00517, 2],
      [-0.01041, 3],
      [-0.00124, 3],
      [-0.0051, 2],
      [-0.00612, 2]
    ],
    "red_o_points": [],
    "y_categories": ["N", "NOT APPLICABLE", "Y", "nan"],
    "blue_o_points": [],
    "blue_x_points": [
      [0.00239, 2],
      [0.01735, 1],
      [0.01447, 1],
      [0.02947, 1],
      [-0.00385, 2],
      [0.01377, 1],
      [-0.00249, 2],
      [0.01226, 1],
      [-0.00215, 2],
      [0.01028, 3]
    ]
  },
  "QS_mulGraftNerve[Ul]": {
    "red_x_points": [
      [-2e-5, 2],
      [-0.00028, 0],
      [-0.00016, 0],
      [-0.00025, 0],
      [-0.00011, 2],
      [-0.0002, 0],
      [-0.0002, 0],
      [-0.00022, 0],
      [-0.00017, 2],
      [-0.00023, 0],
      [-0.00031, 0],
      [-0.00017, 0],
      [-0.00013, 2],
      [0.00046, 1],
      [-7e-5, 2],
      [-0.00035, 0],
      [-0.00022, 2],
      [-0.00017, 0],
      [-4e-5, 2],
      [-2e-5, 2],
      [1e-5, 2],
      [-0.00015, 2],
      [-0.00021, 0],
      [-8e-5, 2],
      [-6e-5, 2],
      [-0.0001, 2],
      [-0.00021, 0],
      [-0.00018, 0],
      [0.00073, 1],
      [-3e-5, 2],
      [-0.00023, 0],
      [-9e-5, 2]
    ],
    "red_o_points": [],
    "y_categories": ["N", "NOT APPLICABLE", "nan"],
    "blue_o_points": [],
    "blue_x_points": [
      [0.00073, 1],
      [-0.0, 2],
      [0.00056, 1],
      [-0.00016, 0],
      [-0.00011, 0],
      [0.00044, 1],
      [3e-5, 2],
      [0.00053, 1],
      [3e-5, 2],
      [-7e-5, 2]
    ]
  },
  "QA_mulInjOrthesisType[ShoulderSupport]": {
    "red_x_points": [
      [-0.00542, 0],
      [-0.00556, 0],
      [-0.00595, 0],
      [-0.00567, 0],
      [-0.00568, 0],
      [-0.00562, 0],
      [-0.00615, 0],
      [-0.0047, 0],
      [-0.01774, 2],
      [-0.00604, 0],
      [-0.00547, 0],
      [-0.00592, 0],
      [-0.00542, 0],
      [0.01114, 1],
      [-0.0071, 0],
      [-0.00586, 0],
      [-0.00615, 0],
      [-0.01069, 2],
      [0.01281, 1],
      [-0.00496, 0],
      [-0.00523, 0],
      [-0.01757, 2],
      [-0.00277, 3],
      [-0.00656, 0],
      [0.0091, 1],
      [-0.00574, 0],
      [-0.00608, 0],
      [-0.00518, 0],
      [-0.01093, 3],
      [-0.00191, 3],
      [-0.00566, 0],
      [-0.00601, 0]
    ],
    "red_o_points": [],
    "y_categories": ["N", "NOT APPLICABLE", "Y", "nan"],
    "blue_o_points": [],
    "blue_x_points": [
      [0.00245, 0],
      [0.01859, 1],
      [0.01363, 1],
      [0.0304, 1],
      [-0.00396, 0],
      [0.01423, 1],
      [-0.0017, 0],
      [0.01447, 1],
      [-0.00078, 0],
      [0.01169, 3]
    ]
  },
  "QA_yonInjUnconscio": {
    "red_x_points": [
      [-0.00504, 1],
      [-0.00634, 1],
      [-0.00402, 2],
      [-0.00353, 2],
      [-0.00321, 2],
      [0.01604, 0],
      [-0.00749, 1],
      [-0.00432, 2],
      [-0.00359, 2],
      [-0.00493, 2],
      [-0.00377, 2],
      [-0.00897, 1],
      [-0.00578, 1],
      [-0.01377, 1],
      [-0.00541, 2],
      [-0.00375, 2],
      [-0.00336, 2],
      [-0.00585, 1],
      [0.0045, 0],
      [-0.00682, 1],
      [-0.00548, 1],
      [-0.00592, 1],
      [-0.00616, 1],
      [-0.00498, 2],
      [-0.00644, 1],
      [-0.00347, 2],
      [-0.00778, 1],
      [-0.00569, 1],
      [-0.00199, 2],
      [-0.00371, 2],
      [-0.00695, 1],
      [-0.00487, 2]
    ],
    "red_o_points": [],
    "y_categories": ["N", "Y", "nan"],
    "blue_o_points": [],
    "blue_x_points": [
      [-5e-5, 2],
      [0.00638, 1],
      [0.0142, 0],
      [0.02721, 0],
      [0.02466, 0],
      [0.00016, 2],
      [-0.002, 1],
      [0.00046, 2],
      [0.02461, 0],
      [-0.00099, 2]
    ]
  },
  "QS_mulTransfSite[Other]": {
    "red_x_points": [
      [-0.00122, 3],
      [-0.01062, 0],
      [-0.01129, 0],
      [-0.01103, 0],
      [-0.00163, 3],
      [-0.01112, 0],
      [-0.01093, 0],
      [-0.01096, 0],
      [-0.00163, 3],
      [-0.01132, 0],
      [-0.01089, 0],
      [-0.01135, 0],
      [-0.00133, 3],
      [0.015, 1],
      [-0.00157, 3],
      [-0.01068, 0],
      [-0.00127, 3],
      [-0.01025, 0],
      [-0.00176, 3],
      [-0.00156, 3],
      [-0.00134, 3],
      [-0.00157, 3],
      [-0.01059, 0],
      [-0.0017, 3],
      [-0.00163, 3],
      [-0.00141, 3],
      [-0.01052, 0],
      [-0.01007, 0],
      [0.01591, 1],
      [-0.00132, 3],
      [-0.01029, 0],
      [-0.00169, 3]
    ],
    "red_o_points": [],
    "y_categories": ["N", "NOT APPLICABLE", "Y", "nan"],
    "blue_o_points": [],
    "blue_x_points": [
      [0.01925, 1],
      [-0.00049, 3],
      [0.01573, 1],
      [-0.00401, 0],
      [0.03293, 2],
      [0.01548, 1],
      [-0.00046, 3],
      [0.01771, 1],
      [-0.00039, 3],
      [-0.00056, 3]
    ]
  },
  "QS_mulGraftNerve[MCA]": {
    "red_x_points": [
      [-5e-5, 2],
      [-7e-5, 0],
      [-0.0, 0],
      [-0.0, 0],
      [-7e-5, 0],
      [0.0, 2],
      [-7e-5, 0],
      [-0.00021, 0],
      [-0.00014, 0],
      [-5e-5, 2],
      [0.0, 2],
      [-7e-5, 0],
      [-5e-5, 2],
      [-6e-5, 2],
      [-5e-5, 2],
      [0.0, 2],
      [8e-5, 1],
      [-0.0, 0],
      [0.0, 2]
    ],
    "red_o_points": [],
    "y_categories": ["N", "NOT APPLICABLE", "nan"],
    "blue_o_points": [],
    "blue_x_points": [
      [6e-5, 1],
      [-0.0, 0],
      [0.00023, 1],
      [-1e-5, 2],
      [0.00014, 1],
      [-1e-5, 2]
    ]
  },
  "QA_lstInjTpbiSide": {
    "red_x_points": [
      [-0.00265, 1],
      [0.00066, 0],
      [0.00022, 0],
      [0.00014, 0],
      [0.00025, 0],
      [-0.00204, 1],
      [-0.00107, 0],
      [-0.00121, 0],
      [-0.00334, 1],
      [-0.00156, 0],
      [-0.00227, 1],
      [-0.00198, 1],
      [-0.00284, 1],
      [-0.01147, 0],
      [-0.00727, 1],
      [-0.00265, 1],
      [6e-5, 0],
      [-0.00241, 1],
      [-0.00774, 1],
      [-0.00071, 0],
      [-0.00051, 0],
      [-0.00137, 0],
      [0.00022, 0],
      [0.00282, 0],
      [-0.00582, 1],
      [-0.00513, 1],
      [-0.0014, 1],
      [-0.00063, 1],
      [-0.01071, 0],
      [-0.00451, 1],
      [-0.00077, 0],
      [0.00125, 0]
    ],
    "red_o_points": [],
    "y_categories": ["L", "R", "nan"],
    "blue_o_points": [],
    "blue_x_points": [
      [-0.00342, 0],
      [0.00709, 0],
      [0.00668, 1],
      [0.00538, 0],
      [0.00255, 1],
      [0.00671, 1],
      [0.00373, 1],
      [0.00636, 1],
      [0.00605, 0],
      [0.00569, 0]
    ]
  },
  "QA_intPexWristFlex": {
    "red_x_points": [
      [-0.00014, 2],
      [-0.00115, 2],
      [-0.00115, 2],
      [-0.0013, 2],
      [-0.00103, 0],
      [-0.00573, 0],
      [-0.00393, 0],
      [-0.00148, 2],
      [-0.0015, 0],
      [-0.002, 2],
      [-0.00209, 2],
      [-0.00214, 2],
      [-0.00171, 0],
      [0.00012, 2],
      [-0.0002, 2],
      [-0.00155, 2],
      [-0.00021, 2],
      [-0.00102, 2],
      [-6e-5, 2],
      [-0.00218, 0],
      [-0.00085, 0],
      [-0.0015, 0],
      [-0.00222, 0],
      [-0.00025, 2],
      [5e-5, 2],
      [-0.00019, 2],
      [-0.00202, 2],
      [-0.00124, 2],
      [-0.01551, 1],
      [-0.00021, 1],
      [-0.00254, 0],
      [-0.00017, 2]
    ],
    "red_o_points": [],
    "y_categories": ["GREATER THAN OR EQUALS TO 60", "LESS THAN 60", "nan"],
    "blue_o_points": [],
    "blue_x_points": [
      [0.00141, 2],
      [-1e-5, 2],
      [0.00562, 0],
      [-0.00049, 2],
      [0.02708, 1],
      [0.0015, 2],
      [3e-5, 2],
      [0.00109, 2],
      [0.00065, 0],
      [0.00028, 2]
    ]
  },
  "QA_lstPexArthre[Shoulder]": {
    "red_x_points": [
      [-0.0011, 2],
      [-0.00156, 3],
      [-0.00163, 3],
      [-0.00216, 0],
      [-0.00381, 3],
      [-0.00439, 2],
      [-0.00253, 2],
      [0.00138, 1],
      [-0.00464, 3],
      [-0.00326, 2],
      [-0.00217, 2],
      [-0.00314, 2],
      [-0.00204, 2],
      [-0.0002, 3],
      [-0.00279, 3],
      [-0.00115, 2],
      [-0.00394, 3],
      [-0.00082, 3],
      [-0.00193, 3],
      [-0.00337, 2],
      [-0.00079, 1],
      [-0.00251, 2],
      [-0.00134, 3],
      [-0.0025, 3],
      [-0.00131, 2],
      [-0.00309, 3],
      [-0.00415, 3],
      [-0.00178, 3],
      [-0.00041, 3],
      [-0.00237, 3],
      [0.00104, 1],
      [-0.00323, 3]
    ],
    "red_o_points": [],
    "y_categories": ["NAIA", "NPV", "PV", "nan"],
    "blue_o_points": [],
    "blue_x_points": [
      [-8e-5, 2],
      [-4e-5, 3],
      [-0.00028, 2],
      [0.00164, 2],
      [0.01744, 1],
      [-0.00018, 2],
      [0.01864, 1],
      [9e-5, 3],
      [0.00342, 2],
      [0.00142, 2]
    ]
  },
  "QA_lstPexPain[C5]": {
    "red_x_points": [
      [-0.00223, 1],
      [-0.00431, 2],
      [-0.00502, 2],
      [-0.00452, 2],
      [-0.00232, 1],
      [-0.0008, 1],
      [-0.00078, 1],
      [-0.00091, 1],
      [-0.00264, 1],
      [-0.001, 1],
      [-0.00105, 1],
      [-0.00073, 1],
      [-0.00197, 1],
      [-0.01514, 2],
      [-0.00633, 2],
      [-0.00481, 2],
      [-0.00604, 2],
      [-0.00438, 2],
      [-0.00591, 2],
      [-0.00188, 1],
      [-0.00195, 1],
      [-0.00194, 1],
      [-0.00459, 2],
      [-0.00648, 2],
      [-0.00261, 1],
      [-0.00688, 2],
      [-0.00434, 2],
      [-0.0046, 2],
      [-0.00376, 1],
      [-0.00357, 1],
      [-0.00066, 1],
      [-0.00248, 1]
    ],
    "red_o_points": [],
    "y_categories": ["NORM", "NPV", "nan"],
    "blue_o_points": [],
    "blue_x_points": [
      [0.02308, 0],
      [-0.00338, 2],
      [0.00028, 1],
      [-0.00022, 1],
      [-0.00054, 1],
      [0.0005, 1],
      [-0.00077, 1],
      [0.01929, 0],
      [-0.00113, 1],
      [0.03719, 0]
    ]
  },
  "QS_mulBpsurgeryType[Lysis]": {
    "red_x_points": [
      [-0.00173, 3],
      [-0.00545, 0],
      [-0.0131, 2],
      [-0.00612, 0],
      [-0.0016, 3],
      [-0.00575, 0],
      [-0.01362, 2],
      [-0.00541, 0],
      [-0.00175, 3],
      [-0.00551, 0],
      [-0.00583, 0],
      [-0.00498, 0],
      [-0.00197, 3],
      [0.01353, 1],
      [-0.0015, 3],
      [-0.00606, 0],
      [-0.00167, 3],
      [-0.01219, 2],
      [-0.00235, 3],
      [-0.00184, 3],
      [-0.00138, 3],
      [-0.00157, 3],
      [-0.00521, 0],
      [-0.00147, 3],
      [-0.00254, 3],
      [-0.00167, 3],
      [-0.00543, 0],
      [-0.00495, 0],
      [0.01393, 1],
      [-0.00153, 3],
      [-0.01255, 2],
      [-0.00161, 3]
    ],
    "red_o_points": [],
    "y_categories": ["N", "NOT APPLICABLE", "Y", "nan"],
    "blue_o_points": [],
    "blue_x_points": [
      [0.01828, 1],
      [-0.00027, 3],
      [0.01513, 1],
      [0.00172, 0],
      [-0.00062, 0],
      [0.01682, 1],
      [-0.0007, 3],
      [0.01766, 1],
      [-0.00031, 3],
      [-0.00026, 3]
    ]
  },
  "QS_mulLysisSite[Trunk]": {
    "red_x_points": [
      [-0.00099, 3],
      [-0.0036, 0],
      [-0.00342, 0],
      [-0.00398, 0],
      [-0.00085, 3],
      [-0.00354, 0],
      [-0.00796, 2],
      [-0.00347, 0],
      [-0.00147, 3],
      [-0.00386, 0],
      [-0.00411, 0],
      [-0.00311, 0],
      [-0.0012, 3],
      [0.00673, 1],
      [-0.00087, 3],
      [-0.00414, 0],
      [-0.00121, 3],
      [-0.00676, 2],
      [-0.00111, 3],
      [-0.00137, 3],
      [-0.00065, 3],
      [-0.00111, 3],
      [-0.00365, 0],
      [-0.00106, 3],
      [-0.00127, 3],
      [-0.00079, 3],
      [-0.00371, 0],
      [-0.00318, 0],
      [0.00802, 1],
      [-0.00079, 3],
      [-0.00688, 2],
      [-0.00094, 3]
    ],
    "red_o_points": [],
    "y_categories": ["N", "NOT APPLICABLE", "Y", "nan"],
    "blue_o_points": [],
    "blue_x_points": [
      [0.01258, 1],
      [-0.00021, 3],
      [0.00997, 1],
      [0.00033, 0],
      [-0.00129, 0],
      [0.01026, 1],
      [-0.0005, 3],
      [0.01075, 1],
      [-0.00039, 3],
      [-0.00034, 3]
    ]
  },
  "QA_lstPexTouch[C8]": {
    "red_x_points": [
      [-0.00686, 1],
      [-0.00214, 2],
      [-0.00211, 1],
      [-0.00198, 2],
      [-0.00735, 1],
      [0.00297, 0],
      [-0.00274, 1],
      [-0.0027, 1],
      [0.00514, 0],
      [-0.00257, 1],
      [0.00267, 0],
      [0.00211, 0],
      [-0.0073, 1],
      [-0.00971, 2],
      [-0.00401, 2],
      [-0.00321, 2],
      [-0.00789, 1],
      [-0.00209, 2],
      [-0.00473, 2],
      [0.00561, 0],
      [-0.00856, 1],
      [0.00509, 0],
      [-0.00261, 2],
      [-0.00339, 2],
      [0.00323, 0],
      [0.00673, 0],
      [-0.00308, 1],
      [-0.00183, 2],
      [-0.00694, 1],
      [-0.00436, 2],
      [-0.00262, 1],
      [-0.00767, 1]
    ],
    "red_o_points": [],
    "y_categories": ["NORM", "NPV", "nan"],
    "blue_o_points": [],
    "blue_x_points": [
      [0.00891, 0],
      [-0.00087, 2],
      [0.00043, 1],
      [0.00168, 1],
      [0.00552, 0],
      [0.00017, 1],
      [0.00883, 0],
      [0.00381, 0],
      [0.00882, 0],
      [0.00932, 0]
    ]
  },
  "QS_mulGraftTrunk[UpperTrunk]": {
    "red_x_points": [
      [-0.00023, 3],
      [-0.00153, 0],
      [-0.00138, 0],
      [-0.0016, 0],
      [-0.00029, 3],
      [-0.00183, 0],
      [-0.00152, 0],
      [-0.0015, 0],
      [-0.00022, 3],
      [-0.00163, 0],
      [-0.00153, 0],
      [-0.00169, 0],
      [-0.00037, 3],
      [0.00271, 1],
      [-0.00028, 3],
      [-0.00448, 2],
      [-0.00019, 3],
      [-0.00142, 0],
      [-0.00025, 3],
      [-0.00027, 3],
      [-0.00022, 3],
      [-0.00027, 3],
      [-0.00121, 0],
      [-0.00021, 3],
      [-0.00019, 3],
      [-0.0003, 3],
      [-0.00147, 0],
      [-0.0015, 0],
      [0.00304, 1],
      [-0.00022, 3],
      [-0.00125, 0],
      [-0.00025, 3]
    ],
    "red_o_points": [],
    "y_categories": ["N", "NOT APPLICABLE", "Y", "nan"],
    "blue_o_points": [],
    "blue_x_points": [
      [0.00454, 1],
      [-0.00017, 3],
      [0.0037, 1],
      [-0.00026, 0],
      [-0.00089, 0],
      [0.00399, 1],
      [-8e-5, 3],
      [0.00381, 1],
      [-8e-5, 3],
      [0.00016, 3]
    ]
  },
  "QS_mulTransfSite[PhMc]": {
    "red_x_points": [
      [-0.0008, 3],
      [-0.00315, 0],
      [-0.00342, 0],
      [-0.00381, 0],
      [-0.00096, 3],
      [-0.00336, 0],
      [-0.00311, 0],
      [-0.00746, 2],
      [-0.001, 3],
      [-0.00326, 0],
      [-0.00371, 0],
      [-0.00302, 0],
      [-0.00105, 3],
      [0.00564, 1],
      [-0.00071, 3],
      [-0.00326, 0],
      [-0.00095, 3],
      [-0.00309, 0],
      [-0.00058, 3],
      [-0.001, 3],
      [-0.00079, 3],
      [-0.00098, 3],
      [-0.00602, 2],
      [-0.00052, 3],
      [-0.00122, 3],
      [-0.00083, 3],
      [-0.00289, 0],
      [-0.00322, 0],
      [0.00616, 1],
      [-0.00072, 3],
      [-0.00291, 0],
      [-0.00089, 3]
    ],
    "red_o_points": [],
    "y_categories": ["N", "NOT APPLICABLE", "Y", "nan"],
    "blue_o_points": [],
    "blue_x_points": [
      [0.01016, 1],
      [-7e-5, 3],
      [0.00853, 1],
      [-0.00088, 0],
      [-0.00116, 0],
      [0.00978, 1],
      [-0.00042, 3],
      [0.00834, 1],
      [-0.00018, 3],
      [0.00026, 3]
    ]
  },
  "QA_mulInjTbpiCause[Motorcycle]": {
    "red_x_points": [
      [-0.004, 0],
      [-0.00032, 1],
      [-0.00025, 1],
      [-0.00028, 1],
      [0.00026, 1],
      [-0.0003, 1],
      [-0.00015, 1],
      [-0.00023, 1],
      [0.00079, 1],
      [-0.00021, 1],
      [-0.0001, 1],
      [-0.00012, 1],
      [-0.00625, 0],
      [-0.03302, 1],
      [0.00018, 1],
      [-0.00046, 1],
      [0.00018, 1],
      [-0.00029, 1],
      [-0.00067, 1],
      [-0.00859, 0],
      [0.00067, 1],
      [0.00189, 1],
      [-0.00019, 1],
      [-0.00013, 1],
      [-0.00015, 1],
      [-0.00696, 0],
      [-0.00018, 1],
      [-0.00023, 1],
      [-0.03404, 1],
      [0.00046, 1],
      [-0.00014, 1],
      [0.00019, 1]
    ],
    "red_o_points": [],
    "y_categories": ["N", "Y", "nan"],
    "blue_o_points": [],
    "blue_x_points": [
      [0.01486, 0],
      [-1e-5, 1],
      [0.01252, 0],
      [-0.00092, 1],
      [-0.00025, 1],
      [0.0129, 0],
      [0.00309, 1],
      [0.01231, 0],
      [0.00366, 1],
      [0.00293, 1]
    ]
  },
  "QS_mulLysisSite[Root]": {
    "red_x_points": [
      [-0.0005, 3],
      [-0.00183, 0],
      [-0.00502, 2],
      [-0.00181, 0],
      [-0.00042, 3],
      [-0.00209, 0],
      [-0.00176, 0],
      [-0.00192, 0],
      [-0.0009, 3],
      [-0.00195, 0],
      [-0.00179, 0],
      [-0.00139, 0],
      [-0.00066, 3],
      [0.00416, 1],
      [-0.00078, 3],
      [-0.00194, 0],
      [-0.00045, 3],
      [-0.0017, 0],
      [-0.00054, 3],
      [-0.00077, 3],
      [-0.0005, 3],
      [-0.00044, 3],
      [-0.00178, 0],
      [-0.00086, 3],
      [-0.00049, 3],
      [-0.00048, 3],
      [-0.00193, 0],
      [-0.00163, 0],
      [0.00396, 1],
      [-0.00041, 3],
      [-0.00481, 2],
      [-0.0005, 3]
    ],
    "red_o_points": [],
    "y_categories": ["N", "NOT APPLICABLE", "Y", "nan"],
    "blue_o_points": [],
    "blue_x_points": [
      [0.00627, 1],
      [-0.00034, 3],
      [0.00518, 1],
      [-0.0002, 0],
      [-0.00031, 0],
      [0.00495, 1],
      [-0.00026, 3],
      [0.00567, 1],
      [-0.00045, 3],
      [-0.00021, 3]
    ]
  },
  "QA_yonInjOrtsurg": {
    "red_x_points": [
      [-0.00128, 2],
      [-0.00027, 2],
      [-5e-5, 2],
      [-0.00027, 2],
      [-0.00126, 2],
      [-0.0, 2],
      [8e-5, 2],
      [0.00016, 1],
      [-0.0016, 2],
      [-0.00098, 0],
      [0.00048, 1],
      [8e-5, 1],
      [-0.00132, 2],
      [-0.00536, 0],
      [0.00492, 1],
      [-0.00053, 2],
      [-0.00211, 2],
      [-0.00158, 0],
      [-0.01059, 0],
      [-0.00909, 0],
      [0.00383, 1],
      [-0.00162, 2],
      [0.00064, 1],
      [-0.00224, 2],
      [-0.00119, 2],
      [-0.00204, 2],
      [-0.00112, 0],
      [-0.00111, 0],
      [0.0006, 1],
      [-0.0019, 2],
      [0.00026, 1],
      [-0.00169, 2]
    ],
    "red_o_points": [],
    "y_categories": ["N", "Y", "nan"],
    "blue_o_points": [],
    "blue_x_points": [
      [0.00015, 2],
      [0.01197, 1],
      [0.00051, 2],
      [0.00079, 2],
      [9e-5, 2],
      [0.00035, 2],
      [-0.00052, 2],
      [0.0003, 2],
      [0.01046, 1],
      [-0.00068, 2]
    ]
  },
  "QA_lstPexMuscstrength[ThumbOppo]": {
    "red_x_points": [
      [-0.00719, 1],
      [0.00041, 2],
      [-0.00461, 1],
      [-0.00429, 1],
      [-0.0075, 1],
      [0.00174, 0],
      [0.0013, 0],
      [-0.00538, 1],
      [0.00107, 0],
      [0.00125, 0],
      [0.00134, 0],
      [0.00174, 0],
      [0.00141, 0],
      [0.00069, 2],
      [0.00131, 2],
      [0.00047, 2],
      [0.00114, 0],
      [0.00059, 2],
      [0.00125, 2],
      [0.00102, 0],
      [-0.00775, 1],
      [0.00094, 0],
      [-0.00541, 1],
      [0.00099, 2],
      [0.00145, 2],
      [0.0011, 2],
      [0.00155, 0],
      [-0.00465, 1],
      [0.00069, 2],
      [-0.00734, 1],
      [-0.00511, 1],
      [0.00093, 2]
    ],
    "red_o_points": [],
    "y_categories": ["GREATER THAN OR EQUALS TO 3", "LESS THAN 3", "nan"],
    "blue_o_points": [],
    "blue_x_points": [
      [0.00048, 2],
      [0.00148, 2],
      [0.00144, 0],
      [0.00226, 2],
      [0.00329, 0],
      [0.00167, 0],
      [0.00435, 0],
      [0.00131, 0],
      [0.00286, 2],
      [0.00276, 2]
    ]
  },
  "QS_mulGraftLevel[Trunk]": {
    "red_x_points": [
      [-0.00024, 3],
      [-0.0012, 0],
      [-0.00099, 0],
      [-0.00076, 0],
      [-0.00019, 3],
      [-0.00121, 0],
      [-0.0011, 0],
      [-0.0009, 0],
      [-0.00022, 3],
      [-0.00097, 0],
      [-0.00102, 0],
      [-0.00114, 0],
      [-0.00019, 3],
      [0.0023, 1],
      [-0.00024, 3],
      [-0.00319, 2],
      [-0.00029, 3],
      [-0.00063, 0],
      [-0.00032, 3],
      [-0.00021, 3],
      [-0.00023, 3],
      [-0.00016, 3],
      [-0.0011, 0],
      [-0.00023, 3],
      [-0.00027, 3],
      [-0.00017, 3],
      [-0.00088, 0],
      [-0.00107, 0],
      [0.00171, 1],
      [-0.00014, 3],
      [-0.00093, 0],
      [-0.00024, 3]
    ],
    "red_o_points": [],
    "y_categories": ["N", "NOT APPLICABLE", "Y", "nan"],
    "blue_o_points": [],
    "blue_x_points": [
      [0.00339, 1],
      [-7e-5, 3],
      [0.00258, 1],
      [2e-5, 0],
      [-0.00055, 0],
      [0.00206, 1],
      [-0.0001, 3],
      [0.00282, 1],
      [-6e-5, 3],
      [-0.00014, 3]
    ]
  },
  "QS_mulGraftNerve[FI]": {
    "red_x_points": [
      [-0.0, 2],
      [-0.00081, 0],
      [-0.00055, 0],
      [-0.00072, 0],
      [-3e-5, 2],
      [-0.00049, 0],
      [-0.00066, 0],
      [-0.00052, 0],
      [-6e-5, 2],
      [-0.00074, 0],
      [-0.0009, 0],
      [-0.00067, 0],
      [-0.00031, 2],
      [0.00077, 1],
      [1e-5, 2],
      [-0.00081, 0],
      [-0.00016, 2],
      [-0.00058, 0],
      [-0.00012, 2],
      [-0.00017, 2],
      [-4e-5, 2],
      [-6e-5, 2],
      [-0.00062, 0],
      [3e-5, 2],
      [1e-5, 2],
      [-0.00011, 2],
      [-0.00074, 0],
      [-0.00067, 0],
      [0.00061, 1],
      [-2e-5, 2],
      [-0.0006, 0],
      [-7e-5, 2]
    ],
    "red_o_points": [],
    "y_categories": ["N", "NOT APPLICABLE", "nan"],
    "blue_o_points": [],
    "blue_x_points": [
      [0.00175, 1],
      [6e-5, 2],
      [0.0016, 1],
      [0.00015, 0],
      [-0.00026, 0],
      [0.00136, 1],
      [-1e-5, 2],
      [0.00125, 1],
      [2e-5, 2],
      [0.00015, 2]
    ]
  },
  "QS_mulGraftNerve[other]": {
    "red_x_points": [
      [-0.00012, 2],
      [-0.00054, 0],
      [-0.00033, 0],
      [-0.0006, 0],
      [-0.00023, 2],
      [-0.00063, 0],
      [-0.00049, 0],
      [-0.00053, 0],
      [-0.0001, 2],
      [-0.00047, 0],
      [-0.00067, 0],
      [-0.00049, 0],
      [5e-5, 2],
      [0.00048, 1],
      [-0.00012, 2],
      [-0.00053, 0],
      [-0.0002, 2],
      [-0.00044, 0],
      [-7e-5, 2],
      [-0.00025, 2],
      [-1e-5, 2],
      [-0.00027, 2],
      [-0.00048, 0],
      [-7e-5, 2],
      [-5e-5, 2],
      [-0.00015, 2],
      [-0.0006, 0],
      [-0.00044, 0],
      [0.00047, 1],
      [-1e-5, 2],
      [-0.00037, 0],
      [-0.0002, 2]
    ],
    "red_o_points": [],
    "y_categories": ["N", "NOT APPLICABLE", "nan"],
    "blue_o_points": [],
    "blue_x_points": [
      [0.00186, 1],
      [2e-5, 2],
      [0.00121, 1],
      [3e-5, 0],
      [-0.00022, 0],
      [0.00141, 1],
      [-4e-5, 2],
      [0.0012, 1],
      [1e-5, 2],
      [0.00018, 2]
    ]
  },
  "QS_mulTransfSite[AcSsAA]": {
    "red_x_points": [
      [-0.00249, 3],
      [-0.01477, 2],
      [-0.00393, 0],
      [-0.01537, 2],
      [-0.00224, 3],
      [-0.01983, 2],
      [-0.00382, 0],
      [-0.00438, 0],
      [-0.00242, 3],
      [-0.00431, 0],
      [-0.01691, 2],
      [-0.00403, 0],
      [-0.00254, 3],
      [0.0179, 1],
      [-0.00258, 3],
      [-0.01638, 2],
      [-0.00273, 3],
      [-0.00374, 0],
      [-0.00317, 3],
      [-0.00247, 3],
      [-0.00205, 3],
      [-0.00212, 3],
      [-0.01514, 2],
      [-0.00222, 3],
      [-0.00254, 3],
      [-0.0024, 3],
      [-0.00426, 0],
      [-0.01487, 2],
      [0.01949, 1],
      [-0.00213, 3],
      [-0.00358, 0],
      [-0.0024, 3]
    ],
    "red_o_points": [],
    "y_categories": ["N", "NOT APPLICABLE", "Y", "nan"],
    "blue_o_points": [],
    "blue_x_points": [
      [0.02555, 1],
      [-0.0008, 3],
      [0.02078, 1],
      [0.00099, 0],
      [-0.00017, 0],
      [0.02124, 1],
      [-0.00106, 3],
      [0.02131, 1],
      [-0.00087, 3],
      [-0.0011, 3]
    ]
  },
  "QS_mulGraftNerve[Ax]": {
    "red_x_points": [
      [-9e-5, 2],
      [-0.00019, 0],
      [-4e-5, 0],
      [-7e-5, 0],
      [-7e-5, 0],
      [-1e-5, 0],
      [-4e-5, 0],
      [-2e-5, 2],
      [-4e-5, 0],
      [-7e-5, 0],
      [-4e-5, 0],
      [-0.0001, 2],
      [0.00026, 1],
      [-1e-5, 2],
      [-3e-5, 0],
      [-4e-5, 0],
      [-0.0001, 2],
      [-0.0001, 2],
      [-2e-5, 2],
      [-2e-5, 2],
      [-7e-5, 0],
      [-0.0001, 2],
      [-8e-5, 2],
      [-0.0001, 2],
      [-4e-5, 0],
      [-7e-5, 0],
      [9e-5, 1],
      [-1e-5, 2],
      [-7e-5, 0],
      [-2e-5, 2]
    ],
    "red_o_points": [],
    "y_categories": ["N", "NOT APPLICABLE", "nan"],
    "blue_o_points": [],
    "blue_x_points": [
      [0.0002, 1],
      [3e-5, 2],
      [0.00019, 1],
      [0.0, 0],
      [-4e-5, 0],
      [0.00019, 1],
      [-2e-5, 2],
      [7e-5, 1],
      [-2e-5, 2],
      [4e-5, 2]
    ]
  },
  "QA_lstPexMuscstrength[WristFlex]": {
    "red_x_points": [
      [-0.00234, 1],
      [-0.00086, 2],
      [-0.0029, 1],
      [-0.00215, 1],
      [-0.00046, 0],
      [0.00011, 0],
      [0.00072, 0],
      [-0.00344, 1],
      [-0.00292, 0],
      [0.00109, 0],
      [0.00022, 0],
      [0.00022, 0],
      [-0.00283, 0],
      [-0.00135, 2],
      [-0.00075, 2],
      [-0.0008, 2],
      [-0.00052, 0],
      [-0.00077, 2],
      [-0.0017, 2],
      [-0.00491, 0],
      [-0.00217, 1],
      [-0.0048, 0],
      [-0.00186, 1],
      [5e-5, 2],
      [-0.00602, 1],
      [-0.00212, 0],
      [0.00101, 0],
      [0.00065, 0],
      [-0.00089, 2],
      [-0.00214, 1],
      [-0.00272, 1],
      [-0.00055, 2]
    ],
    "red_o_points": [],
    "y_categories": ["GREATER THAN OR EQUALS TO 3", "LESS THAN 3", "nan"],
    "blue_o_points": [],
    "blue_x_points": [
      [0.00076, 0],
      [0.00053, 2],
      [0.00142, 0],
      [0.00371, 0],
      [0.00187, 0],
      [0.00188, 0],
      [0.00144, 0],
      [0.0015, 0],
      [0.01038, 1],
      [0.00605, 2]
    ]
  },
  "QS_mulNeuromadSite[C5]": {
    "red_x_points": [
      [-0.00018, 2],
      [-0.00066, 0],
      [-0.00061, 0],
      [-0.00061, 0],
      [-0.00025, 2],
      [-0.00075, 0],
      [-0.00064, 0],
      [-0.00065, 0],
      [-0.00032, 2],
      [-0.00078, 0],
      [-0.00068, 0],
      [-0.00073, 0],
      [-0.00012, 2],
      [0.00077, 1],
      [-5e-5, 2],
      [-0.0007, 0],
      [-0.0002, 2],
      [-0.0006, 0],
      [-0.00032, 2],
      [-0.00026, 2],
      [-6e-5, 2],
      [-0.00021, 2],
      [-0.00053, 0],
      [-7e-5, 2],
      [-0.0001, 2],
      [-0.00016, 2],
      [-0.00064, 0],
      [-0.00058, 0],
      [0.00072, 1],
      [-6e-5, 2],
      [-0.00053, 0],
      [-7e-5, 2]
    ],
    "red_o_points": [],
    "y_categories": ["N", "NOT APPLICABLE", "nan"],
    "blue_o_points": [],
    "blue_x_points": [
      [0.00202, 1],
      [0.0, 2],
      [0.00204, 1],
      [0.00014, 0],
      [-0.00021, 0],
      [0.00191, 1],
      [-5e-5, 2],
      [0.00123, 1],
      [7e-5, 2],
      [1e-5, 2]
    ]
  },
  "QS_mulNeuromadSite[C7]": {
    "red_x_points": [
      [-0.00013, 2],
      [-0.00104, 0],
      [-0.00078, 0],
      [-0.00094, 0],
      [-0.00014, 2],
      [-0.00104, 0],
      [-0.00061, 0],
      [-0.00085, 0],
      [-0.0002, 2],
      [-0.00126, 0],
      [-0.001, 0],
      [-0.00081, 0],
      [-0.00026, 2],
      [0.00139, 1],
      [-4e-5, 2],
      [-0.00114, 0],
      [-9e-5, 2],
      [-0.00084, 0],
      [-9e-5, 2],
      [-0.00025, 2],
      [-9e-5, 2],
      [-0.00037, 2],
      [-0.00093, 0],
      [8e-5, 2],
      [-0.00049, 2],
      [-0.00023, 2],
      [-0.00095, 0],
      [-0.00093, 0],
      [0.00118, 1],
      [6e-5, 2],
      [-0.00079, 0],
      [-5e-5, 2]
    ],
    "red_o_points": [],
    "y_categories": ["N", "NOT APPLICABLE", "nan"],
    "blue_o_points": [],
    "blue_x_points": [
      [0.00227, 1],
      [0.00017, 2],
      [0.00233, 1],
      [0.00015, 0],
      [-0.00017, 0],
      [0.00185, 1],
      [-0.00013, 2],
      [0.0016, 1],
      [6e-5, 2],
      [0.00018, 2]
    ]
  },
  "QS_mulLysisRoot[C5]": {
    "red_x_points": [
      [-0.00096, 3],
      [-0.00322, 0],
      [-0.00757, 2],
      [-0.00344, 0],
      [-0.00094, 3],
      [-0.0035, 0],
      [-0.00293, 0],
      [-0.00316, 0],
      [-0.00108, 3],
      [-0.00351, 0],
      [-0.00343, 0],
      [-0.00262, 0],
      [-0.00077, 3],
      [0.00673, 1],
      [-0.00084, 3],
      [-0.00333, 0],
      [-0.00091, 3],
      [-0.00293, 0],
      [-0.00084, 3],
      [-0.0011, 3],
      [-0.00068, 3],
      [-0.00093, 3],
      [-0.00306, 0],
      [-0.00087, 3],
      [-0.0009, 3],
      [-0.00049, 3],
      [-0.00324, 0],
      [-0.00289, 0],
      [0.00625, 1],
      [-0.00078, 3],
      [-0.00668, 2],
      [-0.00116, 3]
    ],
    "red_o_points": [],
    "y_categories": ["N", "NOT APPLICABLE", "Y", "nan"],
    "blue_o_points": [],
    "blue_x_points": [
      [0.00908, 1],
      [-3e-5, 3],
      [0.00765, 1],
      [0.00025, 0],
      [-0.00075, 0],
      [0.008, 1],
      [-7e-5, 3],
      [0.00882, 1],
      [-0.0004, 3],
      [0.00013, 3]
    ]
  },
  "QA_lstPexMuscstrength[ElbowExte]": {
    "red_x_points": [
      [-0.00093, 1],
      [-0.00106, 2],
      [8e-5, 1],
      [0.00037, 1],
      [-0.0012, 1],
      [-0.00636, 0],
      [0.00084, 1],
      [0.00021, 1],
      [-0.00063, 1],
      [-0.00384, 0],
      [-0.00464, 0],
      [0.00079, 1],
      [-0.00022, 1],
      [-0.00067, 2],
      [-0.00172, 2],
      [-0.00236, 2],
      [-0.00099, 1],
      [-0.00115, 2],
      [-0.0017, 2],
      [-0.0058, 0],
      [-0.00092, 1],
      [-0.00509, 0],
      [0.00014, 1],
      [-0.00222, 2],
      [-0.00653, 0],
      [-0.00355, 0],
      [0.00147, 1],
      [-0.00114, 2],
      [-0.0009, 2],
      [-0.00086, 1],
      [0.00012, 1],
      [-0.00223, 2]
    ],
    "red_o_points": [],
    "y_categories": ["GREATER THAN OR EQUALS TO 3", "LESS THAN 3", "nan"],
    "blue_o_points": [],
    "blue_x_points": [
      [0.00026, 2],
      [-0.0002, 2],
      [0.00021, 0],
      [0.00522, 1],
      [0.00588, 1],
      [0.00045, 0],
      [0.00515, 0],
      [0.0003, 0],
      [0.00976, 1],
      [0.00675, 1]
    ]
  },
  "QS_mulGraftNerve[SS]": {
    "red_x_points": [
      [-9e-5, 0],
      [-0.0001, 0],
      [-0.0001, 0],
      [-3e-5, 2],
      [-3e-5, 0],
      [-3e-5, 2],
      [-0.0001, 0],
      [-3e-5, 0],
      [-3e-5, 0],
      [-1e-5, 2],
      [8e-5, 1],
      [-3e-5, 0],
      [-3e-5, 2],
      [-6e-5, 0],
      [-7e-5, 2],
      [-1e-5, 2],
      [-3e-5, 0],
      [-7e-5, 2],
      [-1e-5, 2],
      [-1e-5, 2],
      [-3e-5, 0],
      [-3e-5, 0],
      [0.00017, 1],
      [-3e-5, 2],
      [-3e-5, 0],
      [-9e-5, 2]
    ],
    "red_o_points": [],
    "y_categories": ["N", "NOT APPLICABLE", "nan"],
    "blue_o_points": [],
    "blue_x_points": [
      [0.00031, 1],
      [-1e-5, 2],
      [8e-5, 1],
      [-3e-5, 0],
      [0.00017, 1],
      [-1e-5, 2],
      [0.00017, 1],
      [-1e-5, 2],
      [-2e-5, 2]
    ]
  },
  "QS_mulGraftNerve[MCF]": {
    "red_x_points": [
      [-3e-5, 2],
      [-3e-5, 2],
      [-1e-5, 0],
      [-1e-5, 0],
      [-1e-5, 0],
      [-3e-5, 2],
      [-1e-5, 0],
      [-1e-5, 0],
      [-3e-5, 2],
      [8e-5, 1],
      [-3e-5, 2],
      [-3e-5, 2],
      [-1e-5, 0],
      [-3e-5, 2],
      [-3e-5, 2],
      [-3e-5, 2],
      [-3e-5, 2],
      [-1e-5, 0],
      [-3e-5, 2],
      [-3e-5, 2],
      [-1e-5, 0],
      [-1e-5, 0],
      [8e-5, 1],
      [-3e-5, 2]
    ],
    "red_o_points": [],
    "y_categories": ["N", "NOT APPLICABLE", "nan"],
    "blue_o_points": [],
    "blue_x_points": [
      [8e-5, 1],
      [-3e-5, 2],
      [-1e-5, 0],
      [-1e-5, 0],
      [8e-5, 1],
      [8e-5, 1],
      [-3e-5, 2]
    ]
  },
  "QS_mulNeuromadSite[C6]": {
    "red_x_points": [
      [-0.00015, 2],
      [-0.00118, 0],
      [-0.00101, 0],
      [-0.00083, 0],
      [-0.00037, 2],
      [-0.00098, 0],
      [-0.00095, 0],
      [-0.00078, 0],
      [-0.00013, 2],
      [-0.00123, 0],
      [-0.00123, 0],
      [-0.0009, 0],
      [-0.00032, 2],
      [0.00163, 1],
      [-4e-5, 2],
      [-0.00128, 0],
      [-0.00017, 2],
      [-0.00113, 0],
      [-4e-5, 2],
      [-0.00014, 2],
      [-0.00016, 2],
      [-0.00016, 2],
      [-0.00078, 0],
      [3e-5, 2],
      [-0.00041, 2],
      [-0.0001, 2],
      [-0.00102, 0],
      [-0.00108, 0],
      [0.00113, 1],
      [-5e-5, 2],
      [-0.00103, 0],
      [-9e-5, 2]
    ],
    "red_o_points": [],
    "y_categories": ["N", "NOT APPLICABLE", "nan"],
    "blue_o_points": [],
    "blue_x_points": [
      [0.00299, 1],
      [0.00012, 2],
      [0.00247, 1],
      [2e-5, 0],
      [-0.00038, 0],
      [0.00162, 1],
      [-1e-5, 2],
      [0.00223, 1],
      [-3e-5, 2],
      [3e-5, 2]
    ]
  },
  "QA_lstPexArthre[Index]": {
    "red_x_points": [
      [-0.00198, 0],
      [-0.00133, 2],
      [-0.0026, 2],
      [-0.00143, 0],
      [-0.00347, 2],
      [0.00144, 1],
      [0.00186, 1],
      [-0.0029, 0],
      [-0.00516, 2],
      [0.00231, 1],
      [0.00148, 1],
      [-0.00555, 0],
      [0.00092, 1],
      [-0.00098, 2],
      [-0.00258, 2],
      [0.00125, 1],
      [-0.00327, 2],
      [-0.00162, 2],
      [-0.0021, 2],
      [-0.00088, 1],
      [-0.00304, 0],
      [-0.00146, 1],
      [-0.0009, 2],
      [-0.00243, 2],
      [0.00042, 1],
      [-0.00389, 2],
      [-0.00235, 2],
      [-0.0011, 2],
      [-0.00119, 2],
      [-0.00263, 2],
      [-0.00328, 0],
      [-0.00282, 2]
    ],
    "red_o_points": [],
    "y_categories": ["NPV", "PV", "nan"],
    "blue_o_points": [],
    "blue_x_points": [
      [0.00196, 0],
      [-0.00106, 2],
      [0.00108, 1],
      [0.00645, 1],
      [0.00404, 1],
      [0.0009, 1],
      [0.00918, 0],
      [-0.00017, 2],
      [0.00561, 1],
      [0.00352, 1]
    ]
  },
  "QS_mulGraftNerve[TD]": {
    "red_x_points": [
      [-5e-5, 2],
      [-0.00018, 0],
      [-0.00026, 0],
      [-0.00026, 0],
      [-6e-5, 2],
      [-0.00039, 0],
      [-0.00023, 0],
      [-0.00015, 0],
      [-0.00016, 2],
      [-0.00029, 0],
      [-0.00031, 0],
      [-0.00027, 0],
      [-0.00019, 2],
      [0.00036, 1],
      [-6e-5, 2],
      [-0.00026, 0],
      [-0.00019, 2],
      [-0.00016, 0],
      [-9e-5, 2],
      [-0.00019, 2],
      [-0.0001, 2],
      [-0.00018, 2],
      [-0.00017, 0],
      [-8e-5, 2],
      [-7e-5, 2],
      [-6e-5, 2],
      [-0.00022, 0],
      [-0.00013, 0],
      [0.00048, 1],
      [-4e-5, 2],
      [-0.00023, 0],
      [-0.0001, 2]
    ],
    "red_o_points": [],
    "y_categories": ["N", "NOT APPLICABLE", "nan"],
    "blue_o_points": [],
    "blue_x_points": [
      [0.00064, 1],
      [-1e-5, 2],
      [0.0007, 1],
      [-7e-5, 0],
      [-0.00018, 0],
      [0.0007, 1],
      [-4e-5, 2],
      [0.00083, 1],
      [-4e-5, 2],
      [3e-5, 2]
    ]
  },
  "QS_mulLysisRoot[C7]": {
    "red_x_points": [
      [-0.00022, 3],
      [-0.00127, 0],
      [-0.00365, 2],
      [-0.00123, 0],
      [-0.0004, 3],
      [-0.00117, 0],
      [-0.0012, 0],
      [-0.00141, 0],
      [-0.0003, 3],
      [-0.00149, 0],
      [-0.00116, 0],
      [-0.00105, 0],
      [-0.00021, 3],
      [0.00246, 1],
      [-0.0003, 3],
      [-0.00129, 0],
      [-0.00044, 3],
      [-0.00084, 0],
      [-0.00028, 3],
      [-0.00029, 3],
      [-0.00025, 3],
      [-0.00013, 3],
      [-0.00109, 0],
      [-0.00046, 3],
      [-0.00027, 3],
      [-0.00047, 3],
      [-0.00114, 0],
      [-0.00115, 0],
      [0.0023, 1],
      [-0.0003, 3],
      [-0.00109, 0],
      [-0.00031, 3]
    ],
    "red_o_points": [],
    "y_categories": ["N", "NOT APPLICABLE", "Y", "nan"],
    "blue_o_points": [],
    "blue_x_points": [
      [0.00459, 1],
      [-0.00013, 3],
      [0.00231, 1],
      [-2e-5, 0],
      [-0.00066, 0],
      [0.00348, 1],
      [-0.00018, 3],
      [0.00321, 1],
      [-6e-5, 3],
      [-0.00015, 3]
    ]
  },
  "QS_mulTransfSite[IMc]": {
    "red_x_points": [
      [-0.00149, 3],
      [-0.00966, 2],
      [-0.00395, 0],
      [-0.00427, 0],
      [-0.00135, 3],
      [-0.00419, 0],
      [-0.00416, 0],
      [-0.00421, 0],
      [-0.00192, 3],
      [-0.00471, 0],
      [-0.00466, 0],
      [-0.00461, 0],
      [-0.0017, 3],
      [0.01106, 1],
      [-0.00145, 3],
      [-0.00438, 0],
      [-0.00151, 3],
      [-0.01021, 2],
      [-0.00192, 3],
      [-0.00195, 3],
      [-0.00145, 3],
      [-0.00134, 3],
      [-0.00424, 0],
      [-0.00157, 3],
      [-0.00183, 3],
      [-0.00157, 3],
      [-0.00451, 0],
      [-0.00897, 2],
      [0.0098, 1],
      [-0.00128, 3],
      [-0.01025, 2],
      [-0.0015, 3]
    ],
    "red_o_points": [],
    "y_categories": ["N", "NOT APPLICABLE", "Y", "nan"],
    "blue_o_points": [],
    "blue_x_points": [
      [0.0153, 1],
      [-0.00051, 3],
      [0.01261, 1],
      [-2e-5, 0],
      [-0.0011, 0],
      [0.01343, 1],
      [-0.00052, 3],
      [0.01382, 1],
      [-0.00076, 3],
      [-0.00059, 3]
    ]
  },
  "QS_lstBpsurgSide": {
    "red_x_points": [
      [-0.00113, 3],
      [-0.00585, 0],
      [-0.00658, 0],
      [-0.00607, 0],
      [-0.00155, 3],
      [-0.00762, 2],
      [-0.00674, 0],
      [-0.00681, 0],
      [-0.00174, 3],
      [-0.00815, 0],
      [-0.0077, 2],
      [-0.00733, 2],
      [-0.00172, 3],
      [0.01064, 1],
      [-0.00119, 3],
      [-0.00729, 2],
      [-0.00188, 3],
      [-0.00759, 2],
      [-0.00099, 3],
      [-0.00185, 3],
      [-0.00138, 3],
      [-0.0017, 3],
      [-0.00632, 0],
      [-0.00121, 3],
      [-0.00143, 3],
      [-0.00109, 3],
      [-0.00711, 2],
      [-0.00603, 2],
      [0.01152, 1],
      [-0.00129, 3],
      [-0.00675, 0],
      [-0.00124, 3]
    ],
    "red_o_points": [],
    "y_categories": ["L", "NOT APPLICABLE", "R", "nan"],
    "blue_o_points": [],
    "blue_x_points": [
      [0.0169, 1],
      [-3e-5, 3],
      [0.0151, 1],
      [0.00229, 0],
      [0.00038, 2],
      [0.01526, 1],
      [-0.00059, 3],
      [0.01494, 1],
      [-0.00018, 3],
      [-0.00017, 3]
    ]
  },
  "QA_lstPexPain[T1]": {
    "red_x_points": [
      [-0.00925, 1],
      [-0.00233, 2],
      [-0.00217, 2],
      [-0.00188, 2],
      [-0.00958, 1],
      [-0.00584, 0],
      [0.00127, 1],
      [0.00116, 1],
      [0.00664, 0],
      [0.00199, 1],
      [-0.00313, 0],
      [-0.00488, 0],
      [0.00637, 0],
      [-0.00916, 2],
      [-0.00502, 2],
      [-0.00328, 2],
      [-0.00468, 2],
      [-0.00198, 2],
      [-0.0049, 2],
      [0.00639, 0],
      [-0.00935, 1],
      [0.007, 0],
      [-0.00275, 2],
      [-0.00441, 2],
      [-0.00947, 1],
      [-0.00512, 2],
      [-0.00316, 2],
      [-0.00219, 2],
      [-0.00447, 1],
      [-0.01035, 1],
      [9e-5, 1],
      [-0.01, 1]
    ],
    "red_o_points": [],
    "y_categories": ["NORM", "NPV", "nan"],
    "blue_o_points": [],
    "blue_x_points": [
      [0.00018, 1],
      [-0.00057, 2],
      [0.00414, 0],
      [0.0065, 1],
      [0.01001, 1],
      [0.00012, 1],
      [0.01017, 0],
      [0.00474, 0],
      [0.01218, 0],
      [0.01428, 0]
    ]
  },
  "QS_mulTransfSite[AcMc]": {
    "red_x_points": [
      [-0.00047, 3],
      [-0.00087, 0],
      [-0.00046, 0],
      [-0.00105, 0],
      [-0.00036, 3],
      [-0.00116, 0],
      [-0.00072, 0],
      [-0.00093, 0],
      [-0.00043, 3],
      [-0.0011, 0],
      [-0.0009, 0],
      [-0.00574, 2],
      [-0.0004, 3],
      [0.00192, 1],
      [-0.00042, 3],
      [-0.00105, 0],
      [-0.00042, 3],
      [-0.00074, 0],
      [-0.00027, 3],
      [-0.00066, 3],
      [-0.0004, 3],
      [-0.00047, 3],
      [-0.00088, 0],
      [-0.00053, 3],
      [-0.00041, 3],
      [-0.00039, 3],
      [-0.00091, 0],
      [-0.00098, 0],
      [0.00277, 1],
      [-0.00037, 3],
      [-0.00089, 0],
      [-0.00026, 3]
    ],
    "red_o_points": [],
    "y_categories": ["N", "NOT APPLICABLE", "Y", "nan"],
    "blue_o_points": [],
    "blue_x_points": [
      [0.00335, 1],
      [-0.00011, 3],
      [0.00287, 1],
      [0.00038, 0],
      [-8e-5, 0],
      [0.00327, 1],
      [-0.00018, 3],
      [0.00305, 1],
      [-0.00022, 3],
      [-4e-5, 3]
    ]
  },
  "QA_lstPexKine[Shoulder]": {
    "red_x_points": [
      [-0.00137, 1],
      [-0.00222, 2],
      [-0.00326, 2],
      [-0.00258, 2],
      [-0.00475, 2],
      [-0.0032, 1],
      [-0.00183, 1],
      [0.00355, 0],
      [-0.00594, 2],
      [-0.00214, 1],
      [-0.00214, 1],
      [-0.00292, 1],
      [-0.00187, 1],
      [-0.00106, 2],
      [-0.00364, 2],
      [-0.00094, 1],
      [-0.00487, 2],
      [-0.00203, 2],
      [-0.00372, 2],
      [-0.00259, 1],
      [-0.00097, 1],
      [-0.00249, 1],
      [-0.00191, 2],
      [-0.00347, 2],
      [-0.00138, 1],
      [-0.00502, 2],
      [-0.00473, 2],
      [-0.00304, 2],
      [-0.00115, 2],
      [-0.0039, 2],
      [-0.00102, 1],
      [-0.00373, 2]
    ],
    "red_o_points": [],
    "y_categories": ["NPV", "PV", "nan"],
    "blue_o_points": [],
    "blue_x_points": [
      [-8e-5, 1],
      [-0.0018, 2],
      [-0.00026, 1],
      [0.00041, 1],
      [0.0218, 0],
      [-0.00012, 1],
      [0.03071, 0],
      [-0.00051, 2],
      [0.00029, 1],
      [0.00061, 1]
    ]
  },
  "QA_yonInjBpsurg": {
    "red_x_points": [
      [-0.0018, 1],
      [-0.00122, 1],
      [-0.00175, 1],
      [-0.0015, 1],
      [-0.00203, 1],
      [-0.00224, 1],
      [-0.00169, 1],
      [-0.00166, 1],
      [-0.00251, 1],
      [-0.00218, 1],
      [-0.0018, 1],
      [-0.00172, 1],
      [-0.00234, 1],
      [0.0042, 0],
      [-0.00178, 1],
      [-0.00189, 1],
      [-0.00269, 1],
      [-0.00124, 1],
      [-0.00158, 1],
      [-0.0023, 1],
      [-0.00153, 1],
      [-0.00231, 1],
      [-0.00121, 1],
      [-0.00187, 1],
      [-0.00235, 1],
      [-0.00193, 1],
      [-0.0017, 1],
      [-0.00135, 1],
      [0.00454, 0],
      [-0.00164, 1],
      [-0.00148, 1],
      [-0.00198, 1]
    ],
    "red_o_points": [],
    "y_categories": ["N", "Y", "nan"],
    "blue_o_points": [],
    "blue_x_points": [
      [0.00822, 0],
      [-0.00019, 1],
      [0.00839, 0],
      [-0.00137, 1],
      [-0.00227, 1],
      [0.00794, 0],
      [-0.00114, 1],
      [0.00892, 0],
      [-0.00063, 1],
      [-0.00076, 1]
    ]
  },
  "QA_equInjTbpiAge": {
    "red_x_points": [
      [0.00087, 1],
      [-2e-5, 1],
      [-9e-5, 1],
      [-0.00028, 0],
      [0.00108, 1],
      [-0.00051, 0],
      [-0.00088, 1],
      [-0.00048, 1],
      [-0.00909, 0],
      [-0.00137, 0],
      [-0.0007, 0],
      [-0.00054, 1],
      [-0.00523, 0],
      [-0.01211, 1],
      [0.00113, 1],
      [-5e-5, 1],
      [0.00108, 1],
      [-0.00093, 0],
      [-0.00686, 0],
      [0.00125, 1],
      [-0.00566, 0],
      [0.00131, 1],
      [-5e-5, 1],
      [0.00118, 1],
      [-0.00035, 1],
      [-0.00786, 0],
      [-0.00076, 1],
      [-0.00012, 1],
      [-0.01186, 1],
      [0.00091, 1],
      [-0.00092, 0],
      [0.00095, 1]
    ],
    "red_o_points": [],
    "y_categories": ["GREATER THAN OR EQUALS TO 30", "LESS THAN 30", "nan"],
    "blue_o_points": [],
    "blue_x_points": [
      [-0.00449, 1],
      [0.00302, 1],
      [0.00673, 0],
      [0.0014, 1],
      [0.00295, 0],
      [0.00779, 0],
      [0.00375, 1],
      [0.00658, 0],
      [0.00455, 1],
      [0.00313, 1]
    ]
  },
  "QS_mulLysisNerve[Ssr]": {
    "red_x_points": [
      [-0.00033, 3],
      [-0.00091, 0],
      [-0.00354, 2],
      [-0.00096, 0],
      [-0.00036, 3],
      [-0.00101, 0],
      [-0.00055, 0],
      [-0.00082, 0],
      [-0.00041, 3],
      [-0.00077, 0],
      [-0.00071, 0],
      [-0.00055, 0],
      [-0.0004, 3],
      [0.00195, 1],
      [-0.00044, 3],
      [-0.00088, 0],
      [-0.00032, 3],
      [-0.00077, 0],
      [-0.00026, 3],
      [-0.00039, 3],
      [-0.00023, 3],
      [-0.00031, 3],
      [-0.00071, 0],
      [-0.00041, 3],
      [-0.0003, 3],
      [-0.0004, 3],
      [-0.0007, 0],
      [-0.00057, 0],
      [0.00206, 1],
      [-0.00031, 3],
      [-0.00049, 0],
      [-0.0003, 3]
    ],
    "red_o_points": [],
    "y_categories": ["N", "NOT APPLICABLE", "Y", "nan"],
    "blue_o_points": [],
    "blue_x_points": [
      [0.00267, 1],
      [-0.0001, 3],
      [0.00212, 1],
      [0.00011, 0],
      [-5e-5, 0],
      [0.00229, 1],
      [-0.00015, 3],
      [0.00256, 1],
      [-0.00031, 3],
      [-1e-5, 3]
    ]
  },
  "QS_mulBpsurgeryType[Graft]": {
    "red_x_points": [
      [-0.00033, 3],
      [-0.00057, 0],
      [-0.00061, 0],
      [-0.00078, 0],
      [-0.00036, 3],
      [-0.00075, 0],
      [-0.00062, 0],
      [-0.00081, 0],
      [-0.00026, 3],
      [-0.00062, 0],
      [-0.00087, 0],
      [-0.00076, 0],
      [-0.00024, 3],
      [0.0013, 1],
      [-0.00044, 3],
      [-0.00224, 2],
      [-0.00034, 3],
      [-0.00032, 0],
      [-0.00044, 3],
      [-0.00028, 3],
      [-0.00026, 3],
      [-0.00025, 3],
      [-0.00051, 0],
      [-0.00034, 3],
      [-0.0003, 3],
      [-0.00031, 3],
      [-0.00075, 0],
      [-0.00096, 0],
      [0.0019, 1],
      [-0.00026, 3],
      [-0.00077, 0],
      [-0.00052, 3]
    ],
    "red_o_points": [],
    "y_categories": ["N", "NOT APPLICABLE", "Y", "nan"],
    "blue_o_points": [],
    "blue_x_points": [
      [0.00204, 1],
      [-8e-5, 3],
      [0.00253, 1],
      [-0.0001, 0],
      [-0.00062, 0],
      [0.00217, 1],
      [-0.00022, 3],
      [0.00226, 1],
      [-0.00013, 3],
      [-0.0002, 3]
    ]
  },
  "QA_lstPexMuscstrength[WristExte]": {
    "red_x_points": [
      [0.00094, 1],
      [-0.00138, 2],
      [-0.00413, 1],
      [-0.00195, 1],
      [0.00076, 1],
      [0.00048, 0],
      [-0.00353, 1],
      [-0.00345, 1],
      [-0.00919, 0],
      [0.0023, 0],
      [0.00061, 0],
      [-0.00496, 1],
      [-0.00757, 0],
      [-0.00071, 2],
      [-0.00037, 2],
      [-0.00131, 2],
      [-0.00453, 0],
      [-0.00196, 2],
      [0.0003, 2],
      [-0.01025, 0],
      [0.00112, 1],
      [-0.01206, 0],
      [-0.00153, 1],
      [-0.00014, 2],
      [-0.00818, 0],
      [0.00179, 1],
      [0.00189, 0],
      [0.00106, 0],
      [-0.00088, 2],
      [0.00093, 1],
      [-0.00355, 1],
      [-0.0, 2]
    ],
    "red_o_points": [],
    "y_categories": ["GREATER THAN OR EQUALS TO 3", "LESS THAN 3", "nan"],
    "blue_o_points": [],
    "blue_x_points": [
      [0.00058, 0],
      [0.00202, 2],
      [0.00021, 0],
      [0.00737, 0],
      [0.0048, 0],
      [0.00085, 1],
      [0.00796, 1],
      [0.0005, 0],
      [0.01056, 1],
      [0.00917, 2]
    ]
  },
  "QS_mulGraftNerve[Me]": {
    "red_x_points": [
      [-6e-5, 2],
      [-6e-5, 0],
      [-7e-5, 0],
      [-0.00012, 0],
      [-3e-5, 2],
      [-0.00011, 0],
      [-7e-5, 0],
      [-0.00011, 0],
      [-0.00011, 0],
      [-0.00011, 0],
      [-0.00016, 0],
      [-3e-5, 2],
      [9e-5, 1],
      [1e-5, 2],
      [-0.00011, 0],
      [-1e-5, 2],
      [-5e-5, 0],
      [4e-5, 2],
      [-8e-5, 2],
      [-3e-5, 2],
      [-6e-5, 2],
      [-6e-5, 0],
      [-2e-5, 2],
      [4e-5, 2],
      [1e-5, 2],
      [-7e-5, 0],
      [-5e-5, 0],
      [-2e-5, 1],
      [-1e-5, 2],
      [-7e-5, 0],
      [-6e-5, 2]
    ],
    "red_o_points": [],
    "y_categories": ["N", "NOT APPLICABLE", "nan"],
    "blue_o_points": [],
    "blue_x_points": [
      [0.00031, 1],
      [2e-5, 2],
      [0.00025, 1],
      [0.00015, 0],
      [-1e-5, 0],
      [0.00025, 1],
      [-1e-5, 2],
      [0.0001, 1],
      [-1e-5, 2],
      [3e-5, 2]
    ]
  },
  "QA_lstPexPalle[Clavicle]": {
    "red_x_points": [
      [-0.00307, 3],
      [-0.00126, 3],
      [-0.00146, 3],
      [-0.00158, 3],
      [-0.00301, 3],
      [-0.00836, 2],
      [-0.00536, 2],
      [-0.00185, 3],
      [-0.00397, 3],
      [-0.00243, 3],
      [-0.00623, 2],
      [-0.00638, 2],
      [-0.00751, 0],
      [0.00043, 3],
      [-0.00261, 3],
      [-0.00186, 3],
      [-0.00305, 3],
      [-0.00098, 3],
      [-0.00209, 3],
      [-0.00937, 0],
      [-0.00745, 0],
      [-0.00326, 2],
      [-0.00013, 1],
      [-0.003, 3],
      [-0.00591, 2],
      [-0.00304, 3],
      [-0.00219, 3],
      [-0.00179, 3],
      [-0.01735, 2],
      [-0.00205, 3],
      [0.00074, 0],
      [-0.00309, 3]
    ],
    "red_o_points": [],
    "y_categories": ["HYPO", "NAIA", "PT", "nan"],
    "blue_o_points": [],
    "blue_x_points": [
      [0.00131, 3],
      [-0.00088, 3],
      [0.00919, 0],
      [-5e-5, 3],
      [0.0209, 0],
      [0.00164, 3],
      [0.03402, 1],
      [0.00181, 3],
      [0.00894, 2],
      [0.00027, 3]
    ]
  },
  "QS_mulGraftNerve[LT]": {
    "red_x_points": [
      [-0.0, 2],
      [-6e-5, 0],
      [-0.0, 2],
      [-6e-5, 0],
      [-6e-5, 0],
      [9e-5, 1],
      [-0.0, 2],
      [-6e-5, 0],
      [-0.0, 2],
      [-0.0, 2],
      [-0.0, 2],
      [-0.0, 2],
      [-6e-5, 0],
      [-0.0, 2],
      [-0.0, 2]
    ],
    "red_o_points": [],
    "y_categories": ["N", "NOT APPLICABLE", "nan"],
    "blue_o_points": [],
    "blue_x_points": [[9e-5, 1], [-0.0, 2], [9e-5, 1], [-0.0, 2]]
  },
  "QA_lstPexMuscstrength[ShoulderAbduc]": {
    "red_x_points": [
      [-0.00317, 1],
      [-0.0027, 1],
      [-0.00263, 1],
      [-0.00282, 1],
      [-0.00301, 1],
      [-0.00322, 1],
      [-0.00306, 1],
      [-0.00319, 1],
      [-0.00328, 1],
      [-0.0028, 1],
      [-0.00264, 1],
      [-0.00251, 1],
      [-0.00305, 1],
      [0.00044, 2],
      [0.00069, 2],
      [0.00094, 2],
      [0.00091, 2],
      [0.00079, 2],
      [0.00093, 2],
      [-0.00318, 1],
      [-0.00303, 1],
      [-0.00308, 1],
      [-0.00256, 1],
      [0.00096, 2],
      [-0.00341, 1],
      [-0.0024, 1],
      [-0.00263, 1],
      [-0.00256, 1],
      [0.00093, 2],
      [-0.0032, 1],
      [-0.00244, 1],
      [0.00095, 2]
    ],
    "red_o_points": [],
    "y_categories": ["GREATER THAN OR EQUALS TO 3", "LESS THAN 3", "nan"],
    "blue_o_points": [],
    "blue_x_points": [
      [0.00091, 2],
      [0.00135, 2],
      [0.01872, 0],
      [0.00178, 2],
      [-0.00197, 1],
      [0.01726, 0],
      [0.00149, 2],
      [-0.00109, 1],
      [-0.00173, 1],
      [-0.00167, 1]
    ]
  },
  "QA_lstPexTouch[C7]": {
    "red_x_points": [
      [-0.0077, 1],
      [-0.00216, 2],
      [-0.00206, 1],
      [-0.00139, 2],
      [-0.00768, 1],
      [0.00216, 0],
      [-0.00315, 1],
      [-0.00309, 1],
      [0.00603, 0],
      [-0.00363, 1],
      [0.00263, 0],
      [-0.00333, 1],
      [-0.00832, 1],
      [-0.0066, 2],
      [-0.00315, 2],
      [-0.00196, 2],
      [-0.00771, 1],
      [-0.00182, 2],
      [-0.00376, 2],
      [0.00591, 0],
      [-0.00875, 1],
      [0.00496, 0],
      [-0.00182, 2],
      [-0.00346, 2],
      [0.00423, 0],
      [0.00578, 0],
      [-0.00276, 1],
      [-0.00192, 2],
      [-0.00188, 1],
      [-0.00406, 2],
      [-0.00281, 1],
      [-0.00824, 1]
    ],
    "red_o_points": [],
    "y_categories": ["NORM", "NPV", "nan"],
    "blue_o_points": [],
    "blue_x_points": [
      [0.00014, 1],
      [-6e-5, 2],
      [0.00059, 1],
      [0.00226, 1],
      [0.00941, 0],
      [0.00052, 1],
      [0.00924, 0],
      [0.00433, 0],
      [0.00851, 0],
      [0.00893, 0]
    ]
  },
  "QS_mulGraftNerve[IS]": {
    "red_x_points": [
      [1e-5, 2],
      [-4e-5, 0],
      [-4e-5, 0],
      [-4e-5, 0],
      [-4e-5, 0],
      [-4e-5, 0],
      [1e-5, 2],
      [-4e-5, 0],
      [-4e-5, 0],
      [1e-5, 2],
      [1e-5, 2],
      [-4e-5, 0],
      [-4e-5, 0],
      [1e-5, 2],
      [1e-5, 2],
      [-4e-5, 0],
      [1e-5, 2],
      [1e-5, 2],
      [-4e-5, 0],
      [-4e-5, 0],
      [0.0001, 1],
      [1e-5, 2],
      [-4e-5, 0],
      [1e-5, 2]
    ],
    "red_o_points": [],
    "y_categories": ["N", "NOT APPLICABLE", "nan"],
    "blue_o_points": [],
    "blue_x_points": [
      [0.0001, 1],
      [1e-5, 2],
      [0.0001, 1],
      [-4e-5, 0],
      [0.0001, 1],
      [1e-5, 2],
      [0.0001, 1],
      [1e-5, 2]
    ]
  },
  "QS_mulGraftNerve[MC]": {
    "red_x_points": [
      [-1e-5, 2],
      [-0.0001, 0],
      [-0.0001, 0],
      [-0.0001, 0],
      [1e-5, 2],
      [-0.0001, 0],
      [-6e-5, 0],
      [1e-5, 2],
      [-4e-5, 0],
      [-0.00016, 0],
      [-6e-5, 0],
      [-1e-5, 2],
      [0.00018, 1],
      [1e-5, 2],
      [-6e-5, 0],
      [1e-5, 2],
      [-0.0001, 0],
      [1e-5, 2],
      [1e-5, 2],
      [1e-5, 2],
      [-1e-5, 2],
      [1e-5, 2],
      [2e-5, 2],
      [-0.0001, 0],
      [-0.0001, 0],
      [7e-5, 1],
      [1e-5, 2],
      [-6e-5, 0],
      [1e-5, 2]
    ],
    "red_o_points": [],
    "y_categories": ["N", "NOT APPLICABLE", "nan"],
    "blue_o_points": [],
    "blue_x_points": [
      [0.00026, 1],
      [1e-5, 2],
      [0.0001, 1],
      [-4e-5, 0],
      [0.0001, 1],
      [1e-5, 2],
      [0.00018, 1],
      [2e-5, 2],
      [1e-5, 2]
    ]
  },
  "QS_mulNeuromadSite[C4]": {
    "red_x_points": [
      [-0.00016, 2],
      [-0.001, 0],
      [-0.00092, 0],
      [-0.00088, 0],
      [-0.00027, 2],
      [-0.00126, 0],
      [-0.00095, 0],
      [-0.00083, 0],
      [-0.00047, 2],
      [-0.00106, 0],
      [-0.00114, 0],
      [-0.00097, 0],
      [-0.00045, 2],
      [0.00105, 1],
      [-0.00012, 2],
      [-0.00083, 0],
      [-0.00053, 2],
      [-0.00082, 0],
      [-0.00019, 2],
      [-0.00067, 2],
      [-0.00013, 2],
      [-0.0005, 2],
      [-0.0008, 0],
      [-0.00014, 2],
      [-0.00069, 2],
      [-0.00021, 2],
      [-0.00079, 0],
      [-0.00102, 0],
      [0.0013, 1],
      [-0.00018, 2],
      [-0.00082, 0],
      [-0.00025, 2]
    ],
    "red_o_points": [],
    "y_categories": ["N", "NOT APPLICABLE", "nan"],
    "blue_o_points": [],
    "blue_x_points": [
      [0.0028, 1],
      [0.00024, 2],
      [0.00252, 1],
      [0.00034, 0],
      [-0.0005, 0],
      [0.00233, 1],
      [-0.00014, 2],
      [0.0031, 1],
      [-1e-5, 2],
      [-4e-5, 2]
    ]
  },
  "QS_mulGraftNerve[Ra]": {
    "red_x_points": [
      [-2e-5, 2],
      [-9e-5, 0],
      [-6e-5, 0],
      [-9e-5, 0],
      [1e-5, 2],
      [-9e-5, 0],
      [-9e-5, 0],
      [-3e-5, 0],
      [-1e-5, 2],
      [-9e-5, 0],
      [-9e-5, 0],
      [-2e-5, 2],
      [0.00019, 1],
      [-9e-5, 0],
      [-2e-5, 2],
      [-9e-5, 0],
      [1e-5, 2],
      [-1e-5, 2],
      [-1e-5, 2],
      [-1e-5, 2],
      [-9e-5, 0],
      [-1e-5, 2],
      [-1e-5, 2],
      [-2e-5, 2],
      [-6e-5, 0],
      [-6e-5, 0],
      [8e-5, 1],
      [-1e-5, 2],
      [-3e-5, 0],
      [-1e-5, 2]
    ],
    "red_o_points": [],
    "y_categories": ["N", "NOT APPLICABLE", "nan"],
    "blue_o_points": [],
    "blue_x_points": [
      [0.00019, 1],
      [-2e-5, 2],
      [0.00019, 1],
      [-3e-5, 0],
      [-3e-5, 0],
      [0.00019, 1],
      [-1e-5, 2],
      [1e-5, 2],
      [1e-5, 2]
    ]
  },
  "QS_mulTransfSite[Oberlin]": {
    "red_x_points": [
      [-0.00208, 3],
      [-0.01535, 0],
      [-0.01527, 0],
      [-0.01498, 0],
      [-0.00228, 3],
      [-0.00304, 2],
      [-0.00244, 2],
      [-0.01574, 0],
      [-0.00262, 3],
      [-0.00284, 2],
      [-0.00307, 2],
      [-0.00269, 2],
      [-0.00246, 3],
      [0.01905, 1],
      [-0.002, 3],
      [-0.00253, 2],
      [-0.00217, 3],
      [-0.0156, 0],
      [-0.00267, 3],
      [-0.00279, 3],
      [-0.00237, 3],
      [-0.00253, 3],
      [-0.01559, 0],
      [-0.00186, 3],
      [-0.00305, 3],
      [-0.00217, 3],
      [-0.00237, 2],
      [-0.01589, 0],
      [0.0189, 1],
      [-0.00189, 3],
      [-0.01698, 0],
      [-0.00216, 3]
    ],
    "red_o_points": [],
    "y_categories": ["N", "NOT APPLICABLE", "Y", "nan"],
    "blue_o_points": [],
    "blue_x_points": [
      [0.02364, 1],
      [-0.00087, 3],
      [0.02041, 1],
      [0.0021, 2],
      [0.00127, 2],
      [0.02186, 1],
      [-0.00133, 3],
      [0.02134, 1],
      [-0.00111, 3],
      [-0.00054, 3]
    ]
  },
  "QS_mulLysisSite[Nerve]": {
    "red_x_points": [
      [-0.00019, 3],
      [-0.00076, 0],
      [-0.00266, 2],
      [-0.00074, 0],
      [-0.00023, 3],
      [-0.00083, 0],
      [-0.00063, 0],
      [-0.00064, 0],
      [-0.00018, 3],
      [-0.0007, 0],
      [-0.00072, 0],
      [-0.00053, 0],
      [-0.00013, 3],
      [0.00231, 1],
      [-0.00026, 3],
      [-0.00084, 0],
      [-0.00012, 3],
      [-0.0007, 0],
      [-0.00031, 3],
      [-0.00032, 3],
      [-0.0001, 3],
      [-0.00016, 3],
      [-0.00073, 0],
      [-0.00029, 3],
      [-0.00026, 3],
      [-0.00022, 3],
      [-0.0008, 0],
      [-0.00088, 0],
      [0.00161, 1],
      [-0.00021, 3],
      [-0.00072, 0],
      [-0.00015, 3]
    ],
    "red_o_points": [],
    "y_categories": ["N", "NOT APPLICABLE", "Y", "nan"],
    "blue_o_points": [],
    "blue_x_points": [
      [0.00238, 1],
      [-9e-5, 3],
      [0.00167, 1],
      [-0.00029, 0],
      [-0.00026, 0],
      [0.00213, 1],
      [-6e-5, 3],
      [0.00199, 1],
      [-4e-5, 3],
      [-5e-5, 3]
    ]
  },
  "QA_lstPexMuscstrength[ElbowFlex]": {
    "red_x_points": [
      [-0.00307, 1],
      [-0.00202, 2],
      [-0.00326, 1],
      [-0.0031, 1],
      [-0.00266, 1],
      [0.00819, 0],
      [-0.00335, 1],
      [-0.00318, 1],
      [-0.00328, 1],
      [-0.00405, 1],
      [-0.00303, 1],
      [-0.00438, 1],
      [-0.00332, 1],
      [-0.0024, 2],
      [-0.00241, 2],
      [-0.00263, 2],
      [-0.00311, 1],
      [-0.00248, 2],
      [-0.00263, 2],
      [-0.00295, 1],
      [-0.0029, 1],
      [-0.00282, 1],
      [-0.00251, 1],
      [-0.00288, 2],
      [0.00139, 0],
      [-0.00223, 1],
      [-0.00335, 1],
      [-0.00295, 1],
      [-0.00226, 2],
      [-0.0028, 1],
      [-0.00327, 1],
      [-0.00274, 2]
    ],
    "red_o_points": [],
    "y_categories": ["GREATER THAN OR EQUALS TO 3", "LESS THAN 3", "nan"],
    "blue_o_points": [],
    "blue_x_points": [
      [-0.00069, 2],
      [-0.00072, 2],
      [0.00993, 0],
      [-0.00102, 1],
      [0.01938, 0],
      [0.00948, 0],
      [-0.00115, 1],
      [0.01066, 0],
      [0.00028, 1],
      [0.00043, 1]
    ]
  },
  "QA_lstPexKine[Index]": {
    "red_x_points": [
      [-0.00164, 0],
      [-0.00067, 2],
      [-0.00152, 2],
      [-0.00091, 2],
      [-0.0027, 2],
      [0.00021, 1],
      [0.00096, 1],
      [-0.00214, 0],
      [-0.00551, 2],
      [0.00069, 1],
      [0.00013, 1],
      [0.0007, 1],
      [-2e-5, 1],
      [-0.00051, 2],
      [-0.00245, 2],
      [0.00031, 1],
      [-0.00351, 2],
      [-0.00105, 2],
      [-0.00164, 2],
      [-0.00079, 1],
      [-0.00343, 0],
      [-0.00101, 1],
      [-0.00047, 2],
      [-0.00239, 2],
      [0.00038, 1],
      [-0.00375, 2],
      [-0.00188, 2],
      [-0.00059, 2],
      [-0.00053, 2],
      [-0.00261, 2],
      [-0.00246, 0],
      [-0.00275, 2]
    ],
    "red_o_points": [],
    "y_categories": ["NPV", "PV", "nan"],
    "blue_o_points": [],
    "blue_x_points": [
      [0.00051, 1],
      [-0.00076, 2],
      [0.00025, 1],
      [0.00306, 1],
      [0.00191, 1],
      [0.00056, 1],
      [0.01111, 0],
      [-0.00027, 2],
      [0.00517, 1],
      [0.00406, 1]
    ]
  }
}
