{
  "QS_mulLysisTrunk[Upper]": {
    "red_x_points": [
      [-0.00207, 3],
      [-0.00317, 0],
      [-0.00269, 0],
      [-0.00286, 0],
      [-0.00274, 0],
      [-0.00503, 2],
      [-0.00282, 0],
      [-0.00197, 3],
      [-0.00292, 0],
      [-0.00305, 0],
      [-0.00279, 0],
      [-0.00189, 3],
      [0.00837, 1],
      [-0.00201, 3],
      [-0.00309, 0],
      [-0.00234, 3],
      [-0.00556, 2],
      [-0.00293, 0],
      [-0.00216, 3],
      [-0.00215, 3],
      [-0.00221, 3],
      [-0.00286, 0],
      [-0.0019, 3],
      [-0.00206, 3],
      [-0.00195, 3],
      [-0.0029, 0],
      [-0.00188, 3],
      [-0.00305, 0],
      [-0.00195, 3],
      [0.00893, 1],
      [-0.00483, 2]
    ],
    "red_o_points": [],
    "y_categories": ["N", "NOT APPLICABLE", "Y", "nan"],
    "blue_o_points": [],
    "blue_x_points": [
      [0.01087, 1],
      [-0.00075, 3],
      [0.01025, 1],
      [-0.00133, 0],
      [-0.00042, 3],
      [0.00981, 1],
      [0.01018, 1]
    ]
  },
  "QS_mulBpsurgeryType[Transf]": {
    "red_x_points": [
      [-0.00066, 3],
      [-0.00079, 2],
      [-0.00174, 0],
      [-0.00083, 2],
      [-0.0007, 2],
      [-0.0007, 2],
      [-0.00073, 2],
      [-0.00064, 3],
      [-0.00088, 2],
      [-0.00083, 2],
      [-0.00064, 2],
      [-0.00071, 3],
      [0.0027, 1],
      [-0.00063, 3],
      [-0.00069, 2],
      [-0.00064, 3],
      [-0.00057, 2],
      [-0.00071, 2],
      [-0.00076, 3],
      [-0.00076, 3],
      [-0.00057, 3],
      [-0.00068, 2],
      [-0.0007, 3],
      [-0.00081, 3],
      [-0.00082, 3],
      [-0.00062, 2],
      [-0.00068, 3],
      [-0.00064, 2],
      [-0.00074, 3],
      [0.00273, 1],
      [-0.00082, 2]
    ],
    "red_o_points": [],
    "y_categories": ["N", "NOT APPLICABLE", "Y", "nan"],
    "blue_o_points": [],
    "blue_x_points": [
      [0.00242, 1],
      [-0.00022, 3],
      [0.00239, 1],
      [-0.00085, 2],
      [-0.00026, 3],
      [0.00252, 1],
      [0.00293, 1]
    ]
  },
  "QA_yonPreOrtsurg": {
    "red_x_points": [
      [-0.00327, 0],
      [-0.00048, 2],
      [-8e-5, 0],
      [-2e-5, 0],
      [-7e-5, 0],
      [-6e-5, 0],
      [-9e-5, 0],
      [-0.00072, 2],
      [-8e-5, 0],
      [-6e-5, 0],
      [-0.00036, 2],
      [0.00484, 1],
      [-0.00089, 0],
      [-0.00088, 2],
      [-0.00025, 0],
      [-0.0041, 0],
      [7e-5, 1],
      [-6e-5, 0],
      [-0.00316, 0],
      [-0.00355, 0],
      [-0.00335, 0],
      [-6e-5, 0],
      [-0.00427, 0],
      [-0.00412, 0],
      [-0.00319, 0],
      [-0.00022, 2],
      [-0.00063, 2],
      [-8e-5, 0],
      [-0.00046, 2],
      [-0.00055, 2],
      [0.00046, 1]
    ],
    "red_o_points": [],
    "y_categories": ["N", "Y", "nan"],
    "blue_o_points": [],
    "blue_x_points": [
      [2e-5, 0],
      [0.00154, 2],
      [-1e-5, 0],
      [9e-5, 0],
      [0.01519, 1],
      [2e-5, 0],
      [2e-5, 0]
    ]
  },
  "QS_mulTransfSite[Double]": {
    "red_x_points": [
      [-1e-5, 2],
      [-1e-5, 0],
      [-1e-5, 0],
      [-1e-5, 0],
      [-1e-5, 0],
      [-1e-5, 0],
      [-1e-5, 0],
      [-1e-5, 2],
      [-1e-5, 2],
      [-1e-5, 0],
      [-1e-5, 2],
      [-1e-5, 0],
      [-1e-5, 2],
      [-1e-5, 2],
      [-1e-5, 0],
      [-1e-5, 2],
      [-1e-5, 0],
      [-1e-5, 0]
    ],
    "red_o_points": [],
    "y_categories": ["N", "NOT APPLICABLE", "nan"],
    "blue_o_points": [],
    "blue_x_points": [[0.00019, 1]]
  },
  "QS_mulGraftRoot[T1]": {
    "red_x_points": [
      [-2e-5, 0],
      [-2e-5, 0],
      [-2e-5, 0],
      [-2e-5, 2],
      [-0.0001, 1],
      [-2e-5, 2],
      [-2e-5, 0],
      [-2e-5, 2],
      [-2e-5, 2],
      [-0.0001, 2],
      [5e-5, 0],
      [-0.0001, 1]
    ],
    "red_o_points": [],
    "y_categories": ["N", "NOT APPLICABLE", "nan"],
    "blue_o_points": [],
    "blue_x_points": [[0.0, 2], [0.00015, 0], [0.00018, 1]]
  },
  "QS_mulGraftTrunk[MiddleTrunk]": {
    "red_x_points": [
      [-2e-5, 2],
      [-3e-5, 0],
      [-3e-5, 0],
      [-3e-5, 0],
      [-3e-5, 0],
      [-3e-5, 0],
      [-3e-5, 0],
      [-3e-5, 0],
      [-2e-5, 2],
      [0.0001, 1],
      [-3e-5, 0],
      [-2e-5, 2],
      [-3e-5, 0],
      [-3e-5, 0],
      [-2e-5, 2],
      [-3e-5, 0],
      [-2e-5, 2],
      [-2e-5, 2],
      [-3e-5, 0],
      [-2e-5, 2],
      [-3e-5, 0],
      [-2e-5, 2],
      [0.0001, 1]
    ],
    "red_o_points": [],
    "y_categories": ["N", "NOT APPLICABLE", "nan"],
    "blue_o_points": [],
    "blue_x_points": [
      [0.0001, 1],
      [-2e-5, 2],
      [-3e-5, 0],
      [0.0001, 1],
      [0.0001, 1]
    ]
  },
  "QS_mulGraftTrunk[LowerTrunk]": {
    "red_x_points": [
      [-2e-5, 2],
      [-1e-5, 0],
      [-2e-5, 0],
      [-2e-5, 0],
      [-2e-5, 0],
      [-2e-5, 0],
      [-1e-5, 0],
      [-2e-5, 0],
      [-1e-5, 0],
      [-2e-5, 0],
      [-2e-5, 2],
      [-2e-5, 2],
      [-2e-5, 0],
      [-2e-5, 2],
      [-2e-5, 0],
      [-1e-5, 2],
      [-2e-5, 2],
      [-2e-5, 2],
      [-2e-5, 0],
      [-2e-5, 0]
    ],
    "red_o_points": [],
    "y_categories": ["N", "NOT APPLICABLE", "nan"],
    "blue_o_points": [],
    "blue_x_points": [[0.00038, 1]]
  },
  "QS_mulGraftNerve[Ph]": {
    "red_x_points": [
      [-0.00039, 2],
      [-0.00135, 0],
      [-0.00133, 0],
      [-0.0012, 0],
      [-0.00123, 0],
      [-0.00111, 0],
      [-0.00133, 0],
      [-0.00041, 2],
      [-0.00126, 0],
      [-0.00124, 0],
      [-0.00131, 0],
      [-0.00048, 2],
      [0.00181, 1],
      [-0.00044, 2],
      [-0.00125, 0],
      [-0.00054, 2],
      [-0.00096, 0],
      [-0.00131, 0],
      [-0.00038, 2],
      [-0.00044, 2],
      [-0.00045, 2],
      [-0.00111, 0],
      [-0.00054, 2],
      [-0.00059, 2],
      [-0.00059, 2],
      [-0.00133, 0],
      [-0.00039, 2],
      [-0.0014, 0],
      [-0.00049, 2],
      [0.00244, 1],
      [-0.00132, 0]
    ],
    "red_o_points": [],
    "y_categories": ["N", "NOT APPLICABLE", "nan"],
    "blue_o_points": [],
    "blue_x_points": [
      [0.00392, 1],
      [4e-5, 2],
      [0.00327, 1],
      [-5e-5, 0],
      [-0.00016, 2],
      [0.00325, 1],
      [0.00475, 1]
    ]
  },
  "QA_yonInjDisloc": {
    "red_x_points": [
      [0.0, 2],
      [-1e-5, 2],
      [-1e-5, 2],
      [-1e-5, 2],
      [-1e-5, 2],
      [-1e-5, 2],
      [-1e-5, 2],
      [-1e-5, 2],
      [-1e-5, 2],
      [-1e-5, 2],
      [-7e-5, 2],
      [-1e-5, 2],
      [-1e-5, 2],
      [-1e-5, 2],
      [-1e-5, 2],
      [-1e-5, 2],
      [-0.00026, 0],
      [-1e-5, 2],
      [-1e-5, 2],
      [-1e-5, 2],
      [-1e-5, 2],
      [-1e-5, 2],
      [-8e-5, 1]
    ],
    "red_o_points": [],
    "y_categories": ["N", "Y", "nan"],
    "blue_o_points": [],
    "blue_x_points": [
      [1e-5, 2],
      [-1e-5, 2],
      [0.00032, 0],
      [0.00014, 1],
      [1e-5, 2]
    ]
  },
  "QA_mulInjOrthesisType[ArmSling]": {
    "red_x_points": [
      [-0.00967, 2],
      [-0.00906, 2],
      [-0.00905, 2],
      [-0.00883, 2],
      [-0.00931, 2],
      [-0.0088, 2],
      [-0.00923, 2],
      [-0.00942, 2],
      [-0.0091, 2],
      [-0.00895, 2],
      [-0.00923, 2],
      [-0.00932, 2],
      [0.0249, 1],
      [-0.00951, 2],
      [-0.00929, 2],
      [-0.00962, 2],
      [-0.01065, 0],
      [-0.00864, 2],
      [-0.00978, 2],
      [-0.00955, 2],
      [-0.01078, 0],
      [-0.01077, 3],
      [-0.00982, 2],
      [0.02774, 1],
      [-0.00995, 2],
      [-0.0084, 2],
      [-0.0087, 2],
      [-0.00878, 2],
      [-0.01154, 3],
      [-0.01451, 3],
      [-0.0088, 2]
    ],
    "red_o_points": [],
    "y_categories": ["N", "NOT APPLICABLE", "Y", "nan"],
    "blue_o_points": [],
    "blue_x_points": [
      [-0.00446, 2],
      [0.02477, 1],
      [0.02475, 1],
      [0.02929, 1],
      [0.02593, 1],
      [0.02403, 1],
      [0.02287, 1]
    ]
  },
  "QS_mulGraftRoot[C4]": {
    "red_x_points": [
      [0.0, 2],
      [-3e-5, 0],
      [-3e-5, 0],
      [-3e-5, 0],
      [-3e-5, 0],
      [-3e-5, 0],
      [0.0, 2],
      [-3e-5, 0],
      [-3e-5, 0],
      [0.0, 2],
      [0.0001, 1],
      [0.0, 2],
      [-3e-5, 0],
      [-3e-5, 0],
      [0.0, 2],
      [0.0, 2],
      [0.0, 2],
      [-3e-5, 0],
      [0.0, 2],
      [0.0, 2],
      [-3e-5, 0],
      [-3e-5, 0],
      [-3e-5, 0]
    ],
    "red_o_points": [],
    "y_categories": ["N", "NOT APPLICABLE", "nan"],
    "blue_o_points": [],
    "blue_x_points": [
      [0.0001, 1],
      [-3e-5, 0],
      [0.0, 2],
      [0.0001, 1],
      [0.0001, 1]
    ]
  },
  "QA_lstPexPain[C6]": {
    "red_x_points": [
      [-0.00044, 1],
      [-0.00011, 2],
      [-3e-5, 2],
      [-0.00011, 2],
      [-0.00093, 0],
      [0.0001, 1],
      [0.0001, 1],
      [-0.00099, 0],
      [0.00017, 1],
      [0.0001, 1],
      [7e-5, 1],
      [-0.00042, 1],
      [-0.00059, 2],
      [0.00034, 2],
      [-0.00011, 2],
      [0.00041, 2],
      [-6e-5, 2],
      [0.0001, 1],
      [-0.00105, 0],
      [-0.00057, 1],
      [-0.00052, 1],
      [-8e-5, 2],
      [0.00063, 2],
      [-0.00481, 0],
      [0.00043, 2],
      [-0.00019, 2],
      [-0.00064, 1],
      [-0.00015, 2],
      [-0.00074, 1],
      [6e-5, 1],
      [6e-5, 1]
    ],
    "red_o_points": [],
    "y_categories": ["NORM", "NPV", "nan"],
    "blue_o_points": [],
    "blue_x_points": [
      [0.0001, 1],
      [0.00073, 2],
      [0.001, 1],
      [0.00125, 1],
      [0.00077, 2],
      [0.00082, 1],
      [0.00093, 1]
    ]
  },
  "QS_mulGraftLevel[Nerve]": {
    "red_x_points": [
      [-2e-5, 2],
      [-9e-5, 0],
      [-5e-5, 0],
      [-9e-5, 0],
      [-9e-5, 0],
      [-9e-5, 0],
      [-3e-5, 2],
      [-5e-5, 0],
      [-9e-5, 0],
      [-9e-5, 0],
      [-3e-5, 2],
      [0.00022, 1],
      [1e-5, 2],
      [-9e-5, 0],
      [-3e-5, 2],
      [-9e-5, 0],
      [-9e-5, 0],
      [-2e-5, 2],
      [-3e-5, 2],
      [-2e-5, 2],
      [-5e-5, 0],
      [1e-5, 2],
      [-2e-5, 2],
      [-2e-5, 2],
      [-5e-5, 0],
      [1e-5, 2],
      [-9e-5, 0],
      [-3e-5, 2],
      [0.0001, 1],
      [-5e-5, 0]
    ],
    "red_o_points": [],
    "y_categories": ["N", "NOT APPLICABLE", "nan"],
    "blue_o_points": [],
    "blue_x_points": [
      [0.00022, 1],
      [-2e-5, 2],
      [0.0001, 1],
      [1e-5, 2],
      [0.00022, 1]
    ]
  },
  "QA_lstPexInspectio[SurgicalScar]": {
    "red_x_points": [
      [0.00174, 1],
      [0.00071, 1],
      [0.00037, 0],
      [0.00063, 1],
      [-0.00275, 2],
      [0.00038, 0],
      [0.00058, 1],
      [0.0017, 1],
      [0.00063, 1],
      [-0.00208, 2],
      [0.00067, 1],
      [-0.00159, 0],
      [-0.00074, 1],
      [-0.00444, 2],
      [0.00089, 1],
      [0.00156, 1],
      [-0.00061, 0],
      [-0.00335, 2],
      [-0.00301, 2],
      [-0.00358, 2],
      [0.00161, 1],
      [0.00083, 1],
      [-0.00403, 2],
      [-0.00866, 2],
      [0.00155, 1],
      [0.0008, 1],
      [-0.00458, 2],
      [-0.0019, 2],
      [0.00162, 1],
      [-0.00082, 1],
      [-0.00213, 2]
    ],
    "red_o_points": [],
    "y_categories": ["ABS", "NAIA", "PT", "nan"],
    "blue_o_points": [],
    "blue_x_points": [
      [0.00032, 1],
      [0.00267, 1],
      [0.00409, 0],
      [0.00262, 1],
      [0.00366, 1],
      [0.00028, 1],
      [0.0041, 0]
    ]
  },
  "QA_intPexWristFlex": {
    "red_x_points": [[0.00085, 2], [-0.00014, 1], [-4e-5, 0], [-0.01686, 1]],
    "red_o_points": [],
    "y_categories": ["GREATER THAN OR EQUALS TO 60", "LESS THAN 60", "nan"],
    "blue_o_points": [],
    "blue_x_points": [
      [0.00141, 2],
      [0.00669, 0],
      [6e-5, 2],
      [6e-5, 2],
      [0.0014, 2],
      [0.00136, 2]
    ]
  },
  "QS_mulGraftNerve[Me]": {
    "red_x_points": [
      [-0.00046, 2],
      [-0.0008, 0],
      [-0.00109, 0],
      [-0.0009, 0],
      [-0.00093, 0],
      [-0.00094, 0],
      [-0.0009, 0],
      [-0.00057, 2],
      [-0.00095, 0],
      [-0.00102, 0],
      [-0.00081, 0],
      [-0.00032, 2],
      [0.00188, 1],
      [-0.00039, 2],
      [-0.00076, 0],
      [-0.00046, 2],
      [-0.00092, 0],
      [-0.00109, 0],
      [-0.0004, 2],
      [-0.00055, 2],
      [-0.00039, 2],
      [-0.00087, 0],
      [-0.00044, 2],
      [-0.00055, 2],
      [-0.00038, 2],
      [-0.00093, 0],
      [-0.00034, 2],
      [-0.00094, 0],
      [-0.00043, 2],
      [0.00209, 1],
      [-0.00082, 0]
    ],
    "red_o_points": [],
    "y_categories": ["N", "NOT APPLICABLE", "nan"],
    "blue_o_points": [],
    "blue_x_points": [
      [0.00347, 1],
      [6e-5, 2],
      [0.00243, 1],
      [-0.00014, 0],
      [-5e-5, 2],
      [0.00199, 1],
      [0.00237, 1]
    ]
  },
  "QS_mulGraftRoot[T2]": {
    "red_x_points": [
      [-5e-5, 2],
      [-9e-5, 0],
      [-4e-5, 0],
      [-9e-5, 0],
      [-9e-5, 0],
      [-4e-5, 0],
      [-9e-5, 0],
      [-3e-5, 2],
      [-9e-5, 0],
      [-9e-5, 0],
      [-2e-5, 0],
      [-5e-5, 2],
      [0.00017, 1],
      [-7e-5, 2],
      [-9e-5, 0],
      [-0.0, 2],
      [-2e-5, 0],
      [-7e-5, 0],
      [-7e-5, 2],
      [-7e-5, 2],
      [-2e-5, 2],
      [-2e-5, 0],
      [-7e-5, 2],
      [-0.0, 2],
      [-5e-5, 2],
      [-9e-5, 0],
      [-7e-5, 2],
      [-7e-5, 0],
      [-7e-5, 2],
      [0.00017, 1],
      [-4e-5, 0]
    ],
    "red_o_points": [],
    "y_categories": ["N", "NOT APPLICABLE", "nan"],
    "blue_o_points": [],
    "blue_x_points": [
      [0.00033, 1],
      [-3e-5, 2],
      [9e-5, 1],
      [-4e-5, 0],
      [-0.0, 2],
      [0.00024, 1],
      [0.00024, 1]
    ]
  },
  "QS_mulGraftRoot[C7]": {
    "red_x_points": [
      [-3e-5, 0],
      [-3e-5, 0],
      [-3e-5, 0],
      [-3e-5, 0],
      [-3e-5, 0],
      [-1e-5, 2],
      [-3e-5, 0],
      [-3e-5, 0],
      [-1e-5, 2],
      [-1e-5, 2],
      [-3e-5, 0],
      [-1e-5, 2],
      [-3e-5, 0],
      [-1e-5, 2],
      [-1e-5, 2],
      [-1e-5, 2],
      [-3e-5, 0],
      [-1e-5, 2],
      [-3e-5, 0],
      [-1e-5, 2],
      [-3e-5, 0],
      [-1e-5, 2],
      [-3e-5, 0]
    ],
    "red_o_points": [],
    "y_categories": ["N", "NOT APPLICABLE", "nan"],
    "blue_o_points": [],
    "blue_x_points": [[0.00015, 1], [-1e-5, 2], [-3e-5, 0], [0.00015, 1]]
  },
  "QS_mulLysisSite[Trunk]": {
    "red_x_points": [
      [-0.00154, 3],
      [-0.00298, 0],
      [-0.00302, 0],
      [-0.00273, 0],
      [-0.0032, 0],
      [-0.00466, 2],
      [-0.00291, 0],
      [-0.00146, 3],
      [-0.00244, 0],
      [-0.00311, 0],
      [-0.00268, 0],
      [-0.00154, 3],
      [0.00774, 1],
      [-0.00142, 3],
      [-0.00253, 0],
      [-0.00143, 3],
      [-0.00563, 2],
      [-0.00312, 0],
      [-0.00175, 3],
      [-0.00137, 3],
      [-0.00158, 3],
      [-0.00261, 0],
      [-0.00155, 3],
      [-0.00148, 3],
      [-0.0016, 3],
      [-0.00288, 0],
      [-0.00142, 3],
      [-0.00291, 0],
      [-0.00162, 3],
      [0.00819, 1],
      [-0.00472, 2]
    ],
    "red_o_points": [],
    "y_categories": ["N", "NOT APPLICABLE", "Y", "nan"],
    "blue_o_points": [],
    "blue_x_points": [
      [0.01054, 1],
      [-0.00036, 3],
      [0.00916, 1],
      [-0.00154, 0],
      [-0.00047, 3],
      [0.00898, 1],
      [0.0098, 1]
    ]
  },
  "QS_mulTransfSite[PhMc]": {
    "red_x_points": [
      [-0.00149, 3],
      [-0.00263, 0],
      [-0.00308, 0],
      [-0.00321, 0],
      [-0.00302, 0],
      [-0.00303, 0],
      [-0.00498, 2],
      [-0.00155, 3],
      [-0.00283, 0],
      [-0.00286, 0],
      [-0.00247, 0],
      [-0.00157, 3],
      [0.00692, 1],
      [-0.00174, 3],
      [-0.00293, 0],
      [-0.00162, 3],
      [-0.00284, 0],
      [-0.00265, 0],
      [-0.00178, 3],
      [-0.00143, 3],
      [-0.00162, 3],
      [-0.00453, 2],
      [-0.00168, 3],
      [-0.00186, 3],
      [-0.0019, 3],
      [-0.00291, 0],
      [-0.00158, 3],
      [-0.00307, 0],
      [-0.00137, 3],
      [0.00846, 1],
      [-0.00281, 0]
    ],
    "red_o_points": [],
    "y_categories": ["N", "NOT APPLICABLE", "Y", "nan"],
    "blue_o_points": [],
    "blue_x_points": [
      [0.0112, 1],
      [-0.0008, 3],
      [0.00942, 1],
      [-0.00185, 0],
      [-0.00056, 3],
      [0.00929, 1],
      [0.00953, 1]
    ]
  },
  "QS_mulLysisSite[Root]": {
    "red_x_points": [
      [-0.00098, 3],
      [-0.00133, 0],
      [-0.00272, 2],
      [-0.00139, 0],
      [-0.00139, 0],
      [-0.00147, 0],
      [-0.00145, 0],
      [-0.00086, 3],
      [-0.00134, 0],
      [-0.00143, 0],
      [-0.00131, 0],
      [-0.00073, 3],
      [0.00441, 1],
      [-0.00083, 3],
      [-0.00139, 0],
      [-0.00093, 3],
      [-0.00136, 0],
      [-0.00137, 0],
      [-0.00084, 3],
      [-0.00092, 3],
      [-0.00067, 3],
      [-0.00145, 0],
      [-0.00081, 3],
      [-0.00104, 3],
      [-0.00077, 3],
      [-0.00139, 0],
      [-0.00106, 3],
      [-0.00124, 0],
      [-0.00082, 3],
      [0.00386, 1],
      [-0.00252, 2]
    ],
    "red_o_points": [],
    "y_categories": ["N", "NOT APPLICABLE", "Y", "nan"],
    "blue_o_points": [],
    "blue_x_points": [
      [0.00599, 1],
      [-0.00033, 3],
      [0.00491, 1],
      [-0.00135, 0],
      [-0.00035, 3],
      [0.00445, 1],
      [0.00463, 1]
    ]
  },
  "QA_yonInjOrtsurg": {
    "red_x_points": [
      [-0.00385, 2],
      [-0.00032, 2],
      [5e-5, 2],
      [6e-5, 2],
      [-4e-5, 2],
      [-2e-5, 2],
      [-0.00033, 1],
      [-0.00317, 2],
      [-9e-5, 0],
      [-2e-5, 1],
      [-0.00012, 1],
      [-0.00356, 2],
      [-0.0026, 0],
      [0.00015, 1],
      [-0.00019, 2],
      [-0.00351, 2],
      [-3e-5, 0],
      [-0.00019, 2],
      [0.00336, 0],
      [-0.00016, 1],
      [-0.00362, 2],
      [-0.0002, 1],
      [-0.00436, 2],
      [-0.00395, 2],
      [-0.00341, 2],
      [-9e-5, 0],
      [-0.00071, 1],
      [0.0, 0],
      [-0.00331, 2],
      [-0.00178, 1],
      [1e-5, 1]
    ],
    "red_o_points": [],
    "y_categories": ["N", "Y", "nan"],
    "blue_o_points": [],
    "blue_x_points": [
      [0.00062, 2],
      [0.0038, 1],
      [0.00063, 2],
      [0.00024, 2],
      [0.01311, 0],
      [0.00048, 2],
      [0.00059, 2]
    ]
  },
  "QS_mulGraftNerve[other]": {
    "red_x_points": [
      [-0.0007, 2],
      [-0.00206, 0],
      [-0.00249, 0],
      [-0.00195, 0],
      [-0.00222, 0],
      [-0.00213, 0],
      [-0.00213, 0],
      [-0.00072, 2],
      [-0.00224, 0],
      [-0.00237, 0],
      [-0.00201, 0],
      [-0.00082, 2],
      [0.00372, 1],
      [-0.00068, 2],
      [-0.00186, 0],
      [-0.0008, 2],
      [-0.00205, 0],
      [-0.00214, 0],
      [-0.00101, 2],
      [-0.00069, 2],
      [-0.00068, 2],
      [-0.00195, 0],
      [-0.00079, 2],
      [-0.00088, 2],
      [-0.00083, 2],
      [-0.00188, 0],
      [-0.00081, 2],
      [-0.00185, 0],
      [-0.00066, 2],
      [0.00393, 1],
      [-0.00233, 0]
    ],
    "red_o_points": [],
    "y_categories": ["N", "NOT APPLICABLE", "nan"],
    "blue_o_points": [],
    "blue_x_points": [
      [0.00725, 1],
      [-5e-5, 2],
      [0.00561, 1],
      [-0.00025, 0],
      [-0.00017, 2],
      [0.00418, 1],
      [0.00617, 1]
    ]
  },
  "QS_mulGraftNerve[DS]": {
    "red_x_points": [
      [-0.0, 2],
      [-0.00013, 0],
      [-0.00014, 0],
      [-0.00014, 0],
      [-0.00013, 0],
      [-9e-5, 0],
      [-0.00013, 0],
      [1e-5, 2],
      [-6e-5, 0],
      [-9e-5, 0],
      [-9e-5, 0],
      [-3e-5, 2],
      [0.00019, 1],
      [-0.0, 2],
      [-0.00014, 0],
      [-0.0, 2],
      [-9e-5, 0],
      [-0.00013, 0],
      [-0.0, 2],
      [3e-5, 2],
      [-4e-5, 2],
      [-0.00011, 0],
      [-0.0, 2],
      [-0.0, 2],
      [-0.0, 2],
      [-0.00013, 0],
      [-1e-5, 2],
      [-0.00013, 0],
      [-3e-5, 2],
      [0.00021, 1],
      [-6e-5, 0]
    ],
    "red_o_points": [],
    "y_categories": ["N", "NOT APPLICABLE", "nan"],
    "blue_o_points": [],
    "blue_x_points": [
      [0.00031, 1],
      [2e-5, 2],
      [0.00031, 1],
      [-5e-5, 0],
      [-0.0, 2],
      [0.00012, 1],
      [0.00019, 1]
    ]
  },
  "QS_mulGraftNerve[LP]": {
    "red_x_points": [
      [-6e-5, 2],
      [-0.00017, 0],
      [-0.00014, 0],
      [-0.0001, 0],
      [-0.00017, 0],
      [-0.00017, 0],
      [-0.0001, 0],
      [-8e-5, 2],
      [-0.00014, 0],
      [-0.00014, 0],
      [-0.00014, 0],
      [-6e-5, 2],
      [0.00021, 1],
      [-9e-5, 2],
      [-0.0001, 0],
      [-8e-5, 2],
      [-6e-5, 0],
      [-0.00014, 0],
      [-8e-5, 2],
      [-0.0, 2],
      [-9e-5, 2],
      [-0.00016, 0],
      [-0.0, 2],
      [-8e-5, 2],
      [-8e-5, 2],
      [-0.00019, 0],
      [-5e-5, 2],
      [-9e-5, 0],
      [-8e-5, 2],
      [0.00012, 1],
      [-0.00016, 0]
    ],
    "red_o_points": [],
    "y_categories": ["N", "NOT APPLICABLE", "nan"],
    "blue_o_points": [],
    "blue_x_points": [
      [0.00048, 1],
      [1e-5, 2],
      [0.00039, 1],
      [-5e-5, 0],
      [-3e-5, 2],
      [0.00031, 1],
      [0.00048, 1]
    ]
  },
  "QA_lstPexMuscstrength[WristFlex]": {
    "red_x_points": [
      [-0.0028, 1],
      [0.00011, 2],
      [-0.00096, 1],
      [-0.00125, 1],
      [0.00019, 0],
      [0.00059, 0],
      [-0.0014, 1],
      [-0.00145, 0],
      [0.00031, 0],
      [0.00025, 0],
      [0.00038, 0],
      [-0.00118, 0],
      [-0.00051, 2],
      [0.00182, 2],
      [0.00028, 2],
      [-0.00147, 0],
      [0.00012, 2],
      [0.00021, 0],
      [-0.00078, 0],
      [-0.00236, 1],
      [-0.00146, 0],
      [-0.00143, 1],
      [0.00128, 2],
      [-0.00718, 1],
      [-0.00161, 0],
      [0.00034, 0],
      [-0.00212, 1],
      [0.00024, 0],
      [0.00161, 2],
      [0.00024, 2],
      [-0.00099, 1]
    ],
    "red_o_points": [],
    "y_categories": ["GREATER THAN OR EQUALS TO 3", "LESS THAN 3", "nan"],
    "blue_o_points": [],
    "blue_x_points": [
      [0.00026, 0],
      [0.00326, 2],
      [0.00115, 0],
      [0.00219, 0],
      [0.00363, 2],
      [0.00112, 0],
      [0.00095, 0]
    ]
  },
  "QS_mulNeuromadSite[C5]": {
    "red_x_points": [
      [-0.00102, 2],
      [-0.00303, 0],
      [-0.00353, 0],
      [-0.0032, 0],
      [-0.00304, 0],
      [-0.00326, 0],
      [-0.00308, 0],
      [-0.00104, 2],
      [-0.00282, 0],
      [-0.003, 0],
      [-0.00287, 0],
      [-0.0016, 2],
      [0.00486, 1],
      [-0.00106, 2],
      [-0.00334, 0],
      [-0.00098, 2],
      [-0.00323, 0],
      [-0.00325, 0],
      [-0.00112, 2],
      [-0.00081, 2],
      [-0.00098, 2],
      [-0.00297, 0],
      [-0.00095, 2],
      [-0.0016, 2],
      [-0.00131, 2],
      [-0.00313, 0],
      [-0.00099, 2],
      [-0.00297, 0],
      [-0.00085, 2],
      [0.00597, 1],
      [-0.00316, 0]
    ],
    "red_o_points": [],
    "y_categories": ["N", "NOT APPLICABLE", "nan"],
    "blue_o_points": [],
    "blue_x_points": [
      [0.01031, 1],
      [0.00018, 2],
      [0.00783, 1],
      [-0.00017, 0],
      [0.0002, 2],
      [0.00672, 1],
      [0.00749, 1]
    ]
  },
  "QS_mulNeuromadSite[C7]": {
    "red_x_points": [
      [-0.00129, 2],
      [-0.00337, 0],
      [-0.00338, 0],
      [-0.00319, 0],
      [-0.00361, 0],
      [-0.00312, 0],
      [-0.00354, 0],
      [-0.00132, 2],
      [-0.00354, 0],
      [-0.00309, 0],
      [-0.00301, 0],
      [-0.00143, 2],
      [0.00468, 1],
      [-0.00103, 2],
      [-0.00338, 0],
      [-0.00141, 2],
      [-0.00301, 0],
      [-0.0035, 0],
      [-0.00136, 2],
      [-0.00135, 2],
      [-0.00123, 2],
      [-0.00278, 0],
      [-0.00105, 2],
      [-0.00105, 2],
      [-0.0014, 2],
      [-0.00317, 0],
      [-0.00123, 2],
      [-0.00334, 0],
      [-0.00098, 2],
      [0.00709, 1],
      [-0.00331, 0]
    ],
    "red_o_points": [],
    "y_categories": ["N", "NOT APPLICABLE", "nan"],
    "blue_o_points": [],
    "blue_x_points": [
      [0.01105, 1],
      [1e-5, 2],
      [0.00846, 1],
      [-0.00031, 0],
      [-0.00021, 2],
      [0.00738, 1],
      [0.00938, 1]
    ]
  },
  "QA_lstPexMuscstrength[ShoulderInrot]": {
    "red_x_points": [
      [-0.00051, 1],
      [9e-5, 2],
      [7e-5, 0],
      [-0.00037, 1],
      [0.00031, 0],
      [-0.00062, 1],
      [0.0001, 2],
      [-0.00062, 1],
      [0.00019, 0],
      [0.00013, 2],
      [0.0001, 2],
      [-0.00053, 1],
      [0.00011, 2],
      [6e-5, 2],
      [0.00011, 2],
      [0.0001, 2],
      [6e-5, 2],
      [-0.00081, 1],
      [7e-5, 0],
      [-0.00046, 1],
      [0.0003, 0],
      [6e-5, 2],
      [6e-5, 2],
      [5e-5, 2],
      [0.00014, 2],
      [-0.00059, 1],
      [7e-5, 2],
      [-0.00064, 1],
      [8e-5, 2],
      [0.0001, 2],
      [0.00019, 0]
    ],
    "red_o_points": [],
    "y_categories": ["GREATER THAN OR EQUALS TO 3", "LESS THAN 3", "nan"],
    "blue_o_points": [],
    "blue_x_points": [
      [6e-5, 2],
      [9e-5, 2],
      [0.00036, 0],
      [0.00035, 2],
      [0.00014, 2],
      [0.00039, 0],
      [0.0003, 0]
    ]
  },
  "QS_mulTransfSite[IMc]": {
    "red_x_points": [
      [-0.00211, 3],
      [-0.00652, 2],
      [-0.00394, 0],
      [-0.00364, 0],
      [-0.00439, 0],
      [-0.00411, 0],
      [-0.00393, 0],
      [-0.00221, 3],
      [-0.00374, 0],
      [-0.00365, 0],
      [-0.00409, 0],
      [-0.00252, 3],
      [0.01079, 1],
      [-0.00214, 3],
      [-0.00358, 0],
      [-0.00237, 3],
      [-0.00589, 2],
      [-0.0037, 0],
      [-0.00234, 3],
      [-0.00206, 3],
      [-0.00214, 3],
      [-0.0037, 0],
      [-0.00222, 3],
      [-0.00238, 3],
      [-0.00203, 3],
      [-0.00371, 0],
      [-0.00205, 3],
      [-0.00628, 2],
      [-0.00234, 3],
      [0.01126, 1],
      [-0.00598, 2]
    ],
    "red_o_points": [],
    "y_categories": ["N", "NOT APPLICABLE", "Y", "nan"],
    "blue_o_points": [],
    "blue_x_points": [
      [0.01421, 1],
      [-0.00079, 3],
      [0.01257, 1],
      [-0.0018, 0],
      [-0.00078, 3],
      [0.01254, 1],
      [0.0137, 1]
    ]
  },
  "QS_mulGraftNerve[SS]": {
    "red_x_points": [
      [-0.0001, 2],
      [-0.00049, 0],
      [-0.00038, 0],
      [-0.00028, 0],
      [-0.00064, 0],
      [-0.00038, 0],
      [-0.00039, 0],
      [-4e-5, 2],
      [-0.00027, 0],
      [-0.00029, 0],
      [-0.00026, 0],
      [-9e-5, 2],
      [0.00066, 1],
      [-9e-5, 2],
      [-0.00042, 0],
      [-8e-5, 2],
      [-0.0004, 0],
      [-0.00024, 0],
      [-0.00011, 2],
      [-6e-5, 2],
      [-0.00011, 2],
      [-0.00034, 0],
      [-5e-5, 2],
      [-8e-5, 2],
      [-0.00012, 2],
      [-0.00043, 0],
      [-0.00011, 2],
      [-0.00029, 0],
      [-1e-5, 2],
      [0.00079, 1],
      [-0.00037, 0]
    ],
    "red_o_points": [],
    "y_categories": ["N", "NOT APPLICABLE", "nan"],
    "blue_o_points": [],
    "blue_x_points": [
      [0.00115, 1],
      [5e-5, 2],
      [0.0009, 1],
      [-8e-5, 0],
      [8e-5, 2],
      [0.00103, 1],
      [0.00043, 1]
    ]
  },
  "QA_lstPexArthre[Index]": {
    "red_x_points": [
      [-0.00026, 0],
      [-0.00047, 2],
      [-0.0003, 2],
      [-0.00046, 0],
      [0.0001, 1],
      [0.00023, 1],
      [-0.00075, 0],
      [-8e-5, 2],
      [0.0003, 1],
      [0.0001, 1],
      [-0.00063, 0],
      [-4e-5, 1],
      [-0.00025, 2],
      [-0.0001, 2],
      [0.0003, 1],
      [-0.00015, 2],
      [-0.00018, 2],
      [0.00019, 1],
      [-4e-5, 1],
      [-0.00015, 0],
      [2e-5, 1],
      [-0.00037, 2],
      [-0.00012, 2],
      [-0.0, 1],
      [-8e-5, 2],
      [-0.00037, 2],
      [6e-5, 1],
      [-0.00017, 2],
      [0.00018, 1],
      [-0.00014, 2],
      [-0.00023, 0]
    ],
    "red_o_points": [],
    "y_categories": ["NPV", "PV", "nan"],
    "blue_o_points": [],
    "blue_x_points": [
      [0.00047, 0],
      [0.00011, 2],
      [6e-5, 1],
      [0.00159, 1],
      [-3e-5, 2],
      [0.00018, 1],
      [-8e-5, 2]
    ]
  },
  "QA_lstPexMuscstrength[FingersAddu]": {
    "red_x_points": [
      [8e-5, 2],
      [-5e-5, 1],
      [-6e-5, 1],
      [-8e-5, 0],
      [-6e-5, 1],
      [-2e-5, 0],
      [3e-5, 2],
      [-2e-5, 0],
      [-2e-5, 0],
      [3e-5, 2],
      [3e-5, 2],
      [-2e-5, 0],
      [3e-5, 2],
      [-2e-5, 0],
      [-2e-5, 0],
      [-5e-5, 1],
      [-2e-5, 0],
      [-0.0001, 1],
      [3e-5, 2],
      [3e-5, 2],
      [3e-5, 2],
      [3e-5, 2],
      [-5e-5, 1],
      [3e-5, 2],
      [3e-5, 2],
      [-5e-5, 1]
    ],
    "red_o_points": [],
    "y_categories": ["GREATER THAN OR EQUALS TO 3", "LESS THAN 3", "nan"],
    "blue_o_points": [],
    "blue_x_points": [[3e-5, 2], [0.0001, 2], [3e-5, 2], [-2e-5, 0]]
  },
  "QS_mulLysisRoot[C7]": {
    "red_x_points": [
      [-0.00066, 3],
      [-0.00138, 0],
      [-0.00251, 2],
      [-0.00123, 0],
      [-0.001, 0],
      [-0.00107, 0],
      [-0.00108, 0],
      [-0.0007, 3],
      [-0.00117, 0],
      [-0.001, 0],
      [-0.00116, 0],
      [-0.00062, 3],
      [0.00364, 1],
      [-0.00077, 3],
      [-0.00126, 0],
      [-0.00074, 3],
      [-0.00114, 0],
      [-0.00107, 0],
      [-0.00061, 3],
      [-0.0007, 3],
      [-0.00069, 3],
      [-0.00114, 0],
      [-0.00066, 3],
      [-0.00053, 3],
      [-0.00079, 3],
      [-0.00097, 0],
      [-0.00064, 3],
      [-0.00102, 0],
      [-0.00057, 3],
      [0.00366, 1],
      [-0.00116, 0]
    ],
    "red_o_points": [],
    "y_categories": ["N", "NOT APPLICABLE", "Y", "nan"],
    "blue_o_points": [],
    "blue_x_points": [
      [0.00415, 1],
      [-0.00021, 3],
      [0.00351, 1],
      [-0.00102, 0],
      [-0.00029, 3],
      [0.00377, 1],
      [0.00379, 1]
    ]
  },
  "QA_yonInjBpsurg": {
    "red_x_points": [
      [-0.00278, 1],
      [-0.00249, 1],
      [-0.00306, 1],
      [-0.00276, 1],
      [-0.00315, 1],
      [-0.00291, 1],
      [-0.00294, 1],
      [-0.0025, 1],
      [-0.0027, 1],
      [-0.00268, 1],
      [-0.00271, 1],
      [-0.00315, 1],
      [0.0076, 0],
      [-0.00283, 1],
      [-0.00292, 1],
      [-0.00298, 1],
      [-0.00246, 1],
      [-0.00287, 1],
      [-0.00281, 1],
      [-0.00278, 1],
      [-0.00248, 1],
      [-0.0026, 1],
      [-0.00262, 1],
      [-0.00284, 1],
      [-0.00301, 1],
      [-0.0027, 1],
      [-0.00278, 1],
      [-0.00294, 1],
      [-0.00262, 1],
      [0.0083, 0],
      [-0.00256, 1]
    ],
    "red_o_points": [],
    "y_categories": ["N", "Y", "nan"],
    "blue_o_points": [],
    "blue_x_points": [
      [0.01397, 0],
      [-0.00051, 1],
      [0.00946, 0],
      [-0.00229, 1],
      [-0.00122, 1],
      [0.01028, 0],
      [0.01072, 0]
    ]
  },
  "QS_mulBpsurgeryType[Lysis]": {
    "red_x_points": [
      [-0.00259, 3],
      [-0.00396, 0],
      [-0.00706, 2],
      [-0.00426, 0],
      [-0.00409, 0],
      [-0.00695, 2],
      [-0.00428, 0],
      [-0.00218, 3],
      [-0.00447, 0],
      [-0.00449, 0],
      [-0.00433, 0],
      [-0.0024, 3],
      [0.01118, 1],
      [-0.00213, 3],
      [-0.00438, 0],
      [-0.0025, 3],
      [-0.00655, 2],
      [-0.00457, 0],
      [-0.00227, 3],
      [-0.00194, 3],
      [-0.00221, 3],
      [-0.00407, 0],
      [-0.00222, 3],
      [-0.00243, 3],
      [-0.00212, 3],
      [-0.00457, 0],
      [-0.00215, 3],
      [-0.00413, 0],
      [-0.00235, 3],
      [0.01421, 1],
      [-0.00665, 2]
    ],
    "red_o_points": [],
    "y_categories": ["N", "NOT APPLICABLE", "Y", "nan"],
    "blue_o_points": [],
    "blue_x_points": [
      [0.01651, 1],
      [-0.00085, 3],
      [0.01384, 1],
      [-0.00159, 0],
      [-0.00103, 3],
      [0.01302, 1],
      [0.01397, 1]
    ]
  },
  "QS_mulBpsurgeryType[Graft]": {
    "red_x_points": [
      [-0.00027, 3],
      [-0.00046, 0],
      [-0.00052, 0],
      [-0.00053, 0],
      [-0.0005, 0],
      [-0.00054, 0],
      [-0.00046, 0],
      [-0.00031, 3],
      [-0.00047, 0],
      [-0.00051, 0],
      [-0.00047, 0],
      [-0.0004, 3],
      [0.00138, 1],
      [-0.00023, 3],
      [-0.00157, 2],
      [-0.00032, 3],
      [-0.00045, 0],
      [-0.00046, 0],
      [-0.00038, 3],
      [-0.00039, 3],
      [-0.00044, 3],
      [-0.00052, 0],
      [-0.00025, 3],
      [-0.0004, 3],
      [-0.00036, 3],
      [-0.0005, 0],
      [-0.0003, 3],
      [-0.00042, 0],
      [-0.00031, 3],
      [0.00192, 1],
      [-0.00057, 0]
    ],
    "red_o_points": [],
    "y_categories": ["N", "NOT APPLICABLE", "Y", "nan"],
    "blue_o_points": [],
    "blue_x_points": [
      [0.00177, 1],
      [-0.00013, 3],
      [0.00102, 1],
      [-9e-5, 0],
      [-0.00013, 3],
      [0.00171, 1],
      [0.0016, 1]
    ]
  },
  "QS_mulLysisRoot[C6]": {
    "red_x_points": [
      [-0.00161, 3],
      [-0.00255, 0],
      [-0.004, 2],
      [-0.00244, 0],
      [-0.00229, 0],
      [-0.00261, 0],
      [-0.00238, 0],
      [-0.00143, 3],
      [-0.00219, 0],
      [-0.00198, 0],
      [-0.00254, 0],
      [-0.00177, 3],
      [0.00651, 1],
      [-0.00141, 3],
      [-0.00229, 0],
      [-0.00155, 3],
      [-0.00241, 0],
      [-0.00242, 0],
      [-0.00136, 3],
      [-0.0014, 3],
      [-0.00143, 3],
      [-0.00242, 0],
      [-0.00144, 3],
      [-0.00144, 3],
      [-0.00148, 3],
      [-0.00248, 0],
      [-0.00125, 3],
      [-0.00241, 0],
      [-0.00146, 3],
      [0.00702, 1],
      [-0.00391, 2]
    ],
    "red_o_points": [],
    "y_categories": ["N", "NOT APPLICABLE", "Y", "nan"],
    "blue_o_points": [],
    "blue_x_points": [
      [0.00948, 1],
      [-0.0007, 3],
      [0.00793, 1],
      [-0.00172, 0],
      [-0.00061, 3],
      [0.00782, 1],
      [0.0078, 1]
    ]
  },
  "QA_lstPexPalle[Clavicle]": {
    "red_x_points": [
      [3e-5, 3],
      [2e-5, 3],
      [1e-5, 3],
      [9e-5, 3],
      [-0.00024, 2],
      [-0.0002, 2],
      [3e-5, 3],
      [4e-5, 3],
      [7e-5, 3],
      [-0.00021, 2],
      [-0.00016, 2],
      [-6e-5, 0],
      [0.0008, 3],
      [1e-5, 3],
      [6e-5, 3],
      [6e-5, 3],
      [3e-5, 3],
      [-0.0, 0],
      [-1e-5, 0],
      [2e-5, 0],
      [-0.00021, 2],
      [-0.00019, 1],
      [0.0001, 3],
      [-0.00327, 2],
      [0.00012, 3],
      [3e-5, 3],
      [-0.00063, 2],
      [3e-5, 3],
      [7e-5, 3],
      [-0.01436, 2],
      [-5e-5, 0]
    ],
    "red_o_points": [],
    "y_categories": ["HYPO", "NAIA", "PT", "nan"],
    "blue_o_points": [],
    "blue_x_points": [
      [0.00123, 3],
      [0.00034, 3],
      [0.00634, 0],
      [0.00039, 3],
      [0.00031, 3],
      [0.00155, 3],
      [0.00169, 3]
    ]
  },
  "QS_mulGraftNerve[LT]": {
    "red_x_points": [
      [-0.00017, 2],
      [-0.00028, 0],
      [-0.0002, 0],
      [-0.00031, 0],
      [-0.00033, 0],
      [-0.00027, 0],
      [-0.00028, 0],
      [-0.00022, 2],
      [-0.00034, 0],
      [-0.00029, 0],
      [-0.00033, 0],
      [-0.00021, 2],
      [0.00049, 1],
      [-0.00018, 2],
      [-0.00032, 0],
      [-0.00016, 2],
      [-0.00032, 0],
      [-0.0004, 0],
      [-0.00019, 2],
      [-0.00013, 2],
      [-0.0002, 2],
      [-0.00039, 0],
      [-0.00024, 2],
      [-0.0001, 2],
      [-0.00016, 2],
      [-0.00028, 0],
      [-0.0002, 2],
      [-0.0003, 0],
      [-0.00017, 2],
      [0.00063, 1],
      [-0.00028, 0]
    ],
    "red_o_points": [],
    "y_categories": ["N", "NOT APPLICABLE", "nan"],
    "blue_o_points": [],
    "blue_x_points": [
      [0.00129, 1],
      [-6e-5, 2],
      [0.001, 1],
      [-0.00012, 0],
      [-0.0, 2],
      [0.00091, 1],
      [0.00122, 1]
    ]
  },
  "QS_mulLysisRoot[C5]": {
    "red_x_points": [
      [-0.00135, 3],
      [-0.00218, 0],
      [-0.00424, 2],
      [-0.00198, 0],
      [-0.00201, 0],
      [-0.00224, 0],
      [-0.00205, 0],
      [-0.00121, 3],
      [-0.00221, 0],
      [-0.00222, 0],
      [-0.00195, 0],
      [-0.00136, 3],
      [0.0069, 1],
      [-0.00134, 3],
      [-0.00235, 0],
      [-0.00115, 3],
      [-0.0024, 0],
      [-0.00205, 0],
      [-0.00126, 3],
      [-0.00126, 3],
      [-0.00118, 3],
      [-0.00216, 0],
      [-0.0015, 3],
      [-0.00139, 3],
      [-0.00136, 3],
      [-0.00228, 0],
      [-0.00117, 3],
      [-0.00227, 0],
      [-0.00137, 3],
      [0.0064, 1],
      [-0.00398, 2]
    ],
    "red_o_points": [],
    "y_categories": ["N", "NOT APPLICABLE", "Y", "nan"],
    "blue_o_points": [],
    "blue_x_points": [
      [0.00763, 1],
      [-0.00046, 3],
      [0.00801, 1],
      [-0.00192, 0],
      [-0.00046, 3],
      [0.0072, 1],
      [0.00771, 1]
    ]
  },
  "QS_mulGraftNerve[IS]": {
    "red_x_points": [
      [-0.00029, 2],
      [-0.00067, 0],
      [-0.00053, 0],
      [-0.00058, 0],
      [-0.00055, 0],
      [-0.00077, 0],
      [-0.00064, 0],
      [-0.00036, 2],
      [-0.00056, 0],
      [-0.00061, 0],
      [-0.00054, 0],
      [-0.00028, 2],
      [0.00112, 1],
      [-0.00037, 2],
      [-0.00063, 0],
      [-0.00032, 2],
      [-0.00039, 0],
      [-0.00071, 0],
      [-0.00033, 2],
      [-0.00021, 2],
      [-0.00026, 2],
      [-0.00052, 0],
      [-0.00034, 2],
      [-0.00026, 2],
      [-0.00037, 2],
      [-0.0006, 0],
      [-0.0002, 2],
      [-0.00063, 0],
      [-0.00027, 2],
      [0.00133, 1],
      [-0.00059, 0]
    ],
    "red_o_points": [],
    "y_categories": ["N", "NOT APPLICABLE", "nan"],
    "blue_o_points": [],
    "blue_x_points": [
      [0.0024, 1],
      [-8e-5, 2],
      [0.00117, 1],
      [-0.00013, 0],
      [-0.00022, 2],
      [0.00159, 1],
      [0.00202, 1]
    ]
  },
  "QS_mulGraftNerve[MC]": {
    "red_x_points": [
      [-0.00014, 2],
      [-0.00058, 0],
      [-0.00061, 0],
      [-0.00058, 0],
      [-0.00073, 0],
      [-0.00054, 0],
      [-0.00062, 0],
      [-8e-5, 2],
      [-0.00065, 0],
      [-0.00073, 0],
      [-0.00057, 0],
      [-0.00015, 2],
      [0.00086, 1],
      [-0.0001, 2],
      [-0.00071, 0],
      [-0.00026, 2],
      [-0.00048, 0],
      [-0.00096, 0],
      [-0.00016, 2],
      [-0.00021, 2],
      [-0.00013, 2],
      [-0.00049, 0],
      [-0.00032, 2],
      [-0.00054, 2],
      [-0.00021, 2],
      [-0.00053, 0],
      [-0.00018, 2],
      [-0.00057, 0],
      [-0.0002, 2],
      [0.00129, 1],
      [-0.00061, 0]
    ],
    "red_o_points": [],
    "y_categories": ["N", "NOT APPLICABLE", "nan"],
    "blue_o_points": [],
    "blue_x_points": [
      [0.00252, 1],
      [0.00014, 2],
      [0.00139, 1],
      [-0.00013, 0],
      [-1e-5, 2],
      [0.00122, 1],
      [0.0014, 1]
    ]
  },
  "QA_lstPexKine[Elbow]": {
    "red_x_points": [
      [-0.00059, 0],
      [-0.0001, 2],
      [-0.00037, 2],
      [-0.0002, 2],
      [6e-5, 1],
      [0.0002, 1],
      [-0.00084, 0],
      [8e-5, 2],
      [0.00019, 1],
      [1e-5, 1],
      [0.00024, 1],
      [-9e-5, 1],
      [-3e-5, 2],
      [5e-5, 2],
      [5e-5, 1],
      [1e-5, 2],
      [-0.00017, 2],
      [0.00019, 1],
      [-8e-5, 1],
      [-0.00021, 0],
      [-5e-5, 1],
      [-0.0001, 2],
      [0.0001, 2],
      [-8e-5, 1],
      [7e-5, 2],
      [-0.0003, 2],
      [-9e-5, 1],
      [-9e-5, 2],
      [-0.00013, 1],
      [-5e-5, 2],
      [-0.00036, 0]
    ],
    "red_o_points": [],
    "y_categories": ["NPV", "PV", "nan"],
    "blue_o_points": [],
    "blue_x_points": [
      [0.0001, 1],
      [0.00014, 2],
      [7e-5, 1],
      [0.00066, 1],
      [0.00014, 2],
      [7e-5, 1],
      [4e-5, 2]
    ]
  },
  "QA_lstPexKine[Index]": {
    "red_x_points": [
      [-0.00078, 0],
      [-0.00035, 2],
      [-0.00046, 2],
      [-0.00017, 2],
      [3e-5, 1],
      [0.00021, 1],
      [-0.00121, 0],
      [0.00014, 2],
      [0.00041, 1],
      [6e-5, 1],
      [0.00027, 1],
      [-0.00022, 1],
      [-0.00011, 2],
      [0.00029, 2],
      [0.00016, 1],
      [-1e-5, 2],
      [-0.00013, 2],
      [0.00031, 1],
      [-0.00025, 1],
      [-0.00076, 0],
      [-0.00021, 1],
      [-0.00029, 2],
      [2e-5, 2],
      [-8e-5, 1],
      [7e-5, 2],
      [-0.00048, 2],
      [-0.00051, 1],
      [-0.00016, 2],
      [-4e-5, 1],
      [-0.00016, 2],
      [-0.00041, 0]
    ],
    "red_o_points": [],
    "y_categories": ["NPV", "PV", "nan"],
    "blue_o_points": [],
    "blue_x_points": [
      [0.00011, 1],
      [0.00045, 2],
      [0.00014, 1],
      [0.0013, 1],
      [0.0004, 2],
      [0.00023, 1],
      [5e-5, 2]
    ]
  },
  "QA_lstPexMuscstrength[ElbowFlex]": {
    "red_x_points": [
      [-0.00342, 1],
      [0.00037, 2],
      [-0.00163, 1],
      [-0.00184, 1],
      [0.00156, 0],
      [-0.00128, 1],
      [-0.00151, 1],
      [-0.00331, 1],
      [-0.00156, 1],
      [-0.00156, 1],
      [-0.00142, 1],
      [-0.00315, 1],
      [0.00041, 2],
      [0.00255, 2],
      [0.00018, 2],
      [-0.00338, 1],
      [0.00024, 2],
      [0.00127, 0],
      [-0.00288, 1],
      [-0.00302, 1],
      [-0.00305, 1],
      [-0.00145, 1],
      [0.00321, 2],
      [8e-5, 0],
      [-0.0039, 1],
      [-0.00135, 1],
      [-0.00323, 1],
      [-0.00124, 1],
      [-0.00271, 1],
      [0.00045, 2],
      [-0.00152, 1]
    ],
    "red_o_points": [],
    "y_categories": ["GREATER THAN OR EQUALS TO 3", "LESS THAN 3", "nan"],
    "blue_o_points": [],
    "blue_x_points": [
      [0.0006, 2],
      [0.00456, 2],
      [0.00409, 0],
      [0.00033, 1],
      [0.00484, 2],
      [0.00403, 0],
      [0.00461, 0]
    ]
  },
  "QS_mulGraftRoot[C6]": {
    "red_x_points": [
      [-0.00014, 0],
      [-5e-5, 0],
      [-6e-5, 0],
      [-0.00016, 0],
      [-6e-5, 0],
      [-2e-5, 2],
      [-5e-5, 0],
      [-5e-5, 0],
      [-1e-5, 0],
      [-4e-5, 2],
      [0.00011, 1],
      [2e-5, 2],
      [-0.00014, 0],
      [-4e-5, 2],
      [-0.00014, 0],
      [-0.00015, 0],
      [-4e-5, 2],
      [-4e-5, 2],
      [-4e-5, 2],
      [2e-5, 2],
      [-4e-5, 2],
      [-6e-5, 0],
      [-4e-5, 2],
      [-6e-5, 0],
      [-2e-5, 2],
      [-1e-5, 1],
      [-6e-5, 0]
    ],
    "red_o_points": [],
    "y_categories": ["N", "NOT APPLICABLE", "nan"],
    "blue_o_points": [],
    "blue_x_points": [
      [0.0002, 1],
      [6e-5, 2],
      [0.00022, 1],
      [-1e-5, 0],
      [2e-5, 2],
      [0.0002, 1],
      [0.00022, 1]
    ]
  },
  "QS_mulTransfSite[IAx]": {
    "red_x_points": [
      [-3e-5, 0],
      [-3e-5, 0],
      [-3e-5, 0],
      [-3e-5, 0],
      [-3e-5, 0],
      [-3e-5, 0],
      [-5e-5, 2],
      [-3e-5, 0],
      [-3e-5, 0],
      [-3e-5, 0],
      [-5e-5, 2],
      [0.0001, 1],
      [-5e-5, 2],
      [-3e-5, 0],
      [-5e-5, 2],
      [-5e-5, 2],
      [-3e-5, 0],
      [-5e-5, 2],
      [-5e-5, 2],
      [-5e-5, 2],
      [-3e-5, 0],
      [-5e-5, 2],
      [0.0001, 1]
    ],
    "red_o_points": [],
    "y_categories": ["N", "NOT APPLICABLE", "nan"],
    "blue_o_points": [],
    "blue_x_points": [[0.0001, 1], [0.0001, 1], [-3e-5, 0], [0.0001, 1]]
  },
  "QA_lstPexInspectio[ScapulaAlata]": {
    "red_x_points": [
      [-0.00021, 1],
      [-0.00021, 1],
      [-0.00022, 1],
      [-0.00023, 1],
      [-0.00019, 1],
      [-0.00024, 1],
      [-0.00027, 1],
      [-0.00024, 1],
      [-0.00024, 1],
      [-0.00022, 1],
      [-0.00027, 1],
      [-0.00015, 1],
      [-0.00052, 1],
      [-0.0002, 1],
      [-0.00024, 1],
      [-0.00014, 1],
      [-0.0002, 1],
      [-0.00025, 1],
      [-0.00185, 0],
      [-0.00018, 1],
      [-0.00017, 1],
      [-0.00024, 1],
      [-0.00018, 1],
      [-0.00031, 1],
      [-0.00035, 1],
      [-0.00022, 1],
      [-0.00018, 1],
      [-0.00022, 1],
      [-0.00018, 1],
      [-0.00033, 1],
      [-0.00022, 1]
    ],
    "red_o_points": [],
    "y_categories": ["ABS", "NAIA", "PT", "nan"],
    "blue_o_points": [],
    "blue_x_points": [
      [-0.00016, 1],
      [-0.00015, 1],
      [-7e-5, 1],
      [-0.00024, 1],
      [-2e-5, 1],
      [-0.00013, 1],
      [0.00501, 2]
    ]
  },
  "QS_mulGraftNerve[Ac]": {
    "red_x_points": [
      [-0.00062, 2],
      [-0.00164, 0],
      [-0.0016, 0],
      [-0.00137, 0],
      [-0.00172, 0],
      [-0.00182, 0],
      [-0.0017, 0],
      [-0.00043, 2],
      [-0.00164, 0],
      [-0.00161, 0],
      [-0.0017, 0],
      [-0.00053, 2],
      [0.00305, 1],
      [-0.0005, 2],
      [-0.00136, 0],
      [-0.00054, 2],
      [-0.00167, 0],
      [-0.00174, 0],
      [-0.00079, 2],
      [-0.00062, 2],
      [-0.00057, 2],
      [-0.00163, 0],
      [-0.00055, 2],
      [-0.00062, 2],
      [-0.00056, 2],
      [-0.00157, 0],
      [-0.00045, 2],
      [-0.00194, 0],
      [-0.00042, 2],
      [0.00376, 1],
      [-0.00143, 0]
    ],
    "red_o_points": [],
    "y_categories": ["N", "NOT APPLICABLE", "nan"],
    "blue_o_points": [],
    "blue_x_points": [
      [0.00529, 1],
      [-0.00014, 2],
      [0.00406, 1],
      [-0.00035, 0],
      [-1e-5, 2],
      [0.00402, 1],
      [0.00415, 1]
    ]
  },
  "QA_lstPexMuscstrength[FingersAbdu]": {
    "red_x_points": [
      [6e-5, 2],
      [5e-5, 2],
      [-0.00026, 1],
      [-0.00021, 1],
      [6e-5, 0],
      [7e-5, 0],
      [-0.00026, 1],
      [-5e-5, 0],
      [3e-5, 0],
      [4e-5, 2],
      [-0.00019, 1],
      [1e-5, 0],
      [8e-5, 2],
      [8e-5, 2],
      [4e-5, 2],
      [0.00011, 0],
      [3e-5, 2],
      [3e-5, 0],
      [1e-5, 0],
      [-0.00022, 1],
      [-3e-5, 0],
      [-5e-5, 1],
      [9e-5, 2],
      [9e-5, 2],
      [0.00011, 2],
      [-0.00021, 1],
      [5e-5, 2],
      [-0.00024, 1],
      [8e-5, 2],
      [3e-5, 2],
      [-0.00019, 1]
    ],
    "red_o_points": [],
    "y_categories": ["GREATER THAN OR EQUALS TO 3", "LESS THAN 3", "nan"],
    "blue_o_points": [],
    "blue_x_points": [
      [8e-5, 2],
      [4e-5, 0],
      [8e-5, 2],
      [0.0001, 2],
      [6e-5, 0],
      [3e-5, 0]
    ]
  },
  "QS_mulNeuromadSite[C8]": {
    "red_x_points": [
      [-0.00086, 2],
      [-0.00346, 0],
      [-0.00306, 0],
      [-0.00313, 0],
      [-0.00332, 0],
      [-0.00322, 0],
      [-0.00313, 0],
      [-0.00086, 2],
      [-0.00287, 0],
      [-0.00313, 0],
      [-0.0029, 0],
      [-0.00091, 2],
      [0.00555, 1],
      [-0.00103, 2],
      [-0.00341, 0],
      [-0.00075, 2],
      [-0.00309, 0],
      [-0.00318, 0],
      [-0.00093, 2],
      [-0.00086, 2],
      [-0.00087, 2],
      [-0.00305, 0],
      [-0.00098, 2],
      [-0.00185, 2],
      [-0.00077, 2],
      [-0.00322, 0],
      [-0.00092, 2],
      [-0.00285, 0],
      [-0.00089, 2],
      [0.00593, 1],
      [-0.003, 0]
    ],
    "red_o_points": [],
    "y_categories": ["N", "NOT APPLICABLE", "nan"],
    "blue_o_points": [],
    "blue_x_points": [
      [0.00977, 1],
      [-6e-5, 2],
      [0.00695, 1],
      [-0.00022, 0],
      [0.00013, 2],
      [0.00724, 1],
      [0.00788, 1]
    ]
  },
  "QS_mulTransfSite[AcSsPA]": {
    "red_x_points": [
      [-0.00049, 3],
      [-0.00114, 0],
      [-0.00135, 0],
      [-0.00143, 0],
      [-0.00141, 0],
      [-0.0013, 0],
      [-0.00135, 0],
      [-0.00066, 3],
      [-0.00124, 0],
      [-0.00126, 0],
      [-0.0013, 0],
      [-0.00062, 3],
      [0.00285, 1],
      [-0.00056, 3],
      [-0.00132, 0],
      [-0.00064, 3],
      [-0.00264, 2],
      [-0.00139, 0],
      [-0.00061, 3],
      [-0.00051, 3],
      [-0.00058, 3],
      [-0.00104, 0],
      [-0.0006, 3],
      [-0.00064, 3],
      [-0.00049, 3],
      [-0.00123, 0],
      [-0.00061, 3],
      [-0.00134, 0],
      [-0.00046, 3],
      [0.0034, 1],
      [-0.00133, 0]
    ],
    "red_o_points": [],
    "y_categories": ["N", "NOT APPLICABLE", "Y", "nan"],
    "blue_o_points": [],
    "blue_x_points": [
      [0.00447, 1],
      [-0.00039, 3],
      [0.0035, 1],
      [-0.00077, 0],
      [-0.00013, 3],
      [0.00425, 1],
      [0.00405, 1]
    ]
  },
  "QA_lstPexPalle[Elbow]": {
    "red_x_points": [
      [0.0002, 4],
      [7e-5, 4],
      [4e-5, 4],
      [6e-5, 4],
      [-0.00055, 3],
      [-0.00046, 3],
      [7e-5, 4],
      [8e-5, 4],
      [0.00014, 4],
      [5e-5, 1],
      [-0.00039, 3],
      [0.0, 1],
      [0.00061, 4],
      [0.00011, 4],
      [9e-5, 4],
      [0.00015, 4],
      [9e-5, 4],
      [0.0001, 1],
      [-0.00046, 3],
      [-0.00032, 0],
      [-0.00039, 3],
      [-0.00028, 2],
      [0.00014, 4],
      [-0.00236, 3],
      [0.00011, 4],
      [0.0001, 4],
      [-0.00031, 3],
      [7e-5, 4],
      [8e-5, 4],
      [-0.01309, 3],
      [-0.00019, 0]
    ],
    "red_o_points": [],
    "y_categories": ["ABS", "HYPO", "NAIA", "PT", "nan"],
    "blue_o_points": [],
    "blue_x_points": [
      [0.00119, 4],
      [0.00038, 4],
      [0.00583, 1],
      [0.00029, 4],
      [0.00017, 4],
      [0.00142, 4],
      [0.00148, 4]
    ]
  },
  "QS_mulGraftRoot[C5]": {
    "red_x_points": [
      [-2e-5, 0],
      [-2e-5, 0],
      [1e-5, 0],
      [-2e-5, 0],
      [-2e-5, 2],
      [-2e-5, 0],
      [-2e-5, 0],
      [-2e-5, 2],
      [1e-5, 0],
      [-2e-5, 2],
      [-2e-5, 2],
      [-0.00011, 2],
      [-2e-5, 2]
    ],
    "red_o_points": [],
    "y_categories": ["N", "NOT APPLICABLE", "nan"],
    "blue_o_points": [],
    "blue_x_points": [[9e-5, 1], [1e-5, 0], [0.00018, 1]]
  },
  "QA_lstPexMuscstrength[ScapulaAbducSuprot]": {
    "red_x_points": [
      [-0.00027, 0],
      [0.00011, 2],
      [-0.00042, 1],
      [-0.00045, 1],
      [-4e-5, 0],
      [-0.00048, 1],
      [-0.00046, 1],
      [-0.001, 1],
      [-0.00018, 0],
      [-1e-5, 0],
      [-0.00055, 1],
      [-0.00093, 1],
      [0.00023, 2],
      [0.00041, 2],
      [0.00033, 2],
      [0.00063, 2],
      [0.0001, 2],
      [3e-5, 0],
      [-0.00041, 0],
      [-0.0007, 1],
      [-0.00041, 0],
      [-0.00037, 1],
      [0.00056, 2],
      [-0.00052, 0],
      [0.00032, 2],
      [-0.00043, 1],
      [-0.0007, 1],
      [2e-5, 0],
      [0.00042, 2],
      [0.0003, 2],
      [-0.00036, 1]
    ],
    "red_o_points": [],
    "y_categories": ["GREATER THAN OR EQUALS TO 3", "LESS THAN 3", "nan"],
    "blue_o_points": [],
    "blue_x_points": [
      [0.00013, 2],
      [0.00086, 2],
      [8e-5, 0],
      [0.00092, 2],
      [0.00079, 2],
      [0.00011, 0],
      [7e-5, 2]
    ]
  },
  "participant_code": {
    "red_x_points": [
      [-0.01428, 1],
      [-0.01386, 2],
      [-0.01414, 3],
      [-0.01353, 4],
      [-0.01465, 5],
      [-0.01442, 6],
      [-0.01418, 7],
      [-0.01437, 8],
      [-0.01404, 9],
      [-0.01334, 10],
      [-0.01456, 11],
      [-0.014, 12],
      [-0.01442, 14],
      [-0.01358, 16],
      [-0.01446, 17],
      [-0.01395, 19],
      [-0.014, 20],
      [-0.01376, 22],
      [-0.0139, 23],
      [-0.01465, 25],
      [-0.01442, 26],
      [-0.01451, 27],
      [-0.01432, 28],
      [-0.0146, 29],
      [-0.01437, 30],
      [-0.01362, 32],
      [-0.01409, 33],
      [-0.01372, 34],
      [-0.01414, 35],
      [-0.01437, 36],
      [-0.01358, 37]
    ],
    "red_o_points": [],
    "y_categories": [
      "P16554",
      "P18297",
      "P19283",
      "P19287",
      "P23391",
      "P31645",
      "P31691",
      "P34778",
      "P35046",
      "P36328",
      "P43633",
      "P4544",
      "P46417",
      "P48965",
      "P53068",
      "P5497",
      "P59529",
      "P62483",
      "P64658",
      "P65202",
      "P66816",
      "P6751",
      "P7408",
      "P75566",
      "P76226",
      "P79971",
      "P82621",
      "P82990",
      "P84932",
      "P85825",
      "P86989",
      "P8770",
      "P87791",
      "P90550",
      "P93159",
      "P94969",
      "P96710",
      "P9744",
      "nan"
    ],
    "blue_o_points": [],
    "blue_x_points": [
      [0.0417, 0],
      [0.04323, 13],
      [0.03986, 15],
      [0.03925, 18],
      [0.04001, 21],
      [0.03848, 24],
      [0.04308, 31]
    ]
  },
  "QS_mulNeuromadSite[T2]": {
    "red_x_points": [
      [-0.0015, 2],
      [-0.0048, 0],
      [-0.00516, 0],
      [-0.00466, 0],
      [-0.00497, 0],
      [-0.00503, 0],
      [-0.0048, 0],
      [-0.00176, 2],
      [-0.0051, 0],
      [-0.005, 0],
      [-0.00431, 0],
      [-0.00198, 2],
      [0.00996, 1],
      [-0.00117, 2],
      [-0.00441, 0],
      [-0.00177, 2],
      [-0.00495, 0],
      [-0.00504, 0],
      [-0.00181, 2],
      [-0.0015, 2],
      [-0.00171, 2],
      [-0.00462, 0],
      [-0.00144, 2],
      [-0.00141, 2],
      [-0.00146, 2],
      [-0.00489, 0],
      [-0.0014, 2],
      [-0.00504, 0],
      [-0.00133, 2],
      [0.0096, 1],
      [-0.00458, 0]
    ],
    "red_o_points": [],
    "y_categories": ["N", "NOT APPLICABLE", "nan"],
    "blue_o_points": [],
    "blue_x_points": [
      [0.01633, 1],
      [-0.00042, 2],
      [0.01129, 1],
      [-0.00034, 0],
      [-0.00029, 2],
      [0.01058, 1],
      [0.0129, 1]
    ]
  },
  "QS_mulGraftNerve[Ul]": {
    "red_x_points": [
      [-0.00039, 2],
      [-0.00095, 0],
      [-0.00099, 0],
      [-0.00109, 0],
      [-0.00107, 0],
      [-0.00105, 0],
      [-0.00087, 0],
      [-0.00058, 2],
      [-0.00105, 0],
      [-0.00099, 0],
      [-0.00083, 0],
      [-0.00029, 2],
      [0.00159, 1],
      [-0.00033, 2],
      [-0.00119, 0],
      [-0.00047, 2],
      [-0.00078, 0],
      [-0.00128, 0],
      [-0.00041, 2],
      [-0.00039, 2],
      [-0.00029, 2],
      [-0.00105, 0],
      [-0.00036, 2],
      [-0.00044, 2],
      [-0.00052, 2],
      [-0.00105, 0],
      [-0.00036, 2],
      [-0.00092, 0],
      [-0.00032, 2],
      [0.00183, 1],
      [-0.00088, 0]
    ],
    "red_o_points": [],
    "y_categories": ["N", "NOT APPLICABLE", "nan"],
    "blue_o_points": [],
    "blue_x_points": [
      [0.00414, 1],
      [-0.00011, 2],
      [0.00233, 1],
      [-0.00022, 0],
      [-1e-5, 2],
      [0.00256, 1],
      [0.0026, 1]
    ]
  },
  "QS_mulGraftNerve[Ssr]": {
    "red_x_points": [
      [-2e-5, 2],
      [-0.00014, 0],
      [-0.00017, 0],
      [-0.00017, 0],
      [-0.0002, 0],
      [-0.00016, 0],
      [-0.00026, 0],
      [-0.00012, 2],
      [-0.00011, 0],
      [-0.00022, 0],
      [-0.00022, 0],
      [-0.00012, 2],
      [0.00055, 1],
      [-0.00012, 2],
      [-0.00022, 0],
      [-9e-5, 2],
      [-0.00025, 0],
      [-0.00026, 0],
      [-7e-5, 2],
      [-8e-5, 2],
      [-7e-5, 2],
      [-0.00019, 0],
      [-0.00012, 2],
      [-9e-5, 2],
      [-4e-5, 2],
      [-0.00024, 0],
      [-7e-5, 2],
      [-0.00026, 0],
      [-8e-5, 2],
      [0.0003, 1],
      [-0.00026, 0]
    ],
    "red_o_points": [],
    "y_categories": ["N", "NOT APPLICABLE", "nan"],
    "blue_o_points": [],
    "blue_x_points": [
      [0.00085, 1],
      [-2e-5, 2],
      [0.0003, 1],
      [-2e-5, 0],
      [0.0, 2],
      [0.00044, 1],
      [0.00044, 1]
    ]
  },
  "QA_intPexShoulderFlex": {
    "red_x_points": [[-9e-5, 0], [3e-5, 2], [3e-5, 2], [3e-5, 2], [-9e-5, 1]],
    "red_o_points": [],
    "y_categories": ["GREATER THAN OR EQUALS TO 180", "LESS THAN 180", "nan"],
    "blue_o_points": [],
    "blue_x_points": [[3e-5, 2]]
  },
  "QS_mulLysisDivision[PDivisionMTrunk]": {
    "red_x_points": [
      [-1e-5, 2],
      [-3e-5, 0],
      [-3e-5, 0],
      [-3e-5, 0],
      [-3e-5, 0],
      [-1e-5, 2],
      [-3e-5, 0],
      [-3e-5, 0],
      [-1e-5, 2],
      [-3e-5, 0],
      [-1e-5, 2],
      [-3e-5, 0],
      [-3e-5, 0],
      [-1e-5, 2],
      [-1e-5, 2],
      [-3e-5, 0],
      [-1e-5, 2],
      [-1e-5, 2],
      [-1e-5, 2],
      [-1e-5, 2],
      [-3e-5, 0],
      [0.00011, 1],
      [-3e-5, 0]
    ],
    "red_o_points": [],
    "y_categories": ["N", "NOT APPLICABLE", "nan"],
    "blue_o_points": [],
    "blue_x_points": [
      [0.00011, 1],
      [-1e-5, 2],
      [0.00011, 1],
      [-3e-5, 0],
      [0.00011, 1]
    ]
  },
  "QS_mulGraftNerve[MCA]": {
    "red_x_points": [
      [-5e-5, 2],
      [-0.0003, 0],
      [-0.00019, 0],
      [-0.00026, 0],
      [-0.0002, 0],
      [-0.00023, 0],
      [-0.0002, 0],
      [-6e-5, 2],
      [-0.00025, 0],
      [-0.00025, 0],
      [-0.0002, 0],
      [-8e-5, 2],
      [0.00017, 1],
      [4e-5, 2],
      [-0.00029, 0],
      [-0.00017, 2],
      [-0.00029, 0],
      [-0.00022, 0],
      [-3e-5, 2],
      [-7e-5, 2],
      [-6e-5, 2],
      [-0.00019, 0],
      [-7e-5, 2],
      [-0.00025, 2],
      [-7e-5, 2],
      [-0.0002, 0],
      [-7e-5, 2],
      [-0.00017, 0],
      [-9e-5, 2],
      [0.00062, 1],
      [-0.0002, 0]
    ],
    "red_o_points": [],
    "y_categories": ["N", "NOT APPLICABLE", "nan"],
    "blue_o_points": [],
    "blue_x_points": [
      [0.00056, 1],
      [0.0002, 2],
      [0.00057, 1],
      [4e-5, 0],
      [8e-5, 2],
      [0.00062, 1],
      [0.00062, 1]
    ]
  },
  "QS_mulGraftTrunk[UpperTrunk]": {
    "red_x_points": [
      [-0.00117, 3],
      [-0.0018, 0],
      [-0.00178, 0],
      [-0.00179, 0],
      [-0.00173, 0],
      [-0.00168, 0],
      [-0.0019, 0],
      [-0.00087, 3],
      [-0.00179, 0],
      [-0.00158, 0],
      [-0.00171, 0],
      [-0.00115, 3],
      [0.00481, 1],
      [-0.00074, 3],
      [-0.00417, 2],
      [-0.00097, 3],
      [-0.00183, 0],
      [-0.00177, 0],
      [-0.00119, 3],
      [-0.00093, 3],
      [-0.00091, 3],
      [-0.00181, 0],
      [-0.00109, 3],
      [-0.00106, 3],
      [-0.00077, 3],
      [-0.00197, 0],
      [-0.00104, 3],
      [-0.00191, 0],
      [-0.00118, 3],
      [0.00525, 1],
      [-0.00156, 0]
    ],
    "red_o_points": [],
    "y_categories": ["N", "NOT APPLICABLE", "Y", "nan"],
    "blue_o_points": [],
    "blue_x_points": [
      [0.00595, 1],
      [-0.00023, 3],
      [0.0056, 1],
      [-0.00084, 0],
      [-0.0004, 3],
      [0.00603, 1],
      [0.00615, 1]
    ]
  },
  "QS_mulLysisDivision[ADivisionUTrunk]": {
    "red_x_points": [
      [-3e-5, 2],
      [-3e-5, 0],
      [-3e-5, 0],
      [-3e-5, 0],
      [-3e-5, 0],
      [-3e-5, 2],
      [-3e-5, 0],
      [-3e-5, 0],
      [-3e-5, 0],
      [-3e-5, 2],
      [0.0001, 1],
      [-3e-5, 2],
      [-3e-5, 2],
      [-3e-5, 0],
      [-3e-5, 2],
      [-3e-5, 2],
      [-3e-5, 2],
      [-3e-5, 0],
      [-3e-5, 2],
      [-3e-5, 2],
      [-3e-5, 0],
      [0.0001, 1],
      [-3e-5, 0]
    ],
    "red_o_points": [],
    "y_categories": ["N", "NOT APPLICABLE", "nan"],
    "blue_o_points": [],
    "blue_x_points": [
      [0.0001, 1],
      [-3e-5, 2],
      [-3e-5, 0],
      [0.0001, 1],
      [0.0001, 1]
    ]
  },
  "QA_mulInjTbpiCause[Motorcycle]": {
    "red_x_points": [
      [0.00138, 0],
      [-0.00081, 1],
      [-0.001, 1],
      [-0.00084, 1],
      [-0.00101, 1],
      [-0.00079, 1],
      [-0.00083, 1],
      [-0.00075, 1],
      [-0.00107, 1],
      [-0.00068, 1],
      [-0.0007, 1],
      [0.00022, 0],
      [-0.02607, 1],
      [-0.0008, 1],
      [-0.00104, 1],
      [-0.00062, 1],
      [-0.00079, 1],
      [-0.00095, 1],
      [0.00087, 0],
      [-0.00077, 1],
      [-0.0007, 1],
      [-0.00074, 1],
      [-0.00089, 1],
      [-0.00129, 1],
      [0.00019, 0],
      [-0.00065, 1],
      [-0.00079, 1],
      [-0.00088, 1],
      [-0.00089, 1],
      [-0.02585, 1],
      [-0.00089, 1]
    ],
    "red_o_points": [],
    "y_categories": ["N", "Y", "nan"],
    "blue_o_points": [],
    "blue_x_points": [
      [0.01163, 0],
      [-0.00022, 1],
      [0.01244, 0],
      [-0.00152, 1],
      [0.00034, 1],
      [0.01278, 0],
      [0.01178, 0]
    ]
  },
  "QA_yonInjUnconscio": {
    "red_x_points": [
      [-0.00293, 1],
      [-0.00317, 1],
      [-0.00167, 2],
      [-0.00183, 2],
      [0.00704, 0],
      [-0.00338, 1],
      [-0.00191, 2],
      [-0.00355, 2],
      [-0.00186, 2],
      [-0.00168, 2],
      [-0.00352, 1],
      [-0.0033, 1],
      [-0.01877, 1],
      [-0.00401, 2],
      [-0.00181, 2],
      [-0.00345, 2],
      [-0.0035, 1],
      [0.00661, 0],
      [-0.00325, 1],
      [-0.00296, 1],
      [-0.00283, 1],
      [-0.00371, 1],
      [-0.00322, 2],
      [-0.00542, 1],
      [-0.00268, 2],
      [-0.00345, 1],
      [0.00672, 0],
      [-0.00274, 1],
      [-0.00368, 2],
      [-0.00063, 2],
      [-0.00306, 1]
    ],
    "red_o_points": [],
    "y_categories": ["N", "Y", "nan"],
    "blue_o_points": [],
    "blue_x_points": [
      [0.001, 2],
      [-0.00017, 1],
      [0.0116, 0],
      [0.01483, 0],
      [0.01621, 0],
      [0.00177, 2],
      [0.00199, 2]
    ]
  },
  "QA_lstPexTouch[T1]": {
    "red_x_points": [
      [-0.00212, 1],
      [-0.00044, 2],
      [0.00057, 1],
      [-0.00037, 2],
      [-0.00193, 0],
      [0.00062, 1],
      [0.00109, 1],
      [-0.00273, 1],
      [-0.00187, 0],
      [-0.0015, 0],
      [-0.00142, 0],
      [-0.00311, 0],
      [-0.0095, 2],
      [0.00271, 2],
      [-0.0005, 2],
      [-0.0019, 1],
      [-5e-5, 2],
      [0.00101, 1],
      [-0.00271, 0],
      [-0.00201, 1],
      [-0.00301, 0],
      [-0.00025, 2],
      [0.0034, 2],
      [-0.0022, 1],
      [-0.00352, 0],
      [0.00101, 1],
      [-0.0038, 0],
      [-0.00053, 2],
      [-0.00308, 0],
      [0.00037, 1],
      [0.00046, 1]
    ],
    "red_o_points": [],
    "y_categories": ["NORM", "NPV", "nan"],
    "blue_o_points": [],
    "blue_x_points": [
      [0.00089, 1],
      [0.00601, 2],
      [0.00092, 1],
      [0.0022, 1],
      [0.0073, 2],
      [0.00059, 1],
      [0.00483, 0]
    ]
  },
  "QS_mulGraftLevel[Trunk]": {
    "red_x_points": [
      [-0.00077, 3],
      [-0.00135, 0],
      [-0.0014, 0],
      [-0.00136, 0],
      [-0.0014, 0],
      [-0.00132, 0],
      [-0.00139, 0],
      [-0.00079, 3],
      [-0.00145, 0],
      [-0.0013, 0],
      [-0.00119, 0],
      [-0.00085, 3],
      [0.00372, 1],
      [-0.00085, 3],
      [-0.00289, 2],
      [-0.00077, 3],
      [-0.00151, 0],
      [-0.00124, 0],
      [-0.00066, 3],
      [-0.00079, 3],
      [-0.00067, 3],
      [-0.00136, 0],
      [-0.00083, 3],
      [-0.00076, 3],
      [-0.00067, 3],
      [-0.00126, 0],
      [-0.00086, 3],
      [-0.00142, 0],
      [-0.00074, 3],
      [0.00419, 1],
      [-0.0012, 0]
    ],
    "red_o_points": [],
    "y_categories": ["N", "NOT APPLICABLE", "Y", "nan"],
    "blue_o_points": [],
    "blue_x_points": [
      [0.00516, 1],
      [-0.00028, 3],
      [0.00385, 1],
      [-0.00139, 0],
      [-0.00051, 3],
      [0.00406, 1],
      [0.00487, 1]
    ]
  },
  "QS_mulNeuromadSite[C4]": {
    "red_x_points": [
      [-0.00071, 2],
      [-0.00202, 0],
      [-0.00221, 0],
      [-0.00208, 0],
      [-0.00231, 0],
      [-0.00212, 0],
      [-0.00182, 0],
      [-0.00083, 2],
      [-0.00229, 0],
      [-0.00221, 0],
      [-0.00199, 0],
      [-0.00097, 2],
      [0.00402, 1],
      [-0.00055, 2],
      [-0.00207, 0],
      [-0.00093, 2],
      [-0.0022, 0],
      [-0.0019, 0],
      [-0.00081, 2],
      [-0.00068, 2],
      [-0.00057, 2],
      [-0.00177, 0],
      [-0.0007, 2],
      [-0.00094, 2],
      [-0.00076, 2],
      [-0.00186, 0],
      [-0.00064, 2],
      [-0.00203, 0],
      [-0.00059, 2],
      [0.00408, 1],
      [-0.00187, 0]
    ],
    "red_o_points": [],
    "y_categories": ["N", "NOT APPLICABLE", "nan"],
    "blue_o_points": [],
    "blue_x_points": [
      [0.00737, 1],
      [5e-5, 2],
      [0.00492, 1],
      [-0.00038, 0],
      [-8e-5, 2],
      [0.00525, 1],
      [0.00555, 1]
    ]
  },
  "QS_mulTransfSite[C7ipsi]": {
    "red_x_points": [
      [-5e-5, 2],
      [-5e-5, 0],
      [-5e-5, 0],
      [-5e-5, 0],
      [-5e-5, 0],
      [-5e-5, 2],
      [-5e-5, 0],
      [-5e-5, 0],
      [-5e-5, 2],
      [-5e-5, 0],
      [-5e-5, 2],
      [-5e-5, 2],
      [-5e-5, 2],
      [-5e-5, 0],
      [-5e-5, 2],
      [-5e-5, 2],
      [-5e-5, 2],
      [-5e-5, 0],
      [-5e-5, 2],
      [-5e-5, 0],
      [-5e-5, 2],
      [0.00013, 1],
      [-5e-5, 0]
    ],
    "red_o_points": [],
    "y_categories": ["N", "NOT APPLICABLE", "nan"],
    "blue_o_points": [],
    "blue_x_points": [[0.00013, 1], [0.00013, 1], [0.00013, 1], [0.00013, 1]]
  },
  "QS_mulGraftNerve[MP]": {
    "red_x_points": [
      [-1e-5, 2],
      [-0.00019, 0],
      [-0.00019, 0],
      [-0.00013, 0],
      [-0.0003, 0],
      [-0.00014, 0],
      [-0.00019, 0],
      [-3e-5, 2],
      [-0.00016, 0],
      [-0.00024, 0],
      [-0.00016, 0],
      [0.0, 2],
      [0.00037, 1],
      [-3e-5, 2],
      [-0.00021, 0],
      [-2e-5, 2],
      [-0.00016, 0],
      [-0.0003, 0],
      [-1e-5, 2],
      [-3e-5, 2],
      [-3e-5, 2],
      [-0.00021, 0],
      [-3e-5, 2],
      [-0.00015, 2],
      [-1e-5, 2],
      [-6e-5, 0],
      [-1e-5, 2],
      [-0.00024, 0],
      [-3e-5, 2],
      [0.00048, 1],
      [-0.00021, 0]
    ],
    "red_o_points": [],
    "y_categories": ["N", "NOT APPLICABLE", "nan"],
    "blue_o_points": [],
    "blue_x_points": [
      [0.0005, 1],
      [-3e-5, 2],
      [0.00016, 1],
      [-0.0001, 0],
      [-3e-5, 2],
      [0.00048, 1],
      [0.00061, 1]
    ]
  },
  "QS_mulGraftNerve[Ax]": {
    "red_x_points": [
      [-0.00014, 2],
      [-0.00058, 0],
      [-0.00078, 0],
      [-0.00077, 0],
      [-0.00069, 0],
      [-0.00082, 0],
      [-0.00062, 0],
      [-0.00028, 2],
      [-0.00055, 0],
      [-0.00049, 0],
      [-0.00046, 0],
      [-0.00024, 2],
      [0.00139, 1],
      [-0.00027, 2],
      [-0.00068, 0],
      [-0.00039, 2],
      [-0.00053, 0],
      [-0.00044, 0],
      [-0.0002, 2],
      [-0.00023, 2],
      [-0.0002, 2],
      [-0.00072, 0],
      [-0.00025, 2],
      [-0.00025, 2],
      [-0.00032, 2],
      [-0.00058, 0],
      [-0.00029, 2],
      [-0.00058, 0],
      [-0.00032, 2],
      [0.00137, 1],
      [-0.00064, 0]
    ],
    "red_o_points": [],
    "y_categories": ["N", "NOT APPLICABLE", "nan"],
    "blue_o_points": [],
    "blue_x_points": [
      [0.00235, 1],
      [-0.00014, 2],
      [0.00157, 1],
      [-0.00019, 0],
      [-0.00019, 2],
      [0.00184, 1],
      [0.00189, 1]
    ]
  },
  "QA_lstPexMuscstrength[ElbowExte]": {
    "red_x_points": [
      [-0.00261, 1],
      [-4e-5, 2],
      [2e-5, 1],
      [4e-5, 1],
      [-0.00063, 0],
      [-0.0, 1],
      [5e-5, 1],
      [-0.00252, 1],
      [-0.0008, 0],
      [-0.00022, 0],
      [8e-5, 1],
      [-0.00191, 1],
      [4e-5, 2],
      [0.00305, 2],
      [-0.00017, 2],
      [-0.00292, 1],
      [-3e-5, 2],
      [0.00019, 1],
      [-0.00172, 0],
      [-0.00222, 1],
      [-0.00277, 0],
      [7e-5, 1],
      [0.00286, 2],
      [-0.00217, 0],
      [-0.00303, 0],
      [5e-5, 1],
      [-0.00182, 1],
      [-0.00025, 2],
      [-0.00247, 1],
      [-3e-5, 2],
      [-0.0, 1]
    ],
    "red_o_points": [],
    "y_categories": ["GREATER THAN OR EQUALS TO 3", "LESS THAN 3", "nan"],
    "blue_o_points": [],
    "blue_x_points": [
      [0.00022, 2],
      [0.00591, 2],
      [-1e-5, 0],
      [0.00094, 1],
      [0.00649, 2],
      [0.00014, 0],
      [-0.0001, 0]
    ]
  },
  "QA_intPexForearmSupin": {
    "red_x_points": [
      [2e-5, 2],
      [9e-5, 0],
      [2e-5, 2],
      [0.0, 2],
      [-0.00031, 1],
      [-0.00025, 1],
      [2e-5, 2],
      [-0.00011, 1],
      [0.0, 2],
      [0.0, 2],
      [1e-5, 2],
      [0.00041, 2],
      [1e-5, 2],
      [-6e-5, 2],
      [1e-5, 2],
      [-0.00044, 1],
      [-0.00021, 1],
      [3e-5, 0],
      [-0.00018, 1],
      [-9e-5, 1],
      [1e-5, 2],
      [2e-5, 2],
      [1e-5, 2],
      [2e-5, 2],
      [-0.00053, 1],
      [1e-5, 2],
      [-0.01255, 1],
      [0.00012, 0]
    ],
    "red_o_points": [],
    "y_categories": ["GREATER THAN OR EQUALS TO 80", "LESS THAN 80", "nan"],
    "blue_o_points": [],
    "blue_x_points": [
      [0.00101, 2],
      [1e-5, 2],
      [0.00531, 0],
      [0.00029, 2],
      [0.00013, 2],
      [0.00123, 2],
      [0.00088, 2]
    ]
  },
  "QA_intPexShoulderExrot": {
    "red_x_points": [
      [7e-5, 2],
      [-9e-5, 1],
      [-9e-5, 0],
      [-0.00018, 1],
      [-9e-5, 1],
      [-0.00018, 0],
      [5e-5, 2],
      [5e-5, 2],
      [-9e-5, 1]
    ],
    "red_o_points": [],
    "y_categories": ["GREATER THAN OR EQUALS TO 60", "LESS THAN 60", "nan"],
    "blue_o_points": [],
    "blue_x_points": [[0.00012, 2], [5e-5, 2]]
  },
  "QS_mulGraftNerve[MCF]": {
    "red_x_points": [
      [-4e-5, 2],
      [-0.00023, 0],
      [-0.00014, 0],
      [-0.00016, 0],
      [-0.00016, 0],
      [-0.00019, 0],
      [-0.00017, 0],
      [-3e-5, 2],
      [-0.00013, 0],
      [-0.00018, 0],
      [-0.00022, 0],
      [-0.00011, 2],
      [0.00045, 1],
      [-4e-5, 2],
      [-0.00016, 0],
      [-0.00013, 2],
      [-0.00016, 0],
      [-0.00016, 0],
      [-0.00011, 2],
      [-8e-5, 2],
      [-8e-5, 2],
      [-0.00019, 0],
      [-6e-5, 2],
      [-6e-5, 2],
      [-4e-5, 2],
      [-0.00016, 0],
      [-6e-5, 2],
      [-0.00016, 0],
      [-8e-5, 2],
      [0.00034, 1],
      [-0.00019, 0]
    ],
    "red_o_points": [],
    "y_categories": ["N", "NOT APPLICABLE", "nan"],
    "blue_o_points": [],
    "blue_x_points": [
      [0.00067, 1],
      [-1e-5, 2],
      [0.0006, 1],
      [-8e-5, 0],
      [0.0, 2],
      [0.00041, 1],
      [0.00044, 1]
    ]
  },
  "QS_mulLysisSite[Nerve]": {
    "red_x_points": [
      [-0.00046, 3],
      [-0.00062, 0],
      [-0.00181, 2],
      [-0.00074, 0],
      [-0.00073, 0],
      [-0.00071, 0],
      [-0.00063, 0],
      [-0.00038, 3],
      [-0.00073, 0],
      [-0.00071, 0],
      [-0.0007, 0],
      [-0.0003, 3],
      [0.00228, 1],
      [-0.0003, 3],
      [-0.00076, 0],
      [-0.00038, 3],
      [-0.00078, 0],
      [-0.00077, 0],
      [-0.00026, 3],
      [-0.00055, 3],
      [-0.00039, 3],
      [-0.00049, 0],
      [-0.0004, 3],
      [-0.00037, 3],
      [-0.00031, 3],
      [-0.00067, 0],
      [-0.00042, 3],
      [-0.00072, 0],
      [-0.0004, 3],
      [0.00227, 1],
      [-0.00068, 0]
    ],
    "red_o_points": [],
    "y_categories": ["N", "NOT APPLICABLE", "Y", "nan"],
    "blue_o_points": [],
    "blue_x_points": [
      [0.00253, 1],
      [-2e-5, 3],
      [0.00193, 1],
      [-0.00082, 0],
      [-0.00017, 3],
      [0.00301, 1],
      [0.00244, 1]
    ]
  },
  "QS_mulGraftNerve[TD]": {
    "red_x_points": [
      [-0.00013, 2],
      [-0.00029, 0],
      [-0.00029, 0],
      [-0.00043, 0],
      [-0.00031, 0],
      [-0.00035, 0],
      [-0.00032, 0],
      [-0.00012, 2],
      [-0.0004, 0],
      [-0.00022, 0],
      [-0.00028, 0],
      [-8e-5, 2],
      [0.00028, 1],
      [-0.0002, 2],
      [-0.00032, 0],
      [-0.00017, 2],
      [-0.00024, 0],
      [-0.00039, 0],
      [-0.00015, 2],
      [-9e-5, 2],
      [-8e-5, 2],
      [-0.00028, 0],
      [-0.00019, 2],
      [-0.00021, 2],
      [-0.00016, 2],
      [-0.00031, 0],
      [-0.00011, 2],
      [-0.00037, 0],
      [-0.00014, 2],
      [0.00065, 1],
      [-0.00025, 0]
    ],
    "red_o_points": [],
    "y_categories": ["N", "NOT APPLICABLE", "nan"],
    "blue_o_points": [],
    "blue_x_points": [
      [0.00117, 1],
      [-4e-5, 2],
      [0.00059, 1],
      [-1e-5, 0],
      [0.00023, 2],
      [0.00066, 1],
      [0.00096, 1]
    ]
  },
  "QS_mulGraftLevel[other]": {
    "red_x_points": [
      [-3e-5, 2],
      [-8e-5, 0],
      [-8e-5, 0],
      [-3e-5, 0],
      [-8e-5, 0],
      [-8e-5, 0],
      [-3e-5, 2],
      [-3e-5, 0],
      [-8e-5, 0],
      [-8e-5, 0],
      [-3e-5, 2],
      [0.00018, 1],
      [-3e-5, 2],
      [-8e-5, 0],
      [-3e-5, 2],
      [-3e-5, 0],
      [-3e-5, 2],
      [-3e-5, 2],
      [-3e-5, 2],
      [-3e-5, 0],
      [-2e-5, 2],
      [-2e-5, 2],
      [-1e-5, 2],
      [-5e-5, 0],
      [-5e-5, 0],
      [-3e-5, 2],
      [0.00018, 1],
      [-5e-5, 0]
    ],
    "red_o_points": [],
    "y_categories": ["N", "NOT APPLICABLE", "nan"],
    "blue_o_points": [],
    "blue_x_points": [
      [0.00018, 1],
      [-2e-5, 2],
      [0.00018, 1],
      [-3e-5, 0],
      [-3e-5, 2],
      [9e-5, 1],
      [0.0001, 1]
    ]
  },
  "QS_lstBpsurgSide": {
    "red_x_points": [
      [-0.00345, 3],
      [-0.00456, 0],
      [-0.00508, 0],
      [-0.00499, 0],
      [-0.01035, 2],
      [-0.00485, 0],
      [-0.00433, 0],
      [-0.0034, 3],
      [-0.00496, 0],
      [-0.00965, 2],
      [-0.00936, 2],
      [-0.00324, 3],
      [0.01804, 1],
      [-0.00363, 3],
      [-0.01002, 2],
      [-0.00344, 3],
      [-0.00923, 2],
      [-0.0104, 2],
      [-0.0035, 3],
      [-0.00333, 3],
      [-0.00356, 3],
      [-0.00433, 0],
      [-0.00369, 3],
      [-0.00367, 3],
      [-0.00356, 3],
      [-0.00921, 2],
      [-0.00358, 3],
      [-0.00928, 2],
      [-0.0033, 3],
      [0.01642, 1],
      [-0.00476, 0]
    ],
    "red_o_points": [],
    "y_categories": ["L", "NOT APPLICABLE", "R", "nan"],
    "blue_o_points": [],
    "blue_x_points": [
      [0.02341, 1],
      [-0.00163, 3],
      [0.01958, 1],
      [0.00033, 0],
      [-0.00091, 3],
      [0.0197, 1],
      [0.01973, 1]
    ]
  },
  "QS_mulTransfSite[AcMc]": {
    "red_x_points": [
      [-0.00047, 3],
      [-0.00062, 0],
      [-0.00066, 0],
      [-0.00084, 0],
      [-0.00085, 0],
      [-0.0007, 0],
      [-0.00073, 0],
      [-0.00052, 3],
      [-0.00075, 0],
      [-0.0007, 0],
      [-0.00184, 2],
      [-0.00048, 3],
      [0.00208, 1],
      [-0.00047, 3],
      [-0.00087, 0],
      [-0.00056, 3],
      [-0.00077, 0],
      [-0.00088, 0],
      [-0.00056, 3],
      [-0.00042, 3],
      [-0.00052, 3],
      [-0.0006, 0],
      [-0.00046, 3],
      [-0.00031, 3],
      [-0.00051, 3],
      [-0.00071, 0],
      [-0.00048, 3],
      [-0.00083, 0],
      [-0.00039, 3],
      [0.00261, 1],
      [-0.0008, 0]
    ],
    "red_o_points": [],
    "y_categories": ["N", "NOT APPLICABLE", "Y", "nan"],
    "blue_o_points": [],
    "blue_x_points": [
      [0.00334, 1],
      [-0.00026, 3],
      [0.00218, 1],
      [-0.00029, 0],
      [-0.00032, 3],
      [0.00274, 1],
      [0.00218, 1]
    ]
  },
  "QS_mulTransfSite[Other]": {
    "red_x_points": [
      [-0.00059, 3],
      [-0.00122, 0],
      [-0.00126, 0],
      [-0.00109, 0],
      [-0.00129, 0],
      [-0.00129, 0],
      [-0.0012, 0],
      [-0.00055, 3],
      [-0.00131, 0],
      [-0.0012, 0],
      [-0.00131, 0],
      [-0.00088, 3],
      [0.00365, 1],
      [-0.00063, 3],
      [-0.00135, 0],
      [-0.0005, 3],
      [-0.00128, 0],
      [-0.00339, 2],
      [-0.00068, 3],
      [-0.00074, 3],
      [-0.00065, 3],
      [-0.00109, 0],
      [-0.00072, 3],
      [-0.00081, 3],
      [-0.00077, 3],
      [-0.00118, 0],
      [-0.00092, 3],
      [-0.0014, 0],
      [-0.00065, 3],
      [0.00394, 1],
      [-0.00107, 0]
    ],
    "red_o_points": [],
    "y_categories": ["N", "NOT APPLICABLE", "Y", "nan"],
    "blue_o_points": [],
    "blue_x_points": [
      [0.00482, 1],
      [-0.0002, 3],
      [0.00365, 1],
      [-0.00103, 0],
      [-0.00022, 3],
      [0.00364, 1],
      [0.00391, 1]
    ]
  },
  "QA_mulInjOrthesisType[ShoulderSupport]": {
    "red_x_points": [
      [-0.00887, 0],
      [-0.00806, 0],
      [-0.00839, 0],
      [-0.0081, 0],
      [-0.00842, 0],
      [-0.00799, 0],
      [-0.00826, 0],
      [-0.01055, 2],
      [-0.00831, 0],
      [-0.00802, 0],
      [-0.00852, 0],
      [-0.00949, 0],
      [0.02269, 1],
      [-0.00939, 0],
      [-0.00828, 0],
      [-0.00929, 0],
      [-0.01003, 2],
      [-0.00846, 0],
      [-0.00868, 0],
      [-0.00928, 0],
      [-0.01076, 2],
      [-0.01031, 3],
      [-0.0087, 0],
      [0.02336, 1],
      [-0.00913, 0],
      [-0.00833, 0],
      [-0.00856, 0],
      [-0.00801, 0],
      [-0.0109, 3],
      [-0.01488, 3],
      [-0.00807, 0]
    ],
    "red_o_points": [],
    "y_categories": ["N", "NOT APPLICABLE", "Y", "nan"],
    "blue_o_points": [],
    "blue_x_points": [
      [-0.0037, 0],
      [0.02509, 1],
      [0.0202, 1],
      [0.02649, 1],
      [0.02682, 1],
      [0.02084, 1],
      [0.02286, 1]
    ]
  },
  "QA_equInjTbpiAge": {
    "red_x_points": [
      [-0.00038, 1],
      [-0.0002, 1],
      [-6e-5, 1],
      [-7e-5, 0],
      [-0.00063, 0],
      [0.00012, 1],
      [0.00011, 1],
      [0.00045, 0],
      [-0.00093, 0],
      [-0.0004, 0],
      [0.00014, 1],
      [0.00052, 0],
      [-0.01184, 1],
      [-0.00086, 1],
      [-0.00011, 1],
      [-0.00063, 1],
      [-8e-5, 0],
      [-0.00101, 0],
      [-0.00059, 1],
      [0.00064, 0],
      [-0.00045, 1],
      [0.0, 1],
      [-0.0008, 1],
      [-0.00132, 1],
      [0.00067, 0],
      [0.00019, 1],
      [-0.00115, 1],
      [0.00014, 1],
      [-0.00066, 1],
      [-0.01024, 1],
      [1e-5, 0]
    ],
    "red_o_points": [],
    "y_categories": ["GREATER THAN OR EQUALS TO 30", "LESS THAN 30", "nan"],
    "blue_o_points": [],
    "blue_x_points": [
      [-0.00356, 1],
      [-0.00078, 1],
      [0.00544, 0],
      [0.00084, 1],
      [0.00335, 0],
      [0.0057, 0],
      [0.00616, 0]
    ]
  },
  "QS_mulLysisNerve[Ssr]": {
    "red_x_points": [
      [-0.0006, 3],
      [-0.00087, 0],
      [-0.00222, 2],
      [-0.00079, 0],
      [-0.00089, 0],
      [-0.0009, 0],
      [-0.00088, 0],
      [-0.00052, 3],
      [-0.00088, 0],
      [-0.0008, 0],
      [-0.00093, 0],
      [-0.00048, 3],
      [0.0028, 1],
      [-0.00049, 3],
      [-0.00087, 0],
      [-0.00056, 3],
      [-0.00078, 0],
      [-0.00076, 0],
      [-0.00038, 3],
      [-0.00041, 3],
      [-0.00052, 3],
      [-0.00103, 0],
      [-0.00043, 3],
      [-0.00052, 3],
      [-0.00044, 3],
      [-0.00089, 0],
      [-0.00048, 3],
      [-0.00083, 0],
      [-0.00046, 3],
      [0.00276, 1],
      [-0.00079, 0]
    ],
    "red_o_points": [],
    "y_categories": ["N", "NOT APPLICABLE", "Y", "nan"],
    "blue_o_points": [],
    "blue_x_points": [
      [0.0036, 1],
      [-0.00033, 3],
      [0.00296, 1],
      [-0.00094, 0],
      [-0.00013, 3],
      [0.00292, 1],
      [0.00276, 1]
    ]
  },
  "QS_mulTransfSite[AcSsAA]": {
    "red_x_points": [
      [-0.00242, 3],
      [-0.00694, 2],
      [-0.0033, 0],
      [-0.00668, 2],
      [-0.00781, 2],
      [-0.00277, 0],
      [-0.00306, 0],
      [-0.00254, 3],
      [-0.00308, 0],
      [-0.00697, 2],
      [-0.00323, 0],
      [-0.00246, 3],
      [0.01052, 1],
      [-0.00243, 3],
      [-0.00778, 2],
      [-0.00277, 3],
      [-0.00292, 0],
      [-0.00315, 0],
      [-0.0025, 3],
      [-0.00268, 3],
      [-0.00229, 3],
      [-0.00669, 2],
      [-0.00273, 3],
      [-0.00237, 3],
      [-0.00269, 3],
      [-0.003, 0],
      [-0.00237, 3],
      [-0.00703, 2],
      [-0.00246, 3],
      [0.01221, 1],
      [-0.00313, 0]
    ],
    "red_o_points": [],
    "y_categories": ["N", "NOT APPLICABLE", "Y", "nan"],
    "blue_o_points": [],
    "blue_x_points": [
      [0.01742, 1],
      [-0.00075, 3],
      [0.01401, 1],
      [-0.00033, 0],
      [-0.00112, 3],
      [0.01345, 1],
      [0.01381, 1]
    ]
  },
  "QS_mulGraftRoot[C8]": {
    "red_x_points": [
      [-0.0, 2],
      [-2e-5, 0],
      [-3e-5, 0],
      [-3e-5, 0],
      [-2e-5, 0],
      [-7e-5, 2],
      [-3e-5, 0],
      [-3e-5, 0],
      [-0.0, 2],
      [0.0001, 1],
      [-0.0, 2],
      [-3e-5, 0],
      [-8e-5, 2],
      [-3e-5, 0],
      [-3e-5, 0],
      [-0.0, 2],
      [-0.0, 2],
      [-3e-5, 0],
      [-0.0, 2],
      [-0.0, 2],
      [-0.0, 2],
      [-2e-5, 0],
      [-0.0, 2],
      [-0.0, 2]
    ],
    "red_o_points": [],
    "y_categories": ["N", "NOT APPLICABLE", "nan"],
    "blue_o_points": [],
    "blue_x_points": [
      [0.00012, 1],
      [-0.0, 2],
      [0.0001, 1],
      [-2e-5, 0],
      [-0.0, 2],
      [0.0001, 1]
    ]
  },
  "QA_lstPexMuscstrength[WristExte]": {
    "red_x_points": [
      [-0.0025, 1],
      [-0.00034, 2],
      [-0.00093, 1],
      [-0.00101, 1],
      [0.00047, 0],
      [-0.00103, 1],
      [-0.00093, 1],
      [-0.00128, 0],
      [0.00054, 0],
      [0.00043, 0],
      [-0.00081, 1],
      [-0.00175, 0],
      [-0.00331, 2],
      [0.00101, 2],
      [-0.00024, 2],
      [-0.00101, 0],
      [-4e-5, 2],
      [0.00048, 0],
      [-0.0008, 0],
      [-0.00225, 1],
      [-0.00091, 0],
      [-0.00101, 1],
      [0.0015, 2],
      [-0.00116, 0],
      [-0.00243, 1],
      [0.00044, 0],
      [-0.00246, 1],
      [0.00063, 0],
      [0.00152, 2],
      [-0.00298, 2],
      [-0.00081, 1]
    ],
    "red_o_points": [],
    "y_categories": ["GREATER THAN OR EQUALS TO 3", "LESS THAN 3", "nan"],
    "blue_o_points": [],
    "blue_x_points": [
      [0.00124, 0],
      [0.00268, 2],
      [0.00125, 0],
      [0.00175, 0],
      [0.0039, 2],
      [0.0014, 1],
      [0.00121, 0]
    ]
  },
  "QS_mulNeuromadSite[C6]": {
    "red_x_points": [
      [-0.00062, 2],
      [-0.00182, 0],
      [-0.00255, 0],
      [-0.00215, 0],
      [-0.00271, 0],
      [-0.00217, 0],
      [-0.00196, 0],
      [-0.00085, 2],
      [-0.00222, 0],
      [-0.00245, 0],
      [-0.00206, 0],
      [-0.00071, 2],
      [0.00474, 1],
      [-0.00077, 2],
      [-0.00218, 0],
      [-0.00082, 2],
      [-0.00204, 0],
      [-0.00231, 0],
      [-0.00077, 2],
      [-0.00067, 2],
      [-0.00064, 2],
      [-0.0018, 0],
      [-0.00079, 2],
      [-0.00077, 2],
      [-0.00096, 2],
      [-0.00204, 0],
      [-0.0007, 2],
      [-0.00213, 0],
      [-0.00073, 2],
      [0.00445, 1],
      [-0.00247, 0]
    ],
    "red_o_points": [],
    "y_categories": ["N", "NOT APPLICABLE", "nan"],
    "blue_o_points": [],
    "blue_x_points": [
      [0.00764, 1],
      [-0.00019, 2],
      [0.00552, 1],
      [-0.00047, 0],
      [-0.00033, 2],
      [0.00608, 1],
      [0.00569, 1]
    ]
  },
  "QS_mulNeuromadSite[T1]": {
    "red_x_points": [
      [-0.00118, 2],
      [-0.00343, 0],
      [-0.00344, 0],
      [-0.00328, 0],
      [-0.00351, 0],
      [-0.0035, 0],
      [-0.00319, 0],
      [-0.00109, 2],
      [-0.00365, 0],
      [-0.00364, 0],
      [-0.00308, 0],
      [-0.00145, 2],
      [0.00658, 1],
      [-0.00112, 2],
      [-0.00304, 0],
      [-0.00098, 2],
      [-0.00357, 0],
      [-0.00367, 0],
      [-0.00127, 2],
      [-0.00077, 2],
      [-0.00102, 2],
      [-0.00312, 0],
      [-0.00102, 2],
      [-0.00113, 2],
      [-0.00106, 2],
      [-0.0035, 0],
      [-0.00101, 2],
      [-0.00389, 0],
      [-0.00101, 2],
      [0.00623, 1],
      [-0.00313, 0]
    ],
    "red_o_points": [],
    "y_categories": ["N", "NOT APPLICABLE", "nan"],
    "blue_o_points": [],
    "blue_x_points": [
      [0.01066, 1],
      [2e-5, 2],
      [0.0085, 1],
      [-0.00026, 0],
      [0.0001, 2],
      [0.00783, 1],
      [0.00881, 1]
    ]
  },
  "QA_lstPexMuscstrength[ShoulderAbduc]": {
    "red_x_points": [
      [-0.00398, 1],
      [-0.00393, 1],
      [-0.00451, 1],
      [-0.0047, 1],
      [-0.00466, 1],
      [-0.0046, 1],
      [-0.00433, 1],
      [-0.00482, 1],
      [-0.00455, 1],
      [-0.00458, 1],
      [-0.00435, 1],
      [-0.00417, 1],
      [0.00259, 2],
      [0.00413, 2],
      [0.00354, 2],
      [0.00371, 2],
      [0.00404, 2],
      [-0.00493, 1],
      [-0.00451, 1],
      [-0.00445, 1],
      [-0.00495, 1],
      [-0.00446, 1],
      [0.00387, 2],
      [-0.00533, 1],
      [-0.00494, 1],
      [-0.00471, 1],
      [-0.00466, 1],
      [-0.00469, 1],
      [-0.00475, 1],
      [0.00239, 2],
      [-0.00461, 1]
    ],
    "red_o_points": [],
    "y_categories": ["GREATER THAN OR EQUALS TO 3", "LESS THAN 3", "nan"],
    "blue_o_points": [],
    "blue_x_points": [
      [0.00233, 2],
      [0.00434, 2],
      [0.01845, 0],
      [0.00468, 2],
      [0.00373, 2],
      [0.01963, 0],
      [-0.00129, 1]
    ]
  },
  "QA_lstPexMuscstrength[ShoulderExrot]": {
    "red_x_points": [
      [-0.00135, 1],
      [0.00037, 2],
      [0.00166, 0],
      [-0.00133, 1],
      [-0.00189, 1],
      [-0.00148, 1],
      [0.00041, 2],
      [-0.00151, 1],
      [-0.00137, 1],
      [-0.00122, 1],
      [0.0004, 2],
      [-0.00144, 1],
      [0.00039, 2],
      [0.00029, 2],
      [0.00034, 2],
      [0.00051, 2],
      [0.00032, 2],
      [-0.00223, 1],
      [-0.00148, 1],
      [-0.00143, 1],
      [-0.00124, 1],
      [0.00028, 2],
      [0.00035, 2],
      [0.00035, 2],
      [0.00042, 2],
      [-0.00161, 1],
      [0.00037, 2],
      [0.00116, 0],
      [0.00037, 2],
      [0.00044, 2],
      [-0.00144, 1]
    ],
    "red_o_points": [],
    "y_categories": ["GREATER THAN OR EQUALS TO 3", "LESS THAN 3", "nan"],
    "blue_o_points": [],
    "blue_x_points": [
      [0.00031, 2],
      [0.00036, 2],
      [0.00308, 0],
      [0.00092, 2],
      [0.00051, 2],
      [0.00276, 0],
      [-0.00015, 1]
    ]
  },
  "QS_mulGraftLevel[Root]": {
    "red_x_points": [
      [-3e-5, 0],
      [-3e-5, 0],
      [-3e-5, 0],
      [-3e-5, 0],
      [-1e-5, 2],
      [-3e-5, 0],
      [-3e-5, 0],
      [-1e-5, 2],
      [-1e-5, 2],
      [-3e-5, 0],
      [-3e-5, 0],
      [-3e-5, 0],
      [-1e-5, 2],
      [-1e-5, 2],
      [-3e-5, 0],
      [-1e-5, 2],
      [-1e-5, 2],
      [-1e-5, 2],
      [-3e-5, 0],
      [-1e-5, 2],
      [-1e-5, 2],
      [0.00011, 1],
      [-3e-5, 0]
    ],
    "red_o_points": [],
    "y_categories": ["N", "NOT APPLICABLE", "nan"],
    "blue_o_points": [],
    "blue_x_points": [
      [-1e-5, 2],
      [0.00011, 1],
      [-3e-5, 0],
      [-1e-5, 2],
      [0.00011, 1],
      [0.00011, 1]
    ]
  },
  "QS_mulGraftNerve[Sc]": {
    "red_x_points": [
      [-5e-5, 2],
      [-0.00014, 0],
      [-0.00014, 0],
      [-0.00017, 0],
      [-9e-5, 0],
      [-0.00019, 0],
      [-0.00011, 0],
      [-7e-5, 2],
      [-0.0001, 0],
      [-0.00016, 0],
      [-0.00014, 0],
      [-6e-5, 2],
      [0.00051, 1],
      [-6e-5, 2],
      [-0.00019, 0],
      [-5e-5, 2],
      [-0.00017, 0],
      [-0.00019, 0],
      [-3e-5, 2],
      [-4e-5, 2],
      [-5e-5, 2],
      [-0.00014, 0],
      [-6e-5, 2],
      [-4e-5, 2],
      [-6e-5, 2],
      [-0.0001, 0],
      [-7e-5, 2],
      [-0.00016, 0],
      [-7e-5, 2],
      [0.00017, 1],
      [-0.00016, 0]
    ],
    "red_o_points": [],
    "y_categories": ["N", "NOT APPLICABLE", "nan"],
    "blue_o_points": [],
    "blue_x_points": [
      [0.00067, 1],
      [-6e-5, 2],
      [0.0003, 1],
      [-0.00014, 0],
      [-4e-5, 2],
      [0.00056, 1],
      [0.00055, 1]
    ]
  },
  "QS_mulGraftNerve[Ra]": {
    "red_x_points": [
      [-0.00037, 2],
      [-0.00105, 0],
      [-0.00107, 0],
      [-0.00096, 0],
      [-0.00119, 0],
      [-0.00099, 0],
      [-0.00074, 0],
      [-0.00026, 2],
      [-0.00127, 0],
      [-0.0007, 0],
      [-0.00099, 0],
      [-0.00028, 2],
      [0.00161, 1],
      [-0.00048, 2],
      [-0.0011, 0],
      [-0.00045, 2],
      [-0.00085, 0],
      [-0.00114, 0],
      [-0.00036, 2],
      [-0.00034, 2],
      [-0.00039, 2],
      [-0.00074, 0],
      [-0.00045, 2],
      [-0.00037, 2],
      [-0.00035, 2],
      [-0.00078, 0],
      [-0.00058, 2],
      [-0.00106, 0],
      [-0.00032, 2],
      [0.00219, 1],
      [-0.00092, 0]
    ],
    "red_o_points": [],
    "y_categories": ["N", "NOT APPLICABLE", "nan"],
    "blue_o_points": [],
    "blue_x_points": [
      [0.00409, 1],
      [-5e-5, 2],
      [0.00237, 1],
      [-0.00013, 0],
      [-0.00014, 2],
      [0.00258, 1],
      [0.00201, 1]
    ]
  },
  "QS_mulTransfSite[Oberlin]": {
    "red_x_points": [
      [-0.00314, 3],
      [-0.00971, 0],
      [-0.0095, 0],
      [-0.00923, 0],
      [-0.00452, 2],
      [-0.00457, 2],
      [-0.00984, 0],
      [-0.00307, 3],
      [-0.00438, 2],
      [-0.00434, 2],
      [-0.00434, 2],
      [-0.00284, 3],
      [0.01408, 1],
      [-0.00319, 3],
      [-0.00487, 2],
      [-0.00268, 3],
      [-0.00943, 0],
      [-0.00424, 2],
      [-0.00316, 3],
      [-0.00294, 3],
      [-0.00278, 3],
      [-0.00904, 0],
      [-0.00301, 3],
      [-0.00322, 3],
      [-0.00329, 3],
      [-0.00471, 2],
      [-0.00316, 3],
      [-0.00954, 0],
      [-0.00301, 3],
      [0.01707, 1],
      [-0.00897, 0]
    ],
    "red_o_points": [],
    "y_categories": ["N", "NOT APPLICABLE", "Y", "nan"],
    "blue_o_points": [],
    "blue_x_points": [
      [0.02292, 1],
      [-0.00107, 3],
      [0.01878, 1],
      [0.00017, 2],
      [-0.00127, 3],
      [0.01895, 1],
      [0.01875, 1]
    ]
  },
  "QA_intPexForearmProna": {
    "red_x_points": [
      [0.00011, 2],
      [-0.00047, 0],
      [0.0001, 2],
      [8e-5, 2],
      [-0.00051, 0],
      [-0.00047, 0],
      [0.0001, 2],
      [-0.00061, 0],
      [7e-5, 2],
      [8e-5, 2],
      [7e-5, 2],
      [-0.00066, 0],
      [0.0001, 2],
      [8e-5, 2],
      [6e-5, 2],
      [8e-5, 2],
      [8e-5, 2],
      [-0.00063, 0],
      [-0.00051, 0],
      [-0.00047, 0],
      [-0.0006, 0],
      [-0.00037, 0],
      [5e-5, 2],
      [8e-5, 2],
      [7e-5, 2],
      [9e-5, 2],
      [0.00055, 1],
      [7e-5, 2],
      [6e-5, 2],
      [0.00043, 1],
      [-0.00047, 0]
    ],
    "red_o_points": [],
    "y_categories": ["GREATER THAN OR EQUALS TO 80", "LESS THAN 80", "nan"],
    "blue_o_points": [],
    "blue_x_points": [
      [3e-5, 2],
      [7e-5, 2],
      [0.00121, 1],
      [0.00016, 2],
      [0.0001, 2],
      [0.00012, 2],
      [1e-5, 2]
    ]
  },
  "QS_mulGraftNerve[FI]": {
    "red_x_points": [
      [-0.00063, 2],
      [-0.00193, 0],
      [-0.00204, 0],
      [-0.00183, 0],
      [-0.00181, 0],
      [-0.00166, 0],
      [-0.00162, 0],
      [-0.00052, 2],
      [-0.002, 0],
      [-0.00189, 0],
      [-0.00166, 0],
      [-0.00073, 2],
      [0.00208, 1],
      [-0.00024, 2],
      [-0.00177, 0],
      [-0.00066, 2],
      [-0.00177, 0],
      [-0.00203, 0],
      [-0.00054, 2],
      [-0.00045, 2],
      [-0.00054, 2],
      [-0.00184, 0],
      [-0.00061, 2],
      [-0.00064, 2],
      [-0.00059, 2],
      [-0.0016, 0],
      [-0.00051, 2],
      [-0.00181, 0],
      [-0.00044, 2],
      [0.00372, 1],
      [-0.00178, 0]
    ],
    "red_o_points": [],
    "y_categories": ["N", "NOT APPLICABLE", "nan"],
    "blue_o_points": [],
    "blue_x_points": [
      [0.00486, 1],
      [0.0001, 2],
      [0.00447, 1],
      [-0.00027, 0],
      [5e-5, 2],
      [0.00468, 1],
      [0.00504, 1]
    ]
  }
}
