{
  "QA_lstPexMuscstrength[ElbowFlex]": {
    "red_x_points": [
      [-0.00411, 1],
      [0.00026, 2],
      [-0.00195, 1],
      [-0.00219, 1],
      [0.00244, 0],
      [-0.0017, 1],
      [-0.00189, 1],
      [-0.00431, 1],
      [-0.0019, 1],
      [-0.00196, 1],
      [-0.00199, 1],
      [-0.0043, 1],
      [0.00046, 2],
      [0.00383, 2],
      [0.00018, 2],
      [-0.00439, 1],
      [0.0003, 2],
      [0.00105, 0],
      [-0.00427, 1],
      [-0.00435, 1],
      [-0.00398, 1],
      [-0.00176, 1],
      [0.00324, 2],
      [-0.00041, 0],
      [-0.0045, 1],
      [-0.0019, 1],
      [-0.00459, 1],
      [-0.00187, 1],
      [-0.00383, 1],
      [0.0004, 2],
      [-0.0017, 1]
    ],
    "red_o_points": [],
    "y_categories": ["GREATER THAN OR EQUALS TO 3", "LESS THAN 3", "nan"],
    "blue_o_points": [],
    "blue_x_points": [
      [0.00054, 2],
      [0.00636, 2],
      [0.00527, 0],
      [0.00086, 1],
      [0.00567, 2],
      [0.00524, 0],
      [0.00566, 0]
    ]
  },
  "QS_mulGraftRoot[C6]": {
    "red_x_points": [
      [-3e-5, 2],
      [-3e-5, 0],
      [-3e-5, 0],
      [-3e-5, 0],
      [-3e-5, 0],
      [-3e-5, 2],
      [-3e-5, 0],
      [-3e-5, 0],
      [-3e-5, 0],
      [-3e-5, 2],
      [0.00012, 1],
      [-3e-5, 2],
      [-3e-5, 0],
      [-3e-5, 2],
      [-3e-5, 0],
      [-3e-5, 0],
      [-3e-5, 2],
      [-3e-5, 2],
      [-3e-5, 2],
      [-3e-5, 0],
      [-3e-5, 2],
      [-3e-5, 2],
      [-3e-5, 0]
    ],
    "red_o_points": [],
    "y_categories": ["N", "NOT APPLICABLE", "nan"],
    "blue_o_points": [],
    "blue_x_points": [
      [0.00012, 1],
      [-3e-5, 2],
      [0.00012, 1],
      [-3e-5, 0],
      [0.00012, 1]
    ]
  },
  "QS_mulBpsurgeryType[Transf]": {
    "red_x_points": [
      [-0.00024, 3],
      [-0.00031, 2],
      [-0.00084, 0],
      [-0.00036, 2],
      [-0.00036, 2],
      [-0.00032, 2],
      [-0.00035, 2],
      [-0.00021, 3],
      [-0.00027, 2],
      [-0.00029, 2],
      [-0.00041, 2],
      [-0.00017, 3],
      [0.0012, 1],
      [-0.0002, 3],
      [-0.00036, 2],
      [-0.00019, 3],
      [-0.00036, 2],
      [-0.00033, 2],
      [-0.00021, 3],
      [-0.00021, 3],
      [-0.00015, 3],
      [-0.00041, 2],
      [-0.00014, 3],
      [-0.00024, 3],
      [-0.00021, 3],
      [-0.00039, 2],
      [-0.00017, 3],
      [-0.00042, 2],
      [-0.00017, 3],
      [0.0014, 1],
      [-0.00036, 2]
    ],
    "red_o_points": [],
    "y_categories": ["N", "NOT APPLICABLE", "Y", "nan"],
    "blue_o_points": [],
    "blue_x_points": [
      [0.00145, 1],
      [-7e-5, 3],
      [0.00097, 1],
      [-0.00048, 2],
      [-0.00017, 3],
      [0.00115, 1],
      [0.00112, 1]
    ]
  },
  "QS_mulNeuromadSite[T1]": {
    "red_x_points": [
      [-0.00156, 2],
      [-0.00439, 0],
      [-0.00485, 0],
      [-0.00415, 0],
      [-0.00435, 0],
      [-0.0045, 0],
      [-0.00442, 0],
      [-0.00162, 2],
      [-0.00454, 0],
      [-0.00481, 0],
      [-0.00436, 0],
      [-0.00202, 2],
      [0.00846, 1],
      [-0.00144, 2],
      [-0.00467, 0],
      [-0.00198, 2],
      [-0.00408, 0],
      [-0.00481, 0],
      [-0.00161, 2],
      [-0.00154, 2],
      [-0.00149, 2],
      [-0.00424, 0],
      [-0.00129, 2],
      [-0.00164, 2],
      [-0.00187, 2],
      [-0.0043, 0],
      [-0.00157, 2],
      [-0.00488, 0],
      [-0.00111, 2],
      [0.00831, 1],
      [-0.00441, 0]
    ],
    "red_o_points": [],
    "y_categories": ["N", "NOT APPLICABLE", "nan"],
    "blue_o_points": [],
    "blue_x_points": [
      [0.01579, 1],
      [-0.00035, 2],
      [0.01065, 1],
      [-0.00028, 0],
      [-0.00019, 2],
      [0.01104, 1],
      [0.01132, 1]
    ]
  },
  "QS_mulNeuromadSite[T2]": {
    "red_x_points": [
      [-0.00167, 2],
      [-0.00511, 0],
      [-0.00553, 0],
      [-0.00563, 0],
      [-0.006, 0],
      [-0.00554, 0],
      [-0.00587, 0],
      [-0.0022, 2],
      [-0.00565, 0],
      [-0.00567, 0],
      [-0.00525, 0],
      [-0.00211, 2],
      [0.00906, 1],
      [-0.00178, 2],
      [-0.00602, 0],
      [-0.00237, 2],
      [-0.00553, 0],
      [-0.00527, 0],
      [-0.0021, 2],
      [-0.00166, 2],
      [-0.00171, 2],
      [-0.00489, 0],
      [-0.00161, 2],
      [-0.00265, 2],
      [-0.00201, 2],
      [-0.00485, 0],
      [-0.00169, 2],
      [-0.00591, 0],
      [-0.00153, 2],
      [0.01088, 1],
      [-0.00541, 0]
    ],
    "red_o_points": [],
    "y_categories": ["N", "NOT APPLICABLE", "nan"],
    "blue_o_points": [],
    "blue_x_points": [
      [0.01967, 1],
      [-0.00028, 2],
      [0.01228, 1],
      [-9e-5, 0],
      [-5e-5, 2],
      [0.01291, 1],
      [0.01451, 1]
    ]
  },
  "QA_mulInjOrthesisType[ShoulderSupport]": {
    "red_x_points": [
      [-0.01198, 0],
      [-0.0117, 0],
      [-0.01108, 0],
      [-0.01087, 0],
      [-0.01133, 0],
      [-0.01143, 0],
      [-0.01135, 0],
      [-0.01373, 2],
      [-0.01134, 0],
      [-0.01077, 0],
      [-0.01132, 0],
      [-0.01144, 0],
      [0.03016, 1],
      [-0.012, 0],
      [-0.01111, 0],
      [-0.01181, 0],
      [-0.01314, 2],
      [-0.01117, 0],
      [-0.01197, 0],
      [-0.01155, 0],
      [-0.01326, 2],
      [-0.01349, 3],
      [-0.01152, 0],
      [0.03223, 1],
      [-0.01178, 0],
      [-0.01067, 0],
      [-0.01203, 0],
      [-0.01068, 0],
      [-0.01459, 3],
      [-0.0202, 3],
      [-0.01086, 0]
    ],
    "red_o_points": [],
    "y_categories": ["N", "NOT APPLICABLE", "Y", "nan"],
    "blue_o_points": [],
    "blue_x_points": [
      [-0.0045, 0],
      [0.03322, 1],
      [0.0305, 1],
      [0.03512, 1],
      [0.03523, 1],
      [0.02995, 1],
      [0.02817, 1]
    ]
  },
  "QS_mulGraftTrunk[MiddleTrunk]": {
    "red_x_points": [
      [-1e-5, 2],
      [-3e-5, 0],
      [-3e-5, 0],
      [-3e-5, 0],
      [-3e-5, 0],
      [-3e-5, 0],
      [-3e-5, 0],
      [-3e-5, 0],
      [-1e-5, 2],
      [9e-5, 1],
      [-1e-5, 2],
      [-3e-5, 0],
      [-1e-5, 2],
      [-1e-5, 2],
      [-1e-5, 2],
      [-3e-5, 0],
      [-1e-5, 2],
      [-1e-5, 2],
      [-1e-5, 2],
      [-1e-5, 2],
      [-3e-5, 0],
      [9e-5, 1],
      [-3e-5, 0]
    ],
    "red_o_points": [],
    "y_categories": ["N", "NOT APPLICABLE", "nan"],
    "blue_o_points": [],
    "blue_x_points": [
      [9e-5, 1],
      [-1e-5, 2],
      [-3e-5, 0],
      [-1e-5, 2],
      [9e-5, 1],
      [9e-5, 1]
    ]
  },
  "QS_mulLysisTrunk[Upper]": {
    "red_x_points": [
      [-0.0015, 3],
      [-0.00327, 0],
      [-0.00364, 0],
      [-0.00324, 0],
      [-0.00354, 0],
      [-0.00624, 2],
      [-0.00347, 0],
      [-0.00167, 3],
      [-0.00362, 0],
      [-0.00326, 0],
      [-0.00327, 0],
      [-0.00187, 3],
      [0.01057, 1],
      [-0.00173, 3],
      [-0.00327, 0],
      [-0.0021, 3],
      [-0.00642, 2],
      [-0.004, 0],
      [-0.00163, 3],
      [-0.00172, 3],
      [-0.00179, 3],
      [-0.00327, 0],
      [-0.00173, 3],
      [-0.0018, 3],
      [-0.0018, 3],
      [-0.00317, 0],
      [-0.00168, 3],
      [-0.00331, 0],
      [-0.00168, 3],
      [0.00882, 1],
      [-0.00514, 2]
    ],
    "red_o_points": [],
    "y_categories": ["N", "NOT APPLICABLE", "Y", "nan"],
    "blue_o_points": [],
    "blue_x_points": [
      [0.01325, 1],
      [-0.00067, 3],
      [0.01047, 1],
      [-0.00167, 0],
      [-0.00087, 3],
      [0.01045, 1],
      [0.01161, 1]
    ]
  },
  "QS_mulGraftNerve[Ac]": {
    "red_x_points": [
      [-0.00036, 2],
      [-0.00147, 0],
      [-0.00143, 0],
      [-0.00147, 0],
      [-0.00117, 0],
      [-0.00114, 0],
      [-0.00137, 0],
      [-0.00031, 2],
      [-0.00127, 0],
      [-0.00118, 0],
      [-0.00129, 0],
      [-0.00031, 2],
      [0.00213, 1],
      [-0.00034, 2],
      [-0.00128, 0],
      [-0.00033, 2],
      [-0.0011, 0],
      [-0.00107, 0],
      [-0.00038, 2],
      [-0.00032, 2],
      [-0.00038, 2],
      [-0.00108, 0],
      [-0.00025, 2],
      [-0.00031, 2],
      [-0.00037, 2],
      [-0.0013, 0],
      [-0.00045, 2],
      [-0.00121, 0],
      [-0.00029, 2],
      [0.00254, 1],
      [-0.00107, 0]
    ],
    "red_o_points": [],
    "y_categories": ["N", "NOT APPLICABLE", "nan"],
    "blue_o_points": [],
    "blue_x_points": [
      [0.00416, 1],
      [3e-5, 2],
      [0.00253, 1],
      [9e-5, 0],
      [-1e-5, 2],
      [0.00259, 1],
      [0.0033, 1]
    ]
  },
  "QS_mulNeuromadSite[C8]": {
    "red_x_points": [
      [-0.001, 2],
      [-0.00371, 0],
      [-0.00427, 0],
      [-0.00358, 0],
      [-0.00368, 0],
      [-0.00359, 0],
      [-0.00363, 0],
      [-0.00108, 2],
      [-0.00354, 0],
      [-0.00357, 0],
      [-0.00331, 0],
      [-0.00132, 2],
      [0.00587, 1],
      [-0.00111, 2],
      [-0.00346, 0],
      [-0.00111, 2],
      [-0.00318, 0],
      [-0.00359, 0],
      [-0.00128, 2],
      [-0.00099, 2],
      [-0.00098, 2],
      [-0.0032, 0],
      [-0.00132, 2],
      [-0.00116, 2],
      [-0.0011, 2],
      [-0.00341, 0],
      [-0.00117, 2],
      [-0.00401, 0],
      [-0.00085, 2],
      [0.00685, 1],
      [-0.00335, 0]
    ],
    "red_o_points": [],
    "y_categories": ["N", "NOT APPLICABLE", "nan"],
    "blue_o_points": [],
    "blue_x_points": [
      [0.01238, 1],
      [-0.00019, 2],
      [0.00779, 1],
      [0.0001, 0],
      [-0.00015, 2],
      [0.00857, 1],
      [0.00904, 1]
    ]
  },
  "QS_mulGraftNerve[Ph]": {
    "red_x_points": [
      [-0.00027, 2],
      [-0.00083, 0],
      [-0.00079, 0],
      [-0.0008, 0],
      [-0.00114, 0],
      [-0.00089, 0],
      [-0.00081, 0],
      [-0.00028, 2],
      [-0.0008, 0],
      [-0.00066, 0],
      [-0.00087, 0],
      [-0.00037, 2],
      [0.00121, 1],
      [-0.00018, 2],
      [-0.00053, 0],
      [-0.00045, 2],
      [-0.0009, 0],
      [-0.00119, 0],
      [-0.00036, 2],
      [-0.00022, 2],
      [-0.00022, 2],
      [-0.00079, 0],
      [-0.00018, 2],
      [-0.00059, 2],
      [-0.00024, 2],
      [-0.00075, 0],
      [-0.00019, 2],
      [-0.00074, 0],
      [-0.00021, 2],
      [0.0018, 1],
      [-0.00068, 0]
    ],
    "red_o_points": [],
    "y_categories": ["N", "NOT APPLICABLE", "nan"],
    "blue_o_points": [],
    "blue_x_points": [
      [0.00301, 1],
      [5e-5, 2],
      [0.00213, 1],
      [-5e-5, 0],
      [4e-5, 2],
      [0.00184, 1],
      [0.00219, 1]
    ]
  },
  "QS_mulTransfSite[AcSsPA]": {
    "red_x_points": [
      [-0.00044, 3],
      [-0.00127, 0],
      [-0.00133, 0],
      [-0.00112, 0],
      [-0.00124, 0],
      [-0.00125, 0],
      [-0.00123, 0],
      [-0.00051, 3],
      [-0.00105, 0],
      [-0.00118, 0],
      [-0.00113, 0],
      [-0.00039, 3],
      [0.00311, 1],
      [-0.00049, 3],
      [-0.00112, 0],
      [-0.00058, 3],
      [-0.00249, 2],
      [-0.00113, 0],
      [-0.0005, 3],
      [-0.00048, 3],
      [-0.00048, 3],
      [-0.0011, 0],
      [-0.00053, 3],
      [-0.00044, 3],
      [-0.00051, 3],
      [-0.00126, 0],
      [-0.00048, 3],
      [-0.00133, 0],
      [-0.00035, 3],
      [0.00334, 1],
      [-0.00116, 0]
    ],
    "red_o_points": [],
    "y_categories": ["N", "NOT APPLICABLE", "Y", "nan"],
    "blue_o_points": [],
    "blue_x_points": [
      [0.00432, 1],
      [-0.00016, 3],
      [0.00314, 1],
      [-0.00085, 0],
      [-0.00021, 3],
      [0.00304, 1],
      [0.00407, 1]
    ]
  },
  "QA_lstPexMuscstrength[ScapulaAbducSuprot]": {
    "red_x_points": [
      [-6e-5, 0],
      [0.00015, 2],
      [-0.0002, 1],
      [-0.00048, 1],
      [-0.00017, 0],
      [-0.00045, 1],
      [-0.00058, 1],
      [-0.00056, 1],
      [-0.00018, 0],
      [-0.00019, 0],
      [-0.00048, 1],
      [-0.00043, 1],
      [0.00021, 2],
      [0.00024, 2],
      [0.0001, 2],
      [0.00038, 2],
      [5e-5, 2],
      [-9e-5, 0],
      [-0.0, 0],
      [-0.00056, 1],
      [-5e-5, 0],
      [-0.00045, 1],
      [6e-5, 2],
      [-0.00013, 0],
      [0.00018, 2],
      [-0.00086, 1],
      [-0.00069, 1],
      [-6e-5, 0],
      [0.00032, 2],
      [0.00036, 2],
      [-0.00016, 1]
    ],
    "red_o_points": [],
    "y_categories": ["GREATER THAN OR EQUALS TO 3", "LESS THAN 3", "nan"],
    "blue_o_points": [],
    "blue_x_points": [
      [0.00013, 2],
      [0.00035, 2],
      [5e-5, 0],
      [0.00137, 2],
      [0.00043, 2],
      [0.00017, 0],
      [7e-5, 2]
    ]
  },
  "participant_code": {
    "red_x_points": [
      [-0.01871, 1],
      [-0.0189, 2],
      [-0.01754, 3],
      [-0.01768, 4],
      [-0.01792, 5],
      [-0.01731, 6],
      [-0.01838, 7],
      [-0.0175, 8],
      [-0.01745, 9],
      [-0.01768, 10],
      [-0.01871, 11],
      [-0.01838, 12],
      [-0.0181, 14],
      [-0.01773, 16],
      [-0.01815, 17],
      [-0.01806, 19],
      [-0.01782, 20],
      [-0.01829, 22],
      [-0.01796, 23],
      [-0.01736, 25],
      [-0.01726, 26],
      [-0.0175, 27],
      [-0.0167, 28],
      [-0.01787, 29],
      [-0.01717, 30],
      [-0.01722, 32],
      [-0.0174, 33],
      [-0.01754, 34],
      [-0.01736, 35],
      [-0.01778, 36],
      [-0.01815, 37]
    ],
    "red_o_points": [],
    "y_categories": [
      "P16554",
      "P18297",
      "P19283",
      "P19287",
      "P23391",
      "P31645",
      "P31691",
      "P34778",
      "P35046",
      "P36328",
      "P43633",
      "P4544",
      "P46417",
      "P48965",
      "P53068",
      "P5497",
      "P59529",
      "P62483",
      "P64658",
      "P65202",
      "P66816",
      "P6751",
      "P7408",
      "P75566",
      "P76226",
      "P79971",
      "P82621",
      "P82990",
      "P84932",
      "P85825",
      "P86989",
      "P8770",
      "P87791",
      "P90550",
      "P93159",
      "P94969",
      "P96710",
      "P9744",
      "nan"
    ],
    "blue_o_points": [],
    "blue_x_points": [
      [0.05289, 0],
      [0.05243, 13],
      [0.05059, 15],
      [0.05136, 18],
      [0.0486, 21],
      [0.05136, 24],
      [0.05381, 31]
    ]
  },
  "QA_lstPexMuscstrength[ShoulderExrot]": {
    "red_x_points": [
      [-0.00205, 1],
      [0.00034, 2],
      [0.00226, 0],
      [-0.00163, 1],
      [-0.00205, 1],
      [-0.00177, 1],
      [0.00037, 2],
      [-0.00198, 1],
      [-0.00173, 1],
      [-0.00174, 1],
      [0.00035, 2],
      [-0.00147, 1],
      [0.0, 2],
      [0.00028, 2],
      [0.00037, 2],
      [0.00031, 2],
      [0.0003, 2],
      [-0.00249, 1],
      [-0.00167, 1],
      [-0.00183, 1],
      [-0.00192, 1],
      [0.0002, 2],
      [0.00028, 2],
      [0.00021, 2],
      [0.00033, 2],
      [-0.00199, 1],
      [0.00032, 2],
      [0.00237, 0],
      [0.00033, 2],
      [4e-5, 2],
      [-0.00158, 1]
    ],
    "red_o_points": [],
    "y_categories": ["GREATER THAN OR EQUALS TO 3", "LESS THAN 3", "nan"],
    "blue_o_points": [],
    "blue_x_points": [
      [0.0002, 2],
      [0.00042, 2],
      [0.00413, 0],
      [0.0007, 2],
      [0.00052, 2],
      [0.00411, 0],
      [0.00011, 1]
    ]
  },
  "QA_mulInjOrthesisType[ArmSling]": {
    "red_x_points": [
      [-0.00891, 2],
      [-0.00873, 2],
      [-0.00924, 2],
      [-0.00922, 2],
      [-0.00869, 2],
      [-0.00932, 2],
      [-0.00883, 2],
      [-0.00939, 2],
      [-0.00927, 2],
      [-0.00878, 2],
      [-0.00931, 2],
      [-0.0099, 2],
      [0.02487, 1],
      [-0.00891, 2],
      [-0.00905, 2],
      [-0.00901, 2],
      [-0.00968, 0],
      [-0.00897, 2],
      [-0.00997, 2],
      [-0.00912, 2],
      [-0.01117, 0],
      [-0.01086, 3],
      [-0.00945, 2],
      [0.02716, 1],
      [-0.00969, 2],
      [-0.00914, 2],
      [-0.00936, 2],
      [-0.00918, 2],
      [-0.01163, 3],
      [-0.0159, 3],
      [-0.00887, 2]
    ],
    "red_o_points": [],
    "y_categories": ["N", "NOT APPLICABLE", "Y", "nan"],
    "blue_o_points": [],
    "blue_x_points": [
      [-0.00412, 2],
      [0.02718, 1],
      [0.02331, 1],
      [0.0299, 1],
      [0.02507, 1],
      [0.02279, 1],
      [0.02267, 1]
    ]
  },
  "QS_mulGraftNerve[Ul]": {
    "red_x_points": [
      [-0.00018, 2],
      [-0.00054, 0],
      [-0.00032, 0],
      [-0.00048, 0],
      [-0.00053, 0],
      [-0.00041, 0],
      [-0.00041, 0],
      [-0.0002, 2],
      [-0.0004, 0],
      [-0.00034, 0],
      [-0.00042, 0],
      [-0.00013, 2],
      [0.00061, 1],
      [-0.00014, 2],
      [-0.00056, 0],
      [-0.00017, 2],
      [-0.0005, 0],
      [-0.00065, 0],
      [-0.00022, 2],
      [-0.00017, 2],
      [-0.00021, 2],
      [-0.00042, 0],
      [-7e-5, 2],
      [-0.00037, 2],
      [-0.00014, 2],
      [-0.00052, 0],
      [-0.00016, 2],
      [-0.00048, 0],
      [-0.00011, 2],
      [0.001, 1],
      [-0.00052, 0]
    ],
    "red_o_points": [],
    "y_categories": ["N", "NOT APPLICABLE", "nan"],
    "blue_o_points": [],
    "blue_x_points": [
      [0.00153, 1],
      [-2e-5, 2],
      [0.00133, 1],
      [-9e-5, 0],
      [-2e-5, 2],
      [0.00113, 1],
      [0.00121, 1]
    ]
  },
  "QS_mulGraftNerve[Ssr]": {
    "red_x_points": [
      [-1e-5, 2],
      [-5e-5, 0],
      [-5e-5, 0],
      [-5e-5, 0],
      [-5e-5, 0],
      [-5e-5, 0],
      [-1e-5, 2],
      [-5e-5, 0],
      [-5e-5, 0],
      [-5e-5, 0],
      [0.0001, 1],
      [-5e-5, 0],
      [-1e-5, 2],
      [-5e-5, 0],
      [-1e-5, 2],
      [-1e-5, 2],
      [-1e-5, 2],
      [-1e-5, 2],
      [-1e-5, 2],
      [-5e-5, 0],
      [-1e-5, 2],
      [-5e-5, 0],
      [0.0001, 1]
    ],
    "red_o_points": [],
    "y_categories": ["N", "NOT APPLICABLE", "nan"],
    "blue_o_points": [],
    "blue_x_points": [[0.0001, 1], [-1e-5, 2], [0.0001, 1], [0.0001, 1]]
  },
  "QA_yonInjUnconscio": {
    "red_x_points": [
      [-0.00311, 1],
      [-0.00356, 1],
      [-0.00189, 2],
      [-0.00192, 2],
      [0.00667, 0],
      [-0.00363, 1],
      [-0.00217, 2],
      [-0.00439, 2],
      [-0.00241, 2],
      [-0.00142, 2],
      [-0.0038, 1],
      [-0.00382, 1],
      [-0.02073, 1],
      [-0.0045, 2],
      [-0.00212, 2],
      [-0.00461, 2],
      [-0.00346, 1],
      [0.0077, 0],
      [-0.00298, 1],
      [-0.00313, 1],
      [-0.00308, 1],
      [-0.00385, 1],
      [-0.00428, 2],
      [-0.00564, 1],
      [-0.00394, 2],
      [-0.00367, 1],
      [0.00823, 0],
      [-0.00328, 1],
      [-0.00493, 2],
      [-0.00062, 2],
      [-0.00336, 1]
    ],
    "red_o_points": [],
    "y_categories": ["N", "Y", "nan"],
    "blue_o_points": [],
    "blue_x_points": [
      [0.00121, 2],
      [0.00014, 1],
      [0.01091, 0],
      [0.01776, 0],
      [0.02129, 0],
      [0.00169, 2],
      [0.0018, 2]
    ]
  },
  "QS_mulGraftNerve[MCA]": {
    "red_x_points": [
      [-2e-5, 2],
      [-0.00012, 0],
      [-9e-5, 0],
      [-0.00012, 0],
      [-0.00012, 0],
      [-0.00012, 0],
      [-8e-5, 0],
      [-2e-5, 2],
      [-0.00012, 0],
      [-9e-5, 0],
      [-0.00012, 0],
      [-2e-5, 2],
      [7e-5, 1],
      [-2e-5, 2],
      [-8e-5, 0],
      [-2e-5, 2],
      [-9e-5, 0],
      [-8e-5, 0],
      [-2e-5, 2],
      [-1e-5, 2],
      [-0.0, 2],
      [-9e-5, 0],
      [-2e-5, 2],
      [-1e-5, 2],
      [-2e-5, 2],
      [-0.00012, 0],
      [-1e-5, 2],
      [-8e-5, 0],
      [-1e-5, 2],
      [0.00019, 1],
      [-3e-5, 0]
    ],
    "red_o_points": [],
    "y_categories": ["N", "NOT APPLICABLE", "nan"],
    "blue_o_points": [],
    "blue_x_points": [
      [0.00035, 1],
      [-2e-5, 2],
      [0.00012, 1],
      [-3e-5, 0],
      [-0.0, 2],
      [0.00035, 1],
      [0.00023, 1]
    ]
  },
  "QA_lstPexInspectio[SurgicalScar]": {
    "red_x_points": [
      [0.00256, 1],
      [0.0013, 1],
      [-0.00011, 0],
      [0.00114, 1],
      [-0.00461, 2],
      [1e-5, 0],
      [0.00123, 1],
      [0.00226, 1],
      [0.00124, 1],
      [-0.00336, 2],
      [0.00142, 1],
      [-0.00217, 0],
      [-0.00153, 1],
      [-0.00623, 2],
      [0.00135, 1],
      [0.00233, 1],
      [-0.00119, 0],
      [-0.00503, 2],
      [-0.00552, 2],
      [-0.00513, 2],
      [0.00215, 1],
      [0.0012, 1],
      [-0.00625, 2],
      [-0.01184, 2],
      [0.00233, 1],
      [0.00124, 1],
      [-0.00608, 2],
      [-0.00298, 2],
      [0.00215, 1],
      [-0.00045, 1],
      [-0.00333, 2]
    ],
    "red_o_points": [],
    "y_categories": ["ABS", "NAIA", "PT", "nan"],
    "blue_o_points": [],
    "blue_x_points": [
      [0.00069, 1],
      [0.0041, 1],
      [0.00527, 0],
      [0.00416, 1],
      [0.00596, 1],
      [0.00029, 1],
      [0.00524, 0]
    ]
  },
  "QS_mulGraftNerve[Me]": {
    "red_x_points": [
      [-0.00021, 2],
      [-0.00032, 0],
      [-0.0003, 0],
      [-0.0003, 0],
      [-0.00064, 0],
      [-0.00038, 0],
      [-0.00035, 0],
      [-0.00027, 2],
      [-0.00031, 0],
      [-0.00028, 0],
      [-0.00024, 0],
      [-0.00027, 2],
      [0.0005, 1],
      [-8e-5, 2],
      [-0.00049, 0],
      [-0.00023, 2],
      [-0.00045, 0],
      [-0.00042, 0],
      [-0.00019, 2],
      [-0.00014, 2],
      [-0.00014, 2],
      [-0.00036, 0],
      [-0.00017, 2],
      [-0.00031, 2],
      [-0.00019, 2],
      [-0.00014, 0],
      [-0.0002, 2],
      [-0.00029, 0],
      [-0.00019, 2],
      [0.00042, 1],
      [-0.00033, 0]
    ],
    "red_o_points": [],
    "y_categories": ["N", "NOT APPLICABLE", "nan"],
    "blue_o_points": [],
    "blue_x_points": [
      [0.00131, 1],
      [9e-5, 2],
      [0.00088, 1],
      [-0.00011, 0],
      [3e-5, 2],
      [0.00113, 1],
      [0.00103, 1]
    ]
  },
  "QS_mulGraftRoot[T2]": {
    "red_x_points": [
      [-0.0, 2],
      [-5e-5, 0],
      [-5e-5, 0],
      [-5e-5, 0],
      [-5e-5, 0],
      [-5e-5, 0],
      [-0.0, 2],
      [-5e-5, 0],
      [-5e-5, 0],
      [9e-5, 1],
      [-0.0, 2],
      [-0.0, 2],
      [-5e-5, 0],
      [-0.0, 2],
      [-0.0, 2],
      [-5e-5, 0],
      [-0.0, 2],
      [-0.0, 2],
      [-0.0, 2],
      [-5e-5, 0],
      [-5e-5, 0],
      [-0.0, 2],
      [9e-5, 1]
    ],
    "red_o_points": [],
    "y_categories": ["N", "NOT APPLICABLE", "nan"],
    "blue_o_points": [],
    "blue_x_points": [[-0.0, 2], [-0.0, 2], [9e-5, 1], [9e-5, 1]]
  },
  "QS_mulGraftRoot[C7]": {
    "red_x_points": [
      [-5e-5, 2],
      [-3e-5, 0],
      [-3e-5, 0],
      [-3e-5, 0],
      [-3e-5, 0],
      [-5e-5, 2],
      [-3e-5, 0],
      [-3e-5, 0],
      [-3e-5, 0],
      [-5e-5, 2],
      [0.00012, 1],
      [-3e-5, 0],
      [-3e-5, 0],
      [-3e-5, 0],
      [-5e-5, 2],
      [-3e-5, 0],
      [-5e-5, 2],
      [-5e-5, 2],
      [-5e-5, 2],
      [-3e-5, 0],
      [-3e-5, 0],
      [-5e-5, 2],
      [-3e-5, 0]
    ],
    "red_o_points": [],
    "y_categories": ["N", "NOT APPLICABLE", "nan"],
    "blue_o_points": [],
    "blue_x_points": [[0.00012, 1], [0.00012, 1], [-3e-5, 0], [0.00012, 1]]
  },
  "QS_mulLysisSite[Trunk]": {
    "red_x_points": [
      [-0.00142, 3],
      [-0.00284, 0],
      [-0.00239, 0],
      [-0.0023, 0],
      [-0.00253, 0],
      [-0.00459, 2],
      [-0.00244, 0],
      [-0.00172, 3],
      [-0.0025, 0],
      [-0.00232, 0],
      [-0.00233, 0],
      [-0.00191, 3],
      [0.00654, 1],
      [-0.00151, 3],
      [-0.00248, 0],
      [-0.00168, 3],
      [-0.00457, 2],
      [-0.00238, 0],
      [-0.0018, 3],
      [-0.00168, 3],
      [-0.0013, 3],
      [-0.00245, 0],
      [-0.0017, 3],
      [-0.00182, 3],
      [-0.00141, 3],
      [-0.00248, 0],
      [-0.00147, 3],
      [-0.00234, 0],
      [-0.00139, 3],
      [0.00737, 1],
      [-0.00403, 2]
    ],
    "red_o_points": [],
    "y_categories": ["N", "NOT APPLICABLE", "Y", "nan"],
    "blue_o_points": [],
    "blue_x_points": [
      [0.00901, 1],
      [-0.00032, 3],
      [0.00813, 1],
      [-0.00114, 0],
      [-0.00038, 3],
      [0.00813, 1],
      [0.0095, 1]
    ]
  },
  "QS_mulGraftTrunk[UpperTrunk]": {
    "red_x_points": [
      [-0.00098, 3],
      [-0.00162, 0],
      [-0.00176, 0],
      [-0.00181, 0],
      [-0.00166, 0],
      [-0.00154, 0],
      [-0.00178, 0],
      [-0.00115, 3],
      [-0.00181, 0],
      [-0.0017, 0],
      [-0.00152, 0],
      [-0.00085, 3],
      [0.00412, 1],
      [-0.00104, 3],
      [-0.00407, 2],
      [-0.00113, 3],
      [-0.00129, 0],
      [-0.00157, 0],
      [-0.00109, 3],
      [-0.00091, 3],
      [-0.00102, 3],
      [-0.00148, 0],
      [-0.00117, 3],
      [-0.00088, 3],
      [-0.00105, 3],
      [-0.00157, 0],
      [-0.00106, 3],
      [-0.00173, 0],
      [-0.00113, 3],
      [0.00467, 1],
      [-0.00139, 0]
    ],
    "red_o_points": [],
    "y_categories": ["N", "NOT APPLICABLE", "Y", "nan"],
    "blue_o_points": [],
    "blue_x_points": [
      [0.00613, 1],
      [-0.00021, 3],
      [0.00499, 1],
      [-0.00038, 0],
      [-0.00026, 3],
      [0.00546, 1],
      [0.00482, 1]
    ]
  },
  "QS_mulTransfSite[PhMc]": {
    "red_x_points": [
      [-0.00155, 3],
      [-0.00277, 0],
      [-0.00248, 0],
      [-0.00251, 0],
      [-0.00222, 0],
      [-0.00238, 0],
      [-0.00477, 2],
      [-0.00138, 3],
      [-0.00284, 0],
      [-0.00261, 0],
      [-0.00257, 0],
      [-0.00162, 3],
      [0.00719, 1],
      [-0.00139, 3],
      [-0.00275, 0],
      [-0.0018, 3],
      [-0.00254, 0],
      [-0.00255, 0],
      [-0.00144, 3],
      [-0.00162, 3],
      [-0.00139, 3],
      [-0.00443, 2],
      [-0.00173, 3],
      [-0.00153, 3],
      [-0.00157, 3],
      [-0.00248, 0],
      [-0.0015, 3],
      [-0.00265, 0],
      [-0.0016, 3],
      [0.00696, 1],
      [-0.00227, 0]
    ],
    "red_o_points": [],
    "y_categories": ["N", "NOT APPLICABLE", "Y", "nan"],
    "blue_o_points": [],
    "blue_x_points": [
      [0.01085, 1],
      [-0.00052, 3],
      [0.00792, 1],
      [-0.00171, 0],
      [-0.00034, 3],
      [0.00831, 1],
      [0.00851, 1]
    ]
  },
  "QA_mulInjTbpiCause[Motorcycle]": {
    "red_x_points": [
      [0.00114, 0],
      [-0.00073, 1],
      [-0.00206, 1],
      [-0.00094, 1],
      [-0.00126, 1],
      [-0.00088, 1],
      [-0.00089, 1],
      [-0.0009, 1],
      [-0.00099, 1],
      [-0.00099, 1],
      [-0.00068, 1],
      [-0.00118, 0],
      [-0.03302, 1],
      [-0.0009, 1],
      [-0.00113, 1],
      [-0.00115, 1],
      [-0.00095, 1],
      [-0.00091, 1],
      [0.00075, 0],
      [-0.00059, 1],
      [-0.00066, 1],
      [-0.0007, 1],
      [-0.0011, 1],
      [-0.0017, 1],
      [0.00113, 0],
      [-0.00081, 1],
      [-0.00065, 1],
      [-0.00104, 1],
      [-0.00088, 1],
      [-0.03091, 1],
      [-0.00067, 1]
    ],
    "red_o_points": [],
    "y_categories": ["N", "Y", "nan"],
    "blue_o_points": [],
    "blue_x_points": [
      [0.01574, 0],
      [-0.00031, 1],
      [0.01273, 0],
      [-0.00165, 1],
      [0.00094, 1],
      [0.01533, 0],
      [0.01558, 0]
    ]
  },
  "QS_mulLysisRoot[C6]": {
    "red_x_points": [
      [-0.00137, 3],
      [-0.00207, 0],
      [-0.00359, 2],
      [-0.00212, 0],
      [-0.0019, 0],
      [-0.0021, 0],
      [-0.00185, 0],
      [-0.0013, 3],
      [-0.0021, 0],
      [-0.00199, 0],
      [-0.00201, 0],
      [-0.00147, 3],
      [0.00494, 1],
      [-0.00125, 3],
      [-0.00187, 0],
      [-0.00154, 3],
      [-0.00187, 0],
      [-0.00182, 0],
      [-0.00135, 3],
      [-0.00135, 3],
      [-0.0013, 3],
      [-0.0018, 0],
      [-0.00145, 3],
      [-0.00124, 3],
      [-0.00146, 3],
      [-0.00223, 0],
      [-0.00145, 3],
      [-0.00215, 0],
      [-0.00113, 3],
      [0.00607, 1],
      [-0.00391, 2]
    ],
    "red_o_points": [],
    "y_categories": ["N", "NOT APPLICABLE", "Y", "nan"],
    "blue_o_points": [],
    "blue_x_points": [
      [0.01016, 1],
      [-0.00053, 3],
      [0.00667, 1],
      [-0.00174, 0],
      [-0.00042, 3],
      [0.00679, 1],
      [0.00776, 1]
    ]
  },
  "QS_mulGraftLevel[Trunk]": {
    "red_x_points": [
      [-0.00033, 3],
      [-0.00071, 0],
      [-0.0007, 0],
      [-0.00053, 0],
      [-0.00059, 0],
      [-0.00063, 0],
      [-0.00063, 0],
      [-0.00043, 3],
      [-0.00065, 0],
      [-0.00061, 0],
      [-0.00042, 0],
      [-0.00046, 3],
      [0.00173, 1],
      [-0.00026, 3],
      [-0.00231, 2],
      [-0.00029, 3],
      [-0.00074, 0],
      [-0.0005, 0],
      [-0.00046, 3],
      [-0.00025, 3],
      [-0.0003, 3],
      [-0.00056, 0],
      [-0.00026, 3],
      [-0.00033, 3],
      [-0.0004, 3],
      [-0.00069, 0],
      [-0.00021, 3],
      [-0.0006, 0],
      [-0.00035, 3],
      [0.00217, 1],
      [-0.0007, 0]
    ],
    "red_o_points": [],
    "y_categories": ["N", "NOT APPLICABLE", "Y", "nan"],
    "blue_o_points": [],
    "blue_x_points": [
      [0.00223, 1],
      [-0.00022, 3],
      [0.00241, 1],
      [-0.00013, 0],
      [-0.00027, 3],
      [0.00196, 1],
      [0.00198, 1]
    ]
  },
  "QS_mulGraftNerve[FI]": {
    "red_x_points": [
      [-0.00031, 2],
      [-0.0008, 0],
      [-0.00072, 0],
      [-0.00066, 0],
      [-0.00077, 0],
      [-0.00056, 0],
      [-0.00075, 0],
      [-0.0004, 2],
      [-0.00063, 0],
      [-0.00074, 0],
      [-0.00057, 0],
      [-0.00026, 2],
      [0.00131, 1],
      [-0.00037, 2],
      [-0.00069, 0],
      [-0.00043, 2],
      [-0.00061, 0],
      [-0.00075, 0],
      [-0.00024, 2],
      [-0.00027, 2],
      [-0.00019, 2],
      [-0.0007, 0],
      [-0.00036, 2],
      [-0.00042, 2],
      [-0.00019, 2],
      [-0.00063, 0],
      [-0.0003, 2],
      [-0.00058, 0],
      [-0.00021, 2],
      [0.00135, 1],
      [-0.00047, 0]
    ],
    "red_o_points": [],
    "y_categories": ["N", "NOT APPLICABLE", "nan"],
    "blue_o_points": [],
    "blue_x_points": [
      [0.00296, 1],
      [4e-5, 2],
      [0.00169, 1],
      [-6e-5, 0],
      [-8e-5, 2],
      [0.00157, 1],
      [0.00168, 1]
    ]
  },
  "QS_mulGraftNerve[other]": {
    "red_x_points": [
      [-0.0005, 2],
      [-0.00201, 0],
      [-0.00223, 0],
      [-0.00225, 0],
      [-0.00257, 0],
      [-0.00175, 0],
      [-0.00182, 0],
      [-0.00079, 2],
      [-0.00189, 0],
      [-0.00208, 0],
      [-0.00205, 0],
      [-0.0007, 2],
      [0.00329, 1],
      [-0.00087, 2],
      [-0.00225, 0],
      [-0.00091, 2],
      [-0.00228, 0],
      [-0.00237, 0],
      [-0.0007, 2],
      [-0.0005, 2],
      [-0.0006, 2],
      [-0.00185, 0],
      [-0.00069, 2],
      [-0.00061, 2],
      [-0.00066, 2],
      [-0.00187, 0],
      [-0.00055, 2],
      [-0.00234, 0],
      [-0.00064, 2],
      [0.00373, 1],
      [-0.00183, 0]
    ],
    "red_o_points": [],
    "y_categories": ["N", "NOT APPLICABLE", "nan"],
    "blue_o_points": [],
    "blue_x_points": [
      [0.0068, 1],
      [-0.00011, 2],
      [0.00514, 1],
      [-7e-5, 0],
      [-3e-5, 2],
      [0.00451, 1],
      [0.00565, 1]
    ]
  },
  "QS_mulTransfSite[AcSsAA]": {
    "red_x_points": [
      [-0.00297, 3],
      [-0.0076, 2],
      [-0.00408, 0],
      [-0.00837, 2],
      [-0.0087, 2],
      [-0.00392, 0],
      [-0.00353, 0],
      [-0.00313, 3],
      [-0.00404, 0],
      [-0.00768, 2],
      [-0.00331, 0],
      [-0.00328, 3],
      [0.01299, 1],
      [-0.00299, 3],
      [-0.00965, 2],
      [-0.00294, 3],
      [-0.00404, 0],
      [-0.00354, 0],
      [-0.00293, 3],
      [-0.00287, 3],
      [-0.00309, 3],
      [-0.00748, 2],
      [-0.00286, 3],
      [-0.00281, 3],
      [-0.00309, 3],
      [-0.00328, 0],
      [-0.00298, 3],
      [-0.00773, 2],
      [-0.00277, 3],
      [0.01426, 1],
      [-0.00344, 0]
    ],
    "red_o_points": [],
    "y_categories": ["N", "NOT APPLICABLE", "Y", "nan"],
    "blue_o_points": [],
    "blue_x_points": [
      [0.01965, 1],
      [-0.00047, 3],
      [0.01562, 1],
      [0.00027, 0],
      [-0.00095, 3],
      [0.01456, 1],
      [0.01579, 1]
    ]
  },
  "QS_mulGraftNerve[DS]": {
    "red_x_points": [
      [-5e-5, 0],
      [-5e-5, 0],
      [-5e-5, 0],
      [-5e-5, 0],
      [-5e-5, 0],
      [-5e-5, 0],
      [-3e-5, 2],
      [-5e-5, 0],
      [-5e-5, 0],
      [-3e-5, 2],
      [-3e-5, 2],
      [-5e-5, 0],
      [-3e-5, 2],
      [-3e-5, 2],
      [-3e-5, 2],
      [-5e-5, 0],
      [-3e-5, 2],
      [-5e-5, 0],
      [-3e-5, 2],
      [-5e-5, 0],
      [-3e-5, 2],
      [0.00012, 1],
      [-5e-5, 0]
    ],
    "red_o_points": [],
    "y_categories": ["N", "NOT APPLICABLE", "nan"],
    "blue_o_points": [],
    "blue_x_points": [
      [0.00012, 1],
      [-3e-5, 2],
      [0.00012, 1],
      [0.00012, 1],
      [0.00012, 1]
    ]
  },
  "QS_mulGraftNerve[Ax]": {
    "red_x_points": [
      [-6e-5, 2],
      [-0.00041, 0],
      [-0.0003, 0],
      [-0.00027, 0],
      [-0.00039, 0],
      [-0.00025, 0],
      [-0.00038, 0],
      [-0.00014, 2],
      [-0.00021, 0],
      [-0.00035, 0],
      [-0.00024, 0],
      [-0.00019, 2],
      [0.00016, 1],
      [-0.0, 2],
      [-0.0004, 0],
      [-0.00011, 2],
      [-0.00028, 0],
      [-0.0004, 0],
      [-0.00016, 2],
      [-7e-5, 2],
      [-7e-5, 2],
      [-0.0002, 0],
      [2e-5, 2],
      [-0.00013, 2],
      [-8e-5, 2],
      [-0.00035, 0],
      [-0.0001, 2],
      [-0.00017, 0],
      [-0.0001, 2],
      [0.0003, 1],
      [-0.00035, 0]
    ],
    "red_o_points": [],
    "y_categories": ["N", "NOT APPLICABLE", "nan"],
    "blue_o_points": [],
    "blue_x_points": [
      [0.00101, 1],
      [0.00024, 2],
      [0.00078, 1],
      [2e-5, 0],
      [0.00015, 2],
      [0.00058, 1],
      [0.00108, 1]
    ]
  },
  "QA_lstPexMuscstrength[WristFlex]": {
    "red_x_points": [
      [-0.0043, 1],
      [-0.00011, 2],
      [-0.00102, 1],
      [-0.00121, 1],
      [0.00026, 0],
      [0.0006, 0],
      [-0.00193, 1],
      [-0.00231, 0],
      [0.0005, 0],
      [0.00035, 0],
      [0.00064, 0],
      [-0.00186, 0],
      [-0.00076, 2],
      [0.0021, 2],
      [-0.00035, 2],
      [-0.00196, 0],
      [-0.00022, 2],
      [0.0002, 0],
      [-0.00159, 0],
      [-0.00288, 1],
      [-0.00208, 0],
      [-0.00159, 1],
      [0.00166, 2],
      [-0.00776, 1],
      [-0.00224, 0],
      [0.00035, 0],
      [-0.00352, 1],
      [0.00032, 0],
      [0.00269, 2],
      [-9e-5, 2],
      [-0.00102, 1]
    ],
    "red_o_points": [],
    "y_categories": ["GREATER THAN OR EQUALS TO 3", "LESS THAN 3", "nan"],
    "blue_o_points": [],
    "blue_x_points": [
      [0.00045, 0],
      [0.00505, 2],
      [0.0012, 0],
      [0.00322, 0],
      [0.00514, 2],
      [0.00139, 0],
      [0.00112, 0]
    ]
  },
  "QS_mulNeuromadSite[C5]": {
    "red_x_points": [
      [-0.0013, 2],
      [-0.00364, 0],
      [-0.00425, 0],
      [-0.00377, 0],
      [-0.00376, 0],
      [-0.00339, 0],
      [-0.00395, 0],
      [-0.00125, 2],
      [-0.00399, 0],
      [-0.00363, 0],
      [-0.00379, 0],
      [-0.00145, 2],
      [0.00603, 1],
      [-0.00125, 2],
      [-0.00368, 0],
      [-0.00166, 2],
      [-0.00334, 0],
      [-0.00382, 0],
      [-0.00145, 2],
      [-0.00128, 2],
      [-0.00108, 2],
      [-0.00355, 0],
      [-0.00119, 2],
      [-0.00137, 2],
      [-0.00144, 2],
      [-0.00354, 0],
      [-0.00136, 2],
      [-0.00381, 0],
      [-0.00094, 2],
      [0.00689, 1],
      [-0.00376, 0]
    ],
    "red_o_points": [],
    "y_categories": ["N", "NOT APPLICABLE", "nan"],
    "blue_o_points": [],
    "blue_x_points": [
      [0.01372, 1],
      [-0.00012, 2],
      [0.00812, 1],
      [0.00031, 0],
      [-0.00032, 2],
      [0.00772, 1],
      [0.01078, 1]
    ]
  },
  "QS_mulNeuromadSite[C7]": {
    "red_x_points": [
      [-0.00088, 2],
      [-0.00207, 0],
      [-0.00261, 0],
      [-0.0019, 0],
      [-0.0021, 0],
      [-0.00238, 0],
      [-0.002, 0],
      [-0.00057, 2],
      [-0.00223, 0],
      [-0.00227, 0],
      [-0.00225, 0],
      [-0.00084, 2],
      [0.00341, 1],
      [-0.00066, 2],
      [-0.00209, 0],
      [-0.00094, 2],
      [-0.00204, 0],
      [-0.00226, 0],
      [-0.00083, 2],
      [-0.00089, 2],
      [-0.00075, 2],
      [-0.00234, 0],
      [-0.00078, 2],
      [-0.00064, 2],
      [-0.00068, 2],
      [-0.00216, 0],
      [-0.0009, 2],
      [-0.00222, 0],
      [-0.00045, 2],
      [0.00471, 1],
      [-0.00226, 0]
    ],
    "red_o_points": [],
    "y_categories": ["N", "NOT APPLICABLE", "nan"],
    "blue_o_points": [],
    "blue_x_points": [
      [0.00798, 1],
      [-0.0002, 2],
      [0.005, 1],
      [9e-5, 0],
      [4e-5, 2],
      [0.00505, 1],
      [0.00519, 1]
    ]
  },
  "QA_lstPexMuscstrength[WristExte]": {
    "red_x_points": [
      [-0.00333, 1],
      [-0.00021, 2],
      [-0.00163, 1],
      [-0.00126, 1],
      [0.00059, 0],
      [-0.00182, 1],
      [-0.00176, 1],
      [-0.00218, 0],
      [0.00096, 0],
      [0.00055, 0],
      [-0.00192, 1],
      [-0.00155, 0],
      [-0.00275, 2],
      [0.00176, 2],
      [-0.00012, 2],
      [-0.00139, 0],
      [-0.00038, 2],
      [0.00074, 0],
      [-0.00134, 0],
      [-0.00307, 1],
      [-0.00174, 0],
      [-0.00153, 1],
      [0.00158, 2],
      [-0.00086, 0],
      [-0.00379, 1],
      [0.00068, 0],
      [-0.00235, 1],
      [0.00065, 0],
      [0.00239, 2],
      [-0.00274, 2],
      [-0.00141, 1]
    ],
    "red_o_points": [],
    "y_categories": ["GREATER THAN OR EQUALS TO 3", "LESS THAN 3", "nan"],
    "blue_o_points": [],
    "blue_x_points": [
      [0.00125, 0],
      [0.00437, 2],
      [0.0012, 0],
      [0.00277, 0],
      [0.00493, 2],
      [0.00104, 1],
      [0.00151, 0]
    ]
  },
  "QA_lstPexMuscstrength[ElbowExte]": {
    "red_x_points": [
      [-0.00267, 1],
      [7e-5, 2],
      [-0.0, 1],
      [0.0, 1],
      [-0.00066, 0],
      [7e-5, 1],
      [-3e-5, 1],
      [-0.00289, 1],
      [-0.00105, 0],
      [-0.00043, 0],
      [0.0001, 1],
      [-0.00268, 1],
      [0.00013, 2],
      [0.00389, 2],
      [-7e-5, 2],
      [-0.00259, 1],
      [1e-5, 2],
      [8e-5, 1],
      [-0.00249, 0],
      [-0.00229, 1],
      [-0.00255, 0],
      [5e-5, 1],
      [0.0033, 2],
      [-0.00245, 0],
      [-0.00297, 0],
      [0.0002, 1],
      [-0.00244, 1],
      [-0.0004, 2],
      [-0.00252, 1],
      [2e-5, 2],
      [0.0, 1]
    ],
    "red_o_points": [],
    "y_categories": ["GREATER THAN OR EQUALS TO 3", "LESS THAN 3", "nan"],
    "blue_o_points": [],
    "blue_x_points": [
      [0.00011, 2],
      [0.00631, 2],
      [0.00012, 0],
      [0.00067, 1],
      [0.00619, 2],
      [0.00013, 0],
      [0.00013, 0]
    ]
  },
  "QS_mulGraftNerve[SS]": {
    "red_x_points": [
      [-0.0, 2],
      [-0.0001, 0],
      [-9e-5, 0],
      [-0.0001, 0],
      [-0.00015, 0],
      [-0.0001, 0],
      [-0.00015, 0],
      [-1e-5, 2],
      [-0.00015, 0],
      [-0.00015, 0],
      [-0.0001, 0],
      [-0.0, 2],
      [9e-5, 1],
      [-1e-5, 2],
      [-0.0001, 0],
      [-0.0, 2],
      [-9e-5, 0],
      [-0.00015, 0],
      [-0.0, 2],
      [-0.0, 2],
      [1e-5, 2],
      [-0.00014, 0],
      [-0.0, 2],
      [1e-5, 2],
      [-1e-5, 2],
      [-0.0001, 0],
      [0.0, 2],
      [-1e-5, 0],
      [1e-5, 2],
      [0.00031, 1],
      [-0.00014, 0]
    ],
    "red_o_points": [],
    "y_categories": ["N", "NOT APPLICABLE", "nan"],
    "blue_o_points": [],
    "blue_x_points": [
      [0.0005, 1],
      [1e-5, 2],
      [0.00031, 1],
      [0.0, 2],
      [0.00031, 1],
      [0.0002, 1]
    ]
  },
  "QS_mulGraftNerve[MCF]": {
    "red_x_points": [
      [-1e-5, 2],
      [-5e-5, 0],
      [-5e-5, 0],
      [-5e-5, 0],
      [-5e-5, 0],
      [-1e-5, 2],
      [-5e-5, 0],
      [-5e-5, 0],
      [-1e-5, 2],
      [0.00012, 1],
      [-1e-5, 2],
      [-5e-5, 0],
      [-1e-5, 2],
      [-5e-5, 0],
      [-5e-5, 0],
      [-1e-5, 2],
      [-1e-5, 2],
      [-5e-5, 0],
      [-1e-5, 2],
      [-1e-5, 2],
      [-5e-5, 0],
      [-1e-5, 2],
      [-5e-5, 0]
    ],
    "red_o_points": [],
    "y_categories": ["N", "NOT APPLICABLE", "nan"],
    "blue_o_points": [],
    "blue_x_points": [[0.00012, 1], [-1e-5, 2], [0.00012, 1], [0.00012, 1]]
  },
  "QS_mulNeuromadSite[C6]": {
    "red_x_points": [
      [-0.00088, 2],
      [-0.00237, 0],
      [-0.00223, 0],
      [-0.00226, 0],
      [-0.00262, 0],
      [-0.0026, 0],
      [-0.00239, 0],
      [-0.00093, 2],
      [-0.0022, 0],
      [-0.00224, 0],
      [-0.00244, 0],
      [-0.00102, 2],
      [0.00415, 1],
      [-0.00085, 2],
      [-0.00221, 0],
      [-0.00081, 2],
      [-0.00226, 0],
      [-0.00248, 0],
      [-0.00092, 2],
      [-0.00079, 2],
      [-0.00085, 2],
      [-0.00223, 0],
      [-0.00071, 2],
      [-0.00085, 2],
      [-0.00083, 2],
      [-0.00226, 0],
      [-0.00075, 2],
      [-0.0025, 0],
      [-0.00052, 2],
      [0.00414, 1],
      [-0.00227, 0]
    ],
    "red_o_points": [],
    "y_categories": ["N", "NOT APPLICABLE", "nan"],
    "blue_o_points": [],
    "blue_x_points": [
      [0.00758, 1],
      [0.0002, 2],
      [0.0052, 1],
      [-0.00018, 0],
      [-4e-5, 2],
      [0.00564, 1],
      [0.00734, 1]
    ]
  },
  "QS_mulLysisSite[Nerve]": {
    "red_x_points": [
      [-0.00031, 3],
      [-0.0004, 0],
      [-0.00112, 2],
      [-0.00053, 0],
      [-0.00054, 0],
      [-0.00046, 0],
      [-0.00048, 0],
      [-0.00026, 3],
      [-0.00046, 0],
      [-0.00053, 0],
      [-0.00049, 0],
      [-0.0003, 3],
      [0.00132, 1],
      [-0.00028, 3],
      [-0.00044, 0],
      [-0.00038, 3],
      [-0.00042, 0],
      [-0.00046, 0],
      [-0.0003, 3],
      [-0.00027, 3],
      [-0.00026, 3],
      [-0.00053, 0],
      [-0.00024, 3],
      [-0.00017, 3],
      [-0.00016, 3],
      [-0.00044, 0],
      [-0.00032, 3],
      [-0.00049, 0],
      [-0.00033, 3],
      [0.00176, 1],
      [-0.00043, 0]
    ],
    "red_o_points": [],
    "y_categories": ["N", "NOT APPLICABLE", "Y", "nan"],
    "blue_o_points": [],
    "blue_x_points": [
      [0.00168, 1],
      [-0.00018, 3],
      [0.00183, 1],
      [-0.00063, 0],
      [-0.00017, 3],
      [0.00163, 1],
      [0.00119, 1]
    ]
  },
  "QS_mulGraftNerve[TD]": {
    "red_x_points": [
      [-1e-5, 2],
      [-1e-5, 0],
      [-6e-5, 0],
      [-6e-5, 0],
      [-5e-5, 0],
      [-1e-5, 0],
      [-5e-5, 0],
      [-6e-5, 0],
      [-6e-5, 0],
      [-1e-5, 2],
      [0.00013, 1],
      [-1e-5, 2],
      [-6e-5, 0],
      [-1e-5, 2],
      [-5e-5, 0],
      [-6e-5, 0],
      [-1e-5, 2],
      [-0.0, 2],
      [-0.0, 2],
      [-0.0, 2],
      [-0.00015, 2],
      [-1e-5, 2],
      [-1e-5, 0],
      [-1e-5, 2],
      [-6e-5, 0],
      [-0.0, 2],
      [-5e-5, 0]
    ],
    "red_o_points": [],
    "y_categories": ["N", "NOT APPLICABLE", "nan"],
    "blue_o_points": [],
    "blue_x_points": [
      [0.0003, 1],
      [-0.0, 2],
      [6e-5, 0],
      [-0.0, 2],
      [0.00013, 1],
      [0.00013, 1]
    ]
  },
  "QS_mulLysisRoot[C7]": {
    "red_x_points": [
      [-0.00031, 3],
      [-0.00062, 0],
      [-0.00154, 2],
      [-0.00079, 0],
      [-0.00067, 0],
      [-0.00066, 0],
      [-0.00076, 0],
      [-0.00029, 3],
      [-0.00067, 0],
      [-0.00074, 0],
      [-0.00068, 0],
      [-0.00026, 3],
      [0.00187, 1],
      [-0.00033, 3],
      [-0.00053, 0],
      [-0.00037, 3],
      [-0.00069, 0],
      [-0.00065, 0],
      [-0.0003, 3],
      [-0.00019, 3],
      [-0.00032, 3],
      [-0.00085, 0],
      [-0.00019, 3],
      [-0.00034, 3],
      [-0.00029, 3],
      [-0.00081, 0],
      [-0.00025, 3],
      [-0.00075, 0],
      [-0.00033, 3],
      [0.00202, 1],
      [-0.00058, 0]
    ],
    "red_o_points": [],
    "y_categories": ["N", "NOT APPLICABLE", "Y", "nan"],
    "blue_o_points": [],
    "blue_x_points": [
      [0.00228, 1],
      [-0.00014, 3],
      [0.00226, 1],
      [-0.00069, 0],
      [-0.00012, 3],
      [0.00228, 1],
      [0.00202, 1]
    ]
  },
  "QS_mulTransfSite[IMc]": {
    "red_x_points": [
      [-0.00231, 3],
      [-0.0076, 2],
      [-0.00443, 0],
      [-0.00441, 0],
      [-0.00433, 0],
      [-0.00422, 0],
      [-0.00459, 0],
      [-0.00248, 3],
      [-0.0041, 0],
      [-0.00433, 0],
      [-0.0045, 0],
      [-0.00291, 3],
      [0.01143, 1],
      [-0.00271, 3],
      [-0.00458, 0],
      [-0.00259, 3],
      [-0.00668, 2],
      [-0.00464, 0],
      [-0.00258, 3],
      [-0.00257, 3],
      [-0.0025, 3],
      [-0.00435, 0],
      [-0.00246, 3],
      [-0.00277, 3],
      [-0.00263, 3],
      [-0.00426, 0],
      [-0.00268, 3],
      [-0.00667, 2],
      [-0.00243, 3],
      [0.01298, 1],
      [-0.00701, 2]
    ],
    "red_o_points": [],
    "y_categories": ["N", "NOT APPLICABLE", "Y", "nan"],
    "blue_o_points": [],
    "blue_x_points": [
      [0.01864, 1],
      [-0.00095, 3],
      [0.01271, 1],
      [-0.00152, 0],
      [-0.00081, 3],
      [0.01421, 1],
      [0.01446, 1]
    ]
  },
  "QA_lstPexTouch[T1]": {
    "red_x_points": [
      [-0.00194, 1],
      [2e-5, 2],
      [0.00032, 1],
      [-0.0, 2],
      [-0.00141, 0],
      [0.00037, 1],
      [0.00055, 1],
      [-0.0026, 1],
      [-0.00201, 0],
      [-0.00107, 0],
      [-0.0013, 0],
      [-0.00317, 0],
      [-0.01319, 2],
      [0.00366, 2],
      [-1e-5, 2],
      [-0.00171, 1],
      [-0.00013, 2],
      [0.00089, 1],
      [-0.00253, 0],
      [-0.0023, 1],
      [-0.00312, 0],
      [-0.00013, 2],
      [0.00339, 2],
      [-0.00262, 1],
      [-0.00353, 0],
      [0.00039, 1],
      [-0.00327, 0],
      [-0.0002, 2],
      [-0.00325, 0],
      [7e-5, 1],
      [0.0002, 1]
    ],
    "red_o_points": [],
    "y_categories": ["NORM", "NPV", "nan"],
    "blue_o_points": [],
    "blue_x_points": [
      [0.00068, 1],
      [0.00526, 2],
      [0.00084, 1],
      [0.00238, 1],
      [0.00658, 2],
      [0.0008, 1],
      [0.00722, 0]
    ]
  },
  "QS_mulTransfSite[AcMc]": {
    "red_x_points": [
      [-0.00041, 3],
      [-0.0007, 0],
      [-0.00077, 0],
      [-0.00058, 0],
      [-0.00059, 0],
      [-0.00073, 0],
      [-0.00075, 0],
      [-0.00032, 3],
      [-0.00068, 0],
      [-0.00055, 0],
      [-0.0015, 2],
      [-0.00034, 3],
      [0.00195, 1],
      [-0.00031, 3],
      [-0.00065, 0],
      [-0.00029, 3],
      [-0.00056, 0],
      [-0.00059, 0],
      [-0.00038, 3],
      [-0.00033, 3],
      [-0.00031, 3],
      [-0.00055, 0],
      [-0.00018, 3],
      [-0.00042, 3],
      [-0.00035, 3],
      [-0.0008, 0],
      [-0.00027, 3],
      [-0.00068, 0],
      [-0.00043, 3],
      [0.00193, 1],
      [-0.00044, 0]
    ],
    "red_o_points": [],
    "y_categories": ["N", "NOT APPLICABLE", "Y", "nan"],
    "blue_o_points": [],
    "blue_x_points": [
      [0.00265, 1],
      [-0.00017, 3],
      [0.00182, 1],
      [-0.00057, 0],
      [-0.00013, 3],
      [0.00186, 1],
      [0.00201, 1]
    ]
  },
  "QS_mulTransfSite[Other]": {
    "red_x_points": [
      [-0.0006, 3],
      [-0.00095, 0],
      [-0.00103, 0],
      [-0.00091, 0],
      [-0.00091, 0],
      [-0.00094, 0],
      [-0.00107, 0],
      [-0.00058, 3],
      [-0.00085, 0],
      [-0.00097, 0],
      [-0.00106, 0],
      [-0.00089, 3],
      [0.00226, 1],
      [-0.00043, 3],
      [-0.00105, 0],
      [-0.00065, 3],
      [-0.00117, 0],
      [-0.00392, 2],
      [-0.00059, 3],
      [-0.00058, 3],
      [-0.00039, 3],
      [-0.00086, 0],
      [-0.00048, 3],
      [-0.00078, 3],
      [-0.00065, 3],
      [-0.00082, 0],
      [-0.00074, 3],
      [-0.00095, 0],
      [-0.00051, 3],
      [0.00322, 1],
      [-0.0008, 0]
    ],
    "red_o_points": [],
    "y_categories": ["N", "NOT APPLICABLE", "Y", "nan"],
    "blue_o_points": [],
    "blue_x_points": [
      [0.00464, 1],
      [-0.00022, 3],
      [0.00318, 1],
      [-0.00041, 0],
      [-6e-5, 3],
      [0.0023, 1],
      [0.00368, 1]
    ]
  },
  "QA_yonInjBpsurg": {
    "red_x_points": [
      [-0.00382, 1],
      [-0.0029, 1],
      [-0.00374, 1],
      [-0.00341, 1],
      [-0.00303, 1],
      [-0.00337, 1],
      [-0.0034, 1],
      [-0.00311, 1],
      [-0.00331, 1],
      [-0.00307, 1],
      [-0.00311, 1],
      [-0.00393, 1],
      [0.00811, 0],
      [-0.00315, 1],
      [-0.00281, 1],
      [-0.00307, 1],
      [-0.00295, 1],
      [-0.00364, 1],
      [-0.00316, 1],
      [-0.00314, 1],
      [-0.00297, 1],
      [-0.00279, 1],
      [-0.00315, 1],
      [-0.00336, 1],
      [-0.00405, 1],
      [-0.00327, 1],
      [-0.00295, 1],
      [-0.00314, 1],
      [-0.00287, 1],
      [0.00827, 0],
      [-0.00306, 1]
    ],
    "red_o_points": [],
    "y_categories": ["N", "Y", "nan"],
    "blue_o_points": [],
    "blue_x_points": [
      [0.01686, 0],
      [-0.00107, 1],
      [0.01084, 0],
      [-0.0026, 1],
      [-0.00056, 1],
      [0.01135, 0],
      [0.01257, 0]
    ]
  },
  "QA_equInjTbpiAge": {
    "red_x_points": [
      [-0.00075, 1],
      [-0.00015, 1],
      [2e-5, 1],
      [-0.00038, 0],
      [-0.00054, 0],
      [0.00015, 1],
      [0.00013, 1],
      [0.00057, 0],
      [-0.00095, 0],
      [-0.00026, 0],
      [0.00014, 1],
      [0.00051, 0],
      [-0.01406, 1],
      [-0.00123, 1],
      [7e-5, 1],
      [-0.00111, 1],
      [-0.00033, 0],
      [-0.00117, 0],
      [-0.0009, 1],
      [0.00093, 0],
      [-0.00081, 1],
      [5e-5, 1],
      [-0.00115, 1],
      [-0.00269, 1],
      [0.00104, 0],
      [8e-5, 1],
      [-0.00138, 1],
      [-1e-5, 1],
      [-0.00107, 1],
      [-0.01163, 1],
      [-4e-5, 0]
    ],
    "red_o_points": [],
    "y_categories": ["GREATER THAN OR EQUALS TO 30", "LESS THAN 30", "nan"],
    "blue_o_points": [],
    "blue_x_points": [
      [-0.00344, 1],
      [-0.00111, 1],
      [0.00671, 0],
      [0.001, 1],
      [0.0049, 0],
      [0.00749, 0],
      [0.00677, 0]
    ]
  },
  "QS_mulLysisNerve[Ssr]": {
    "red_x_points": [
      [-0.00015, 3],
      [-0.00037, 0],
      [-0.00085, 2],
      [-0.00036, 0],
      [-0.0004, 0],
      [-0.00031, 0],
      [-0.0004, 0],
      [-0.00027, 3],
      [-0.00031, 0],
      [-0.00044, 0],
      [-0.00022, 0],
      [-0.00017, 3],
      [0.00102, 1],
      [-0.00022, 3],
      [-0.00037, 0],
      [-0.00026, 3],
      [-0.00033, 0],
      [-0.00045, 0],
      [-0.00017, 3],
      [-0.00025, 3],
      [-0.0003, 3],
      [-0.00029, 0],
      [-0.00021, 3],
      [-0.00017, 3],
      [-0.00029, 3],
      [-0.00036, 0],
      [-0.00023, 3],
      [-0.00034, 0],
      [-0.00021, 3],
      [0.00115, 1],
      [-0.00032, 0]
    ],
    "red_o_points": [],
    "y_categories": ["N", "NOT APPLICABLE", "Y", "nan"],
    "blue_o_points": [],
    "blue_x_points": [
      [0.00092, 1],
      [-0.00018, 3],
      [0.00118, 1],
      [-0.00034, 0],
      [-7e-5, 3],
      [0.00128, 1],
      [0.00151, 1]
    ]
  },
  "QS_mulBpsurgeryType[Graft]": {
    "red_x_points": [
      [-0.00024, 3],
      [-0.00057, 0],
      [-0.00045, 0],
      [-0.00052, 0],
      [-0.00056, 0],
      [-0.00041, 0],
      [-0.00053, 0],
      [-0.00029, 3],
      [-0.00053, 0],
      [-0.00052, 0],
      [-0.00054, 0],
      [-0.00038, 3],
      [0.00111, 1],
      [-0.00031, 3],
      [-0.00237, 2],
      [-0.00027, 3],
      [-0.00032, 0],
      [-0.00043, 0],
      [-0.00025, 3],
      [-0.00039, 3],
      [-0.00022, 3],
      [-0.0005, 0],
      [-0.00027, 3],
      [-0.00022, 3],
      [-0.00035, 3],
      [-0.00046, 0],
      [-0.00024, 3],
      [-0.00053, 0],
      [-0.00036, 3],
      [0.00138, 1],
      [-0.00056, 0]
    ],
    "red_o_points": [],
    "y_categories": ["N", "NOT APPLICABLE", "Y", "nan"],
    "blue_o_points": [],
    "blue_x_points": [
      [0.00235, 1],
      [-0.00016, 3],
      [0.00178, 1],
      [6e-5, 0],
      [-0.00011, 3],
      [0.00162, 1],
      [0.00184, 1]
    ]
  },
  "QS_mulLysisRoot[C5]": {
    "red_x_points": [
      [-0.00088, 3],
      [-0.00178, 0],
      [-0.00263, 2],
      [-0.00163, 0],
      [-0.00152, 0],
      [-0.00155, 0],
      [-0.00156, 0],
      [-0.00081, 3],
      [-0.00172, 0],
      [-0.00143, 0],
      [-0.00161, 0],
      [-0.00074, 3],
      [0.0046, 1],
      [-0.00089, 3],
      [-0.00169, 0],
      [-0.00121, 3],
      [-0.00155, 0],
      [-0.00158, 0],
      [-0.00091, 3],
      [-0.00082, 3],
      [-0.00097, 3],
      [-0.00153, 0],
      [-0.00082, 3],
      [-0.00097, 3],
      [-0.00091, 3],
      [-0.00153, 0],
      [-0.0008, 3],
      [-0.00171, 0],
      [-0.00091, 3],
      [0.00499, 1],
      [-0.00253, 2]
    ],
    "red_o_points": [],
    "y_categories": ["N", "NOT APPLICABLE", "Y", "nan"],
    "blue_o_points": [],
    "blue_x_points": [
      [0.0058, 1],
      [-0.0004, 3],
      [0.00471, 1],
      [-0.00115, 0],
      [-0.00019, 3],
      [0.00467, 1],
      [0.00528, 1]
    ]
  },
  "QS_mulLysisSite[Root]": {
    "red_x_points": [
      [-0.00068, 3],
      [-0.00107, 0],
      [-0.00227, 2],
      [-0.00108, 0],
      [-0.00091, 0],
      [-0.00095, 0],
      [-0.00094, 0],
      [-0.00068, 3],
      [-0.001, 0],
      [-0.00101, 0],
      [-0.00095, 0],
      [-0.0007, 3],
      [0.00371, 1],
      [-0.00053, 3],
      [-0.00095, 0],
      [-0.00068, 3],
      [-0.00094, 0],
      [-0.00104, 0],
      [-0.00064, 3],
      [-0.00085, 3],
      [-0.00077, 3],
      [-0.00102, 0],
      [-0.00072, 3],
      [-0.00069, 3],
      [-0.00072, 3],
      [-0.00092, 0],
      [-0.00049, 3],
      [-0.00102, 0],
      [-0.0007, 3],
      [0.00332, 1],
      [-0.0023, 2]
    ],
    "red_o_points": [],
    "y_categories": ["N", "NOT APPLICABLE", "Y", "nan"],
    "blue_o_points": [],
    "blue_x_points": [
      [0.00408, 1],
      [-0.00036, 3],
      [0.00373, 1],
      [-0.00133, 0],
      [-0.0005, 3],
      [0.00372, 1],
      [0.00339, 1]
    ]
  },
  "QS_mulBpsurgeryType[Lysis]": {
    "red_x_points": [
      [-0.00258, 3],
      [-0.00451, 0],
      [-0.00819, 2],
      [-0.00497, 0],
      [-0.00488, 0],
      [-0.0084, 2],
      [-0.00498, 0],
      [-0.00236, 3],
      [-0.00437, 0],
      [-0.00479, 0],
      [-0.00439, 0],
      [-0.00279, 3],
      [0.01186, 1],
      [-0.00246, 3],
      [-0.00503, 0],
      [-0.0028, 3],
      [-0.00774, 2],
      [-0.00444, 0],
      [-0.00257, 3],
      [-0.00209, 3],
      [-0.00242, 3],
      [-0.00483, 0],
      [-0.00254, 3],
      [-0.00225, 3],
      [-0.00259, 3],
      [-0.00464, 0],
      [-0.00243, 3],
      [-0.00456, 0],
      [-0.00196, 3],
      [0.01312, 1],
      [-0.00782, 2]
    ],
    "red_o_points": [],
    "y_categories": ["N", "NOT APPLICABLE", "Y", "nan"],
    "blue_o_points": [],
    "blue_x_points": [
      [0.01731, 1],
      [-0.00075, 3],
      [0.01491, 1],
      [-0.0016, 0],
      [-0.00037, 3],
      [0.01522, 1],
      [0.0159, 1]
    ]
  },
  "QS_mulGraftNerve[LT]": {
    "red_x_points": [
      [-4e-5, 2],
      [-0.00013, 0],
      [-0.00013, 0],
      [-0.00013, 0],
      [-7e-5, 0],
      [-0.00011, 0],
      [-0.00013, 0],
      [-0.0, 2],
      [-0.00011, 0],
      [-0.00013, 0],
      [-7e-5, 0],
      [-2e-5, 2],
      [0.00024, 1],
      [1e-5, 2],
      [-0.00023, 0],
      [-3e-5, 2],
      [-0.00017, 0],
      [-1e-5, 0],
      [-3e-5, 2],
      [-0.0, 2],
      [-0.0, 2],
      [-0.00011, 0],
      [1e-5, 2],
      [1e-5, 2],
      [-0.0, 2],
      [-7e-5, 0],
      [-2e-5, 2],
      [-0.00013, 0],
      [-2e-5, 2],
      [-0.00011, 0]
    ],
    "red_o_points": [],
    "y_categories": ["N", "NOT APPLICABLE", "nan"],
    "blue_o_points": [],
    "blue_x_points": [
      [0.00041, 1],
      [3e-5, 2],
      [0.00023, 1],
      [-2e-5, 0],
      [5e-5, 2],
      [0.00023, 1],
      [0.00034, 1]
    ]
  },
  "QA_lstPexMuscstrength[ShoulderAbduc]": {
    "red_x_points": [
      [-0.00477, 1],
      [-0.00518, 1],
      [-0.00448, 1],
      [-0.00458, 1],
      [-0.00467, 1],
      [-0.00459, 1],
      [-0.00513, 1],
      [-0.00516, 1],
      [-0.00475, 1],
      [-0.00479, 1],
      [-0.0046, 1],
      [-0.00467, 1],
      [0.0024, 2],
      [0.0041, 2],
      [0.00445, 2],
      [0.00424, 2],
      [0.004, 2],
      [-0.00499, 1],
      [-0.00485, 1],
      [-0.00472, 1],
      [-0.00483, 1],
      [-0.00488, 1],
      [0.00397, 2],
      [-0.00753, 1],
      [-0.00506, 1],
      [-0.00465, 1],
      [-0.00514, 1],
      [-0.00469, 1],
      [-0.00518, 1],
      [0.00122, 2],
      [-0.00487, 1]
    ],
    "red_o_points": [],
    "y_categories": ["GREATER THAN OR EQUALS TO 3", "LESS THAN 3", "nan"],
    "blue_o_points": [],
    "blue_x_points": [
      [0.00337, 2],
      [0.00425, 2],
      [0.02015, 0],
      [0.00567, 2],
      [0.00458, 2],
      [0.02089, 0],
      [-0.00088, 1]
    ]
  },
  "QS_mulNeuromadSite[C4]": {
    "red_x_points": [
      [-0.00092, 2],
      [-0.00191, 0],
      [-0.00181, 0],
      [-0.00187, 0],
      [-0.00209, 0],
      [-0.00209, 0],
      [-0.00188, 0],
      [-0.00095, 2],
      [-0.00182, 0],
      [-0.00195, 0],
      [-0.00162, 0],
      [-0.0008, 2],
      [0.00319, 1],
      [-0.00093, 2],
      [-0.00173, 0],
      [-0.00099, 2],
      [-0.00159, 0],
      [-0.00162, 0],
      [-0.00074, 2],
      [-0.00077, 2],
      [-0.00066, 2],
      [-0.00141, 0],
      [-0.00081, 2],
      [-0.00122, 2],
      [-0.00111, 2],
      [-0.00185, 0],
      [-0.00081, 2],
      [-0.00161, 0],
      [-0.00075, 2],
      [0.00344, 1],
      [-0.00192, 0]
    ],
    "red_o_points": [],
    "y_categories": ["N", "NOT APPLICABLE", "nan"],
    "blue_o_points": [],
    "blue_x_points": [
      [0.00716, 1],
      [1e-5, 2],
      [0.00459, 1],
      [-8e-5, 0],
      [-9e-5, 2],
      [0.00451, 1],
      [0.00418, 1]
    ]
  },
  "QS_lstBpsurgSide": {
    "red_x_points": [
      [-0.00442, 3],
      [-0.0067, 0],
      [-0.0067, 0],
      [-0.0066, 0],
      [-0.01284, 2],
      [-0.00665, 0],
      [-0.00653, 0],
      [-0.00395, 3],
      [-0.0059, 0],
      [-0.01316, 2],
      [-0.01299, 2],
      [-0.00432, 3],
      [0.02134, 1],
      [-0.00417, 3],
      [-0.01358, 2],
      [-0.00455, 3],
      [-0.01296, 2],
      [-0.01452, 2],
      [-0.00391, 3],
      [-0.00405, 3],
      [-0.00419, 3],
      [-0.00577, 0],
      [-0.00413, 3],
      [-0.00494, 3],
      [-0.00443, 3],
      [-0.01321, 2],
      [-0.00407, 3],
      [-0.01266, 2],
      [-0.00374, 3],
      [0.02293, 1],
      [-0.00618, 0]
    ],
    "red_o_points": [],
    "y_categories": ["L", "NOT APPLICABLE", "R", "nan"],
    "blue_o_points": [],
    "blue_x_points": [
      [0.03197, 1],
      [-0.00164, 3],
      [0.02553, 1],
      [0.00103, 0],
      [-0.0019, 3],
      [0.02448, 1],
      [0.02545, 1]
    ]
  },
  "QS_mulGraftNerve[IS]": {
    "red_x_points": [
      [-1e-5, 2],
      [-0.00022, 0],
      [-0.00026, 0],
      [-0.00022, 0],
      [-0.00016, 0],
      [-0.00018, 0],
      [-0.00025, 0],
      [-5e-5, 2],
      [-0.00025, 0],
      [-0.00025, 0],
      [-0.00018, 0],
      [-7e-5, 2],
      [0.00039, 1],
      [-4e-5, 2],
      [-0.00017, 0],
      [-4e-5, 2],
      [-0.00021, 0],
      [-0.00017, 0],
      [-4e-5, 2],
      [-5e-5, 2],
      [1e-5, 2],
      [-0.00021, 0],
      [-4e-5, 2],
      [-2e-5, 2],
      [-4e-5, 2],
      [-0.00017, 0],
      [-2e-5, 2],
      [-0.00023, 0],
      [-3e-5, 2],
      [0.00042, 1],
      [-0.00017, 0]
    ],
    "red_o_points": [],
    "y_categories": ["N", "NOT APPLICABLE", "nan"],
    "blue_o_points": [],
    "blue_x_points": [
      [0.00041, 1],
      [-0.0, 2],
      [0.00054, 1],
      [-7e-5, 0],
      [-3e-5, 2],
      [0.00053, 1],
      [0.00051, 1]
    ]
  },
  "QS_mulGraftNerve[MC]": {
    "red_x_points": [
      [-5e-5, 2],
      [-4e-5, 0],
      [-0.00011, 0],
      [-9e-5, 0],
      [-6e-5, 0],
      [-7e-5, 0],
      [-0.00011, 0],
      [-5e-5, 2],
      [-9e-5, 0],
      [-0.00012, 0],
      [-4e-5, 0],
      [-5e-5, 2],
      [0.00025, 1],
      [-6e-5, 2],
      [-8e-5, 0],
      [-3e-5, 2],
      [-8e-5, 0],
      [-9e-5, 0],
      [-4e-5, 2],
      [-5e-5, 2],
      [-5e-5, 2],
      [-6e-5, 0],
      [-5e-5, 2],
      [-0.00019, 2],
      [-5e-5, 2],
      [-0.00012, 0],
      [-3e-5, 2],
      [-7e-5, 0],
      [-4e-5, 2],
      [0.00028, 1],
      [-9e-5, 0]
    ],
    "red_o_points": [],
    "y_categories": ["N", "NOT APPLICABLE", "nan"],
    "blue_o_points": [],
    "blue_x_points": [
      [0.00047, 1],
      [-2e-5, 2],
      [0.00029, 1],
      [1e-5, 0],
      [1e-5, 2],
      [0.00016, 1],
      [0.00017, 1]
    ]
  },
  "QA_yonPreOrtsurg": {
    "red_x_points": [
      [-0.00496, 0],
      [-0.00039, 2],
      [-7e-5, 0],
      [-0.00018, 0],
      [-7e-5, 0],
      [-0.00013, 0],
      [-0.00022, 0],
      [-0.00043, 2],
      [-0.00019, 0],
      [-9e-5, 0],
      [-0.00019, 2],
      [0.00665, 1],
      [-0.00084, 0],
      [-0.00035, 2],
      [-0.0003, 0],
      [-0.00544, 0],
      [-4e-5, 1],
      [-9e-5, 0],
      [-0.00438, 0],
      [-0.00414, 0],
      [-0.00471, 0],
      [-0.00019, 0],
      [-0.00503, 0],
      [-0.00621, 0],
      [-0.00498, 0],
      [-0.0002, 2],
      [-0.00063, 2],
      [-0.0001, 0],
      [-0.0002, 2],
      [-0.00028, 2],
      [0.00025, 1]
    ],
    "red_o_points": [],
    "y_categories": ["N", "Y", "nan"],
    "blue_o_points": [],
    "blue_x_points": [
      [-0.00013, 0],
      [0.00323, 2],
      [-0.00025, 0],
      [-0.00017, 0],
      [0.02007, 1],
      [-0.00014, 0],
      [8e-5, 0]
    ]
  },
  "QS_mulGraftNerve[Ra]": {
    "red_x_points": [
      [-0.00017, 2],
      [-0.00037, 0],
      [-0.0004, 0],
      [-0.00027, 0],
      [-0.00043, 0],
      [-0.00042, 0],
      [-0.00048, 0],
      [-0.00014, 2],
      [-0.0004, 0],
      [-0.00049, 0],
      [-0.00037, 0],
      [-0.00021, 2],
      [0.00085, 1],
      [-0.00017, 2],
      [-0.00037, 0],
      [-0.00011, 2],
      [-0.00042, 0],
      [-0.00042, 0],
      [-0.00017, 2],
      [-0.00019, 2],
      [-0.00013, 2],
      [-0.00033, 0],
      [-0.0001, 2],
      [-0.00014, 2],
      [-0.0002, 2],
      [-0.00043, 0],
      [-0.00022, 2],
      [-0.00056, 0],
      [-8e-5, 2],
      [0.00078, 1],
      [-0.00037, 0]
    ],
    "red_o_points": [],
    "y_categories": ["N", "NOT APPLICABLE", "nan"],
    "blue_o_points": [],
    "blue_x_points": [
      [0.00144, 1],
      [-0.00014, 2],
      [0.00112, 1],
      [-1e-5, 0],
      [-6e-5, 2],
      [0.00088, 1],
      [0.00129, 1]
    ]
  },
  "QS_mulTransfSite[Oberlin]": {
    "red_x_points": [
      [-0.00321, 3],
      [-0.01144, 0],
      [-0.01132, 0],
      [-0.01113, 0],
      [-0.00527, 2],
      [-0.00471, 2],
      [-0.01096, 0],
      [-0.00305, 3],
      [-0.00549, 2],
      [-0.00533, 2],
      [-0.0057, 2],
      [-0.00321, 3],
      [0.01808, 1],
      [-0.00322, 3],
      [-0.00515, 2],
      [-0.0037, 3],
      [-0.01129, 0],
      [-0.00551, 2],
      [-0.00334, 3],
      [-0.00371, 3],
      [-0.00329, 3],
      [-0.01044, 0],
      [-0.00366, 3],
      [-0.00356, 3],
      [-0.00368, 3],
      [-0.00475, 2],
      [-0.00369, 3],
      [-0.01066, 0],
      [-0.00311, 3],
      [0.01883, 1],
      [-0.0109, 0]
    ],
    "red_o_points": [],
    "y_categories": ["N", "NOT APPLICABLE", "Y", "nan"],
    "blue_o_points": [],
    "blue_x_points": [
      [0.02767, 1],
      [-0.00086, 3],
      [0.01951, 1],
      [0.00054, 2],
      [-0.00133, 3],
      [0.02068, 1],
      [0.02126, 1]
    ]
  },
  "QA_lstPexKine[Index]": {
    "red_x_points": [
      [-0.0009, 0],
      [-0.00054, 2],
      [-0.0006, 2],
      [-0.00043, 2],
      [6e-5, 1],
      [0.00045, 1],
      [-0.00127, 0],
      [0.00024, 2],
      [0.00044, 1],
      [4e-5, 1],
      [0.00032, 1],
      [-0.00013, 1],
      [-2e-5, 2],
      [0.00017, 2],
      [0.0002, 1],
      [7e-5, 2],
      [1e-5, 2],
      [0.00023, 1],
      [-0.00024, 1],
      [-0.00054, 0],
      [-0.00025, 1],
      [-0.00056, 2],
      [9e-5, 2],
      [-0.00031, 1],
      [0.00016, 2],
      [-0.00058, 2],
      [-0.00022, 1],
      [-0.00012, 2],
      [-4e-5, 1],
      [-4e-5, 2],
      [-0.00052, 0]
    ],
    "red_o_points": [],
    "y_categories": ["NPV", "PV", "nan"],
    "blue_o_points": [],
    "blue_x_points": [
      [0.00021, 1],
      [0.00037, 2],
      [1e-5, 1],
      [0.0016, 1],
      [0.00018, 2],
      [2e-5, 1],
      [3e-5, 2]
    ]
  }
}
