{
  "QA_lstPexPain[C8]": {
    "red_x_points": [
      [0.00701, 0],
      [-0.00408, 2],
      [-0.00522, 2],
      [0.00579, 0],
      [-0.00453, 2],
      [-0.00513, 1],
      [-0.00785, 1],
      [-0.00771, 1],
      [-0.0061, 2],
      [-0.00599, 2],
      [-0.00751, 2],
      [-0.00372, 2],
      [-0.00767, 1],
      [0.00613, 0],
      [-0.00637, 1],
      [-0.00631, 1],
      [-0.00456, 2],
      [-0.00718, 2],
      [-0.00773, 2],
      [-0.00527, 2],
      [-0.00861, 1],
      [-0.00394, 1],
      [-0.00891, 1]
    ],
    "red_o_points": [],
    "y_categories": ["NORM", "NPV", "nan"],
    "blue_o_points": [],
    "blue_x_points": [
      [-0.00594, 1],
      [-0.00423, 1],
      [0.00918, 0],
      [-0.00166, 1],
      [0.01178, 0],
      [0.01111, 0],
      [0.01118, 0],
      [0.00977, 0],
      [-0.00411, 2],
      [-0.00132, 2],
      [-0.0038, 2],
      [-0.00051, 1],
      [-0.0035, 2],
      [0.01057, 0],
      [0.01081, 0],
      [0.01018, 0],
      [-0.00391, 2],
      [0.01007, 0],
      [0.01011, 0],
      [0.01543, 0],
      [0.01428, 0]
    ]
  },
  "QS_mulTransfSite[TrAx]": {
    "red_x_points": [
      [-0.0002, 1],
      [-9e-5, 0],
      [-9e-5, 0],
      [1e-5, 0],
      [-3e-5, 0],
      [9e-5, 2],
      [-0.0002, 1],
      [2e-5, 2],
      [-2e-5, 0],
      [4e-5, 2],
      [-9e-5, 0],
      [2e-5, 2],
      [-7e-5, 1],
      [5e-5, 2],
      [-0.00013, 0],
      [-0.00011, 2],
      [-9e-5, 0],
      [-0.0001, 0],
      [-7e-5, 1],
      [2e-5, 2]
    ],
    "red_o_points": [],
    "y_categories": ["N", "NOT APPLICABLE", "nan"],
    "blue_o_points": [],
    "blue_x_points": [
      [9e-5, 2],
      [2e-5, 2],
      [1e-5, 0],
      [1e-5, 0],
      [1e-5, 0],
      [1e-5, 0],
      [7e-5, 2],
      [0.00052, 1],
      [-9e-5, 0],
      [1e-5, 0],
      [4e-5, 2],
      [3e-5, 2],
      [3e-5, 2],
      [4e-5, 2],
      [0.00011, 1],
      [3e-5, 2],
      [9e-5, 2]
    ]
  },
  "QS_mulTransfSite[C7cont]": {
    "red_x_points": [
      [-7e-5, 1],
      [-2e-5, 0],
      [-1e-5, 2],
      [-2e-5, 0],
      [0.0, 2],
      [-2e-5, 0],
      [-1e-5, 2],
      [-7e-5, 1],
      [0.0, 2]
    ],
    "red_o_points": [],
    "y_categories": ["N", "NOT APPLICABLE", "nan"],
    "blue_o_points": [],
    "blue_x_points": [
      [0.0, 2],
      [0.00012, 1],
      [-2e-5, 0],
      [0.00013, 0],
      [-1e-5, 2]
    ]
  },
  "QS_mulLysisCord[Medial]": {
    "red_x_points": [
      [-0.00015, 1],
      [-0.00015, 0],
      [3e-5, 0],
      [3e-5, 0],
      [-5e-5, 0],
      [3e-5, 0],
      [-1e-5, 2],
      [-0.00024, 1],
      [0.00012, 2],
      [-0.00015, 0],
      [-3e-5, 2],
      [-0.00015, 0],
      [-0.00042, 1],
      [-1e-5, 2],
      [-5e-5, 0],
      [-5e-5, 0],
      [-5e-5, 1],
      [8e-5, 0],
      [-1e-5, 2]
    ],
    "red_o_points": [],
    "y_categories": ["N", "NOT APPLICABLE", "nan"],
    "blue_o_points": [],
    "blue_x_points": [
      [2e-5, 2],
      [-2e-5, 2],
      [4e-5, 0],
      [0.00012, 0],
      [0.00019, 0],
      [0.00012, 2],
      [0.00022, 1],
      [2e-5, 0],
      [0.00029, 0],
      [0.00012, 2],
      [0.0, 2],
      [0.0, 2],
      [0.00012, 2],
      [0.00011, 2],
      [-7e-5, 1]
    ]
  },
  "QA_lstPexTouch[C6]": {
    "red_x_points": [
      [-0.00382, 1],
      [-0.0028, 2],
      [-0.0028, 1],
      [-0.00239, 1],
      [-0.00265, 2],
      [-0.00223, 1],
      [-0.00197, 1],
      [-0.0033, 1],
      [-0.00306, 2],
      [-0.00302, 2],
      [-0.00343, 1],
      [-0.00233, 2],
      [-0.00276, 1],
      [-0.00274, 1],
      [-0.00429, 1],
      [-0.00208, 1],
      [-0.00234, 2],
      [-0.00364, 1],
      [-0.00274, 1],
      [-0.00312, 2],
      [-0.00355, 1],
      [-0.00207, 1],
      [-0.00303, 1]
    ],
    "red_o_points": [],
    "y_categories": ["NORM", "NPV", "nan"],
    "blue_o_points": [],
    "blue_x_points": [
      [-0.00277, 1],
      [-0.00246, 1],
      [0.01616, 0],
      [-0.00204, 1],
      [0.02108, 0],
      [-0.00221, 1],
      [-0.00223, 1],
      [-0.00233, 1],
      [-0.00115, 2],
      [0.00028, 2],
      [-0.00129, 2],
      [-0.00255, 1],
      [-0.00063, 2],
      [-0.0023, 1],
      [-0.00212, 1],
      [0.01805, 0],
      [-0.00078, 2],
      [0.01715, 0],
      [0.02362, 0],
      [-0.00248, 1],
      [-0.00282, 1]
    ]
  },
  "QS_equBpsurgTime": {
    "red_x_points": [
      [0.00104, 3],
      [-0.00889, 0],
      [-0.00065, 2],
      [-0.01158, 0],
      [-0.00693, 0],
      [-0.00162, 1],
      [-0.00045, 3],
      [-0.00056, 3],
      [0.0018, 3],
      [-0.00736, 1],
      [0.00094, 3],
      [0.00092, 2],
      [0.00138, 3],
      [-0.00699, 2],
      [0.00093, 3],
      [0.00013, 3],
      [-0.00592, 0],
      [0.00144, 3],
      [-0.01111, 0],
      [-0.0064, 0],
      [0.0006, 3],
      [-0.00181, 2],
      [0.00103, 3]
    ],
    "red_o_points": [],
    "y_categories": [
      "0 TO 6 MONTHS",
      "13 TO 24 MONTHS",
      "7 TO 12 MONTHS",
      "nan"
    ],
    "blue_o_points": [],
    "blue_x_points": [
      [0.00167, 3],
      [0.00145, 3],
      [-0.00016, 0],
      [0.01018, 1],
      [0.00193, 3],
      [0.00562, 1],
      [0.00217, 0],
      [0.00474, 2],
      [0.0023, 3],
      [0.00239, 3],
      [0.00756, 2],
      [0.00694, 2],
      [0.00258, 3],
      [0.00093, 3],
      [0.00111, 3],
      [0.00099, 3],
      [0.0022, 3],
      [0.00088, 3],
      [0.00133, 3],
      [0.00164, 3],
      [0.00164, 3]
    ]
  },
  "QA_equInjTbpiTime": {
    "red_x_points": [
      [-0.00962, 0],
      [-0.00914, 0],
      [0.00217, 3],
      [0.00212, 3],
      [-0.00741, 0],
      [-0.00783, 0],
      [-0.00817, 0],
      [-0.00879, 0],
      [0.00176, 3],
      [-0.0089, 0],
      [-0.00879, 0],
      [-0.00816, 0],
      [0.00197, 3],
      [0.0012, 3],
      [-0.0095, 0],
      [-0.00737, 0],
      [-0.01204, 2],
      [-0.01889, 2],
      [-0.00861, 0],
      [-0.01463, 2],
      [-0.00934, 0],
      [0.00175, 3],
      [0.01243, 1]
    ],
    "red_o_points": [],
    "y_categories": [
      "0 TO 6 MONTHS",
      "13 TO 24 MONTHS",
      "25 MONTHS OR MORE",
      "7 TO 12 MONTHS",
      "nan"
    ],
    "blue_o_points": [],
    "blue_x_points": [
      [-0.00695, 0],
      [0.02095, 1],
      [-0.00681, 0],
      [0.02157, 1],
      [0.00434, 3],
      [-0.00738, 0],
      [-0.00614, 0],
      [0.00412, 3],
      [-0.00631, 0],
      [-0.00334, 2],
      [0.02276, 1],
      [0.00508, 3],
      [0.0207, 1],
      [0.0042, 3],
      [0.01903, 1],
      [0.01983, 1],
      [0.00479, 3],
      [0.01841, 1],
      [0.00634, 3],
      [0.00492, 3],
      [-0.00632, 0]
    ]
  },
  "QS_mulGraftRoot[T1]": {
    "red_x_points": [
      [-3e-5, 1],
      [-0.00024, 0],
      [2e-5, 0],
      [-0.00012, 0],
      [-0.00013, 0],
      [-4e-5, 0],
      [1e-5, 2],
      [-9e-5, 1],
      [0.00018, 2],
      [-0.00025, 0],
      [7e-5, 2],
      [-0.00024, 0],
      [9e-5, 2],
      [2e-5, 0],
      [-0.00031, 1],
      [-1e-5, 2],
      [-0.00021, 0],
      [2e-5, 2],
      [-0.00011, 0],
      [-0.0002, 0],
      [-0.00026, 1],
      [9e-5, 2]
    ],
    "red_o_points": [],
    "y_categories": ["N", "NOT APPLICABLE", "nan"],
    "blue_o_points": [],
    "blue_x_points": [
      [4e-5, 2],
      [9e-5, 2],
      [5e-5, 0],
      [5e-5, 0],
      [1e-5, 2],
      [8e-5, 0],
      [2e-5, 0],
      [-3e-5, 0],
      [0.00014, 2],
      [0.00027, 1],
      [-0.00014, 0],
      [-0.0001, 0],
      [0.00033, 2],
      [0.0, 2],
      [7e-5, 2],
      [0.00012, 2],
      [0.00036, 2],
      [7e-5, 2],
      [0.0001, 1],
      [9e-5, 2],
      [0.00011, 2]
    ]
  },
  "QS_mulGraftNerve[IS]": {
    "red_x_points": [
      [-0.00012, 1],
      [-8e-5, 0],
      [-8e-5, 0],
      [0.0, 0],
      [-5e-5, 2],
      [-0.00013, 1],
      [-3e-5, 0],
      [7e-5, 2],
      [-8e-5, 0],
      [5e-5, 0],
      [-0.00012, 1],
      [-5e-5, 0],
      [4e-5, 2],
      [-8e-5, 0],
      [-5e-5, 0],
      [-4e-5, 1],
      [5e-5, 2]
    ],
    "red_o_points": [],
    "y_categories": ["N", "NOT APPLICABLE", "nan"],
    "blue_o_points": [],
    "blue_x_points": [
      [8e-5, 2],
      [3e-5, 2],
      [0.0, 0],
      [5e-5, 0],
      [5e-5, 0],
      [5e-5, 0],
      [0.0, 0],
      [0.0001, 2],
      [0.00018, 1],
      [-0.00011, 0],
      [2e-5, 0],
      [4e-5, 2],
      [5e-5, 2],
      [3e-5, 2],
      [0.0001, 2],
      [-8e-5, 1],
      [5e-5, 2],
      [5e-5, 2]
    ]
  },
  "QS_mulGraftTrunk[MiddleTrunk]": {
    "red_x_points": [
      [-0.00059, 1],
      [-0.00038, 0],
      [-6e-5, 0],
      [5e-5, 0],
      [-0.00035, 0],
      [0.00015, 0],
      [1e-5, 2],
      [-0.00057, 1],
      [0.00015, 2],
      [-0.0004, 0],
      [-4e-5, 2],
      [-0.00039, 0],
      [7e-5, 2],
      [4e-5, 0],
      [-0.00054, 1],
      [5e-5, 2],
      [-0.00022, 0],
      [0.00012, 2],
      [-0.00017, 0],
      [-0.00024, 0],
      [-0.00089, 1],
      [7e-5, 0],
      [8e-5, 2]
    ],
    "red_o_points": [],
    "y_categories": ["N", "NOT APPLICABLE", "nan"],
    "blue_o_points": [],
    "blue_x_points": [
      [0.00019, 2],
      [0.00019, 2],
      [0.00012, 0],
      [0.0002, 0],
      [0.0002, 2],
      [0.00025, 0],
      [0.00018, 0],
      [0.00012, 0],
      [0.00033, 2],
      [0.00097, 1],
      [-0.00019, 0],
      [9e-5, 0],
      [0.00028, 2],
      [4e-5, 2],
      [0.0002, 2],
      [6e-5, 2],
      [0.00029, 2],
      [0.00011, 2],
      [0.00016, 1],
      [0.00019, 2],
      [8e-5, 2]
    ]
  },
  "QS_mulGraftTrunk[LowerTrunk]": {
    "red_x_points": [
      [-0.0006, 1],
      [-0.00078, 0],
      [-0.00024, 0],
      [2e-5, 0],
      [-0.00027, 0],
      [0.00015, 0],
      [9e-5, 2],
      [-0.00127, 1],
      [0.00031, 2],
      [-0.00073, 0],
      [8e-5, 2],
      [-0.0007, 0],
      [0.00014, 2],
      [6e-5, 0],
      [-0.00177, 1],
      [9e-5, 2],
      [-0.00056, 0],
      [7e-5, 2],
      [-0.0003, 0],
      [-0.00062, 0],
      [-0.00076, 1],
      [9e-5, 0],
      [9e-5, 2]
    ],
    "red_o_points": [],
    "y_categories": ["N", "NOT APPLICABLE", "nan"],
    "blue_o_points": [],
    "blue_x_points": [
      [0.00039, 2],
      [0.00032, 2],
      [0.00014, 0],
      [0.00034, 0],
      [0.00022, 2],
      [0.00065, 0],
      [0.00027, 0],
      [0.00017, 0],
      [0.00077, 2],
      [0.00195, 1],
      [-0.00053, 0],
      [0.00042, 0],
      [0.00062, 2],
      [0.00025, 2],
      [0.00023, 2],
      [0.00019, 2],
      [0.00065, 2],
      [0.0002, 2],
      [-0.00017, 1],
      [0.00019, 2],
      [0.00013, 2]
    ]
  },
  "QS_mulGraftNerve[Ph]": {
    "red_x_points": [
      [-0.00302, 1],
      [-0.00117, 0],
      [-0.00098, 0],
      [1e-5, 0],
      [-0.00073, 0],
      [0.00031, 0],
      [0.00019, 2],
      [-0.00239, 1],
      [0.00106, 2],
      [-0.00097, 0],
      [0.0004, 2],
      [-0.00125, 0],
      [0.00018, 2],
      [-3e-5, 0],
      [-0.00375, 1],
      [0.00021, 2],
      [-0.00103, 0],
      [0.00022, 2],
      [-0.00072, 0],
      [-0.00147, 0],
      [-0.00226, 1],
      [7e-5, 0],
      [0.00037, 2]
    ],
    "red_o_points": [],
    "y_categories": ["N", "NOT APPLICABLE", "nan"],
    "blue_o_points": [],
    "blue_x_points": [
      [0.00085, 2],
      [0.00076, 2],
      [0.0005, 0],
      [0.00092, 0],
      [0.00069, 2],
      [0.00108, 0],
      [0.00035, 0],
      [4e-5, 0],
      [0.00143, 2],
      [0.00346, 1],
      [-0.00064, 0],
      [0.00071, 0],
      [0.00118, 2],
      [0.00051, 2],
      [0.00052, 2],
      [0.00037, 2],
      [0.00135, 2],
      [0.00063, 2],
      [0.00071, 1],
      [0.00069, 2],
      [0.00062, 2]
    ]
  },
  "QS_mulLysisTrunk[Middle]": {
    "red_x_points": [[0.0, 2], [-0.00017, 1]],
    "red_o_points": [],
    "y_categories": ["N", "NOT APPLICABLE", "nan"],
    "blue_o_points": [],
    "blue_x_points": [
      [0.0, 2],
      [3e-5, 0],
      [3e-5, 0],
      [3e-5, 0],
      [3e-5, 0],
      [0.0, 2],
      [0.0, 2],
      [0.0, 2],
      [0.0, 2],
      [0.0, 2]
    ]
  },
  "QS_mulTransfSite[PhAc]": {
    "red_x_points": [
      [-0.00013, 1],
      [2e-5, 0],
      [2e-5, 0],
      [-7e-5, 1],
      [-0.00013, 0],
      [-7e-5, 1],
      [2e-5, 2],
      [-7e-5, 0],
      [-7e-5, 2],
      [-0.00013, 0]
    ],
    "red_o_points": [],
    "y_categories": ["N", "NOT APPLICABLE", "nan"],
    "blue_o_points": [],
    "blue_x_points": [
      [2e-5, 2],
      [2e-5, 0],
      [0.00027, 1],
      [9e-5, 0],
      [7e-5, 2],
      [7e-5, 2],
      [7e-5, 1]
    ]
  },
  "QA_mulInjOrthesisType[ArmSling]": {
    "red_x_points": [
      [-0.00489, 2],
      [-0.00588, 2],
      [-0.00284, 2],
      [-0.00183, 2],
      [-0.00361, 2],
      [-0.00187, 2],
      [-0.00126, 2],
      [-0.00028, 1],
      [-0.00621, 2],
      [-0.00529, 2],
      [-0.00328, 2],
      [-0.01462, 0],
      [-0.00757, 3],
      [-0.00137, 2],
      [0.00048, 1],
      [-0.0012, 2],
      [-0.00926, 3],
      [-0.00589, 2],
      [-0.00334, 2],
      [-0.00417, 2],
      [-0.00646, 3],
      [-0.00141, 2],
      [-0.00363, 2]
    ],
    "red_o_points": [],
    "y_categories": ["N", "NOT APPLICABLE", "Y", "nan"],
    "blue_o_points": [],
    "blue_x_points": [
      [-0.00106, 2],
      [-0.0014, 2],
      [-0.00031, 2],
      [-0.00046, 2],
      [-0.00136, 2],
      [-0.00112, 2],
      [-0.00049, 2],
      [-0.00069, 2],
      [0.02776, 1],
      [0.02315, 1],
      [-0.00429, 2],
      [0.01749, 1],
      [0.02228, 1],
      [-0.00063, 2],
      [0.00523, 0],
      [-0.00074, 2],
      [-0.00514, 2],
      [0.01045, 1],
      [0.00949, 1],
      [-0.0024, 2],
      [-0.00011, 3]
    ]
  },
  "QS_mulGraftRoot[C4]": {
    "red_x_points": [
      [-0.00019, 1],
      [-0.0, 0],
      [-0.0, 0],
      [4e-5, 2],
      [-0.00019, 1],
      [5e-5, 2],
      [4e-5, 2],
      [-0.0, 0],
      [4e-5, 2],
      [-0.0, 0],
      [-9e-5, 1]
    ],
    "red_o_points": [],
    "y_categories": ["N", "NOT APPLICABLE", "nan"],
    "blue_o_points": [],
    "blue_x_points": [
      [9e-5, 2],
      [9e-5, 2],
      [-0.0, 0],
      [-0.0, 0],
      [-0.0, 0],
      [0.0, 0],
      [4e-5, 2],
      [5e-5, 2],
      [4e-5, 2],
      [4e-5, 2]
    ]
  },
  "QA_mulInjOrthesisType[ShoulderSupport]": {
    "red_x_points": [
      [-0.00505, 0],
      [-0.00614, 0],
      [-0.0026, 0],
      [-0.01323, 2],
      [-0.00393, 0],
      [-0.0022, 0],
      [-0.00143, 0],
      [-0.00127, 1],
      [-0.00706, 0],
      [-0.00511, 0],
      [-0.00393, 0],
      [-0.01239, 2],
      [-0.00845, 3],
      [-0.00165, 0],
      [-0.00011, 1],
      [-0.00174, 0],
      [-0.00993, 3],
      [-0.00646, 0],
      [-0.00288, 0],
      [-0.00436, 0],
      [-0.00732, 3],
      [-0.00109, 0],
      [-0.00515, 0]
    ],
    "red_o_points": [],
    "y_categories": ["N", "NOT APPLICABLE", "Y", "nan"],
    "blue_o_points": [],
    "blue_x_points": [
      [-0.00156, 0],
      [-0.0015, 0],
      [0.00066, 0],
      [0.00066, 0],
      [0.00872, 2],
      [-0.00045, 0],
      [-2e-5, 0],
      [0.0008, 0],
      [0.02879, 1],
      [0.0228, 1],
      [-0.00452, 0],
      [0.0194, 1],
      [0.02124, 1],
      [-0.00016, 0],
      [0.00387, 2],
      [-0.00075, 0],
      [-0.00547, 0],
      [0.01049, 1],
      [0.01034, 1],
      [-0.00235, 0],
      [0.00249, 3]
    ]
  },
  "QS_mulGraftLevel[Nerve]": {
    "red_x_points": [
      [-0.00016, 1],
      [-0.00019, 0],
      [-0.0001, 0],
      [7e-5, 0],
      [-0.00015, 0],
      [-1e-5, 0],
      [-0.00039, 1],
      [0.00014, 2],
      [-0.00016, 0],
      [7e-5, 2],
      [-0.0002, 0],
      [-2e-5, 0],
      [-0.00018, 1],
      [2e-5, 2],
      [-6e-5, 0],
      [7e-5, 2],
      [-0.00012, 0],
      [-0.00015, 0],
      [-0.00058, 1],
      [5e-5, 2]
    ],
    "red_o_points": [],
    "y_categories": ["N", "NOT APPLICABLE", "nan"],
    "blue_o_points": [],
    "blue_x_points": [
      [4e-5, 2],
      [5e-5, 2],
      [3e-5, 0],
      [9e-5, 0],
      [2e-5, 2],
      [5e-5, 0],
      [4e-5, 0],
      [4e-5, 0],
      [0.00012, 2],
      [0.00053, 1],
      [-7e-5, 0],
      [0.00017, 0],
      [0.00011, 2],
      [0.00014, 2],
      [0.00011, 2],
      [0.00014, 2],
      [0.00015, 2],
      [0.00014, 2],
      [0.00014, 2]
    ]
  },
  "QA_lstPexArthre[Shoulder]": {
    "red_x_points": [
      [0.00563, 2],
      [-0.00211, 3],
      [-0.00311, 3],
      [0.00584, 2],
      [-0.01492, 0],
      [-0.01803, 1],
      [0.00681, 2],
      [0.0065, 2],
      [-0.0023, 3],
      [0.00457, 2],
      [-0.00389, 3],
      [-0.00239, 3],
      [-0.00379, 3],
      [-0.0197, 1],
      [0.00618, 2],
      [-0.01451, 1],
      [-0.00176, 3],
      [-0.00311, 3],
      [-0.00522, 3],
      [-0.00215, 3],
      [-0.00332, 3],
      [-0.0127, 1],
      [-0.00386, 3]
    ],
    "red_o_points": [],
    "y_categories": ["NAIA", "NPV", "PV", "nan"],
    "blue_o_points": [],
    "blue_x_points": [
      [0.01015, 2],
      [-0.00298, 3],
      [0.00627, 2],
      [0.00903, 2],
      [-0.00153, 3],
      [0.01032, 2],
      [0.00853, 2],
      [0.00789, 2],
      [-0.00161, 3],
      [-0.00105, 3],
      [-0.00125, 3],
      [0.01039, 2],
      [-0.00133, 3],
      [0.00745, 2],
      [0.0058, 2],
      [-0.00141, 1],
      [-0.00144, 3],
      [0.0057, 2],
      [-0.00143, 3],
      [0.00737, 2],
      [0.00646, 2]
    ]
  },
  "QS_mulGraftRoot[T2]": {
    "red_x_points": [
      [-0.00029, 1],
      [-3e-5, 0],
      [-3e-5, 0],
      [6e-5, 0],
      [-3e-5, 0],
      [-4e-5, 0],
      [6e-5, 2],
      [-0.00051, 1],
      [0.0001, 2],
      [-0.00011, 0],
      [2e-5, 2],
      [-0.00013, 0],
      [7e-5, 2],
      [0.0, 0],
      [-0.00055, 1],
      [2e-5, 2],
      [-9e-5, 0],
      [4e-5, 2],
      [-3e-5, 0],
      [-6e-5, 0],
      [-0.00043, 1],
      [4e-5, 0],
      [2e-5, 2]
    ],
    "red_o_points": [],
    "y_categories": ["N", "NOT APPLICABLE", "nan"],
    "blue_o_points": [],
    "blue_x_points": [
      [0.00016, 2],
      [0.00014, 2],
      [7e-5, 0],
      [0.0001, 0],
      [5e-5, 2],
      [7e-5, 0],
      [7e-5, 0],
      [3e-5, 0],
      [5e-5, 2],
      [0.00031, 1],
      [-9e-5, 0],
      [0.00018, 0],
      [6e-5, 2],
      [0.00013, 2],
      [9e-5, 2],
      [5e-5, 2],
      [1e-5, 2],
      [0.0002, 2],
      [7e-5, 1],
      [0.00013, 2],
      [6e-5, 2]
    ]
  },
  "QS_mulTransfSite[MPMc]": {
    "red_x_points": [
      [-8e-5, 1],
      [2e-5, 0],
      [2e-5, 0],
      [4e-5, 2],
      [-8e-5, 1],
      [-8e-5, 1],
      [-8e-5, 1],
      [2e-5, 0],
      [4e-5, 2]
    ],
    "red_o_points": [],
    "y_categories": ["N", "NOT APPLICABLE", "nan"],
    "blue_o_points": [],
    "blue_x_points": [
      [4e-5, 2],
      [4e-5, 2],
      [2e-5, 0],
      [2e-5, 0],
      [2e-5, 0],
      [4e-5, 2]
    ]
  },
  "QS_mulTransfSite[PhMc]": {
    "red_x_points": [
      [-0.0069, 1],
      [-0.00358, 0],
      [-0.00069, 0],
      [0.00076, 0],
      [-0.00199, 0],
      [-0.01272, 2],
      [0.00095, 3],
      [-0.00788, 1],
      [0.00292, 3],
      [-0.00324, 0],
      [0.00181, 3],
      [-0.00324, 0],
      [0.00169, 3],
      [-2e-5, 0],
      [-0.00986, 1],
      [0.00154, 3],
      [-0.01124, 2],
      [0.00194, 3],
      [-0.00095, 0],
      [-0.00364, 0],
      [-0.00717, 1],
      [0.00107, 0],
      [0.00201, 3]
    ],
    "red_o_points": [],
    "y_categories": ["N", "NOT APPLICABLE", "Y", "nan"],
    "blue_o_points": [],
    "blue_x_points": [
      [0.00383, 3],
      [0.00275, 3],
      [0.00112, 0],
      [0.00318, 0],
      [0.00195, 3],
      [0.00317, 0],
      [0.00149, 0],
      [0.00114, 0],
      [0.00507, 3],
      [0.00733, 1],
      [-0.00167, 0],
      [0.00321, 0],
      [0.0051, 3],
      [0.00229, 3],
      [0.00293, 3],
      [0.00199, 3],
      [0.00501, 3],
      [0.00255, 3],
      [0.00081, 1],
      [0.00263, 3],
      [0.00255, 3]
    ]
  },
  "QS_mulLysisNerve[TD]": {
    "red_x_points": [
      [-9e-5, 0],
      [-9e-5, 0],
      [-0.00018, 1],
      [-9e-5, 0],
      [4e-5, 2],
      [-9e-5, 0]
    ],
    "red_o_points": [],
    "y_categories": ["N", "NOT APPLICABLE", "nan"],
    "blue_o_points": [],
    "blue_x_points": [
      [2e-5, 2],
      [2e-5, 0],
      [2e-5, 0],
      [2e-5, 0],
      [2e-5, 0],
      [0.00011, 1],
      [2e-5, 0],
      [4e-5, 2],
      [2e-5, 2],
      [2e-5, 2],
      [4e-5, 2],
      [2e-5, 2],
      [0.00011, 1]
    ]
  },
  "QS_mulLysisRoot[C6]": {
    "red_x_points": [
      [-0.00319, 1],
      [-0.00097, 0],
      [-0.00903, 2],
      [0.00098, 0],
      [-0.0009, 0],
      [0.00161, 0],
      [0.00071, 3],
      [-0.00385, 1],
      [0.00117, 3],
      [-0.00058, 0],
      [0.00115, 3],
      [-0.0008, 0],
      [0.00098, 3],
      [0.00032, 0],
      [-0.00332, 1],
      [0.00065, 3],
      [-0.00073, 0],
      [0.00126, 3],
      [0.00047, 0],
      [-0.00108, 0],
      [-0.00342, 1],
      [-0.00717, 2],
      [0.00094, 3]
    ],
    "red_o_points": [],
    "y_categories": ["N", "NOT APPLICABLE", "Y", "nan"],
    "blue_o_points": [],
    "blue_x_points": [
      [0.00143, 3],
      [0.00123, 3],
      [0.00027, 0],
      [0.00268, 0],
      [0.00126, 3],
      [0.00196, 0],
      [0.0006, 0],
      [0.00129, 0],
      [0.00124, 3],
      [0.00229, 1],
      [-0.00094, 0],
      [0.00265, 0],
      [0.0011, 3],
      [0.00081, 3],
      [0.00065, 3],
      [0.00061, 3],
      [0.0018, 3],
      [0.00064, 3],
      [0.00157, 1],
      [0.00095, 3],
      [0.00072, 3]
    ]
  },
  "QS_mulGraftNerve[other]": {
    "red_x_points": [
      [-0.00351, 1],
      [-0.00226, 0],
      [-0.00049, 0],
      [-3e-5, 0],
      [-0.00144, 0],
      [0.00022, 0],
      [0.00021, 2],
      [-0.00292, 1],
      [0.00124, 2],
      [-0.00165, 0],
      [0.0003, 2],
      [-0.00182, 0],
      [0.00051, 2],
      [-2e-5, 0],
      [-0.00624, 1],
      [0.00026, 2],
      [-0.00111, 0],
      [0.00018, 2],
      [-0.00073, 0],
      [-0.00229, 0],
      [-0.00337, 1],
      [6e-5, 0],
      [0.00067, 2]
    ],
    "red_o_points": [],
    "y_categories": ["N", "NOT APPLICABLE", "nan"],
    "blue_o_points": [],
    "blue_x_points": [
      [0.00122, 2],
      [0.0011, 2],
      [0.00057, 0],
      [0.00116, 0],
      [0.00042, 2],
      [0.00132, 0],
      [0.00095, 0],
      [0.00041, 0],
      [0.00191, 2],
      [0.00435, 1],
      [-0.00061, 0],
      [0.00071, 0],
      [0.00187, 2],
      [0.00071, 2],
      [0.00114, 2],
      [0.00049, 2],
      [0.00205, 2],
      [0.00085, 2],
      [0.00066, 1],
      [0.00177, 2],
      [0.00121, 2]
    ]
  },
  "QS_mulTransfSite[AcSsAA]": {
    "red_x_points": [
      [-0.00752, 1],
      [-0.01528, 2],
      [-0.00168, 0],
      [-0.0005, 0],
      [-0.00907, 2],
      [0.00025, 0],
      [0.00057, 3],
      [-0.00986, 1],
      [0.00526, 3],
      [-0.01527, 2],
      [0.00274, 3],
      [-0.00137, 0],
      [0.00213, 3],
      [-0.00652, 0],
      [-0.01045, 1],
      [0.00141, 3],
      [-0.00873, 2],
      [0.00298, 3],
      [-0.00254, 0],
      [-0.01178, 2],
      [-0.00805, 1],
      [3e-5, 0],
      [0.00316, 3]
    ],
    "red_o_points": [],
    "y_categories": ["N", "NOT APPLICABLE", "Y", "nan"],
    "blue_o_points": [],
    "blue_x_points": [
      [0.00434, 3],
      [0.0035, 3],
      [0.0041, 2],
      [0.00187, 0],
      [0.00329, 3],
      [0.00284, 0],
      [0.00724, 2],
      [0.00061, 0],
      [0.00708, 3],
      [0.01151, 1],
      [0.00514, 0],
      [0.00337, 0],
      [0.00652, 3],
      [0.00258, 3],
      [0.00291, 3],
      [0.00255, 3],
      [0.0066, 3],
      [0.00345, 3],
      [0.00252, 1],
      [0.004, 3],
      [0.00405, 3]
    ]
  },
  "QS_mulGraftNerve[DS]": {
    "red_x_points": [
      [-0.00022, 1],
      [-0.00019, 0],
      [-6e-5, 0],
      [-2e-5, 0],
      [-6e-5, 0],
      [-6e-5, 0],
      [0.00012, 2],
      [-0.00014, 0],
      [4e-5, 2],
      [-0.00012, 0],
      [4e-5, 2],
      [-6e-5, 1],
      [-2e-5, 2],
      [-6e-5, 0],
      [-0.00014, 0],
      [-0.00026, 1]
    ],
    "red_o_points": [],
    "y_categories": ["N", "NOT APPLICABLE", "nan"],
    "blue_o_points": [],
    "blue_x_points": [
      [0.0, 2],
      [4e-5, 2],
      [-2e-5, 0],
      [8e-5, 0],
      [4e-5, 2],
      [0.0001, 0],
      [0.00012, 2],
      [0.00025, 1],
      [3e-5, 0],
      [0.00011, 0],
      [6e-5, 2],
      [4e-5, 2],
      [4e-5, 2],
      [4e-5, 2],
      [8e-5, 2],
      [4e-5, 2],
      [4e-5, 1],
      [4e-5, 2],
      [4e-5, 2]
    ]
  },
  "QA_lstPexMuscstrength[WristFlex]": {
    "red_x_points": [
      [-0.00039, 0],
      [-0.00267, 2],
      [-0.00876, 1],
      [0.00176, 0],
      [-0.00774, 1],
      [-0.012, 1],
      [-0.0008, 0],
      [0.00034, 0],
      [-0.00188, 2],
      [-0.00428, 2],
      [-0.00052, 0],
      [-0.00262, 2],
      [-0.00626, 1],
      [0.00184, 0],
      [0.00089, 0],
      [-0.00384, 1],
      [-0.0066, 1],
      [-0.00221, 0],
      [0.00318, 0],
      [0.0016, 0],
      [-0.00159, 2],
      [-0.00776, 1],
      [-0.00434, 2]
    ],
    "red_o_points": [],
    "y_categories": ["GREATER THAN OR EQUALS TO 3", "LESS THAN 3", "nan"],
    "blue_o_points": [],
    "blue_x_points": [
      [0.00331, 1],
      [0.00625, 0],
      [0.00254, 0],
      [0.00454, 0],
      [0.00334, 0],
      [0.00664, 0],
      [0.00345, 0],
      [0.00363, 0],
      [0.00104, 2],
      [0.00046, 2],
      [0.00588, 0],
      [0.00654, 0],
      [0.00067, 2],
      [0.00078, 0],
      [0.00099, 0],
      [0.0023, 0],
      [0.00158, 2],
      [0.00252, 1],
      [0.00161, 0],
      [0.00538, 1],
      [0.00119, 2]
    ]
  },
  "QS_mulNeuromadSite[C5]": {
    "red_x_points": [
      [-0.00443, 1],
      [-0.00207, 0],
      [-0.0005, 0],
      [0.00012, 0],
      [-0.00141, 0],
      [0.0001, 0],
      [7e-5, 2],
      [-0.00359, 1],
      [0.00129, 2],
      [-0.0016, 0],
      [0.00036, 2],
      [-0.00206, 0],
      [0.0003, 2],
      [7e-5, 0],
      [-0.00488, 1],
      [0.00016, 2],
      [-0.00147, 0],
      [0.00018, 2],
      [-0.00069, 0],
      [-0.00236, 0],
      [-0.00355, 1],
      [-2e-5, 0],
      [0.00046, 2]
    ],
    "red_o_points": [],
    "y_categories": ["N", "NOT APPLICABLE", "nan"],
    "blue_o_points": [],
    "blue_x_points": [
      [0.00133, 2],
      [0.00087, 2],
      [0.00091, 0],
      [0.00114, 0],
      [0.00061, 2],
      [0.00152, 0],
      [0.00101, 0],
      [0.00056, 0],
      [0.00199, 2],
      [0.00466, 1],
      [-0.00109, 0],
      [0.00122, 0],
      [0.00201, 2],
      [0.00105, 2],
      [0.00112, 2],
      [0.00061, 2],
      [0.00192, 2],
      [0.00107, 2],
      [0.00083, 1],
      [0.0013, 2],
      [0.0009, 2]
    ]
  },
  "QS_mulNeuromadSite[C7]": {
    "red_x_points": [
      [-0.00718, 1],
      [-0.00419, 0],
      [-0.00156, 0],
      [3e-5, 0],
      [-0.00274, 0],
      [0.00023, 0],
      [0.00041, 2],
      [-0.00839, 1],
      [0.00296, 2],
      [-0.00359, 0],
      [0.00087, 2],
      [-0.00455, 0],
      [0.00084, 2],
      [-0.00037, 0],
      [-0.0093, 1],
      [0.00033, 2],
      [-0.00365, 0],
      [0.0012, 2],
      [-0.00176, 0],
      [-0.00468, 0],
      [-0.00754, 1],
      [0.00056, 0],
      [0.0013, 2]
    ],
    "red_o_points": [],
    "y_categories": ["N", "NOT APPLICABLE", "nan"],
    "blue_o_points": [],
    "blue_x_points": [
      [0.00297, 2],
      [0.00199, 2],
      [0.00124, 0],
      [0.00322, 0],
      [0.00153, 2],
      [0.00205, 0],
      [0.00097, 0],
      [0.00109, 0],
      [0.0042, 2],
      [0.01013, 1],
      [-0.00241, 0],
      [0.00232, 0],
      [0.00391, 2],
      [0.00173, 2],
      [0.00218, 2],
      [0.00121, 2],
      [0.00455, 2],
      [0.00187, 2],
      [0.00102, 1],
      [0.00263, 2],
      [0.00237, 2]
    ]
  },
  "QS_mulGraftNerve[TD]": {
    "red_x_points": [
      [-0.00225, 1],
      [-0.00128, 0],
      [-0.00041, 0],
      [-0.00017, 0],
      [-0.00084, 0],
      [0.00014, 0],
      [-2e-5, 2],
      [-0.00176, 1],
      [0.00071, 2],
      [-0.00084, 0],
      [0.00013, 2],
      [-0.00088, 0],
      [0.0002, 2],
      [-7e-5, 0],
      [-0.00244, 1],
      [2e-5, 2],
      [-0.00117, 0],
      [0.00027, 2],
      [-0.00034, 0],
      [-0.00115, 0],
      [-0.00206, 1],
      [8e-5, 0],
      [0.00028, 2]
    ],
    "red_o_points": [],
    "y_categories": ["N", "NOT APPLICABLE", "nan"],
    "blue_o_points": [],
    "blue_x_points": [
      [0.00082, 2],
      [0.00033, 2],
      [0.00048, 0],
      [0.00056, 0],
      [0.00035, 2],
      [0.00065, 0],
      [0.00054, 0],
      [0.00023, 0],
      [0.0012, 2],
      [0.00291, 1],
      [-0.00095, 0],
      [0.00061, 0],
      [0.00117, 2],
      [0.00024, 2],
      [0.00069, 2],
      [0.00039, 2],
      [0.00111, 2],
      [0.00069, 2],
      [0.00049, 1],
      [0.0008, 2],
      [0.0005, 2]
    ]
  },
  "QS_mulGraftNerve[SS]": {
    "red_x_points": [
      [-0.00152, 1],
      [-0.00091, 0],
      [-0.00038, 0],
      [0.00016, 0],
      [-0.00055, 0],
      [8e-5, 0],
      [-2e-5, 2],
      [-0.00194, 1],
      [0.00054, 2],
      [-0.00061, 0],
      [0.00024, 2],
      [-0.00076, 0],
      [5e-5, 2],
      [2e-5, 0],
      [-0.00223, 1],
      [1e-5, 2],
      [-0.00065, 0],
      [0.00024, 2],
      [-0.00031, 0],
      [-0.00071, 0],
      [-0.00164, 1],
      [9e-5, 0],
      [0.00012, 2]
    ],
    "red_o_points": [],
    "y_categories": ["N", "NOT APPLICABLE", "nan"],
    "blue_o_points": [],
    "blue_x_points": [
      [0.00047, 2],
      [0.0002, 2],
      [0.00025, 0],
      [0.00059, 0],
      [6e-5, 2],
      [0.00064, 0],
      [0.00045, 0],
      [0.00065, 0],
      [0.00084, 2],
      [0.00228, 1],
      [-0.00087, 0],
      [0.00079, 0],
      [0.00103, 2],
      [0.00051, 2],
      [0.00043, 2],
      [0.00019, 2],
      [0.00061, 2],
      [0.00038, 2],
      [0.00024, 1],
      [0.00063, 2],
      [0.00033, 2]
    ]
  },
  "QS_mulBpsurgeryType[Graft]": {
    "red_x_points": [
      [-0.00405, 1],
      [-0.00194, 0],
      [-0.00143, 0],
      [0.00011, 0],
      [-0.00165, 0],
      [9e-5, 0],
      [0.00067, 3],
      [-0.00404, 1],
      [0.00206, 3],
      [-0.01389, 2],
      [0.00118, 3],
      [-0.00206, 0],
      [0.00089, 3],
      [0.00016, 0],
      [-0.00492, 1],
      [0.00044, 3],
      [-0.00134, 0],
      [0.00137, 3],
      [-0.00071, 0],
      [-0.00253, 0],
      [-0.003, 1],
      [0.00018, 0],
      [0.00108, 3]
    ],
    "red_o_points": [],
    "y_categories": ["N", "NOT APPLICABLE", "Y", "nan"],
    "blue_o_points": [],
    "blue_x_points": [
      [0.00152, 3],
      [0.00091, 3],
      [0.00136, 0],
      [0.00159, 0],
      [0.00095, 3],
      [0.00165, 0],
      [0.00141, 0],
      [0.00112, 0],
      [0.0027, 3],
      [0.00604, 1],
      [-0.00085, 0],
      [0.00154, 0],
      [0.00258, 3],
      [0.00094, 3],
      [0.00106, 3],
      [0.00062, 3],
      [0.00262, 3],
      [0.0013, 3],
      [0.00084, 1],
      [0.00165, 3],
      [0.00179, 3]
    ]
  },
  "QA_lstPexArthre[Index]": {
    "red_x_points": [
      [-0.00707, 0],
      [-0.00215, 2],
      [-0.00238, 2],
      [-0.00699, 0],
      [-0.00405, 0],
      [-0.00828, 0],
      [0.00117, 1],
      [0.00085, 1],
      [-0.0018, 2],
      [0.00342, 1],
      [-0.00208, 2],
      [-0.00215, 2],
      [-0.00235, 2],
      [0.00188, 1],
      [0.00077, 1],
      [-0.0033, 0],
      [-0.00126, 2],
      [-0.00313, 2],
      [-0.00556, 2],
      [-0.00151, 2],
      [-0.00177, 2],
      [-0.00584, 0],
      [-0.00271, 2]
    ],
    "red_o_points": [],
    "y_categories": ["NPV", "PV", "nan"],
    "blue_o_points": [],
    "blue_x_points": [
      [0.00148, 0],
      [-0.00115, 2],
      [0.00322, 1],
      [0.00711, 1],
      [-0.00075, 2],
      [0.00847, 1],
      [0.00701, 1],
      [5e-5, 0],
      [-0.00118, 2],
      [-0.0006, 2],
      [-0.00139, 2],
      [0.01092, 1],
      [-0.00087, 2],
      [0.00277, 1],
      [0.00259, 1],
      [0.0009, 0],
      [-0.00096, 2],
      [0.00434, 1],
      [-0.00015, 2],
      [0.00713, 1],
      [0.00735, 1]
    ]
  },
  "QA_lstPexMuscstrength[FingersAddu]": {
    "red_x_points": [
      [0.00039, 2],
      [-0.00013, 2],
      [-0.0153, 1],
      [-0.00051, 2],
      [-0.01487, 1],
      [-0.0173, 1],
      [0.00558, 0],
      [0.00559, 0],
      [2e-5, 2],
      [0.00021, 2],
      [0.00507, 0],
      [0.00055, 2],
      [-0.0159, 1],
      [0.00681, 0],
      [0.00608, 0],
      [-0.01473, 1],
      [-0.01337, 1],
      [0.00087, 2],
      [-0.00042, 2],
      [-0.01603, 1],
      [3e-5, 2],
      [-0.01453, 1],
      [-0.00083, 2]
    ],
    "red_o_points": [],
    "y_categories": ["GREATER THAN OR EQUALS TO 3", "LESS THAN 3", "nan"],
    "blue_o_points": [],
    "blue_x_points": [
      [0.01076, 0],
      [-0.00758, 1],
      [0.00684, 0],
      [0.00917, 0],
      [0.00908, 0],
      [0.01087, 0],
      [0.00152, 2],
      [0.00969, 0],
      [0.0008, 2],
      [0.00184, 2],
      [0.00167, 2],
      [0.00245, 2],
      [0.00177, 2],
      [0.00671, 0],
      [0.00677, 0],
      [0.00678, 0],
      [0.00222, 2],
      [0.00147, 2],
      [0.00827, 0],
      [0.0008, 2],
      [0.00082, 2]
    ]
  },
  "QA_lstPexPain[T1]": {
    "red_x_points": [
      [-0.00535, 1],
      [-0.00343, 2],
      [-0.0043, 2],
      [0.00361, 0],
      [-0.00349, 2],
      [-0.00185, 1],
      [0.00064, 0],
      [0.00182, 0],
      [-0.0054, 2],
      [-0.00535, 2],
      [-0.00675, 2],
      [-0.00358, 2],
      [-0.00596, 1],
      [-0.00847, 1],
      [-0.0027, 1],
      [-0.00224, 1],
      [-0.00381, 2],
      [-0.00876, 2],
      [-0.00817, 2],
      [-0.00391, 2],
      [-0.00521, 1],
      [-0.00183, 1],
      [-0.00556, 1]
    ],
    "red_o_points": [],
    "y_categories": ["NORM", "NPV", "nan"],
    "blue_o_points": [],
    "blue_x_points": [
      [-0.0003, 1],
      [-0.00194, 1],
      [0.00719, 0],
      [0.00191, 1],
      [0.0146, 0],
      [0.00102, 1],
      [0.01062, 0],
      [0.01042, 0],
      [-0.00226, 2],
      [-0.00076, 2],
      [-0.00324, 2],
      [0.00083, 1],
      [-0.00234, 2],
      [0.00804, 0],
      [0.00744, 0],
      [0.00895, 0],
      [-0.0028, 2],
      [-0.00385, 1],
      [0.01041, 0],
      [0.01252, 0],
      [0.01361, 0]
    ]
  },
  "QA_lstPexKine[Shoulder]": {
    "red_x_points": [
      [0.00153, 1],
      [-0.00167, 2],
      [-0.00252, 2],
      [0.00194, 1],
      [-0.00208, 2],
      [-0.01228, 0],
      [0.00135, 1],
      [0.00109, 1],
      [-0.00105, 2],
      [0.00222, 1],
      [-0.0014, 2],
      [-0.00134, 2],
      [-0.00191, 2],
      [-0.01971, 0],
      [0.00155, 1],
      [0.00093, 1],
      [-0.00148, 2],
      [-0.00245, 2],
      [-0.0056, 2],
      [-0.00178, 2],
      [-0.00088, 2],
      [0.00152, 1],
      [-0.00215, 2]
    ],
    "red_o_points": [],
    "y_categories": ["NPV", "PV", "nan"],
    "blue_o_points": [],
    "blue_x_points": [
      [0.00322, 1],
      [-0.00154, 2],
      [0.00446, 1],
      [0.00645, 1],
      [-0.00047, 2],
      [0.00676, 1],
      [0.00583, 1],
      [0.00551, 1],
      [-0.00075, 2],
      [-0.00064, 2],
      [-0.00177, 2],
      [0.00653, 1],
      [-0.00061, 2],
      [0.00213, 1],
      [0.00227, 1],
      [0.00171, 0],
      [-0.00082, 2],
      [0.00279, 1],
      [-0.00036, 2],
      [0.00289, 1],
      [0.00259, 1]
    ]
  },
  "QA_yonInjBpsurg": {
    "red_x_points": [
      [-0.00735, 0],
      [0.00038, 1],
      [0.00027, 1],
      [0.00097, 1],
      [0.00015, 1],
      [0.00081, 1],
      [0.00066, 1],
      [-0.00953, 0],
      [0.00014, 1],
      [0.00062, 1],
      [0.0005, 1],
      [0.00031, 1],
      [0.00057, 1],
      [0.00104, 1],
      [-0.0102, 0],
      [0.0005, 1],
      [-0.00067, 1],
      [-0.00069, 1],
      [0.00055, 1],
      [-0.0006, 1],
      [-0.00867, 0],
      [0.00039, 1],
      [0.00066, 1]
    ],
    "red_o_points": [],
    "y_categories": ["N", "Y", "nan"],
    "blue_o_points": [],
    "blue_x_points": [
      [0.00201, 1],
      [0.00145, 1],
      [0.00206, 1],
      [0.00163, 1],
      [0.00077, 1],
      [0.00216, 1],
      [0.00204, 1],
      [0.00165, 1],
      [0.00062, 1],
      [0.00231, 0],
      [0.00032, 1],
      [0.00141, 1],
      [0.00052, 1],
      [0.00191, 1],
      [0.00181, 1],
      [0.00123, 1],
      [0.00029, 1],
      [0.00202, 1],
      [-0.00015, 0],
      [0.00189, 1],
      [0.00125, 1]
    ]
  },
  "QA_lstPexPalle[Clavicle]": {
    "red_x_points": [
      [-0.00082, 3],
      [-0.00073, 3],
      [-0.00112, 3],
      [0.00679, 2],
      [-0.00095, 3],
      [-0.00074, 3],
      [-0.01292, 0],
      [-0.01177, 0],
      [-0.00072, 3],
      [-0.00109, 3],
      [-0.00097, 3],
      [-0.00057, 3],
      [-0.00079, 3],
      [-0.01798, 0],
      [-0.00058, 3],
      [-0.01213, 0],
      [-0.00475, 1],
      [-0.00096, 3],
      [-0.0014, 3],
      [-0.00078, 3],
      [0.00656, 2],
      [-0.01024, 0],
      [-0.00067, 3]
    ],
    "red_o_points": [],
    "y_categories": ["HYPO", "NAIA", "PT", "nan"],
    "blue_o_points": [],
    "blue_x_points": [
      [-0.00034, 3],
      [-0.00046, 3],
      [0.01055, 2],
      [0.01282, 2],
      [-0.00039, 3],
      [-0.00077, 3],
      [0.01383, 2],
      [0.01086, 2],
      [-0.00066, 3],
      [-0.00058, 3],
      [-0.00091, 3],
      [-0.00033, 3],
      [-0.00049, 3],
      [-0.00771, 0],
      [0.00936, 2],
      [0.0064, 1],
      [-0.0008, 3],
      [0.00834, 2],
      [-0.00011, 3],
      [0.01118, 2],
      [-0.00048, 3]
    ]
  },
  "QA_txtInjMedicatioListNer": {
    "red_x_points": [
      [-0.00622, 1],
      [-0.00593, 1],
      [-0.00531, 1],
      [-0.0043, 1],
      [-0.00644, 1],
      [-0.00055, 2],
      [-0.00586, 1],
      [0.00451, 0],
      [-0.00563, 2],
      [-0.0025, 2],
      [-0.00164, 2],
      [-0.00235, 2],
      [-0.00725, 1],
      [-0.00631, 1],
      [-0.00065, 2],
      [-0.00562, 1],
      [-0.00175, 2],
      [-0.00666, 1],
      [-0.00831, 1],
      [-0.00595, 1],
      [-0.00381, 1],
      [-0.00022, 2],
      [-0.0021, 2]
    ],
    "red_o_points": [],
    "y_categories": ["N", "Y", "nan"],
    "blue_o_points": [],
    "blue_x_points": [
      [0.02511, 0],
      [0.00087, 2],
      [0.0122, 0],
      [-0.00385, 1],
      [0.00108, 2],
      [0.0017, 2],
      [0.00236, 2],
      [-0.00418, 1],
      [-0.00338, 1],
      [-0.00431, 1],
      [0.02515, 0],
      [-0.00013, 2],
      [0.02015, 0],
      [-0.00396, 1],
      [0.00143, 2],
      [0.0005, 2],
      [-0.00396, 1],
      [0.01364, 0],
      [0.01519, 0],
      [-0.00454, 1],
      [-0.00023, 2]
    ]
  },
  "QA_lstPexTouch[C5]": {
    "red_x_points": [
      [-0.00075, 0],
      [-0.0001, 2],
      [-0.00143, 1],
      [-0.00062, 1],
      [-0.00096, 2],
      [-0.00042, 1],
      [-0.00111, 1],
      [-0.00315, 1],
      [-0.00076, 2],
      [-0.00052, 2],
      [-0.00227, 1],
      [-0.00039, 2],
      [-0.00256, 1],
      [-0.00082, 1],
      [-0.00302, 1],
      [-0.00095, 1],
      [-0.00095, 2],
      [-0.00403, 1],
      [-0.00161, 1],
      [-0.00159, 2],
      [-0.00301, 1],
      [-0.00024, 1],
      [-0.00278, 1]
    ],
    "red_o_points": [],
    "y_categories": ["NORM", "NPV", "nan"],
    "blue_o_points": [],
    "blue_x_points": [
      [-0.00122, 1],
      [-0.00182, 1],
      [-0.00052, 1],
      [-0.00049, 1],
      [0.0121, 0],
      [-0.00036, 1],
      [-0.00039, 1],
      [-0.00041, 1],
      [0.00153, 2],
      [0.00367, 2],
      [0.00028, 2],
      [-0.00064, 1],
      [0.00169, 2],
      [-0.0011, 1],
      [0.00604, 0],
      [-0.00068, 1],
      [0.00149, 2],
      [0.00643, 0],
      [0.01042, 0],
      [-0.00088, 1],
      [-0.00112, 1]
    ]
  },
  "QS_mulGraftNerve[LT]": {
    "red_x_points": [
      [-0.00045, 1],
      [-0.0005, 0],
      [-0.00021, 0],
      [0.0001, 0],
      [-0.00026, 0],
      [5e-5, 0],
      [0.0, 2],
      [-0.00115, 1],
      [0.00022, 2],
      [-0.00047, 0],
      [9e-5, 2],
      [-0.00065, 0],
      [0.0, 2],
      [-2e-5, 0],
      [-0.00099, 1],
      [-6e-5, 2],
      [-0.00046, 0],
      [0.00016, 2],
      [-0.00033, 0],
      [-0.00068, 0],
      [-0.00042, 1],
      [1e-5, 0],
      [5e-5, 2]
    ],
    "red_o_points": [],
    "y_categories": ["N", "NOT APPLICABLE", "nan"],
    "blue_o_points": [],
    "blue_x_points": [
      [0.00018, 2],
      [0.00026, 2],
      [0.00017, 0],
      [0.00025, 0],
      [0.00022, 2],
      [0.0005, 0],
      [0.00024, 0],
      [9e-5, 0],
      [0.00036, 2],
      [0.00151, 1],
      [-0.00024, 0],
      [0.00025, 0],
      [0.00048, 2],
      [0.00023, 2],
      [0.00016, 2],
      [0.00017, 2],
      [0.00049, 2],
      [0.00011, 2],
      [0.00029, 1],
      [0.0002, 2],
      [3e-5, 2]
    ]
  },
  "QA_lstPexMuscstrength[ThumbOppo]": {
    "red_x_points": [
      [0.00041, 2],
      [0.00038, 2],
      [-0.01002, 1],
      [-0.01835, 1],
      [-0.00748, 1],
      [-0.01149, 1],
      [0.0006, 0],
      [0.00265, 0],
      [0.00038, 2],
      [0.00019, 2],
      [-0.00076, 0],
      [0.00047, 2],
      [-0.00822, 1],
      [0.00374, 0],
      [0.00284, 0],
      [-0.00605, 1],
      [-0.00748, 1],
      [0.00038, 2],
      [0.00368, 0],
      [-0.00805, 1],
      [0.00011, 2],
      [-0.00873, 1],
      [-0.00079, 2]
    ],
    "red_o_points": [],
    "y_categories": ["GREATER THAN OR EQUALS TO 3", "LESS THAN 3", "nan"],
    "blue_o_points": [],
    "blue_x_points": [
      [-0.00266, 1],
      [-0.00188, 1],
      [0.00434, 0],
      [0.00651, 0],
      [0.00651, 0],
      [0.00728, 0],
      [0.00607, 0],
      [0.00851, 0],
      [0.00144, 2],
      [0.00126, 2],
      [0.00198, 2],
      [0.00618, 2],
      [0.00134, 2],
      [0.00398, 0],
      [0.00375, 0],
      [0.00542, 0],
      [0.00199, 2],
      [0.00092, 2],
      [0.00531, 0],
      [0.00196, 2],
      [0.00138, 2]
    ]
  },
  "QA_lstPexTouch[T1]": {
    "red_x_points": [
      [-0.00792, 1],
      [-0.00256, 2],
      [-0.00604, 1],
      [0.00666, 0],
      [-0.0026, 2],
      [-0.00685, 1],
      [0.00476, 0],
      [-0.00887, 1],
      [-0.00225, 2],
      [-0.00461, 2],
      [-0.00792, 1],
      [-0.00308, 2],
      [-0.00675, 1],
      [-0.01077, 1],
      [-0.00824, 1],
      [-0.00547, 1],
      [-0.00284, 2],
      [0.00382, 0],
      [-0.00774, 1],
      [-0.00398, 2],
      [-0.00933, 1],
      [-0.00508, 1],
      [-0.0073, 1]
    ],
    "red_o_points": [],
    "y_categories": ["NORM", "NPV", "nan"],
    "blue_o_points": [],
    "blue_x_points": [
      [-0.00541, 1],
      [-0.00492, 1],
      [0.0122, 0],
      [-0.00458, 1],
      [-0.00475, 1],
      [0.01576, 0],
      [0.01659, 0],
      [0.01415, 0],
      [0.0001, 2],
      [0.00157, 2],
      [-0.0007, 2],
      [-0.00492, 1],
      [0.00035, 2],
      [0.01132, 0],
      [0.01018, 0],
      [0.01115, 0],
      [0.00121, 2],
      [-0.00565, 1],
      [0.01398, 0],
      [0.012, 0],
      [0.01534, 0]
    ]
  },
  "QS_mulTransfSite[IAx]": {
    "red_x_points": [
      [-0.00012, 1],
      [-5e-5, 0],
      [4e-5, 2],
      [-0.00012, 1],
      [0.0, 2],
      [2e-5, 0],
      [0.0, 2],
      [-5e-5, 0],
      [-0.00015, 0],
      [-0.00012, 1],
      [-5e-5, 0],
      [-5e-5, 2],
      [-5e-5, 0],
      [-0.0001, 0],
      [2e-5, 0],
      [0.0, 2]
    ],
    "red_o_points": [],
    "y_categories": ["N", "NOT APPLICABLE", "nan"],
    "blue_o_points": [],
    "blue_x_points": [
      [4e-5, 2],
      [2e-5, 0],
      [2e-5, 0],
      [5e-5, 2],
      [2e-5, 0],
      [2e-5, 0],
      [0.0, 2],
      [0.00026, 1],
      [-5e-5, 0],
      [2e-5, 0],
      [0.0, 2],
      [5e-5, 2],
      [4e-5, 2],
      [0.0, 2],
      [4e-5, 2],
      [0.00016, 1],
      [4e-5, 2],
      [4e-5, 2]
    ]
  },
  "QS_mulGraftNerve[MC]": {
    "red_x_points": [
      [-0.00067, 1],
      [-0.00025, 0],
      [-0.00016, 0],
      [7e-5, 0],
      [-0.00013, 0],
      [-5e-5, 0],
      [-0.00023, 2],
      [-0.00049, 1],
      [0.0001, 2],
      [-0.00035, 0],
      [-5e-5, 2],
      [-0.0003, 0],
      [7e-5, 2],
      [-0.00016, 0],
      [-0.00081, 1],
      [3e-5, 2],
      [-0.0003, 0],
      [0.00014, 2],
      [-0.00019, 0],
      [-0.00052, 0],
      [-0.00039, 1],
      [1e-5, 0],
      [3e-5, 2]
    ],
    "red_o_points": [],
    "y_categories": ["N", "NOT APPLICABLE", "nan"],
    "blue_o_points": [],
    "blue_x_points": [
      [9e-5, 2],
      [2e-5, 2],
      [0.0001, 0],
      [8e-5, 0],
      [0.00011, 2],
      [0.00028, 0],
      [0.00029, 0],
      [9e-5, 0],
      [0.00048, 2],
      [0.00077, 1],
      [-5e-5, 0],
      [0.00028, 0],
      [0.00046, 2],
      [0.00015, 2],
      [0.00013, 2],
      [3e-5, 2],
      [0.00047, 2],
      [0.00014, 2],
      [0.00024, 1],
      [0.00029, 2],
      [0.00014, 2]
    ]
  },
  "QA_lstPexKine[Elbow]": {
    "red_x_points": [
      [-1e-5, 1],
      [-0.00117, 2],
      [-0.002, 2],
      [0.00181, 1],
      [-0.00166, 2],
      [-0.00833, 0],
      [0.00047, 1],
      [-8e-5, 1],
      [-0.00092, 2],
      [0.00107, 1],
      [-0.00139, 2],
      [-0.00108, 2],
      [-0.00211, 2],
      [0.00129, 1],
      [0.0005, 1],
      [-0.00295, 0],
      [-0.00148, 2],
      [-0.00173, 2],
      [-0.00231, 2],
      [-0.00103, 2],
      [-0.00061, 2],
      [-0.0057, 0],
      [-0.00188, 2]
    ],
    "red_o_points": [],
    "y_categories": ["NPV", "PV", "nan"],
    "blue_o_points": [],
    "blue_x_points": [
      [0.00346, 0],
      [-0.00096, 2],
      [0.00143, 1],
      [0.00408, 1],
      [-0.00054, 2],
      [0.00458, 1],
      [0.00258, 1],
      [0.00276, 1],
      [-0.00039, 2],
      [-0.00027, 2],
      [-0.00116, 2],
      [0.00475, 1],
      [-0.00042, 2],
      [0.00152, 1],
      [0.00165, 1],
      [0.00232, 0],
      [-0.00056, 2],
      [0.00134, 1],
      [-1e-5, 2],
      [0.00283, 1],
      [0.00231, 1]
    ]
  },
  "QS_mulGraftLevel[Trunk]": {
    "red_x_points": [
      [-0.00541, 1],
      [-0.00422, 0],
      [-0.00146, 0],
      [4e-5, 0],
      [-0.00241, 0],
      [2e-5, 0],
      [0.00067, 3],
      [-0.00655, 1],
      [0.00285, 3],
      [-0.01537, 2],
      [0.0012, 3],
      [-0.0036, 0],
      [0.00076, 3],
      [-0.00011, 0],
      [-0.00889, 1],
      [0.00068, 3],
      [-0.00322, 0],
      [0.00153, 3],
      [-0.00113, 0],
      [-0.00362, 0],
      [-0.00469, 1],
      [0.00035, 0],
      [0.00107, 3]
    ],
    "red_o_points": [],
    "y_categories": ["N", "NOT APPLICABLE", "Y", "nan"],
    "blue_o_points": [],
    "blue_x_points": [
      [0.00242, 3],
      [0.00161, 3],
      [0.00115, 0],
      [0.00236, 0],
      [0.00114, 3],
      [0.00208, 0],
      [0.00157, 0],
      [0.00081, 0],
      [0.00504, 3],
      [0.00969, 1],
      [-0.00187, 0],
      [0.00279, 0],
      [0.00466, 3],
      [0.00142, 3],
      [0.00207, 3],
      [0.00112, 3],
      [0.00452, 3],
      [0.00229, 3],
      [0.00151, 1],
      [0.00268, 3],
      [0.00248, 3]
    ]
  },
  "QS_mulLysisNerve[Ssr]": {
    "red_x_points": [
      [-0.00516, 1],
      [-0.00159, 0],
      [-0.00899, 2],
      [-0.017, 2],
      [-0.00092, 0],
      [0.001, 0],
      [0.00103, 3],
      [-0.00519, 1],
      [0.00134, 3],
      [-0.00129, 0],
      [0.00141, 3],
      [-0.00116, 0],
      [0.00141, 3],
      [0.00042, 0],
      [-0.00617, 1],
      [0.00099, 3],
      [-0.00089, 0],
      [0.00142, 3],
      [0.00021, 0],
      [-0.00102, 0],
      [-0.00543, 1],
      [0.0011, 0],
      [0.00146, 3]
    ],
    "red_o_points": [],
    "y_categories": ["N", "NOT APPLICABLE", "Y", "nan"],
    "blue_o_points": [],
    "blue_x_points": [
      [0.00214, 3],
      [0.00215, 3],
      [0.0018, 0],
      [0.00284, 0],
      [0.00202, 3],
      [0.00268, 0],
      [0.00235, 0],
      [0.00268, 0],
      [0.00196, 3],
      [0.00293, 1],
      [-0.00081, 0],
      [0.00329, 0],
      [0.00174, 3],
      [0.00173, 3],
      [0.00212, 3],
      [0.0017, 3],
      [0.00199, 3],
      [0.00177, 3],
      [0.0017, 1],
      [0.00269, 3],
      [0.00156, 3]
    ]
  },
  "QA_lstPexKine[Index]": {
    "red_x_points": [
      [0.0002, 1],
      [-0.00156, 2],
      [-0.00239, 2],
      [0.00131, 1],
      [-0.0021, 2],
      [-0.00881, 0],
      [0.00024, 1],
      [0.00021, 1],
      [-0.00079, 2],
      [0.00161, 1],
      [-0.00198, 2],
      [-0.00155, 2],
      [-0.00187, 2],
      [0.00145, 1],
      [0.00045, 1],
      [-0.00209, 0],
      [-0.00123, 2],
      [-0.0017, 2],
      [-0.0038, 2],
      [-0.00099, 2],
      [-0.00045, 2],
      [-0.00679, 0],
      [-0.00186, 2]
    ],
    "red_o_points": [],
    "y_categories": ["NPV", "PV", "nan"],
    "blue_o_points": [],
    "blue_x_points": [
      [0.00418, 0],
      [-0.00103, 2],
      [0.00154, 1],
      [0.00489, 1],
      [-0.00058, 2],
      [0.00522, 1],
      [0.00296, 1],
      [0.00298, 1],
      [-0.0004, 2],
      [-0.00035, 2],
      [-0.00105, 2],
      [0.0065, 1],
      [-0.00056, 2],
      [0.00116, 1],
      [0.00078, 1],
      [0.0037, 0],
      [-0.00059, 2],
      [0.00114, 1],
      [-0.00017, 2],
      [0.00243, 1],
      [0.00175, 1]
    ]
  },
  "QS_mulGraftRoot[C6]": {
    "red_x_points": [[-0.00017, 1]],
    "red_o_points": [],
    "y_categories": ["N", "NOT APPLICABLE", "nan"],
    "blue_o_points": [],
    "blue_x_points": [
      [2e-5, 0],
      [2e-5, 0],
      [2e-5, 0],
      [2e-5, 0],
      [2e-5, 2],
      [2e-5, 2],
      [2e-5, 2]
    ]
  },
  "QA_yonInjDisloc": {
    "red_x_points": [
      [-1e-5, 2],
      [-2e-5, 2],
      [-2e-5, 2],
      [1e-5, 2],
      [-3e-5, 2],
      [-3e-5, 2],
      [-0.0001, 2],
      [-0.00012, 2],
      [-2e-5, 2],
      [-2e-5, 2],
      [-0.0, 2],
      [-3e-5, 2],
      [2e-5, 2],
      [-8e-5, 2],
      [-0.00958, 1],
      [-0.00017, 2],
      [-3e-5, 2],
      [-3e-5, 2],
      [2e-5, 2],
      [-1e-5, 2],
      [-1e-5, 2],
      [-0.00644, 1],
      [-2e-5, 2]
    ],
    "red_o_points": [],
    "y_categories": ["N", "Y", "nan"],
    "blue_o_points": [],
    "blue_x_points": [
      [3e-5, 2],
      [1e-5, 2],
      [4e-5, 2],
      [3e-5, 2],
      [5e-5, 2],
      [3e-5, 2],
      [3e-5, 2],
      [4e-5, 2],
      [5e-5, 2],
      [3e-5, 2],
      [-2e-5, 2],
      [3e-5, 2],
      [0.00782, 0],
      [0.00837, 0],
      [6e-5, 2],
      [2e-5, 2],
      [-0.0, 2],
      [2e-5, 2],
      [0.00011, 2],
      [-1e-5, 2],
      [-2e-5, 2]
    ]
  },
  "QA_lstPexInspectio[ScapulaAlata]": {
    "red_x_points": [
      [-0.00155, 1],
      [-0.00021, 1],
      [-0.0005, 1],
      [-0.00042, 1],
      [-0.00032, 1],
      [-0.00026, 1],
      [-0.00087, 1],
      [-0.00237, 1],
      [-0.00067, 1],
      [-0.00021, 1],
      [-0.00062, 1],
      [-0.00023, 1],
      [-0.00044, 1],
      [-0.00106, 1],
      [-0.00134, 1],
      [-0.0007, 1],
      [-0.00021, 1],
      [-0.00088, 1],
      [-0.00042, 1],
      [-0.00056, 1],
      [-0.001, 1],
      [-0.00061, 1],
      [-0.00029, 1]
    ],
    "red_o_points": [],
    "y_categories": ["ABS", "NAIA", "PT", "nan"],
    "blue_o_points": [],
    "blue_x_points": [
      [-0.00054, 1],
      [-0.00033, 1],
      [-0.00042, 1],
      [-0.00049, 1],
      [-0.00045, 1],
      [-0.00041, 1],
      [-0.00038, 1],
      [-0.00041, 1],
      [-0.00028, 1],
      [-0.0007, 1],
      [-0.00028, 1],
      [-0.00036, 1],
      [-0.00026, 1],
      [0.00919, 0],
      [-0.00043, 1],
      [-0.00035, 1],
      [-0.00057, 1],
      [-0.00026, 1],
      [0.01418, 2],
      [-0.00044, 1],
      [-0.0003, 1]
    ]
  },
  "QA_yonInjFracture": {
    "red_x_points": [
      [0.00481, 0],
      [-0.00295, 2],
      [0.00366, 0],
      [-0.00403, 2],
      [-0.00936, 1],
      [-0.01135, 1],
      [0.00192, 0],
      [0.00221, 0],
      [-0.01181, 1],
      [-0.01001, 1],
      [0.00355, 0],
      [-0.00931, 1],
      [-0.01222, 1],
      [-0.00066, 0],
      [-0.01276, 1],
      [-0.00819, 1],
      [-0.00729, 1],
      [0.00306, 0],
      [0.00307, 0],
      [0.00496, 0],
      [-0.00856, 1],
      [-0.00639, 1],
      [-0.01655, 1]
    ],
    "red_o_points": [],
    "y_categories": ["N", "Y", "nan"],
    "blue_o_points": [],
    "blue_x_points": [
      [0.00868, 0],
      [0.00997, 0],
      [0.00341, 0],
      [0.00617, 0],
      [0.00813, 2],
      [0.00707, 0],
      [0.00145, 1],
      [6e-5, 1],
      [-0.00764, 1],
      [0.00732, 0],
      [0.00969, 0],
      [0.00906, 0],
      [0.00805, 0],
      [0.00355, 0],
      [0.00359, 0],
      [0.00429, 2],
      [0.00924, 0],
      [0.00486, 0],
      [0.00382, 0],
      [-0.0037, 1],
      [0.00712, 2]
    ]
  },
  "QS_mulTransfSite[MeBr]": {
    "red_x_points": [
      [-9e-5, 0],
      [-4e-5, 0],
      [-9e-5, 0],
      [-4e-5, 0],
      [9e-5, 2],
      [-9e-5, 0],
      [-9e-5, 0],
      [2e-5, 2],
      [-5e-5, 0],
      [2e-5, 2],
      [-4e-5, 0],
      [-5e-5, 0],
      [2e-5, 2]
    ],
    "red_o_points": [],
    "y_categories": ["N", "NOT APPLICABLE", "nan"],
    "blue_o_points": [],
    "blue_x_points": [
      [2e-5, 2],
      [2e-5, 2],
      [9e-5, 2],
      [0.00012, 1],
      [-5e-5, 0],
      [-4e-5, 0],
      [7e-5, 2],
      [7e-5, 2],
      [0.00014, 1]
    ]
  },
  "QS_mulGraftNerve[Ac]": {
    "red_x_points": [
      [-0.00139, 1],
      [-0.00063, 0],
      [-0.00028, 0],
      [0.00016, 0],
      [-0.00064, 0],
      [5e-5, 0],
      [2e-5, 2],
      [-0.00132, 1],
      [0.0006, 2],
      [-0.00083, 0],
      [0.00014, 2],
      [-0.0009, 0],
      [6e-5, 2],
      [6e-5, 0],
      [-0.00145, 1],
      [0.00011, 2],
      [-0.00064, 0],
      [0.00026, 2],
      [-0.00028, 0],
      [-0.00086, 0],
      [-0.00117, 1],
      [8e-5, 0],
      [7e-5, 2]
    ],
    "red_o_points": [],
    "y_categories": ["N", "NOT APPLICABLE", "nan"],
    "blue_o_points": [],
    "blue_x_points": [
      [0.00041, 2],
      [0.00022, 2],
      [0.00018, 0],
      [0.00046, 0],
      [0.00024, 2],
      [0.00049, 0],
      [0.0002, 0],
      [0.0001, 0],
      [0.00059, 2],
      [0.00213, 1],
      [-0.00057, 0],
      [0.00068, 0],
      [0.00066, 2],
      [9e-5, 2],
      [0.00024, 2],
      [0.00014, 2],
      [0.00103, 2],
      [0.00028, 2],
      [0.00052, 1],
      [0.00031, 2],
      [0.00038, 2]
    ]
  },
  "QS_mulNeuromadSite[C8]": {
    "red_x_points": [
      [-0.00312, 1],
      [-0.00216, 0],
      [-0.00101, 0],
      [-2e-5, 0],
      [-0.00148, 0],
      [0.00019, 0],
      [0.00022, 2],
      [-0.00366, 1],
      [0.00137, 2],
      [-0.00152, 0],
      [0.00061, 2],
      [-0.00207, 0],
      [0.00032, 2],
      [-0.00012, 0],
      [-0.00486, 1],
      [5e-5, 2],
      [-0.00134, 0],
      [0.00053, 2],
      [-0.00096, 0],
      [-0.00224, 0],
      [-0.00274, 1],
      [0.00016, 0],
      [0.00017, 2]
    ],
    "red_o_points": [],
    "y_categories": ["N", "NOT APPLICABLE", "nan"],
    "blue_o_points": [],
    "blue_x_points": [
      [0.00094, 2],
      [0.00043, 2],
      [0.00067, 0],
      [0.00095, 0],
      [0.00074, 2],
      [0.00128, 0],
      [0.00057, 0],
      [0.00051, 0],
      [0.00166, 2],
      [0.00512, 1],
      [-0.00121, 0],
      [0.00158, 0],
      [0.00166, 2],
      [0.00112, 2],
      [0.001, 2],
      [0.00063, 2],
      [0.0019, 2],
      [0.00113, 2],
      [0.00095, 1],
      [0.00115, 2],
      [0.00089, 2]
    ]
  },
  "QA_lstPexMuscstrength[FingersFlex]": {
    "red_x_points": [
      [0.00222, 2],
      [0.00195, 2],
      [-0.02542, 1],
      [0.00821, 0],
      [-0.0257, 1],
      [-0.02548, 1],
      [-0.028, 1],
      [0.00816, 0],
      [0.00252, 2],
      [0.00246, 2],
      [0.00774, 0],
      [0.002, 2],
      [-0.02888, 1],
      [0.0075, 0],
      [0.00732, 0],
      [-0.02753, 1],
      [-0.02548, 1],
      [0.00256, 2],
      [0.00831, 0],
      [0.00798, 0],
      [0.00238, 2],
      [-0.02491, 1],
      [0.00216, 2]
    ],
    "red_o_points": [],
    "y_categories": ["GREATER THAN OR EQUALS TO 3", "LESS THAN 3", "nan"],
    "blue_o_points": [],
    "blue_x_points": [
      [0.01055, 0],
      [0.01038, 0],
      [0.00817, 0],
      [0.0087, 0],
      [0.00929, 0],
      [0.00899, 0],
      [0.00814, 0],
      [0.00863, 0],
      [0.00336, 2],
      [0.0031, 2],
      [0.00323, 2],
      [0.00408, 2],
      [0.0033, 2],
      [0.00841, 0],
      [0.00892, 0],
      [0.00888, 0],
      [0.00362, 2],
      [0.0031, 2],
      [0.00851, 0],
      [0.00333, 2],
      [0.00327, 2]
    ]
  },
  "QA_lstPexPalle[Elbow]": {
    "red_x_points": [
      [-0.00158, 4],
      [-0.00131, 4],
      [-0.00136, 4],
      [0.00939, 3],
      [-0.00136, 4],
      [-0.00131, 4],
      [-0.01455, 1],
      [-0.01229, 1],
      [-0.00145, 4],
      [-0.00138, 4],
      [-0.00136, 4],
      [-0.00119, 4],
      [-0.0012, 4],
      [-0.01591, 1],
      [-0.00129, 4],
      [-0.02081, 0],
      [-0.01711, 2],
      [-0.0015, 4],
      [-0.00152, 4],
      [-0.00175, 4],
      [0.01029, 3],
      [-0.01851, 0],
      [-0.00142, 4]
    ],
    "red_o_points": [],
    "y_categories": ["ABS", "HYPO", "NAIA", "PT", "nan"],
    "blue_o_points": [],
    "blue_x_points": [
      [-0.00114, 4],
      [-0.00114, 4],
      [0.01301, 3],
      [0.01692, 3],
      [-0.00074, 4],
      [-0.00122, 4],
      [-0.00536, 1],
      [0.015, 3],
      [-0.00111, 4],
      [-0.00096, 4],
      [-0.00114, 4],
      [-0.00103, 4],
      [-0.00101, 4],
      [0.01496, 3],
      [0.01462, 3],
      [0.01405, 3],
      [-0.00118, 4],
      [0.01358, 3],
      [-0.0005, 4],
      [0.01596, 3],
      [-0.00111, 4]
    ]
  },
  "QS_mulGraftRoot[C5]": {
    "red_x_points": [
      [-0.00126, 1],
      [-0.00052, 0],
      [-0.00012, 0],
      [0.00015, 0],
      [-0.00019, 0],
      [-0.0, 0],
      [4e-5, 2],
      [-0.00122, 1],
      [0.00035, 2],
      [-0.00032, 0],
      [0.00011, 2],
      [-0.00038, 0],
      [5e-5, 2],
      [-0.00015, 0],
      [-0.00094, 1],
      [8e-5, 2],
      [-0.00034, 0],
      [0.00011, 2],
      [-0.0003, 0],
      [-0.00045, 0],
      [-0.00073, 1],
      [0.0002, 0],
      [9e-5, 2]
    ],
    "red_o_points": [],
    "y_categories": ["N", "NOT APPLICABLE", "nan"],
    "blue_o_points": [],
    "blue_x_points": [
      [0.00031, 2],
      [0.0002, 2],
      [9e-5, 0],
      [0.00034, 0],
      [9e-5, 2],
      [0.00043, 0],
      [0.00015, 0],
      [9e-5, 0],
      [0.00027, 2],
      [0.00113, 1],
      [-0.00038, 0],
      [0.00029, 0],
      [0.00028, 2],
      [0.0004, 2],
      [0.00033, 2],
      [0.00015, 2],
      [0.00037, 2],
      [0.00019, 2],
      [0.00027, 1],
      [0.00037, 2],
      [0.00035, 2]
    ]
  },
  "QA_lstPexMuscstrength[ScapulaAbducSuprot]": {
    "red_x_points": [
      [-0.00089, 2],
      [-0.00055, 2],
      [-0.00558, 1],
      [-0.00126, 2],
      [-0.00517, 1],
      [-0.0081, 1],
      [-0.00807, 1],
      [0.00239, 0],
      [-0.00088, 2],
      [-0.00113, 2],
      [-0.00308, 2],
      [-0.00034, 2],
      [-0.00767, 1],
      [-0.00085, 0],
      [0.00341, 0],
      [-0.00828, 1],
      [-0.00313, 1],
      [-0.00143, 2],
      [-0.0065, 1],
      [0.00199, 0],
      [-0.00134, 2],
      [-0.00344, 1],
      [-0.00445, 2]
    ],
    "red_o_points": [],
    "y_categories": ["GREATER THAN OR EQUALS TO 3", "LESS THAN 3", "nan"],
    "blue_o_points": [],
    "blue_x_points": [
      [0.01565, 0],
      [0.01521, 0],
      [0.00385, 0],
      [-0.0015, 1],
      [-0.00219, 1],
      [0.00917, 0],
      [0.00633, 0],
      [-0.00018, 1],
      [-0.00043, 2],
      [0.00033, 2],
      [0.0011, 2],
      [0.00219, 2],
      [0.00012, 2],
      [0.00532, 0],
      [0.00568, 0],
      [-0.00038, 2],
      [0.00043, 2],
      [0.00482, 0],
      [0.00133, 2],
      [-0.00191, 1],
      [-0.00059, 2]
    ]
  },
  "QA_lstPexArthre[Elbow]": {
    "red_x_points": [
      [0.00012, 2],
      [-0.0011, 3],
      [-0.00177, 3],
      [0.00054, 2],
      [-0.00666, 0],
      [-0.00634, 1],
      [-0.00179, 2],
      [-0.00022, 2],
      [-0.00112, 3],
      [0.00142, 2],
      [-0.00204, 3],
      [-0.00112, 3],
      [-0.00196, 3],
      [0.00096, 2],
      [0.0002, 2],
      [-0.00303, 2],
      [-0.00127, 3],
      [-0.00181, 3],
      [-0.0028, 3],
      [-0.00094, 3],
      [-0.0005, 3],
      [0.00073, 2],
      [-0.00233, 3]
    ],
    "red_o_points": [],
    "y_categories": ["NAIA", "NPV", "PV", "nan"],
    "blue_o_points": [],
    "blue_x_points": [
      [0.01415, 1],
      [-0.0011, 3],
      [0.00136, 2],
      [0.00211, 2],
      [-0.00056, 3],
      [0.00349, 2],
      [0.0019, 2],
      [0.00195, 2],
      [-0.00087, 3],
      [-0.00042, 3],
      [-0.00072, 3],
      [0.00426, 2],
      [-0.00064, 3],
      [0.0005, 2],
      [0.00079, 2],
      [0.00467, 1],
      [-0.00071, 3],
      [0.00082, 2],
      [-0.00037, 3],
      [0.00093, 2],
      [0.00128, 2]
    ]
  },
  "QA_lstPexMuscstrength[ShoulderExrot]": {
    "red_x_points": [
      [-0.00037, 2],
      [-0.00016, 2],
      [-0.01454, 0],
      [-0.00029, 2],
      [0.00342, 1],
      [-0.00023, 2],
      [0.00247, 1],
      [-0.01658, 0],
      [-0.00036, 2],
      [-0.0002, 2],
      [-0.00106, 2],
      [-0.00011, 2],
      [-0.00022, 2],
      [0.00344, 1],
      [-0.02181, 0],
      [0.00217, 1],
      [-2e-5, 2],
      [0.00015, 2],
      [0.00436, 1],
      [-0.01609, 0],
      [-0.00054, 2],
      [0.00233, 1],
      [-0.00022, 2]
    ],
    "red_o_points": [],
    "y_categories": ["GREATER THAN OR EQUALS TO 3", "LESS THAN 3", "nan"],
    "blue_o_points": [],
    "blue_x_points": [
      [0.00688, 1],
      [0.00032, 2],
      [0.00449, 1],
      [0.00508, 1],
      [0.00534, 1],
      [0.00705, 1],
      [0.00452, 1],
      [0.00041, 2],
      [0.00011, 2],
      [0.00044, 2],
      [0.00042, 2],
      [0.0004, 2],
      [0.00046, 2],
      [0.00435, 1],
      [0.00475, 1],
      [0.0, 2],
      [0.00028, 2],
      [0.00066, 2],
      [0.00844, 1],
      [0.00012, 2],
      [-4e-5, 2]
    ]
  },
  "QS_mulGraftNerve[Ul]": {
    "red_x_points": [
      [-0.00055, 1],
      [-0.00041, 0],
      [-0.0001, 0],
      [0.00017, 0],
      [-0.00029, 0],
      [0.00021, 0],
      [-3e-5, 2],
      [-0.00113, 1],
      [0.00024, 2],
      [-0.00033, 0],
      [8e-5, 2],
      [-0.00029, 0],
      [4e-5, 2],
      [7e-5, 0],
      [-0.00125, 1],
      [2e-5, 2],
      [-0.0002, 0],
      [0.00016, 2],
      [-0.00011, 0],
      [-0.00045, 0],
      [-0.00063, 1],
      [0.00016, 0],
      [7e-5, 2]
    ],
    "red_o_points": [],
    "y_categories": ["N", "NOT APPLICABLE", "nan"],
    "blue_o_points": [],
    "blue_x_points": [
      [8e-5, 2],
      [8e-5, 2],
      [5e-5, 0],
      [0.00042, 0],
      [1e-5, 2],
      [0.00033, 0],
      [0.00038, 0],
      [0.00011, 0],
      [0.00031, 2],
      [0.00115, 1],
      [-0.00011, 0],
      [0.00041, 0],
      [0.00047, 2],
      [0.00015, 2],
      [0.00011, 2],
      [6e-5, 2],
      [0.00034, 2],
      [0.00011, 2],
      [-0.0001, 1],
      [0.0001, 2],
      [0.00011, 2]
    ]
  },
  "QS_mulGraftNerve[Ssr]": {
    "red_x_points": [
      [-0.0017, 1],
      [-0.00077, 0],
      [-0.00018, 0],
      [6e-5, 0],
      [-0.00044, 0],
      [3e-5, 0],
      [0.00014, 2],
      [-0.00152, 1],
      [0.0003, 2],
      [-0.00048, 0],
      [-0.0, 2],
      [-0.00066, 0],
      [0.00028, 2],
      [-0.00016, 0],
      [-0.00206, 1],
      [8e-5, 2],
      [-0.00088, 0],
      [-0.00017, 2],
      [-0.00026, 0],
      [-0.00092, 0],
      [-0.00152, 1],
      [-0.0, 0],
      [0.00019, 2]
    ],
    "red_o_points": [],
    "y_categories": ["N", "NOT APPLICABLE", "nan"],
    "blue_o_points": [],
    "blue_x_points": [
      [0.00043, 2],
      [0.00027, 2],
      [0.00035, 0],
      [0.00046, 0],
      [0.00033, 2],
      [0.00049, 0],
      [0.00035, 0],
      [0.00028, 0],
      [0.00084, 2],
      [0.00231, 1],
      [-0.00039, 0],
      [0.0003, 0],
      [0.00069, 2],
      [0.00054, 2],
      [0.00057, 2],
      [0.00037, 2],
      [0.00078, 2],
      [0.00048, 2],
      [0.00015, 1],
      [0.00055, 2],
      [0.0005, 2]
    ]
  },
  "QS_mulLysisDivision[PDivisionMTrunk]": {
    "red_x_points": [
      [-6e-5, 1],
      [4e-5, 0],
      [4e-5, 0],
      [4e-5, 0],
      [-1e-5, 2],
      [-6e-5, 1],
      [-1e-5, 2],
      [-1e-5, 2],
      [-6e-5, 1],
      [-1e-5, 2],
      [4e-5, 0],
      [-6e-5, 1],
      [-1e-5, 2]
    ],
    "red_o_points": [],
    "y_categories": ["N", "NOT APPLICABLE", "nan"],
    "blue_o_points": [],
    "blue_x_points": [
      [-1e-5, 2],
      [-1e-5, 2],
      [4e-5, 0],
      [4e-5, 0],
      [4e-5, 0],
      [4e-5, 0]
    ]
  },
  "QS_mulGraftNerve[MCA]": {
    "red_x_points": [
      [-0.00066, 1],
      [-0.00022, 0],
      [-9e-5, 0],
      [-5e-5, 0],
      [-0.00026, 0],
      [2e-5, 0],
      [-6e-5, 2],
      [-0.00056, 1],
      [5e-5, 2],
      [-0.00034, 0],
      [0.00013, 2],
      [-0.00021, 0],
      [7e-5, 2],
      [-3e-5, 0],
      [-0.00076, 1],
      [-0.00021, 0],
      [-0.00012, 2],
      [-0.00012, 0],
      [-0.00026, 0],
      [-0.00023, 1],
      [2e-5, 0],
      [7e-5, 2]
    ],
    "red_o_points": [],
    "y_categories": ["N", "NOT APPLICABLE", "nan"],
    "blue_o_points": [],
    "blue_x_points": [
      [0.00037, 2],
      [0.0001, 2],
      [0.00022, 0],
      [0.00021, 0],
      [0.00011, 2],
      [0.00025, 0],
      [0.00018, 0],
      [-3e-5, 0],
      [0.00024, 2],
      [0.0009, 1],
      [-0.0001, 0],
      [6e-5, 0],
      [0.00016, 2],
      [8e-5, 2],
      [0.00013, 2],
      [0.00018, 2],
      [0.00022, 2],
      [0.00021, 2],
      [-0.00019, 1],
      [0.00024, 2],
      [0.00027, 2]
    ]
  },
  "QA_lstPexInspectio[Swelling]": {
    "red_x_points": [
      [0.00161, 1],
      [0.00152, 1],
      [-0.00198, 0],
      [0.00187, 1],
      [-0.0126, 2],
      [0.00119, 1],
      [-0.01962, 2],
      [-0.00115, 0],
      [-0.00653, 0],
      [0.001, 1],
      [-0.00579, 0],
      [0.00124, 1],
      [0.00289, 1],
      [-0.03007, 2],
      [0.00176, 1],
      [-0.01498, 2],
      [0.0017, 1],
      [0.00256, 1],
      [0.00124, 1],
      [-0.00249, 0],
      [-0.00445, 0],
      [-0.00083, 0],
      [0.00341, 1]
    ],
    "red_o_points": [],
    "y_categories": ["ABS", "NAIA", "PT", "nan"],
    "blue_o_points": [],
    "blue_x_points": [
      [0.00654, 1],
      [0.00476, 1],
      [0.00366, 0],
      [0.00354, 0],
      [0.00483, 1],
      [0.00311, 1],
      [0.00573, 0],
      [0.00454, 1],
      [0.00477, 1],
      [0.00268, 1],
      [0.00302, 1],
      [0.00394, 1],
      [0.00386, 1],
      [0.00142, 0],
      [0.0041, 1],
      [0.00359, 1],
      [-0.00049, 0],
      [0.00344, 1],
      [0.0023, 0],
      [0.00459, 1],
      [0.00457, 1]
    ]
  },
  "QS_mulLysisNerve[FI]": {
    "red_x_points": [
      [-0.00025, 1],
      [-4e-5, 0],
      [-8e-5, 0],
      [1e-5, 0],
      [5e-5, 0],
      [-0.0, 2],
      [-0.00021, 1],
      [1e-5, 2],
      [-3e-5, 0],
      [3e-5, 2],
      [-4e-5, 0],
      [2e-5, 2],
      [-0.00048, 1],
      [-0.0, 2],
      [-8e-5, 0],
      [1e-5, 2],
      [-8e-5, 0],
      [-3e-5, 0],
      [-5e-5, 1],
      [5e-5, 0],
      [2e-5, 2]
    ],
    "red_o_points": [],
    "y_categories": ["N", "NOT APPLICABLE", "nan"],
    "blue_o_points": [],
    "blue_x_points": [
      [0.00014, 2],
      [1e-5, 2],
      [0.00012, 0],
      [0.00012, 0],
      [2e-5, 2],
      [0.00014, 0],
      [1e-5, 0],
      [1e-5, 0],
      [0.00013, 1],
      [1e-5, 0],
      [0.00015, 0],
      [6e-5, 2],
      [1e-5, 2],
      [1e-5, 2],
      [1e-5, 2],
      [1e-5, 2],
      [5e-5, 2],
      [0.00016, 1]
    ]
  },
  "QS_mulLysisNerve[Ph]": {
    "red_x_points": [
      [-0.00024, 1],
      [-0.0001, 0],
      [-1e-5, 0],
      [3e-5, 0],
      [-0.0001, 0],
      [3e-5, 0],
      [-7e-5, 2],
      [-0.00014, 1],
      [7e-5, 2],
      [-0.0001, 0],
      [-5e-5, 2],
      [-0.0001, 0],
      [2e-5, 2],
      [-0.00013, 0],
      [-0.00024, 1],
      [1e-5, 2],
      [-5e-5, 0],
      [2e-5, 2],
      [-1e-5, 0],
      [-0.00015, 0],
      [-0.00016, 1],
      [2e-5, 2]
    ],
    "red_o_points": [],
    "y_categories": ["N", "NOT APPLICABLE", "nan"],
    "blue_o_points": [],
    "blue_x_points": [
      [2e-5, 2],
      [2e-5, 2],
      [0.00012, 0],
      [3e-5, 0],
      [7e-5, 2],
      [0.00025, 0],
      [3e-5, 0],
      [0.00018, 2],
      [0.00039, 1],
      [-0.0001, 0],
      [0.00011, 0],
      [0.00018, 2],
      [7e-5, 2],
      [3e-5, 2],
      [7e-5, 1]
    ]
  },
  "QS_mulGraftTrunk[UpperTrunk]": {
    "red_x_points": [
      [-0.0075, 1],
      [-0.00478, 0],
      [-0.00242, 0],
      [0.00015, 0],
      [-0.00275, 0],
      [0.00033, 0],
      [0.00091, 3],
      [-0.00847, 1],
      [0.00309, 3],
      [-0.01979, 2],
      [0.0019, 3],
      [-0.00372, 0],
      [0.00088, 3],
      [-0.00014, 0],
      [-0.0107, 1],
      [0.00078, 3],
      [-0.00326, 0],
      [0.00189, 3],
      [-0.00127, 0],
      [-0.00434, 0],
      [-0.00787, 1],
      [0.00022, 0],
      [0.00154, 3]
    ],
    "red_o_points": [],
    "y_categories": ["N", "NOT APPLICABLE", "Y", "nan"],
    "blue_o_points": [],
    "blue_x_points": [
      [0.00306, 3],
      [0.00224, 3],
      [0.00222, 0],
      [0.00279, 0],
      [0.00172, 3],
      [0.0034, 0],
      [0.00274, 0],
      [0.00188, 0],
      [0.00551, 3],
      [0.01082, 1],
      [-0.00154, 0],
      [0.00399, 0],
      [0.00514, 3],
      [0.00243, 3],
      [0.00233, 3],
      [0.00166, 3],
      [0.0053, 3],
      [0.00206, 3],
      [0.00178, 1],
      [0.00316, 3],
      [0.00266, 3]
    ]
  },
  "QA_yonPreFracture": {
    "red_x_points": [
      [-0.02588, 1],
      [0.00174, 2],
      [0.00455, 0],
      [0.00194, 2],
      [0.00493, 0],
      [0.00503, 0],
      [-0.02381, 1],
      [0.00478, 0],
      [0.00186, 2],
      [-0.02472, 1],
      [-0.02618, 1],
      [-0.02342, 1],
      [0.00199, 2],
      [0.00481, 0],
      [0.00502, 0],
      [0.00434, 0],
      [0.00441, 0],
      [0.00612, 0],
      [-0.02651, 1],
      [0.00488, 0],
      [0.00139, 2],
      [-0.02102, 1],
      [0.00155, 2]
    ],
    "red_o_points": [],
    "y_categories": ["N", "Y", "nan"],
    "blue_o_points": [],
    "blue_x_points": [
      [0.00619, 0],
      [0.00385, 2],
      [0.00528, 0],
      [0.00623, 0],
      [0.00415, 2],
      [0.00601, 0],
      [0.00601, 0],
      [0.00457, 2],
      [0.00345, 2],
      [0.00662, 0],
      [0.00721, 0],
      [0.0071, 0],
      [0.0068, 0],
      [0.0054, 0],
      [0.00527, 0],
      [0.00356, 2],
      [0.00665, 0],
      [0.00629, 0],
      [0.00527, 0],
      [0.00292, 2],
      [0.00335, 2]
    ]
  },
  "QS_mulTransfSite[MeMc]": {
    "red_x_points": [
      [-0.00037, 1],
      [-0.00042, 0],
      [-8e-5, 0],
      [3e-5, 0],
      [-2e-5, 0],
      [-6e-5, 0],
      [-7e-5, 2],
      [-0.0004, 1],
      [0.00015, 2],
      [-0.0003, 0],
      [2e-5, 2],
      [-0.00023, 0],
      [3e-5, 2],
      [0.0, 0],
      [-0.00041, 1],
      [0.0, 2],
      [-0.0001, 0],
      [4e-5, 2],
      [-0.00012, 0],
      [-0.00017, 0],
      [-0.00017, 1],
      [7e-5, 0],
      [8e-5, 2]
    ],
    "red_o_points": [],
    "y_categories": ["N", "NOT APPLICABLE", "nan"],
    "blue_o_points": [],
    "blue_x_points": [
      [0.00013, 2],
      [5e-5, 2],
      [0.0, 0],
      [0.00017, 0],
      [0.00017, 2],
      [0.00017, 0],
      [0.00013, 0],
      [-4e-5, 0],
      [0.00014, 2],
      [0.00061, 1],
      [-0.00012, 0],
      [0.00024, 0],
      [9e-5, 2],
      [8e-5, 2],
      [0.00015, 2],
      [8e-5, 2],
      [0.0002, 1],
      [0.00015, 2],
      [8e-5, 2]
    ]
  },
  "QA_lstPexPain[C7]": {
    "red_x_points": [
      [-0.00708, 1],
      [-0.00794, 2],
      [-0.00703, 2],
      [-0.00764, 1],
      [-0.00667, 2],
      [-0.00516, 1],
      [-0.00606, 1],
      [-0.00769, 1],
      [-0.00737, 2],
      [-0.00818, 2],
      [-0.00861, 2],
      [-0.00731, 2],
      [-0.00718, 1],
      [0.0107, 0],
      [-0.00664, 1],
      [-0.0062, 1],
      [-0.00632, 2],
      [-0.00835, 2],
      [-0.00911, 2],
      [-0.00717, 2],
      [-0.00858, 1],
      [-0.00506, 1],
      [-0.00726, 1]
    ],
    "red_o_points": [],
    "y_categories": ["NORM", "NPV", "nan"],
    "blue_o_points": [],
    "blue_x_points": [
      [-0.00541, 1],
      [-0.00536, 1],
      [0.01872, 0],
      [-0.00335, 1],
      [0.02263, 0],
      [-0.00436, 1],
      [0.02183, 0],
      [0.01992, 0],
      [-0.00699, 2],
      [-0.00423, 2],
      [-0.00554, 2],
      [-0.00369, 1],
      [-0.00661, 2],
      [0.01959, 0],
      [0.01695, 0],
      [0.01931, 0],
      [-0.00637, 2],
      [0.01932, 0],
      [0.0226, 0],
      [-0.00646, 1],
      [0.02539, 0]
    ]
  },
  "participant_code": {
    "red_x_points": [
      [-0.03195, 0],
      [-0.03351, 2],
      [-0.03224, 3],
      [-0.03234, 4],
      [-0.03254, 5],
      [-0.03186, 9],
      [-0.03137, 14],
      [-0.02953, 17],
      [-0.03341, 19],
      [-0.03215, 20],
      [-0.03322, 22],
      [-0.03079, 23],
      [-0.03312, 24],
      [-0.03409, 26],
      [-0.03244, 28],
      [-0.03273, 29],
      [-0.0338, 31],
      [-0.03351, 35],
      [-0.03215, 37],
      [-0.03438, 39],
      [-0.03322, 41],
      [-0.03166, 42],
      [-0.03399, 43]
    ],
    "red_o_points": [],
    "y_categories": [
      "P16554",
      "P18297",
      "P19283",
      "P19287",
      "P23172",
      "P23391",
      "P30595",
      "P31645",
      "P31691",
      "P34778",
      "P35046",
      "P36328",
      "P43633",
      "P4544",
      "P46417",
      "P48965",
      "P53068",
      "P5497",
      "P58556",
      "P59529",
      "P62483",
      "P64658",
      "P65202",
      "P66816",
      "P67052",
      "P6751",
      "P7408",
      "P75566",
      "P76226",
      "P79971",
      "P82621",
      "P82990",
      "P84549",
      "P84932",
      "P85825",
      "P86989",
      "P8770",
      "P87791",
      "P90550",
      "P93159",
      "P94969",
      "P96710",
      "P9744",
      "P98500",
      "nan"
    ],
    "blue_o_points": [],
    "blue_x_points": [
      [0.03599, 1],
      [0.03579, 6],
      [0.03517, 7],
      [0.03795, 8],
      [0.03527, 10],
      [0.03394, 11],
      [0.0364, 12],
      [0.03805, 13],
      [0.03548, 15],
      [0.03671, 16],
      [0.03589, 18],
      [0.0361, 21],
      [0.03548, 25],
      [0.0363, 27],
      [0.03538, 30],
      [0.03558, 32],
      [0.03589, 33],
      [0.03414, 34],
      [0.03342, 36],
      [0.03599, 38],
      [0.03507, 40]
    ]
  },
  "QS_mulTransfSite[C7ipsi]": {
    "red_x_points": [[-0.0001, 0], [-0.0001, 0], [-0.0001, 0], [-0.0001, 0]],
    "red_o_points": [],
    "y_categories": ["N", "NOT APPLICABLE", "nan"],
    "blue_o_points": [],
    "blue_x_points": [[0.0001, 2], [0.0001, 1], [0.0001, 2], [0.0001, 2]]
  },
  "QS_mulGraftNerve[Ax]": {
    "red_x_points": [
      [-0.00261, 1],
      [-0.00186, 0],
      [-0.00037, 0],
      [0.0, 0],
      [-0.00077, 0],
      [3e-5, 0],
      [6e-5, 2],
      [-0.00205, 1],
      [0.00125, 2],
      [-0.00146, 0],
      [0.00028, 2],
      [-0.00213, 0],
      [0.00028, 2],
      [-0.00019, 0],
      [-0.00354, 1],
      [0.0001, 2],
      [-0.00087, 0],
      [0.00043, 2],
      [-0.00084, 0],
      [-0.00167, 0],
      [-0.00267, 1],
      [-2e-5, 0],
      [0.00035, 2]
    ],
    "red_o_points": [],
    "y_categories": ["N", "NOT APPLICABLE", "nan"],
    "blue_o_points": [],
    "blue_x_points": [
      [0.00049, 2],
      [0.00059, 2],
      [0.0005, 0],
      [0.00068, 0],
      [0.00047, 2],
      [0.0011, 0],
      [0.00079, 0],
      [0.00029, 0],
      [0.00131, 2],
      [0.00384, 1],
      [-0.00082, 0],
      [0.00128, 0],
      [0.00161, 2],
      [0.00053, 2],
      [0.0009, 2],
      [0.00031, 2],
      [0.00129, 2],
      [0.00052, 2],
      [0.0009, 1],
      [0.0009, 2],
      [0.0008, 2]
    ]
  },
  "QA_lstPexTouch[C7]": {
    "red_x_points": [
      [-0.00949, 1],
      [-0.00301, 2],
      [-0.00742, 1],
      [-0.00957, 1],
      [-0.00275, 2],
      [-0.00784, 1],
      [-0.00885, 1],
      [-0.00913, 1],
      [-0.0027, 2],
      [-0.00383, 2],
      [-0.00966, 1],
      [-0.00301, 2],
      [-0.01023, 1],
      [0.01017, 0],
      [-0.00971, 1],
      [-0.00863, 1],
      [-0.00269, 2],
      [0.01139, 0],
      [-0.00861, 1],
      [-0.00416, 2],
      [-0.01112, 1],
      [-0.00731, 1],
      [-0.01087, 1]
    ],
    "red_o_points": [],
    "y_categories": ["NORM", "NPV", "nan"],
    "blue_o_points": [],
    "blue_x_points": [
      [-0.00767, 1],
      [-0.00802, 1],
      [0.01508, 0],
      [-0.00601, 1],
      [0.01834, 0],
      [-0.00693, 1],
      [0.01887, 0],
      [-0.00632, 1],
      [-0.00025, 2],
      [0.00037, 2],
      [-0.00151, 2],
      [-0.00725, 1],
      [-0.00018, 2],
      [0.01498, 0],
      [0.01586, 0],
      [0.01606, 0],
      [0.0003, 2],
      [0.01562, 0],
      [0.02005, 0],
      [0.0187, 0],
      [0.01895, 0]
    ]
  },
  "QA_lstPexMuscstrength[ElbowExte]": {
    "red_x_points": [
      [-0.00442, 2],
      [-0.0046, 2],
      [-0.00392, 1],
      [-0.00215, 1],
      [-0.00586, 1],
      [-0.00359, 1],
      [-0.00278, 1],
      [0.00261, 0],
      [-0.00239, 2],
      [-0.00737, 2],
      [-0.00407, 1],
      [-0.0047, 2],
      [-0.00095, 1],
      [-0.00676, 1],
      [0.00117, 0],
      [-0.00229, 1],
      [-0.00585, 1],
      [-0.00404, 0],
      [-0.00552, 1],
      [-0.00436, 2],
      [-0.00331, 2],
      [-0.00198, 1],
      [-0.0042, 2]
    ],
    "red_o_points": [],
    "y_categories": ["GREATER THAN OR EQUALS TO 3", "LESS THAN 3", "nan"],
    "blue_o_points": [],
    "blue_x_points": [
      [-0.0005, 1],
      [0.00019, 1],
      [0.00807, 0],
      [-0.00261, 1],
      [-4e-5, 1],
      [0.01512, 0],
      [0.01107, 0],
      [-0.00198, 1],
      [0.00012, 2],
      [-0.00102, 2],
      [0.01823, 0],
      [0.00083, 1],
      [0.00049, 2],
      [0.00711, 0],
      [0.00542, 0],
      [0.00688, 0],
      [0.00054, 2],
      [0.00521, 0],
      [0.00503, 0],
      [0.00153, 1],
      [0.00165, 1]
    ]
  },
  "QA_intPexForearmSupin": {
    "red_x_points": [
      [-0.00038, 2],
      [-0.00793, 0],
      [-0.0006, 2],
      [-0.00036, 2],
      [-0.00046, 2],
      [-0.00027, 2],
      [-0.01728, 0],
      [-0.01304, 0],
      [-0.00062, 2],
      [-0.00064, 2],
      [-0.00063, 2],
      [-0.00034, 2],
      [-0.00087, 2],
      [0.00465, 1],
      [-0.00013, 2],
      [-0.01443, 0],
      [0.00052, 1],
      [-0.00063, 2],
      [-0.00064, 2],
      [-0.00053, 2],
      [0.004, 1],
      [-0.00941, 0],
      [-0.00103, 2]
    ],
    "red_o_points": [],
    "y_categories": ["GREATER THAN OR EQUALS TO 80", "LESS THAN 80", "nan"],
    "blue_o_points": [],
    "blue_x_points": [
      [2e-5, 2],
      [0.01267, 1],
      [0.00557, 1],
      [0.00914, 1],
      [0.00857, 1],
      [6e-5, 2],
      [0.00022, 2],
      [0.00019, 2],
      [-0.00023, 2],
      [-5e-5, 2],
      [0.00327, 0],
      [-8e-5, 2],
      [-0.00015, 2],
      [0.00723, 1],
      [0.00637, 1],
      [-0.00025, 2],
      [-0.00042, 2],
      [-8e-5, 2],
      [0.00024, 2],
      [0.00896, 1],
      [-0.0002, 2]
    ]
  },
  "QA_lstPexTinel[TinelSign]": {
    "red_x_points": [
      [0.00109, 1],
      [3e-5, 1],
      [-0.00793, 2],
      [0.0016, 1],
      [0.00035, 1],
      [0.00086, 1],
      [-0.01212, 2],
      [-0.00826, 2],
      [-0.00279, 1],
      [0.00063, 1],
      [-0.01309, 2],
      [-0.0061, 2],
      [-0.0001, 1],
      [-0.01022, 2],
      [0.00167, 1],
      [-0.00922, 2],
      [0.00078, 1],
      [-0.00133, 1],
      [-0.01036, 2],
      [-0.00719, 2],
      [0.00062, 1],
      [-0.0067, 2],
      [-0.00022, 1]
    ],
    "red_o_points": [],
    "y_categories": ["ABS", "NAIA", "PT", "nan"],
    "blue_o_points": [],
    "blue_x_points": [
      [0.00485, 1],
      [0.02762, 0],
      [0.01428, 0],
      [-0.00614, 2],
      [0.00225, 1],
      [0.00341, 1],
      [-0.00537, 2],
      [0.00359, 1],
      [0.00185, 2],
      [0.00131, 1],
      [0.00347, 1],
      [0.00351, 1],
      [0.00066, 1],
      [0.01747, 0],
      [0.003, 1],
      [0.00249, 1],
      [0.00043, 2],
      [0.00201, 1],
      [0.00308, 1],
      [0.00204, 1],
      [0.00216, 1]
    ]
  },
  "QS_mulGraftNerve[MCF]": {
    "red_x_points": [
      [-0.0002, 1],
      [-9e-5, 0],
      [-1e-5, 0],
      [-9e-5, 0],
      [-1e-5, 0],
      [-0.00013, 1],
      [3e-5, 2],
      [-4e-5, 0],
      [4e-5, 2],
      [-3e-5, 0],
      [3e-5, 2],
      [-0.0, 0],
      [-0.0004, 1],
      [-4e-5, 0],
      [3e-5, 2],
      [-0.0, 0],
      [-8e-5, 0],
      [-0.00024, 1],
      [3e-5, 2]
    ],
    "red_o_points": [],
    "y_categories": ["N", "NOT APPLICABLE", "nan"],
    "blue_o_points": [],
    "blue_x_points": [
      [7e-5, 2],
      [6e-5, 2],
      [5e-5, 0],
      [2e-5, 0],
      [8e-5, 2],
      [0.0, 0],
      [3e-5, 0],
      [2e-5, 0],
      [0.0, 2],
      [0.00024, 1],
      [-2e-5, 0],
      [6e-5, 0],
      [5e-5, 2],
      [6e-5, 2],
      [0.00015, 2],
      [0.00012, 2],
      [0.00012, 2],
      [0.0001, 2],
      [-7e-5, 1],
      [5e-5, 2],
      [3e-5, 2]
    ]
  },
  "QS_mulLysisSite[Nerve]": {
    "red_x_points": [
      [-0.00677, 1],
      [-0.00215, 0],
      [-0.00913, 2],
      [-0.01764, 2],
      [-0.00126, 0],
      [0.00197, 0],
      [0.00131, 3],
      [-0.00719, 1],
      [0.00221, 3],
      [-0.00122, 0],
      [0.00174, 3],
      [-0.00191, 0],
      [0.00142, 3],
      [0.00018, 0],
      [-0.00669, 1],
      [0.00141, 3],
      [-0.0014, 0],
      [0.0019, 3],
      [0.00021, 0],
      [-0.00197, 0],
      [-0.00751, 1],
      [0.0015, 0],
      [0.00178, 3]
    ],
    "red_o_points": [],
    "y_categories": ["N", "NOT APPLICABLE", "Y", "nan"],
    "blue_o_points": [],
    "blue_x_points": [
      [0.00282, 3],
      [0.00244, 3],
      [0.00101, 0],
      [0.00338, 0],
      [0.00212, 3],
      [0.00327, 0],
      [0.00217, 0],
      [0.00296, 0],
      [0.00265, 3],
      [0.00421, 1],
      [-0.00084, 0],
      [0.00389, 0],
      [0.00197, 3],
      [0.00242, 3],
      [0.00224, 3],
      [0.0017, 3],
      [0.00273, 3],
      [0.00188, 3],
      [0.00065, 1],
      [0.00317, 3],
      [0.00238, 3]
    ]
  },
  "QS_mulTransfSite[IMc]": {
    "red_x_points": [
      [-0.01006, 1],
      [-0.02098, 2],
      [-0.00017, 0],
      [-0.02414, 2],
      [-0.00148, 0],
      [0.00335, 0],
      [0.00294, 3],
      [-0.01113, 1],
      [0.00613, 3],
      [-0.00132, 0],
      [0.00439, 3],
      [-0.01837, 2],
      [0.00347, 3],
      [0.00112, 0],
      [-0.0139, 1],
      [0.00285, 3],
      [-0.00264, 0],
      [0.00486, 3],
      [0.00054, 0],
      [-0.01914, 2],
      [-0.0121, 1],
      [-0.01255, 2],
      [0.0042, 3]
    ],
    "red_o_points": [],
    "y_categories": ["N", "NOT APPLICABLE", "Y", "nan"],
    "blue_o_points": [],
    "blue_x_points": [
      [0.00684, 3],
      [0.00492, 3],
      [0.00382, 0],
      [0.00644, 0],
      [0.00469, 3],
      [0.00634, 0],
      [0.00428, 0],
      [0.00526, 0],
      [0.00841, 3],
      [0.00752, 1],
      [0.00171, 0],
      [0.00659, 0],
      [0.00769, 3],
      [0.00524, 3],
      [0.00527, 3],
      [0.00486, 3],
      [0.00865, 3],
      [0.00548, 3],
      [-0.00117, 1],
      [0.00629, 3],
      [0.00502, 3]
    ]
  },
  "QS_mulTransfSite[AcMc]": {
    "red_x_points": [
      [-0.00815, 1],
      [-0.0058, 0],
      [-0.00296, 0],
      [-0.00449, 0],
      [-0.00326, 0],
      [-0.00127, 0],
      [0.00098, 3],
      [-0.00913, 1],
      [0.00319, 3],
      [-0.00439, 0],
      [0.00148, 3],
      [-0.00392, 0],
      [0.00215, 3],
      [-0.00277, 0],
      [-0.01062, 1],
      [0.001, 3],
      [-0.00357, 0],
      [0.00124, 3],
      [-0.003, 0],
      [-0.0045, 0],
      [-0.00908, 1],
      [-0.00136, 0],
      [0.00192, 3]
    ],
    "red_o_points": [],
    "y_categories": ["N", "NOT APPLICABLE", "Y", "nan"],
    "blue_o_points": [],
    "blue_x_points": [
      [0.00313, 3],
      [0.00249, 3],
      [0.00044, 0],
      [0.00167, 0],
      [0.00283, 3],
      [0.0015, 0],
      [0.00067, 0],
      [0.01773, 2],
      [0.00446, 3],
      [0.00782, 1],
      [-0.00215, 0],
      [0.00047, 0],
      [0.00321, 3],
      [0.00267, 3],
      [0.00246, 3],
      [0.00219, 3],
      [0.0044, 3],
      [0.00249, 3],
      [0.00115, 1],
      [0.00381, 3],
      [0.00286, 3]
    ]
  },
  "QS_mulTransfSite[Other]": {
    "red_x_points": [
      [-0.00401, 1],
      [-0.00244, 0],
      [-0.0007, 0],
      [-6e-5, 0],
      [-0.00111, 0],
      [0.00026, 0],
      [-0.0, 3],
      [-0.00672, 1],
      [0.00167, 3],
      [-0.00137, 0],
      [0.00109, 3],
      [-0.00212, 0],
      [0.00063, 3],
      [-0.0237, 2],
      [-0.00568, 1],
      [0.00076, 3],
      [-0.00144, 0],
      [0.00112, 3],
      [-0.00031, 0],
      [-0.0018, 0],
      [-0.00536, 1],
      [0.00026, 0],
      [0.00067, 3]
    ],
    "red_o_points": [],
    "y_categories": ["N", "NOT APPLICABLE", "Y", "nan"],
    "blue_o_points": [],
    "blue_x_points": [
      [0.00205, 3],
      [0.0018, 3],
      [0.0029, 0],
      [0.00338, 0],
      [0.00249, 3],
      [0.00215, 0],
      [0.00407, 0],
      [0.0028, 0],
      [0.00185, 3],
      [0.00455, 1],
      [-0.00075, 0],
      [0.00196, 0],
      [0.00218, 3],
      [0.0031, 3],
      [0.00332, 3],
      [0.00238, 3],
      [0.0023, 3],
      [0.00267, 3],
      [0.00049, 1],
      [0.00282, 3],
      [0.00183, 3]
    ]
  },
  "QA_lstPexTouch[C8]": {
    "red_x_points": [
      [0.00576, 0],
      [-0.00309, 2],
      [-0.00778, 1],
      [-0.00971, 1],
      [-0.00266, 2],
      [-0.00685, 1],
      [-0.00836, 1],
      [-0.00947, 1],
      [-0.00219, 2],
      [-0.00318, 2],
      [-0.01115, 1],
      [-0.00218, 2],
      [-0.00973, 1],
      [0.00918, 0],
      [-0.00868, 1],
      [-0.00832, 1],
      [-0.00251, 2],
      [0.00566, 0],
      [-0.00837, 1],
      [-0.00343, 2],
      [-0.01188, 1],
      [-0.00683, 1],
      [-0.01134, 1]
    ],
    "red_o_points": [],
    "y_categories": ["NORM", "NPV", "nan"],
    "blue_o_points": [],
    "blue_x_points": [
      [-0.00801, 1],
      [-0.00816, 1],
      [0.01215, 0],
      [-0.00686, 1],
      [0.01428, 0],
      [-0.00625, 1],
      [0.0132, 0],
      [0.01333, 0],
      [0.00064, 2],
      [0.00171, 2],
      [-0.00021, 2],
      [-0.00557, 1],
      [0.00094, 2],
      [0.01295, 0],
      [0.01241, 0],
      [0.01397, 0],
      [0.00121, 2],
      [0.01174, 0],
      [0.01338, 0],
      [0.01596, 0],
      [0.01431, 0]
    ]
  },
  "QA_lstPexPain[C6]": {
    "red_x_points": [
      [-0.00031, 1],
      [-0.00434, 2],
      [-0.00351, 2],
      [-0.00056, 1],
      [-0.00345, 2],
      [6e-5, 1],
      [-0.00081, 1],
      [-0.00062, 1],
      [-0.00446, 2],
      [-0.00381, 2],
      [-0.00507, 2],
      [-0.00298, 2],
      [-0.00059, 1],
      [-0.00185, 1],
      [-0.00018, 1],
      [-0.00075, 1],
      [-0.00296, 2],
      [-0.00572, 2],
      [-0.00475, 2],
      [-0.00327, 2],
      [-0.00034, 1],
      [-0.00035, 1],
      [-0.00069, 1]
    ],
    "red_o_points": [],
    "y_categories": ["NORM", "NPV", "nan"],
    "blue_o_points": [],
    "blue_x_points": [
      [3e-5, 1],
      [-7e-5, 1],
      [0.01058, 0],
      [0.00016, 1],
      [0.01688, 0],
      [0.00022, 1],
      [0.00021, 1],
      [-5e-5, 1],
      [-0.00284, 2],
      [-0.00281, 2],
      [-0.00341, 2],
      [0.00025, 1],
      [-0.00268, 2],
      [0.01398, 0],
      [-4e-5, 1],
      [0.01197, 0],
      [-0.00307, 2],
      [0.01179, 0],
      [7e-5, 1],
      [-0.00018, 1],
      [0.00032, 1]
    ]
  },
  "QS_mulLysisRoot[T1]": {
    "red_x_points": [
      [-9e-5, 1],
      [-6e-5, 0],
      [4e-5, 0],
      [-6e-5, 0],
      [1e-5, 2],
      [4e-5, 2],
      [-9e-5, 1],
      [-6e-5, 0],
      [1e-5, 2],
      [-9e-5, 1]
    ],
    "red_o_points": [],
    "y_categories": ["N", "NOT APPLICABLE", "nan"],
    "blue_o_points": [],
    "blue_x_points": [
      [4e-5, 2],
      [4e-5, 0],
      [0.00014, 1],
      [4e-5, 0],
      [1e-5, 2],
      [4e-5, 2]
    ]
  },
  "QS_mulLysisRoot[C5]": {
    "red_x_points": [
      [-0.00373, 1],
      [-0.00161, 0],
      [-0.0097, 2],
      [0.00074, 0],
      [-0.00101, 0],
      [0.00134, 0],
      [0.0008, 3],
      [-0.00471, 1],
      [0.00144, 3],
      [-0.00128, 0],
      [0.00114, 3],
      [-0.00132, 0],
      [0.00107, 3],
      [0.00022, 0],
      [-0.00442, 1],
      [0.00066, 3],
      [-0.00089, 0],
      [0.00144, 3],
      [0.00024, 0],
      [-0.00103, 0],
      [-0.00401, 1],
      [-0.0078, 2],
      [0.00116, 3]
    ],
    "red_o_points": [],
    "y_categories": ["N", "NOT APPLICABLE", "Y", "nan"],
    "blue_o_points": [],
    "blue_x_points": [
      [0.0022, 3],
      [0.0015, 3],
      [0.00025, 0],
      [0.00219, 0],
      [0.00155, 3],
      [0.00162, 0],
      [0.00053, 0],
      [0.00112, 0],
      [0.00193, 3],
      [0.00248, 1],
      [-0.0005, 0],
      [0.00289, 0],
      [0.00195, 3],
      [0.00135, 3],
      [0.00145, 3],
      [0.00093, 3],
      [0.00218, 3],
      [0.00135, 3],
      [0.00148, 1],
      [0.00166, 3],
      [0.00114, 3]
    ]
  },
  "QS_mulNeuromadSite[C6]": {
    "red_x_points": [
      [-0.00436, 1],
      [-0.00303, 0],
      [-0.0007, 0],
      [-0.0, 0],
      [-0.00159, 0],
      [-0.00016, 0],
      [0.00055, 2],
      [-0.00431, 1],
      [0.00138, 2],
      [-0.00202, 0],
      [0.00072, 2],
      [-0.00248, 0],
      [0.00056, 2],
      [-6e-5, 0],
      [-0.00618, 1],
      [0.00029, 2],
      [-0.00215, 0],
      [0.0007, 2],
      [-0.00132, 0],
      [-0.00268, 0],
      [-0.00425, 1],
      [0.00029, 0],
      [0.00074, 2]
    ],
    "red_o_points": [],
    "y_categories": ["N", "NOT APPLICABLE", "nan"],
    "blue_o_points": [],
    "blue_x_points": [
      [0.00173, 2],
      [0.0014, 2],
      [0.00123, 0],
      [0.00123, 0],
      [0.00078, 2],
      [0.0009, 0],
      [0.0006, 0],
      [0.00046, 0],
      [0.00277, 2],
      [0.00609, 1],
      [-0.00135, 0],
      [0.00058, 0],
      [0.00228, 2],
      [0.00105, 2],
      [0.00152, 2],
      [0.00071, 2],
      [0.00206, 2],
      [0.00147, 2],
      [0.00133, 1],
      [0.00179, 2],
      [0.00141, 2]
    ]
  },
  "QS_mulNeuromadSite[T1]": {
    "red_x_points": [
      [-0.00243, 1],
      [-0.0016, 0],
      [-0.00048, 0],
      [0.00015, 0],
      [-0.00082, 0],
      [0.00011, 0],
      [6e-5, 2],
      [-0.00317, 1],
      [0.00086, 2],
      [-0.00111, 0],
      [0.00015, 2],
      [-0.00117, 0],
      [0.00035, 2],
      [-5e-5, 0],
      [-0.00482, 1],
      [-1e-5, 2],
      [-0.0012, 0],
      [0.0006, 2],
      [-0.00066, 0],
      [-0.00194, 0],
      [-0.00238, 1],
      [8e-5, 0],
      [0.00044, 2]
    ],
    "red_o_points": [],
    "y_categories": ["N", "NOT APPLICABLE", "nan"],
    "blue_o_points": [],
    "blue_x_points": [
      [0.00094, 2],
      [0.00081, 2],
      [0.00043, 0],
      [0.00104, 0],
      [0.00056, 2],
      [0.00111, 0],
      [0.00027, 0],
      [0.00056, 0],
      [0.00167, 2],
      [0.00285, 1],
      [-0.00063, 0],
      [0.00105, 0],
      [0.00142, 2],
      [0.00074, 2],
      [0.00089, 2],
      [0.00049, 2],
      [0.00152, 2],
      [0.00091, 2],
      [0.00066, 1],
      [0.00094, 2],
      [0.00083, 2]
    ]
  },
  "QA_lstPexMuscstrength[ShoulderAbduc]": {
    "red_x_points": [
      [-0.00141, 2],
      [0.00027, 1],
      [0.00033, 1],
      [0.0008, 1],
      [0.00018, 1],
      [0.00079, 1],
      [0.00067, 1],
      [-0.01695, 0],
      [-0.00041, 2],
      [-0.00095, 2],
      [-0.00274, 2],
      [-0.00048, 2],
      [0.00035, 1],
      [0.0011, 1],
      [-0.01981, 0],
      [0.00027, 1],
      [0.00034, 1],
      [0.00058, 1],
      [0.0008, 1],
      [0.00051, 1],
      [-0.00085, 2],
      [0.00047, 1],
      [-0.00074, 2]
    ],
    "red_o_points": [],
    "y_categories": ["GREATER THAN OR EQUALS TO 3", "LESS THAN 3", "nan"],
    "blue_o_points": [],
    "blue_x_points": [
      [0.00281, 1],
      [0.00203, 1],
      [0.00227, 1],
      [0.00189, 1],
      [0.00167, 1],
      [0.00308, 1],
      [0.00201, 1],
      [0.00156, 1],
      [0.00036, 2],
      [0.00081, 2],
      [0.00115, 1],
      [0.00047, 2],
      [0.0007, 2],
      [0.00205, 1],
      [0.00234, 1],
      [-0.00031, 2],
      [0.00062, 2],
      [0.00184, 1],
      [0.00787, 1],
      [0.00064, 1],
      [0.00102, 1]
    ]
  },
  "QS_mulNeuromadSite[T2]": {
    "red_x_points": [
      [-0.00346, 1],
      [-0.00245, 0],
      [-0.00096, 0],
      [-0.00022, 0],
      [-0.00132, 0],
      [1e-5, 0],
      [-0.00015, 2],
      [-0.00354, 1],
      [0.00132, 2],
      [-0.00174, 0],
      [0.00056, 2],
      [-0.00197, 0],
      [0.00044, 2],
      [-0.00029, 0],
      [-0.0043, 1],
      [0.00012, 2],
      [-0.0015, 0],
      [0.00043, 2],
      [-0.00096, 0],
      [-0.00224, 0],
      [-0.00303, 1],
      [0.00032, 0],
      [0.00028, 2]
    ],
    "red_o_points": [],
    "y_categories": ["N", "NOT APPLICABLE", "nan"],
    "blue_o_points": [],
    "blue_x_points": [
      [0.00107, 2],
      [0.00082, 2],
      [0.00065, 0],
      [0.0008, 0],
      [0.0009, 2],
      [0.00125, 0],
      [0.00095, 0],
      [0.00023, 0],
      [0.00194, 2],
      [0.00466, 1],
      [-0.00078, 0],
      [0.00121, 0],
      [0.00179, 2],
      [0.00114, 2],
      [0.00105, 2],
      [0.00081, 2],
      [0.00195, 2],
      [0.00098, 2],
      [0.00105, 1],
      [0.0012, 2],
      [0.00096, 2]
    ]
  },
  "QS_mulNeuromadSite[C4]": {
    "red_x_points": [
      [-0.00499, 1],
      [-0.00327, 0],
      [-0.00141, 0],
      [3e-5, 0],
      [-0.00208, 0],
      [0.00047, 0],
      [0.00012, 2],
      [-0.00665, 1],
      [0.00177, 2],
      [-0.00245, 0],
      [0.0009, 2],
      [-0.0034, 0],
      [0.00069, 2],
      [0.00014, 0],
      [-0.00838, 1],
      [0.00036, 2],
      [-0.00188, 0],
      [0.00058, 2],
      [-0.00244, 0],
      [-0.00353, 0],
      [-0.00725, 1],
      [0.00014, 0],
      [0.00078, 2]
    ],
    "red_o_points": [],
    "y_categories": ["N", "NOT APPLICABLE", "nan"],
    "blue_o_points": [],
    "blue_x_points": [
      [0.00197, 2],
      [0.00147, 2],
      [0.00095, 0],
      [0.00152, 0],
      [0.00145, 2],
      [0.00234, 0],
      [0.00153, 0],
      [0.00052, 0],
      [0.00267, 2],
      [0.0075, 1],
      [-0.00068, 0],
      [0.00192, 0],
      [0.00247, 2],
      [0.00151, 2],
      [0.00228, 2],
      [0.00142, 2],
      [0.00259, 2],
      [0.00209, 2],
      [0.00187, 1],
      [0.00246, 2],
      [0.0019, 2]
    ]
  },
  "QS_mulGraftNerve[Ra]": {
    "red_x_points": [
      [-0.00037, 1],
      [-0.00011, 0],
      [-2e-5, 0],
      [-2e-5, 0],
      [-1e-5, 0],
      [-1e-5, 0],
      [3e-5, 2],
      [-0.0003, 1],
      [4e-5, 2],
      [-0.00011, 0],
      [0.0, 2],
      [-0.0001, 0],
      [5e-5, 2],
      [-2e-5, 0],
      [-0.00074, 1],
      [5e-5, 2],
      [0.0, 0],
      [0.00014, 2],
      [-2e-5, 0],
      [-0.00035, 1],
      [-1e-5, 0],
      [9e-5, 2]
    ],
    "red_o_points": [],
    "y_categories": ["N", "NOT APPLICABLE", "nan"],
    "blue_o_points": [],
    "blue_x_points": [
      [9e-5, 2],
      [5e-5, 2],
      [7e-5, 0],
      [0.00014, 0],
      [4e-5, 2],
      [0.00011, 0],
      [3e-5, 0],
      [0.00012, 0],
      [5e-5, 2],
      [-2e-5, 1],
      [3e-5, 0],
      [0.00032, 0],
      [0.00014, 2],
      [0.0001, 2],
      [9e-5, 2],
      [6e-5, 2],
      [5e-5, 2],
      [0.00017, 2],
      [0.00011, 2],
      [5e-5, 2]
    ]
  },
  "QS_mulTransfSite[Oberlin]": {
    "red_x_points": [
      [-0.00846, 1],
      [-0.02639, 0],
      [-0.02617, 0],
      [-0.02808, 0],
      [-0.0262, 0],
      [-0.02645, 0],
      [0.00722, 3],
      [-0.0093, 1],
      [0.00879, 3],
      [0.0111, 2],
      [0.00783, 3],
      [-0.02659, 0],
      [0.00793, 3],
      [0.01008, 2],
      [-0.01002, 1],
      [0.0076, 3],
      [-0.02675, 0],
      [0.00784, 3],
      [0.01116, 2],
      [-0.02826, 0],
      [-0.00967, 1],
      [-0.02441, 0],
      [0.00772, 3]
    ],
    "red_o_points": [],
    "y_categories": ["N", "NOT APPLICABLE", "Y", "nan"],
    "blue_o_points": [],
    "blue_x_points": [
      [0.00904, 3],
      [0.00864, 3],
      [0.0127, 2],
      [0.01342, 2],
      [0.00868, 3],
      [0.01353, 2],
      [0.01291, 2],
      [0.01313, 2],
      [0.00974, 3],
      [-0.00396, 1],
      [0.01244, 2],
      [0.01406, 2],
      [0.00952, 3],
      [0.00855, 3],
      [0.00823, 3],
      [0.00794, 3],
      [0.00959, 3],
      [0.00827, 3],
      [-0.00443, 1],
      [0.00914, 3],
      [0.00836, 3]
    ]
  },
  "QA_yonPexPain": {
    "red_x_points": [
      [-0.00947, 1],
      [-0.01142, 1],
      [-0.00937, 1],
      [-0.01033, 1],
      [-0.0106, 1],
      [-0.00999, 1],
      [-0.0098, 1],
      [-0.00977, 1],
      [-0.01104, 1],
      [-0.01031, 1],
      [0.01233, 0],
      [-0.01047, 1],
      [-0.00984, 1],
      [-0.01051, 1],
      [0.01391, 0],
      [-0.00977, 1],
      [-0.01033, 1],
      [-0.01115, 1],
      [-0.01051, 1],
      [-0.01069, 1],
      [-0.00931, 1],
      [-0.00919, 1],
      [-0.01212, 1]
    ],
    "red_o_points": [],
    "y_categories": ["N", "Y", "nan"],
    "blue_o_points": [],
    "blue_x_points": [
      [-0.00992, 1],
      [0.01922, 0],
      [0.01704, 0],
      [0.0191, 0],
      [-0.00907, 1],
      [0.01987, 0],
      [-0.0095, 1],
      [-0.00927, 1],
      [-0.01126, 1],
      [0.02725, 2],
      [0.02177, 0],
      [-0.00963, 1],
      [0.02048, 0],
      [0.01754, 0],
      [0.01732, 0],
      [0.01772, 0],
      [0.02816, 2],
      [0.01818, 0],
      [-0.00963, 1],
      [-0.01019, 1],
      [0.02458, 2]
    ]
  },
  "QS_mulGraftNerve[FI]": {
    "red_x_points": [
      [-0.00245, 1],
      [-0.00114, 0],
      [-0.00054, 0],
      [0.0001, 0],
      [-0.00058, 0],
      [0.00025, 0],
      [8e-5, 2],
      [-0.00223, 1],
      [0.00054, 2],
      [-0.00113, 0],
      [0.0005, 2],
      [-0.00139, 0],
      [6e-5, 2],
      [-0.00013, 0],
      [-0.00269, 1],
      [6e-5, 2],
      [-0.0008, 0],
      [0.00043, 2],
      [-0.00043, 0],
      [-0.00136, 0],
      [-0.00144, 1],
      [0.00015, 0],
      [0.00037, 2]
    ],
    "red_o_points": [],
    "y_categories": ["N", "NOT APPLICABLE", "nan"],
    "blue_o_points": [],
    "blue_x_points": [
      [0.00094, 2],
      [0.0004, 2],
      [0.00018, 0],
      [0.00058, 0],
      [0.00038, 2],
      [0.00084, 0],
      [0.00025, 0],
      [0.0004, 0],
      [0.00113, 2],
      [0.00348, 1],
      [-0.001, 0],
      [0.00071, 0],
      [0.00137, 2],
      [0.00047, 2],
      [0.00044, 2],
      [0.00013, 2],
      [0.00088, 2],
      [0.00063, 2],
      [0.00021, 1],
      [0.00054, 2],
      [0.00084, 2]
    ]
  },
  "QA_lstPexPalle[Ulna]": {
    "red_x_points": [
      [-0.00126, 4],
      [-0.00133, 4],
      [-0.00138, 4],
      [-0.02769, 2],
      [-0.00126, 4],
      [-0.00132, 4],
      [-0.00953, 1],
      [0.00618, 3],
      [-0.00141, 4],
      [-0.0013, 4],
      [-0.00186, 4],
      [-0.00115, 4],
      [-0.00122, 4],
      [0.00692, 3],
      [-0.00127, 4],
      [-0.01965, 0],
      [-0.01685, 0],
      [-0.00158, 4],
      [-0.00183, 4],
      [-0.00125, 4],
      [0.00701, 3],
      [-0.01824, 0],
      [-0.00135, 4]
    ],
    "red_o_points": [],
    "y_categories": ["ABS", "HYPO", "NAIA", "PT", "nan"],
    "blue_o_points": [],
    "blue_x_points": [
      [-0.00081, 4],
      [-0.00106, 4],
      [0.00911, 3],
      [0.01172, 1],
      [-0.00119, 4],
      [-0.00049, 4],
      [0.0104, 3],
      [0.01245, 3],
      [-0.00139, 4],
      [-0.00103, 4],
      [-0.00093, 4],
      [-0.00093, 4],
      [-0.00123, 4],
      [0.01134, 3],
      [0.01209, 3],
      [0.01236, 3],
      [-0.00116, 4],
      [0.01136, 3],
      [-0.00047, 4],
      [0.01343, 3],
      [-0.00093, 4]
    ]
  }
}
