{
  "QA_lstPexMuscstrength[ElbowFlex]": {
    "red_x_points": [
      [-0.02133, 1],
      [-0.00314, 2],
      [-0.01825, 1],
      [-0.01584, 1],
      [-0.01855, 1],
      [-0.02151, 1],
      [-0.01845, 1],
      [-0.01703, 1],
      [-0.02018, 1],
      [-0.02131, 1],
      [-0.02064, 1],
      [-0.02235, 1],
      [-0.01043, 2],
      [-0.01771, 2],
      [0.00517, 2],
      [-0.02084, 1],
      [-0.02032, 1],
      [-0.01576, 1],
      [-0.01599, 1],
      [-0.02067, 1],
      [-0.00918, 2],
      [-0.01892, 1],
      [-0.02199, 1],
      [-0.02038, 1],
      [-0.01458, 1],
      [-0.00223, 2],
      [-0.01466, 1],
      [-0.02024, 1],
      [-0.01001, 2]
    ],
    "red_o_points": [],
    "y_categories": ["GREATER THAN OR EQUALS TO 3", "LESS THAN 3", "nan"],
    "blue_o_points": [],
    "blue_x_points": [
      [-0.00329, 2],
      [-0.0186, 1],
      [0.13186, 0],
      [-0.01863, 1],
      [0.00732, 2],
      [0.00613, 2],
      [0.05204, 0],
      [-0.01115, 1],
      [-0.01732, 1],
      [0.00333, 2],
      [0.13175, 0],
      [0.06789, 0],
      [0.08464, 0],
      [0.06862, 0],
      [-0.01724, 1]
    ]
  },
  "participant_code": {
    "red_x_points": [
      [-0.09166, 1],
      [-0.09269, 2],
      [-0.09111, 3],
      [-0.0905, 4],
      [-0.09194, 5],
      [-0.09091, 8],
      [-0.092, 9],
      [-0.0918, 10],
      [-0.08995, 11],
      [-0.09063, 13],
      [-0.09269, 14],
      [-0.09214, 18],
      [-0.09008, 19],
      [-0.09248, 20],
      [-0.09372, 23],
      [-0.08926, 26],
      [-0.09166, 28],
      [-0.09365, 29],
      [-0.0931, 30],
      [-0.09104, 31],
      [-0.09262, 32],
      [-0.09139, 34],
      [-0.0929, 36],
      [-0.08988, 38],
      [-0.08988, 39],
      [-0.09146, 40],
      [-0.0905, 41],
      [-0.09214, 42],
      [-0.09159, 43]
    ],
    "red_o_points": [],
    "y_categories": [
      "P16554",
      "P18297",
      "P19283",
      "P19287",
      "P23172",
      "P23391",
      "P30595",
      "P31645",
      "P31691",
      "P34778",
      "P35046",
      "P36328",
      "P43633",
      "P4544",
      "P46417",
      "P48965",
      "P53068",
      "P5497",
      "P58556",
      "P59529",
      "P62483",
      "P64658",
      "P65202",
      "P66816",
      "P6751",
      "P7408",
      "P75566",
      "P76226",
      "P79971",
      "P82621",
      "P82990",
      "P84549",
      "P84932",
      "P85825",
      "P86989",
      "P8770",
      "P87791",
      "P90550",
      "P93159",
      "P94969",
      "P96710",
      "P97130",
      "P9744",
      "P98500",
      "nan"
    ],
    "blue_o_points": [],
    "blue_x_points": [
      [0.17739, 0],
      [0.17503, 6],
      [0.17555, 7],
      [0.1745, 12],
      [0.17674, 15],
      [0.18212, 16],
      [0.17411, 17],
      [0.17555, 21],
      [0.17792, 22],
      [0.17595, 24],
      [0.18055, 25],
      [0.17634, 27],
      [0.17647, 33],
      [0.17884, 35],
      [0.17831, 37]
    ]
  },
  "QA_mulInjOrthesisType[ArmSling]": {
    "red_x_points": [
      [-0.01594, 2],
      [-0.01689, 2],
      [-0.01525, 2],
      [-0.01512, 2],
      [-0.01484, 2],
      [-0.01597, 2],
      [-0.01502, 2],
      [-0.01561, 2],
      [-0.01546, 2],
      [-0.01595, 2],
      [-0.01573, 2],
      [-0.01574, 2],
      [-0.01664, 2],
      [-0.016, 2],
      [-0.04965, 0],
      [-0.0165, 2],
      [-0.01622, 2],
      [-0.04784, 0],
      [-0.04616, 3],
      [-0.01624, 2],
      [-0.01626, 2],
      [-0.01514, 2],
      [-0.0158, 2],
      [-0.01614, 2],
      [-0.05075, 3],
      [-0.05291, 3],
      [-0.04943, 3],
      [-0.016, 2],
      [-0.01619, 2]
    ],
    "red_o_points": [],
    "y_categories": ["N", "NOT APPLICABLE", "Y", "nan"],
    "blue_o_points": [],
    "blue_x_points": [
      [-0.01516, 2],
      [-0.01465, 2],
      [-0.01421, 2],
      [-0.01508, 2],
      [0.10387, 1],
      [0.10108, 1],
      [0.08571, 1],
      [0.09342, 1],
      [-0.01502, 2],
      [0.09392, 1],
      [-0.01459, 2],
      [0.09464, 1],
      [0.0974, 1],
      [0.09457, 1],
      [-0.01447, 2]
    ]
  },
  "QA_mulInjOrthesisType[ShoulderSupport]": {
    "red_x_points": [
      [-0.01996, 0],
      [-0.0202, 0],
      [-0.0195, 0],
      [-0.07159, 2],
      [-0.01946, 0],
      [-0.02013, 0],
      [-0.01897, 0],
      [-0.07166, 2],
      [-0.01887, 0],
      [-0.01982, 0],
      [-0.01944, 0],
      [-0.01968, 0],
      [-0.02002, 0],
      [-0.01977, 0],
      [-0.07049, 2],
      [-0.01946, 0],
      [-0.01927, 0],
      [-0.07094, 2],
      [-0.06845, 3],
      [-0.01931, 0],
      [-0.01892, 0],
      [-0.01907, 0],
      [-0.01915, 0],
      [-0.01995, 0],
      [-0.0722, 3],
      [-0.07273, 3],
      [-0.07136, 3],
      [-0.01947, 0],
      [-0.01971, 0]
    ],
    "red_o_points": [],
    "y_categories": ["N", "NOT APPLICABLE", "Y", "nan"],
    "blue_o_points": [],
    "blue_x_points": [
      [-0.0186, 0],
      [-0.018, 0],
      [-0.01793, 0],
      [-0.01786, 0],
      [0.14271, 1],
      [0.13881, 1],
      [0.13364, 1],
      [0.13594, 1],
      [-0.01788, 0],
      [0.13812, 1],
      [-0.01827, 0],
      [0.13927, 1],
      [0.13993, 1],
      [0.13861, 1],
      [-0.01894, 0]
    ]
  },
  "QA_yonInjUnconscio": {
    "red_x_points": [
      [-0.04148, 1],
      [-0.03562, 1],
      [0.00271, 2],
      [0.00024, 2],
      [0.00271, 2],
      [-0.05081, 1],
      [0.00274, 2],
      [-0.00205, 2],
      [0.00101, 2],
      [-0.04823, 1],
      [-0.04268, 1],
      [-0.05003, 1],
      [-0.00514, 2],
      [-0.00521, 2],
      [-0.01193, 1],
      [-0.04277, 1],
      [-0.04288, 1],
      [-0.01888, 1],
      [-0.01959, 1],
      [-0.04104, 1],
      [-0.00558, 2],
      [0.00084, 2],
      [-0.0491, 1],
      [-0.04301, 1],
      [-0.00336, 2],
      [-0.00712, 2],
      [-0.00313, 2],
      [-0.04176, 1],
      [-0.00513, 2]
    ],
    "red_o_points": [],
    "y_categories": ["N", "Y", "nan"],
    "blue_o_points": [],
    "blue_x_points": [
      [-0.00115, 2],
      [0.00266, 2],
      [0.1274, 0],
      [0.00441, 2],
      [-0.00891, 1],
      [-0.00763, 1],
      [0.04901, 0],
      [0.08468, 0],
      [0.0023, 2],
      [0.07743, 0],
      [0.13309, 0],
      [-0.00193, 2],
      [-0.01139, 1],
      [-0.00188, 2],
      [0.15818, 0]
    ]
  },
  "QS_mulTransfSite[Oberlin]": {
    "red_x_points": [
      [-0.00121, 3],
      [-0.04723, 0],
      [-0.042, 0],
      [-0.03099, 0],
      [-0.04198, 0],
      [0.00353, 2],
      [-0.04113, 0],
      [-0.00389, 3],
      [0.00686, 2],
      [0.00348, 2],
      [-0.00122, 3],
      [0.00402, 2],
      [-0.00477, 3],
      [-0.00075, 2],
      [-0.02593, 0],
      [-0.00096, 3],
      [-0.00115, 3],
      [-0.00035, 3],
      [-0.01811, 0],
      [-0.00101, 3],
      [-0.00432, 3],
      [-0.00417, 3],
      [0.00369, 2],
      [-0.03726, 0],
      [-0.00338, 3],
      [0.0317, 1],
      [-0.00314, 3],
      [-0.03634, 0],
      [-0.00431, 3]
    ],
    "red_o_points": [],
    "y_categories": ["N", "NOT APPLICABLE", "Y", "nan"],
    "blue_o_points": [],
    "blue_x_points": [
      [0.12011, 1],
      [-0.00246, 3],
      [0.01032, 2],
      [0.01267, 2],
      [0.00118, 3],
      [0.05795, 1],
      [0.02163, 1],
      [0.00279, 2],
      [-0.00251, 3],
      [-2e-5, 3],
      [0.0099, 2],
      [0.03574, 1],
      [0.0006, 3],
      [0.03523, 1],
      [-0.0008, 3]
    ]
  }
}
