{
  "QA_lstPexMuscstrength[ElbowFlex]": {
    "red_x_points": [
      [-0.01123, 1],
      [-0.00012, 2],
      [-0.01051, 1],
      [-0.01045, 1],
      [-0.01109, 1],
      [-0.01102, 1],
      [-0.01078, 1],
      [-0.01093, 1],
      [-0.01038, 1],
      [-0.01071, 1],
      [-0.01069, 1],
      [-0.01084, 1],
      [6e-5, 2],
      [-0.00135, 2],
      [0.00087, 2],
      [-0.01092, 1],
      [-0.01098, 1],
      [-0.01018, 1],
      [-0.00994, 1],
      [-0.01133, 1],
      [-3e-5, 2],
      [-0.01093, 1],
      [-0.01089, 1],
      [-0.01005, 1],
      [-0.01039, 1],
      [0.00071, 2],
      [-0.01028, 1],
      [-0.01062, 1],
      [-4e-5, 2]
    ],
    "red_o_points": [],
    "y_categories": ["GREATER THAN OR EQUALS TO 3", "LESS THAN 3", "nan"],
    "blue_o_points": [],
    "blue_x_points": [
      [0.00136, 2],
      [-0.00999, 1],
      [0.05369, 0],
      [-0.01048, 1],
      [0.00239, 2],
      [0.0022, 2],
      [0.04152, 0],
      [-0.0091, 1],
      [-0.01043, 1],
      [0.00219, 2],
      [0.04981, 0],
      [0.04459, 0],
      [0.04603, 0],
      [0.04169, 0],
      [-0.01043, 1]
    ]
  },
  "QS_mulGraftNerve[other]": {
    "red_x_points": [
      [4e-5, 2],
      [-0.00017, 0],
      [-0.00018, 0],
      [-6e-5, 0],
      [-0.00012, 0],
      [-5e-5, 0],
      [-8e-5, 0],
      [-1e-5, 2],
      [-0.00012, 0],
      [-0.0001, 0],
      [-1e-5, 2],
      [-0.00013, 0],
      [-1e-5, 2],
      [-0.0002, 0],
      [-0.00011, 0],
      [-2e-5, 2],
      [-1e-5, 2],
      [-2e-5, 2],
      [-9e-5, 0],
      [-1e-5, 2],
      [1e-5, 2],
      [-1e-5, 2],
      [-6e-5, 0],
      [-0.0001, 0],
      [-0.00012, 2],
      [0.00028, 1],
      [-2e-5, 2],
      [-0.0001, 0],
      [0.0, 2]
    ],
    "red_o_points": [],
    "y_categories": ["N", "NOT APPLICABLE", "nan"],
    "blue_o_points": [],
    "blue_x_points": [
      [0.00055, 1],
      [2e-5, 2],
      [-2e-5, 0],
      [-3e-5, 0],
      [0.0, 2],
      [0.00048, 1],
      [0.0001, 1],
      [-2e-5, 0],
      [1e-5, 2],
      [-0.0, 2],
      [-3e-5, 0],
      [0.00028, 1],
      [2e-5, 2],
      [0.00025, 1],
      [-3e-5, 2]
    ]
  },
  "QS_mulLysisTrunk[Upper]": {
    "red_x_points": [
      [-0.00073, 3],
      [-0.00534, 0],
      [-0.00355, 0],
      [-0.00314, 0],
      [-0.00357, 0],
      [-0.01516, 2],
      [-0.00326, 0],
      [-0.00098, 3],
      [-0.00355, 0],
      [-0.00298, 0],
      [-0.00111, 3],
      [-0.00385, 0],
      [-0.00092, 3],
      [-0.00496, 0],
      [-0.01335, 2],
      [-0.00155, 3],
      [-0.00101, 3],
      [-0.00109, 3],
      [-0.00347, 0],
      [-0.00099, 3],
      [-0.0009, 3],
      [-0.00087, 3],
      [-0.00398, 0],
      [-0.00377, 0],
      [-0.00104, 3],
      [0.0139, 1],
      [-0.00098, 3],
      [-0.01198, 2],
      [-0.00079, 3]
    ],
    "red_o_points": [],
    "y_categories": ["N", "NOT APPLICABLE", "Y", "nan"],
    "blue_o_points": [],
    "blue_x_points": [
      [0.02479, 1],
      [-0.00061, 3],
      [-0.00133, 0],
      [-0.00164, 0],
      [-0.00011, 3],
      [0.02027, 1],
      [0.01503, 1],
      [-0.00126, 0],
      [-0.00045, 3],
      [-0.00033, 3],
      [-0.00088, 0],
      [0.01746, 1],
      [-0.00066, 3],
      [0.01551, 1],
      [-0.00082, 3]
    ]
  },
  "QS_mulBpsurgeryType[Transf]": {
    "red_x_points": [
      [-5e-5, 3],
      [-0.00035, 2],
      [-0.00226, 0],
      [-0.00045, 2],
      [-0.00046, 2],
      [-0.00038, 2],
      [-0.00047, 2],
      [-0.00014, 3],
      [-0.0005, 2],
      [-0.00026, 2],
      [-5e-5, 3],
      [-0.00041, 2],
      [-0.00016, 3],
      [-0.00054, 2],
      [-0.00048, 2],
      [-6e-5, 3],
      [-7e-5, 3],
      [-4e-5, 3],
      [-0.00038, 2],
      [-3e-5, 3],
      [-0.00017, 3],
      [-0.00013, 3],
      [-0.0003, 2],
      [-0.00041, 2],
      [-0.0001, 3],
      [0.00125, 1],
      [-0.00014, 3],
      [-0.00028, 2],
      [-0.00015, 3]
    ],
    "red_o_points": [],
    "y_categories": ["N", "NOT APPLICABLE", "Y", "nan"],
    "blue_o_points": [],
    "blue_x_points": [
      [0.00252, 1],
      [-9e-5, 3],
      [-6e-5, 2],
      [-0.00047, 2],
      [-4e-5, 3],
      [0.00194, 1],
      [0.00156, 1],
      [-0.00029, 2],
      [-0.00011, 3],
      [-3e-5, 3],
      [-2e-5, 2],
      [0.00106, 1],
      [-3e-5, 3],
      [0.00211, 1],
      [-6e-5, 3]
    ]
  },
  "participant_code": {
    "red_x_points": [
      [-0.03154, 1],
      [-0.03243, 2],
      [-0.03161, 3],
      [-0.03181, 4],
      [-0.03236, 5],
      [-0.03119, 8],
      [-0.03195, 9],
      [-0.03202, 10],
      [-0.03058, 11],
      [-0.03298, 13],
      [-0.03263, 14],
      [-0.03092, 18],
      [-0.03181, 19],
      [-0.03243, 20],
      [-0.03126, 23],
      [-0.03147, 26],
      [-0.03209, 28],
      [-0.03202, 29],
      [-0.03236, 30],
      [-0.03113, 31],
      [-0.03202, 32],
      [-0.03229, 34],
      [-0.03092, 36],
      [-0.03133, 38],
      [-0.03346, 39],
      [-0.03126, 40],
      [-0.0325, 41],
      [-0.02989, 42],
      [-0.03222, 43]
    ],
    "red_o_points": [],
    "y_categories": [
      "P16554",
      "P18297",
      "P19283",
      "P19287",
      "P23172",
      "P23391",
      "P30595",
      "P31645",
      "P31691",
      "P34778",
      "P35046",
      "P36328",
      "P43633",
      "P4544",
      "P46417",
      "P48965",
      "P53068",
      "P5497",
      "P58556",
      "P59529",
      "P62483",
      "P64658",
      "P65202",
      "P66816",
      "P6751",
      "P7408",
      "P75566",
      "P76226",
      "P79971",
      "P82621",
      "P82990",
      "P84549",
      "P84932",
      "P85825",
      "P86989",
      "P8770",
      "P87791",
      "P90550",
      "P93159",
      "P94969",
      "P96710",
      "P97130",
      "P9744",
      "P98500",
      "nan"
    ],
    "blue_o_points": [],
    "blue_x_points": [
      [0.06307, 0],
      [0.0615, 6],
      [0.06071, 7],
      [0.0615, 12],
      [0.05979, 15],
      [0.06307, 16],
      [0.06123, 17],
      [0.06215, 21],
      [0.06176, 22],
      [0.05939, 24],
      [0.06228, 25],
      [0.05834, 27],
      [0.06426, 33],
      [0.06163, 35],
      [0.06176, 37]
    ]
  },
  "QS_mulGraftNerve[Ac]": {
    "red_x_points": [
      [2e-5, 2],
      [-0.00018, 0],
      [-0.00014, 0],
      [-4e-5, 0],
      [-6e-5, 0],
      [-4e-5, 0],
      [-0.0001, 0],
      [1e-5, 2],
      [-0.0001, 0],
      [-2e-5, 0],
      [-0.0, 2],
      [-8e-5, 0],
      [1e-5, 2],
      [-0.00016, 0],
      [-0.00014, 0],
      [-3e-5, 2],
      [-0.0, 2],
      [-4e-5, 0],
      [-3e-5, 2],
      [1e-5, 2],
      [1e-5, 2],
      [-0.00014, 0],
      [-0.0001, 0],
      [1e-5, 2],
      [0.00015, 1],
      [1e-5, 2],
      [-4e-5, 0],
      [1e-5, 2]
    ],
    "red_o_points": [],
    "y_categories": ["N", "NOT APPLICABLE", "nan"],
    "blue_o_points": [],
    "blue_x_points": [
      [0.00063, 1],
      [2e-5, 2],
      [3e-5, 0],
      [2e-5, 0],
      [1e-5, 2],
      [0.00017, 1],
      [7e-5, 1],
      [-4e-5, 0],
      [2e-5, 2],
      [-0.0, 2],
      [0.0001, 1],
      [-3e-5, 2],
      [0.00023, 1],
      [-3e-5, 2]
    ]
  },
  "QS_mulNeuromadSite[C8]": {
    "red_x_points": [
      [-7e-5, 2],
      [-0.00108, 0],
      [-0.00032, 0],
      [-0.00051, 0],
      [-0.00059, 0],
      [-0.00049, 0],
      [-0.00042, 0],
      [-0.00022, 2],
      [-0.00043, 0],
      [-0.00056, 0],
      [-0.0, 2],
      [-0.0006, 0],
      [-0.00024, 2],
      [-0.00084, 0],
      [-0.00084, 0],
      [-0.00014, 2],
      [-7e-5, 2],
      [-7e-5, 2],
      [-0.00054, 0],
      [-0.00016, 2],
      [-0.00015, 2],
      [-0.00021, 2],
      [-0.00056, 0],
      [-0.00057, 0],
      [-0.00025, 2],
      [0.00115, 1],
      [-0.00016, 2],
      [-0.00049, 0],
      [-0.00014, 2]
    ],
    "red_o_points": [],
    "y_categories": ["N", "NOT APPLICABLE", "nan"],
    "blue_o_points": [],
    "blue_x_points": [
      [0.00305, 1],
      [-0.00011, 2],
      [-0.00033, 0],
      [-0.00019, 0],
      [7e-5, 2],
      [0.0027, 1],
      [0.00142, 1],
      [-0.00029, 0],
      [-0.00012, 2],
      [-4e-5, 2],
      [-0.00027, 0],
      [0.00196, 1],
      [0.0, 2],
      [0.00175, 1],
      [-3e-5, 2]
    ]
  },
  "QS_mulGraftNerve[Ph]": {
    "red_x_points": [
      [1e-5, 2],
      [-8e-5, 0],
      [-0.0001, 0],
      [-4e-5, 0],
      [-7e-5, 0],
      [-8e-5, 0],
      [-7e-5, 0],
      [-3e-5, 0],
      [-8e-5, 0],
      [3e-5, 2],
      [-8e-5, 0],
      [1e-5, 2],
      [-3e-5, 0],
      [-8e-5, 0],
      [3e-5, 2],
      [3e-5, 2],
      [2e-5, 2],
      [-8e-5, 0],
      [3e-5, 2],
      [2e-5, 2],
      [1e-5, 2],
      [-8e-5, 0],
      [-8e-5, 0],
      [1e-5, 2],
      [0.00012, 1],
      [1e-5, 2],
      [-8e-5, 0],
      [2e-5, 2]
    ],
    "red_o_points": [],
    "y_categories": ["N", "NOT APPLICABLE", "nan"],
    "blue_o_points": [],
    "blue_x_points": [
      [0.00022, 1],
      [2e-5, 2],
      [-4e-5, 0],
      [-3e-5, 0],
      [3e-5, 2],
      [0.00026, 1],
      [9e-5, 1],
      [2e-5, 2],
      [1e-5, 2],
      [-4e-5, 0],
      [9e-5, 1],
      [3e-5, 2],
      [3e-5, 1],
      [1e-5, 2]
    ]
  },
  "QS_mulTransfSite[AcSsPA]": {
    "red_x_points": [
      [-9e-5, 3],
      [-0.00126, 0],
      [-0.00085, 0],
      [-0.00075, 0],
      [-0.00116, 0],
      [-0.00087, 0],
      [-0.00099, 0],
      [-0.00025, 3],
      [-0.00111, 0],
      [-0.00081, 0],
      [-0.00016, 3],
      [-0.00091, 0],
      [-0.00027, 3],
      [-0.0011, 0],
      [-0.00267, 2],
      [-8e-5, 3],
      [-9e-5, 3],
      [-8e-5, 3],
      [-0.00087, 0],
      [-3e-5, 3],
      [-0.00025, 3],
      [-0.0001, 3],
      [-0.00098, 0],
      [-0.00079, 0],
      [-0.00017, 3],
      [0.00225, 1],
      [-0.0001, 3],
      [-0.00085, 0],
      [-0.00036, 3]
    ],
    "red_o_points": [],
    "y_categories": ["N", "NOT APPLICABLE", "Y", "nan"],
    "blue_o_points": [],
    "blue_x_points": [
      [0.00508, 1],
      [5e-5, 3],
      [-0.00057, 0],
      [-0.0005, 0],
      [-1e-5, 3],
      [0.00384, 1],
      [0.00257, 1],
      [-0.00067, 0],
      [-2e-5, 3],
      [2e-5, 3],
      [-0.00056, 0],
      [0.00338, 1],
      [-2e-5, 3],
      [0.00318, 1],
      [-3e-5, 3]
    ]
  },
  "QA_lstPexPalle[Elbow]": {
    "red_x_points": [
      [-0.00061, 4],
      [-0.00334, 4],
      [-0.0023, 4],
      [-0.00165, 3],
      [-0.00399, 4],
      [-0.00079, 3],
      [-0.00375, 4],
      [-0.00064, 4],
      [-0.00493, 4],
      [-0.00096, 3],
      [-0.0029, 1],
      [-0.00519, 4],
      [-0.00084, 4],
      [-0.00547, 4],
      [-0.00162, 4],
      [0.00034, 3],
      [-0.00771, 0],
      [0.0004, 3],
      [-0.00755, 2],
      [0.00013, 3],
      [-0.00054, 4],
      [-0.00068, 4],
      [-0.00515, 4],
      [-0.00365, 4],
      [-0.00021, 4],
      [-0.02617, 3],
      [-0.0004, 4],
      [-0.00618, 0],
      [-0.00077, 4]
    ],
    "red_o_points": [],
    "y_categories": ["ABS", "HYPO", "NAIA", "PT", "nan"],
    "blue_o_points": [],
    "blue_x_points": [
      [0.00488, 4],
      [8e-5, 4],
      [0.00441, 3],
      [0.03598, 1],
      [6e-5, 4],
      [0.0045, 4],
      [0.00974, 1],
      [-0.00357, 4],
      [0.0004, 4],
      [0.00023, 4],
      [0.02551, 1],
      [0.00434, 4],
      [0.00117, 3],
      [0.00455, 4],
      [0.00482, 3]
    ]
  },
  "QA_lstPexArthre[Index]": {
    "red_x_points": [
      [-0.01056, 0],
      [-0.00391, 2],
      [-0.0033, 2],
      [-0.00587, 0],
      [-0.00839, 0],
      [0.00694, 1],
      [-0.00745, 0],
      [0.00031, 2],
      [0.00815, 1],
      [-0.0111, 0],
      [0.00305, 1],
      [-0.00575, 2],
      [9e-5, 2],
      [0.00844, 1],
      [-0.00275, 2],
      [0.00327, 1],
      [-0.01017, 0],
      [0.00221, 1],
      [-0.00407, 2],
      [-0.0115, 0],
      [0.0003, 2],
      [-0.00014, 2],
      [-0.00667, 2],
      [-0.0052, 2],
      [0.00257, 1],
      [-0.0006, 2],
      [0.00047, 2],
      [-0.00594, 0],
      [0.00031, 2]
    ],
    "red_o_points": [],
    "y_categories": ["NPV", "PV", "nan"],
    "blue_o_points": [],
    "blue_x_points": [
      [7e-5, 0],
      [0.00142, 2],
      [0.0113, 1],
      [0.01361, 1],
      [0.00263, 2],
      [-0.00015, 2],
      [0.00156, 1],
      [0.00965, 1],
      [0.00158, 2],
      [0.00173, 2],
      [0.0106, 1],
      [0.00222, 1],
      [0.00445, 1],
      [-0.00025, 2],
      [0.00684, 1]
    ]
  },
  "QS_mulGraftNerve[IS]": {
    "red_x_points": [
      [0.0, 2],
      [-3e-5, 0],
      [-3e-5, 0],
      [0.0, 2],
      [-3e-5, 0],
      [-3e-5, 0],
      [0.0, 2],
      [0.0, 2],
      [-3e-5, 0],
      [0.0, 2]
    ],
    "red_o_points": [],
    "y_categories": ["N", "NOT APPLICABLE", "nan"],
    "blue_o_points": [],
    "blue_x_points": [[0.00017, 1], [0.0, 2]]
  },
  "QA_yonInjTbi": {
    "red_x_points": [
      [0.00818, 0],
      [-0.00194, 2],
      [-0.00241, 0],
      [-0.00188, 0],
      [-0.00244, 2],
      [0.00086, 1],
      [-0.00283, 0],
      [-0.01093, 2],
      [-0.00507, 2],
      [0.00109, 1],
      [-0.00538, 1],
      [-0.00477, 0],
      [0.00853, 0],
      [0.00139, 1],
      [0.00023, 1],
      [-0.00655, 1],
      [-0.00511, 1],
      [-0.00606, 1],
      [0.00084, 1],
      [-0.00573, 1],
      [0.00777, 0],
      [-0.00659, 1],
      [0.00151, 1],
      [0.00136, 1],
      [-0.00582, 1],
      [-0.00089, 2],
      [-0.01126, 2],
      [0.00022, 1],
      [-0.00775, 1]
    ],
    "red_o_points": [],
    "y_categories": ["N", "Y", "nan"],
    "blue_o_points": [],
    "blue_x_points": [
      [0.00046, 0],
      [-0.00332, 1],
      [0.00252, 1],
      [0.0031, 1],
      [0.01347, 0],
      [2e-5, 1],
      [6e-5, 1],
      [0.00366, 1],
      [0.01539, 0],
      [0.01233, 0],
      [0.00241, 1],
      [4e-5, 2],
      [-0.00442, 1],
      [7e-5, 2],
      [0.01563, 0]
    ]
  },
  "QA_mulInjOrthesisType[ArmSling]": {
    "red_x_points": [
      [-0.00817, 2],
      [-0.00814, 2],
      [-0.00724, 2],
      [-0.00765, 2],
      [-0.00767, 2],
      [-0.00776, 2],
      [-0.00755, 2],
      [-0.0077, 2],
      [-0.00772, 2],
      [-0.00756, 2],
      [-0.00781, 2],
      [-0.00766, 2],
      [-0.0078, 2],
      [-0.0074, 2],
      [-0.02377, 0],
      [-0.0076, 2],
      [-0.00775, 2],
      [-0.02372, 0],
      [-0.02343, 3],
      [-0.00752, 2],
      [-0.00768, 2],
      [-0.00754, 2],
      [-0.00758, 2],
      [-0.00757, 2],
      [-0.02405, 3],
      [-0.02549, 3],
      [-0.02403, 3],
      [-0.00802, 2],
      [-0.00777, 2]
    ],
    "red_o_points": [],
    "y_categories": ["N", "NOT APPLICABLE", "Y", "nan"],
    "blue_o_points": [],
    "blue_x_points": [
      [-0.00711, 2],
      [-0.00745, 2],
      [-0.00735, 2],
      [-0.00733, 2],
      [0.04862, 1],
      [0.04793, 1],
      [0.04432, 1],
      [0.04793, 1],
      [-0.00714, 2],
      [0.04546, 1],
      [-0.00736, 2],
      [0.0461, 1],
      [0.04706, 1],
      [0.04488, 1],
      [-0.0072, 2]
    ]
  },
  "QS_lstBpsurgSide": {
    "red_x_points": [
      [-0.00077, 3],
      [-0.01227, 0],
      [-0.0134, 0],
      [-0.01109, 0],
      [-0.01269, 0],
      [-0.01303, 0],
      [-0.01234, 0],
      [-0.0015, 3],
      [-0.01369, 0],
      [0.00112, 2],
      [-0.00145, 3],
      [0.00048, 2],
      [-0.00129, 3],
      [0.00021, 2],
      [-0.00178, 2],
      [-0.00145, 3],
      [-0.00088, 3],
      [-0.00125, 3],
      [-0.00872, 0],
      [-0.00087, 3],
      [-0.00138, 3],
      [-0.00128, 3],
      [1e-5, 2],
      [0.00085, 2],
      [-0.00109, 3],
      [0.01443, 1],
      [-0.00098, 3],
      [-0.0113, 0],
      [-0.00113, 3]
    ],
    "red_o_points": [],
    "y_categories": ["L", "NOT APPLICABLE", "R", "nan"],
    "blue_o_points": [],
    "blue_x_points": [
      [0.0309, 1],
      [-0.00059, 3],
      [0.00496, 2],
      [0.00682, 2],
      [-4e-5, 3],
      [0.017, 1],
      [0.0134, 1],
      [-0.00204, 0],
      [-0.00075, 3],
      [-0.0002, 3],
      [0.00409, 2],
      [0.01841, 1],
      [-0.00069, 3],
      [0.01795, 1],
      [-0.00071, 3]
    ]
  },
  "QA_mulInjOrthesisType[ShoulderSupport]": {
    "red_x_points": [
      [-0.00698, 0],
      [-0.00699, 0],
      [-0.00721, 0],
      [-0.02549, 2],
      [-0.00691, 0],
      [-0.00726, 0],
      [-0.00691, 0],
      [-0.0255, 2],
      [-0.00704, 0],
      [-0.00664, 0],
      [-0.00718, 0],
      [-0.00715, 0],
      [-0.0071, 0],
      [-0.00686, 0],
      [-0.02558, 2],
      [-0.00678, 0],
      [-0.00698, 0],
      [-0.02545, 2],
      [-0.02471, 3],
      [-0.00693, 0],
      [-0.00667, 0],
      [-0.00698, 0],
      [-0.00715, 0],
      [-0.00704, 0],
      [-0.02502, 3],
      [-0.02592, 3],
      [-0.02565, 3],
      [-0.00674, 0],
      [-0.00693, 0]
    ],
    "red_o_points": [],
    "y_categories": ["N", "NOT APPLICABLE", "Y", "nan"],
    "blue_o_points": [],
    "blue_x_points": [
      [-0.00657, 0],
      [-0.00676, 0],
      [-0.00658, 0],
      [-0.00652, 0],
      [0.0515, 1],
      [0.05182, 1],
      [0.04875, 1],
      [0.05003, 1],
      [-0.00627, 0],
      [0.04746, 1],
      [-0.00698, 0],
      [0.04779, 1],
      [0.04928, 1],
      [0.04944, 1],
      [-0.00662, 0]
    ]
  },
  "QA_yonInjUnconscio": {
    "red_x_points": [
      [-0.01481, 1],
      [-0.01397, 1],
      [-0.00201, 2],
      [-0.00222, 2],
      [-0.00211, 2],
      [-0.01504, 1],
      [-0.002, 2],
      [-0.00272, 2],
      [-0.00222, 2],
      [-0.01524, 1],
      [-0.01386, 1],
      [-0.01489, 1],
      [-0.00359, 2],
      [-0.00194, 2],
      [-0.01032, 1],
      [-0.01407, 1],
      [-0.01375, 1],
      [-0.01098, 1],
      [-0.01069, 1],
      [-0.01378, 1],
      [-0.00349, 2],
      [-0.00241, 2],
      [-0.0152, 1],
      [-0.01452, 1],
      [-0.00278, 2],
      [-0.00264, 2],
      [-0.00295, 2],
      [-0.01381, 1],
      [-0.00327, 2]
    ],
    "red_o_points": [],
    "y_categories": ["N", "Y", "nan"],
    "blue_o_points": [],
    "blue_x_points": [
      [-0.00138, 2],
      [-0.00167, 2],
      [0.05249, 0],
      [-0.00098, 2],
      [-0.00718, 1],
      [-0.00843, 1],
      [0.03522, 0],
      [0.04441, 0],
      [-0.00183, 2],
      [0.0407, 0],
      [0.05089, 0],
      [-0.0019, 2],
      [-0.00947, 1],
      [-0.00208, 2],
      [0.05252, 0]
    ]
  },
  "QA_lstPexInspectio[SurgicalScar]": {
    "red_x_points": [
      [-0.00292, 1],
      [-0.00507, 1],
      [-0.00651, 0],
      [-0.00393, 1],
      [-0.00711, 1],
      [-0.01158, 0],
      [-0.00515, 1],
      [-0.0031, 1],
      [-0.0085, 1],
      [-0.01026, 1],
      [-0.00983, 0],
      [-0.00804, 1],
      [-0.00194, 2],
      [-0.00918, 1],
      [-0.00552, 0],
      [0.00669, 2],
      [0.00453, 2],
      [-0.00713, 1],
      [-0.00465, 1],
      [-0.00568, 1],
      [-0.00282, 2],
      [-0.0037, 1],
      [-0.00862, 1],
      [0.01214, 2],
      [-0.00318, 1],
      [-0.00418, 1],
      [-0.00189, 1],
      [0.00553, 2],
      [-0.00327, 1]
    ],
    "red_o_points": [],
    "y_categories": ["ABS", "NAIA", "PT", "nan"],
    "blue_o_points": [],
    "blue_x_points": [
      [-0.00029, 1],
      [0.01122, 2],
      [0.02459, 2],
      [0.03062, 2],
      [0.00281, 1],
      [0.00049, 1],
      [0.00044, 0],
      [-0.00576, 1],
      [-9e-5, 1],
      [0.00331, 1],
      [0.02226, 2],
      [-0.00035, 1],
      [0.00902, 2],
      [0.00423, 0],
      [0.01236, 2]
    ]
  },
  "QS_mulGraftNerve[Me]": {
    "red_x_points": [
      [-0.0, 2],
      [-3e-5, 0],
      [-3e-5, 0],
      [-3e-5, 0],
      [-3e-5, 0],
      [-0.0, 2],
      [-3e-5, 0],
      [-3e-5, 0],
      [-0.0, 2],
      [-3e-5, 0],
      [-0.0, 2],
      [-3e-5, 0],
      [-0.0, 2],
      [-0.0, 2],
      [-0.0, 2],
      [-3e-5, 0],
      [-0.0, 2],
      [-0.0, 2],
      [-3e-5, 0],
      [-3e-5, 0],
      [-0.0, 2],
      [9e-5, 1],
      [-3e-5, 0]
    ],
    "red_o_points": [],
    "y_categories": ["N", "NOT APPLICABLE", "nan"],
    "blue_o_points": [],
    "blue_x_points": [
      [9e-5, 1],
      [-3e-5, 0],
      [-3e-5, 0],
      [-0.0, 2],
      [9e-5, 1],
      [-3e-5, 0],
      [-0.0, 2],
      [-0.0, 2],
      [9e-5, 1],
      [-0.0, 2],
      [9e-5, 1],
      [-0.0, 2]
    ]
  },
  "QS_mulBpsurgeryType[Lysis]": {
    "red_x_points": [
      [-0.00122, 3],
      [-0.00497, 0],
      [-0.0162, 2],
      [-0.01473, 2],
      [-0.00283, 0],
      [-0.01692, 2],
      [-0.00295, 0],
      [-0.00147, 3],
      [-0.00282, 0],
      [-0.00258, 0],
      [-0.00131, 3],
      [-0.00264, 0],
      [-0.00151, 3],
      [-0.00467, 0],
      [-0.01654, 2],
      [-0.0011, 3],
      [-0.00131, 3],
      [-0.00089, 3],
      [-0.00239, 0],
      [-0.0011, 3],
      [-0.00155, 3],
      [-0.00138, 3],
      [-0.00286, 0],
      [-0.00261, 0],
      [-0.00139, 3],
      [0.01968, 1],
      [-0.00139, 3],
      [-0.0162, 2],
      [-0.00142, 3]
    ],
    "red_o_points": [],
    "y_categories": ["N", "NOT APPLICABLE", "Y", "nan"],
    "blue_o_points": [],
    "blue_x_points": [
      [0.03069, 1],
      [-0.00089, 3],
      [-0.0009, 0],
      [-0.00076, 0],
      [-0.00033, 3],
      [0.02454, 1],
      [0.01809, 1],
      [-0.00147, 0],
      [-0.00074, 3],
      [-0.00035, 3],
      [-0.00082, 0],
      [0.02146, 1],
      [-0.00068, 3],
      [0.02204, 1],
      [-0.00064, 3]
    ]
  },
  "QS_mulLysisSite[Trunk]": {
    "red_x_points": [
      [-0.00047, 3],
      [-0.00412, 0],
      [-0.00298, 0],
      [-0.00247, 0],
      [-0.00303, 0],
      [-0.01264, 2],
      [-0.00287, 0],
      [-0.0012, 3],
      [-0.00278, 0],
      [-0.00253, 0],
      [-0.00094, 3],
      [-0.00294, 0],
      [-0.00105, 3],
      [-0.00383, 0],
      [-0.01115, 2],
      [-0.00083, 3],
      [-0.00078, 3],
      [-0.00079, 3],
      [-0.00287, 0],
      [-0.00057, 3],
      [-0.00104, 3],
      [-0.00084, 3],
      [-0.00299, 0],
      [-0.00272, 0],
      [-0.00115, 3],
      [0.01221, 1],
      [-0.00084, 3],
      [-0.01061, 2],
      [-0.00108, 3]
    ],
    "red_o_points": [],
    "y_categories": ["N", "NOT APPLICABLE", "Y", "nan"],
    "blue_o_points": [],
    "blue_x_points": [
      [0.02069, 1],
      [-0.00062, 3],
      [-0.00149, 0],
      [-0.00111, 0],
      [-0.00011, 3],
      [0.01709, 1],
      [0.01295, 1],
      [-0.00153, 0],
      [-0.00043, 3],
      [-0.00028, 3],
      [-0.00092, 0],
      [0.01358, 1],
      [-0.00035, 3],
      [0.01279, 1],
      [-0.00037, 3]
    ]
  },
  "QS_mulGraftTrunk[UpperTrunk]": {
    "red_x_points": [
      [-0.0003, 3],
      [-0.00239, 0],
      [-0.00191, 0],
      [-0.00144, 0],
      [-0.00196, 0],
      [-0.00124, 0],
      [-0.00193, 0],
      [-0.00043, 3],
      [-0.00163, 0],
      [-0.00112, 0],
      [-0.00044, 3],
      [-0.00169, 0],
      [-0.00057, 3],
      [-0.0091, 2],
      [-0.00245, 0],
      [-0.00035, 3],
      [-0.00029, 3],
      [-0.00047, 3],
      [-0.00152, 0],
      [-0.00027, 3],
      [-0.00061, 3],
      [-0.00052, 3],
      [-0.00166, 0],
      [-0.00195, 0],
      [-0.00063, 3],
      [0.00421, 1],
      [-0.00032, 3],
      [-0.00116, 0],
      [-0.00051, 3]
    ],
    "red_o_points": [],
    "y_categories": ["N", "NOT APPLICABLE", "Y", "nan"],
    "blue_o_points": [],
    "blue_x_points": [
      [0.01021, 1],
      [-0.00026, 3],
      [-0.00047, 0],
      [0.00031, 0],
      [0.00026, 3],
      [0.00781, 1],
      [0.00479, 1],
      [-0.00107, 0],
      [-0.00029, 3],
      [-0.00011, 3],
      [-0.00046, 0],
      [0.0079, 1],
      [-0.00023, 3],
      [0.00651, 1],
      [-0.0003, 3]
    ]
  },
  "QS_mulTransfSite[PhMc]": {
    "red_x_points": [
      [-0.0002, 3],
      [-0.00268, 0],
      [-0.00185, 0],
      [-0.00155, 0],
      [-0.00209, 0],
      [-0.00178, 0],
      [-0.00754, 2],
      [-0.00074, 3],
      [-0.00196, 0],
      [-0.00177, 0],
      [-0.00065, 3],
      [-0.00202, 0],
      [-0.00046, 3],
      [-0.00282, 0],
      [-0.00191, 0],
      [-0.00039, 3],
      [-0.00031, 3],
      [-0.00037, 3],
      [-0.00643, 2],
      [-0.00022, 3],
      [-0.00056, 3],
      [-0.00064, 3],
      [-0.00213, 0],
      [-0.0022, 0],
      [-0.00058, 3],
      [0.00678, 1],
      [-0.0006, 3],
      [-0.00153, 0],
      [-0.00043, 3]
    ],
    "red_o_points": [],
    "y_categories": ["N", "NOT APPLICABLE", "Y", "nan"],
    "blue_o_points": [],
    "blue_x_points": [
      [0.01201, 1],
      [-0.00025, 3],
      [-0.0004, 0],
      [-0.00112, 0],
      [0.0, 3],
      [0.00936, 1],
      [0.0066, 1],
      [-0.00155, 0],
      [-0.0002, 3],
      [-0.00023, 3],
      [-0.00095, 0],
      [0.00821, 1],
      [-0.00028, 3],
      [0.00861, 1],
      [-0.00017, 3]
    ]
  },
  "QS_mulLysisSite[Root]": {
    "red_x_points": [
      [-0.00025, 3],
      [-0.002, 0],
      [-0.00597, 2],
      [-0.00139, 0],
      [-0.00151, 0],
      [-0.0016, 0],
      [-0.00157, 0],
      [-0.0002, 3],
      [-0.00164, 0],
      [-0.00146, 0],
      [-0.00035, 3],
      [-0.00171, 0],
      [-0.00051, 3],
      [-0.00173, 0],
      [-0.00178, 0],
      [-0.00033, 3],
      [-0.00023, 3],
      [-0.00031, 3],
      [-0.00145, 0],
      [-0.00022, 3],
      [-0.00044, 3],
      [-0.00028, 3],
      [-0.00207, 0],
      [-0.00169, 0],
      [-0.00037, 3],
      [0.00476, 1],
      [-0.00037, 3],
      [-0.00485, 2],
      [-0.00039, 3]
    ],
    "red_o_points": [],
    "y_categories": ["N", "NOT APPLICABLE", "Y", "nan"],
    "blue_o_points": [],
    "blue_x_points": [
      [0.01065, 1],
      [-5e-5, 3],
      [-0.00069, 0],
      [-0.00111, 0],
      [-0.0001, 3],
      [0.00734, 1],
      [0.00536, 1],
      [-0.00111, 0],
      [-0.00015, 3],
      [-0.00016, 3],
      [-0.00037, 0],
      [0.00628, 1],
      [-0.00027, 3],
      [0.00642, 1],
      [-0.00011, 3]
    ]
  },
  "QA_lstPexInspectio[ShoulderSubdisloc]": {
    "red_x_points": [
      [-0.00198, 1],
      [-0.00455, 1],
      [0.00306, 0],
      [-0.00353, 1],
      [-0.00663, 1],
      [-0.00234, 2],
      [-0.0052, 1],
      [-0.00286, 1],
      [-0.00671, 1],
      [-0.00859, 1],
      [-0.00079, 2],
      [-0.0074, 1],
      [-0.00195, 1],
      [-0.00852, 1],
      [-0.00245, 1],
      [-0.00364, 2],
      [-0.00059, 2],
      [9e-5, 1],
      [-0.0047, 1],
      [-0.00117, 1],
      [-0.01218, 0],
      [0.00346, 2],
      [-0.00181, 2],
      [-0.00098, 2],
      [-0.00184, 1],
      [-0.01328, 2],
      [-0.00214, 1],
      [-0.00109, 2],
      [-0.003, 1]
    ],
    "red_o_points": [],
    "y_categories": ["ABS", "NAIA", "PT", "nan"],
    "blue_o_points": [],
    "blue_x_points": [
      [0.00409, 1],
      [0.00738, 2],
      [0.0316, 0],
      [0.00654, 2],
      [0.00099, 1],
      [0.00545, 1],
      [0.00517, 0],
      [-0.00309, 1],
      [0.01143, 2],
      [0.00073, 1],
      [0.0269, 0],
      [0.00283, 1],
      [0.00247, 1],
      [-0.00152, 2],
      [0.00231, 1]
    ]
  },
  "QS_mulGraftLevel[Trunk]": {
    "red_x_points": [
      [-0.00016, 3],
      [-0.00208, 0],
      [-0.00129, 0],
      [-0.00127, 0],
      [-0.00148, 0],
      [-0.00095, 0],
      [-0.0015, 0],
      [-0.00012, 3],
      [-0.00127, 0],
      [-0.00121, 0],
      [-0.0001, 3],
      [-0.00118, 0],
      [-0.00015, 3],
      [-0.00739, 2],
      [-0.00186, 0],
      [-0.00018, 3],
      [-0.00012, 3],
      [-0.00017, 3],
      [-0.001, 0],
      [-0.00017, 3],
      [-0.00033, 3],
      [-0.00022, 3],
      [-0.0012, 0],
      [-0.00134, 0],
      [-0.00025, 3],
      [0.0039, 1],
      [-0.00017, 3],
      [-0.00103, 0],
      [-0.0002, 3]
    ],
    "red_o_points": [],
    "y_categories": ["N", "NOT APPLICABLE", "Y", "nan"],
    "blue_o_points": [],
    "blue_x_points": [
      [0.00722, 1],
      [-4e-5, 3],
      [-0.00017, 0],
      [-3e-5, 0],
      [0.00018, 3],
      [0.00566, 1],
      [0.0039, 1],
      [-0.00049, 0],
      [-5e-5, 3],
      [0.00013, 3],
      [0.00014, 0],
      [0.00403, 1],
      [-0.00018, 3],
      [0.00441, 1],
      [-0.0002, 3]
    ]
  },
  "QA_lstPexPain[C7]": {
    "red_x_points": [
      [-0.00145, 1],
      [-0.0044, 2],
      [-0.00321, 2],
      [-0.00129, 1],
      [-0.00564, 2],
      [-0.00293, 1],
      [-0.00221, 1],
      [-0.00564, 0],
      [-0.00349, 1],
      [0.00747, 0],
      [-0.00167, 1],
      [-0.00818, 2],
      [0.00242, 2],
      [-0.00693, 2],
      [-0.00195, 2],
      [-0.0069, 0],
      [-0.00079, 1],
      [-0.00595, 0],
      [-0.00438, 2],
      [-0.00488, 0],
      [0.00221, 2],
      [0.00196, 2],
      [-0.00817, 2],
      [-0.00654, 2],
      [-0.00451, 0],
      [-0.00317, 1],
      [-0.00089, 1],
      [-0.00138, 1],
      [-0.00073, 1]
    ],
    "red_o_points": [],
    "y_categories": ["NORM", "NPV", "nan"],
    "blue_o_points": [],
    "blue_x_points": [
      [5e-5, 1],
      [0.00383, 1],
      [0.01717, 0],
      [0.02076, 0],
      [0.00552, 2],
      [0.00033, 2],
      [0.0015, 1],
      [0.0063, 2],
      [0.00541, 2],
      [0.01416, 0],
      [-1e-5, 1],
      [-0.00247, 0],
      [0.00303, 0],
      [0.00768, 1]
    ]
  },
  "QS_mulTransfSite[AcSsAA]": {
    "red_x_points": [
      [-0.00027, 3],
      [-0.00081, 2],
      [-0.00595, 0],
      [-0.0061, 0],
      [-0.00078, 2],
      [-0.00597, 0],
      [-0.00615, 0],
      [-0.00066, 3],
      [-0.00785, 0],
      [-0.00724, 0],
      [-0.00045, 3],
      [-0.0059, 0],
      [-0.00077, 3],
      [-0.00054, 2],
      [-0.00468, 0],
      [-0.00057, 3],
      [-0.00029, 3],
      [-0.00031, 3],
      [-0.00046, 2],
      [-0.00032, 3],
      [-0.00084, 3],
      [-0.00057, 3],
      [-0.00557, 0],
      [-0.00041, 2],
      [-0.00069, 3],
      [0.00851, 1],
      [-0.00069, 3],
      [-0.00404, 0],
      [-0.00067, 3]
    ],
    "red_o_points": [],
    "y_categories": ["N", "NOT APPLICABLE", "Y", "nan"],
    "blue_o_points": [],
    "blue_x_points": [
      [0.01615, 1],
      [-0.00038, 3],
      [0.00704, 2],
      [0.00672, 2],
      [-0.00015, 3],
      [0.00906, 1],
      [0.00765, 1],
      [-0.00316, 0],
      [-0.00033, 3],
      [-0.00019, 3],
      [-0.00295, 0],
      [0.01079, 1],
      [-0.00032, 3],
      [0.01124, 1],
      [-0.00016, 3]
    ]
  },
  "QS_mulNeuromadSite[C5]": {
    "red_x_points": [
      [5e-5, 2],
      [-0.00064, 0],
      [-0.00038, 0],
      [-0.0003, 0],
      [-0.00034, 0],
      [-0.0003, 0],
      [-0.00045, 0],
      [-2e-5, 2],
      [-0.00047, 0],
      [-0.00026, 0],
      [5e-5, 2],
      [-0.00038, 0],
      [-0.00013, 2],
      [-0.0008, 0],
      [-0.0006, 0],
      [6e-5, 2],
      [1e-5, 2],
      [6e-5, 2],
      [-0.00034, 0],
      [1e-5, 2],
      [-0.0001, 2],
      [-7e-5, 2],
      [-0.00046, 0],
      [-0.00047, 0],
      [-0.00019, 2],
      [0.0009, 1],
      [-8e-5, 2],
      [-0.00028, 0],
      [-4e-5, 2]
    ],
    "red_o_points": [],
    "y_categories": ["N", "NOT APPLICABLE", "nan"],
    "blue_o_points": [],
    "blue_x_points": [
      [0.00241, 1],
      [-2e-5, 2],
      [-0.00019, 0],
      [-0.00027, 0],
      [0.00015, 2],
      [0.00147, 1],
      [0.00047, 1],
      [-0.00014, 0],
      [-1e-5, 2],
      [0.00012, 2],
      [-3e-5, 0],
      [0.00088, 1],
      [6e-5, 2],
      [0.00107, 1],
      [1e-5, 2]
    ]
  },
  "QS_mulNeuromadSite[C7]": {
    "red_x_points": [
      [0.0, 2],
      [-0.00035, 0],
      [-0.00026, 0],
      [-0.00017, 0],
      [-0.00037, 0],
      [-0.0002, 0],
      [-0.00028, 0],
      [-4e-5, 2],
      [-0.00028, 0],
      [-0.00023, 0],
      [1e-5, 2],
      [-0.00028, 0],
      [-0.0001, 2],
      [-0.00054, 0],
      [-0.00029, 0],
      [0.0, 2],
      [-0.0, 2],
      [-1e-5, 2],
      [-0.00023, 0],
      [2e-5, 2],
      [-1e-5, 2],
      [-6e-5, 2],
      [-0.00032, 0],
      [-0.00029, 0],
      [-8e-5, 2],
      [0.00067, 1],
      [-5e-5, 2],
      [-0.00023, 0],
      [-6e-5, 2]
    ],
    "red_o_points": [],
    "y_categories": ["N", "NOT APPLICABLE", "nan"],
    "blue_o_points": [],
    "blue_x_points": [
      [0.00138, 1],
      [-5e-5, 2],
      [-9e-5, 0],
      [-0.0002, 0],
      [6e-5, 2],
      [0.00115, 1],
      [0.00047, 1],
      [-0.00015, 0],
      [5e-5, 2],
      [4e-5, 2],
      [-0.00012, 0],
      [0.00065, 1],
      [2e-5, 2],
      [0.00085, 1],
      [-3e-5, 2]
    ]
  },
  "QA_lstPexMuscstrength[WristExte]": {
    "red_x_points": [
      [-0.00563, 1],
      [-0.00423, 2],
      [-0.0045, 1],
      [-0.00394, 1],
      [-0.00663, 1],
      [-0.0072, 1],
      [-0.00569, 1],
      [0.00049, 0],
      [0.00707, 0],
      [-0.01031, 1],
      [0.00063, 0],
      [0.00591, 0],
      [-0.00199, 2],
      [-0.00633, 2],
      [-0.00267, 2],
      [-0.00123, 0],
      [-0.00233, 1],
      [-0.00095, 0],
      [-0.00529, 1],
      [-0.00497, 1],
      [-0.00208, 2],
      [-0.00467, 1],
      [0.00636, 0],
      [0.00524, 0],
      [-0.00162, 2],
      [-0.00083, 2],
      [-0.00405, 1],
      [-0.00332, 1],
      [-0.00195, 2]
    ],
    "red_o_points": [],
    "y_categories": ["GREATER THAN OR EQUALS TO 3", "LESS THAN 3", "nan"],
    "blue_o_points": [],
    "blue_x_points": [
      [0.00222, 0],
      [0.00238, 1],
      [0.00975, 0],
      [0.00989, 0],
      [0.00191, 2],
      [-0.0001, 2],
      [0.00109, 0],
      [0.00818, 0],
      [0.01125, 0],
      [0.00122, 2],
      [0.00764, 0],
      [-0.00039, 1],
      [0.00541, 0],
      [0.00166, 0],
      [0.00463, 1]
    ]
  },
  "QS_mulGraftNerve[TD]": {
    "red_x_points": [
      [2e-5, 2],
      [-4e-5, 0],
      [-6e-5, 0],
      [-6e-5, 0],
      [-6e-5, 0],
      [-4e-5, 0],
      [-6e-5, 0],
      [-6e-5, 0],
      [-4e-5, 0],
      [2e-5, 2],
      [-4e-5, 0],
      [-2e-5, 2],
      [-4e-5, 0],
      [2e-5, 2],
      [2e-5, 2],
      [2e-5, 2],
      [-2e-5, 2],
      [-2e-5, 2],
      [-4e-5, 0],
      [-4e-5, 0],
      [9e-5, 1],
      [-4e-5, 0],
      [-2e-5, 2]
    ],
    "red_o_points": [],
    "y_categories": ["N", "NOT APPLICABLE", "nan"],
    "blue_o_points": [],
    "blue_x_points": [
      [9e-5, 1],
      [-2e-5, 2],
      [2e-5, 2],
      [0.00016, 1],
      [9e-5, 1],
      [2e-5, 2],
      [9e-5, 1]
    ]
  },
  "QA_intPexForearmSupin": {
    "red_x_points": [
      [-0.00128, 2],
      [-0.00567, 0],
      [-0.00104, 2],
      [-0.00068, 2],
      [-0.00154, 2],
      [0.00508, 1],
      [-0.0013, 2],
      [0.00326, 1],
      [-0.00171, 2],
      [-0.0019, 2],
      [-0.00832, 0],
      [-0.01028, 0],
      [-0.00101, 2],
      [-0.00199, 2],
      [-0.00056, 2],
      [0.00552, 1],
      [-0.00882, 0],
      [0.00133, 1],
      [0.00247, 1],
      [-0.00104, 2],
      [-0.00112, 2],
      [-0.00108, 2],
      [-0.0021, 2],
      [-0.00176, 2],
      [4e-5, 2],
      [-0.02563, 1],
      [-0.00023, 2],
      [-0.00486, 0],
      [-0.00086, 2]
    ],
    "red_o_points": [],
    "y_categories": ["GREATER THAN OR EQUALS TO 80", "LESS THAN 80", "nan"],
    "blue_o_points": [],
    "blue_x_points": [
      [0.00449, 2],
      [0.00903, 1],
      [0.01386, 1],
      [-0.00156, 2],
      [0.0001, 2],
      [0.00466, 2],
      [0.00665, 0],
      [-0.00086, 2],
      [-0.00057, 2],
      [5e-5, 2],
      [0.01308, 1],
      [0.00454, 2],
      [0.00032, 2],
      [0.00483, 2],
      [0.00848, 1]
    ]
  },
  "QS_mulGraftNerve[SS]": {
    "red_x_points": [
      [-0.0, 2],
      [-2e-5, 0],
      [-2e-5, 0],
      [-2e-5, 0],
      [-2e-5, 0],
      [-2e-5, 0],
      [-2e-5, 0],
      [-0.0, 2],
      [-2e-5, 0],
      [-0.0, 2],
      [-2e-5, 0],
      [-2e-5, 0],
      [-0.0, 2],
      [-0.0, 2],
      [-0.0, 2],
      [-0.0, 2],
      [-2e-5, 0],
      [-2e-5, 0],
      [-0.0, 2],
      [8e-5, 1],
      [-0.0, 2],
      [-2e-5, 0],
      [-0.0, 2]
    ],
    "red_o_points": [],
    "y_categories": ["N", "NOT APPLICABLE", "nan"],
    "blue_o_points": [],
    "blue_x_points": [
      [8e-5, 1],
      [-0.0, 2],
      [-2e-5, 0],
      [-2e-5, 0],
      [-0.0, 2],
      [8e-5, 1],
      [-2e-5, 0],
      [-0.0, 2],
      [-2e-5, 0],
      [-0.0, 2],
      [8e-5, 1],
      [-0.0, 2]
    ]
  },
  "QA_yonInjChesttube": {
    "red_x_points": [
      [-0.00262, 2],
      [-0.00209, 2],
      [0.00219, 0],
      [-0.00137, 2],
      [-0.00314, 2],
      [0.00138, 0],
      [-0.00483, 1],
      [-0.00194, 2],
      [-0.00388, 2],
      [-0.00282, 2],
      [0.00072, 0],
      [0.0024, 0],
      [-0.00373, 2],
      [-0.00339, 2],
      [0.0006, 0],
      [0.001, 0],
      [0.00076, 0],
      [0.00096, 0],
      [-0.00392, 1],
      [-0.00151, 2],
      [-0.01894, 1],
      [-0.00317, 2],
      [-0.00315, 2],
      [0.00234, 0],
      [-0.00223, 2],
      [-0.0001, 2],
      [-0.00282, 2],
      [0.00043, 0],
      [-0.00302, 2]
    ],
    "red_o_points": [],
    "y_categories": ["N", "Y", "nan"],
    "blue_o_points": [],
    "blue_x_points": [
      [2e-5, 1],
      [-0.00127, 2],
      [0.0038, 0],
      [0.00594, 0],
      [-0.00206, 2],
      [-2e-5, 2],
      [7e-5, 0],
      [0.007, 0],
      [0.01865, 0],
      [0.01699, 0],
      [0.00323, 0],
      [-7e-5, 2],
      [0.00351, 0],
      [-6e-5, 2],
      [0.00012, 2]
    ]
  },
  "QS_mulTransfSite[IMc]": {
    "red_x_points": [
      [-0.00111, 3],
      [-0.01859, 2],
      [-0.00323, 0],
      [-0.0164, 2],
      [-0.00319, 0],
      [-0.00272, 0],
      [-0.00331, 0],
      [-0.00176, 3],
      [-0.0034, 0],
      [-0.0028, 0],
      [-0.00126, 3],
      [-0.00337, 0],
      [-0.00155, 3],
      [-0.00516, 0],
      [-0.0157, 2],
      [-0.00149, 3],
      [-0.00122, 3],
      [-0.00119, 3],
      [-0.00282, 0],
      [-0.00124, 3],
      [-0.00159, 3],
      [-0.00173, 3],
      [-0.00344, 0],
      [-0.01796, 2],
      [-0.00173, 3],
      [0.01863, 1],
      [-0.00165, 3],
      [-0.01589, 2],
      [-0.00187, 3]
    ],
    "red_o_points": [],
    "y_categories": ["N", "NOT APPLICABLE", "Y", "nan"],
    "blue_o_points": [],
    "blue_x_points": [
      [0.03316, 1],
      [-0.00107, 3],
      [-0.00096, 0],
      [-0.00132, 0],
      [-0.00048, 3],
      [0.02715, 1],
      [0.02229, 1],
      [-0.00196, 0],
      [-0.00104, 3],
      [-0.00081, 3],
      [-0.00098, 0],
      [0.02289, 1],
      [-0.00087, 3],
      [0.02366, 1],
      [-0.00096, 3]
    ]
  },
  "QS_mulLysisRoot[C7]": {
    "red_x_points": [
      [-7e-5, 3],
      [-0.00084, 0],
      [-0.00427, 2],
      [-0.00081, 0],
      [-0.00091, 0],
      [-0.00078, 0],
      [-0.00097, 0],
      [-0.00024, 3],
      [-0.00099, 0],
      [-0.00075, 0],
      [-0.00011, 3],
      [-0.00062, 0],
      [-0.00019, 3],
      [-0.00092, 0],
      [-0.00059, 0],
      [-6e-5, 3],
      [-5e-5, 3],
      [-0.00015, 3],
      [-0.00073, 0],
      [-0.00013, 3],
      [-0.0002, 3],
      [-0.00019, 3],
      [-0.00088, 0],
      [-0.00074, 0],
      [-0.00025, 3],
      [0.00272, 1],
      [-0.0002, 3],
      [-0.00066, 0],
      [-0.00015, 3]
    ],
    "red_o_points": [],
    "y_categories": ["N", "NOT APPLICABLE", "Y", "nan"],
    "blue_o_points": [],
    "blue_x_points": [
      [0.00556, 1],
      [1e-5, 3],
      [-0.00029, 0],
      [-0.00052, 0],
      [-8e-5, 3],
      [0.00281, 1],
      [0.00242, 1],
      [-0.00061, 0],
      [6e-5, 3],
      [-0.00013, 3],
      [-0.00028, 0],
      [0.00299, 1],
      [-0.00011, 3],
      [0.00295, 1],
      [-6e-5, 3]
    ]
  },
  "QS_mulLysisRoot[C6]": {
    "red_x_points": [
      [-0.00033, 3],
      [-0.00472, 0],
      [-0.01091, 2],
      [-0.00252, 0],
      [-0.00302, 0],
      [-0.00263, 0],
      [-0.00315, 0],
      [-0.00063, 3],
      [-0.00342, 0],
      [-0.00259, 0],
      [-0.00062, 3],
      [-0.003, 0],
      [-0.00082, 3],
      [-0.00442, 0],
      [-0.00396, 0],
      [-0.00059, 3],
      [-0.00057, 3],
      [-0.00036, 3],
      [-0.00267, 0],
      [-0.00046, 3],
      [-0.00067, 3],
      [-0.00063, 3],
      [-0.00298, 0],
      [-0.0032, 0],
      [-0.0006, 3],
      [0.01004, 1],
      [-0.00061, 3],
      [-0.0092, 2],
      [-0.00064, 3]
    ],
    "red_o_points": [],
    "y_categories": ["N", "NOT APPLICABLE", "Y", "nan"],
    "blue_o_points": [],
    "blue_x_points": [
      [0.02002, 1],
      [-3e-5, 3],
      [-0.0014, 0],
      [-0.00157, 0],
      [0.00029, 3],
      [0.01294, 1],
      [0.0098, 1],
      [-0.00241, 0],
      [3e-5, 3],
      [0.00017, 3],
      [-0.00093, 0],
      [0.01185, 1],
      [-5e-5, 3],
      [0.01149, 1],
      [-0.00035, 3]
    ]
  },
  "QS_mulTransfSite[AcMc]": {
    "red_x_points": [
      [-0.00012, 3],
      [-0.00155, 0],
      [-0.00112, 0],
      [-0.00102, 0],
      [-0.00123, 0],
      [-0.00086, 0],
      [-0.00117, 0],
      [-0.00041, 3],
      [-0.0012, 0],
      [-0.01045, 2],
      [-0.00016, 3],
      [-0.00103, 0],
      [-0.00016, 3],
      [-0.00146, 0],
      [-0.00128, 0],
      [-0.00061, 3],
      [-0.00019, 3],
      [-0.00037, 3],
      [-0.00102, 0],
      [-0.00059, 3],
      [-0.00014, 3],
      [-0.00031, 3],
      [-0.0011, 0],
      [-0.00108, 0],
      [-0.00029, 3],
      [0.00351, 1],
      [-0.00025, 3],
      [-0.00087, 0],
      [-0.00019, 3]
    ],
    "red_o_points": [],
    "y_categories": ["N", "NOT APPLICABLE", "Y", "nan"],
    "blue_o_points": [],
    "blue_x_points": [
      [0.00709, 1],
      [-0.0001, 3],
      [0.0015, 0],
      [0.00225, 0],
      [-0.00013, 3],
      [0.00475, 1],
      [0.00398, 1],
      [-0.00091, 0],
      [-0.00012, 3],
      [-9e-5, 3],
      [0.00142, 0],
      [0.00396, 1],
      [-0.00026, 3],
      [0.00346, 1],
      [-9e-5, 3]
    ]
  },
  "QS_mulTransfSite[Other]": {
    "red_x_points": [
      [-0.00114, 3],
      [-0.00952, 0],
      [-0.00759, 0],
      [-0.00753, 0],
      [-0.00782, 0],
      [-0.00805, 0],
      [-0.00762, 0],
      [-0.00134, 3],
      [-0.00818, 0],
      [-0.0081, 0],
      [-0.00111, 3],
      [-0.00767, 0],
      [-0.00138, 3],
      [-0.00925, 0],
      [-0.00858, 0],
      [-0.00105, 3],
      [-0.00116, 3],
      [-0.00103, 3],
      [-0.00722, 0],
      [-0.0012, 3],
      [-0.00139, 3],
      [-0.00131, 3],
      [-0.00836, 0],
      [-0.00799, 0],
      [-0.00114, 3],
      [0.01568, 1],
      [-0.00136, 3],
      [-0.00784, 0],
      [-0.00138, 3]
    ],
    "red_o_points": [],
    "y_categories": ["N", "NOT APPLICABLE", "Y", "nan"],
    "blue_o_points": [],
    "blue_x_points": [
      [0.02928, 1],
      [-0.00098, 3],
      [-0.00615, 0],
      [-0.00725, 0],
      [-0.00054, 3],
      [0.02104, 1],
      [0.0176, 1],
      [-0.00592, 0],
      [-0.00086, 3],
      [-0.00082, 3],
      [0.03766, 2],
      [0.02023, 1],
      [-0.00075, 3],
      [0.01988, 1],
      [-0.00079, 3]
    ]
  },
  "QA_yonInjBpsurg": {
    "red_x_points": [
      [-0.0005, 1],
      [-0.00045, 1],
      [-0.00059, 1],
      [-0.00061, 1],
      [-0.00076, 1],
      [-0.00037, 1],
      [-0.00069, 1],
      [-0.00063, 1],
      [-0.00063, 1],
      [-0.00043, 1],
      [-0.00055, 1],
      [-0.00049, 1],
      [-0.00074, 1],
      [-0.00073, 1],
      [-0.00039, 1],
      [-0.00046, 1],
      [-0.00042, 1],
      [-0.00045, 1],
      [-0.00035, 1],
      [-0.00046, 1],
      [-0.00066, 1],
      [-0.00074, 1],
      [-0.00041, 1],
      [-0.00036, 1],
      [-0.00062, 1],
      [0.00212, 0],
      [-0.00061, 1],
      [-0.00035, 1],
      [-0.00086, 1]
    ],
    "red_o_points": [],
    "y_categories": ["N", "Y", "nan"],
    "blue_o_points": [],
    "blue_x_points": [
      [0.00598, 0],
      [-0.0004, 1],
      [-0.00044, 1],
      [-0.00079, 1],
      [-0.00029, 1],
      [0.0026, 0],
      [0.00234, 0],
      [-0.00043, 1],
      [-0.00045, 1],
      [-0.00018, 1],
      [-0.00045, 1],
      [0.0031, 0],
      [-0.00032, 1],
      [0.00322, 0],
      [-0.00029, 1]
    ]
  },
  "QA_lstPexTouch[C8]": {
    "red_x_points": [
      [-0.00147, 1],
      [-0.0044, 2],
      [-0.00216, 1],
      [-0.00203, 1],
      [-0.00604, 2],
      [-0.00394, 1],
      [-0.00291, 1],
      [-0.00449, 0],
      [-0.00488, 1],
      [0.00951, 0],
      [-0.00162, 1],
      [-0.008, 2],
      [-0.00243, 2],
      [-0.00735, 2],
      [-0.00191, 2],
      [-0.00141, 0],
      [-0.00112, 1],
      [-0.00255, 0],
      [-0.00389, 2],
      [-0.00145, 0],
      [-0.00246, 2],
      [-0.00474, 0],
      [-0.00492, 1],
      [-0.00728, 2],
      [-0.00322, 0],
      [-0.00546, 1],
      [-0.00086, 2],
      [-0.00166, 1],
      [-0.00064, 1]
    ],
    "red_o_points": [],
    "y_categories": ["NORM", "NPV", "nan"],
    "blue_o_points": [],
    "blue_x_points": [
      [0.00377, 0],
      [0.00941, 1],
      [0.016, 0],
      [0.02149, 0],
      [0.00366, 2],
      [0.00095, 2],
      [-5e-5, 1],
      [-0.00101, 1],
      [0.00791, 1],
      [0.00392, 2],
      [0.01428, 0],
      [-0.00022, 1],
      [-0.00044, 0],
      [0.00269, 0],
      [0.00344, 0]
    ]
  },
  "QA_lstPexPalle[Clavicle]": {
    "red_x_points": [
      [-0.00029, 3],
      [-0.00176, 3],
      [-0.00138, 3],
      [0.00161, 2],
      [-0.00188, 3],
      [0.00211, 2],
      [-0.00148, 3],
      [-0.00022, 3],
      [-0.00216, 3],
      [0.00333, 2],
      [-0.01421, 0],
      [-0.00238, 3],
      [-0.00044, 3],
      [-0.00196, 3],
      [-0.00075, 3],
      [-0.01574, 0],
      [-0.01407, 0],
      [0.0109, 2],
      [-0.00401, 1],
      [-0.01622, 1],
      [-0.0003, 3],
      [-0.00026, 3],
      [-0.00272, 3],
      [-0.00208, 3],
      [-1e-5, 3],
      [-0.02678, 2],
      [-0.00013, 3],
      [-0.0012, 0],
      [-0.00048, 3]
    ],
    "red_o_points": [],
    "y_categories": ["HYPO", "NAIA", "PT", "nan"],
    "blue_o_points": [],
    "blue_x_points": [
      [0.00497, 3],
      [0.00054, 3],
      [0.0063, 2],
      [0.00686, 2],
      [0.00085, 3],
      [0.00491, 3],
      [0.00656, 0],
      [-0.00158, 3],
      [0.00052, 3],
      [0.00064, 3],
      [0.00988, 0],
      [0.00504, 3],
      [0.01836, 2],
      [0.00546, 3],
      [0.02561, 2]
    ]
  },
  "QS_mulBpsurgeryType[Graft]": {
    "red_x_points": [
      [-0.00015, 3],
      [-0.00088, 0],
      [-0.00072, 0],
      [-0.0006, 0],
      [-0.0008, 0],
      [-0.00054, 0],
      [-0.00072, 0],
      [-0.00023, 3],
      [-0.00044, 0],
      [-0.00056, 0],
      [-0.00014, 3],
      [-0.00062, 0],
      [-0.00028, 3],
      [-0.00583, 2],
      [-0.00073, 0],
      [-0.00023, 3],
      [-0.00014, 3],
      [-0.00026, 3],
      [-0.00051, 0],
      [-0.00017, 3],
      [-0.00023, 3],
      [-0.0002, 3],
      [-0.00063, 0],
      [-0.00067, 0],
      [-0.00038, 3],
      [0.0023, 1],
      [-0.00023, 3],
      [-0.00066, 0],
      [-0.00022, 3]
    ],
    "red_o_points": [],
    "y_categories": ["N", "NOT APPLICABLE", "Y", "nan"],
    "blue_o_points": [],
    "blue_x_points": [
      [0.00475, 1],
      [-0.00011, 3],
      [-0.0, 0],
      [0.0001, 0],
      [-0.00011, 3],
      [0.00317, 1],
      [0.0026, 1],
      [-0.00015, 0],
      [-0.00013, 3],
      [-0.00014, 3],
      [-0.00027, 0],
      [0.00298, 1],
      [-0.00013, 3],
      [0.00305, 1],
      [-0.00014, 3]
    ]
  },
  "QS_mulLysisRoot[C5]": {
    "red_x_points": [
      [-0.00027, 3],
      [-0.0024, 0],
      [-0.00747, 2],
      [-0.00193, 0],
      [-0.00225, 0],
      [-0.00214, 0],
      [-0.00232, 0],
      [-0.00055, 3],
      [-0.00225, 0],
      [-0.00193, 0],
      [-0.00043, 3],
      [-0.00223, 0],
      [-0.00053, 3],
      [-0.00251, 0],
      [-0.00274, 0],
      [-0.00067, 3],
      [-0.00032, 3],
      [-0.00039, 3],
      [-0.00199, 0],
      [-0.00049, 3],
      [-0.0007, 3],
      [-0.00057, 3],
      [-0.00216, 0],
      [-0.00233, 0],
      [-0.00045, 3],
      [0.00636, 1],
      [-0.00041, 3],
      [-0.00675, 2],
      [-0.00067, 3]
    ],
    "red_o_points": [],
    "y_categories": ["N", "NOT APPLICABLE", "Y", "nan"],
    "blue_o_points": [],
    "blue_x_points": [
      [0.01537, 1],
      [-7e-5, 3],
      [-0.00095, 0],
      [-0.00113, 0],
      [-0.00014, 3],
      [0.00954, 1],
      [0.00685, 1],
      [-0.00142, 0],
      [-0.00027, 3],
      [-0.00025, 3],
      [-0.00088, 0],
      [0.00845, 1],
      [-0.00031, 3],
      [0.00877, 1],
      [-9e-5, 3]
    ]
  },
  "QS_mulNeuromadSite[C6]": {
    "red_x_points": [
      [-0.0, 2],
      [-0.00033, 0],
      [-0.00017, 0],
      [-0.00016, 0],
      [-0.00021, 0],
      [-0.00017, 0],
      [-0.00027, 0],
      [-2e-5, 2],
      [-0.00023, 0],
      [-0.00017, 0],
      [1e-5, 2],
      [-0.00022, 0],
      [-4e-5, 2],
      [-0.00041, 0],
      [-0.00032, 0],
      [-1e-5, 2],
      [0.0, 2],
      [0.0, 2],
      [-0.00012, 0],
      [0.0, 2],
      [-3e-5, 2],
      [-0.0, 2],
      [-0.00013, 0],
      [-0.00024, 0],
      [-0.0, 2],
      [0.00032, 1],
      [1e-5, 2],
      [-0.0001, 0],
      [-1e-5, 2]
    ],
    "red_o_points": [],
    "y_categories": ["N", "NOT APPLICABLE", "nan"],
    "blue_o_points": [],
    "blue_x_points": [
      [0.00132, 1],
      [3e-5, 2],
      [-0.00015, 0],
      [-0.00022, 0],
      [5e-5, 2],
      [0.00088, 1],
      [0.00057, 1],
      [-0.00011, 0],
      [-0.0, 2],
      [3e-5, 2],
      [-0.00017, 0],
      [0.00044, 1],
      [0.0, 2],
      [0.00036, 1],
      [1e-5, 2]
    ]
  },
  "QS_mulNeuromadSite[T1]": {
    "red_x_points": [
      [-9e-5, 2],
      [-0.00069, 0],
      [-0.00057, 0],
      [-0.00038, 0],
      [-0.00048, 0],
      [-0.00027, 0],
      [-0.00032, 0],
      [-0.0001, 2],
      [-0.00056, 0],
      [-0.0003, 0],
      [-0.0001, 2],
      [-0.00037, 0],
      [2e-5, 2],
      [-0.0007, 0],
      [-0.00062, 0],
      [-0.0001, 2],
      [-6e-5, 2],
      [-9e-5, 2],
      [-0.00028, 0],
      [-0.0001, 2],
      [-3e-5, 2],
      [-3e-5, 2],
      [-0.00038, 0],
      [-0.0004, 0],
      [-4e-5, 2],
      [0.00109, 1],
      [0.0, 2],
      [-0.00028, 0],
      [-3e-5, 2]
    ],
    "red_o_points": [],
    "y_categories": ["N", "NOT APPLICABLE", "nan"],
    "blue_o_points": [],
    "blue_x_points": [
      [0.00268, 1],
      [2e-5, 2],
      [-0.00026, 0],
      [-0.00025, 0],
      [5e-5, 2],
      [0.00146, 1],
      [0.00089, 1],
      [-0.00017, 0],
      [-2e-5, 2],
      [5e-5, 2],
      [-0.00021, 0],
      [0.00112, 1],
      [-0.0001, 2],
      [0.00103, 1],
      [-4e-5, 2]
    ]
  },
  "QA_lstPexTouch[C7]": {
    "red_x_points": [
      [-0.00211, 1],
      [-0.00839, 2],
      [-0.00304, 1],
      [-0.00305, 1],
      [-0.01011, 2],
      [-0.00571, 1],
      [-0.0051, 1],
      [-0.00441, 0],
      [-0.00736, 1],
      [-0.00827, 1],
      [-0.00155, 1],
      [-0.01422, 2],
      [-0.00283, 2],
      [-0.01354, 2],
      [-0.00485, 2],
      [-0.00176, 0],
      [-0.00144, 1],
      [-0.00252, 0],
      [-0.00814, 2],
      [-0.00184, 0],
      [-0.00227, 2],
      [-0.00685, 0],
      [-0.00801, 1],
      [-0.01093, 2],
      [-0.00357, 0],
      [-0.00541, 1],
      [-0.00058, 2],
      [-0.00244, 1],
      [0.00095, 1]
    ],
    "red_o_points": [],
    "y_categories": ["NORM", "NPV", "nan"],
    "blue_o_points": [],
    "blue_x_points": [
      [-7e-5, 1],
      [0.00907, 1],
      [0.03689, 0],
      [0.04177, 0],
      [0.00644, 2],
      [0.0004, 2],
      [-0.0002, 1],
      [-0.00308, 1],
      [0.00851, 1],
      [0.00453, 2],
      [0.03628, 0],
      [0.00013, 1],
      [-0.00053, 0],
      [0.00483, 0],
      [0.00439, 0]
    ]
  },
  "QA_yonInjPhysio": {
    "red_x_points": [
      [-0.00716, 0],
      [0.00037, 0],
      [0.00022, 0],
      [0.00029, 0],
      [-0.00206, 2],
      [0.00058, 0],
      [0.00063, 0],
      [-0.00512, 0],
      [0.00113, 0],
      [-0.00736, 1],
      [-0.00561, 0],
      [0.00121, 0],
      [-0.00794, 0],
      [-0.00636, 1],
      [-0.00154, 1],
      [0.00415, 1],
      [-0.00655, 0],
      [0.0045, 1],
      [0.00041, 0],
      [-0.00613, 0],
      [0.00456, 1],
      [0.00395, 1],
      [0.00149, 0],
      [-0.00618, 1],
      [-0.0089, 2],
      [-0.01429, 1],
      [-0.0098, 2],
      [0.00024, 0],
      [0.00464, 1]
    ],
    "red_o_points": [],
    "y_categories": ["N", "Y", "nan"],
    "blue_o_points": [],
    "blue_x_points": [
      [0.00575, 0],
      [0.0077, 1],
      [0.00498, 0],
      [0.00663, 0],
      [0.00823, 1],
      [0.00508, 0],
      [0.00329, 0],
      [0.00199, 0],
      [-0.00213, 0],
      [0.00641, 1],
      [0.00392, 0],
      [0.00435, 0],
      [0.00671, 1],
      [-0.0037, 1],
      [0.00743, 1]
    ]
  },
  "QS_mulNeuromadSite[T2]": {
    "red_x_points": [
      [5e-5, 2],
      [-0.00115, 0],
      [-0.00061, 0],
      [-0.00061, 0],
      [-0.0007, 0],
      [-0.00063, 0],
      [-0.00061, 0],
      [-9e-5, 2],
      [-0.00061, 0],
      [-0.00063, 0],
      [-0.00017, 2],
      [-0.00077, 0],
      [-6e-5, 2],
      [-0.00096, 0],
      [-0.00109, 0],
      [-0.00019, 2],
      [-1e-5, 2],
      [-0.00015, 2],
      [-0.00061, 0],
      [3e-5, 2],
      [-3e-5, 2],
      [-0.00019, 2],
      [-0.00074, 0],
      [-0.00065, 0],
      [-0.00023, 2],
      [0.00164, 1],
      [-5e-5, 2],
      [-0.00064, 0],
      [-9e-5, 2]
    ],
    "red_o_points": [],
    "y_categories": ["N", "NOT APPLICABLE", "nan"],
    "blue_o_points": [],
    "blue_x_points": [
      [0.00317, 1],
      [1e-5, 2],
      [-0.00047, 0],
      [-0.00031, 0],
      [7e-5, 2],
      [0.00263, 1],
      [0.00196, 1],
      [-0.00031, 0],
      [-0.0001, 2],
      [3e-5, 2],
      [-0.00031, 0],
      [0.00184, 1],
      [-0.00015, 2],
      [0.00248, 1],
      [-3e-5, 2]
    ]
  },
  "QS_mulGraftNerve[MC]": {
    "red_x_points": [
      [2e-5, 2],
      [-9e-5, 0],
      [-0.00011, 0],
      [-1e-5, 0],
      [-5e-5, 0],
      [-4e-5, 0],
      [-0.00011, 0],
      [2e-5, 2],
      [-0.00015, 0],
      [-1e-5, 0],
      [-0.0, 2],
      [-9e-5, 0],
      [2e-5, 2],
      [-0.00015, 0],
      [-8e-5, 0],
      [-0.0, 2],
      [-0.0, 2],
      [-0.0, 2],
      [-4e-5, 0],
      [-0.0, 2],
      [2e-5, 2],
      [4e-5, 2],
      [-5e-5, 0],
      [-9e-5, 0],
      [-0.0, 2],
      [9e-5, 1],
      [2e-5, 2],
      [-5e-5, 0],
      [2e-5, 2]
    ],
    "red_o_points": [],
    "y_categories": ["N", "NOT APPLICABLE", "nan"],
    "blue_o_points": [],
    "blue_x_points": [
      [0.00042, 1],
      [4e-5, 2],
      [-1e-5, 0],
      [-5e-5, 0],
      [2e-5, 2],
      [9e-5, 1],
      [9e-5, 1],
      [-8e-5, 0],
      [4e-5, 2],
      [2e-5, 2],
      [-1e-5, 0],
      [0.00022, 1],
      [-0.0, 2],
      [9e-5, 1],
      [-0.0, 2]
    ]
  },
  "QS_mulLysisNerve[Ssr]": {
    "red_x_points": [
      [-0.00061, 3],
      [-0.0039, 0],
      [-0.01025, 2],
      [-0.00918, 2],
      [-0.00313, 0],
      [-0.00235, 0],
      [-0.00305, 0],
      [-0.00079, 3],
      [-0.00304, 0],
      [-0.00266, 0],
      [-0.00085, 3],
      [-0.00264, 0],
      [-0.001, 3],
      [-0.00412, 0],
      [-0.00332, 0],
      [-0.00076, 3],
      [-0.00063, 3],
      [-0.00063, 3],
      [-0.00251, 0],
      [-0.00071, 3],
      [-0.0011, 3],
      [-0.00073, 3],
      [-0.00307, 0],
      [-0.00319, 0],
      [-0.00094, 3],
      [0.01122, 1],
      [-0.00069, 3],
      [-0.0025, 0],
      [-0.00093, 3]
    ],
    "red_o_points": [],
    "y_categories": ["N", "NOT APPLICABLE", "Y", "nan"],
    "blue_o_points": [],
    "blue_x_points": [
      [0.01914, 1],
      [-0.00061, 3],
      [-0.00156, 0],
      [-0.00212, 0],
      [-0.00038, 3],
      [0.01282, 1],
      [0.01119, 1],
      [-0.0021, 0],
      [-0.00029, 3],
      [-0.00025, 3],
      [-0.00165, 0],
      [0.01218, 1],
      [-0.00037, 3],
      [0.0125, 1],
      [-0.00044, 3]
    ]
  },
  "QS_mulNeuromadSite[C4]": {
    "red_x_points": [
      [-1e-5, 2],
      [-0.00026, 0],
      [-0.00047, 0],
      [-6e-5, 0],
      [-0.00036, 0],
      [-0.00014, 0],
      [-0.00034, 0],
      [-0.0, 2],
      [-0.00032, 0],
      [-6e-5, 0],
      [-2e-5, 2],
      [-0.00034, 0],
      [2e-5, 2],
      [-0.0004, 0],
      [-0.00021, 0],
      [-4e-5, 2],
      [-2e-5, 2],
      [-9e-5, 2],
      [-0.00019, 0],
      [-2e-5, 2],
      [9e-5, 2],
      [2e-5, 2],
      [-0.00038, 0],
      [-0.00027, 0],
      [-2e-5, 2],
      [0.00034, 1],
      [3e-5, 2],
      [-0.00012, 0],
      [7e-5, 2]
    ],
    "red_o_points": [],
    "y_categories": ["N", "NOT APPLICABLE", "nan"],
    "blue_o_points": [],
    "blue_x_points": [
      [0.00112, 1],
      [0.00013, 2],
      [-0.0001, 0],
      [-0.00011, 0],
      [7e-5, 2],
      [0.00049, 1],
      [0.00049, 1],
      [-0.00016, 0],
      [0.00016, 2],
      [5e-5, 2],
      [-0.00014, 0],
      [0.00102, 1],
      [-3e-5, 2],
      [0.00059, 1],
      [-1e-5, 2]
    ]
  },
  "QS_mulGraftNerve[Ra]": {
    "red_x_points": [
      [-2e-5, 2],
      [-7e-5, 0],
      [-3e-5, 0],
      [-3e-5, 0],
      [-6e-5, 0],
      [-3e-5, 0],
      [-6e-5, 0],
      [-2e-5, 2],
      [-7e-5, 0],
      [-7e-5, 0],
      [-1e-5, 2],
      [-4e-5, 0],
      [-2e-5, 2],
      [-6e-5, 0],
      [-4e-5, 0],
      [-2e-5, 2],
      [-1e-5, 2],
      [-2e-5, 2],
      [-2e-5, 0],
      [-2e-5, 2],
      [-2e-5, 2],
      [-2e-5, 2],
      [-7e-5, 0],
      [-6e-5, 0],
      [-1e-5, 2],
      [0.0001, 1],
      [-2e-5, 2],
      [-7e-5, 0],
      [-1e-5, 2]
    ],
    "red_o_points": [],
    "y_categories": ["N", "NOT APPLICABLE", "nan"],
    "blue_o_points": [],
    "blue_x_points": [
      [0.00037, 1],
      [-2e-5, 2],
      [-3e-5, 0],
      [-7e-5, 0],
      [-2e-5, 2],
      [0.00023, 1],
      [0.00023, 1],
      [-6e-5, 0],
      [-2e-5, 2],
      [-1e-5, 2],
      [-3e-5, 0],
      [0.0001, 1],
      [-2e-5, 2],
      [0.00023, 1],
      [-1e-5, 2]
    ]
  },
  "QS_mulTransfSite[Oberlin]": {
    "red_x_points": [
      [-0.00161, 3],
      [-0.02535, 0],
      [-0.02454, 0],
      [-0.02271, 0],
      [-0.0247, 0],
      [0.00359, 2],
      [-0.0244, 0],
      [-0.00189, 3],
      [0.00431, 2],
      [0.00358, 2],
      [-0.00156, 3],
      [0.00333, 2],
      [-0.00235, 3],
      [0.00238, 2],
      [-0.0218, 0],
      [-0.00144, 3],
      [-0.0017, 3],
      [-0.00143, 3],
      [-0.02073, 0],
      [-0.00167, 3],
      [-0.00194, 3],
      [-0.00175, 3],
      [0.00348, 2],
      [-0.02382, 0],
      [-0.00182, 3],
      [0.02826, 1],
      [-0.0018, 3],
      [-0.02325, 0],
      [-0.00211, 3]
    ],
    "red_o_points": [],
    "y_categories": ["N", "NOT APPLICABLE", "Y", "nan"],
    "blue_o_points": [],
    "blue_x_points": [
      [0.04354, 1],
      [-0.00124, 3],
      [0.00602, 2],
      [0.00674, 2],
      [-0.00062, 3],
      [0.03324, 1],
      [0.03063, 1],
      [0.00469, 2],
      [-0.00112, 3],
      [-0.00083, 3],
      [0.00583, 2],
      [0.03034, 1],
      [-0.001, 3],
      [0.03038, 1],
      [-0.00119, 3]
    ]
  },
  "QA_intPexForearmProna": {
    "red_x_points": [
      [-0.00055, 2],
      [-0.00066, 0],
      [-0.00059, 2],
      [-0.00034, 2],
      [-0.00053, 2],
      [-0.00243, 0],
      [-0.00062, 2],
      [-0.01687, 0],
      [-0.00057, 2],
      [-0.00062, 2],
      [-0.0157, 0],
      [-0.00184, 0],
      [-0.00061, 2],
      [-0.00048, 2],
      [3e-5, 2],
      [-0.01706, 0],
      [-0.01649, 0],
      [-0.01539, 0],
      [-0.00154, 0],
      [-0.00028, 2],
      [-0.00061, 2],
      [-0.00077, 2],
      [-0.00046, 2],
      [-0.0005, 2],
      [0.00017, 2],
      [0.0005, 1],
      [-6e-5, 2],
      [-0.00215, 0],
      [-0.00068, 2]
    ],
    "red_o_points": [],
    "y_categories": ["GREATER THAN OR EQUALS TO 80", "LESS THAN 80", "nan"],
    "blue_o_points": [],
    "blue_x_points": [
      [-0.00033, 2],
      [0.04841, 1],
      [-0.00063, 0],
      [-0.00048, 2],
      [0.00082, 2],
      [3e-5, 2],
      [0.00091, 1],
      [0.00016, 2],
      [5e-5, 2],
      [0.00084, 2],
      [-0.00047, 0],
      [6e-5, 2],
      [0.00126, 2],
      [8e-5, 2],
      [0.04699, 1]
    ]
  },
  "QS_mulLysisSite[Nerve]": {
    "red_x_points": [
      [-0.00023, 3],
      [-0.00289, 0],
      [-0.00801, 2],
      [-0.00712, 2],
      [-0.00237, 0],
      [-0.00172, 0],
      [-0.00253, 0],
      [-0.00046, 3],
      [-0.00251, 0],
      [-0.00201, 0],
      [-0.00026, 3],
      [-0.00224, 0],
      [-0.00054, 3],
      [-0.00286, 0],
      [-0.00281, 0],
      [-0.00039, 3],
      [-0.00027, 3],
      [-0.00024, 3],
      [-0.00215, 0],
      [-0.00032, 3],
      [-0.0005, 3],
      [-0.00046, 3],
      [-0.00242, 0],
      [-0.00231, 0],
      [-0.00066, 3],
      [0.00699, 1],
      [-0.00055, 3],
      [-0.00187, 0],
      [-0.00058, 3]
    ],
    "red_o_points": [],
    "y_categories": ["N", "NOT APPLICABLE", "Y", "nan"],
    "blue_o_points": [],
    "blue_x_points": [
      [0.01287, 1],
      [-0.00015, 3],
      [-0.001, 0],
      [-0.00108, 0],
      [0.00012, 3],
      [0.01041, 1],
      [0.00749, 1],
      [-0.00157, 0],
      [-6e-5, 3],
      [4e-5, 3],
      [-0.00108, 0],
      [0.00966, 1],
      [-0.00013, 3],
      [0.00914, 1],
      [-0.00038, 3]
    ]
  },
  "QA_yonPexPain": {
    "red_x_points": [
      [-0.00625, 1],
      [-0.00048, 1],
      [-0.0007, 1],
      [-0.0004, 1],
      [-0.00067, 1],
      [-0.00181, 0],
      [-0.00042, 1],
      [-0.00617, 1],
      [-0.0022, 0],
      [-0.00024, 1],
      [-0.00469, 1],
      [-0.00092, 0],
      [-0.00861, 1],
      [-0.00078, 1],
      [-0.00049, 1],
      [0.00599, 0],
      [-0.00451, 1],
      [0.00579, 0],
      [-0.00011, 1],
      [0.00736, 0],
      [-0.01671, 2],
      [-0.00806, 1],
      [-0.00016, 1],
      [-0.00039, 1],
      [-0.01201, 2],
      [-0.00105, 1],
      [-0.00674, 1],
      [-0.00024, 1],
      [-0.00853, 1]
    ],
    "red_o_points": [],
    "y_categories": ["N", "Y", "nan"],
    "blue_o_points": [],
    "blue_x_points": [
      [-0.00046, 1],
      [0.02004, 0],
      [0.00201, 0],
      [0.00172, 1],
      [-0.00394, 1],
      [0.00061, 2],
      [4e-5, 1],
      [0.00239, 1],
      [0.02306, 0],
      [0.0175, 0],
      [0.00163, 1],
      [0.00128, 0],
      [0.00931, 0],
      [-0.00023, 1],
      [-0.00075, 1]
    ]
  },
  "QS_mulGraftNerve[FI]": {
    "red_x_points": [
      [-2e-5, 0],
      [-8e-5, 0],
      [-6e-5, 0],
      [-6e-5, 0],
      [-2e-5, 0],
      [-6e-5, 0],
      [1e-5, 2],
      [-0.00012, 0],
      [0.0, 2],
      [1e-5, 2],
      [-0.0001, 0],
      [0.0, 2],
      [0.0, 2],
      [1e-5, 2],
      [2e-5, 2],
      [-2e-5, 0],
      [-2e-5, 0],
      [-2e-5, 0],
      [2e-5, 2]
    ],
    "red_o_points": [],
    "y_categories": ["N", "NOT APPLICABLE", "nan"],
    "blue_o_points": [],
    "blue_x_points": [[0.00046, 1], [1e-5, 2], [2e-5, 2], [-2e-5, 0]]
  },
  "QA_lstPexPalle[Ulna]": {
    "red_x_points": [
      [-0.00073, 4],
      [-0.00265, 4],
      [-0.00232, 4],
      [-0.00745, 2],
      [-0.0034, 4],
      [-0.01193, 1],
      [-0.00273, 4],
      [-0.00048, 4],
      [-0.00429, 4],
      [0.01204, 3],
      [-0.00933, 1],
      [-0.00359, 4],
      [-0.0009, 4],
      [-0.00403, 4],
      [-0.00156, 4],
      [0.00508, 3],
      [-0.0099, 0],
      [0.00315, 3],
      [-0.00844, 0],
      [0.00479, 3],
      [-0.00078, 4],
      [-0.00069, 4],
      [-0.00399, 4],
      [-0.00305, 4],
      [-0.00031, 4],
      [0.00273, 3],
      [-0.00042, 4],
      [-0.00834, 0],
      [-0.00072, 4]
    ],
    "red_o_points": [],
    "y_categories": ["ABS", "HYPO", "NAIA", "PT", "nan"],
    "blue_o_points": [],
    "blue_x_points": [
      [-0.00044, 4],
      [-0.0002, 4],
      [0.01717, 3],
      [0.01998, 3],
      [-0.00019, 4],
      [-0.00013, 4],
      [0.00244, 3],
      [-0.003, 4],
      [-0.00036, 4],
      [-5e-5, 4],
      [0.01535, 3],
      [-0.00021, 4],
      [0.00476, 3],
      [-0.00017, 4],
      [0.00928, 3]
    ]
  }
}
