{
  "QA_lstPexMuscstrength[ElbowFlex]": {
    "red_x_points": [
      [-0.00565, 1],
      [0.00056, 2],
      [-0.00244, 1],
      [-0.00217, 1],
      [0.00193, 0],
      [-0.00241, 1],
      [-0.00246, 1],
      [-0.00551, 1],
      [-0.00224, 1],
      [-0.00234, 1],
      [-0.00225, 1],
      [-0.00563, 1],
      [0.0008, 2],
      [0.0052, 2],
      [0.0006, 2],
      [-0.00503, 1],
      [0.00075, 2],
      [0.00165, 0],
      [-0.00545, 1],
      [-0.005, 1],
      [-0.00482, 1],
      [-0.00226, 1],
      [0.00495, 2],
      [-0.00059, 0],
      [-0.00566, 1],
      [-0.00222, 1],
      [-0.0047, 1],
      [-0.00247, 1],
      [-0.00546, 1],
      [0.00079, 2],
      [-0.00243, 1]
    ],
    "red_o_points": [],
    "y_categories": ["GREATER THAN OR EQUALS TO 3", "LESS THAN 3", "nan"],
    "blue_o_points": [],
    "blue_x_points": [
      [0.00049, 2],
      [0.00824, 2],
      [0.00553, 0],
      [0.00079, 1],
      [0.00804, 2],
      [0.0065, 0],
      [0.0067, 0]
    ]
  },
  "QS_mulLysisRoot[C6]": {
    "red_x_points": [
      [-0.00104, 3],
      [-0.00152, 0],
      [-0.00302, 2],
      [-0.00157, 0],
      [-0.00175, 0],
      [-0.00159, 0],
      [-0.00168, 0],
      [-0.00098, 3],
      [-0.00189, 0],
      [-0.00129, 0],
      [-0.00171, 0],
      [-0.00102, 3],
      [0.00535, 1],
      [-0.00103, 3],
      [-0.0017, 0],
      [-0.00093, 3],
      [-0.00181, 0],
      [-0.00154, 0],
      [-0.00102, 3],
      [-0.00105, 3],
      [-0.00085, 3],
      [-0.00157, 0],
      [-0.00085, 3],
      [-0.00097, 3],
      [-0.00103, 3],
      [-0.00178, 0],
      [-0.00098, 3],
      [-0.00165, 0],
      [-0.00088, 3],
      [0.00402, 1],
      [-0.0029, 2]
    ],
    "red_o_points": [],
    "y_categories": ["N", "NOT APPLICABLE", "Y", "nan"],
    "blue_o_points": [],
    "blue_x_points": [
      [0.00722, 1],
      [-0.00048, 3],
      [0.00574, 1],
      [-0.00158, 0],
      [-0.00038, 3],
      [0.00544, 1],
      [0.00597, 1]
    ]
  },
  "QS_mulLysisTrunk[Upper]": {
    "red_x_points": [
      [-0.00199, 3],
      [-0.00234, 0],
      [-0.00261, 0],
      [-0.00297, 0],
      [-0.00273, 0],
      [-0.0056, 2],
      [-0.00267, 0],
      [-0.00203, 3],
      [-0.00273, 0],
      [-0.00268, 0],
      [-0.00248, 0],
      [-0.00186, 3],
      [0.00806, 1],
      [-0.00195, 3],
      [-0.00288, 0],
      [-0.00206, 3],
      [-0.00547, 2],
      [-0.00304, 0],
      [-0.00175, 3],
      [-0.0019, 3],
      [-0.00179, 3],
      [-0.00239, 0],
      [-0.00167, 3],
      [-0.00216, 3],
      [-0.00184, 3],
      [-0.00236, 0],
      [-0.00185, 3],
      [-0.00268, 0],
      [-0.00173, 3],
      [0.00903, 1],
      [-0.0047, 2]
    ],
    "red_o_points": [],
    "y_categories": ["N", "NOT APPLICABLE", "Y", "nan"],
    "blue_o_points": [],
    "blue_x_points": [
      [0.01231, 1],
      [-0.00101, 3],
      [0.00943, 1],
      [-0.00149, 0],
      [-0.00085, 3],
      [0.00821, 1],
      [0.01011, 1]
    ]
  },
  "QS_mulBpsurgeryType[Transf]": {
    "red_x_points": [
      [-7e-5, 3],
      [-6e-5, 2],
      [-0.00035, 0],
      [-9e-5, 2],
      [-7e-5, 2],
      [-7e-5, 2],
      [-9e-5, 2],
      [-9e-5, 3],
      [-6e-5, 2],
      [-9e-5, 2],
      [-8e-5, 2],
      [-7e-5, 3],
      [-9e-5, 3],
      [-7e-5, 2],
      [-3e-5, 3],
      [-5e-5, 2],
      [-8e-5, 2],
      [1e-5, 3],
      [-4e-5, 3],
      [-8e-5, 3],
      [-5e-5, 2],
      [-9e-5, 3],
      [-0.00011, 3],
      [-9e-5, 3],
      [-6e-5, 2],
      [-6e-5, 3],
      [-9e-5, 2],
      [-3e-5, 3],
      [0.00042, 1],
      [-9e-5, 2]
    ],
    "red_o_points": [],
    "y_categories": ["N", "NOT APPLICABLE", "Y", "nan"],
    "blue_o_points": [],
    "blue_x_points": [
      [0.00057, 1],
      [-6e-5, 3],
      [0.00048, 1],
      [-6e-5, 2],
      [0.0, 3],
      [0.00011, 1],
      [0.00034, 1]
    ]
  },
  "QS_mulGraftNerve[Ac]": {
    "red_x_points": [
      [-0.00021, 2],
      [-0.00082, 0],
      [-0.00074, 0],
      [-0.00069, 0],
      [-0.00065, 0],
      [-0.0007, 0],
      [-0.00086, 0],
      [-0.00013, 2],
      [-0.00081, 0],
      [-0.00083, 0],
      [-0.00062, 0],
      [-0.00019, 2],
      [0.00077, 1],
      [-0.00023, 2],
      [-0.00077, 0],
      [-0.00022, 2],
      [-0.00067, 0],
      [-0.00071, 0],
      [-0.00023, 2],
      [-0.00016, 2],
      [-6e-5, 2],
      [-0.00063, 0],
      [-0.00022, 2],
      [-0.00018, 2],
      [-0.00032, 2],
      [-0.00074, 0],
      [-0.00029, 2],
      [-0.00057, 0],
      [-0.00012, 2],
      [0.00094, 1],
      [-0.00059, 0]
    ],
    "red_o_points": [],
    "y_categories": ["N", "NOT APPLICABLE", "nan"],
    "blue_o_points": [],
    "blue_x_points": [
      [0.00321, 1],
      [4e-5, 2],
      [0.00134, 1],
      [0.00016, 0],
      [4e-5, 2],
      [0.00112, 1],
      [0.00144, 1]
    ]
  },
  "QS_mulNeuromadSite[C8]": {
    "red_x_points": [
      [-0.00112, 2],
      [-0.00377, 0],
      [-0.0033, 0],
      [-0.00349, 0],
      [-0.00416, 0],
      [-0.0037, 0],
      [-0.00381, 0],
      [-0.00133, 2],
      [-0.00359, 0],
      [-0.00373, 0],
      [-0.0034, 0],
      [-0.00131, 2],
      [0.00493, 1],
      [-0.00084, 2],
      [-0.004, 0],
      [-0.00139, 2],
      [-0.00355, 0],
      [-0.00441, 0],
      [-0.00134, 2],
      [-0.00108, 2],
      [-0.00095, 2],
      [-0.00288, 0],
      [-0.00089, 2],
      [-0.00128, 2],
      [-0.00171, 2],
      [-0.00318, 0],
      [-0.00121, 2],
      [-0.00353, 0],
      [-0.00067, 2],
      [0.00629, 1],
      [-0.00391, 0]
    ],
    "red_o_points": [],
    "y_categories": ["N", "NOT APPLICABLE", "nan"],
    "blue_o_points": [],
    "blue_x_points": [
      [0.0161, 1],
      [2e-5, 2],
      [0.00746, 1],
      [0.00048, 0],
      [0.0001, 2],
      [0.00736, 1],
      [0.00963, 1]
    ]
  },
  "QS_mulGraftNerve[Ph]": {
    "red_x_points": [
      [-0.00019, 2],
      [-0.00034, 0],
      [-0.00041, 0],
      [-0.00035, 0],
      [-0.00035, 0],
      [-0.00038, 0],
      [-0.0004, 0],
      [-0.0001, 2],
      [-0.00035, 0],
      [-0.00041, 0],
      [-0.00024, 0],
      [-0.00014, 2],
      [0.0001, 1],
      [-0.00018, 2],
      [-0.00037, 0],
      [-0.00013, 2],
      [-0.0002, 0],
      [-0.00035, 0],
      [-0.00011, 2],
      [-0.00018, 2],
      [-0.00014, 2],
      [-0.00029, 0],
      [-0.00011, 2],
      [-9e-5, 2],
      [-0.00015, 2],
      [-0.00024, 0],
      [-0.00013, 2],
      [-0.00038, 0],
      [-8e-5, 2],
      [0.00068, 1],
      [-0.00036, 0]
    ],
    "red_o_points": [],
    "y_categories": ["N", "NOT APPLICABLE", "nan"],
    "blue_o_points": [],
    "blue_x_points": [
      [0.00159, 1],
      [5e-5, 2],
      [0.00072, 1],
      [0.00025, 0],
      [-2e-5, 2],
      [0.00042, 1],
      [0.00142, 1]
    ]
  },
  "QS_mulTransfSite[AcSsPA]": {
    "red_x_points": [
      [-0.00028, 3],
      [-0.00064, 0],
      [-0.00051, 0],
      [-0.00056, 0],
      [-0.00063, 0],
      [-0.0006, 0],
      [-0.00061, 0],
      [-0.00023, 3],
      [-0.00054, 0],
      [-0.00063, 0],
      [-0.00057, 0],
      [-0.00023, 3],
      [0.00106, 1],
      [-0.00027, 3],
      [-0.00033, 0],
      [-0.00033, 3],
      [-0.00206, 2],
      [-0.00072, 0],
      [-0.00026, 3],
      [-0.00021, 3],
      [-0.00027, 3],
      [-0.00058, 0],
      [-0.00013, 3],
      [-0.00026, 3],
      [-0.00022, 3],
      [-0.00053, 0],
      [-0.00026, 3],
      [-0.00068, 0],
      [-0.00017, 3],
      [0.00159, 1],
      [-0.00041, 0]
    ],
    "red_o_points": [],
    "y_categories": ["N", "NOT APPLICABLE", "Y", "nan"],
    "blue_o_points": [],
    "blue_x_points": [
      [0.00222, 1],
      [-9e-5, 3],
      [0.00142, 1],
      [6e-5, 0],
      [-3e-5, 3],
      [0.00174, 1],
      [0.00187, 1]
    ]
  },
  "participant_code": {
    "red_x_points": [
      [-0.02179, 1],
      [-0.02286, 2],
      [-0.02249, 3],
      [-0.02193, 4],
      [-0.02221, 5],
      [-0.02254, 6],
      [-0.02338, 7],
      [-0.0209, 8],
      [-0.02258, 9],
      [-0.02212, 10],
      [-0.02198, 11],
      [-0.02198, 12],
      [-0.02188, 14],
      [-0.02137, 16],
      [-0.02296, 17],
      [-0.02193, 19],
      [-0.02235, 20],
      [-0.02193, 22],
      [-0.02216, 23],
      [-0.02221, 25],
      [-0.0224, 26],
      [-0.02235, 27],
      [-0.02142, 28],
      [-0.02268, 29],
      [-0.02151, 30],
      [-0.02235, 32],
      [-0.02207, 33],
      [-0.02221, 34],
      [-0.0224, 35],
      [-0.02216, 36],
      [-0.02174, 37]
    ],
    "red_o_points": [],
    "y_categories": [
      "P16554",
      "P18297",
      "P19283",
      "P19287",
      "P23391",
      "P31645",
      "P31691",
      "P34778",
      "P35046",
      "P36328",
      "P43633",
      "P4544",
      "P46417",
      "P48965",
      "P53068",
      "P5497",
      "P59529",
      "P62483",
      "P64658",
      "P65202",
      "P66816",
      "P6751",
      "P7408",
      "P75566",
      "P76226",
      "P79971",
      "P82621",
      "P82990",
      "P84932",
      "P85825",
      "P86989",
      "P8770",
      "P87791",
      "P90550",
      "P93159",
      "P94969",
      "P96710",
      "P9744",
      "nan"
    ],
    "blue_o_points": [],
    "blue_x_points": [
      [0.06592, 0],
      [0.06699, 13],
      [0.06331, 15],
      [0.06377, 18],
      [0.06515, 21],
      [0.06163, 24],
      [0.06669, 31]
    ]
  },
  "QS_mulGraftNerve[IS]": {
    "red_x_points": [
      [-7e-5, 2],
      [-5e-5, 0],
      [-5e-5, 0],
      [-7e-5, 0],
      [-7e-5, 0],
      [-2e-5, 0],
      [-5e-5, 2],
      [-7e-5, 0],
      [-7e-5, 0],
      [-7e-5, 0],
      [-7e-5, 2],
      [0.00013, 1],
      [-7e-5, 2],
      [-5e-5, 0],
      [-7e-5, 2],
      [-5e-5, 0],
      [-7e-5, 0],
      [-2e-5, 2],
      [-7e-5, 2],
      [-5e-5, 2],
      [-7e-5, 2],
      [-5e-5, 2],
      [-2e-5, 0],
      [-7e-5, 2],
      [-7e-5, 0],
      [-7e-5, 0]
    ],
    "red_o_points": [],
    "y_categories": ["N", "NOT APPLICABLE", "nan"],
    "blue_o_points": [],
    "blue_x_points": [[0.00031, 1], [0.00013, 1], [0.00013, 1]]
  },
  "QA_mulInjOrthesisType[ArmSling]": {
    "red_x_points": [
      [-0.01306, 2],
      [-0.01282, 2],
      [-0.01268, 2],
      [-0.01298, 2],
      [-0.01228, 2],
      [-0.01215, 2],
      [-0.01187, 2],
      [-0.01279, 2],
      [-0.01248, 2],
      [-0.01155, 2],
      [-0.01276, 2],
      [-0.01262, 2],
      [0.03445, 1],
      [-0.01357, 2],
      [-0.01226, 2],
      [-0.01263, 2],
      [-0.01441, 0],
      [-0.0125, 2],
      [-0.01335, 2],
      [-0.01264, 2],
      [-0.01563, 0],
      [-0.01502, 3],
      [-0.01393, 2],
      [0.03542, 1],
      [-0.01337, 2],
      [-0.01179, 2],
      [-0.01307, 2],
      [-0.01204, 2],
      [-0.01576, 3],
      [-0.02354, 3],
      [-0.01232, 2]
    ],
    "red_o_points": [],
    "y_categories": ["N", "NOT APPLICABLE", "Y", "nan"],
    "blue_o_points": [],
    "blue_x_points": [
      [-0.00538, 2],
      [0.03922, 1],
      [0.03234, 1],
      [0.03955, 1],
      [0.03915, 1],
      [0.03034, 1],
      [0.032, 1]
    ]
  },
  "QS_mulGraftNerve[Ul]": {
    "red_x_points": [
      [-1e-5, 2],
      [-0.00015, 0],
      [-0.00014, 0],
      [-0.00014, 0],
      [-0.00028, 0],
      [-9e-5, 0],
      [-3e-5, 0],
      [-5e-5, 2],
      [-0.00012, 0],
      [-0.00012, 0],
      [-0.00017, 0],
      [-2e-5, 2],
      [0.00019, 1],
      [-5e-5, 2],
      [-0.00026, 0],
      [-0.00012, 2],
      [-8e-5, 0],
      [-0.00028, 0],
      [-3e-5, 2],
      [-4e-5, 2],
      [0.0, 2],
      [-0.00012, 0],
      [-0.00011, 2],
      [-0.00011, 2],
      [-3e-5, 2],
      [-0.00016, 0],
      [-3e-5, 2],
      [-9e-5, 0],
      [0.0, 2],
      [0.00026, 1],
      [-0.00016, 0]
    ],
    "red_o_points": [],
    "y_categories": ["N", "NOT APPLICABLE", "nan"],
    "blue_o_points": [],
    "blue_x_points": [
      [0.00089, 1],
      [7e-5, 2],
      [0.00026, 1],
      [-3e-5, 0],
      [0.0, 2],
      [0.00017, 1],
      [0.00033, 1]
    ]
  },
  "QA_mulInjOrthesisType[ShoulderSupport]": {
    "red_x_points": [
      [-0.01653, 0],
      [-0.0145, 0],
      [-0.01494, 0],
      [-0.01451, 0],
      [-0.01441, 0],
      [-0.01481, 0],
      [-0.01522, 0],
      [-0.01817, 2],
      [-0.01548, 0],
      [-0.01389, 0],
      [-0.0145, 0],
      [-0.01496, 0],
      [0.03951, 1],
      [-0.01542, 0],
      [-0.01486, 0],
      [-0.01555, 0],
      [-0.01714, 2],
      [-0.01471, 0],
      [-0.01531, 0],
      [-0.01574, 0],
      [-0.01915, 2],
      [-0.01781, 3],
      [-0.01584, 0],
      [0.04293, 1],
      [-0.01627, 0],
      [-0.01435, 0],
      [-0.01589, 0],
      [-0.01365, 0],
      [-0.01864, 3],
      [-0.02683, 3],
      [-0.01456, 0]
    ],
    "red_o_points": [],
    "y_categories": ["N", "NOT APPLICABLE", "Y", "nan"],
    "blue_o_points": [],
    "blue_x_points": [
      [-0.00667, 0],
      [0.04693, 1],
      [0.03906, 1],
      [0.04938, 1],
      [0.04318, 1],
      [0.0396, 1],
      [0.03756, 1]
    ]
  },
  "QA_yonInjUnconscio": {
    "red_x_points": [
      [-0.00434, 1],
      [-0.00399, 1],
      [-0.00172, 2],
      [-0.00181, 2],
      [0.00695, 0],
      [-0.00465, 1],
      [-0.00224, 2],
      [-0.00418, 2],
      [-0.0025, 2],
      [-0.00166, 2],
      [-0.00429, 1],
      [-0.00452, 1],
      [-0.02848, 1],
      [-0.0058, 2],
      [-0.00284, 2],
      [-0.0055, 2],
      [-0.00425, 1],
      [0.00834, 0],
      [-0.00415, 1],
      [-0.0038, 1],
      [-0.00435, 1],
      [-0.00405, 1],
      [-0.00606, 2],
      [-0.01006, 1],
      [-0.0036, 2],
      [-0.00403, 1],
      [0.01127, 0],
      [-0.0037, 1],
      [-0.0044, 2],
      [-0.00082, 2],
      [-0.00392, 1]
    ],
    "red_o_points": [],
    "y_categories": ["N", "Y", "nan"],
    "blue_o_points": [],
    "blue_x_points": [
      [0.00126, 2],
      [-0.00223, 1],
      [0.0158, 0],
      [0.02065, 0],
      [0.02293, 0],
      [0.00313, 2],
      [0.00278, 2]
    ]
  },
  "QS_mulGraftNerve[Me]": {
    "red_x_points": [
      [-7e-5, 2],
      [-0.00023, 0],
      [-0.00017, 0],
      [-0.00023, 0],
      [-0.00018, 0],
      [-0.00021, 0],
      [-0.00018, 0],
      [-0.00012, 2],
      [-0.00019, 0],
      [-0.00011, 0],
      [-0.00013, 0],
      [-0.00012, 2],
      [2e-5, 1],
      [-8e-5, 2],
      [-0.00015, 0],
      [-0.00011, 2],
      [-7e-5, 0],
      [-0.00016, 0],
      [-0.00017, 2],
      [-0.00011, 2],
      [-0.00014, 2],
      [-0.00018, 0],
      [-6e-5, 2],
      [-0.00011, 2],
      [-0.0001, 2],
      [-0.00024, 0],
      [-0.00012, 2],
      [-0.00017, 0],
      [-1e-5, 2],
      [0.00032, 1],
      [-0.00019, 0]
    ],
    "red_o_points": [],
    "y_categories": ["N", "NOT APPLICABLE", "nan"],
    "blue_o_points": [],
    "blue_x_points": [
      [0.00146, 1],
      [2e-5, 2],
      [0.0005, 1],
      [0.00017, 0],
      [3e-5, 2],
      [0.00037, 1],
      [0.00046, 1]
    ]
  },
  "QS_mulBpsurgeryType[Lysis]": {
    "red_x_points": [
      [-0.0028, 3],
      [-0.00484, 0],
      [-0.00802, 2],
      [-0.00543, 0],
      [-0.00547, 0],
      [-0.00826, 2],
      [-0.00528, 0],
      [-0.00257, 3],
      [-0.00518, 0],
      [-0.00544, 0],
      [-0.00493, 0],
      [-0.00257, 3],
      [0.01348, 1],
      [-0.00243, 3],
      [-0.00489, 0],
      [-0.0031, 3],
      [-0.00805, 2],
      [-0.00615, 0],
      [-0.00289, 3],
      [-0.00248, 3],
      [-0.00243, 3],
      [-0.00494, 0],
      [-0.00272, 3],
      [-0.00296, 3],
      [-0.00291, 3],
      [-0.00513, 0],
      [-0.00253, 3],
      [-0.00526, 0],
      [-0.00273, 3],
      [0.0133, 1],
      [-0.00812, 2]
    ],
    "red_o_points": [],
    "y_categories": ["N", "NOT APPLICABLE", "Y", "nan"],
    "blue_o_points": [],
    "blue_x_points": [
      [0.01965, 1],
      [-0.0006, 3],
      [0.01591, 1],
      [-0.00105, 0],
      [-0.00062, 3],
      [0.01653, 1],
      [0.01791, 1]
    ]
  },
  "QS_mulLysisSite[Trunk]": {
    "red_x_points": [
      [-0.001, 3],
      [-0.00214, 0],
      [-0.00209, 0],
      [-0.0022, 0],
      [-0.00216, 0],
      [-0.00427, 2],
      [-0.00215, 0],
      [-0.00097, 3],
      [-0.00215, 0],
      [-0.00209, 0],
      [-0.00219, 0],
      [-0.00102, 3],
      [0.00669, 1],
      [-0.00114, 3],
      [-0.00225, 0],
      [-0.00142, 3],
      [-0.00403, 2],
      [-0.00234, 0],
      [-0.00102, 3],
      [-0.001, 3],
      [-0.001, 3],
      [-0.00213, 0],
      [-0.00118, 3],
      [-0.00119, 3],
      [-0.00109, 3],
      [-0.00232, 0],
      [-0.00102, 3],
      [-0.00221, 0],
      [-0.00085, 3],
      [0.00488, 1],
      [-0.00364, 2]
    ],
    "red_o_points": [],
    "y_categories": ["N", "NOT APPLICABLE", "Y", "nan"],
    "blue_o_points": [],
    "blue_x_points": [
      [0.00897, 1],
      [-0.00031, 3],
      [0.00618, 1],
      [-0.00054, 0],
      [-0.0002, 3],
      [0.00697, 1],
      [0.00604, 1]
    ]
  },
  "QS_mulGraftTrunk[UpperTrunk]": {
    "red_x_points": [
      [-0.00057, 3],
      [-0.00076, 0],
      [-0.00071, 0],
      [-0.00073, 0],
      [-0.00069, 0],
      [-0.00075, 0],
      [-0.00061, 0],
      [-0.0005, 3],
      [-0.00069, 0],
      [-0.00071, 0],
      [-0.00072, 0],
      [-0.00046, 3],
      [0.00086, 1],
      [-0.00043, 3],
      [-0.00293, 2],
      [-0.00054, 3],
      [-0.00052, 0],
      [-0.00065, 0],
      [-0.00048, 3],
      [-0.00037, 3],
      [-0.0004, 3],
      [-0.00064, 0],
      [-0.00043, 3],
      [-0.00041, 3],
      [-0.00045, 3],
      [-0.00064, 0],
      [-0.0005, 3],
      [-0.0007, 0],
      [-0.00048, 3],
      [0.00222, 1],
      [-0.00066, 0]
    ],
    "red_o_points": [],
    "y_categories": ["N", "NOT APPLICABLE", "Y", "nan"],
    "blue_o_points": [],
    "blue_x_points": [
      [0.00292, 1],
      [-7e-5, 3],
      [0.00219, 1],
      [0.00039, 0],
      [-0.00015, 3],
      [0.00228, 1],
      [0.00257, 1]
    ]
  },
  "QS_mulTransfSite[PhMc]": {
    "red_x_points": [
      [-0.001, 3],
      [-0.00214, 0],
      [-0.00206, 0],
      [-0.00203, 0],
      [-0.00244, 0],
      [-0.00203, 0],
      [-0.00369, 2],
      [-0.00101, 3],
      [-0.0022, 0],
      [-0.0021, 0],
      [-0.002, 0],
      [-0.0009, 3],
      [0.00521, 1],
      [-0.00109, 3],
      [-0.00227, 0],
      [-0.00119, 3],
      [-0.00179, 0],
      [-0.00233, 0],
      [-0.00111, 3],
      [-0.00106, 3],
      [-0.00091, 3],
      [-0.00335, 2],
      [-0.00097, 3],
      [-0.00095, 3],
      [-0.00106, 3],
      [-0.00202, 0],
      [-0.00096, 3],
      [-0.00215, 0],
      [-0.0009, 3],
      [0.00577, 1],
      [-0.00202, 0]
    ],
    "red_o_points": [],
    "y_categories": ["N", "NOT APPLICABLE", "Y", "nan"],
    "blue_o_points": [],
    "blue_x_points": [
      [0.00697, 1],
      [-0.00069, 3],
      [0.00671, 1],
      [-0.0015, 0],
      [-0.00042, 3],
      [0.00708, 1],
      [0.00664, 1]
    ]
  },
  "QA_mulInjTbpiCause[Motorcycle]": {
    "red_x_points": [
      [0.00179, 0],
      [-0.00115, 1],
      [-0.00136, 1],
      [-0.00135, 1],
      [-0.00174, 1],
      [-0.00108, 1],
      [-0.00136, 1],
      [-0.00119, 1],
      [-0.00131, 1],
      [-0.0012, 1],
      [-0.00107, 1],
      [0.00167, 0],
      [-0.04306, 1],
      [-0.0013, 1],
      [-0.00142, 1],
      [-0.00131, 1],
      [-0.00125, 1],
      [-0.00147, 1],
      [0.0012, 0],
      [-0.00092, 1],
      [-0.00096, 1],
      [-0.00098, 1],
      [-0.00142, 1],
      [-0.00265, 1],
      [0.00226, 0],
      [-0.00101, 1],
      [-0.00068, 1],
      [-0.00098, 1],
      [-0.00129, 1],
      [-0.04041, 1],
      [-0.00099, 1]
    ],
    "red_o_points": [],
    "y_categories": ["N", "Y", "nan"],
    "blue_o_points": [],
    "blue_x_points": [
      [0.02102, 0],
      [-0.00113, 1],
      [0.01741, 0],
      [-0.00237, 1],
      [-0.00122, 1],
      [0.01816, 0],
      [0.01997, 0]
    ]
  },
  "QS_mulLysisSite[Root]": {
    "red_x_points": [
      [-0.00037, 3],
      [-0.0007, 0],
      [-0.00178, 2],
      [-0.00066, 0],
      [-0.00062, 0],
      [-0.00069, 0],
      [-0.00067, 0],
      [-0.00041, 3],
      [-0.00066, 0],
      [-0.00062, 0],
      [-0.00068, 0],
      [-0.00039, 3],
      [0.00227, 1],
      [-0.00048, 3],
      [-0.00053, 0],
      [-0.00043, 3],
      [-0.00055, 0],
      [-0.00058, 0],
      [-0.0004, 3],
      [-0.0005, 3],
      [-0.00045, 3],
      [-0.00064, 0],
      [-0.00042, 3],
      [-0.00034, 3],
      [-0.00033, 3],
      [-0.00053, 0],
      [-0.0003, 3],
      [-0.00071, 0],
      [-0.00029, 3],
      [0.00253, 1],
      [-0.00131, 2]
    ],
    "red_o_points": [],
    "y_categories": ["N", "NOT APPLICABLE", "Y", "nan"],
    "blue_o_points": [],
    "blue_x_points": [
      [0.00199, 1],
      [-0.00019, 3],
      [0.00207, 1],
      [-0.00082, 0],
      [-0.00022, 3],
      [0.00202, 1],
      [0.00237, 1]
    ]
  },
  "QS_mulGraftLevel[Trunk]": {
    "red_x_points": [
      [-0.00031, 3],
      [-0.00043, 0],
      [-0.00032, 0],
      [-0.00034, 0],
      [-0.00042, 0],
      [-0.00043, 0],
      [-0.00049, 0],
      [-0.00037, 3],
      [-0.00049, 0],
      [-0.00047, 0],
      [-0.00049, 0],
      [-0.00033, 3],
      [0.00175, 1],
      [-0.00046, 3],
      [-0.00235, 2],
      [-0.00031, 3],
      [-0.0004, 0],
      [-0.00044, 0],
      [-0.00037, 3],
      [-0.00035, 3],
      [-0.00044, 3],
      [-0.00048, 0],
      [-0.0004, 3],
      [-0.00042, 3],
      [-0.00034, 3],
      [-0.00043, 0],
      [-0.00035, 3],
      [-0.00044, 0],
      [-0.00042, 3],
      [0.00172, 1],
      [-0.00037, 0]
    ],
    "red_o_points": [],
    "y_categories": ["N", "NOT APPLICABLE", "Y", "nan"],
    "blue_o_points": [],
    "blue_x_points": [
      [0.00197, 1],
      [-0.00023, 3],
      [0.00152, 1],
      [0.00026, 0],
      [-0.00019, 3],
      [0.00153, 1],
      [0.00217, 1]
    ]
  },
  "QS_mulGraftNerve[other]": {
    "red_x_points": [
      [-0.00029, 2],
      [-0.00125, 0],
      [-0.00123, 0],
      [-0.00141, 0],
      [-0.0012, 0],
      [-0.00107, 0],
      [-0.00132, 0],
      [-0.00036, 2],
      [-0.00121, 0],
      [-0.00127, 0],
      [-0.00116, 0],
      [-0.00033, 2],
      [0.00192, 1],
      [-0.00043, 2],
      [-0.00116, 0],
      [-0.00055, 2],
      [-0.00095, 0],
      [-0.00103, 0],
      [-0.0004, 2],
      [-0.0002, 2],
      [-0.00019, 2],
      [-0.00116, 0],
      [-0.00035, 2],
      [-0.0006, 2],
      [-0.0005, 2],
      [-0.00095, 0],
      [-0.00048, 2],
      [-0.00114, 0],
      [-0.00026, 2],
      [0.00204, 1],
      [-0.00116, 0]
    ],
    "red_o_points": [],
    "y_categories": ["N", "NOT APPLICABLE", "nan"],
    "blue_o_points": [],
    "blue_x_points": [
      [0.00498, 1],
      [5e-5, 2],
      [0.00263, 1],
      [0.00014, 0],
      [-9e-5, 2],
      [0.00257, 1],
      [0.00331, 1]
    ]
  },
  "QS_mulGraftNerve[Ax]": {
    "red_x_points": [
      [-6e-5, 2],
      [-0.00012, 0],
      [-8e-5, 0],
      [-8e-5, 0],
      [-6e-5, 0],
      [-8e-5, 0],
      [-7e-5, 0],
      [-3e-5, 2],
      [-0.00012, 0],
      [-9e-5, 0],
      [-0.00012, 0],
      [-7e-5, 2],
      [0.00022, 1],
      [-7e-5, 2],
      [-0.00012, 0],
      [-2e-5, 2],
      [-5e-5, 0],
      [-0.00011, 0],
      [-2e-5, 2],
      [-4e-5, 2],
      [-2e-5, 2],
      [-9e-5, 0],
      [-5e-5, 2],
      [-4e-5, 2],
      [-6e-5, 2],
      [-8e-5, 0],
      [-7e-5, 2],
      [-0.0001, 0],
      [-1e-5, 2],
      [0.0001, 1],
      [-0.00012, 0]
    ],
    "red_o_points": [],
    "y_categories": ["N", "NOT APPLICABLE", "nan"],
    "blue_o_points": [],
    "blue_x_points": [
      [0.00059, 1],
      [-1e-5, 2],
      [0.0001, 1],
      [-4e-5, 2],
      [0.00022, 1],
      [0.00022, 1]
    ]
  },
  "QA_lstPexMuscstrength[WristFlex]": {
    "red_x_points": [
      [-0.00342, 1],
      [-0.0003, 2],
      [-0.00107, 1],
      [-0.00109, 1],
      [0.00049, 0],
      [0.00078, 0],
      [-0.00126, 1],
      [-0.00169, 0],
      [0.00067, 0],
      [0.00046, 0],
      [0.00038, 0],
      [-0.00201, 0],
      [-0.00097, 2],
      [0.00255, 2],
      [-4e-5, 2],
      [-0.00191, 0],
      [-0.00015, 2],
      [0.00044, 0],
      [-0.00155, 0],
      [-0.00336, 1],
      [-0.00149, 0],
      [-0.00143, 1],
      [0.00209, 2],
      [-0.01339, 1],
      [-0.00153, 0],
      [0.00044, 0],
      [-0.00417, 1],
      [0.0004, 0],
      [0.00223, 2],
      [-7e-5, 2],
      [-0.0014, 1]
    ],
    "red_o_points": [],
    "y_categories": ["GREATER THAN OR EQUALS TO 3", "LESS THAN 3", "nan"],
    "blue_o_points": [],
    "blue_x_points": [
      [0.00026, 0],
      [0.00387, 2],
      [0.00209, 0],
      [0.00324, 0],
      [0.00434, 2],
      [0.00177, 0],
      [0.00214, 0]
    ]
  },
  "QS_mulNeuromadSite[C5]": {
    "red_x_points": [
      [-0.00125, 2],
      [-0.00378, 0],
      [-0.00358, 0],
      [-0.00327, 0],
      [-0.00414, 0],
      [-0.00355, 0],
      [-0.00395, 0],
      [-0.00103, 2],
      [-0.0041, 0],
      [-0.00385, 0],
      [-0.00399, 0],
      [-0.00116, 2],
      [0.00533, 1],
      [-0.00137, 2],
      [-0.00435, 0],
      [-0.00111, 2],
      [-0.00376, 0],
      [-0.00394, 0],
      [-0.0012, 2],
      [-0.00128, 2],
      [-0.00104, 2],
      [-0.00361, 0],
      [-0.00127, 2],
      [-0.00129, 2],
      [-0.00144, 2],
      [-0.00356, 0],
      [-0.00122, 2],
      [-0.00372, 0],
      [-0.00088, 2],
      [0.00734, 1],
      [-0.00366, 0]
    ],
    "red_o_points": [],
    "y_categories": ["N", "NOT APPLICABLE", "nan"],
    "blue_o_points": [],
    "blue_x_points": [
      [0.01458, 1],
      [6e-5, 2],
      [0.00897, 1],
      [-8e-5, 0],
      [-1e-5, 2],
      [0.00863, 1],
      [0.00874, 1]
    ]
  },
  "QS_mulNeuromadSite[C7]": {
    "red_x_points": [
      [-0.00086, 2],
      [-0.00254, 0],
      [-0.00237, 0],
      [-0.00236, 0],
      [-0.00309, 0],
      [-0.00211, 0],
      [-0.00263, 0],
      [-0.00091, 2],
      [-0.00236, 0],
      [-0.00237, 0],
      [-0.00264, 0],
      [-0.00103, 2],
      [0.00387, 1],
      [-0.00051, 2],
      [-0.00278, 0],
      [-0.00104, 2],
      [-0.00286, 0],
      [-0.00257, 0],
      [-0.00103, 2],
      [-0.00086, 2],
      [-0.00071, 2],
      [-0.00223, 0],
      [-0.00053, 2],
      [-0.00087, 2],
      [-0.0012, 2],
      [-0.00233, 0],
      [-0.00087, 2],
      [-0.00268, 0],
      [-0.00068, 2],
      [0.00478, 1],
      [-0.00221, 0]
    ],
    "red_o_points": [],
    "y_categories": ["N", "NOT APPLICABLE", "nan"],
    "blue_o_points": [],
    "blue_x_points": [
      [0.00987, 1],
      [0.00018, 2],
      [0.0047, 1],
      [0.00015, 0],
      [9e-5, 2],
      [0.0052, 1],
      [0.00676, 1]
    ]
  },
  "QA_lstPexMuscstrength[WristExte]": {
    "red_x_points": [
      [-0.00244, 1],
      [2e-5, 2],
      [-0.00098, 1],
      [-0.00078, 1],
      [0.00031, 0],
      [-0.0012, 1],
      [-0.00091, 1],
      [-0.00126, 0],
      [0.00055, 0],
      [0.00035, 0],
      [-0.00074, 1],
      [-0.00129, 0],
      [-0.00243, 2],
      [0.00221, 2],
      [7e-5, 2],
      [-0.00148, 0],
      [5e-5, 2],
      [0.00043, 0],
      [-0.00128, 0],
      [-0.00249, 1],
      [-0.0013, 0],
      [-0.00078, 1],
      [0.00194, 2],
      [-0.00176, 0],
      [-0.00265, 1],
      [0.00038, 0],
      [-0.00382, 1],
      [0.00016, 0],
      [0.0021, 2],
      [-0.00237, 2],
      [-0.00094, 1]
    ],
    "red_o_points": [],
    "y_categories": ["GREATER THAN OR EQUALS TO 3", "LESS THAN 3", "nan"],
    "blue_o_points": [],
    "blue_x_points": [
      [0.00099, 0],
      [0.00378, 2],
      [0.00101, 0],
      [0.00142, 0],
      [0.00348, 2],
      [0.00118, 1],
      [0.00117, 0]
    ]
  },
  "QS_mulTransfSite[IMc]": {
    "red_x_points": [
      [-0.0027, 3],
      [-0.00681, 2],
      [-0.00407, 0],
      [-0.00394, 0],
      [-0.00422, 0],
      [-0.00428, 0],
      [-0.00426, 0],
      [-0.00295, 3],
      [-0.00428, 0],
      [-0.00408, 0],
      [-0.00378, 0],
      [-0.0028, 3],
      [0.01154, 1],
      [-0.00287, 3],
      [-0.00394, 0],
      [-0.00312, 3],
      [-0.00766, 2],
      [-0.00439, 0],
      [-0.00284, 3],
      [-0.00278, 3],
      [-0.00261, 3],
      [-0.00375, 0],
      [-0.00268, 3],
      [-0.00329, 3],
      [-0.0031, 3],
      [-0.00407, 0],
      [-0.00277, 3],
      [-0.00714, 2],
      [-0.00283, 3],
      [0.01267, 1],
      [-0.00694, 2]
    ],
    "red_o_points": [],
    "y_categories": ["N", "NOT APPLICABLE", "Y", "nan"],
    "blue_o_points": [],
    "blue_x_points": [
      [0.01835, 1],
      [-0.00092, 3],
      [0.01413, 1],
      [-0.00171, 0],
      [-0.00118, 3],
      [0.0133, 1],
      [0.01639, 1]
    ]
  },
  "QS_mulLysisSite[Nerve]": {
    "red_x_points": [
      [-0.00017, 3],
      [-0.00018, 0],
      [-0.00076, 2],
      [-0.00015, 0],
      [-0.00021, 0],
      [-0.0002, 0],
      [-0.00019, 0],
      [-0.00011, 3],
      [-0.00018, 0],
      [-0.00019, 0],
      [-0.00016, 0],
      [-0.00023, 3],
      [0.00075, 1],
      [-0.00017, 3],
      [-0.00014, 0],
      [-0.00019, 3],
      [-0.00022, 0],
      [-0.00018, 0],
      [-0.00012, 3],
      [-0.0002, 3],
      [-0.00015, 3],
      [-0.00015, 0],
      [-9e-5, 3],
      [-0.0002, 3],
      [-0.00019, 3],
      [-0.00021, 0],
      [-0.00012, 3],
      [-0.00015, 0],
      [-0.00012, 3],
      [0.00074, 1],
      [-0.00019, 0]
    ],
    "red_o_points": [],
    "y_categories": ["N", "NOT APPLICABLE", "Y", "nan"],
    "blue_o_points": [],
    "blue_x_points": [
      [0.001, 1],
      [-4e-5, 3],
      [0.00053, 1],
      [-0.00021, 0],
      [-0.00013, 3],
      [0.00077, 1],
      [0.00085, 1]
    ]
  },
  "QS_mulLysisRoot[C7]": {
    "red_x_points": [
      [-0.00017, 3],
      [-0.00027, 0],
      [-0.0008, 2],
      [-0.00035, 0],
      [-0.00033, 0],
      [-0.00033, 0],
      [-0.00023, 0],
      [-0.00017, 3],
      [-0.00023, 0],
      [-0.00039, 0],
      [-0.0003, 0],
      [-0.00013, 3],
      [0.00054, 1],
      [-0.00018, 3],
      [-0.00028, 0],
      [-0.00015, 3],
      [-0.00031, 0],
      [-0.00031, 0],
      [-0.00015, 3],
      [-0.00014, 3],
      [-0.00024, 3],
      [-0.00031, 0],
      [-0.00018, 3],
      [-0.0002, 3],
      [-0.00014, 3],
      [-0.00031, 0],
      [-0.00025, 3],
      [-0.00032, 0],
      [-0.00019, 3],
      [0.00078, 1],
      [-0.00021, 0]
    ],
    "red_o_points": [],
    "y_categories": ["N", "NOT APPLICABLE", "Y", "nan"],
    "blue_o_points": [],
    "blue_x_points": [
      [0.00115, 1],
      [-6e-5, 3],
      [0.00107, 1],
      [-0.00032, 0],
      [-0.00016, 3],
      [0.00102, 1],
      [0.00116, 1]
    ]
  },
  "QS_lstBpsurgSide": {
    "red_x_points": [
      [-0.00426, 3],
      [-0.00673, 0],
      [-0.00669, 0],
      [-0.00685, 0],
      [-0.01378, 2],
      [-0.00622, 0],
      [-0.00678, 0],
      [-0.00428, 3],
      [-0.00677, 0],
      [-0.01244, 2],
      [-0.0123, 2],
      [-0.00471, 3],
      [0.0227, 1],
      [-0.00435, 3],
      [-0.01472, 2],
      [-0.00481, 3],
      [-0.01467, 2],
      [-0.01523, 2],
      [-0.00456, 3],
      [-0.00407, 3],
      [-0.00413, 3],
      [-0.00629, 0],
      [-0.00486, 3],
      [-0.00442, 3],
      [-0.0044, 3],
      [-0.01331, 2],
      [-0.0045, 3],
      [-0.01242, 2],
      [-0.00423, 3],
      [0.02252, 1],
      [-0.00665, 0]
    ],
    "red_o_points": [],
    "y_categories": ["L", "NOT APPLICABLE", "R", "nan"],
    "blue_o_points": [],
    "blue_x_points": [
      [0.03532, 1],
      [-0.00157, 3],
      [0.02643, 1],
      [0.00282, 0],
      [-0.00127, 3],
      [0.02444, 1],
      [0.02582, 1]
    ]
  },
  "QS_mulTransfSite[AcMc]": {
    "red_x_points": [
      [-0.00034, 3],
      [-0.00036, 0],
      [-0.00038, 0],
      [-0.00035, 0],
      [-0.00031, 0],
      [-0.0003, 0],
      [-0.00033, 0],
      [-0.00039, 3],
      [-0.00036, 0],
      [-0.00029, 0],
      [-0.00139, 2],
      [-0.00039, 3],
      [0.00135, 1],
      [-0.00025, 3],
      [-0.00031, 0],
      [-0.00031, 3],
      [-0.00039, 0],
      [-0.00036, 0],
      [-0.00037, 3],
      [-0.00027, 3],
      [-0.00033, 3],
      [-0.00035, 0],
      [-0.00037, 3],
      [-0.00033, 3],
      [-0.00028, 3],
      [-0.00037, 0],
      [-0.00038, 3],
      [-0.00038, 0],
      [-0.00027, 3],
      [0.00159, 1],
      [-0.00034, 0]
    ],
    "red_o_points": [],
    "y_categories": ["N", "NOT APPLICABLE", "Y", "nan"],
    "blue_o_points": [],
    "blue_x_points": [
      [0.00154, 1],
      [-9e-5, 3],
      [0.00141, 1],
      [-0.00042, 0],
      [-0.00014, 3],
      [0.00117, 1],
      [0.0015, 1]
    ]
  },
  "QS_mulTransfSite[Other]": {
    "red_x_points": [
      [-0.00032, 3],
      [-0.00034, 0],
      [-0.00037, 0],
      [-0.00033, 0],
      [-0.00032, 0],
      [-0.00036, 0],
      [-0.00034, 0],
      [-0.00039, 3],
      [-0.00034, 0],
      [-0.00033, 0],
      [-0.00045, 0],
      [-0.00039, 3],
      [0.00138, 1],
      [-0.00033, 3],
      [-0.00038, 0],
      [-0.00054, 3],
      [-0.00039, 0],
      [-0.00276, 2],
      [-0.00029, 3],
      [-0.00034, 3],
      [-0.00039, 3],
      [-0.00039, 0],
      [-0.0003, 3],
      [-0.00048, 3],
      [-0.00046, 3],
      [-0.00032, 0],
      [-0.00048, 3],
      [-0.00028, 0],
      [-0.00026, 3],
      [0.00168, 1],
      [-0.00038, 0]
    ],
    "red_o_points": [],
    "y_categories": ["N", "NOT APPLICABLE", "Y", "nan"],
    "blue_o_points": [],
    "blue_x_points": [
      [0.00161, 1],
      [-7e-5, 3],
      [0.00186, 1],
      [9e-5, 0],
      [6e-5, 3],
      [0.00143, 1],
      [0.00154, 1]
    ]
  },
  "QA_yonInjBpsurg": {
    "red_x_points": [
      [-0.00476, 1],
      [-0.00397, 1],
      [-0.00472, 1],
      [-0.00427, 1],
      [-0.00457, 1],
      [-0.00443, 1],
      [-0.00433, 1],
      [-0.00423, 1],
      [-0.0042, 1],
      [-0.00476, 1],
      [-0.00394, 1],
      [-0.00406, 1],
      [0.00954, 0],
      [-0.00436, 1],
      [-0.0047, 1],
      [-0.00491, 1],
      [-0.00327, 1],
      [-0.00462, 1],
      [-0.0043, 1],
      [-0.00407, 1],
      [-0.00375, 1],
      [-0.00327, 1],
      [-0.00465, 1],
      [-0.00443, 1],
      [-0.0052, 1],
      [-0.00421, 1],
      [-0.004, 1],
      [-0.00391, 1],
      [-0.00412, 1],
      [0.01193, 0],
      [-0.00407, 1]
    ],
    "red_o_points": [],
    "y_categories": ["N", "Y", "nan"],
    "blue_o_points": [],
    "blue_x_points": [
      [0.025, 0],
      [-0.00131, 1],
      [0.01371, 0],
      [-0.00343, 1],
      [-0.00106, 1],
      [0.0143, 0],
      [0.01585, 0]
    ]
  },
  "QS_mulLysisNerve[Ssr]": {
    "red_x_points": [
      [-0.00022, 3],
      [-0.00021, 0],
      [-0.00065, 2],
      [-0.00023, 0],
      [-0.00022, 0],
      [-0.00025, 0],
      [-0.00026, 0],
      [-0.00024, 3],
      [-0.00028, 0],
      [-0.00025, 0],
      [-0.00022, 0],
      [-0.00026, 3],
      [0.00123, 1],
      [-0.00021, 3],
      [-0.0002, 0],
      [-0.00024, 3],
      [-0.00019, 0],
      [-0.00017, 0],
      [-0.00027, 3],
      [-0.00024, 3],
      [-0.00016, 3],
      [-0.00026, 0],
      [-0.00026, 3],
      [-0.0002, 3],
      [-0.00019, 3],
      [-0.00028, 0],
      [-0.0002, 3],
      [-0.00029, 0],
      [-0.00017, 3],
      [0.00092, 1],
      [-0.00028, 0]
    ],
    "red_o_points": [],
    "y_categories": ["N", "NOT APPLICABLE", "Y", "nan"],
    "blue_o_points": [],
    "blue_x_points": [
      [0.00115, 1],
      [-6e-5, 3],
      [0.00095, 1],
      [-0.00032, 0],
      [-0.00014, 3],
      [0.00059, 1],
      [0.00113, 1]
    ]
  },
  "QS_mulTransfSite[AcSsAA]": {
    "red_x_points": [
      [-0.0036, 3],
      [-0.00811, 2],
      [-0.00372, 0],
      [-0.00772, 2],
      [-0.00873, 2],
      [-0.00358, 0],
      [-0.00398, 0],
      [-0.00333, 3],
      [-0.00357, 0],
      [-0.0079, 2],
      [-0.00351, 0],
      [-0.00335, 3],
      [0.01431, 1],
      [-0.0033, 3],
      [-0.00966, 2],
      [-0.00347, 3],
      [-0.00331, 0],
      [-0.0036, 0],
      [-0.00318, 3],
      [-0.00322, 3],
      [-0.0033, 3],
      [-0.00802, 2],
      [-0.00315, 3],
      [-0.0033, 3],
      [-0.00324, 3],
      [-0.00368, 0],
      [-0.00354, 3],
      [-0.00857, 2],
      [-0.00284, 3],
      [0.01502, 1],
      [-0.00366, 0]
    ],
    "red_o_points": [],
    "y_categories": ["N", "NOT APPLICABLE", "Y", "nan"],
    "blue_o_points": [],
    "blue_x_points": [
      [0.02346, 1],
      [-0.00098, 3],
      [0.01488, 1],
      [-0.00065, 0],
      [-0.00119, 3],
      [0.01598, 1],
      [0.01598, 1]
    ]
  },
  "QS_mulLysisRoot[C5]": {
    "red_x_points": [
      [-0.00079, 3],
      [-0.00122, 0],
      [-0.00303, 2],
      [-0.00142, 0],
      [-0.00146, 0],
      [-0.0014, 0],
      [-0.00134, 0],
      [-0.001, 3],
      [-0.00137, 0],
      [-0.00136, 0],
      [-0.00148, 0],
      [-0.00093, 3],
      [0.00508, 1],
      [-0.00095, 3],
      [-0.00128, 0],
      [-0.00104, 3],
      [-0.00134, 0],
      [-0.00149, 0],
      [-0.00121, 3],
      [-0.001, 3],
      [-0.00092, 3],
      [-0.00133, 0],
      [-0.00086, 3],
      [-0.00097, 3],
      [-0.00093, 3],
      [-0.00149, 0],
      [-0.00107, 3],
      [-0.0012, 0],
      [-0.00085, 3],
      [0.00454, 1],
      [-0.00275, 2]
    ],
    "red_o_points": [],
    "y_categories": ["N", "NOT APPLICABLE", "Y", "nan"],
    "blue_o_points": [],
    "blue_x_points": [
      [0.00607, 1],
      [-0.00042, 3],
      [0.00449, 1],
      [-0.00152, 0],
      [-0.00059, 3],
      [0.00392, 1],
      [0.00512, 1]
    ]
  },
  "QS_mulNeuromadSite[C6]": {
    "red_x_points": [
      [-0.00051, 2],
      [-0.00155, 0],
      [-0.00168, 0],
      [-0.00162, 0],
      [-0.00152, 0],
      [-0.00124, 0],
      [-0.00174, 0],
      [-0.00057, 2],
      [-0.00153, 0],
      [-0.00131, 0],
      [-0.00159, 0],
      [-0.00041, 2],
      [0.00226, 1],
      [-0.00035, 2],
      [-0.00154, 0],
      [-0.0006, 2],
      [-0.00139, 0],
      [-0.00156, 0],
      [-0.00057, 2],
      [-0.00048, 2],
      [-0.00037, 2],
      [-0.00119, 0],
      [-0.00055, 2],
      [-0.00023, 2],
      [-0.00066, 2],
      [-0.00149, 0],
      [-0.00032, 2],
      [-0.00157, 0],
      [-0.00025, 2],
      [0.00302, 1],
      [-0.00137, 0]
    ],
    "red_o_points": [],
    "y_categories": ["N", "NOT APPLICABLE", "nan"],
    "blue_o_points": [],
    "blue_x_points": [
      [0.00532, 1],
      [1e-5, 2],
      [0.00328, 1],
      [-1e-5, 0],
      [-0.00017, 2],
      [0.00328, 1],
      [0.00396, 1]
    ]
  },
  "QS_mulNeuromadSite[T1]": {
    "red_x_points": [
      [-0.00133, 2],
      [-0.00419, 0],
      [-0.00398, 0],
      [-0.00425, 0],
      [-0.00379, 0],
      [-0.00403, 0],
      [-0.00404, 0],
      [-0.00139, 2],
      [-0.0039, 0],
      [-0.00357, 0],
      [-0.00414, 0],
      [-0.00135, 2],
      [0.00656, 1],
      [-0.00113, 2],
      [-0.00352, 0],
      [-0.00169, 2],
      [-0.00346, 0],
      [-0.0042, 0],
      [-0.00127, 2],
      [-0.00119, 2],
      [-0.00115, 2],
      [-0.0037, 0],
      [-0.00117, 2],
      [-0.00151, 2],
      [-0.00165, 2],
      [-0.00403, 0],
      [-0.00124, 2],
      [-0.00429, 0],
      [-0.00098, 2],
      [0.00638, 1],
      [-0.00374, 0]
    ],
    "red_o_points": [],
    "y_categories": ["N", "NOT APPLICABLE", "nan"],
    "blue_o_points": [],
    "blue_x_points": [
      [0.01529, 1],
      [-9e-5, 2],
      [0.00825, 1],
      [0.00027, 0],
      [6e-5, 2],
      [0.0092, 1],
      [0.01107, 1]
    ]
  },
  "QA_lstPexMuscstrength[ShoulderAbduc]": {
    "red_x_points": [
      [-0.00722, 1],
      [-0.007, 1],
      [-0.00703, 1],
      [-0.00723, 1],
      [-0.00783, 1],
      [-0.00691, 1],
      [-0.00715, 1],
      [-0.00753, 1],
      [-0.00727, 1],
      [-0.00739, 1],
      [-0.00749, 1],
      [-0.00775, 1],
      [0.00302, 2],
      [0.00603, 2],
      [0.00572, 2],
      [0.00541, 2],
      [0.00613, 2],
      [-0.00758, 1],
      [-0.0074, 1],
      [-0.0071, 1],
      [-0.0076, 1],
      [-0.00724, 1],
      [0.00617, 2],
      [-0.00963, 1],
      [-0.00698, 1],
      [-0.00719, 1],
      [-0.00759, 1],
      [-0.00678, 1],
      [-0.00734, 1],
      [0.00201, 2],
      [-0.00707, 1]
    ],
    "red_o_points": [],
    "y_categories": ["GREATER THAN OR EQUALS TO 3", "LESS THAN 3", "nan"],
    "blue_o_points": [],
    "blue_x_points": [
      [0.00452, 2],
      [0.00605, 2],
      [0.03075, 0],
      [0.00722, 2],
      [0.00661, 2],
      [0.0321, 0],
      [-0.00131, 1]
    ]
  },
  "QS_mulNeuromadSite[T2]": {
    "red_x_points": [
      [-0.0022, 2],
      [-0.00719, 0],
      [-0.00685, 0],
      [-0.00714, 0],
      [-0.00767, 0],
      [-0.00669, 0],
      [-0.00709, 0],
      [-0.00253, 2],
      [-0.00748, 0],
      [-0.00688, 0],
      [-0.00627, 0],
      [-0.00249, 2],
      [0.01028, 1],
      [-0.00231, 2],
      [-0.00784, 0],
      [-0.0025, 2],
      [-0.00664, 0],
      [-0.0069, 0],
      [-0.00249, 2],
      [-0.00207, 2],
      [-0.00184, 2],
      [-0.00596, 0],
      [-0.00226, 2],
      [-0.00353, 2],
      [-0.00285, 2],
      [-0.00609, 0],
      [-0.00233, 2],
      [-0.00701, 0],
      [-0.00176, 2],
      [0.01294, 1],
      [-0.00633, 0]
    ],
    "red_o_points": [],
    "y_categories": ["N", "NOT APPLICABLE", "nan"],
    "blue_o_points": [],
    "blue_x_points": [
      [0.02854, 1],
      [2e-5, 2],
      [0.01434, 1],
      [0.00061, 0],
      [-0.00021, 2],
      [0.01567, 1],
      [0.01686, 1]
    ]
  },
  "QS_mulNeuromadSite[C4]": {
    "red_x_points": [
      [-0.00045, 2],
      [-0.0011, 0],
      [-0.00127, 0],
      [-0.00096, 0],
      [-0.00079, 0],
      [-0.00103, 0],
      [-0.00129, 0],
      [-0.00046, 2],
      [-0.00129, 0],
      [-0.00124, 0],
      [-0.00112, 0],
      [-0.00045, 2],
      [0.00124, 1],
      [-0.00059, 2],
      [-0.00128, 0],
      [-0.0007, 2],
      [-0.00111, 0],
      [-0.00157, 0],
      [-0.00066, 2],
      [-0.00045, 2],
      [-0.00041, 2],
      [-0.0008, 0],
      [-0.00041, 2],
      [-0.0005, 2],
      [-0.00064, 2],
      [-0.00108, 0],
      [-0.00045, 2],
      [-0.00113, 0],
      [-0.00038, 2],
      [0.00182, 1],
      [-0.00103, 0]
    ],
    "red_o_points": [],
    "y_categories": ["N", "NOT APPLICABLE", "nan"],
    "blue_o_points": [],
    "blue_x_points": [
      [0.00533, 1],
      [0.00018, 2],
      [0.00213, 1],
      [0.00015, 0],
      [-3e-5, 2],
      [0.00206, 1],
      [0.00396, 1]
    ]
  },
  "QS_mulGraftNerve[Ra]": {
    "red_x_points": [
      [-1e-5, 2],
      [-3e-5, 0],
      [-2e-5, 0],
      [-1e-5, 0],
      [-2e-5, 0],
      [-1e-5, 0],
      [-3e-5, 0],
      [-2e-5, 2],
      [-3e-5, 0],
      [-3e-5, 0],
      [-2e-5, 0],
      [-3e-5, 2],
      [-1e-5, 0],
      [-1e-5, 2],
      [-1e-5, 0],
      [-3e-5, 2],
      [-2e-5, 2],
      [-1e-5, 2],
      [-2e-5, 2],
      [-3e-5, 2],
      [-1e-5, 2],
      [-3e-5, 0],
      [-2e-5, 2],
      [-3e-5, 0]
    ],
    "red_o_points": [],
    "y_categories": ["N", "NOT APPLICABLE", "nan"],
    "blue_o_points": [],
    "blue_x_points": [[0.00019, 1], [0.00018, 1]]
  },
  "QS_mulTransfSite[Oberlin]": {
    "red_x_points": [
      [-0.00441, 3],
      [-0.0136, 0],
      [-0.01314, 0],
      [-0.01319, 0],
      [-0.00588, 2],
      [-0.00483, 2],
      [-0.01322, 0],
      [-0.00445, 3],
      [-0.00537, 2],
      [-0.00567, 2],
      [-0.00526, 2],
      [-0.00478, 3],
      [0.02207, 1],
      [-0.0048, 3],
      [-0.0058, 2],
      [-0.00473, 3],
      [-0.01367, 0],
      [-0.00595, 2],
      [-0.00497, 3],
      [-0.00454, 3],
      [-0.00431, 3],
      [-0.01276, 0],
      [-0.00485, 3],
      [-0.00476, 3],
      [-0.00501, 3],
      [-0.00556, 2],
      [-0.00474, 3],
      [-0.01292, 0],
      [-0.00438, 3],
      [0.02304, 1],
      [-0.01231, 0]
    ],
    "red_o_points": [],
    "y_categories": ["N", "NOT APPLICABLE", "Y", "nan"],
    "blue_o_points": [],
    "blue_x_points": [
      [0.03405, 1],
      [-0.00187, 3],
      [0.02404, 1],
      [0.00089, 2],
      [-0.00135, 3],
      [0.0236, 1],
      [0.02653, 1]
    ]
  },
  "QS_mulGraftNerve[FI]": {
    "red_x_points": [
      [-0.00013, 2],
      [-0.00055, 0],
      [-0.0005, 0],
      [-0.00046, 0],
      [-0.00049, 0],
      [-0.0005, 0],
      [-0.00049, 0],
      [-0.00011, 2],
      [-0.00044, 0],
      [-0.00041, 0],
      [-0.00034, 0],
      [-0.0001, 2],
      [0.00049, 1],
      [-0.0001, 2],
      [-0.00048, 0],
      [-0.00021, 2],
      [-0.00046, 0],
      [-0.00028, 0],
      [-0.00016, 2],
      [-0.00011, 2],
      [-0.00012, 2],
      [-0.00041, 0],
      [-0.00016, 2],
      [-4e-5, 2],
      [-0.00013, 2],
      [-0.00032, 0],
      [-0.00011, 2],
      [-0.00036, 0],
      [-4e-5, 2],
      [0.00044, 1],
      [-0.00027, 0]
    ],
    "red_o_points": [],
    "y_categories": ["N", "NOT APPLICABLE", "nan"],
    "blue_o_points": [],
    "blue_x_points": [
      [0.00207, 1],
      [0.00016, 2],
      [0.00093, 1],
      [0.00011, 0],
      [-3e-5, 2],
      [0.00063, 1],
      [0.00102, 1]
    ]
  }
}
