{
  "QA_lstPexPain[C8]": {
    "red_x_points": [
      [-0.00982, 1],
      [-0.00256, 2],
      [-0.00368, 2],
      [-0.00314, 2],
      [-0.00923, 1],
      [0.00047, 0],
      [0.00025, 1],
      [-0.00052, 1],
      [0.00746, 0],
      [-0.0005, 0],
      [0.00069, 0],
      [-0.00035, 0],
      [-0.01235, 1],
      [-0.01586, 2],
      [-0.00552, 2],
      [-0.00442, 2],
      [-0.00543, 2],
      [-0.00183, 2],
      [-0.00611, 2],
      [0.00926, 0],
      [-0.01034, 1],
      [0.00795, 0],
      [-0.00379, 2],
      [-0.00525, 2],
      [0.00588, 0],
      [-0.00576, 2],
      [-0.00505, 2],
      [-0.00237, 2],
      [-0.00878, 1],
      [-0.01143, 1],
      [-0.00116, 1],
      [-0.01017, 1]
    ],
    "red_o_points": [],
    "y_categories": ["NORM", "NPV", "nan"],
    "blue_o_points": [],
    "blue_x_points": [
      [0.01065, 0],
      [-0.00161, 2],
      [0.00039, 1],
      [0.0102, 1],
      [0.00445, 0],
      [0.00064, 1],
      [0.01241, 0],
      [0.00528, 0],
      [0.01032, 0],
      [0.01474, 0]
    ]
  },
  "QS_mulLysisSite[Root]": {
    "red_x_points": [
      [-0.00036, 3],
      [-0.00106, 0],
      [-0.00469, 2],
      [-0.00123, 0],
      [-0.00053, 3],
      [-0.00121, 0],
      [-0.0009, 0],
      [-0.00106, 0],
      [-0.00077, 3],
      [-0.00121, 0],
      [-0.00127, 0],
      [-0.00065, 0],
      [-0.0005, 3],
      [0.00283, 1],
      [-0.00083, 3],
      [-0.00117, 0],
      [-0.00033, 3],
      [-0.00113, 0],
      [-0.00038, 3],
      [-0.00089, 3],
      [-0.00059, 3],
      [-0.00035, 3],
      [-0.00114, 0],
      [-0.00076, 3],
      [-0.00049, 3],
      [-0.00037, 3],
      [-0.00123, 0],
      [-0.00116, 0],
      [0.00306, 1],
      [-0.00043, 3],
      [-0.00488, 2],
      [-0.00041, 3]
    ],
    "red_o_points": [],
    "y_categories": ["N", "NOT APPLICABLE", "Y", "nan"],
    "blue_o_points": [],
    "blue_x_points": [
      [0.00486, 1],
      [-0.00026, 3],
      [0.00392, 1],
      [0.00041, 0],
      [0.00041, 0],
      [0.00359, 1],
      [-0.00022, 3],
      [0.00394, 1],
      [-0.00055, 3],
      [-0.00025, 3]
    ]
  },
  "QS_mulLysisTrunk[Upper]": {
    "red_x_points": [
      [-0.00123, 3],
      [-0.00419, 0],
      [-0.00394, 0],
      [-0.00436, 0],
      [-0.00129, 3],
      [-0.00468, 0],
      [-0.01139, 2],
      [-0.00394, 0],
      [-0.00155, 3],
      [-0.00389, 0],
      [-0.00442, 0],
      [-0.00415, 0],
      [-0.0014, 3],
      [0.00908, 1],
      [-0.00165, 3],
      [-0.00402, 0],
      [-0.00179, 3],
      [-0.00917, 2],
      [-0.00223, 3],
      [-0.00171, 3],
      [-0.00114, 3],
      [-0.00152, 3],
      [-0.00439, 0],
      [-0.00133, 3],
      [-0.00272, 3],
      [-0.00129, 3],
      [-0.00394, 0],
      [-0.00381, 0],
      [0.01003, 1],
      [-0.00112, 3],
      [-0.00957, 2],
      [-0.00159, 3]
    ],
    "red_o_points": [],
    "y_categories": ["N", "NOT APPLICABLE", "Y", "nan"],
    "blue_o_points": [],
    "blue_x_points": [
      [0.01529, 1],
      [-0.00042, 3],
      [0.01272, 1],
      [0.00082, 0],
      [-0.00114, 0],
      [0.01119, 1],
      [-0.00084, 3],
      [0.01357, 1],
      [-0.00044, 3],
      [-0.00024, 3]
    ]
  },
  "QA_lstPexPain[C5]": {
    "red_x_points": [
      [-0.00249, 1],
      [-0.00488, 2],
      [-0.0062, 2],
      [-0.0059, 2],
      [-0.00295, 1],
      [-0.0013, 1],
      [-0.00109, 1],
      [-0.00144, 1],
      [-0.00307, 1],
      [-0.00153, 1],
      [-0.00161, 1],
      [-0.00109, 1],
      [-0.00299, 1],
      [-0.01711, 2],
      [-0.00752, 2],
      [-0.00645, 2],
      [-0.00754, 2],
      [-0.0047, 2],
      [-0.00675, 2],
      [-0.00263, 1],
      [-0.00247, 1],
      [-0.00258, 1],
      [-0.00627, 2],
      [-0.00725, 2],
      [-0.0029, 1],
      [-0.0098, 2],
      [-0.00516, 2],
      [-0.00496, 2],
      [-0.00532, 1],
      [-0.00473, 1],
      [-0.00095, 1],
      [-0.00289, 1]
    ],
    "red_o_points": [],
    "y_categories": ["NORM", "NPV", "nan"],
    "blue_o_points": [],
    "blue_x_points": [
      [0.02586, 0],
      [-0.00344, 2],
      [-0.00016, 1],
      [-0.0006, 1],
      [-0.00076, 1],
      [-7e-5, 1],
      [-0.00113, 1],
      [0.02314, 0],
      [-0.00151, 1],
      [0.04633, 0]
    ]
  },
  "QS_mulGraftNerve[Ac]": {
    "red_x_points": [
      [4e-5, 2],
      [-0.00014, 0],
      [-0.00013, 0],
      [-0.00019, 0],
      [-1e-5, 2],
      [-0.00038, 0],
      [-0.00015, 0],
      [-0.00012, 0],
      [-1e-5, 2],
      [-0.00022, 0],
      [-0.00028, 0],
      [-0.00025, 0],
      [1e-5, 2],
      [0.00013, 1],
      [-1e-5, 2],
      [-0.00023, 0],
      [4e-5, 2],
      [-0.00023, 0],
      [-1e-5, 2],
      [4e-5, 2],
      [-1e-5, 2],
      [1e-5, 2],
      [-0.00018, 0],
      [-0.0, 2],
      [2e-5, 2],
      [-0.0, 2],
      [-0.00026, 0],
      [-0.00012, 0],
      [0.00036, 1],
      [0.0, 2],
      [-0.00018, 0],
      [-0.0, 2]
    ],
    "red_o_points": [],
    "y_categories": ["N", "NOT APPLICABLE", "nan"],
    "blue_o_points": [],
    "blue_x_points": [
      [0.0005, 1],
      [3e-5, 2],
      [0.00048, 1],
      [-9e-5, 0],
      [-4e-5, 0],
      [0.00059, 1],
      [-0.0, 2],
      [0.0003, 1],
      [3e-5, 2],
      [7e-5, 2]
    ]
  },
  "QS_mulNeuromadSite[C8]": {
    "red_x_points": [
      [-9e-5, 2],
      [-0.0024, 0],
      [-0.00235, 0],
      [-0.00257, 0],
      [-0.00037, 2],
      [-0.00287, 0],
      [-0.00174, 0],
      [-0.00245, 0],
      [-0.00065, 2],
      [-0.00323, 0],
      [-0.00305, 0],
      [-0.0023, 0],
      [-0.00022, 2],
      [0.00221, 1],
      [-0.00045, 2],
      [-0.00279, 0],
      [-0.00073, 2],
      [-0.00191, 0],
      [-0.00103, 2],
      [-0.00024, 2],
      [-3e-5, 2],
      [-0.00026, 2],
      [-0.00167, 0],
      [-0.00051, 2],
      [-0.00143, 2],
      [-0.00041, 2],
      [-0.0021, 0],
      [-0.00195, 0],
      [0.00423, 1],
      [-0.0002, 2],
      [-0.00199, 0],
      [-0.00083, 2]
    ],
    "red_o_points": [],
    "y_categories": ["N", "NOT APPLICABLE", "nan"],
    "blue_o_points": [],
    "blue_x_points": [
      [0.00694, 1],
      [-7e-5, 2],
      [0.00448, 1],
      [0.0016, 0],
      [-0.00015, 0],
      [0.00485, 1],
      [4e-5, 2],
      [0.00517, 1],
      [0.00019, 2],
      [0.00025, 2]
    ]
  },
  "QS_mulGraftNerve[Ph]": {
    "red_x_points": [
      [-0.0, 2],
      [-0.0001, 0],
      [-4e-5, 0],
      [-3e-5, 2],
      [-6e-5, 0],
      [-6e-5, 0],
      [-4e-5, 0],
      [-3e-5, 2],
      [-0.0001, 0],
      [-0.0001, 0],
      [-4e-5, 0],
      [-3e-5, 2],
      [0.0002, 1],
      [-3e-5, 2],
      [-8e-5, 2],
      [-0.0001, 0],
      [-0.0001, 2],
      [-3e-5, 2],
      [-0.0, 2],
      [-0.00013, 0],
      [-3e-5, 2],
      [-0.0001, 2],
      [-3e-5, 2],
      [-0.0001, 0],
      [-6e-5, 0],
      [6e-5, 1],
      [-3e-5, 2],
      [-0.0001, 0],
      [-8e-5, 2]
    ],
    "red_o_points": [],
    "y_categories": ["N", "NOT APPLICABLE", "nan"],
    "blue_o_points": [],
    "blue_x_points": [
      [0.00018, 1],
      [-7e-5, 2],
      [0.00018, 1],
      [0.00022, 0],
      [-4e-5, 0],
      [0.00013, 1],
      [-0.0, 2],
      [0.0002, 1],
      [-3e-5, 2],
      [0.00013, 2]
    ]
  },
  "QS_mulTransfSite[AcSsPA]": {
    "red_x_points": [
      [-0.00021, 3],
      [-0.0013, 0],
      [-0.00098, 0],
      [-0.00152, 0],
      [-0.00026, 3],
      [-0.00153, 0],
      [-0.00136, 0],
      [-0.00139, 0],
      [-0.00023, 3],
      [-0.00126, 0],
      [-0.0015, 0],
      [-0.00137, 0],
      [-0.0004, 3],
      [0.00231, 1],
      [-0.00037, 3],
      [-0.00132, 0],
      [-0.00032, 3],
      [-0.00325, 2],
      [-0.00035, 3],
      [-0.00038, 3],
      [-0.00021, 3],
      [-0.00019, 3],
      [-0.00118, 0],
      [-0.00033, 3],
      [-0.00025, 3],
      [-0.00029, 3],
      [-0.00142, 0],
      [-0.00107, 0],
      [0.00259, 1],
      [-0.00032, 3],
      [-0.00138, 0],
      [-0.00044, 3]
    ],
    "red_o_points": [],
    "y_categories": ["N", "NOT APPLICABLE", "Y", "nan"],
    "blue_o_points": [],
    "blue_x_points": [
      [0.00357, 1],
      [-0.00021, 3],
      [0.00365, 1],
      [-0.0001, 0],
      [-0.00084, 0],
      [0.00367, 1],
      [-8e-5, 3],
      [0.00314, 1],
      [-6e-5, 3],
      [-8e-5, 3]
    ]
  },
  "participant_code": {
    "red_x_points": [
      [-0.03211, 1],
      [-0.02964, 2],
      [-0.03093, 3],
      [-0.03023, 4],
      [-0.03146, 5],
      [-0.03105, 6],
      [-0.03146, 7],
      [-0.03046, 8],
      [-0.03111, 9],
      [-0.03046, 10],
      [-0.03058, 11],
      [-0.03129, 12],
      [-0.03011, 13],
      [-0.02988, 15],
      [-0.0307, 17],
      [-0.0307, 18],
      [-0.03064, 20],
      [-0.03011, 21],
      [-0.02988, 22],
      [-0.02923, 24],
      [-0.02999, 26],
      [-0.03058, 27],
      [-0.03064, 28],
      [-0.03011, 30],
      [-0.03117, 31],
      [-0.03182, 32],
      [-0.03076, 34],
      [-0.03141, 36],
      [-0.03135, 38],
      [-0.03041, 39],
      [-0.03105, 40],
      [-0.03105, 41]
    ],
    "red_o_points": [],
    "y_categories": [
      "P16554",
      "P18297",
      "P19283",
      "P19287",
      "P23391",
      "P30595",
      "P31645",
      "P31691",
      "P34778",
      "P35046",
      "P36328",
      "P43633",
      "P4544",
      "P46417",
      "P48965",
      "P53068",
      "P5497",
      "P59529",
      "P62483",
      "P64658",
      "P65202",
      "P66816",
      "P6751",
      "P7408",
      "P75566",
      "P76226",
      "P79971",
      "P82621",
      "P82990",
      "P84549",
      "P84932",
      "P85825",
      "P86989",
      "P8770",
      "P87791",
      "P90550",
      "P93159",
      "P94969",
      "P96710",
      "P97130",
      "P9744",
      "P98500",
      "nan"
    ],
    "blue_o_points": [],
    "blue_x_points": [
      [0.06253, 0],
      [0.06578, 14],
      [0.06394, 16],
      [0.06225, 19],
      [0.05942, 23],
      [0.06295, 25],
      [0.06479, 29],
      [0.06634, 33],
      [0.06578, 35],
      [0.06239, 37]
    ]
  },
  "QA_lstPexTouch[T1]": {
    "red_x_points": [
      [-0.01098, 1],
      [-0.00237, 2],
      [0.00116, 1],
      [-0.00277, 2],
      [-0.01217, 1],
      [-0.01034, 0],
      [0.00155, 1],
      [0.0022, 1],
      [-0.01275, 1],
      [-0.00523, 0],
      [-0.00547, 0],
      [-0.00739, 0],
      [0.00882, 0],
      [-0.00956, 2],
      [-0.00497, 2],
      [-0.00475, 2],
      [-0.01282, 1],
      [-0.00155, 2],
      [-0.00425, 2],
      [0.00869, 0],
      [-0.01245, 1],
      [0.01012, 0],
      [-0.00344, 2],
      [-0.00499, 2],
      [-0.01323, 1],
      [0.00912, 0],
      [0.00376, 1],
      [-0.0023, 2],
      [-0.00195, 1],
      [-0.00438, 2],
      [0.0, 1],
      [-0.01132, 1]
    ],
    "red_o_points": [],
    "y_categories": ["NORM", "NPV", "nan"],
    "blue_o_points": [],
    "blue_x_points": [
      [0.0007, 1],
      [0.00115, 2],
      [0.00096, 1],
      [0.00765, 1],
      [0.01302, 1],
      [0.00064, 1],
      [0.0138, 0],
      [0.00574, 0],
      [0.01291, 0],
      [0.0152, 0]
    ]
  },
  "QA_mulInjOrthesisType[ArmSling]": {
    "red_x_points": [
      [-0.00697, 2],
      [-0.00634, 2],
      [-0.00725, 2],
      [-0.00729, 2],
      [-0.00743, 2],
      [-0.00694, 2],
      [-0.00691, 2],
      [-0.00747, 2],
      [-0.00615, 2],
      [-0.00785, 2],
      [-0.00736, 2],
      [-0.00694, 2],
      [-0.00723, 2],
      [0.01349, 1],
      [-0.0089, 2],
      [-0.00713, 2],
      [-0.0082, 2],
      [-0.0126, 0],
      [0.01371, 1],
      [-0.00618, 2],
      [-0.00734, 2],
      [-0.02201, 0],
      [-0.00385, 3],
      [-0.00888, 2],
      [0.00914, 1],
      [-0.00759, 2],
      [-0.00719, 2],
      [-0.00659, 2],
      [-0.01531, 3],
      [-0.00188, 3],
      [-0.00651, 2],
      [-0.00697, 2]
    ],
    "red_o_points": [],
    "y_categories": ["N", "NOT APPLICABLE", "Y", "nan"],
    "blue_o_points": [],
    "blue_x_points": [
      [0.00336, 2],
      [0.02446, 1],
      [0.01505, 1],
      [0.03657, 1],
      [-0.00481, 2],
      [0.01719, 1],
      [-0.00216, 2],
      [0.01598, 1],
      [-0.00295, 2],
      [0.01462, 3]
    ]
  },
  "QS_mulGraftNerve[Ul]": {
    "red_x_points": [
      [-3e-5, 0],
      [-3e-5, 0],
      [-3e-5, 0],
      [-1e-5, 2],
      [-3e-5, 0],
      [-3e-5, 0],
      [-3e-5, 0],
      [-3e-5, 0],
      [-3e-5, 0],
      [-3e-5, 0],
      [-1e-5, 2],
      [-3e-5, 0],
      [-1e-5, 2],
      [-3e-5, 0],
      [-1e-5, 2],
      [-1e-5, 2],
      [-1e-5, 2],
      [-3e-5, 0],
      [-1e-5, 2],
      [-1e-5, 2],
      [-3e-5, 0],
      [0.00011, 1],
      [-1e-5, 2],
      [-1e-5, 2]
    ],
    "red_o_points": [],
    "y_categories": ["N", "NOT APPLICABLE", "nan"],
    "blue_o_points": [],
    "blue_x_points": [
      [0.00011, 1],
      [-1e-5, 2],
      [0.00011, 1],
      [-3e-5, 0],
      [-1e-5, 2]
    ]
  },
  "QA_mulInjOrthesisType[ShoulderSupport]": {
    "red_x_points": [
      [-0.00726, 0],
      [-0.00682, 0],
      [-0.00732, 0],
      [-0.00726, 0],
      [-0.00693, 0],
      [-0.0083, 0],
      [-0.00769, 0],
      [-0.00745, 0],
      [-0.02248, 2],
      [-0.0075, 0],
      [-0.00706, 0],
      [-0.00731, 0],
      [-0.00745, 0],
      [0.01416, 1],
      [-0.00831, 0],
      [-0.00744, 0],
      [-0.00813, 0],
      [-0.01343, 2],
      [0.01703, 1],
      [-0.00601, 0],
      [-0.00804, 0],
      [-0.02435, 2],
      [-0.00394, 3],
      [-0.0087, 0],
      [0.01058, 1],
      [-0.00728, 0],
      [-0.00774, 0],
      [-0.00645, 0],
      [-0.01464, 3],
      [-0.00088, 3],
      [-0.0068, 0],
      [-0.00735, 0]
    ],
    "red_o_points": [],
    "y_categories": ["N", "NOT APPLICABLE", "Y", "nan"],
    "blue_o_points": [],
    "blue_x_points": [
      [0.0034, 0],
      [0.02549, 1],
      [0.01894, 1],
      [0.03994, 1],
      [-0.00493, 0],
      [0.01991, 1],
      [-0.00112, 0],
      [0.01586, 1],
      [-0.00225, 0],
      [0.01668, 3]
    ]
  },
  "QA_yonInjUnconscio": {
    "red_x_points": [
      [-0.00732, 1],
      [-0.00852, 1],
      [-0.0047, 2],
      [-0.00475, 2],
      [-0.00544, 2],
      [0.02498, 0],
      [-0.01004, 1],
      [-0.00556, 2],
      [-0.006, 2],
      [-0.00689, 2],
      [-0.00637, 2],
      [-0.01181, 1],
      [-0.00874, 1],
      [-0.02231, 1],
      [-0.00804, 2],
      [-0.0054, 2],
      [-0.00653, 2],
      [-0.00779, 1],
      [0.00549, 0],
      [-0.01121, 1],
      [-0.00768, 1],
      [-0.01016, 1],
      [-0.00862, 1],
      [-0.00834, 2],
      [-0.00942, 1],
      [-0.00712, 2],
      [-0.00971, 1],
      [-0.00779, 1],
      [-0.00196, 2],
      [-0.00661, 2],
      [-0.00826, 1],
      [-0.00642, 2]
    ],
    "red_o_points": [],
    "y_categories": ["N", "Y", "nan"],
    "blue_o_points": [],
    "blue_x_points": [
      [0.00036, 2],
      [0.01145, 1],
      [0.02026, 0],
      [0.03424, 0],
      [0.03092, 0],
      [0.00064, 2],
      [-0.00309, 1],
      [0.00107, 2],
      [0.03732, 0],
      [-0.00019, 2]
    ]
  },
  "QS_mulTransfSite[Other]": {
    "red_x_points": [
      [-0.00247, 3],
      [-0.01646, 0],
      [-0.01652, 0],
      [-0.01691, 0],
      [-0.00291, 3],
      [-0.01792, 0],
      [-0.01705, 0],
      [-0.01695, 0],
      [-0.00271, 3],
      [-0.01708, 0],
      [-0.01768, 0],
      [-0.01791, 0],
      [-0.00293, 3],
      [0.02426, 1],
      [-0.00283, 3],
      [-0.01744, 0],
      [-0.00265, 3],
      [-0.01594, 0],
      [-0.00312, 3],
      [-0.00288, 3],
      [-0.00236, 3],
      [-0.00241, 3],
      [-0.01598, 0],
      [-0.0026, 3],
      [-0.00329, 3],
      [-0.00237, 3],
      [-0.01706, 0],
      [-0.01713, 0],
      [0.02597, 1],
      [-0.00225, 3],
      [-0.01625, 0],
      [-0.00318, 3]
    ],
    "red_o_points": [],
    "y_categories": ["N", "NOT APPLICABLE", "Y", "nan"],
    "blue_o_points": [],
    "blue_x_points": [
      [0.02981, 1],
      [-0.0013, 3],
      [0.02501, 1],
      [-0.00738, 0],
      [0.06081, 2],
      [0.02451, 1],
      [-0.00122, 3],
      [0.02538, 1],
      [-0.00071, 3],
      [-0.00057, 3]
    ]
  },
  "QA_lstInjTpbiSide": {
    "red_x_points": [
      [-0.00333, 1],
      [0.00046, 0],
      [-0.00028, 0],
      [6e-5, 0],
      [0.00056, 0],
      [-0.00207, 1],
      [-0.00068, 0],
      [-0.00213, 0],
      [-0.00545, 1],
      [-0.00083, 0],
      [-0.00125, 1],
      [-0.00186, 1],
      [-0.00477, 1],
      [-0.01674, 0],
      [-0.00635, 1],
      [-0.00209, 1],
      [0.0013, 0],
      [-0.00167, 1],
      [-0.00967, 1],
      [0.00108, 0],
      [0.00165, 0],
      [-0.0005, 0],
      [0.00029, 0],
      [0.00281, 0],
      [-0.00649, 1],
      [-0.00561, 1],
      [-0.00062, 1],
      [-0.00039, 1],
      [-0.01779, 0],
      [-0.00728, 1],
      [-0.00043, 0],
      [0.00075, 0]
    ],
    "red_o_points": [],
    "y_categories": ["L", "R", "nan"],
    "blue_o_points": [],
    "blue_x_points": [
      [-0.00654, 0],
      [0.00982, 0],
      [0.01015, 1],
      [0.00416, 0],
      [0.00214, 1],
      [0.00969, 1],
      [0.00219, 1],
      [0.00892, 1],
      [0.00554, 0],
      [0.00701, 0]
    ]
  },
  "QS_mulLysisSite[Trunk]": {
    "red_x_points": [
      [-0.00109, 3],
      [-0.00309, 0],
      [-0.00312, 0],
      [-0.00335, 0],
      [-0.00099, 3],
      [-0.00364, 0],
      [-0.00889, 2],
      [-0.00296, 0],
      [-0.00136, 3],
      [-0.00327, 0],
      [-0.0039, 0],
      [-0.00266, 0],
      [-0.00091, 3],
      [0.00695, 1],
      [-0.00125, 3],
      [-0.00342, 0],
      [-0.00095, 3],
      [-0.00677, 2],
      [-0.0012, 3],
      [-0.00109, 3],
      [-0.00076, 3],
      [-0.001, 3],
      [-0.0033, 0],
      [-0.00134, 3],
      [-0.00103, 3],
      [-0.00103, 3],
      [-0.0034, 0],
      [-0.00327, 0],
      [0.00805, 1],
      [-0.00074, 3],
      [-0.00746, 2],
      [-0.00129, 3]
    ],
    "red_o_points": [],
    "y_categories": ["N", "NOT APPLICABLE", "Y", "nan"],
    "blue_o_points": [],
    "blue_x_points": [
      [0.01204, 1],
      [-0.00031, 3],
      [0.00865, 1],
      [0.00092, 0],
      [-0.00061, 0],
      [0.00963, 1],
      [-0.00046, 3],
      [0.00849, 1],
      [-0.00066, 3],
      [-0.00038, 3]
    ]
  },
  "QS_mulGraftTrunk[UpperTrunk]": {
    "red_x_points": [
      [-0.00022, 3],
      [-0.00107, 0],
      [-0.00099, 0],
      [-0.00106, 0],
      [-0.00019, 3],
      [-0.00142, 0],
      [-0.00091, 0],
      [-0.001, 0],
      [-8e-5, 3],
      [-0.00116, 0],
      [-0.00097, 0],
      [-0.00114, 0],
      [-0.00016, 3],
      [0.00154, 1],
      [-0.0003, 3],
      [-0.00284, 2],
      [-0.00029, 3],
      [-0.00081, 0],
      [-0.00029, 3],
      [-0.00025, 3],
      [-0.00026, 3],
      [-9e-5, 3],
      [-0.00081, 0],
      [-0.00038, 3],
      [-0.00017, 3],
      [-0.0002, 3],
      [-0.0011, 0],
      [-0.00108, 0],
      [0.0019, 1],
      [-0.00022, 3],
      [-0.00092, 0],
      [-0.00034, 3]
    ],
    "red_o_points": [],
    "y_categories": ["N", "NOT APPLICABLE", "Y", "nan"],
    "blue_o_points": [],
    "blue_x_points": [
      [0.00364, 1],
      [-0.00016, 3],
      [0.00289, 1],
      [-0.00027, 0],
      [-0.00054, 0],
      [0.00298, 1],
      [-0.00021, 3],
      [0.00194, 1],
      [-2e-5, 3],
      [0.00014, 3]
    ]
  },
  "QS_mulTransfSite[PhMc]": {
    "red_x_points": [
      [-0.00054, 3],
      [-0.00267, 0],
      [-0.0025, 0],
      [-0.00269, 0],
      [-0.00062, 3],
      [-0.00294, 0],
      [-0.0021, 0],
      [-0.00935, 2],
      [-0.00061, 3],
      [-0.00245, 0],
      [-0.0032, 0],
      [-0.0027, 0],
      [-0.00053, 3],
      [0.00595, 1],
      [-0.00049, 3],
      [-0.00302, 0],
      [-0.00051, 3],
      [-0.00225, 0],
      [-0.00049, 3],
      [-0.00044, 3],
      [-0.00039, 3],
      [-0.00032, 3],
      [-0.00562, 2],
      [-0.00055, 3],
      [-0.00088, 3],
      [-0.00043, 3],
      [-0.00247, 0],
      [-0.00254, 0],
      [0.0056, 1],
      [-0.00048, 3],
      [-0.00223, 0],
      [-0.0009, 3]
    ],
    "red_o_points": [],
    "y_categories": ["N", "NOT APPLICABLE", "Y", "nan"],
    "blue_o_points": [],
    "blue_x_points": [
      [0.00831, 1],
      [-8e-5, 3],
      [0.0061, 1],
      [0.00048, 0],
      [-0.00089, 0],
      [0.00758, 1],
      [0.00014, 3],
      [0.00666, 1],
      [0.00021, 3],
      [-0.0, 3]
    ]
  },
  "QA_mulInjTbpiCause[Motorcycle]": {
    "red_x_points": [
      [-0.00211, 0],
      [-0.00062, 1],
      [-0.00082, 1],
      [-0.00065, 1],
      [-0.00066, 1],
      [-0.00072, 1],
      [-0.00038, 1],
      [-0.00091, 1],
      [0.00152, 1],
      [-0.00096, 1],
      [-0.00073, 1],
      [-0.00017, 1],
      [-0.00918, 0],
      [-0.03968, 1],
      [-0.00073, 1],
      [-0.00092, 1],
      [-0.00024, 1],
      [-0.00061, 1],
      [-0.00182, 1],
      [-0.0176, 0],
      [0.00025, 1],
      [0.00434, 1],
      [-0.00037, 1],
      [-0.00086, 1],
      [-0.00114, 1],
      [-0.00761, 0],
      [-0.00048, 1],
      [-0.00029, 1],
      [-0.04017, 1],
      [-0.00068, 1],
      [-0.00027, 1],
      [-0.00096, 1]
    ],
    "red_o_points": [],
    "y_categories": ["N", "Y", "nan"],
    "blue_o_points": [],
    "blue_x_points": [
      [0.0206, 0],
      [-0.00075, 1],
      [0.01571, 0],
      [-0.00199, 1],
      [-0.00023, 1],
      [0.01736, 0],
      [0.00569, 1],
      [0.01666, 0],
      [0.00573, 1],
      [0.0044, 1]
    ]
  },
  "QS_mulLysisRoot[C6]": {
    "red_x_points": [
      [-0.0005, 3],
      [-0.0019, 0],
      [-0.00584, 2],
      [-0.00208, 0],
      [-0.00055, 3],
      [-0.00192, 0],
      [-0.00143, 0],
      [-0.0015, 0],
      [-0.00064, 3],
      [-0.00179, 0],
      [-0.00179, 0],
      [-0.0009, 0],
      [-0.00058, 3],
      [0.00454, 1],
      [-0.00077, 3],
      [-0.0016, 0],
      [-0.00049, 3],
      [-0.00131, 0],
      [-0.00064, 3],
      [-0.00088, 3],
      [-0.00044, 3],
      [-0.00047, 3],
      [-0.00148, 0],
      [-0.0007, 3],
      [-0.00062, 3],
      [-0.00057, 3],
      [-0.0014, 0],
      [-0.00169, 0],
      [0.0039, 1],
      [-0.00049, 3],
      [-0.00583, 2],
      [-0.00046, 3]
    ],
    "red_o_points": [],
    "y_categories": ["N", "NOT APPLICABLE", "Y", "nan"],
    "blue_o_points": [],
    "blue_x_points": [
      [0.00581, 1],
      [-0.00023, 3],
      [0.00497, 1],
      [0.00069, 0],
      [-0.00055, 0],
      [0.00526, 1],
      [-0.00032, 3],
      [0.00574, 1],
      [-0.00049, 3],
      [-0.00012, 3]
    ]
  },
  "QS_mulGraftLevel[Trunk]": {
    "red_x_points": [
      [-0.0002, 3],
      [-0.00071, 0],
      [-0.00063, 0],
      [-0.0007, 0],
      [-0.00014, 3],
      [-0.00066, 0],
      [-0.00066, 0],
      [-0.00066, 0],
      [-0.00019, 3],
      [-0.00063, 0],
      [-0.00054, 0],
      [-0.00062, 0],
      [-9e-5, 3],
      [0.00141, 1],
      [-0.0002, 3],
      [-0.00259, 2],
      [-0.00017, 3],
      [-0.00075, 0],
      [-0.00019, 3],
      [-0.00018, 3],
      [-0.00019, 3],
      [-0.00018, 3],
      [-0.00084, 0],
      [-0.00012, 3],
      [-0.00017, 3],
      [-0.00017, 3],
      [-0.00076, 0],
      [-0.00071, 0],
      [0.00123, 1],
      [-0.00019, 3],
      [-0.00076, 0],
      [-0.00018, 3]
    ],
    "red_o_points": [],
    "y_categories": ["N", "NOT APPLICABLE", "Y", "nan"],
    "blue_o_points": [],
    "blue_x_points": [
      [0.00221, 1],
      [-9e-5, 3],
      [0.00189, 1],
      [0.00072, 0],
      [-0.00051, 0],
      [0.00216, 1],
      [-9e-5, 3],
      [0.00159, 1],
      [-0.00012, 3],
      [-0.00021, 3]
    ]
  },
  "QS_mulGraftNerve[other]": {
    "red_x_points": [
      [-6e-5, 2],
      [-6e-5, 0],
      [-9e-5, 0],
      [-0.00019, 0],
      [-6e-5, 0],
      [-0.00013, 0],
      [1e-5, 2],
      [-0.00025, 0],
      [-0.00023, 0],
      [-0.00012, 0],
      [-3e-5, 2],
      [7e-5, 1],
      [-9e-5, 0],
      [-1e-5, 2],
      [-9e-5, 0],
      [1e-5, 2],
      [-6e-5, 2],
      [5e-5, 2],
      [-6e-5, 0],
      [1e-5, 2],
      [2e-5, 2],
      [-0.0, 2],
      [-9e-5, 0],
      [-6e-5, 0],
      [0.00027, 1],
      [-1e-5, 2]
    ],
    "red_o_points": [],
    "y_categories": ["N", "NOT APPLICABLE", "nan"],
    "blue_o_points": [],
    "blue_x_points": [
      [0.00023, 1],
      [1e-5, 2],
      [0.0002, 1],
      [-5e-5, 0],
      [0.00016, 1],
      [5e-5, 2],
      [0.00024, 1],
      [5e-5, 2],
      [4e-5, 2]
    ]
  },
  "QS_mulNeuromadSite[C5]": {
    "red_x_points": [
      [-7e-5, 2],
      [-0.00023, 0],
      [-0.0001, 0],
      [-0.00012, 0],
      [-5e-5, 2],
      [-0.0004, 0],
      [-0.00024, 0],
      [-0.00028, 0],
      [-7e-5, 2],
      [-0.00041, 0],
      [-0.0005, 0],
      [-0.00036, 0],
      [-4e-5, 2],
      [0.00036, 1],
      [-4e-5, 2],
      [-0.00025, 0],
      [-9e-5, 2],
      [-0.00028, 0],
      [-7e-5, 2],
      [-0.00012, 2],
      [-8e-5, 2],
      [-0.00013, 2],
      [-4e-5, 0],
      [-4e-5, 2],
      [-5e-5, 2],
      [-0.0001, 2],
      [-0.00033, 0],
      [-0.00015, 0],
      [0.00036, 1],
      [-4e-5, 2],
      [-0.00029, 0],
      [-6e-5, 2]
    ],
    "red_o_points": [],
    "y_categories": ["N", "NOT APPLICABLE", "nan"],
    "blue_o_points": [],
    "blue_x_points": [
      [0.00067, 1],
      [-2e-5, 2],
      [0.00096, 1],
      [-8e-5, 0],
      [-0.00013, 0],
      [0.00056, 1],
      [-7e-5, 2],
      [0.00044, 1],
      [-6e-5, 2],
      [3e-5, 2]
    ]
  },
  "QS_mulNeuromadSite[C7]": {
    "red_x_points": [
      [7e-5, 2],
      [-0.00058, 0],
      [-0.00043, 0],
      [-0.00058, 0],
      [-8e-5, 2],
      [-0.00047, 0],
      [-0.00028, 0],
      [-0.00053, 0],
      [-0.0002, 2],
      [-0.00042, 0],
      [-0.00053, 0],
      [-0.00023, 0],
      [5e-5, 2],
      [5e-5, 1],
      [-0.00016, 2],
      [-0.00062, 0],
      [0.0, 2],
      [-0.00054, 0],
      [-0.00015, 2],
      [-0.00018, 2],
      [6e-5, 2],
      [-8e-5, 2],
      [-0.0003, 0],
      [-0.00021, 2],
      [-0.00035, 2],
      [-7e-5, 2],
      [-0.00043, 0],
      [-0.00016, 0],
      [0.00108, 1],
      [2e-5, 2],
      [-9e-5, 0],
      [-7e-5, 2]
    ],
    "red_o_points": [],
    "y_categories": ["N", "NOT APPLICABLE", "nan"],
    "blue_o_points": [],
    "blue_x_points": [
      [0.00132, 1],
      [0.00016, 2],
      [0.00069, 1],
      [0.00023, 0],
      [0.0, 0],
      [0.00078, 1],
      [-5e-5, 2],
      [0.0009, 1],
      [-5e-5, 2],
      [-6e-5, 2]
    ]
  },
  "QS_mulGraftNerve[TD]": {
    "red_x_points": [
      [-3e-5, 2],
      [-6e-5, 0],
      [-6e-5, 0],
      [-6e-5, 0],
      [-3e-5, 2],
      [-6e-5, 0],
      [-6e-5, 0],
      [-6e-5, 0],
      [-3e-5, 2],
      [-6e-5, 0],
      [-6e-5, 0],
      [-6e-5, 0],
      [-3e-5, 2],
      [-3e-5, 2],
      [-6e-5, 0],
      [-3e-5, 2],
      [-3e-5, 2],
      [-3e-5, 2],
      [-3e-5, 2],
      [-3e-5, 2],
      [-6e-5, 0],
      [0.00012, 1],
      [-3e-5, 2],
      [-6e-5, 0]
    ],
    "red_o_points": [],
    "y_categories": ["N", "NOT APPLICABLE", "nan"],
    "blue_o_points": [],
    "blue_x_points": [[0.00012, 1], [0.00012, 1], [0.00012, 1], [-3e-5, 2]]
  },
  "QS_mulNeuromadSite[T1]": {
    "red_x_points": [
      [-4e-5, 2],
      [-0.00056, 0],
      [-0.00068, 0],
      [-0.00081, 0],
      [-8e-5, 2],
      [-0.00065, 0],
      [-0.00044, 0],
      [-0.00056, 0],
      [-0.00031, 2],
      [-0.00094, 0],
      [-0.00095, 0],
      [-0.00055, 0],
      [-9e-5, 2],
      [0.00057, 1],
      [-4e-5, 2],
      [-0.00081, 0],
      [-0.00027, 2],
      [-0.00069, 0],
      [-0.00027, 2],
      [-0.00019, 2],
      [-7e-5, 2],
      [-0.00024, 2],
      [-0.00047, 0],
      [2e-5, 2],
      [-0.00063, 2],
      [-7e-5, 2],
      [-0.00068, 0],
      [-0.00056, 0],
      [0.00075, 1],
      [-3e-5, 2],
      [-0.00056, 0],
      [-0.00013, 2]
    ],
    "red_o_points": [],
    "y_categories": ["N", "NOT APPLICABLE", "nan"],
    "blue_o_points": [],
    "blue_x_points": [
      [0.00234, 1],
      [2e-5, 2],
      [0.0016, 1],
      [0.00031, 0],
      [-0.00025, 0],
      [0.00198, 1],
      [1e-5, 2],
      [0.00105, 1],
      [2e-5, 2],
      [0.00018, 2]
    ]
  },
  "QS_mulLysisSite[Nerve]": {
    "red_x_points": [
      [-0.00011, 3],
      [-0.00021, 0],
      [-0.00181, 2],
      [-0.00029, 0],
      [-0.00015, 3],
      [-0.00037, 0],
      [-0.00026, 0],
      [-0.00027, 0],
      [-0.00025, 3],
      [-0.00028, 0],
      [-0.00023, 0],
      [-7e-5, 0],
      [-4e-5, 3],
      [0.00045, 1],
      [-0.00025, 3],
      [-0.00026, 0],
      [-0.00015, 3],
      [-0.00024, 0],
      [-0.00013, 3],
      [-0.00011, 3],
      [-0.0001, 3],
      [-0.00012, 3],
      [-0.0002, 0],
      [-0.00018, 3],
      [-0.0001, 3],
      [-0.00016, 3],
      [-0.00019, 0],
      [-0.00017, 0],
      [0.0006, 1],
      [-0.00011, 3],
      [-0.00023, 0],
      [-0.00013, 3]
    ],
    "red_o_points": [],
    "y_categories": ["N", "NOT APPLICABLE", "Y", "nan"],
    "blue_o_points": [],
    "blue_x_points": [
      [0.00083, 1],
      [-3e-5, 3],
      [0.00083, 1],
      [0.00027, 0],
      [0.00019, 0],
      [0.00079, 1],
      [-5e-5, 3],
      [0.00078, 1],
      [-5e-5, 3],
      [-5e-5, 3]
    ]
  },
  "QS_mulTransfSite[IMc]": {
    "red_x_points": [
      [-0.00122, 3],
      [-0.0109, 2],
      [-0.00426, 0],
      [-0.00449, 0],
      [-0.00125, 3],
      [-0.00522, 0],
      [-0.00399, 0],
      [-0.00418, 0],
      [-0.00175, 3],
      [-0.00443, 0],
      [-0.00472, 0],
      [-0.00432, 0],
      [-0.00146, 3],
      [0.01061, 1],
      [-0.00171, 3],
      [-0.00425, 0],
      [-0.00166, 3],
      [-0.0101, 2],
      [-0.00126, 3],
      [-0.00138, 3],
      [-0.0015, 3],
      [-0.00148, 3],
      [-0.00387, 0],
      [-0.00141, 3],
      [-0.00157, 3],
      [-0.00148, 3],
      [-0.00398, 0],
      [-0.00961, 2],
      [0.01146, 1],
      [-0.0013, 3],
      [-0.01104, 2],
      [-0.00182, 3]
    ],
    "red_o_points": [],
    "y_categories": ["N", "NOT APPLICABLE", "Y", "nan"],
    "blue_o_points": [],
    "blue_x_points": [
      [0.01765, 1],
      [-0.00032, 3],
      [0.01377, 1],
      [0.00044, 0],
      [-0.00148, 0],
      [0.01383, 1],
      [-0.00069, 3],
      [0.01352, 1],
      [-0.00082, 3],
      [-0.0002, 3]
    ]
  },
  "QS_mulLysisRoot[C7]": {
    "red_x_points": [
      [-0.00018, 3],
      [-0.00045, 0],
      [-0.00227, 2],
      [-0.00046, 0],
      [-0.00014, 3],
      [-0.00042, 0],
      [-0.00041, 0],
      [-0.00029, 0],
      [-0.00018, 3],
      [-0.00043, 0],
      [-0.00051, 0],
      [-0.00038, 0],
      [-0.00017, 3],
      [0.00071, 1],
      [-0.00025, 3],
      [-0.00035, 0],
      [-0.00014, 3],
      [-0.0004, 0],
      [-0.0001, 3],
      [-0.00021, 3],
      [-0.00011, 3],
      [-0.00014, 3],
      [-0.00049, 0],
      [-0.00014, 3],
      [-0.0001, 3],
      [-0.00017, 3],
      [-0.00029, 0],
      [-0.00039, 0],
      [0.00115, 1],
      [-0.00014, 3],
      [-0.00036, 0],
      [-6e-5, 3]
    ],
    "red_o_points": [],
    "y_categories": ["N", "NOT APPLICABLE", "Y", "nan"],
    "blue_o_points": [],
    "blue_x_points": [
      [0.00164, 1],
      [1e-5, 3],
      [0.00077, 1],
      [-0.00014, 0],
      [6e-5, 0],
      [0.00136, 1],
      [-0.00014, 3],
      [0.00125, 1],
      [-4e-5, 3],
      [-3e-5, 3]
    ]
  },
  "QS_lstBpsurgSide": {
    "red_x_points": [
      [-0.00174, 3],
      [-0.00666, 0],
      [-0.00761, 0],
      [-0.00774, 0],
      [-0.00134, 3],
      [-0.00815, 2],
      [-0.00717, 0],
      [-0.00873, 0],
      [-0.00169, 3],
      [-0.00861, 0],
      [-0.0079, 2],
      [-0.00704, 2],
      [-0.00147, 3],
      [0.0125, 1],
      [-0.00153, 3],
      [-0.00869, 2],
      [-0.00143, 3],
      [-0.00703, 2],
      [-0.00194, 3],
      [-0.00152, 3],
      [-0.00154, 3],
      [-0.00126, 3],
      [-0.00713, 0],
      [-0.00132, 3],
      [-0.00198, 3],
      [-0.00124, 3],
      [-0.00704, 2],
      [-0.00603, 2],
      [0.01331, 1],
      [-0.00144, 3],
      [-0.0076, 0],
      [-0.00127, 3]
    ],
    "red_o_points": [],
    "y_categories": ["L", "NOT APPLICABLE", "R", "nan"],
    "blue_o_points": [],
    "blue_x_points": [
      [0.01887, 1],
      [-0.00069, 3],
      [0.01561, 1],
      [0.00164, 0],
      [-0.00032, 2],
      [0.0169, 1],
      [-0.00026, 3],
      [0.01623, 1],
      [-0.00068, 3],
      [-0.0002, 3]
    ]
  },
  "QA_lstPexPain[T1]": {
    "red_x_points": [
      [-0.00999, 1],
      [-0.00239, 2],
      [-0.00241, 2],
      [-0.00242, 2],
      [-0.00994, 1],
      [-0.00988, 0],
      [0.00268, 1],
      [0.00267, 1],
      [0.00753, 0],
      [0.0034, 1],
      [-0.00473, 0],
      [-0.00774, 0],
      [0.00728, 0],
      [-0.01429, 2],
      [-0.00467, 2],
      [-0.00488, 2],
      [-0.0053, 2],
      [-0.0022, 2],
      [-0.00553, 2],
      [0.00769, 0],
      [-0.01006, 1],
      [0.00795, 0],
      [-0.004, 2],
      [-0.00502, 2],
      [-0.0115, 1],
      [-0.00584, 2],
      [-0.00549, 2],
      [-0.00239, 2],
      [-0.00641, 1],
      [-0.01201, 1],
      [0.00103, 1],
      [-0.01017, 1]
    ],
    "red_o_points": [],
    "y_categories": ["NORM", "NPV", "nan"],
    "blue_o_points": [],
    "blue_x_points": [
      [0.00043, 1],
      [-0.00092, 2],
      [0.00705, 0],
      [0.00794, 1],
      [0.01416, 1],
      [-4e-5, 1],
      [0.01168, 0],
      [0.00607, 0],
      [0.01122, 0],
      [0.01629, 0]
    ]
  },
  "QS_mulTransfSite[AcMc]": {
    "red_x_points": [
      [-0.0002, 3],
      [-0.00035, 0],
      [-0.00017, 0],
      [-0.00048, 0],
      [-0.00015, 3],
      [-0.00051, 0],
      [-0.00045, 0],
      [-0.00036, 0],
      [-0.00048, 3],
      [-0.00054, 0],
      [-0.00061, 0],
      [-0.00652, 2],
      [-0.00032, 3],
      [0.00103, 1],
      [-0.00022, 3],
      [-0.00025, 0],
      [-0.00037, 3],
      [-0.0004, 0],
      [-0.00016, 3],
      [-0.00059, 3],
      [-0.00016, 3],
      [-0.0005, 3],
      [-0.00048, 0],
      [-0.00028, 3],
      [-0.00016, 3],
      [-0.00014, 3],
      [-0.00024, 0],
      [-0.00049, 0],
      [0.00091, 1],
      [-0.00015, 3],
      [-0.00029, 0],
      [-0.00017, 3]
    ],
    "red_o_points": [],
    "y_categories": ["N", "NOT APPLICABLE", "Y", "nan"],
    "blue_o_points": [],
    "blue_x_points": [
      [0.00159, 1],
      [-3e-5, 3],
      [0.00236, 1],
      [0.00063, 0],
      [0.0011, 0],
      [0.0014, 1],
      [-0.00023, 3],
      [0.00308, 1],
      [-9e-5, 3],
      [-0.0002, 3]
    ]
  },
  "QA_lstPexKine[Shoulder]": {
    "red_x_points": [
      [-0.00115, 1],
      [-0.00327, 2],
      [-0.00407, 2],
      [-0.00374, 2],
      [-0.00647, 2],
      [-0.00466, 1],
      [-0.00195, 1],
      [0.00323, 0],
      [-0.0104, 2],
      [-0.00182, 1],
      [-0.00263, 1],
      [-0.0033, 1],
      [-0.00213, 1],
      [-0.00112, 2],
      [-0.00571, 2],
      [-0.00197, 1],
      [-0.00562, 2],
      [-0.00283, 2],
      [-0.00605, 2],
      [-0.00245, 1],
      [-0.0012, 1],
      [-0.00215, 1],
      [-0.00299, 2],
      [-0.00566, 2],
      [-0.00224, 1],
      [-0.00832, 2],
      [-0.00576, 2],
      [-0.00366, 2],
      [-0.00167, 2],
      [-0.00551, 2],
      [-0.00099, 1],
      [-0.00659, 2]
    ],
    "red_o_points": [],
    "y_categories": ["NPV", "PV", "nan"],
    "blue_o_points": [],
    "blue_x_points": [
      [-0.00023, 1],
      [-0.00282, 2],
      [-0.00021, 1],
      [0.00189, 1],
      [0.02836, 0],
      [-0.00011, 1],
      [0.04326, 0],
      [-0.00056, 2],
      [6e-5, 1],
      [0.00064, 1]
    ]
  },
  "QA_yonInjBpsurg": {
    "red_x_points": [
      [-0.00188, 1],
      [-0.0017, 1],
      [-0.00204, 1],
      [-0.00175, 1],
      [-0.00202, 1],
      [-0.00193, 1],
      [-0.0015, 1],
      [-0.00212, 1],
      [-0.00208, 1],
      [-0.00204, 1],
      [-0.00204, 1],
      [-0.00144, 1],
      [-0.00184, 1],
      [0.00346, 0],
      [-0.00194, 1],
      [-0.00196, 1],
      [-0.00233, 1],
      [-0.0015, 1],
      [-0.00198, 1],
      [-0.00168, 1],
      [-0.00185, 1],
      [-0.00155, 1],
      [-0.0013, 1],
      [-0.00199, 1],
      [-0.00286, 1],
      [-0.00207, 1],
      [-0.00164, 1],
      [-0.0016, 1],
      [0.00528, 0],
      [-0.0017, 1],
      [-0.00163, 1],
      [-0.00222, 1]
    ],
    "red_o_points": [],
    "y_categories": ["N", "Y", "nan"],
    "blue_o_points": [],
    "blue_x_points": [
      [0.00894, 0],
      [-0.00036, 1],
      [0.00713, 0],
      [-0.00131, 1],
      [-0.00167, 1],
      [0.00819, 0],
      [-0.00086, 1],
      [0.00867, 0],
      [-0.00091, 1],
      [-0.00046, 1]
    ]
  },
  "QA_lstPexTouch[C8]": {
    "red_x_points": [
      [-0.00833, 1],
      [-0.0032, 2],
      [-0.00281, 1],
      [-0.00351, 2],
      [-0.00763, 1],
      [0.00323, 0],
      [-0.00329, 1],
      [-0.00441, 1],
      [0.00612, 0],
      [-0.00329, 1],
      [0.00374, 0],
      [0.00332, 0],
      [-0.00987, 1],
      [-0.01619, 2],
      [-0.00498, 2],
      [-0.00404, 2],
      [-0.0094, 1],
      [-0.00235, 2],
      [-0.00526, 2],
      [0.00727, 0],
      [-0.00824, 1],
      [0.00607, 0],
      [-0.00268, 2],
      [-0.00526, 2],
      [0.00381, 0],
      [0.00648, 0],
      [-0.00325, 1],
      [-0.00296, 2],
      [-0.00763, 1],
      [-0.00423, 2],
      [-0.0033, 1],
      [-0.00868, 1]
    ],
    "red_o_points": [],
    "y_categories": ["NORM", "NPV", "nan"],
    "blue_o_points": [],
    "blue_x_points": [
      [0.01215, 0],
      [-0.00054, 2],
      [0.00044, 1],
      [0.00141, 1],
      [0.00754, 0],
      [0.00059, 1],
      [0.01006, 0],
      [0.00668, 0],
      [0.00796, 0],
      [0.01027, 0]
    ]
  },
  "QS_mulLysisNerve[Ssr]": {
    "red_x_points": [
      [-0.00023, 3],
      [-0.00043, 0],
      [-0.00233, 2],
      [-0.00041, 0],
      [-9e-5, 3],
      [-0.00044, 0],
      [-0.00033, 0],
      [-0.0004, 0],
      [-5e-5, 3],
      [-0.00035, 0],
      [-0.00038, 0],
      [-0.00027, 0],
      [-7e-5, 3],
      [0.00068, 1],
      [-0.0001, 3],
      [-0.00036, 0],
      [-0.00017, 3],
      [-0.00044, 0],
      [-4e-5, 3],
      [-8e-5, 3],
      [-0.0001, 3],
      [-5e-5, 3],
      [-0.00035, 0],
      [-1e-5, 3],
      [-0.00011, 3],
      [-9e-5, 3],
      [-0.00012, 0],
      [-0.00039, 0],
      [0.00106, 1],
      [-3e-5, 3],
      [-0.00021, 0],
      [-0.00016, 3]
    ],
    "red_o_points": [],
    "y_categories": ["N", "NOT APPLICABLE", "Y", "nan"],
    "blue_o_points": [],
    "blue_x_points": [
      [0.00158, 1],
      [-1e-5, 3],
      [0.00077, 1],
      [0.00013, 0],
      [-2e-5, 0],
      [0.00107, 1],
      [-4e-5, 3],
      [0.00098, 1],
      [1e-5, 3],
      [2e-5, 3]
    ]
  },
  "QS_mulTransfSite[AcSsAA]": {
    "red_x_points": [
      [-0.00204, 3],
      [-0.0149, 2],
      [-0.00376, 0],
      [-0.0151, 2],
      [-0.00216, 3],
      [-0.02258, 2],
      [-0.0032, 0],
      [-0.00393, 0],
      [-0.00229, 3],
      [-0.00381, 0],
      [-0.01802, 2],
      [-0.00337, 0],
      [-0.0019, 3],
      [0.01788, 1],
      [-0.00229, 3],
      [-0.01623, 2],
      [-0.00236, 3],
      [-0.00345, 0],
      [-0.00346, 3],
      [-0.00242, 3],
      [-0.00203, 3],
      [-0.00222, 3],
      [-0.01481, 2],
      [-0.00207, 3],
      [-0.00406, 3],
      [-0.00217, 3],
      [-0.00354, 0],
      [-0.01425, 2],
      [0.01807, 1],
      [-0.00211, 3],
      [-0.00282, 0],
      [-0.00213, 3]
    ],
    "red_o_points": [],
    "y_categories": ["N", "NOT APPLICABLE", "Y", "nan"],
    "blue_o_points": [],
    "blue_x_points": [
      [0.02368, 1],
      [-0.00078, 3],
      [0.01967, 1],
      [0.00299, 0],
      [0.00236, 0],
      [0.0198, 1],
      [-0.00087, 3],
      [0.02272, 1],
      [-0.00093, 3],
      [-0.00049, 3]
    ]
  },
  "QS_mulLysisRoot[C5]": {
    "red_x_points": [
      [-0.00053, 3],
      [-0.00293, 0],
      [-0.00706, 2],
      [-0.00292, 0],
      [-0.00075, 3],
      [-0.00291, 0],
      [-0.00266, 0],
      [-0.00273, 0],
      [-0.00105, 3],
      [-0.00334, 0],
      [-0.0026, 0],
      [-0.00239, 0],
      [-0.00052, 3],
      [0.00529, 1],
      [-0.00079, 3],
      [-0.00295, 0],
      [-0.00047, 3],
      [-0.00247, 0],
      [-0.00055, 3],
      [-0.00073, 3],
      [-0.00058, 3],
      [-0.00078, 3],
      [-0.00239, 0],
      [-0.00077, 3],
      [-0.00076, 3],
      [-0.00069, 3],
      [-0.00249, 0],
      [-0.00241, 0],
      [0.00669, 1],
      [-0.0007, 3],
      [-0.00632, 2],
      [-0.00068, 3]
    ],
    "red_o_points": [],
    "y_categories": ["N", "NOT APPLICABLE", "Y", "nan"],
    "blue_o_points": [],
    "blue_x_points": [
      [0.00837, 1],
      [-0.0, 3],
      [0.00721, 1],
      [-0.00019, 0],
      [-0.00051, 0],
      [0.0078, 1],
      [-0.00047, 3],
      [0.00785, 1],
      [-0.00036, 3],
      [-0.00032, 3]
    ]
  },
  "QS_mulNeuromadSite[C6]": {
    "red_x_points": [
      [-7e-5, 2],
      [-0.00045, 0],
      [-0.00044, 0],
      [-0.00044, 0],
      [-9e-5, 2],
      [-0.00065, 0],
      [-0.00041, 0],
      [-0.00052, 0],
      [-0.00015, 2],
      [-0.00057, 0],
      [-0.00055, 0],
      [-0.00058, 0],
      [-0.0001, 2],
      [0.00061, 1],
      [-0.00025, 2],
      [-0.00059, 0],
      [-0.00015, 2],
      [-0.00051, 0],
      [-0.00014, 2],
      [-2e-5, 2],
      [-3e-5, 2],
      [-5e-5, 2],
      [-0.00057, 0],
      [-0.00023, 2],
      [-0.00032, 2],
      [-0.0002, 2],
      [-0.00045, 0],
      [-0.00052, 0],
      [0.00094, 1],
      [-0.00019, 2],
      [-0.00045, 0],
      [-0.00017, 2]
    ],
    "red_o_points": [],
    "y_categories": ["N", "NOT APPLICABLE", "nan"],
    "blue_o_points": [],
    "blue_x_points": [
      [0.00147, 1],
      [-4e-5, 2],
      [0.00081, 1],
      [0.00022, 0],
      [-0.00014, 0],
      [0.00081, 1],
      [-6e-5, 2],
      [0.00181, 1],
      [-4e-5, 2],
      [-6e-5, 2]
    ]
  },
  "QS_mulBpsurgeryType[Lysis]": {
    "red_x_points": [
      [-0.00139, 3],
      [-0.00593, 0],
      [-0.01293, 2],
      [-0.00612, 0],
      [-0.00151, 3],
      [-0.00667, 0],
      [-0.01417, 2],
      [-0.00542, 0],
      [-0.0021, 3],
      [-0.00571, 0],
      [-0.00574, 0],
      [-0.00469, 0],
      [-0.0017, 3],
      [0.01261, 1],
      [-0.0018, 3],
      [-0.00603, 0],
      [-0.00194, 3],
      [-0.01122, 2],
      [-0.00155, 3],
      [-0.00192, 3],
      [-0.00136, 3],
      [-0.0014, 3],
      [-0.00582, 0],
      [-0.00193, 3],
      [-0.00217, 3],
      [-0.00126, 3],
      [-0.00508, 0],
      [-0.00529, 0],
      [0.01322, 1],
      [-0.00129, 3],
      [-0.01304, 2],
      [-0.0018, 3]
    ],
    "red_o_points": [],
    "y_categories": ["N", "NOT APPLICABLE", "Y", "nan"],
    "blue_o_points": [],
    "blue_x_points": [
      [0.02097, 1],
      [-0.0003, 3],
      [0.01594, 1],
      [0.00113, 0],
      [-0.00087, 0],
      [0.01607, 1],
      [-0.00043, 3],
      [0.0175, 1],
      [-0.00057, 3],
      [0.00045, 3]
    ]
  },
  "QA_lstPexTouch[C7]": {
    "red_x_points": [
      [-0.00778, 1],
      [-0.00201, 2],
      [-0.00287, 1],
      [-0.00223, 2],
      [-0.00772, 1],
      [0.00332, 0],
      [-0.00271, 1],
      [-0.00388, 1],
      [0.00587, 0],
      [-0.00292, 1],
      [0.00386, 0],
      [-0.00362, 1],
      [-0.0111, 1],
      [-0.00997, 2],
      [-0.00381, 2],
      [-0.00286, 2],
      [-0.0089, 1],
      [-0.00203, 2],
      [-0.00415, 2],
      [0.00659, 0],
      [-0.00844, 1],
      [0.00627, 0],
      [-0.00268, 2],
      [-0.00415, 2],
      [0.00214, 0],
      [0.0054, 0],
      [-0.00338, 1],
      [-0.00208, 2],
      [-0.00309, 1],
      [-0.00483, 2],
      [-0.00297, 1],
      [-0.0084, 1]
    ],
    "red_o_points": [],
    "y_categories": ["NORM", "NPV", "nan"],
    "blue_o_points": [],
    "blue_x_points": [
      [5e-5, 1],
      [-0.00037, 2],
      [0.00132, 1],
      [0.00115, 1],
      [0.01291, 0],
      [0.0013, 1],
      [0.00986, 0],
      [0.00484, 0],
      [0.00848, 0],
      [0.01248, 0]
    ]
  },
  "QA_lstPexMuscstrength[ShoulderAbduc]": {
    "red_x_points": [
      [-0.00398, 1],
      [-0.00331, 1],
      [-0.00362, 1],
      [-0.00315, 1],
      [-0.0042, 1],
      [-0.00417, 1],
      [-0.00368, 1],
      [-0.00366, 1],
      [-0.00389, 1],
      [-0.00373, 1],
      [-0.00411, 1],
      [-0.00427, 1],
      [-0.00409, 1],
      [0.00114, 2],
      [0.00121, 2],
      [0.00154, 2],
      [0.00141, 2],
      [0.00131, 2],
      [0.0011, 2],
      [-0.00387, 1],
      [-0.00372, 1],
      [-0.0038, 1],
      [-0.00336, 1],
      [0.00148, 2],
      [-0.00596, 1],
      [-0.00356, 1],
      [-0.00368, 1],
      [-0.00349, 1],
      [0.00177, 2],
      [-0.00386, 1],
      [-0.00378, 1],
      [0.00173, 2]
    ],
    "red_o_points": [],
    "y_categories": ["GREATER THAN OR EQUALS TO 3", "LESS THAN 3", "nan"],
    "blue_o_points": [],
    "blue_x_points": [
      [0.00129, 2],
      [0.00193, 2],
      [0.02099, 0],
      [0.00266, 2],
      [-0.00292, 1],
      [0.02304, 0],
      [0.00248, 2],
      [-0.00169, 1],
      [-0.00252, 1],
      [-0.00269, 1]
    ]
  },
  "QA_lstPexMuscstrength[ThumbOppo]": {
    "red_x_points": [
      [-0.00732, 1],
      [0.00088, 2],
      [-0.00507, 1],
      [-0.00437, 1],
      [-0.0073, 1],
      [0.00138, 0],
      [0.00108, 0],
      [-0.00688, 1],
      [0.00086, 0],
      [0.00144, 0],
      [0.00119, 0],
      [0.00101, 0],
      [0.00066, 0],
      [0.00075, 2],
      [0.00147, 2],
      [0.00073, 2],
      [0.00051, 0],
      [0.00083, 2],
      [0.00127, 2],
      [0.00052, 0],
      [-0.00763, 1],
      [0.00118, 0],
      [-0.00413, 1],
      [0.00174, 2],
      [0.00153, 2],
      [0.00136, 2],
      [0.00114, 0],
      [-0.00414, 1],
      [0.00103, 2],
      [-0.00689, 1],
      [-0.00548, 1],
      [0.00151, 2]
    ],
    "red_o_points": [],
    "y_categories": ["GREATER THAN OR EQUALS TO 3", "LESS THAN 3", "nan"],
    "blue_o_points": [],
    "blue_x_points": [
      [0.00049, 2],
      [0.00253, 2],
      [0.00143, 0],
      [0.00383, 2],
      [0.00285, 0],
      [0.0011, 0],
      [0.002, 0],
      [0.00131, 0],
      [0.00302, 2],
      [0.00314, 2]
    ]
  },
  "QS_mulNeuromadSite[T2]": {
    "red_x_points": [
      [-0.00018, 2],
      [-0.00065, 0],
      [-0.00073, 0],
      [-0.0012, 0],
      [-0.00018, 2],
      [-0.00145, 0],
      [-0.00069, 0],
      [-0.00092, 0],
      [-0.00028, 2],
      [-0.0011, 0],
      [-0.00104, 0],
      [-0.00089, 0],
      [-0.00025, 2],
      [0.00097, 1],
      [-0.00042, 2],
      [-0.00081, 0],
      [-0.0005, 2],
      [-0.0007, 0],
      [-0.00067, 2],
      [-0.00022, 2],
      [-0.00019, 2],
      [-0.00024, 2],
      [-0.00067, 0],
      [-0.00049, 2],
      [-0.00048, 2],
      [-0.00027, 2],
      [-0.00067, 0],
      [-0.0007, 0],
      [0.00138, 1],
      [-0.00027, 2],
      [-0.00037, 0],
      [-0.00033, 2]
    ],
    "red_o_points": [],
    "y_categories": ["N", "NOT APPLICABLE", "nan"],
    "blue_o_points": [],
    "blue_x_points": [
      [0.00308, 1],
      [-8e-5, 2],
      [0.00214, 1],
      [0.0005, 0],
      [-0.0004, 0],
      [0.00212, 1],
      [-3e-5, 2],
      [0.00183, 1],
      [-0.00011, 2],
      [-7e-5, 2]
    ]
  },
  "QA_equInjTbpiTime": {
    "red_x_points": [
      [-0.00012, 0],
      [-0.00332, 0],
      [0.00675, 3],
      [-0.00399, 0],
      [-0.0053, 1],
      [-0.00884, 0],
      [-0.00717, 1],
      [-0.00506, 0],
      [0.00096, 3],
      [-0.00695, 0],
      [-0.00671, 0],
      [0.01175, 3],
      [-0.00164, 0],
      [-0.0404, 2],
      [-0.00042, 3],
      [-0.00474, 0],
      [0.00033, 0],
      [-0.0028, 0],
      [-0.01732, 1],
      [0.00084, 3],
      [-0.00066, 0],
      [-0.00513, 1],
      [-0.00855, 2],
      [-0.00144, 3],
      [-0.01437, 1],
      [-0.01619, 2],
      [-0.00597, 0],
      [-0.00812, 2],
      [0.00071, 0],
      [0.00089, 0],
      [0.00594, 3],
      [-0.00581, 1]
    ],
    "red_o_points": [],
    "y_categories": [
      "0 TO 6 MONTHS",
      "13 TO 24 MONTHS",
      "25 MONTHS OR MORE",
      "7 TO 12 MONTHS",
      "nan"
    ],
    "blue_o_points": [],
    "blue_x_points": [
      [0.00361, 0],
      [0.01087, 0],
      [0.00441, 0],
      [0.01941, 3],
      [0.01879, 3],
      [0.00494, 0],
      [0.0039, 1],
      [0.0127, 3],
      [0.00782, 3],
      [0.0071, 0]
    ]
  },
  "QS_mulNeuromadSite[C4]": {
    "red_x_points": [
      [-9e-5, 2],
      [-0.00138, 0],
      [-0.00107, 0],
      [-0.0011, 0],
      [-0.00038, 2],
      [-0.0012, 0],
      [-0.00092, 0],
      [-0.00142, 0],
      [-0.00035, 2],
      [-0.00118, 0],
      [-0.00172, 0],
      [-0.00108, 0],
      [-9e-5, 2],
      [0.00112, 1],
      [-0.00025, 2],
      [-0.00134, 0],
      [-0.00035, 2],
      [-0.00104, 0],
      [-0.00028, 2],
      [-0.00023, 2],
      [-9e-5, 2],
      [-0.00018, 2],
      [-0.00095, 0],
      [-0.00019, 2],
      [-0.00042, 2],
      [-0.0002, 2],
      [-0.00127, 0],
      [-0.00114, 0],
      [0.00187, 1],
      [-0.00019, 2],
      [-0.00082, 0],
      [-0.00025, 2]
    ],
    "red_o_points": [],
    "y_categories": ["N", "NOT APPLICABLE", "nan"],
    "blue_o_points": [],
    "blue_x_points": [
      [0.00434, 1],
      [9e-5, 2],
      [0.00208, 1],
      [0.00034, 0],
      [-0.00023, 0],
      [0.00248, 1],
      [-0.0001, 2],
      [0.00257, 1],
      [-9e-5, 2],
      [0.00011, 2]
    ]
  },
  "QS_mulTransfSite[Oberlin]": {
    "red_x_points": [
      [-0.0027, 3],
      [-0.01918, 0],
      [-0.02039, 0],
      [-0.0199, 0],
      [-0.00298, 3],
      [-0.00454, 2],
      [-0.00419, 2],
      [-0.01936, 0],
      [-0.00317, 3],
      [-0.0055, 2],
      [-0.00526, 2],
      [-0.00352, 2],
      [-0.00273, 3],
      [0.02318, 1],
      [-0.00276, 3],
      [-0.00478, 2],
      [-0.00289, 3],
      [-0.01958, 0],
      [-0.00354, 3],
      [-0.00303, 3],
      [-0.00285, 3],
      [-0.00293, 3],
      [-0.01925, 0],
      [-0.00286, 3],
      [-0.00359, 3],
      [-0.00279, 3],
      [-0.00463, 2],
      [-0.0181, 0],
      [0.02342, 1],
      [-0.00236, 3],
      [-0.01989, 0],
      [-0.00289, 3]
    ],
    "red_o_points": [],
    "y_categories": ["N", "NOT APPLICABLE", "Y", "nan"],
    "blue_o_points": [],
    "blue_x_points": [
      [0.03078, 1],
      [-0.00099, 3],
      [0.02538, 1],
      [0.00278, 2],
      [0.00067, 2],
      [0.02651, 1],
      [-0.00119, 3],
      [0.02952, 1],
      [-0.00136, 3],
      [-0.00047, 3]
    ]
  },
  "QA_lstPexMuscstrength[ElbowFlex]": {
    "red_x_points": [
      [-0.00313, 1],
      [-0.00246, 2],
      [-0.00357, 1],
      [-0.0033, 1],
      [-0.00284, 1],
      [0.00752, 0],
      [-0.00358, 1],
      [-0.0039, 1],
      [-0.00287, 1],
      [-0.00403, 1],
      [-0.0038, 1],
      [-0.00418, 1],
      [-0.0029, 1],
      [-0.00264, 2],
      [-0.00294, 2],
      [-0.0028, 2],
      [-0.00317, 1],
      [-0.003, 2],
      [-0.0036, 2],
      [-0.00284, 1],
      [-0.00269, 1],
      [-0.00256, 1],
      [-0.00261, 1],
      [-0.00266, 2],
      [0.00011, 0],
      [-0.00259, 1],
      [-0.00384, 1],
      [-0.00288, 1],
      [-0.00277, 2],
      [-0.00306, 1],
      [-0.00339, 1],
      [-0.00284, 2]
    ],
    "red_o_points": [],
    "y_categories": ["GREATER THAN OR EQUALS TO 3", "LESS THAN 3", "nan"],
    "blue_o_points": [],
    "blue_x_points": [
      [-0.00074, 2],
      [-0.00044, 2],
      [0.01062, 0],
      [-0.00016, 1],
      [0.02157, 0],
      [0.01018, 0],
      [-0.00044, 1],
      [0.01082, 0],
      [-0.00033, 1],
      [-0.00069, 1]
    ]
  },
  "QS_mulGraftNerve[FI]": {
    "red_x_points": [
      [-1e-5, 2],
      [-0.00015, 0],
      [-6e-5, 0],
      [-0.00014, 0],
      [-0.0, 2],
      [-0.00041, 0],
      [-0.00027, 0],
      [-0.00018, 0],
      [0.0, 2],
      [-0.00031, 0],
      [-0.00031, 0],
      [-0.00018, 0],
      [-2e-5, 2],
      [7e-5, 1],
      [1e-5, 2],
      [-0.00012, 0],
      [1e-5, 2],
      [-9e-5, 0],
      [3e-5, 2],
      [-1e-5, 2],
      [1e-5, 2],
      [2e-5, 2],
      [-0.00012, 0],
      [0.0, 2],
      [5e-5, 2],
      [-2e-5, 2],
      [-0.0003, 0],
      [-8e-5, 0],
      [-0.00013, 1],
      [1e-5, 2],
      [-8e-5, 0],
      [-9e-5, 2]
    ],
    "red_o_points": [],
    "y_categories": ["N", "NOT APPLICABLE", "nan"],
    "blue_o_points": [],
    "blue_x_points": [
      [0.00049, 1],
      [3e-5, 2],
      [0.00047, 1],
      [1e-5, 0],
      [-0.00015, 0],
      [0.00054, 1],
      [4e-5, 2],
      [0.0005, 1],
      [5e-5, 2],
      [5e-5, 2]
    ]
  }
}
