{
  "QA_lstPexMuscstrength[ElbowFlex]": {
    "red_x_points": [
      [-0.00907, 1],
      [0.00024, 2],
      [-0.00863, 1],
      [-0.00836, 1],
      [-0.00926, 1],
      [-0.00937, 1],
      [-0.00936, 1],
      [-0.00849, 1],
      [-0.00904, 1],
      [-0.00934, 1],
      [-0.00896, 1],
      [-0.00946, 1],
      [0.00046, 2],
      [-0.00069, 2],
      [0.00089, 2],
      [-0.00915, 1],
      [-0.00878, 1],
      [-0.00839, 1],
      [-0.00891, 1],
      [-0.00878, 1],
      [0.00047, 2],
      [-0.00892, 1],
      [-0.00968, 1],
      [-0.00893, 1],
      [-0.00861, 1],
      [0.00117, 2],
      [-0.009, 1],
      [-0.00916, 1],
      [0.00043, 2]
    ],
    "red_o_points": [],
    "y_categories": ["GREATER THAN OR EQUALS TO 3", "LESS THAN 3", "nan"],
    "blue_o_points": [],
    "blue_x_points": [
      [0.00167, 2],
      [-0.00876, 1],
      [0.0436, 0],
      [-0.00901, 1],
      [0.00222, 2],
      [0.00194, 2],
      [0.03285, 0],
      [-0.00788, 1],
      [-0.00888, 1],
      [0.00212, 2],
      [0.04242, 0],
      [0.03561, 0],
      [0.03957, 0],
      [0.03548, 0],
      [-0.00828, 1]
    ]
  },
  "QS_mulGraftNerve[other]": {
    "red_x_points": [
      [-3e-5, 2],
      [-0.00068, 0],
      [-0.00041, 0],
      [-0.00045, 0],
      [-0.00045, 0],
      [-0.00045, 0],
      [-0.00037, 0],
      [-7e-5, 2],
      [-0.00055, 0],
      [-0.0005, 0],
      [-4e-5, 2],
      [-0.00056, 0],
      [-0.00011, 2],
      [-0.0005, 0],
      [-0.00058, 0],
      [-8e-5, 2],
      [-5e-5, 2],
      [-4e-5, 2],
      [-0.00058, 0],
      [-7e-5, 2],
      [-6e-5, 2],
      [-0.0002, 2],
      [-0.00056, 0],
      [-0.00047, 0],
      [-0.00012, 2],
      [0.00105, 1],
      [-0.0001, 2],
      [-0.0005, 0],
      [-9e-5, 2]
    ],
    "red_o_points": [],
    "y_categories": ["N", "NOT APPLICABLE", "nan"],
    "blue_o_points": [],
    "blue_x_points": [
      [0.00234, 1],
      [-7e-5, 2],
      [-0.00041, 0],
      [-0.0002, 0],
      [6e-5, 2],
      [0.00211, 1],
      [0.00133, 1],
      [-0.00027, 0],
      [-3e-5, 2],
      [-2e-5, 2],
      [-0.00029, 0],
      [0.00138, 1],
      [1e-5, 2],
      [0.00171, 1],
      [-3e-5, 2]
    ]
  },
  "QS_mulGraftRoot[C6]": {
    "red_x_points": [
      [1e-5, 2],
      [-4e-5, 0],
      [-4e-5, 0],
      [-4e-5, 0],
      [-4e-5, 0],
      [-4e-5, 0],
      [1e-5, 2],
      [1e-5, 2]
    ],
    "red_o_points": [],
    "y_categories": ["N", "NOT APPLICABLE", "nan"],
    "blue_o_points": [],
    "blue_x_points": [[0.00016, 1], [1e-5, 2]]
  },
  "QS_mulBpsurgeryType[Transf]": {
    "red_x_points": [
      [-0.00017, 3],
      [-0.0009, 2],
      [-0.0029, 0],
      [-0.00079, 2],
      [-0.00076, 2],
      [-0.00078, 2],
      [-0.0009, 2],
      [-0.00017, 3],
      [-0.00083, 2],
      [-0.00061, 2],
      [-0.00013, 3],
      [-0.00076, 2],
      [-0.00026, 3],
      [-0.001, 2],
      [-0.00088, 2],
      [-0.0001, 3],
      [-9e-5, 3],
      [-0.00014, 3],
      [-0.00073, 2],
      [-5e-5, 3],
      [-0.00014, 3],
      [-0.00021, 3],
      [-0.00085, 2],
      [-0.00074, 2],
      [-0.00018, 3],
      [0.00196, 1],
      [-0.00019, 3],
      [-0.0007, 2],
      [-0.00027, 3]
    ],
    "red_o_points": [],
    "y_categories": ["N", "NOT APPLICABLE", "Y", "nan"],
    "blue_o_points": [],
    "blue_x_points": [
      [0.00455, 1],
      [-0.00012, 3],
      [-0.00038, 2],
      [-0.00066, 2],
      [-3e-5, 3],
      [0.00343, 1],
      [0.00249, 1],
      [-0.00074, 2],
      [-0.00011, 3],
      [-8e-5, 3],
      [-9e-5, 2],
      [0.00326, 1],
      [-4e-5, 3],
      [0.00284, 1],
      [-4e-5, 3]
    ]
  },
  "QA_mulInjOrthesisType[ShoulderSupport]": {
    "red_x_points": [
      [-0.00571, 0],
      [-0.00576, 0],
      [-0.00586, 0],
      [-0.02132, 2],
      [-0.00571, 0],
      [-0.00591, 0],
      [-0.00582, 0],
      [-0.02171, 2],
      [-0.0059, 0],
      [-0.00553, 0],
      [-0.00564, 0],
      [-0.00594, 0],
      [-0.00563, 0],
      [-0.00562, 0],
      [-0.02147, 2],
      [-0.00584, 0],
      [-0.00573, 0],
      [-0.02141, 2],
      [-0.02211, 3],
      [-0.00557, 0],
      [-0.00583, 0],
      [-0.0059, 0],
      [-0.00574, 0],
      [-0.00553, 0],
      [-0.02151, 3],
      [-0.02159, 3],
      [-0.02137, 3],
      [-0.00585, 0],
      [-0.00554, 0]
    ],
    "red_o_points": [],
    "y_categories": ["N", "NOT APPLICABLE", "Y", "nan"],
    "blue_o_points": [],
    "blue_x_points": [
      [-0.00534, 0],
      [-0.00546, 0],
      [-0.00531, 0],
      [-0.00568, 0],
      [0.04256, 1],
      [0.041, 1],
      [0.04008, 1],
      [0.0407, 1],
      [-0.00574, 0],
      [0.04206, 1],
      [-0.00551, 0],
      [0.04192, 1],
      [0.04048, 1],
      [0.04284, 1],
      [-0.00552, 0]
    ]
  },
  "QS_mulGraftRoot[T1]": {
    "red_x_points": [[0.0, 2], [-7e-5, 0], [0.0, 2], [2e-5, 1], [0.0, 2]],
    "red_o_points": [],
    "y_categories": ["N", "NOT APPLICABLE", "nan"],
    "blue_o_points": [],
    "blue_x_points": [[0.0, 2], [2e-5, 1], [0.0, 2]]
  },
  "QA_yonInjUnconscio": {
    "red_x_points": [
      [-0.01143, 1],
      [-0.01135, 1],
      [-0.00179, 2],
      [-0.00231, 2],
      [-0.00227, 2],
      [-0.01218, 1],
      [-0.00218, 2],
      [-0.00272, 2],
      [-0.0023, 2],
      [-0.0124, 1],
      [-0.01181, 1],
      [-0.01271, 1],
      [-0.0029, 2],
      [-0.00239, 2],
      [-0.01027, 1],
      [-0.0115, 1],
      [-0.01138, 1],
      [-0.00935, 1],
      [-0.01013, 1],
      [-0.01162, 1],
      [-0.00292, 2],
      [-0.00234, 2],
      [-0.01298, 1],
      [-0.01188, 1],
      [-0.0031, 2],
      [-0.00234, 2],
      [-0.00275, 2],
      [-0.01149, 1],
      [-0.00291, 2]
    ],
    "red_o_points": [],
    "y_categories": ["N", "Y", "nan"],
    "blue_o_points": [],
    "blue_x_points": [
      [-0.00128, 2],
      [-0.00189, 2],
      [0.04513, 0],
      [-0.00121, 2],
      [-0.00821, 1],
      [-0.00826, 1],
      [0.03246, 0],
      [0.03805, 0],
      [-0.0018, 2],
      [0.03972, 0],
      [0.04298, 0],
      [-0.00184, 2],
      [-0.00861, 1],
      [-0.00185, 2],
      [0.04432, 0]
    ]
  },
  "QS_mulLysisTrunk[Upper]": {
    "red_x_points": [
      [-0.00081, 3],
      [-0.00451, 0],
      [-0.00294, 0],
      [-0.00275, 0],
      [-0.00298, 0],
      [-0.01159, 2],
      [-0.00321, 0],
      [-0.00118, 3],
      [-0.00319, 0],
      [-0.00277, 0],
      [-0.00106, 3],
      [-0.00326, 0],
      [-0.00101, 3],
      [-0.00421, 0],
      [-0.0111, 2],
      [-0.00104, 3],
      [-0.00081, 3],
      [-0.00088, 3],
      [-0.00292, 0],
      [-0.00065, 3],
      [-0.00093, 3],
      [-0.00095, 3],
      [-0.00316, 0],
      [-0.00271, 0],
      [-0.00098, 3],
      [0.01268, 1],
      [-0.00094, 3],
      [-0.01152, 2],
      [-0.00099, 3]
    ],
    "red_o_points": [],
    "y_categories": ["N", "NOT APPLICABLE", "Y", "nan"],
    "blue_o_points": [],
    "blue_x_points": [
      [0.02105, 1],
      [-0.00062, 3],
      [-0.00146, 0],
      [-0.00152, 0],
      [-0.00034, 3],
      [0.01718, 1],
      [0.01454, 1],
      [-0.0022, 0],
      [-0.00063, 3],
      [-0.00045, 3],
      [-0.00176, 0],
      [0.01526, 1],
      [-0.0007, 3],
      [0.01459, 1],
      [-0.00055, 3]
    ]
  },
  "QS_mulGraftNerve[Ac]": {
    "red_x_points": [
      [-3e-5, 2],
      [-0.00052, 0],
      [-0.00032, 0],
      [-0.00029, 0],
      [-0.00036, 0],
      [-0.00037, 0],
      [-0.00028, 0],
      [-4e-5, 2],
      [-0.00028, 0],
      [-0.00032, 0],
      [-1e-5, 2],
      [-0.00037, 0],
      [-0.00017, 2],
      [-0.00053, 0],
      [-0.00036, 0],
      [-2e-5, 2],
      [-3e-5, 2],
      [-4e-5, 2],
      [-0.00026, 0],
      [-1e-5, 2],
      [-9e-5, 2],
      [-3e-5, 2],
      [-0.00031, 0],
      [-0.0003, 0],
      [-0.00011, 2],
      [0.00065, 1],
      [-0.00011, 2],
      [-0.00034, 0],
      [-0.00011, 2]
    ],
    "red_o_points": [],
    "y_categories": ["N", "NOT APPLICABLE", "nan"],
    "blue_o_points": [],
    "blue_x_points": [
      [0.00165, 1],
      [-5e-5, 2],
      [-0.00028, 0],
      [-0.00023, 0],
      [-5e-5, 2],
      [0.00141, 1],
      [0.00088, 1],
      [-0.00014, 0],
      [-1e-5, 2],
      [-4e-5, 2],
      [-0.00016, 0],
      [0.00128, 1],
      [-0.0, 2],
      [0.0011, 1],
      [1e-5, 2]
    ]
  },
  "QS_mulGraftTrunk[LowerTrunk]": {
    "red_x_points": [
      [0.0, 2],
      [-4e-5, 0],
      [-4e-5, 0],
      [-4e-5, 0],
      [0.0, 2],
      [0.0, 2],
      [-4e-5, 0],
      [0.0, 2]
    ],
    "red_o_points": [],
    "y_categories": ["N", "NOT APPLICABLE", "nan"],
    "blue_o_points": [],
    "blue_x_points": [[0.00016, 1], [0.0, 2]]
  },
  "QS_mulNeuromadSite[C8]": {
    "red_x_points": [
      [-0.00029, 2],
      [-0.00175, 0],
      [-0.00097, 0],
      [-0.00119, 0],
      [-0.00111, 0],
      [-0.001, 0],
      [-0.00116, 0],
      [-0.00024, 2],
      [-0.00119, 0],
      [-0.00111, 0],
      [-0.00013, 2],
      [-0.00138, 0],
      [-0.00016, 2],
      [-0.00187, 0],
      [-0.00174, 0],
      [-0.00014, 2],
      [-0.00013, 2],
      [-0.00016, 2],
      [-0.00086, 0],
      [-6e-5, 2],
      [-0.00022, 2],
      [-0.00023, 2],
      [-0.0011, 0],
      [-0.00116, 0],
      [-0.00024, 2],
      [0.00362, 1],
      [-0.00028, 2],
      [-0.00092, 0],
      [-0.00028, 2]
    ],
    "red_o_points": [],
    "y_categories": ["N", "NOT APPLICABLE", "nan"],
    "blue_o_points": [],
    "blue_x_points": [
      [0.00548, 1],
      [-0.00021, 2],
      [-0.00076, 0],
      [-0.00098, 0],
      [0.0001, 2],
      [0.00507, 1],
      [0.0029, 1],
      [-0.00083, 0],
      [-0.00014, 2],
      [-0.0, 2],
      [-0.00052, 0],
      [0.00397, 1],
      [-0.00015, 2],
      [0.00358, 1],
      [-7e-5, 2]
    ]
  },
  "QS_mulGraftNerve[Ph]": {
    "red_x_points": [
      [-0.00011, 2],
      [-0.00026, 0],
      [-0.0002, 0],
      [-0.0003, 0],
      [-0.00025, 0],
      [-0.00024, 0],
      [-0.00024, 0],
      [-0.00011, 2],
      [-0.00033, 0],
      [-0.00032, 0],
      [-7e-5, 2],
      [-0.00023, 0],
      [-6e-5, 2],
      [-0.00026, 0],
      [-0.00015, 0],
      [-0.0001, 2],
      [-3e-5, 2],
      [-0.00011, 2],
      [-0.00019, 0],
      [-5e-5, 2],
      [-5e-5, 2],
      [-9e-5, 2],
      [-0.00019, 0],
      [-0.00016, 0],
      [-0.0001, 2],
      [0.00035, 1],
      [-0.00012, 2],
      [-0.00022, 0],
      [-3e-5, 2]
    ],
    "red_o_points": [],
    "y_categories": ["N", "NOT APPLICABLE", "nan"],
    "blue_o_points": [],
    "blue_x_points": [
      [0.00138, 1],
      [-0.00011, 2],
      [-0.00015, 0],
      [-0.00027, 0],
      [-0.0, 2],
      [0.00104, 1],
      [0.00084, 1],
      [-0.00017, 0],
      [-4e-5, 2],
      [-1e-5, 2],
      [-6e-5, 0],
      [0.00107, 1],
      [-7e-5, 2],
      [0.00082, 1],
      [-5e-5, 2]
    ]
  },
  "QS_mulTransfSite[AcSsPA]": {
    "red_x_points": [
      [-0.00026, 3],
      [-0.00155, 0],
      [-0.00119, 0],
      [-0.00118, 0],
      [-0.00114, 0],
      [-0.0012, 0],
      [-0.00122, 0],
      [-0.00029, 3],
      [-0.00099, 0],
      [-0.001, 0],
      [-0.0005, 3],
      [-0.00117, 0],
      [-0.00027, 3],
      [-0.00159, 0],
      [-0.00432, 2],
      [-0.00031, 3],
      [-0.00014, 3],
      [-0.00044, 3],
      [-0.00099, 0],
      [-0.00015, 3],
      [-0.00026, 3],
      [-0.0002, 3],
      [-0.00121, 0],
      [-0.00112, 0],
      [-0.00036, 3],
      [0.00357, 1],
      [-0.0003, 3],
      [-0.00105, 0],
      [-0.00025, 3]
    ],
    "red_o_points": [],
    "y_categories": ["N", "NOT APPLICABLE", "Y", "nan"],
    "blue_o_points": [],
    "blue_x_points": [
      [0.00519, 1],
      [-0.00017, 3],
      [-0.00072, 0],
      [-0.00077, 0],
      [-7e-5, 3],
      [0.00567, 1],
      [0.00411, 1],
      [-0.00084, 0],
      [-0.00017, 3],
      [-4e-5, 3],
      [-0.0006, 0],
      [0.00462, 1],
      [-0.00021, 3],
      [0.00522, 1],
      [-0.00013, 3]
    ]
  },
  "QA_lstPexMuscstrength[ScapulaElev]": {
    "red_x_points": [
      [-0.00016, 0],
      [-0.00033, 2],
      [-0.00074, 2],
      [-0.00046, 2],
      [-0.00177, 1],
      [0.00025, 0],
      [-0.00056, 2],
      [-0.00333, 1],
      [0.00096, 0],
      [-0.0003, 2],
      [-0.00024, 0],
      [-0.00031, 2],
      [-0.00035, 2],
      [-0.00068, 2],
      [9e-5, 0],
      [-0.00016, 0],
      [-0.00023, 0],
      [-0.00019, 0],
      [-0.00017, 2],
      [0.00021, 2],
      [-0.00027, 2],
      [-0.00028, 2],
      [0.0005, 0],
      [0.00049, 0],
      [-9e-5, 2],
      [-0.00037, 2],
      [-0.00013, 2],
      [-0.00121, 1],
      [-0.00036, 2]
    ],
    "red_o_points": [],
    "y_categories": ["GREATER THAN OR EQUALS TO 3", "LESS THAN 3", "nan"],
    "blue_o_points": [],
    "blue_x_points": [
      [-0.00024, 2],
      [7e-5, 2],
      [0.00066, 0],
      [0.00224, 0],
      [8e-5, 2],
      [-0.00014, 2],
      [0.00321, 0],
      [0.00013, 2],
      [0.00101, 0],
      [0.00109, 0],
      [0.0003, 2],
      [0.00145, 0],
      [0.00032, 2]
    ]
  },
  "QA_lstPexMuscstrength[ScapulaAbducSuprot]": {
    "red_x_points": [
      [0.00123, 0],
      [-0.00115, 2],
      [-0.00715, 1],
      [-0.00043, 2],
      [-0.00971, 1],
      [-0.00926, 1],
      [-0.00824, 1],
      [-0.00576, 1],
      [0.01028, 0],
      [-0.01099, 1],
      [-0.00651, 1],
      [-0.00178, 2],
      [-0.00052, 2],
      [-0.00195, 2],
      [-0.00052, 2],
      [0.00338, 0],
      [-0.00621, 1],
      [0.00241, 0],
      [-0.00739, 1],
      [-0.00155, 2],
      [-0.00068, 2],
      [-0.00099, 2],
      [-0.01166, 1],
      [0.00905, 0],
      [-0.00055, 2],
      [7e-5, 2],
      [0.00298, 0],
      [-0.00585, 1],
      [-0.00107, 2]
    ],
    "red_o_points": [],
    "y_categories": ["GREATER THAN OR EQUALS TO 3", "LESS THAN 3", "nan"],
    "blue_o_points": [],
    "blue_x_points": [
      [0.00015, 2],
      [0.00768, 0],
      [0.01397, 0],
      [0.01593, 0],
      [0.0004, 2],
      [0.00031, 2],
      [0.00325, 0],
      [0.00072, 2],
      [0.0024, 2],
      [0.00068, 2],
      [0.01262, 0],
      [0.00355, 0],
      [0.0041, 0],
      [0.00011, 2],
      [0.00464, 1]
    ]
  },
  "participant_code": {
    "red_x_points": [
      [-0.02653, 1],
      [-0.02687, 2],
      [-0.02681, 3],
      [-0.02619, 4],
      [-0.02674, 5],
      [-0.02687, 8],
      [-0.02715, 9],
      [-0.02578, 10],
      [-0.02633, 11],
      [-0.02667, 13],
      [-0.02591, 14],
      [-0.02564, 18],
      [-0.02653, 19],
      [-0.02619, 20],
      [-0.02667, 23],
      [-0.02653, 26],
      [-0.02708, 28],
      [-0.02633, 29],
      [-0.02598, 30],
      [-0.02633, 31],
      [-0.0255, 32],
      [-0.02516, 34],
      [-0.02612, 36],
      [-0.02578, 38],
      [-0.02612, 39],
      [-0.02694, 40],
      [-0.02708, 41],
      [-0.02756, 42],
      [-0.02537, 43]
    ],
    "red_o_points": [],
    "y_categories": [
      "P16554",
      "P18297",
      "P19283",
      "P19287",
      "P23172",
      "P23391",
      "P30595",
      "P31645",
      "P31691",
      "P34778",
      "P35046",
      "P36328",
      "P43633",
      "P4544",
      "P46417",
      "P48965",
      "P53068",
      "P5497",
      "P58556",
      "P59529",
      "P62483",
      "P64658",
      "P65202",
      "P66816",
      "P6751",
      "P7408",
      "P75566",
      "P76226",
      "P79971",
      "P82621",
      "P82990",
      "P84549",
      "P84932",
      "P85825",
      "P86989",
      "P8770",
      "P87791",
      "P90550",
      "P93159",
      "P94969",
      "P96710",
      "P97130",
      "P9744",
      "P98500",
      "nan"
    ],
    "blue_o_points": [],
    "blue_x_points": [
      [0.05374, 0],
      [0.05059, 6],
      [0.05125, 7],
      [0.05033, 12],
      [0.05164, 15],
      [0.05112, 16],
      [0.04967, 17],
      [0.05138, 21],
      [0.05072, 22],
      [0.0502, 24],
      [0.05112, 25],
      [0.04914, 27],
      [0.05177, 33],
      [0.05059, 35],
      [0.05151, 37]
    ]
  },
  "QS_mulNeuromadSite[T2]": {
    "red_x_points": [
      [-0.00017, 2],
      [-0.00174, 0],
      [-0.00128, 0],
      [-0.00114, 0],
      [-0.00127, 0],
      [-0.00115, 0],
      [-0.00134, 0],
      [-0.00031, 2],
      [-0.00148, 0],
      [-0.00129, 0],
      [-0.00025, 2],
      [-0.00121, 0],
      [-0.00022, 2],
      [-0.0016, 0],
      [-0.00173, 0],
      [-0.00028, 2],
      [-0.00012, 2],
      [-0.00027, 2],
      [-0.00115, 0],
      [-0.00037, 2],
      [-0.00023, 2],
      [-0.00033, 2],
      [-0.00121, 0],
      [-0.00113, 0],
      [-0.00029, 2],
      [0.00356, 1],
      [-0.00024, 2],
      [-0.00119, 0],
      [-0.00025, 2]
    ],
    "red_o_points": [],
    "y_categories": ["N", "NOT APPLICABLE", "nan"],
    "blue_o_points": [],
    "blue_x_points": [
      [0.00664, 1],
      [-0.00016, 2],
      [-0.00092, 0],
      [-0.00091, 0],
      [-1e-5, 2],
      [0.00561, 1],
      [0.00368, 1],
      [-0.00093, 0],
      [-0.00023, 2],
      [-5e-5, 2],
      [-0.00073, 0],
      [0.00411, 1],
      [-0.00013, 2],
      [0.00385, 1],
      [-0.00014, 2]
    ]
  },
  "QA_yonInjTbi": {
    "red_x_points": [
      [0.00725, 0],
      [-0.00239, 2],
      [-0.00165, 0],
      [-0.00177, 0],
      [-0.0013, 2],
      [0.00058, 1],
      [-0.00157, 0],
      [-0.01028, 2],
      [-0.00346, 2],
      [0.00069, 1],
      [-0.00474, 1],
      [-0.00426, 0],
      [0.00811, 0],
      [0.00063, 1],
      [-9e-5, 1],
      [-0.00509, 1],
      [-0.00469, 1],
      [-0.00521, 1],
      [0.00058, 1],
      [-0.00621, 1],
      [0.00716, 0],
      [-0.00621, 1],
      [0.00115, 1],
      [0.00095, 1],
      [-0.00546, 1],
      [-0.00078, 2],
      [-0.00931, 2],
      [0.00026, 1],
      [-0.00684, 1]
    ],
    "red_o_points": [],
    "y_categories": ["N", "Y", "nan"],
    "blue_o_points": [],
    "blue_x_points": [
      [0.0008, 0],
      [-0.00223, 1],
      [0.00207, 1],
      [0.00234, 1],
      [0.01243, 0],
      [-0.00011, 1],
      [4e-5, 1],
      [0.00321, 1],
      [0.01268, 0],
      [0.01083, 0],
      [0.00195, 1],
      [-3e-5, 2],
      [-0.00398, 1],
      [0.00012, 2],
      [0.01381, 0]
    ]
  },
  "QA_mulInjOrthesisType[ArmSling]": {
    "red_x_points": [
      [-0.00633, 2],
      [-0.00622, 2],
      [-0.00585, 2],
      [-0.00614, 2],
      [-0.00561, 2],
      [-0.00617, 2],
      [-0.00601, 2],
      [-0.00617, 2],
      [-0.00598, 2],
      [-0.00579, 2],
      [-0.00597, 2],
      [-0.00593, 2],
      [-0.00605, 2],
      [-0.00614, 2],
      [-0.01856, 0],
      [-0.00603, 2],
      [-0.00623, 2],
      [-0.01848, 0],
      [-0.01813, 3],
      [-0.00609, 2],
      [-0.00551, 2],
      [-0.00596, 2],
      [-0.00607, 2],
      [-0.00612, 2],
      [-0.01808, 3],
      [-0.01917, 3],
      [-0.01874, 3],
      [-0.00587, 2],
      [-0.0064, 2]
    ],
    "red_o_points": [],
    "y_categories": ["N", "NOT APPLICABLE", "Y", "nan"],
    "blue_o_points": [],
    "blue_x_points": [
      [-0.00582, 2],
      [-0.0059, 2],
      [-0.00557, 2],
      [-0.00561, 2],
      [0.03752, 1],
      [0.03694, 1],
      [0.03574, 1],
      [0.03672, 1],
      [-0.00567, 2],
      [0.03374, 1],
      [-0.00569, 2],
      [0.03517, 1],
      [0.03721, 1],
      [0.03647, 1],
      [-0.00548, 2]
    ]
  },
  "QS_mulGraftNerve[Ul]": {
    "red_x_points": [
      [1e-5, 2],
      [-0.00015, 0],
      [-0.00015, 0],
      [-4e-5, 0],
      [-0.00015, 0],
      [-0.00014, 0],
      [-0.00014, 0],
      [1e-5, 2],
      [-0.0001, 0],
      [-0.0002, 0],
      [-0.0, 2],
      [-8e-5, 0],
      [-1e-5, 2],
      [-0.00023, 0],
      [-0.00022, 0],
      [-1e-5, 2],
      [0.0, 2],
      [0.0, 2],
      [-0.00014, 0],
      [-2e-5, 2],
      [-0.0, 2],
      [-2e-5, 2],
      [-0.00015, 0],
      [-0.00011, 0],
      [1e-5, 2],
      [0.00033, 1],
      [-0.0, 2],
      [-0.00012, 0],
      [-1e-5, 2]
    ],
    "red_o_points": [],
    "y_categories": ["N", "NOT APPLICABLE", "nan"],
    "blue_o_points": [],
    "blue_x_points": [
      [0.00054, 1],
      [-0.0, 2],
      [-0.00011, 0],
      [-0.00012, 0],
      [1e-5, 2],
      [0.00047, 1],
      [0.00041, 1],
      [-0.0001, 0],
      [0.0, 2],
      [0.0, 2],
      [-4e-5, 0],
      [0.00041, 1],
      [0.0, 2],
      [0.00041, 1],
      [-2e-5, 2]
    ]
  },
  "QS_mulGraftNerve[Ssr]": {
    "red_x_points": [
      [1e-5, 2],
      [-3e-5, 0],
      [-3e-5, 0],
      [-3e-5, 0],
      [-3e-5, 0],
      [-3e-5, 0],
      [-3e-5, 0],
      [-3e-5, 0],
      [1e-5, 2],
      [-3e-5, 0],
      [1e-5, 2],
      [-3e-5, 0],
      [2e-5, 2],
      [2e-5, 2],
      [1e-5, 2],
      [-1e-5, 2],
      [-3e-5, 0],
      [-3e-5, 0],
      [1e-5, 2]
    ],
    "red_o_points": [],
    "y_categories": ["N", "NOT APPLICABLE", "nan"],
    "blue_o_points": [],
    "blue_x_points": [
      [0.0003, 1],
      [2e-5, 2],
      [-3e-5, 0],
      [-1e-5, 0],
      [1e-5, 2],
      [-1e-5, 0],
      [1e-5, 2]
    ]
  },
  "QS_mulGraftLevel[Nerve]": {
    "red_x_points": [[2e-5, 2], [-0.00011, 0], [2e-5, 1]],
    "red_o_points": [],
    "y_categories": ["N", "NOT APPLICABLE", "nan"],
    "blue_o_points": [],
    "blue_x_points": [[2e-5, 1], [2e-5, 2], [2e-5, 1], [2e-5, 2]]
  },
  "QA_lstPexPalle[Elbow]": {
    "red_x_points": [
      [-0.00068, 4],
      [-0.00296, 4],
      [-0.00179, 4],
      [-0.00138, 3],
      [-0.00299, 4],
      [-0.00177, 3],
      [-0.00268, 4],
      [-0.00041, 4],
      [-0.00366, 4],
      [-0.00221, 3],
      [-0.00163, 1],
      [-0.00378, 4],
      [-0.00055, 4],
      [-0.00334, 4],
      [-0.00187, 4],
      [-3e-5, 3],
      [-0.00721, 0],
      [0.00026, 3],
      [-0.00669, 2],
      [0.00031, 3],
      [-0.00039, 4],
      [-0.00042, 4],
      [-0.00371, 4],
      [-0.00406, 4],
      [-0.00031, 4],
      [-0.02221, 3],
      [-0.00052, 4],
      [-0.00638, 0],
      [-0.00055, 4]
    ],
    "red_o_points": [],
    "y_categories": ["ABS", "HYPO", "NAIA", "PT", "nan"],
    "blue_o_points": [],
    "blue_x_points": [
      [0.00372, 4],
      [0.00014, 4],
      [0.00345, 3],
      [0.03119, 1],
      [-0.00018, 4],
      [0.00391, 4],
      [0.00865, 1],
      [-0.00247, 4],
      [0.00017, 4],
      [0.00011, 4],
      [0.0221, 1],
      [0.00364, 4],
      [0.00164, 3],
      [0.00408, 4],
      [0.00346, 3]
    ]
  },
  "QS_mulGraftNerve[MCA]": {
    "red_x_points": [
      [-1e-5, 2],
      [-0.00016, 0],
      [-4e-5, 0],
      [-8e-5, 0],
      [-6e-5, 0],
      [-9e-5, 0],
      [-0.00012, 0],
      [-2e-5, 2],
      [-0.00013, 0],
      [-0.00013, 0],
      [-0.0, 2],
      [-8e-5, 0],
      [-2e-5, 2],
      [-0.00011, 0],
      [-0.00015, 0],
      [-1e-5, 2],
      [-2e-5, 2],
      [-2e-5, 2],
      [-8e-5, 0],
      [-2e-5, 2],
      [-2e-5, 2],
      [-0.0, 2],
      [-9e-5, 0],
      [-8e-5, 0],
      [-2e-5, 2],
      [0.00035, 1],
      [-1e-5, 2],
      [-0.0001, 0],
      [-2e-5, 2]
    ],
    "red_o_points": [],
    "y_categories": ["N", "NOT APPLICABLE", "nan"],
    "blue_o_points": [],
    "blue_x_points": [
      [0.00067, 1],
      [-1e-5, 2],
      [-4e-5, 0],
      [-9e-5, 0],
      [-1e-5, 2],
      [0.00035, 1],
      [0.00019, 1],
      [-8e-5, 0],
      [-1e-5, 2],
      [-2e-5, 2],
      [-2e-5, 0],
      [0.00019, 1],
      [-2e-5, 2],
      [0.00028, 1],
      [-1e-5, 2]
    ]
  },
  "QA_lstPexInspectio[Swelling]": {
    "red_x_points": [
      [0.00132, 1],
      [-0.00244, 1],
      [0.00152, 0],
      [-0.00194, 1],
      [-0.00032, 2],
      [0.00162, 0],
      [-0.00232, 1],
      [0.00188, 1],
      [-0.00612, 1],
      [-0.0058, 1],
      [-0.00706, 2],
      [-0.00428, 1],
      [-0.00511, 0],
      [-0.0044, 1],
      [-0.00088, 1],
      [-0.00401, 0],
      [-0.00769, 2],
      [0.00177, 1],
      [-0.00234, 1],
      [0.0016, 1],
      [-0.0053, 0],
      [0.00205, 1],
      [-0.00485, 1],
      [0.00364, 0],
      [0.00188, 1],
      [-0.00669, 0],
      [-0.00918, 2],
      [0.00021, 0],
      [0.00241, 1]
    ],
    "red_o_points": [],
    "y_categories": ["ABS", "NAIA", "PT", "nan"],
    "blue_o_points": [],
    "blue_x_points": [
      [0.00321, 1],
      [0.00362, 1],
      [0.00866, 0],
      [0.01086, 0],
      [0.00493, 1],
      [0.00249, 1],
      [9e-5, 0],
      [-0.00221, 1],
      [0.00329, 0],
      [0.00452, 1],
      [0.01371, 2],
      [0.00185, 1],
      [0.00285, 1],
      [-0.0008, 0],
      [0.00377, 1]
    ]
  },
  "QA_lstPexInspectio[SurgicalScar]": {
    "red_x_points": [
      [-0.00308, 1],
      [-0.00418, 1],
      [-0.00616, 0],
      [-0.00428, 1],
      [-0.00586, 1],
      [-0.00909, 0],
      [-0.00502, 1],
      [-0.00315, 1],
      [-0.0081, 1],
      [-0.00808, 1],
      [-0.00738, 0],
      [-0.00657, 1],
      [-0.00311, 2],
      [-0.00729, 1],
      [-0.00429, 0],
      [0.00427, 2],
      [0.00375, 2],
      [-0.00671, 1],
      [-0.00376, 1],
      [-0.00461, 1],
      [-0.00261, 2],
      [-0.00361, 1],
      [-0.00757, 1],
      [0.01141, 2],
      [-0.00316, 1],
      [-0.00368, 1],
      [-0.00176, 1],
      [0.00568, 2],
      [-0.00313, 1]
    ],
    "red_o_points": [],
    "y_categories": ["ABS", "NAIA", "PT", "nan"],
    "blue_o_points": [],
    "blue_x_points": [
      [-0.00079, 1],
      [0.01112, 2],
      [0.0208, 2],
      [0.02462, 2],
      [0.00126, 1],
      [-0.00012, 1],
      [0.00082, 0],
      [-0.00427, 1],
      [0.00405, 1],
      [0.00185, 1],
      [0.01836, 2],
      [-0.00043, 1],
      [0.01021, 2],
      [0.00314, 0],
      [0.01051, 2]
    ]
  },
  "QA_intPexWristFlex": {
    "red_x_points": [
      [-0.00019, 2],
      [-0.00069, 2],
      [-0.00051, 2],
      [-0.00061, 2],
      [-0.00072, 2],
      [-0.00066, 0],
      [-0.00075, 2],
      [0.00029, 0],
      [-0.0011, 2],
      [-0.00092, 2],
      [-0.00059, 0],
      [-0.00116, 2],
      [-0.00022, 2],
      [-0.00071, 2],
      [-0.0004, 2],
      [-0.00024, 0],
      [-0.00022, 0],
      [-0.00025, 0],
      [-0.00011, 0],
      [-0.00011, 2],
      [-0.00013, 2],
      [-0.00033, 2],
      [-0.00113, 2],
      [-0.00062, 2],
      [-0.00017, 2],
      [-0.019, 1],
      [-0.00322, 1],
      [-7e-5, 0],
      [-0.00019, 2]
    ],
    "red_o_points": [],
    "y_categories": ["GREATER THAN OR EQUALS TO 60", "LESS THAN 60", "nan"],
    "blue_o_points": [],
    "blue_x_points": [
      [0.00347, 2],
      [0.00262, 0],
      [0.00033, 0],
      [-0.00064, 2],
      [1e-5, 2],
      [0.00344, 2],
      [0.00486, 0],
      [-0.00063, 2],
      [6e-5, 2],
      [0.00012, 2],
      [0.01249, 1],
      [0.00344, 2],
      [0.00035, 2],
      [0.00352, 2],
      [0.0013, 0]
    ]
  },
  "QS_mulGraftNerve[Me]": {
    "red_x_points": [
      [-5e-5, 2],
      [-0.00023, 0],
      [-0.00012, 0],
      [-0.00022, 0],
      [-0.00024, 0],
      [-0.00018, 0],
      [-0.0001, 0],
      [-7e-5, 2],
      [-0.00019, 0],
      [-0.00022, 0],
      [-4e-5, 2],
      [-0.0002, 0],
      [-7e-5, 2],
      [-0.0002, 0],
      [-0.00012, 0],
      [-6e-5, 2],
      [-6e-5, 2],
      [-4e-5, 2],
      [-0.00019, 0],
      [-4e-5, 2],
      [-7e-5, 2],
      [-6e-5, 2],
      [-0.00025, 0],
      [-0.00025, 0],
      [-5e-5, 2],
      [0.00064, 1],
      [-5e-5, 2],
      [-0.00023, 0],
      [-6e-5, 2]
    ],
    "red_o_points": [],
    "y_categories": ["N", "NOT APPLICABLE", "nan"],
    "blue_o_points": [],
    "blue_x_points": [
      [0.00097, 1],
      [-4e-5, 2],
      [-0.00022, 0],
      [-0.00022, 0],
      [-5e-5, 2],
      [0.00091, 1],
      [0.00082, 1],
      [-0.00015, 0],
      [-5e-5, 2],
      [-5e-5, 2],
      [-0.00016, 0],
      [0.00091, 1],
      [-5e-5, 2],
      [0.00042, 1],
      [-2e-5, 2]
    ]
  },
  "QS_mulBpsurgeryType[Lysis]": {
    "red_x_points": [
      [-0.00113, 3],
      [-0.0042, 0],
      [-0.01625, 2],
      [-0.01437, 2],
      [-0.00282, 0],
      [-0.01603, 2],
      [-0.00293, 0],
      [-0.00112, 3],
      [-0.00294, 0],
      [-0.00267, 0],
      [-0.00118, 3],
      [-0.00304, 0],
      [-0.00145, 3],
      [-0.00387, 0],
      [-0.01493, 2],
      [-0.00117, 3],
      [-0.00107, 3],
      [-0.0012, 3],
      [-0.0026, 0],
      [-0.00115, 3],
      [-0.00123, 3],
      [-0.00135, 3],
      [-0.00324, 0],
      [-0.00307, 0],
      [-0.00153, 3],
      [0.01929, 1],
      [-0.0015, 3],
      [-0.01479, 2],
      [-0.00142, 3]
    ],
    "red_o_points": [],
    "y_categories": ["N", "NOT APPLICABLE", "Y", "nan"],
    "blue_o_points": [],
    "blue_x_points": [
      [0.02754, 1],
      [-0.00077, 3],
      [-0.00125, 0],
      [-0.00116, 0],
      [-0.00044, 3],
      [0.02381, 1],
      [0.01993, 1],
      [-0.00148, 0],
      [-0.00056, 3],
      [-0.00063, 3],
      [-0.00129, 0],
      [0.02275, 1],
      [-0.00091, 3],
      [0.02048, 1],
      [-0.00107, 3]
    ]
  },
  "QS_mulLysisSite[Trunk]": {
    "red_x_points": [
      [-0.00051, 3],
      [-0.00432, 0],
      [-0.00311, 0],
      [-0.00292, 0],
      [-0.0034, 0],
      [-0.0119, 2],
      [-0.00317, 0],
      [-0.00076, 3],
      [-0.00324, 0],
      [-0.00316, 0],
      [-0.00067, 3],
      [-0.00362, 0],
      [-0.00094, 3],
      [-0.00396, 0],
      [-0.01041, 2],
      [-0.00063, 3],
      [-0.00054, 3],
      [-0.0007, 3],
      [-0.00331, 0],
      [-0.00052, 3],
      [-0.00079, 3],
      [-0.00075, 3],
      [-0.00323, 0],
      [-0.00297, 0],
      [-0.00089, 3],
      [0.01333, 1],
      [-0.00092, 3],
      [-0.01024, 2],
      [-0.00079, 3]
    ],
    "red_o_points": [],
    "y_categories": ["N", "NOT APPLICABLE", "Y", "nan"],
    "blue_o_points": [],
    "blue_x_points": [
      [0.01898, 1],
      [-0.00041, 3],
      [-0.00179, 0],
      [-0.00163, 0],
      [-0.00012, 3],
      [0.01711, 1],
      [0.01366, 1],
      [-0.00209, 0],
      [-0.00035, 3],
      [-0.00029, 3],
      [-0.00177, 0],
      [0.01435, 1],
      [-0.00045, 3],
      [0.01426, 1],
      [-0.00042, 3]
    ]
  },
  "QS_mulGraftTrunk[UpperTrunk]": {
    "red_x_points": [
      [-0.00028, 3],
      [-0.00253, 0],
      [-0.00179, 0],
      [-0.00223, 0],
      [-0.00221, 0],
      [-0.00178, 0],
      [-0.0019, 0],
      [-0.00052, 3],
      [-0.00222, 0],
      [-0.00173, 0],
      [-0.00031, 3],
      [-0.00189, 0],
      [-0.00052, 3],
      [-0.00724, 2],
      [-0.00215, 0],
      [-0.00037, 3],
      [-0.00026, 3],
      [-0.00031, 3],
      [-0.00169, 0],
      [-0.00031, 3],
      [-0.00044, 3],
      [-0.00037, 3],
      [-0.00192, 0],
      [-0.00192, 0],
      [-0.00048, 3],
      [0.00551, 1],
      [-0.00036, 3],
      [-0.0017, 0],
      [-0.00045, 3]
    ],
    "red_o_points": [],
    "y_categories": ["N", "NOT APPLICABLE", "Y", "nan"],
    "blue_o_points": [],
    "blue_x_points": [
      [0.01089, 1],
      [-0.00031, 3],
      [-0.00105, 0],
      [-0.00127, 0],
      [-1e-5, 3],
      [0.00829, 1],
      [0.00592, 1],
      [-0.00116, 0],
      [-0.00043, 3],
      [-8e-5, 3],
      [-0.0011, 0],
      [0.00771, 1],
      [-0.00017, 3],
      [0.00734, 1],
      [-0.00019, 3]
    ]
  },
  "QS_mulTransfSite[PhMc]": {
    "red_x_points": [
      [-0.0006, 3],
      [-0.00378, 0],
      [-0.00283, 0],
      [-0.00272, 0],
      [-0.0031, 0],
      [-0.00222, 0],
      [-0.00957, 2],
      [-0.00076, 3],
      [-0.00288, 0],
      [-0.00249, 0],
      [-0.00056, 3],
      [-0.00306, 0],
      [-0.0008, 3],
      [-0.00335, 0],
      [-0.00356, 0],
      [-0.00088, 3],
      [-0.00054, 3],
      [-0.00066, 3],
      [-0.0081, 2],
      [-0.00068, 3],
      [-0.00079, 3],
      [-0.00073, 3],
      [-0.00305, 0],
      [-0.00279, 0],
      [-0.00076, 3],
      [0.00909, 1],
      [-0.00068, 3],
      [-0.00237, 0],
      [-0.00083, 3]
    ],
    "red_o_points": [],
    "y_categories": ["N", "NOT APPLICABLE", "Y", "nan"],
    "blue_o_points": [],
    "blue_x_points": [
      [0.01701, 1],
      [-0.00036, 3],
      [-0.00153, 0],
      [-0.00191, 0],
      [-0.00025, 3],
      [0.01369, 1],
      [0.01155, 1],
      [-0.00208, 0],
      [-0.00054, 3],
      [-0.00026, 3],
      [-0.00182, 0],
      [0.01156, 1],
      [-0.00039, 3],
      [0.01191, 1],
      [-0.00052, 3]
    ]
  },
  "QS_mulLysisSite[Root]": {
    "red_x_points": [
      [-0.0002, 3],
      [-0.00272, 0],
      [-0.00707, 2],
      [-0.00171, 0],
      [-0.00209, 0],
      [-0.0017, 0],
      [-0.00209, 0],
      [-0.00027, 3],
      [-0.00211, 0],
      [-0.00181, 0],
      [-0.0003, 3],
      [-0.00221, 0],
      [-0.00029, 3],
      [-0.00244, 0],
      [-0.00247, 0],
      [-0.00058, 3],
      [-0.0003, 3],
      [-0.00041, 3],
      [-0.00196, 0],
      [-0.00034, 3],
      [-0.00033, 3],
      [-0.00031, 3],
      [-0.00232, 0],
      [-0.0018, 0],
      [-0.00042, 3],
      [0.00711, 1],
      [-0.00035, 3],
      [-0.0065, 2],
      [-0.00047, 3]
    ],
    "red_o_points": [],
    "y_categories": ["N", "NOT APPLICABLE", "Y", "nan"],
    "blue_o_points": [],
    "blue_x_points": [
      [0.01105, 1],
      [-7e-5, 3],
      [-0.00063, 0],
      [-0.00111, 0],
      [-3e-5, 3],
      [0.00855, 1],
      [0.00764, 1],
      [-0.00167, 0],
      [0.00018, 3],
      [-4e-5, 3],
      [-0.00112, 0],
      [0.00783, 1],
      [-0.00029, 3],
      [0.00841, 1],
      [-0.00024, 3]
    ]
  },
  "QA_lstPexInspectio[ShoulderSubdisloc]": {
    "red_x_points": [
      [-0.00265, 1],
      [-0.00386, 1],
      [0.00257, 0],
      [-0.00255, 1],
      [-0.00496, 1],
      [-0.00176, 2],
      [-0.00408, 1],
      [-0.00175, 1],
      [-0.0065, 1],
      [-0.00757, 1],
      [-0.00076, 2],
      [-0.00535, 1],
      [-0.00219, 1],
      [-0.00635, 1],
      [-0.00204, 1],
      [-0.00235, 2],
      [-0.00058, 2],
      [-0.00021, 1],
      [-0.00319, 1],
      [-0.00127, 1],
      [-0.00991, 0],
      [0.00297, 2],
      [-0.00144, 2],
      [-9e-5, 2],
      [-0.00124, 1],
      [-0.01056, 2],
      [-0.00148, 1],
      [-0.00046, 2],
      [-0.00311, 1]
    ],
    "red_o_points": [],
    "y_categories": ["ABS", "NAIA", "PT", "nan"],
    "blue_o_points": [],
    "blue_x_points": [
      [0.00378, 1],
      [0.0063, 2],
      [0.02524, 0],
      [0.00504, 2],
      [0.00099, 1],
      [0.00422, 1],
      [0.00376, 0],
      [-0.00271, 1],
      [0.00967, 2],
      [0.0006, 1],
      [0.02171, 0],
      [0.00235, 1],
      [0.00173, 1],
      [-0.00146, 2],
      [0.00149, 1]
    ]
  },
  "QA_yonPreTbi": {
    "red_x_points": [
      [-0.00092, 2],
      [-1e-5, 2],
      [-6e-5, 2],
      [-5e-5, 2],
      [-6e-5, 2],
      [-5e-5, 2],
      [-7e-5, 2],
      [-0.00078, 2],
      [-6e-5, 2],
      [-6e-5, 2],
      [-0.00099, 2],
      [-8e-5, 2],
      [-0.00082, 2],
      [-1e-5, 2],
      [-0.0, 2],
      [-0.01319, 1],
      [-0.00093, 2],
      [-0.00072, 2],
      [-5e-5, 2],
      [-0.00086, 2],
      [-0.00077, 2],
      [-0.00101, 2],
      [-8e-5, 2],
      [-6e-5, 2],
      [-0.00075, 2],
      [-0.0, 2],
      [-0.00058, 2],
      [-0.00011, 2],
      [-0.00102, 2]
    ],
    "red_o_points": [],
    "y_categories": ["N", "Y", "nan"],
    "blue_o_points": [],
    "blue_x_points": [
      [-1e-5, 2],
      [0.027, 0],
      [4e-5, 2],
      [-9e-5, 2],
      [-0.00053, 2],
      [-0.0, 2],
      [1e-5, 2],
      [-3e-5, 2],
      [-0.00072, 2],
      [-0.00034, 2],
      [3e-5, 2],
      [1e-5, 2],
      [-0.0004, 2],
      [-0.0, 2],
      [-0.0008, 2]
    ]
  },
  "QS_mulGraftLevel[Trunk]": {
    "red_x_points": [
      [-5e-5, 3],
      [-0.00163, 0],
      [-0.00137, 0],
      [-0.00108, 0],
      [-0.00135, 0],
      [-0.00084, 0],
      [-0.00139, 0],
      [-0.00019, 3],
      [-0.00137, 0],
      [-0.00119, 0],
      [-0.0002, 3],
      [-0.00138, 0],
      [-0.00025, 3],
      [-0.00618, 2],
      [-0.00182, 0],
      [-0.00026, 3],
      [-0.00013, 3],
      [-0.00032, 3],
      [-0.00095, 0],
      [-0.00016, 3],
      [-0.0002, 3],
      [-0.00021, 3],
      [-0.00144, 0],
      [-0.00127, 0],
      [-0.00021, 3],
      [0.00441, 1],
      [-0.00019, 3],
      [-0.001, 0],
      [-0.00015, 3]
    ],
    "red_o_points": [],
    "y_categories": ["N", "NOT APPLICABLE", "Y", "nan"],
    "blue_o_points": [],
    "blue_x_points": [
      [0.00742, 1],
      [-0.00011, 3],
      [-0.00058, 0],
      [-0.00032, 0],
      [4e-5, 3],
      [0.00519, 1],
      [0.00406, 1],
      [-0.00082, 0],
      [-6e-5, 3],
      [1e-5, 3],
      [-0.00063, 0],
      [0.00449, 1],
      [-0.0003, 3],
      [0.00419, 1],
      [-0.00021, 3]
    ]
  },
  "QS_mulNeuromadSite[C4]": {
    "red_x_points": [
      [3e-5, 2],
      [-0.0006, 0],
      [-0.00032, 0],
      [-0.0004, 0],
      [-0.00035, 0],
      [-0.00043, 0],
      [-0.00041, 0],
      [-0.00018, 2],
      [-0.0003, 0],
      [-0.00048, 0],
      [-6e-5, 2],
      [-0.00037, 0],
      [-0.00022, 2],
      [-0.00068, 0],
      [-0.00056, 0],
      [-8e-5, 2],
      [1e-5, 2],
      [-0.00011, 2],
      [-0.00041, 0],
      [-5e-5, 2],
      [-0.00012, 2],
      [-0.00014, 2],
      [-0.0005, 0],
      [-0.00032, 0],
      [-7e-5, 2],
      [0.00113, 1],
      [-0.0001, 2],
      [-0.0004, 0],
      [-0.00015, 2]
    ],
    "red_o_points": [],
    "y_categories": ["N", "NOT APPLICABLE", "nan"],
    "blue_o_points": [],
    "blue_x_points": [
      [0.0023, 1],
      [-5e-5, 2],
      [-0.00017, 0],
      [-1e-5, 0],
      [8e-5, 2],
      [0.00168, 1],
      [0.0012, 1],
      [-0.00032, 0],
      [-0.00011, 2],
      [2e-5, 2],
      [-0.00019, 0],
      [0.00108, 1],
      [-5e-5, 2],
      [0.00123, 1],
      [-5e-5, 2]
    ]
  },
  "QA_lstPexPain[C7]": {
    "red_x_points": [
      [-0.00176, 1],
      [-0.00411, 2],
      [-0.00261, 2],
      [-0.00136, 1],
      [-0.00499, 2],
      [-0.00303, 1],
      [-0.00215, 1],
      [-0.00544, 0],
      [-0.00433, 1],
      [0.00528, 0],
      [-0.00163, 1],
      [-0.00605, 2],
      [0.00158, 2],
      [-0.00504, 2],
      [-0.00236, 2],
      [-0.00542, 0],
      [-0.00144, 1],
      [-0.00578, 0],
      [-0.00369, 2],
      [-0.00456, 0],
      [0.00148, 2],
      [0.00165, 2],
      [-0.00639, 2],
      [-0.00661, 2],
      [-0.00419, 0],
      [-0.00305, 1],
      [-0.00083, 1],
      [-0.00126, 1],
      [-0.00151, 1]
    ],
    "red_o_points": [],
    "y_categories": ["NORM", "NPV", "nan"],
    "blue_o_points": [],
    "blue_x_points": [
      [0.00013, 1],
      [0.00512, 1],
      [0.01586, 0],
      [0.01917, 0],
      [0.00596, 2],
      [7e-5, 2],
      [7e-5, 1],
      [0.00111, 1],
      [0.00546, 2],
      [0.00524, 2],
      [0.01277, 0],
      [-0.00172, 0],
      [0.00301, 0],
      [0.00736, 1]
    ]
  },
  "QS_mulTransfSite[AcSsAA]": {
    "red_x_points": [
      [-0.00067, 3],
      [-0.00185, 2],
      [-0.00496, 0],
      [-0.00465, 0],
      [-0.00034, 2],
      [-0.005, 0],
      [-0.00421, 0],
      [-0.00062, 3],
      [-0.00536, 0],
      [-0.00582, 0],
      [-0.00043, 3],
      [-0.0044, 0],
      [-0.00061, 3],
      [-0.00151, 2],
      [-0.00391, 0],
      [-0.0009, 3],
      [-0.00027, 3],
      [-0.00086, 3],
      [-0.00071, 2],
      [-0.00047, 3],
      [-0.00067, 3],
      [-0.00061, 3],
      [-0.00453, 0],
      [-0.00026, 2],
      [-0.00066, 3],
      [0.00715, 1],
      [-0.0008, 3],
      [-0.00375, 0],
      [-0.00066, 3]
    ],
    "red_o_points": [],
    "y_categories": ["N", "NOT APPLICABLE", "Y", "nan"],
    "blue_o_points": [],
    "blue_x_points": [
      [0.01343, 1],
      [-0.00051, 3],
      [0.00471, 2],
      [0.00548, 2],
      [-7e-5, 3],
      [0.00918, 1],
      [0.00834, 1],
      [-0.00291, 0],
      [-0.00037, 3],
      [-0.00016, 3],
      [-0.00236, 0],
      [0.00929, 1],
      [-0.00059, 3],
      [0.0093, 1],
      [-0.00041, 3]
    ]
  },
  "QS_mulGraftNerve[DS]": {
    "red_x_points": [
      [2e-5, 2],
      [-0.00011, 0],
      [-0.0001, 0],
      [-0.00013, 0],
      [-0.00013, 0],
      [-0.00011, 0],
      [-6e-5, 0],
      [-1e-5, 2],
      [-0.00016, 0],
      [-7e-5, 0],
      [2e-5, 2],
      [-7e-5, 0],
      [-1e-5, 2],
      [-6e-5, 0],
      [-0.00011, 0],
      [3e-5, 2],
      [3e-5, 2],
      [3e-5, 2],
      [-0.00011, 0],
      [2e-5, 2],
      [-1e-5, 2],
      [-2e-5, 2],
      [-0.00011, 0],
      [-0.00011, 0],
      [1e-5, 2],
      [0.00017, 1],
      [-3e-5, 2],
      [-7e-5, 0],
      [-1e-5, 2]
    ],
    "red_o_points": [],
    "y_categories": ["N", "NOT APPLICABLE", "nan"],
    "blue_o_points": [],
    "blue_x_points": [
      [0.0003, 1],
      [-1e-5, 2],
      [-3e-5, 0],
      [-6e-5, 0],
      [3e-5, 2],
      [0.00039, 1],
      [9e-5, 1],
      [-4e-5, 0],
      [-1e-5, 2],
      [1e-5, 2],
      [-7e-5, 0],
      [0.00022, 1],
      [3e-5, 2],
      [0.00045, 1],
      [1e-5, 2]
    ]
  },
  "QS_mulGraftNerve[MP]": {
    "red_x_points": [
      [-0.0, 2],
      [-0.0001, 0],
      [-0.00011, 0],
      [-0.0001, 0],
      [-6e-5, 0],
      [-0.0001, 0],
      [-0.00014, 0],
      [-0.0, 2],
      [-7e-5, 0],
      [-0.0001, 0],
      [-0.0, 2],
      [-0.0001, 0],
      [-1e-5, 2],
      [-0.00014, 0],
      [-0.0001, 0],
      [-0.0, 2],
      [-0.0, 2],
      [0.0, 2],
      [-3e-5, 0],
      [0.0, 2],
      [-1e-5, 2],
      [-1e-5, 2],
      [-0.0001, 0],
      [-4e-5, 0],
      [-1e-5, 2],
      [0.00028, 1],
      [-1e-5, 2],
      [-7e-5, 0],
      [0.0, 2]
    ],
    "red_o_points": [],
    "y_categories": ["N", "NOT APPLICABLE", "nan"],
    "blue_o_points": [],
    "blue_x_points": [
      [0.00044, 1],
      [-1e-5, 2],
      [-7e-5, 0],
      [-3e-5, 0],
      [0.0, 2],
      [0.00028, 1],
      [0.00028, 1],
      [-6e-5, 0],
      [-0.0, 2],
      [0.0, 2],
      [-0.0001, 0],
      [0.00019, 1],
      [-0.0, 2],
      [0.00019, 1],
      [-0.0, 2]
    ]
  },
  "QS_mulLysisSite[Nerve]": {
    "red_x_points": [
      [-0.00033, 3],
      [-0.00346, 0],
      [-0.00901, 2],
      [-0.00852, 2],
      [-0.0026, 0],
      [-0.0023, 0],
      [-0.00237, 0],
      [-0.00074, 3],
      [-0.00262, 0],
      [-0.00238, 0],
      [-0.00043, 3],
      [-0.00277, 0],
      [-0.00077, 3],
      [-0.00381, 0],
      [-0.00318, 0],
      [-0.00061, 3],
      [-0.00039, 3],
      [-0.00054, 3],
      [-0.00242, 0],
      [-0.00051, 3],
      [-0.00062, 3],
      [-0.0007, 3],
      [-0.0027, 0],
      [-0.00276, 0],
      [-0.00073, 3],
      [0.00942, 1],
      [-0.00071, 3],
      [-0.00232, 0],
      [-0.00063, 3]
    ],
    "red_o_points": [],
    "y_categories": ["N", "NOT APPLICABLE", "Y", "nan"],
    "blue_o_points": [],
    "blue_x_points": [
      [0.01627, 1],
      [-0.00044, 3],
      [-0.00142, 0],
      [-0.00168, 0],
      [-2e-5, 3],
      [0.0123, 1],
      [0.00893, 1],
      [-0.00174, 0],
      [-0.00047, 3],
      [-0.00016, 3],
      [-0.00157, 0],
      [0.0116, 1],
      [-0.00036, 3],
      [0.01054, 1],
      [-0.00027, 3]
    ]
  },
  "QS_mulGraftNerve[Ax]": {
    "red_x_points": [
      [-5e-5, 2],
      [-0.0003, 0],
      [-0.00017, 0],
      [-0.00016, 0],
      [-0.00018, 0],
      [-8e-5, 0],
      [-0.00025, 0],
      [-4e-5, 2],
      [-0.00019, 0],
      [-8e-5, 0],
      [-5e-5, 2],
      [-0.00014, 0],
      [-5e-5, 2],
      [-0.00018, 0],
      [-0.00021, 0],
      [-4e-5, 2],
      [-3e-5, 2],
      [-5e-5, 2],
      [-9e-5, 0],
      [-5e-5, 2],
      [-1e-5, 2],
      [-1e-5, 2],
      [-0.00021, 0],
      [-0.00018, 0],
      [-5e-5, 2],
      [0.00043, 1],
      [-4e-5, 2],
      [-0.00014, 0],
      [-0.0, 2]
    ],
    "red_o_points": [],
    "y_categories": ["N", "NOT APPLICABLE", "nan"],
    "blue_o_points": [],
    "blue_x_points": [
      [0.00118, 1],
      [-0.0, 2],
      [-9e-5, 0],
      [-0.00018, 0],
      [-2e-5, 2],
      [0.00075, 1],
      [0.0004, 1],
      [-0.00011, 0],
      [-1e-5, 2],
      [-2e-5, 2],
      [-7e-5, 0],
      [0.00047, 1],
      [-3e-5, 2],
      [0.00039, 1],
      [-3e-5, 2]
    ]
  },
  "QA_lstPexMuscstrength[WristFlex]": {
    "red_x_points": [
      [-0.00235, 1],
      [-0.00142, 2],
      [-0.00206, 1],
      [0.00047, 0],
      [-0.00318, 1],
      [0.00052, 0],
      [-0.00229, 1],
      [-0.00095, 0],
      [0.00155, 0],
      [0.00015, 0],
      [-0.00145, 0],
      [0.00076, 0],
      [-0.00129, 2],
      [-0.00223, 2],
      [-0.00056, 2],
      [-0.00596, 0],
      [-0.0001, 1],
      [-0.00897, 0],
      [-0.00194, 1],
      [-0.00491, 0],
      [-0.00127, 2],
      [-0.00183, 0],
      [0.00106, 0],
      [0.00113, 0],
      [-0.00127, 2],
      [-0.00078, 2],
      [-0.00187, 1],
      [-0.00166, 1],
      [-0.00201, 2]
    ],
    "red_o_points": [],
    "y_categories": ["GREATER THAN OR EQUALS TO 3", "LESS THAN 3", "nan"],
    "blue_o_points": [],
    "blue_x_points": [
      [0.00074, 0],
      [0.00195, 0],
      [0.00178, 0],
      [0.00237, 0],
      [0.00285, 2],
      [-1e-5, 2],
      [6e-5, 0],
      [0.00121, 0],
      [0.00262, 0],
      [0.00192, 2],
      [0.00209, 0],
      [0.00063, 0],
      [0.01341, 1],
      [0.00042, 0],
      [0.0127, 1]
    ]
  },
  "QS_mulNeuromadSite[C5]": {
    "red_x_points": [
      [2e-5, 2],
      [-0.00182, 0],
      [-0.00092, 0],
      [-0.00111, 0],
      [-0.00137, 0],
      [-0.0011, 0],
      [-0.00122, 0],
      [-0.00033, 2],
      [-0.00104, 0],
      [-0.00117, 0],
      [-6e-5, 2],
      [-0.00132, 0],
      [-0.00027, 2],
      [-0.00144, 0],
      [-0.00163, 0],
      [1e-5, 2],
      [-2e-5, 2],
      [2e-5, 2],
      [-0.0011, 0],
      [-8e-5, 2],
      [-0.00018, 2],
      [-0.00033, 2],
      [-0.00133, 0],
      [-0.00118, 0],
      [-0.00025, 2],
      [0.00293, 1],
      [-0.00019, 2],
      [-0.00135, 0],
      [-6e-5, 2]
    ],
    "red_o_points": [],
    "y_categories": ["N", "NOT APPLICABLE", "nan"],
    "blue_o_points": [],
    "blue_x_points": [
      [0.00565, 1],
      [-7e-5, 2],
      [-0.00059, 0],
      [-0.00077, 0],
      [0.00029, 2],
      [0.00528, 1],
      [0.00292, 1],
      [-0.00076, 0],
      [-0.00012, 2],
      [3e-5, 2],
      [-0.00075, 0],
      [0.00302, 1],
      [0.00011, 2],
      [0.00376, 1],
      [-9e-5, 2]
    ]
  },
  "QS_mulNeuromadSite[C7]": {
    "red_x_points": [
      [-0.0001, 2],
      [-0.00056, 0],
      [-0.00034, 0],
      [-0.00053, 0],
      [-0.00057, 0],
      [-0.00034, 0],
      [-0.00051, 0],
      [-8e-5, 2],
      [-0.00043, 0],
      [-0.00035, 0],
      [-1e-5, 2],
      [-0.00043, 0],
      [-0.00011, 2],
      [-0.00071, 0],
      [-0.00069, 0],
      [-0.0001, 2],
      [-3e-5, 2],
      [-8e-5, 2],
      [-0.00038, 0],
      [-1e-5, 2],
      [-0.00012, 2],
      [-6e-5, 2],
      [-0.00039, 0],
      [-0.00051, 0],
      [-0.00012, 2],
      [0.00094, 1],
      [-0.00012, 2],
      [-0.00037, 0],
      [-7e-5, 2]
    ],
    "red_o_points": [],
    "y_categories": ["N", "NOT APPLICABLE", "nan"],
    "blue_o_points": [],
    "blue_x_points": [
      [0.0023, 1],
      [-9e-5, 2],
      [-0.00026, 0],
      [-0.00037, 0],
      [2e-5, 2],
      [0.0023, 1],
      [0.00061, 1],
      [-0.00027, 0],
      [-4e-5, 2],
      [-7e-5, 2],
      [-0.00024, 0],
      [0.00195, 1],
      [-4e-5, 2],
      [0.00145, 1],
      [-7e-5, 2]
    ]
  },
  "QS_mulLysisRoot[C5]": {
    "red_x_points": [
      [-0.00042, 3],
      [-0.00273, 0],
      [-0.00868, 2],
      [-0.0022, 0],
      [-0.0024, 0],
      [-0.00216, 0],
      [-0.0026, 0],
      [-0.00053, 3],
      [-0.0026, 0],
      [-0.00248, 0],
      [-0.00045, 3],
      [-0.0024, 0],
      [-0.00056, 3],
      [-0.00313, 0],
      [-0.00271, 0],
      [-0.00049, 3],
      [-0.0004, 3],
      [-0.00049, 3],
      [-0.00198, 0],
      [-0.0005, 3],
      [-0.0007, 3],
      [-0.00047, 3],
      [-0.0025, 0],
      [-0.00227, 0],
      [-0.00057, 3],
      [0.00879, 1],
      [-0.00056, 3],
      [-0.00709, 2],
      [-0.00047, 3]
    ],
    "red_o_points": [],
    "y_categories": ["N", "NOT APPLICABLE", "Y", "nan"],
    "blue_o_points": [],
    "blue_x_points": [
      [0.01389, 1],
      [-0.00038, 3],
      [-0.00072, 0],
      [-0.00134, 0],
      [-0.00026, 3],
      [0.01038, 1],
      [0.00834, 1],
      [-0.00213, 0],
      [-0.00018, 3],
      [-0.00026, 3],
      [-0.0009, 0],
      [0.01048, 1],
      [-0.00034, 3],
      [0.00955, 1],
      [-0.00039, 3]
    ]
  },
  "QS_mulGraftNerve[TD]": {
    "red_x_points": [
      [-3e-5, 2],
      [-7e-5, 0],
      [-0.0002, 0],
      [-4e-5, 0],
      [-0.00014, 0],
      [-0.0001, 0],
      [-0.00012, 0],
      [-0.0, 2],
      [-0.00011, 0],
      [-9e-5, 0],
      [2e-5, 2],
      [-0.0001, 0],
      [-1e-5, 2],
      [-9e-5, 0],
      [-4e-5, 0],
      [2e-5, 2],
      [0.0, 2],
      [-1e-5, 2],
      [-4e-5, 0],
      [-1e-5, 2],
      [-6e-5, 2],
      [-2e-5, 2],
      [-0.0001, 0],
      [-9e-5, 0],
      [-2e-5, 2],
      [9e-5, 1],
      [-2e-5, 2],
      [-0.0001, 0],
      [-1e-5, 2]
    ],
    "red_o_points": [],
    "y_categories": ["N", "NOT APPLICABLE", "nan"],
    "blue_o_points": [],
    "blue_x_points": [
      [0.00084, 1],
      [3e-5, 2],
      [-4e-5, 0],
      [-5e-5, 0],
      [0.00031, 1],
      [-2e-5, 0],
      [1e-5, 2],
      [-2e-5, 2],
      [-2e-5, 0],
      [0.00022, 1],
      [-1e-5, 2],
      [0.00022, 1],
      [2e-5, 2]
    ]
  },
  "QA_intPexForearmSupin": {
    "red_x_points": [
      [-0.00099, 2],
      [-0.00448, 0],
      [-0.00076, 2],
      [-0.00058, 2],
      [-0.00108, 2],
      [0.00457, 1],
      [-0.00106, 2],
      [0.00173, 1],
      [-0.00138, 2],
      [-0.00165, 2],
      [-0.00674, 0],
      [-0.00746, 0],
      [-0.00074, 2],
      [-0.00153, 2],
      [-0.00051, 2],
      [0.00356, 1],
      [-0.00716, 0],
      [0.00154, 1],
      [0.0023, 1],
      [-0.00064, 2],
      [-0.00058, 2],
      [-0.00073, 2],
      [-0.00162, 2],
      [-0.00136, 2],
      [1e-5, 2],
      [-0.02192, 1],
      [-0.00029, 2],
      [-0.00386, 0],
      [-0.00084, 2]
    ],
    "red_o_points": [],
    "y_categories": ["GREATER THAN OR EQUALS TO 80", "LESS THAN 80", "nan"],
    "blue_o_points": [],
    "blue_x_points": [
      [0.00394, 2],
      [0.00716, 1],
      [0.01067, 1],
      [-0.0015, 2],
      [7e-5, 2],
      [0.00402, 2],
      [0.00568, 0],
      [-0.00053, 2],
      [-0.00043, 2],
      [0.0, 2],
      [0.00972, 1],
      [0.00422, 2],
      [0.00023, 2],
      [0.00415, 2],
      [0.00686, 1]
    ]
  },
  "QS_mulGraftNerve[SS]": {
    "red_x_points": [
      [-1e-5, 2],
      [-0.0002, 0],
      [-0.0002, 0],
      [-0.00016, 0],
      [-0.0002, 0],
      [-0.00018, 0],
      [-0.00017, 0],
      [-1e-5, 2],
      [-0.00015, 0],
      [-0.0001, 0],
      [-1e-5, 2],
      [-0.0002, 0],
      [0.0, 2],
      [-0.00017, 0],
      [-0.00011, 0],
      [-1e-5, 2],
      [-1e-5, 2],
      [-2e-5, 2],
      [-0.00013, 0],
      [-0.0, 2],
      [0.0, 2],
      [0.0, 2],
      [-0.00017, 0],
      [-0.00011, 0],
      [-2e-5, 2],
      [9e-5, 1],
      [-2e-5, 2],
      [-0.00016, 0],
      [0.0, 2]
    ],
    "red_o_points": [],
    "y_categories": ["N", "NOT APPLICABLE", "nan"],
    "blue_o_points": [],
    "blue_x_points": [
      [0.00094, 1],
      [0.0, 2],
      [-0.00011, 0],
      [-0.00012, 0],
      [-2e-5, 2],
      [0.00035, 1],
      [0.00053, 1],
      [-0.00013, 0],
      [0.0, 2],
      [-1e-5, 2],
      [-0.0001, 0],
      [0.00062, 1],
      [-2e-5, 2],
      [0.00049, 1],
      [-0.0, 2]
    ]
  },
  "QS_mulGraftNerve[MCF]": {
    "red_x_points": [
      [2e-5, 2],
      [-9e-5, 0],
      [-7e-5, 0],
      [-0.0001, 0],
      [-0.0001, 0],
      [-0.00013, 0],
      [-4e-5, 0],
      [-2e-5, 2],
      [-0.0001, 0],
      [-8e-5, 0],
      [2e-5, 2],
      [-0.00013, 0],
      [-2e-5, 2],
      [-0.0001, 0],
      [-0.00013, 0],
      [4e-5, 2],
      [2e-5, 2],
      [4e-5, 2],
      [-0.00013, 0],
      [2e-5, 2],
      [-1e-5, 2],
      [-3e-5, 2],
      [-8e-5, 0],
      [-3e-5, 2],
      [0.00019, 1],
      [-3e-5, 2],
      [-0.00013, 0],
      [-2e-5, 2]
    ],
    "red_o_points": [],
    "y_categories": ["N", "NOT APPLICABLE", "nan"],
    "blue_o_points": [],
    "blue_x_points": [
      [0.00032, 1],
      [2e-5, 2],
      [-4e-5, 0],
      [-0.0001, 0],
      [4e-5, 2],
      [0.00038, 1],
      [0.00022, 1],
      [-4e-5, 0],
      [-2e-5, 2],
      [2e-5, 2],
      [9e-5, 1],
      [4e-5, 2],
      [0.00032, 1],
      [2e-5, 2]
    ]
  },
  "QA_lstPexArthre[Index]": {
    "red_x_points": [
      [-0.00734, 0],
      [-0.0038, 2],
      [-0.00297, 2],
      [-0.00513, 0],
      [-0.00755, 0],
      [0.00658, 1],
      [-0.00649, 0],
      [0.00013, 2],
      [0.00796, 1],
      [-0.01075, 0],
      [0.00241, 1],
      [-0.00559, 2],
      [7e-5, 2],
      [0.00603, 1],
      [-0.00311, 2],
      [0.00204, 1],
      [-0.00584, 0],
      [0.00184, 1],
      [-0.00391, 2],
      [-0.00804, 0],
      [-2e-5, 2],
      [0.00038, 2],
      [-0.00539, 2],
      [-0.00464, 2],
      [0.00153, 1],
      [-0.00114, 2],
      [6e-5, 2],
      [-0.00519, 0],
      [0.0002, 2]
    ],
    "red_o_points": [],
    "y_categories": ["NPV", "PV", "nan"],
    "blue_o_points": [],
    "blue_x_points": [
      [0.00056, 0],
      [0.00104, 2],
      [0.01089, 1],
      [0.01212, 1],
      [0.00111, 2],
      [-0.00016, 2],
      [0.00161, 1],
      [0.00925, 1],
      [0.00109, 2],
      [0.00092, 2],
      [0.01006, 1],
      [0.00137, 1],
      [0.00317, 1],
      [-0.00015, 2],
      [0.00477, 1]
    ]
  },
  "QS_mulTransfSite[IMc]": {
    "red_x_points": [
      [-0.00098, 3],
      [-0.01265, 2],
      [-0.00207, 0],
      [-0.01233, 2],
      [-0.00211, 0],
      [-0.00216, 0],
      [-0.0022, 0],
      [-0.00087, 3],
      [-0.00201, 0],
      [-0.00206, 0],
      [-0.00085, 3],
      [-0.00231, 0],
      [-0.00116, 3],
      [-0.00327, 0],
      [-0.01209, 2],
      [-0.00096, 3],
      [-0.00071, 3],
      [-0.00102, 3],
      [-0.00221, 0],
      [-0.00081, 3],
      [-0.00096, 3],
      [-0.00094, 3],
      [-0.00231, 0],
      [-0.01441, 2],
      [-0.00101, 3],
      [0.01513, 1],
      [-0.00106, 3],
      [-0.01229, 2],
      [-0.00102, 3]
    ],
    "red_o_points": [],
    "y_categories": ["N", "NOT APPLICABLE", "Y", "nan"],
    "blue_o_points": [],
    "blue_x_points": [
      [0.02449, 1],
      [-0.00077, 3],
      [-0.00088, 0],
      [-0.00051, 0],
      [-0.00021, 3],
      [0.01727, 1],
      [0.01547, 1],
      [-0.00138, 0],
      [-0.0005, 3],
      [-0.00043, 3],
      [-0.00097, 0],
      [0.01688, 1],
      [-0.00061, 3],
      [0.01647, 1],
      [-0.00059, 3]
    ]
  },
  "QS_mulLysisRoot[C7]": {
    "red_x_points": [
      [-0.00035, 3],
      [-0.00139, 0],
      [-0.00493, 2],
      [-0.00114, 0],
      [-0.00145, 0],
      [-0.00077, 0],
      [-0.00131, 0],
      [-0.00038, 3],
      [-0.00129, 0],
      [-0.00102, 0],
      [-0.00029, 3],
      [-0.00109, 0],
      [-0.00046, 3],
      [-0.00149, 0],
      [-0.00133, 0],
      [-0.00034, 3],
      [-0.0003, 3],
      [-0.00027, 3],
      [-0.00095, 0],
      [-0.00034, 3],
      [-0.00047, 3],
      [-0.00042, 3],
      [-0.00133, 0],
      [-0.00126, 0],
      [-0.00044, 3],
      [0.00377, 1],
      [-0.00034, 3],
      [-0.00097, 0],
      [-0.00043, 3]
    ],
    "red_o_points": [],
    "y_categories": ["N", "NOT APPLICABLE", "Y", "nan"],
    "blue_o_points": [],
    "blue_x_points": [
      [0.00727, 1],
      [-0.00025, 3],
      [-0.00089, 0],
      [-0.00102, 0],
      [-0.00024, 3],
      [0.00551, 1],
      [0.00436, 1],
      [-0.00109, 0],
      [-0.0003, 3],
      [-0.00016, 3],
      [-0.00056, 0],
      [0.00523, 1],
      [-0.00015, 3],
      [0.00535, 1],
      [-0.00026, 3]
    ]
  },
  "QS_mulGraftLevel[other]": {
    "red_x_points": [
      [-1e-5, 0],
      [-1e-5, 0],
      [-1e-5, 0],
      [-1e-5, 0],
      [-1e-5, 0],
      [-1e-5, 0],
      [0.0, 2],
      [-1e-5, 0],
      [-1e-5, 0],
      [0.0, 2],
      [-1e-5, 0],
      [0.0, 2],
      [0.0, 2],
      [0.0, 2],
      [0.0, 2],
      [-1e-5, 0],
      [-1e-5, 0],
      [0.0, 2]
    ],
    "red_o_points": [],
    "y_categories": ["N", "NOT APPLICABLE", "nan"],
    "blue_o_points": [],
    "blue_x_points": [
      [0.00014, 1],
      [0.0, 2],
      [-1e-5, 0],
      [-1e-5, 0],
      [0.0, 2],
      [-1e-5, 0],
      [0.0, 2]
    ]
  },
  "QS_lstBpsurgSide": {
    "red_x_points": [
      [-0.0008, 3],
      [-0.01004, 0],
      [-0.00948, 0],
      [-0.00875, 0],
      [-0.00918, 0],
      [-0.00981, 0],
      [-0.00898, 0],
      [-0.00099, 3],
      [-0.01137, 0],
      [0.00077, 2],
      [-0.00105, 3],
      [2e-5, 2],
      [-0.00105, 3],
      [-0.00088, 2],
      [-0.00208, 2],
      [-0.00114, 3],
      [-0.00076, 3],
      [-0.00083, 3],
      [-0.00714, 0],
      [-0.00064, 3],
      [-0.00099, 3],
      [-0.00093, 3],
      [0.00062, 2],
      [0.00031, 2],
      [-0.0011, 3],
      [0.01297, 1],
      [-0.00095, 3],
      [-0.00881, 0],
      [-0.00086, 3]
    ],
    "red_o_points": [],
    "y_categories": ["L", "NOT APPLICABLE", "R", "nan"],
    "blue_o_points": [],
    "blue_x_points": [
      [0.02175, 1],
      [-0.00073, 3],
      [0.00377, 2],
      [0.00443, 2],
      [-0.00019, 3],
      [0.01505, 1],
      [0.0131, 1],
      [-0.00313, 0],
      [-0.00035, 3],
      [-0.00037, 3],
      [0.00328, 2],
      [0.01415, 1],
      [-0.00076, 3],
      [0.0144, 1],
      [-0.0005, 3]
    ]
  },
  "QS_mulLysisRoot[C6]": {
    "red_x_points": [
      [-0.00036, 3],
      [-0.00442, 0],
      [-0.01048, 2],
      [-0.00343, 0],
      [-0.00316, 0],
      [-0.00335, 0],
      [-0.00349, 0],
      [-0.0008, 3],
      [-0.0038, 0],
      [-0.00305, 0],
      [-0.00062, 3],
      [-0.00369, 0],
      [-0.00063, 3],
      [-0.00408, 0],
      [-0.00392, 0],
      [-0.0005, 3],
      [-0.00032, 3],
      [-0.00064, 3],
      [-0.00319, 0],
      [-0.0004, 3],
      [-0.00069, 3],
      [-0.00086, 3],
      [-0.00385, 0],
      [-0.00383, 0],
      [-0.00079, 3],
      [0.01127, 1],
      [-0.00077, 3],
      [-0.01014, 2],
      [-0.00077, 3]
    ],
    "red_o_points": [],
    "y_categories": ["N", "NOT APPLICABLE", "Y", "nan"],
    "blue_o_points": [],
    "blue_x_points": [
      [0.01846, 1],
      [-0.00052, 3],
      [-0.00191, 0],
      [-0.00223, 0],
      [4e-5, 3],
      [0.01582, 1],
      [0.01229, 1],
      [-0.0022, 0],
      [-0.00041, 3],
      [-0.00032, 3],
      [-0.00232, 0],
      [0.01416, 1],
      [-0.00017, 3],
      [0.01457, 1],
      [-0.00048, 3]
    ]
  },
  "QS_mulTransfSite[AcMc]": {
    "red_x_points": [
      [-0.00024, 3],
      [-0.00184, 0],
      [-0.00111, 0],
      [-0.00071, 0],
      [-0.00116, 0],
      [-0.00067, 0],
      [-0.00104, 0],
      [-0.00045, 3],
      [-0.00111, 0],
      [-0.00748, 2],
      [-0.0002, 3],
      [-0.00087, 0],
      [-0.00026, 3],
      [-0.00172, 0],
      [-0.00172, 0],
      [-0.00035, 3],
      [-0.00015, 3],
      [-0.00047, 3],
      [-0.00086, 0],
      [-0.00034, 3],
      [-0.00038, 3],
      [-0.00061, 3],
      [-0.00115, 0],
      [-0.00114, 0],
      [-0.00043, 3],
      [0.00355, 1],
      [-0.00038, 3],
      [-0.00077, 0],
      [-0.0003, 3]
    ],
    "red_o_points": [],
    "y_categories": ["N", "NOT APPLICABLE", "Y", "nan"],
    "blue_o_points": [],
    "blue_x_points": [
      [0.0065, 1],
      [-0.00016, 3],
      [0.00144, 0],
      [0.00071, 0],
      [9e-5, 3],
      [0.00533, 1],
      [0.0027, 1],
      [-0.00072, 0],
      [-0.00015, 3],
      [-1e-5, 3],
      [0.00069, 0],
      [0.00418, 1],
      [-0.00021, 3],
      [0.00429, 1],
      [-0.00035, 3]
    ]
  },
  "QS_mulTransfSite[Other]": {
    "red_x_points": [
      [-0.00118, 3],
      [-0.00866, 0],
      [-0.00791, 0],
      [-0.00758, 0],
      [-0.00779, 0],
      [-0.00822, 0],
      [-0.00774, 0],
      [-0.00131, 3],
      [-0.00762, 0],
      [-0.00793, 0],
      [-0.00112, 3],
      [-0.00834, 0],
      [-0.00144, 3],
      [-0.00884, 0],
      [-0.00813, 0],
      [-0.00144, 3],
      [-0.00105, 3],
      [-0.00119, 3],
      [-0.00703, 0],
      [-0.0013, 3],
      [-0.00136, 3],
      [-0.00137, 3],
      [-0.00858, 0],
      [-0.0085, 0],
      [-0.00122, 3],
      [0.0173, 1],
      [-0.00109, 3],
      [-0.00784, 0],
      [-0.0014, 3]
    ],
    "red_o_points": [],
    "y_categories": ["N", "NOT APPLICABLE", "Y", "nan"],
    "blue_o_points": [],
    "blue_x_points": [
      [0.02666, 1],
      [-0.00083, 3],
      [-0.00661, 0],
      [-0.00675, 0],
      [-0.00061, 3],
      [0.02352, 1],
      [0.01801, 1],
      [-0.00665, 0],
      [-0.00112, 3],
      [-0.00077, 3],
      [0.03596, 2],
      [0.0205, 1],
      [-0.00069, 3],
      [0.02037, 1],
      [-0.00109, 3]
    ]
  },
  "QA_yonInjBpsurg": {
    "red_x_points": [
      [-0.00058, 1],
      [-0.00059, 1],
      [-0.00046, 1],
      [-0.0007, 1],
      [-0.00059, 1],
      [-0.00035, 1],
      [-0.00078, 1],
      [-0.0007, 1],
      [-0.00076, 1],
      [-0.00034, 1],
      [-0.00038, 1],
      [-0.00043, 1],
      [-0.00108, 1],
      [-0.00091, 1],
      [-0.00039, 1],
      [-0.00044, 1],
      [-0.0004, 1],
      [-0.00048, 1],
      [-0.00032, 1],
      [-0.00043, 1],
      [-0.00089, 1],
      [-0.00081, 1],
      [-0.00045, 1],
      [-0.00048, 1],
      [-0.0009, 1],
      [0.00266, 0],
      [-0.00067, 1],
      [-0.00035, 1],
      [-0.00107, 1]
    ],
    "red_o_points": [],
    "y_categories": ["N", "Y", "nan"],
    "blue_o_points": [],
    "blue_x_points": [
      [0.00579, 0],
      [-0.00051, 1],
      [-0.00044, 1],
      [-0.00072, 1],
      [-0.00034, 1],
      [0.00252, 0],
      [0.00286, 0],
      [-0.00049, 1],
      [-0.00046, 1],
      [-0.00037, 1],
      [-0.00052, 1],
      [0.00373, 0],
      [-0.00034, 1],
      [0.00365, 0],
      [-0.00026, 1]
    ]
  },
  "QA_lstPexTouch[C8]": {
    "red_x_points": [
      [-0.00208, 1],
      [-0.0056, 2],
      [-0.00287, 1],
      [-0.00183, 1],
      [-0.00579, 2],
      [-0.00423, 1],
      [-0.00322, 1],
      [-0.00291, 0],
      [-0.0065, 1],
      [0.0121, 0],
      [-0.0009, 1],
      [-0.00876, 2],
      [-0.00236, 2],
      [-0.00817, 2],
      [-0.00313, 2],
      [-0.00053, 0],
      [-0.00134, 1],
      [-0.00219, 0],
      [-0.00417, 2],
      [-0.00213, 0],
      [-0.00231, 2],
      [-0.00481, 0],
      [-0.00565, 1],
      [-0.00934, 2],
      [-0.00304, 0],
      [-0.0061, 1],
      [-0.00129, 2],
      [-0.00256, 1],
      [-0.00096, 1]
    ],
    "red_o_points": [],
    "y_categories": ["NORM", "NPV", "nan"],
    "blue_o_points": [],
    "blue_x_points": [
      [0.00448, 0],
      [0.00642, 1],
      [0.01927, 0],
      [0.02235, 0],
      [0.00446, 2],
      [0.00083, 2],
      [-5e-5, 1],
      [-0.0014, 1],
      [0.0078, 1],
      [0.00492, 2],
      [0.01667, 0],
      [-0.00029, 1],
      [-0.00012, 0],
      [0.00357, 0],
      [0.00376, 0]
    ]
  },
  "QS_mulNeuromadSite[T1]": {
    "red_x_points": [
      [1e-5, 2],
      [-0.00099, 0],
      [-0.00088, 0],
      [-0.00091, 0],
      [-0.0009, 0],
      [-0.00074, 0],
      [-0.00098, 0],
      [-0.00021, 2],
      [-0.00083, 0],
      [-0.00075, 0],
      [-7e-5, 2],
      [-0.00094, 0],
      [-8e-5, 2],
      [-0.001, 0],
      [-0.0009, 0],
      [-0.0001, 2],
      [1e-5, 2],
      [-8e-5, 2],
      [-0.00077, 0],
      [-4e-5, 2],
      [-0.00011, 2],
      [-9e-5, 2],
      [-0.00104, 0],
      [-0.00103, 0],
      [-2e-5, 2],
      [0.00214, 1],
      [-6e-5, 2],
      [-0.00082, 0],
      [-9e-5, 2]
    ],
    "red_o_points": [],
    "y_categories": ["N", "NOT APPLICABLE", "nan"],
    "blue_o_points": [],
    "blue_x_points": [
      [0.00404, 1],
      [-5e-5, 2],
      [-0.0005, 0],
      [-0.00075, 0],
      [8e-5, 2],
      [0.00317, 1],
      [0.00216, 1],
      [-0.00065, 0],
      [-0.00014, 2],
      [1e-5, 2],
      [-0.00045, 0],
      [0.0025, 1],
      [-0.0001, 2],
      [0.00294, 1],
      [-3e-5, 2]
    ]
  },
  "QS_mulBpsurgeryType[Graft]": {
    "red_x_points": [
      [-0.00012, 3],
      [-0.00106, 0],
      [-0.00091, 0],
      [-0.00077, 0],
      [-0.00111, 0],
      [-0.00078, 0],
      [-0.00108, 0],
      [-0.00016, 3],
      [-0.00079, 0],
      [-0.00079, 0],
      [-0.00022, 3],
      [-0.00093, 0],
      [-0.00012, 3],
      [-0.00462, 2],
      [-0.00095, 0],
      [-0.00018, 3],
      [-0.00011, 3],
      [-0.00016, 3],
      [-0.00081, 0],
      [-0.00012, 3],
      [-0.00016, 3],
      [-0.00013, 3],
      [-0.00097, 0],
      [-0.00107, 0],
      [-0.00026, 3],
      [0.00267, 1],
      [-0.00016, 3],
      [-0.00076, 0],
      [-0.00017, 3]
    ],
    "red_o_points": [],
    "y_categories": ["N", "NOT APPLICABLE", "Y", "nan"],
    "blue_o_points": [],
    "blue_x_points": [
      [0.00479, 1],
      [-0.0001, 3],
      [-0.00032, 0],
      [-0.00015, 0],
      [-7e-5, 3],
      [0.00418, 1],
      [0.00258, 1],
      [-0.00056, 0],
      [-0.00011, 3],
      [-9e-5, 3],
      [-0.00061, 0],
      [0.00333, 1],
      [-0.00018, 3],
      [0.00421, 1],
      [-0.00011, 3]
    ]
  },
  "QA_lstPexMuscstrength[WristExte]": {
    "red_x_points": [
      [-0.00563, 1],
      [-0.00319, 2],
      [-0.00357, 1],
      [-0.00388, 1],
      [-0.00523, 1],
      [-0.00564, 1],
      [-0.00467, 1],
      [-0.00042, 0],
      [0.0059, 0],
      [-0.00783, 1],
      [0.00048, 0],
      [0.0051, 0],
      [-0.00204, 2],
      [-0.00553, 2],
      [-0.00225, 2],
      [-0.00062, 0],
      [-0.00205, 1],
      [-0.00108, 0],
      [-0.00417, 1],
      [-0.00607, 1],
      [-0.00213, 2],
      [-0.00613, 1],
      [0.00538, 0],
      [0.00461, 0],
      [-0.00173, 2],
      [-0.00119, 2],
      [-0.00401, 1],
      [-0.00298, 1],
      [-0.00165, 2]
    ],
    "red_o_points": [],
    "y_categories": ["GREATER THAN OR EQUALS TO 3", "LESS THAN 3", "nan"],
    "blue_o_points": [],
    "blue_x_points": [
      [0.00249, 0],
      [0.00231, 1],
      [0.00695, 0],
      [0.00865, 0],
      [0.00087, 2],
      [-0.00024, 2],
      [0.00126, 0],
      [0.00676, 0],
      [0.01386, 0],
      [0.00051, 2],
      [0.00678, 0],
      [-0.00036, 1],
      [0.00686, 0],
      [0.00197, 0],
      [0.00356, 1]
    ]
  },
  "QS_mulNeuromadSite[C6]": {
    "red_x_points": [
      [-0.00015, 2],
      [-0.00099, 0],
      [-0.00064, 0],
      [-0.00055, 0],
      [-0.0005, 0],
      [-0.00046, 0],
      [-0.0005, 0],
      [-0.00011, 2],
      [-0.00069, 0],
      [-0.00055, 0],
      [-0.00013, 2],
      [-0.00063, 0],
      [-0.00016, 2],
      [-0.00074, 0],
      [-0.00079, 0],
      [-0.00015, 2],
      [-0.00014, 2],
      [-0.00018, 2],
      [-0.00046, 0],
      [-0.00011, 2],
      [-0.00024, 2],
      [-0.00014, 2],
      [-0.00048, 0],
      [-0.00059, 0],
      [-0.00021, 2],
      [0.00185, 1],
      [-0.00015, 2],
      [-0.00045, 0],
      [-0.00022, 2]
    ],
    "red_o_points": [],
    "y_categories": ["N", "NOT APPLICABLE", "nan"],
    "blue_o_points": [],
    "blue_x_points": [
      [0.00272, 1],
      [-0.00015, 2],
      [-0.00042, 0],
      [-0.00048, 0],
      [-7e-5, 2],
      [0.00266, 1],
      [0.00161, 1],
      [-0.00049, 0],
      [-0.00012, 2],
      [-0.00011, 2],
      [-0.00029, 0],
      [0.00208, 1],
      [-3e-5, 2],
      [0.0024, 1],
      [-5e-5, 2]
    ]
  },
  "QA_lstPexPalle[Clavicle]": {
    "red_x_points": [
      [-2e-5, 3],
      [-0.00161, 3],
      [-0.00086, 3],
      [0.00129, 2],
      [-0.00163, 3],
      [0.00185, 2],
      [-0.00147, 3],
      [-0.0001, 3],
      [-0.00285, 3],
      [0.00291, 2],
      [-0.01337, 0],
      [-0.00281, 3],
      [-7e-5, 3],
      [-0.00226, 3],
      [-0.00084, 3],
      [-0.01402, 0],
      [-0.0132, 0],
      [0.0107, 2],
      [-0.00391, 1],
      [-0.01487, 1],
      [0.0001, 3],
      [-0.00018, 3],
      [-0.0034, 3],
      [-0.00257, 3],
      [-0.00014, 3],
      [-0.02605, 2],
      [-0.00021, 3],
      [-0.0012, 0],
      [-0.0001, 3]
    ],
    "red_o_points": [],
    "y_categories": ["HYPO", "NAIA", "PT", "nan"],
    "blue_o_points": [],
    "blue_x_points": [
      [0.00486, 3],
      [0.00056, 3],
      [0.00507, 2],
      [0.00671, 2],
      [0.001, 3],
      [0.00487, 3],
      [0.00623, 0],
      [-0.00154, 3],
      [0.00066, 3],
      [0.00042, 3],
      [0.01195, 0],
      [0.00488, 3],
      [0.01942, 2],
      [0.00527, 3],
      [0.02052, 2]
    ]
  },
  "QS_mulGraftNerve[LT]": {
    "red_x_points": [
      [-0.0, 2],
      [-5e-5, 0],
      [-3e-5, 0],
      [-3e-5, 0],
      [-6e-5, 0],
      [-3e-5, 0],
      [-6e-5, 0],
      [-6e-5, 0],
      [-1e-5, 0],
      [1e-5, 2],
      [-5e-5, 0],
      [-3e-5, 2],
      [-3e-5, 0],
      [-3e-5, 0],
      [1e-5, 2],
      [-0.0, 2],
      [0.0, 2],
      [-3e-5, 0],
      [1e-5, 2],
      [-3e-5, 2],
      [-3e-5, 2],
      [-5e-5, 0],
      [-3e-5, 0],
      [-4e-5, 2],
      [-4e-5, 0],
      [-4e-5, 2]
    ],
    "red_o_points": [],
    "y_categories": ["N", "NOT APPLICABLE", "nan"],
    "blue_o_points": [],
    "blue_x_points": [
      [0.00043, 1],
      [1e-5, 2],
      [-3e-5, 0],
      [-5e-5, 0],
      [0.0, 2],
      [0.00017, 1],
      [-3e-5, 2],
      [-3e-5, 0],
      [0.00013, 1],
      [0.00013, 1],
      [1e-5, 2]
    ]
  },
  "QA_lstPexMuscstrength[ShoulderAbduc]": {
    "red_x_points": [
      [-0.00026, 1],
      [-0.00018, 1],
      [-0.00012, 1],
      [-0.0002, 1],
      [-0.00018, 1],
      [-0.00017, 1],
      [-0.00018, 1],
      [-0.00025, 1],
      [-0.00024, 1],
      [-0.00013, 1],
      [-0.00017, 1],
      [-0.00015, 1],
      [0.00014, 2],
      [0.00015, 2],
      [0.00015, 2],
      [-0.00016, 1],
      [-0.0002, 1],
      [-0.00024, 1],
      [-9e-5, 1],
      [3e-5, 2],
      [0.00019, 2],
      [-0.00023, 1],
      [-0.00019, 1],
      [-0.0002, 1],
      [-0.00024, 1],
      [0.00012, 2],
      [-0.0003, 1],
      [-0.00017, 1],
      [0.00015, 2]
    ],
    "red_o_points": [],
    "y_categories": ["GREATER THAN OR EQUALS TO 3", "LESS THAN 3", "nan"],
    "blue_o_points": [],
    "blue_x_points": [
      [0.00018, 2],
      [-0.00017, 1],
      [-0.00022, 1],
      [-0.00022, 1],
      [0.00019, 2],
      [0.0001, 2],
      [0.00157, 0],
      [0.00021, 2],
      [0.00023, 2],
      [0.00018, 2],
      [-0.00017, 1],
      [0.00184, 0],
      [-0.00017, 1],
      [-4e-5, 1],
      [-0.0002, 1]
    ]
  },
  "QA_yonInjPhysio": {
    "red_x_points": [
      [-0.00714, 0],
      [0.0005, 0],
      [0.00033, 0],
      [0.00026, 0],
      [-0.00204, 2],
      [0.00014, 0],
      [0.00025, 0],
      [-0.00588, 0],
      [0.00112, 0],
      [-0.00629, 1],
      [-0.00544, 0],
      [0.00104, 0],
      [-0.00693, 0],
      [-0.0045, 1],
      [-0.00185, 1],
      [0.00382, 1],
      [-0.00598, 0],
      [0.00444, 1],
      [0.00015, 0],
      [-0.00588, 0],
      [0.00421, 1],
      [0.00401, 1],
      [0.00149, 0],
      [-0.00796, 1],
      [-0.00868, 2],
      [-0.01237, 1],
      [-0.00833, 2],
      [0.00022, 0],
      [0.00461, 1]
    ],
    "red_o_points": [],
    "y_categories": ["N", "Y", "nan"],
    "blue_o_points": [],
    "blue_x_points": [
      [0.00471, 0],
      [0.00679, 1],
      [0.00542, 0],
      [0.00603, 0],
      [0.00748, 1],
      [0.00466, 0],
      [0.00304, 0],
      [0.00157, 0],
      [-0.0023, 0],
      [0.00674, 1],
      [0.00414, 0],
      [0.00358, 0],
      [0.00622, 1],
      [-0.00296, 1],
      [0.00756, 1]
    ]
  },
  "QA_lstPexTouch[C7]": {
    "red_x_points": [
      [-0.00269, 1],
      [-0.00847, 2],
      [-0.00266, 1],
      [-0.00347, 1],
      [-0.00908, 2],
      [-0.00505, 1],
      [-0.00458, 1],
      [-0.00431, 0],
      [-0.00691, 1],
      [-0.0072, 1],
      [-0.0014, 1],
      [-0.0125, 2],
      [-0.00294, 2],
      [-0.01108, 2],
      [-0.00488, 2],
      [-0.00153, 0],
      [-0.00205, 1],
      [-0.0028, 0],
      [-0.0068, 2],
      [-0.00212, 0],
      [-0.0022, 2],
      [-0.00549, 0],
      [-0.00649, 1],
      [-0.01099, 2],
      [-0.0046, 0],
      [-0.00386, 1],
      [-0.00131, 2],
      [-0.00266, 1],
      [-0.00108, 1]
    ],
    "red_o_points": [],
    "y_categories": ["NORM", "NPV", "nan"],
    "blue_o_points": [],
    "blue_x_points": [
      [-0.00017, 1],
      [0.00839, 1],
      [0.03512, 0],
      [0.03823, 0],
      [0.00638, 2],
      [0.0001, 2],
      [-0.0001, 1],
      [-0.0032, 1],
      [0.00907, 1],
      [0.00754, 2],
      [0.03089, 0],
      [3e-5, 1],
      [0.00127, 0],
      [0.00368, 0],
      [0.004, 0]
    ]
  },
  "QA_lstPexMuscstrength[ShoulderExrot]": {
    "red_x_points": [
      [-0.00051, 2],
      [-0.00173, 0],
      [-0.00028, 2],
      [0.00077, 1],
      [0.00046, 1],
      [-0.00037, 2],
      [-2e-5, 1],
      [0.0008, 1],
      [-0.00072, 2],
      [-6e-5, 1],
      [-0.00065, 2],
      [-0.0, 2],
      [-0.00055, 2],
      [-0.0004, 2],
      [-2e-5, 1],
      [2e-5, 1],
      [-9e-5, 1],
      [-0.00041, 2],
      [-5e-5, 2],
      [-0.0, 2],
      [7e-5, 2],
      [0.00097, 1],
      [-0.00756, 0],
      [0.0, 2],
      [-5e-5, 2],
      [0.00019, 1],
      [-0.0, 2]
    ],
    "red_o_points": [],
    "y_categories": ["GREATER THAN OR EQUALS TO 3", "LESS THAN 3", "nan"],
    "blue_o_points": [],
    "blue_x_points": [
      [0.00022, 2],
      [0.00336, 1],
      [0.0037, 1],
      [0.0001, 0],
      [-0.00023, 2],
      [0.00041, 2],
      [0.00259, 1],
      [0.0001, 0],
      [-5e-5, 2],
      [-0.0, 2]
    ]
  },
  "QA_intPexShoulderFlex": {
    "red_x_points": [
      [6e-5, 1],
      [-4e-5, 2],
      [-0.00017, 2],
      [-0.00012, 2],
      [-0.00475, 0],
      [-0.00011, 2],
      [-0.00028, 2],
      [-0.00064, 2],
      [-2e-5, 1],
      [0.0005, 1],
      [-0.00031, 2],
      [-0.0001, 2],
      [9e-5, 1],
      [0.0, 1],
      [0.0, 1],
      [0.00033, 1],
      [-0.00012, 2],
      [-0.00032, 2],
      [-0.0002, 2],
      [-2e-5, 1],
      [3e-5, 1],
      [7e-5, 1]
    ],
    "red_o_points": [],
    "y_categories": ["GREATER THAN OR EQUALS TO 180", "LESS THAN 180", "nan"],
    "blue_o_points": [],
    "blue_x_points": [
      [0.00033, 1],
      [0.00333, 1],
      [0.00017, 2],
      [-2e-5, 2],
      [1e-5, 2],
      [0.00223, 1],
      [0.0, 1],
      [3e-5, 1]
    ]
  },
  "QS_mulGraftNerve[IS]": {
    "red_x_points": [
      [1e-5, 2],
      [-0.00018, 0],
      [-6e-5, 0],
      [-3e-5, 0],
      [-9e-5, 0],
      [-4e-5, 0],
      [-0.00012, 0],
      [-2e-5, 2],
      [-0.00012, 0],
      [-4e-5, 0],
      [-2e-5, 2],
      [-8e-5, 0],
      [-2e-5, 2],
      [-0.00016, 0],
      [-0.00018, 0],
      [0.0, 2],
      [-2e-5, 2],
      [-2e-5, 2],
      [-4e-5, 0],
      [-2e-5, 2],
      [-2e-5, 2],
      [-2e-5, 2],
      [-4e-5, 0],
      [-0.0001, 0],
      [-1e-5, 2],
      [0.0001, 1],
      [1e-5, 2],
      [-4e-5, 0],
      [3e-5, 2]
    ],
    "red_o_points": [],
    "y_categories": ["N", "NOT APPLICABLE", "nan"],
    "blue_o_points": [],
    "blue_x_points": [
      [0.00037, 1],
      [-1e-5, 2],
      [-2e-5, 0],
      [-5e-5, 0],
      [5e-5, 2],
      [0.00039, 1],
      [0.0001, 1],
      [-9e-5, 0],
      [1e-5, 2],
      [6e-5, 2],
      [-2e-5, 0],
      [0.0001, 1],
      [-2e-5, 2],
      [0.00051, 1],
      [-2e-5, 2]
    ]
  },
  "QS_mulGraftLevel[Root]": {
    "red_x_points": [
      [-0.0, 2],
      [-4e-5, 0],
      [-4e-5, 0],
      [-3e-5, 0],
      [-4e-5, 0],
      [-3e-5, 0],
      [-4e-5, 0],
      [-4e-5, 0],
      [-1e-5, 2],
      [-4e-5, 0],
      [-0.0, 2],
      [-2e-5, 0],
      [-0.0, 2],
      [-0.0, 2],
      [-1e-5, 2],
      [-3e-5, 0],
      [0.0, 2],
      [-0.0, 2],
      [-0.0, 2],
      [-4e-5, 0],
      [-4e-5, 0],
      [-1e-5, 2],
      [-1e-5, 2],
      [-3e-5, 0],
      [-0.0, 2]
    ],
    "red_o_points": [],
    "y_categories": ["N", "NOT APPLICABLE", "nan"],
    "blue_o_points": [],
    "blue_x_points": [
      [0.00028, 1],
      [0.0, 2],
      [-4e-5, 0],
      [-4e-5, 0],
      [-1e-5, 2],
      [0.00013, 1],
      [-0.0, 2],
      [-1e-5, 2],
      [-3e-5, 0],
      [0.00013, 1],
      [-1e-5, 2],
      [0.00013, 1],
      [-0.0, 2]
    ]
  },
  "QS_mulGraftNerve[MC]": {
    "red_x_points": [
      [-1e-5, 2],
      [-0.00016, 0],
      [-0.00013, 0],
      [-0.00013, 0],
      [-0.00017, 0],
      [-0.00011, 0],
      [-0.0001, 0],
      [-7e-5, 2],
      [-0.00011, 0],
      [-0.00024, 0],
      [-0.0, 2],
      [-0.00012, 0],
      [-5e-5, 2],
      [-0.00017, 0],
      [-0.00014, 0],
      [-1e-5, 2],
      [-3e-5, 2],
      [0.0, 2],
      [-0.00011, 0],
      [-3e-5, 2],
      [-5e-5, 2],
      [-6e-5, 2],
      [-0.00014, 0],
      [-0.00013, 0],
      [-6e-5, 2],
      [0.00028, 1],
      [-3e-5, 2],
      [-0.00014, 0],
      [-2e-5, 2]
    ],
    "red_o_points": [],
    "y_categories": ["N", "NOT APPLICABLE", "nan"],
    "blue_o_points": [],
    "blue_x_points": [
      [0.00058, 1],
      [-3e-5, 2],
      [-0.00013, 0],
      [-0.00011, 0],
      [-3e-5, 2],
      [0.00058, 1],
      [0.00045, 1],
      [-0.00011, 0],
      [-5e-5, 2],
      [-2e-5, 2],
      [-0.0001, 0],
      [0.00055, 1],
      [0.0, 2],
      [0.00068, 1],
      [-3e-5, 2]
    ]
  },
  "QS_mulLysisNerve[Ssr]": {
    "red_x_points": [
      [-0.00039, 3],
      [-0.00406, 0],
      [-0.00838, 2],
      [-0.00787, 2],
      [-0.00253, 0],
      [-0.00212, 0],
      [-0.00231, 0],
      [-0.00064, 3],
      [-0.00257, 0],
      [-0.0025, 0],
      [-0.00051, 3],
      [-0.0024, 0],
      [-0.00064, 3],
      [-0.00396, 0],
      [-0.00368, 0],
      [-0.00047, 3],
      [-0.00044, 3],
      [-0.0005, 3],
      [-0.0022, 0],
      [-0.00048, 3],
      [-0.00076, 3],
      [-0.00068, 3],
      [-0.00238, 0],
      [-0.00255, 0],
      [-0.00068, 3],
      [0.00936, 1],
      [-0.00064, 3],
      [-0.00231, 0],
      [-0.00076, 3]
    ],
    "red_o_points": [],
    "y_categories": ["N", "NOT APPLICABLE", "Y", "nan"],
    "blue_o_points": [],
    "blue_x_points": [
      [0.01454, 1],
      [-0.00026, 3],
      [-0.00122, 0],
      [-0.00178, 0],
      [-9e-5, 3],
      [0.01259, 1],
      [0.00922, 1],
      [-0.00138, 0],
      [-0.00047, 3],
      [-0.0001, 3],
      [-0.00151, 0],
      [0.01073, 1],
      [-0.00028, 3],
      [0.01023, 1],
      [-0.00016, 3]
    ]
  },
  "QS_mulGraftNerve[Sc]": {
    "red_x_points": [
      [-0.0, 2],
      [-5e-5, 0],
      [-5e-5, 0],
      [-0.0, 2],
      [-5e-5, 0],
      [-0.0, 2],
      [-5e-5, 0],
      [-5e-5, 0],
      [-0.0, 2],
      [-0.0, 2],
      [-5e-5, 0],
      [-0.0, 2],
      [-0.0, 2]
    ],
    "red_o_points": [],
    "y_categories": ["N", "NOT APPLICABLE", "nan"],
    "blue_o_points": [],
    "blue_x_points": [
      [0.00012, 1],
      [-0.0, 2],
      [-0.0, 2],
      [-5e-5, 0],
      [-0.0, 2],
      [-0.0, 2],
      [0.00012, 1],
      [0.00012, 1]
    ]
  },
  "QS_mulGraftNerve[Ra]": {
    "red_x_points": [
      [-4e-5, 2],
      [-0.00054, 0],
      [-0.00029, 0],
      [-0.00031, 0],
      [-0.00028, 0],
      [-0.0002, 0],
      [-0.00035, 0],
      [-9e-5, 2],
      [-0.00024, 0],
      [-0.00018, 0],
      [-4e-5, 2],
      [-0.00023, 0],
      [-3e-5, 2],
      [-0.0005, 0],
      [-0.00051, 0],
      [-5e-5, 2],
      [-3e-5, 2],
      [-6e-5, 2],
      [-0.00015, 0],
      [-2e-5, 2],
      [4e-5, 2],
      [-0.00011, 2],
      [-0.00021, 0],
      [-0.00027, 0],
      [-0.0001, 2],
      [0.00081, 1],
      [-0.00012, 2],
      [-0.00023, 0],
      [-6e-5, 2]
    ],
    "red_o_points": [],
    "y_categories": ["N", "NOT APPLICABLE", "nan"],
    "blue_o_points": [],
    "blue_x_points": [
      [0.00118, 1],
      [-0.0001, 2],
      [-0.0001, 0],
      [-0.00015, 0],
      [0.00011, 2],
      [0.00136, 1],
      [0.00041, 1],
      [-0.00022, 0],
      [-8e-5, 2],
      [0.00012, 2],
      [-0.00013, 0],
      [0.00086, 1],
      [-5e-5, 2],
      [0.0012, 1],
      [-4e-5, 2]
    ]
  },
  "QS_mulTransfSite[Oberlin]": {
    "red_x_points": [
      [-0.00129, 3],
      [-0.02061, 0],
      [-0.02084, 0],
      [-0.01968, 0],
      [-0.02033, 0],
      [0.00253, 2],
      [-0.0207, 0],
      [-0.00163, 3],
      [0.00258, 2],
      [0.00265, 2],
      [-0.00132, 3],
      [0.00247, 2],
      [-0.00177, 3],
      [0.00127, 2],
      [-0.01935, 0],
      [-0.00133, 3],
      [-0.00143, 3],
      [-0.0012, 3],
      [-0.01772, 0],
      [-0.00126, 3],
      [-0.00125, 3],
      [-0.00169, 3],
      [0.00236, 2],
      [-0.01945, 0],
      [-0.00165, 3],
      [0.02184, 1],
      [-0.00158, 3],
      [-0.02108, 0],
      [-0.00173, 3]
    ],
    "red_o_points": [],
    "y_categories": ["N", "NOT APPLICABLE", "Y", "nan"],
    "blue_o_points": [],
    "blue_x_points": [
      [0.03728, 1],
      [-0.00102, 3],
      [0.00459, 2],
      [0.00549, 2],
      [-0.00049, 3],
      [0.03071, 1],
      [0.02614, 1],
      [0.00361, 2],
      [-0.00092, 3],
      [-0.00075, 3],
      [0.00453, 2],
      [0.02763, 1],
      [-0.00077, 3],
      [0.02801, 1],
      [-0.00086, 3]
    ]
  },
  "QA_intPexForearmProna": {
    "red_x_points": [
      [-0.0005, 2],
      [-0.00057, 0],
      [-0.00045, 2],
      [-0.00017, 2],
      [-0.00031, 2],
      [-0.00199, 0],
      [-0.00035, 2],
      [-0.0156, 0],
      [-0.00042, 2],
      [-0.00054, 2],
      [-0.01509, 0],
      [-0.00205, 0],
      [-0.00039, 2],
      [-0.00026, 2],
      [1e-5, 2],
      [-0.01619, 0],
      [-0.01476, 0],
      [-0.01461, 0],
      [-0.00157, 0],
      [-0.00029, 2],
      [-0.00037, 2],
      [-0.00052, 2],
      [-0.00041, 2],
      [-0.00032, 2],
      [0.00018, 2],
      [0.0006, 1],
      [-0.0, 2],
      [-0.00184, 0],
      [-0.00039, 2]
    ],
    "red_o_points": [],
    "y_categories": ["GREATER THAN OR EQUALS TO 80", "LESS THAN 80", "nan"],
    "blue_o_points": [],
    "blue_x_points": [
      [-0.00015, 2],
      [0.04391, 1],
      [-0.00047, 0],
      [-0.00026, 2],
      [0.00069, 2],
      [4e-5, 2],
      [0.00153, 1],
      [0.00021, 2],
      [0.00012, 2],
      [0.00079, 2],
      [-0.00045, 0],
      [0.0001, 2],
      [0.00086, 2],
      [7e-5, 2],
      [0.04219, 1]
    ]
  },
  "QA_yonInjChesttube": {
    "red_x_points": [
      [-0.00211, 2],
      [-0.00217, 2],
      [0.00163, 0],
      [-0.00164, 2],
      [-0.00287, 2],
      [0.0013, 0],
      [-0.00435, 1],
      [-0.00153, 2],
      [-0.00343, 2],
      [-0.00284, 2],
      [0.00125, 0],
      [0.00322, 0],
      [-0.00298, 2],
      [-0.00312, 2],
      [0.00087, 0],
      [0.00117, 0],
      [0.00102, 0],
      [0.00128, 0],
      [-0.0039, 1],
      [-0.0016, 2],
      [-0.0139, 1],
      [-0.00241, 2],
      [-0.00342, 2],
      [0.00235, 0],
      [-0.00255, 2],
      [-8e-5, 2],
      [-0.00194, 2],
      [0.0007, 0],
      [-0.00287, 2]
    ],
    "red_o_points": [],
    "y_categories": ["N", "Y", "nan"],
    "blue_o_points": [],
    "blue_x_points": [
      [0.00027, 1],
      [-0.00072, 2],
      [0.00393, 0],
      [0.0046, 0],
      [-0.0019, 2],
      [-1e-5, 2],
      [0.00606, 0],
      [0.01397, 0],
      [0.01159, 0],
      [0.00338, 0],
      [-2e-5, 2],
      [0.00383, 0],
      [-2e-5, 2],
      [-4e-5, 2]
    ]
  },
  "QA_yonPexPain": {
    "red_x_points": [
      [-0.00613, 1],
      [-0.00067, 1],
      [-0.00087, 1],
      [-0.00046, 1],
      [-0.00054, 1],
      [-0.00127, 0],
      [-0.00026, 1],
      [-0.00514, 1],
      [-0.00155, 0],
      [-0.00021, 1],
      [-0.00393, 1],
      [-0.00101, 0],
      [-0.00715, 1],
      [-0.00048, 1],
      [-0.00036, 1],
      [0.00498, 0],
      [-0.0041, 1],
      [0.00541, 0],
      [-0.00047, 1],
      [0.00668, 0],
      [-0.01388, 2],
      [-0.00664, 1],
      [-8e-5, 1],
      [-0.00095, 1],
      [-0.01189, 2],
      [-0.00075, 1],
      [-0.00562, 1],
      [-7e-5, 1],
      [-0.00713, 1]
    ],
    "red_o_points": [],
    "y_categories": ["N", "Y", "nan"],
    "blue_o_points": [],
    "blue_x_points": [
      [-0.00012, 1],
      [0.016, 0],
      [0.00273, 0],
      [0.00102, 1],
      [-0.00418, 1],
      [0.00051, 2],
      [-0.0, 1],
      [0.00234, 1],
      [0.01991, 0],
      [0.01602, 0],
      [0.00084, 1],
      [0.00095, 0],
      [0.00953, 0],
      [-0.00013, 1],
      [-0.00087, 1]
    ]
  },
  "QS_mulGraftNerve[FI]": {
    "red_x_points": [
      [-2e-5, 2],
      [-0.00053, 0],
      [-0.00037, 0],
      [-0.0003, 0],
      [-0.00039, 0],
      [-0.00033, 0],
      [-0.0003, 0],
      [-5e-5, 2],
      [-0.00042, 0],
      [-0.00031, 0],
      [-2e-5, 2],
      [-0.00033, 0],
      [-8e-5, 2],
      [-0.00063, 0],
      [-0.00036, 0],
      [0.0, 2],
      [0.0, 2],
      [-3e-5, 2],
      [-0.00027, 0],
      [0.0, 2],
      [-9e-5, 2],
      [-4e-5, 2],
      [-0.00041, 0],
      [-0.00043, 0],
      [-5e-5, 2],
      [0.00077, 1],
      [-6e-5, 2],
      [-0.00032, 0],
      [-3e-5, 2]
    ],
    "red_o_points": [],
    "y_categories": ["N", "NOT APPLICABLE", "nan"],
    "blue_o_points": [],
    "blue_x_points": [
      [0.0019, 1],
      [-3e-5, 2],
      [-0.00029, 0],
      [-0.00029, 0],
      [-4e-5, 2],
      [0.00122, 1],
      [0.00115, 1],
      [-0.00025, 0],
      [2e-5, 2],
      [-6e-5, 2],
      [-0.00029, 0],
      [0.00124, 1],
      [-3e-5, 2],
      [0.0011, 1],
      [2e-5, 2]
    ]
  },
  "QA_lstPexPalle[Ulna]": {
    "red_x_points": [
      [-0.00054, 4],
      [-0.0028, 4],
      [-0.00219, 4],
      [-0.0073, 2],
      [-0.00317, 4],
      [-0.0095, 1],
      [-0.00284, 4],
      [-0.00046, 4],
      [-0.00356, 4],
      [0.0114, 3],
      [-0.00917, 1],
      [-0.00312, 4],
      [-0.00055, 4],
      [-0.0033, 4],
      [-0.00159, 4],
      [0.00451, 3],
      [-0.00991, 0],
      [0.00322, 3],
      [-0.00749, 0],
      [0.00439, 3],
      [-0.00053, 4],
      [-0.00055, 4],
      [-0.00347, 4],
      [-0.003, 4],
      [-0.00045, 4],
      [0.00244, 3],
      [-0.00029, 4],
      [-0.00739, 0],
      [-0.00057, 4]
    ],
    "red_o_points": [],
    "y_categories": ["ABS", "HYPO", "NAIA", "PT", "nan"],
    "blue_o_points": [],
    "blue_x_points": [
      [-0.00032, 4],
      [-4e-5, 4],
      [0.01496, 3],
      [0.01744, 3],
      [0.00016, 4],
      [-0.00015, 4],
      [0.00232, 3],
      [-0.00246, 4],
      [0.00017, 4],
      [0.00017, 4],
      [0.01334, 3],
      [-0.00014, 4],
      [0.00451, 3],
      [-0.00013, 4],
      [0.00795, 3]
    ]
  }
}
