{
  "QA_lstPexPain[C8]": {
    "red_x_points": [
      [0.01233, 0],
      [-0.00883, 2],
      [-0.01201, 2],
      [0.00992, 0],
      [-0.0073, 2],
      [-0.00842, 1],
      [-0.01388, 1],
      [-0.01295, 1],
      [-0.01234, 2],
      [-0.01186, 2],
      [-0.02151, 2],
      [-0.00589, 2],
      [-0.01836, 1],
      [0.01501, 0],
      [-0.01396, 1],
      [-0.01541, 1],
      [-0.0051, 2],
      [-0.01252, 2],
      [-0.02181, 2],
      [-0.01063, 2],
      [-0.01641, 1],
      [-0.00594, 1],
      [-0.02333, 1]
    ],
    "red_o_points": [],
    "y_categories": ["NORM", "NPV", "nan"],
    "blue_o_points": [],
    "blue_x_points": [
      [-0.01326, 1],
      [-0.0106, 1],
      [0.01805, 0],
      [-0.00124, 1],
      [0.02734, 0],
      [0.02918, 0],
      [0.0231, 0],
      [0.01853, 0],
      [-0.00943, 2],
      [0.00049, 2],
      [-0.00506, 2],
      [-0.00195, 1],
      [-0.00633, 2],
      [0.02225, 0],
      [0.02067, 0],
      [0.01918, 0],
      [-0.00778, 2],
      [0.02043, 0],
      [0.02076, 0],
      [0.02837, 0],
      [0.02848, 0]
    ]
  },
  "QA_lstPexPain[C7]": {
    "red_x_points": [
      [-0.01766, 1],
      [-0.01406, 2],
      [-0.01518, 2],
      [-0.0151, 1],
      [-0.01256, 2],
      [-0.00969, 1],
      [-0.01338, 1],
      [-0.01654, 1],
      [-0.01714, 2],
      [-0.01707, 2],
      [-0.02288, 2],
      [-0.01193, 2],
      [-0.01603, 1],
      [0.02598, 0],
      [-0.01684, 1],
      [-0.01358, 1],
      [-0.01134, 2],
      [-0.01984, 2],
      [-0.02662, 2],
      [-0.01789, 2],
      [-0.01913, 1],
      [-0.00948, 1],
      [-0.01759, 1]
    ],
    "red_o_points": [],
    "y_categories": ["NORM", "NPV", "nan"],
    "blue_o_points": [],
    "blue_x_points": [
      [-0.01197, 1],
      [-0.01215, 1],
      [0.03662, 0],
      [-0.00477, 1],
      [0.0477, 0],
      [-0.00591, 1],
      [0.04339, 0],
      [0.04801, 0],
      [-0.01406, 2],
      [-0.00157, 2],
      [-0.0107, 2],
      [-0.00532, 1],
      [-0.01025, 2],
      [0.03811, 0],
      [0.03628, 0],
      [0.03793, 0],
      [-0.01173, 2],
      [0.03737, 0],
      [0.05364, 0],
      [-0.01345, 1],
      [0.04836, 0]
    ]
  },
  "QA_yonPreFracture": {
    "red_x_points": [
      [-0.06074, 1],
      [0.00123, 2],
      [0.00852, 0],
      [0.00485, 2],
      [0.00951, 0],
      [0.00911, 0],
      [-0.05067, 1],
      [0.0113, 0],
      [-0.00028, 2],
      [-0.06868, 1],
      [-0.07074, 1],
      [-0.05115, 1],
      [0.00298, 2],
      [0.01209, 0],
      [0.01191, 0],
      [0.00999, 0],
      [0.00922, 0],
      [0.01531, 0],
      [-0.06867, 1],
      [0.0092, 0],
      [0.0001, 2],
      [-0.03865, 1],
      [0.00117, 2]
    ],
    "red_o_points": [],
    "y_categories": ["N", "Y", "nan"],
    "blue_o_points": [],
    "blue_x_points": [
      [0.01519, 0],
      [0.01056, 2],
      [0.01486, 0],
      [0.01535, 0],
      [0.00904, 2],
      [0.0174, 0],
      [0.01472, 0],
      [0.01679, 2],
      [0.00546, 2],
      [0.01791, 0],
      [0.02128, 0],
      [0.0233, 0],
      [0.01955, 0],
      [0.01133, 0],
      [0.01122, 0],
      [0.00895, 2],
      [0.01963, 0],
      [0.0162, 0],
      [0.01219, 0],
      [0.00569, 2],
      [0.00646, 2]
    ]
  },
  "QA_lstPexTouch[C7]": {
    "red_x_points": [
      [-0.0259, 1],
      [-0.00818, 2],
      [-0.01788, 1],
      [-0.01825, 1],
      [-0.00585, 2],
      [-0.01411, 1],
      [-0.02099, 1],
      [-0.02245, 1],
      [-0.00688, 2],
      [-0.01386, 2],
      [-0.02433, 1],
      [-0.00528, 2],
      [-0.0249, 1],
      [0.02108, 0],
      [-0.02308, 1],
      [-0.02026, 1],
      [-0.00342, 2],
      [0.01694, 0],
      [-0.01648, 1],
      [-0.01025, 2],
      [-0.02813, 1],
      [-0.0135, 1],
      [-0.02706, 1]
    ],
    "red_o_points": [],
    "y_categories": ["NORM", "NPV", "nan"],
    "blue_o_points": [],
    "blue_x_points": [
      [-0.02099, 1],
      [-0.01839, 1],
      [0.03769, 0],
      [-0.01103, 1],
      [0.0392, 0],
      [-0.01363, 1],
      [0.04224, 0],
      [-0.01236, 1],
      [-0.00018, 2],
      [0.00971, 2],
      [-0.00035, 2],
      [-0.01402, 1],
      [0.00316, 2],
      [0.03237, 0],
      [0.02906, 0],
      [0.03243, 0],
      [0.0037, 2],
      [0.02937, 0],
      [0.04662, 0],
      [0.05363, 0],
      [0.0448, 0]
    ]
  },
  "QA_lstPexTouch[C6]": {
    "red_x_points": [
      [-0.00879, 1],
      [-0.00378, 2],
      [-0.00649, 1],
      [-0.00396, 1],
      [-0.00481, 2],
      [-0.00249, 1],
      [-0.00285, 1],
      [-0.00865, 1],
      [-0.0049, 2],
      [-0.00555, 2],
      [-0.0056, 1],
      [-0.00218, 2],
      [-0.00662, 1],
      [-0.00644, 1],
      [-0.00951, 1],
      [-0.0042, 1],
      [-0.00229, 2],
      [-0.0095, 1],
      [-0.00394, 1],
      [-0.01299, 2],
      [-0.00848, 1],
      [-0.00264, 1],
      [-0.00696, 1]
    ],
    "red_o_points": [],
    "y_categories": ["NORM", "NPV", "nan"],
    "blue_o_points": [],
    "blue_x_points": [
      [-0.0043, 1],
      [-0.00461, 1],
      [0.02622, 0],
      [-0.00263, 1],
      [0.03939, 0],
      [-0.00274, 1],
      [-0.00275, 1],
      [-0.0035, 1],
      [-0.00035, 2],
      [0.00889, 2],
      [0.00067, 2],
      [-0.00351, 1],
      [0.00215, 2],
      [-0.00446, 1],
      [-0.00327, 1],
      [0.02457, 0],
      [0.00286, 2],
      [0.02008, 0],
      [0.04901, 0],
      [-0.00447, 1],
      [-0.00364, 1]
    ]
  },
  "participant_code": {
    "red_x_points": [
      [-0.08974, 0],
      [-0.09178, 2],
      [-0.08916, 3],
      [-0.09295, 4],
      [-0.09324, 5],
      [-0.09188, 9],
      [-0.09013, 14],
      [-0.0911, 17],
      [-0.09295, 19],
      [-0.09042, 20],
      [-0.09168, 22],
      [-0.09159, 23],
      [-0.09266, 24],
      [-0.09159, 26],
      [-0.09149, 28],
      [-0.09052, 29],
      [-0.09042, 31],
      [-0.09246, 35],
      [-0.09314, 37],
      [-0.09479, 39],
      [-0.09324, 41],
      [-0.09217, 42],
      [-0.0945, 43]
    ],
    "red_o_points": [],
    "y_categories": [
      "P16554",
      "P18297",
      "P19283",
      "P19287",
      "P23172",
      "P23391",
      "P30595",
      "P31645",
      "P31691",
      "P34778",
      "P35046",
      "P36328",
      "P43633",
      "P4544",
      "P46417",
      "P48965",
      "P53068",
      "P5497",
      "P58556",
      "P59529",
      "P62483",
      "P64658",
      "P65202",
      "P66816",
      "P67052",
      "P6751",
      "P7408",
      "P75566",
      "P76226",
      "P79971",
      "P82621",
      "P82990",
      "P84549",
      "P84932",
      "P85825",
      "P86989",
      "P8770",
      "P87791",
      "P90550",
      "P93159",
      "P94969",
      "P96710",
      "P9744",
      "P98500",
      "nan"
    ],
    "blue_o_points": [],
    "blue_x_points": [
      [0.09965, 1],
      [0.10294, 6],
      [0.10366, 7],
      [0.10263, 8],
      [0.1016, 10],
      [0.10109, 11],
      [0.10037, 12],
      [0.09883, 13],
      [0.10078, 15],
      [0.1015, 16],
      [0.1015, 18],
      [0.09708, 21],
      [0.10191, 25],
      [0.10201, 27],
      [0.09831, 30],
      [0.1014, 32],
      [0.10016, 33],
      [0.09841, 34],
      [0.09883, 36],
      [0.10201, 38],
      [0.09893, 40]
    ]
  },
  "QA_lstPexArthre[Shoulder]": {
    "red_x_points": [
      [0.00973, 2],
      [-0.00216, 3],
      [-0.00739, 3],
      [0.01303, 2],
      [-0.02284, 0],
      [-0.02706, 1],
      [0.0117, 2],
      [0.01437, 2],
      [-0.00281, 3],
      [0.00466, 2],
      [-0.00713, 3],
      [-0.00167, 3],
      [-0.00956, 3],
      [-0.06779, 1],
      [0.0123, 2],
      [-0.03608, 1],
      [-0.00121, 3],
      [-0.00651, 3],
      [-0.01243, 3],
      [-0.00258, 3],
      [-0.00696, 3],
      [-0.02342, 1],
      [-0.00838, 3]
    ],
    "red_o_points": [],
    "y_categories": ["NAIA", "NPV", "PV", "nan"],
    "blue_o_points": [],
    "blue_x_points": [
      [0.02232, 2],
      [-0.00597, 3],
      [0.01272, 2],
      [0.01597, 2],
      [-0.00017, 3],
      [0.01796, 2],
      [0.0183, 2],
      [0.01903, 2],
      [-0.00182, 3],
      [-0.00027, 3],
      [-0.00113, 3],
      [0.02379, 2],
      [-0.00037, 3],
      [0.01515, 2],
      [0.01142, 2],
      [-0.00265, 1],
      [-0.00078, 3],
      [0.00877, 2],
      [0.00079, 3],
      [0.0173, 2],
      [0.00984, 2]
    ]
  },
  "QS_mulTransfSite[Oberlin]": {
    "red_x_points": [
      [-0.02591, 1],
      [-0.07147, 0],
      [-0.07021, 0],
      [-0.07672, 0],
      [-0.06893, 0],
      [-0.06664, 0],
      [0.01819, 3],
      [-0.03004, 1],
      [0.02252, 3],
      [0.02464, 2],
      [0.01999, 3],
      [-0.07102, 0],
      [0.02011, 3],
      [0.02837, 2],
      [-0.03573, 1],
      [0.01924, 3],
      [-0.06897, 0],
      [0.01981, 3],
      [0.02994, 2],
      [-0.07604, 0],
      [-0.0292, 1],
      [-0.06634, 0],
      [0.01971, 3]
    ],
    "red_o_points": [],
    "y_categories": ["N", "NOT APPLICABLE", "Y", "nan"],
    "blue_o_points": [],
    "blue_x_points": [
      [0.02641, 3],
      [0.02289, 3],
      [0.03472, 2],
      [0.04023, 2],
      [0.02284, 3],
      [0.03871, 2],
      [0.03451, 2],
      [0.03735, 2],
      [0.02856, 3],
      [-0.00224, 1],
      [0.0344, 2],
      [0.04411, 2],
      [0.02464, 3],
      [0.02355, 3],
      [0.02274, 3],
      [0.02186, 3],
      [0.02636, 3],
      [0.02117, 3],
      [-0.01303, 1],
      [0.0227, 3],
      [0.02222, 3]
    ]
  },
  "QA_yonPexPain": {
    "red_x_points": [
      [-0.02263, 1],
      [-0.02753, 1],
      [-0.02276, 1],
      [-0.02086, 1],
      [-0.02488, 1],
      [-0.02009, 1],
      [-0.02054, 1],
      [-0.02179, 1],
      [-0.03155, 1],
      [-0.02873, 1],
      [0.02758, 0],
      [-0.02512, 1],
      [-0.02226, 1],
      [-0.02419, 1],
      [0.02869, 0],
      [-0.0238, 1],
      [-0.02617, 1],
      [-0.02873, 1],
      [-0.02327, 1],
      [-0.02753, 1],
      [-0.02363, 1],
      [-0.01893, 1],
      [-0.03204, 1]
    ],
    "red_o_points": [],
    "y_categories": ["N", "Y", "nan"],
    "blue_o_points": [],
    "blue_x_points": [
      [-0.02374, 1],
      [0.05052, 0],
      [0.03666, 0],
      [0.04347, 0],
      [-0.01874, 1],
      [0.04398, 0],
      [-0.01998, 1],
      [-0.01921, 1],
      [-0.02995, 1],
      [0.07437, 2],
      [0.05554, 0],
      [-0.02435, 1],
      [0.05653, 0],
      [0.03683, 0],
      [0.03518, 0],
      [0.03691, 0],
      [0.07198, 2],
      [0.04117, 0],
      [-0.01925, 1],
      [-0.02236, 1],
      [0.05521, 2]
    ]
  },
  "QA_lstPexMuscstrength[FingersFlex]": {
    "red_x_points": [
      [0.00429, 2],
      [0.00474, 2],
      [-0.05859, 1],
      [0.01781, 0],
      [-0.05762, 1],
      [-0.05197, 1],
      [-0.06118, 1],
      [0.01778, 0],
      [0.00611, 2],
      [0.00488, 2],
      [0.01787, 0],
      [0.00428, 2],
      [-0.06727, 1],
      [0.0182, 0],
      [0.01764, 0],
      [-0.06575, 1],
      [-0.05726, 1],
      [0.00636, 2],
      [0.01681, 0],
      [0.01042, 0],
      [0.00341, 2],
      [-0.05495, 1],
      [0.00339, 2]
    ],
    "red_o_points": [],
    "y_categories": ["GREATER THAN OR EQUALS TO 3", "LESS THAN 3", "nan"],
    "blue_o_points": [],
    "blue_x_points": [
      [0.02722, 0],
      [0.02363, 0],
      [0.01658, 0],
      [0.01905, 0],
      [0.02333, 0],
      [0.01902, 0],
      [0.01868, 0],
      [0.01976, 0],
      [0.00716, 2],
      [0.00868, 2],
      [0.00835, 2],
      [0.00933, 2],
      [0.00926, 2],
      [0.02062, 0],
      [0.01953, 0],
      [0.01934, 0],
      [0.01076, 2],
      [0.00676, 2],
      [0.01963, 0],
      [0.00796, 2],
      [0.00591, 2]
    ]
  },
  "QA_lstPexTouch[C8]": {
    "red_x_points": [
      [0.01392, 0],
      [-0.00837, 2],
      [-0.01783, 1],
      [-0.02332, 1],
      [-0.00505, 2],
      [-0.01026, 1],
      [-0.01573, 1],
      [-0.01804, 1],
      [-0.00809, 2],
      [-0.00901, 2],
      [-0.02052, 1],
      [-0.00363, 2],
      [-0.02591, 1],
      [0.02038, 0],
      [-0.01699, 1],
      [-0.01576, 1],
      [-0.00299, 2],
      [0.00874, 0],
      [-0.01528, 1],
      [-0.01419, 2],
      [-0.02065, 1],
      [-0.01258, 1],
      [-0.02635, 1]
    ],
    "red_o_points": [],
    "y_categories": ["NORM", "NPV", "nan"],
    "blue_o_points": [],
    "blue_x_points": [
      [-0.01711, 1],
      [-0.02009, 1],
      [0.02368, 0],
      [-0.01055, 1],
      [0.03592, 0],
      [-0.01026, 1],
      [0.02844, 0],
      [0.03401, 0],
      [-0.0015, 2],
      [0.00637, 2],
      [0.00096, 2],
      [-0.01161, 1],
      [0.00454, 2],
      [0.02398, 0],
      [0.02097, 0],
      [0.02558, 0],
      [0.00407, 2],
      [0.01773, 0],
      [0.02778, 0],
      [0.03627, 0],
      [0.0283, 0]
    ]
  },
  "QA_equInjTbpiTime": {
    "red_x_points": [
      [-0.02565, 0],
      [-0.02277, 0],
      [0.00402, 3],
      [0.00423, 3],
      [-0.01862, 0],
      [-0.01441, 0],
      [-0.01522, 0],
      [-0.02572, 0],
      [0.00477, 3],
      [-0.02457, 0],
      [-0.02137, 0],
      [-0.02166, 0],
      [0.00337, 3],
      [0.00296, 3],
      [-0.02742, 0],
      [-0.01589, 0],
      [-0.02734, 2],
      [-0.05327, 2],
      [-0.01977, 0],
      [-0.04102, 2],
      [-0.02572, 0],
      [0.00387, 3],
      [0.02063, 1]
    ],
    "red_o_points": [],
    "y_categories": [
      "0 TO 6 MONTHS",
      "13 TO 24 MONTHS",
      "25 MONTHS OR MORE",
      "7 TO 12 MONTHS",
      "nan"
    ],
    "blue_o_points": [],
    "blue_x_points": [
      [-0.01769, 0],
      [0.04823, 1],
      [-0.01457, 0],
      [0.05189, 1],
      [0.00858, 3],
      [-0.01795, 0],
      [-0.01294, 0],
      [0.00971, 3],
      [-0.01927, 0],
      [0.00383, 2],
      [0.06044, 1],
      [0.01688, 3],
      [0.06222, 1],
      [0.0101, 3],
      [0.04585, 1],
      [0.0409, 1],
      [0.01541, 3],
      [0.0381, 1],
      [0.02243, 3],
      [0.01487, 3],
      [-0.01041, 0]
    ]
  }
}
