{
  "QA_lstPexMuscstrength[ElbowFlex]": {
    "red_x_points": [
      [-0.01505, 1],
      [-0.00109, 2],
      [-0.01364, 1],
      [-0.01274, 1],
      [-0.0134, 1],
      [-0.01501, 1],
      [-0.013, 1],
      [-0.01352, 1],
      [-0.01424, 1],
      [-0.01568, 1],
      [-0.01489, 1],
      [-0.01569, 1],
      [-0.00109, 2],
      [-0.00591, 2],
      [0.00219, 2],
      [-0.01486, 1],
      [-0.01436, 1],
      [-0.01385, 1],
      [-0.01316, 1],
      [-0.01418, 1],
      [-0.00097, 2],
      [-0.01371, 1],
      [-0.01564, 1],
      [-0.0148, 1],
      [-0.01286, 1],
      [0.00114, 2],
      [-0.01287, 1],
      [-0.01397, 1],
      [-0.00081, 2]
    ],
    "red_o_points": [],
    "y_categories": ["GREATER THAN OR EQUALS TO 3", "LESS THAN 3", "nan"],
    "blue_o_points": [],
    "blue_x_points": [
      [0.002, 2],
      [-0.01284, 1],
      [0.07619, 0],
      [-0.01362, 1],
      [0.00483, 2],
      [0.004, 2],
      [0.04875, 0],
      [-0.01112, 1],
      [-0.01249, 1],
      [0.00329, 2],
      [0.07548, 0],
      [0.05097, 0],
      [0.06314, 0],
      [0.05168, 0],
      [-0.01259, 1]
    ]
  },
  "participant_code": {
    "red_x_points": [
      [-0.0497, 1],
      [-0.04778, 2],
      [-0.0484, 3],
      [-0.04772, 4],
      [-0.04662, 5],
      [-0.04922, 8],
      [-0.0473, 9],
      [-0.04868, 10],
      [-0.04772, 11],
      [-0.0473, 13],
      [-0.04868, 14],
      [-0.04806, 18],
      [-0.04806, 19],
      [-0.04861, 20],
      [-0.04758, 23],
      [-0.04703, 26],
      [-0.04888, 28],
      [-0.04888, 29],
      [-0.04696, 30],
      [-0.04778, 31],
      [-0.04881, 32],
      [-0.0473, 34],
      [-0.04874, 36],
      [-0.04744, 38],
      [-0.04662, 39],
      [-0.04833, 40],
      [-0.04614, 41],
      [-0.04813, 42],
      [-0.04669, 43]
    ],
    "red_o_points": [],
    "y_categories": [
      "P16554",
      "P18297",
      "P19283",
      "P19287",
      "P23172",
      "P23391",
      "P30595",
      "P31645",
      "P31691",
      "P34778",
      "P35046",
      "P36328",
      "P43633",
      "P4544",
      "P46417",
      "P48965",
      "P53068",
      "P5497",
      "P58556",
      "P59529",
      "P62483",
      "P64658",
      "P65202",
      "P66816",
      "P6751",
      "P7408",
      "P75566",
      "P76226",
      "P79971",
      "P82621",
      "P82990",
      "P84549",
      "P84932",
      "P85825",
      "P86989",
      "P8770",
      "P87791",
      "P90550",
      "P93159",
      "P94969",
      "P96710",
      "P97130",
      "P9744",
      "P98500",
      "nan"
    ],
    "blue_o_points": [],
    "blue_x_points": [
      [0.09566, 0],
      [0.09198, 6],
      [0.09172, 7],
      [0.0933, 12],
      [0.09146, 15],
      [0.09132, 16],
      [0.08935, 17],
      [0.09224, 21],
      [0.09277, 22],
      [0.09382, 24],
      [0.09487, 25],
      [0.09172, 27],
      [0.09382, 33],
      [0.09238, 35],
      [0.09277, 37]
    ]
  },
  "QS_mulLysisTrunk[Upper]": {
    "red_x_points": [
      [-0.00042, 3],
      [-0.00519, 0],
      [-0.00318, 0],
      [-0.00282, 0],
      [-0.00303, 0],
      [-0.01097, 2],
      [-0.0032, 0],
      [-0.00086, 3],
      [-0.00315, 0],
      [-0.0031, 0],
      [-0.00039, 3],
      [-0.00317, 0],
      [-0.00123, 3],
      [-0.00509, 0],
      [-0.01046, 2],
      [-0.00048, 3],
      [-0.00052, 3],
      [-0.00019, 3],
      [-0.00292, 0],
      [-0.00033, 3],
      [-0.00108, 3],
      [-0.00084, 3],
      [-0.00348, 0],
      [-0.00268, 0],
      [-0.0007, 3],
      [0.01212, 1],
      [-0.00064, 3],
      [-0.01252, 2],
      [-0.00112, 3]
    ],
    "red_o_points": [],
    "y_categories": ["N", "NOT APPLICABLE", "Y", "nan"],
    "blue_o_points": [],
    "blue_x_points": [
      [0.02527, 1],
      [-0.00035, 3],
      [-0.001, 0],
      [-0.00156, 0],
      [0.00031, 3],
      [0.01762, 1],
      [0.01131, 1],
      [-0.00164, 0],
      [-0.00045, 3],
      [-0.00016, 3],
      [-0.001, 0],
      [0.0113, 1],
      [-0.00013, 3],
      [0.01236, 1],
      [-0.00023, 3]
    ]
  },
  "QS_mulTransfSite[Oberlin]": {
    "red_x_points": [
      [-0.00181, 3],
      [-0.02983, 0],
      [-0.03035, 0],
      [-0.02588, 0],
      [-0.03028, 0],
      [0.00475, 2],
      [-0.03078, 0],
      [-0.00265, 3],
      [0.00457, 2],
      [0.00416, 2],
      [-0.00197, 3],
      [0.00448, 2],
      [-0.00302, 3],
      [0.00333, 2],
      [-0.02448, 0],
      [-0.00192, 3],
      [-0.00193, 3],
      [-0.00157, 3],
      [-0.02312, 0],
      [-0.00174, 3],
      [-0.00276, 3],
      [-0.00264, 3],
      [0.00462, 2],
      [-0.02929, 0],
      [-0.0022, 3],
      [0.03088, 1],
      [-0.00229, 3],
      [-0.02898, 0],
      [-0.00273, 3]
    ],
    "red_o_points": [],
    "y_categories": ["N", "NOT APPLICABLE", "Y", "nan"],
    "blue_o_points": [],
    "blue_x_points": [
      [0.05566, 1],
      [-0.00159, 3],
      [0.00804, 2],
      [0.0107, 2],
      [-0.00066, 3],
      [0.04118, 1],
      [0.03335, 1],
      [0.00502, 2],
      [-0.00141, 3],
      [-0.00089, 3],
      [0.00752, 2],
      [0.03652, 1],
      [-0.00085, 3],
      [0.03403, 1],
      [-0.00117, 3]
    ]
  },
  "QS_mulTransfSite[IMc]": {
    "red_x_points": [
      [-0.00101, 3],
      [-0.02049, 2],
      [-0.00292, 0],
      [-0.0156, 2],
      [-0.00302, 0],
      [-0.00334, 0],
      [-0.0035, 0],
      [-0.00145, 3],
      [-0.00348, 0],
      [-0.00303, 0],
      [-0.00084, 3],
      [-0.00298, 0],
      [-0.00219, 3],
      [-0.00524, 0],
      [-0.01714, 2],
      [-0.00108, 3],
      [-0.00133, 3],
      [-0.0006, 3],
      [-0.00319, 0],
      [-0.00102, 3],
      [-0.00253, 3],
      [-0.00165, 3],
      [-0.00318, 0],
      [-0.02052, 2],
      [-0.00117, 3],
      [0.0193, 1],
      [-0.00144, 3],
      [-0.01771, 2],
      [-0.00214, 3]
    ],
    "red_o_points": [],
    "y_categories": ["N", "NOT APPLICABLE", "Y", "nan"],
    "blue_o_points": [],
    "blue_x_points": [
      [0.03741, 1],
      [-0.00102, 3],
      [0.00115, 0],
      [0.00056, 0],
      [2e-5, 3],
      [0.0291, 1],
      [0.01795, 1],
      [-0.00141, 0],
      [-0.00086, 3],
      [-0.00044, 3],
      [0.00062, 0],
      [0.02094, 1],
      [-0.00012, 3],
      [0.0216, 1],
      [-0.00101, 3]
    ]
  },
  "QS_mulLysisSite[Nerve]": {
    "red_x_points": [
      [5e-5, 3],
      [-0.00223, 0],
      [-0.0049, 2],
      [-0.00428, 2],
      [-0.00145, 0],
      [-0.00128, 0],
      [-0.00124, 0],
      [-0.00049, 3],
      [-0.00183, 0],
      [-0.00129, 0],
      [1e-5, 3],
      [-0.00132, 0],
      [-0.00066, 3],
      [-0.00262, 0],
      [-0.00217, 0],
      [1e-5, 3],
      [2e-5, 3],
      [-6e-5, 3],
      [-0.00127, 0],
      [0.0001, 3],
      [-0.00071, 3],
      [-0.00058, 3],
      [-0.00125, 0],
      [-0.00151, 0],
      [-0.00053, 3],
      [0.00502, 1],
      [-0.00068, 3],
      [-0.00106, 0],
      [-0.00074, 3]
    ],
    "red_o_points": [],
    "y_categories": ["N", "NOT APPLICABLE", "Y", "nan"],
    "blue_o_points": [],
    "blue_x_points": [
      [0.01049, 1],
      [-0.00018, 3],
      [-0.0007, 0],
      [-0.00113, 0],
      [0.00027, 3],
      [0.00677, 1],
      [0.00347, 1],
      [-0.00072, 0],
      [-9e-5, 3],
      [-0.0, 3],
      [-0.00045, 0],
      [0.00565, 1],
      [0.00011, 3],
      [0.0055, 1],
      [-6e-5, 3]
    ]
  },
  "QS_mulNeuromadSite[C8]": {
    "red_x_points": [
      [-2e-5, 2],
      [-7e-5, 0],
      [-9e-5, 0],
      [-3e-5, 0],
      [-8e-5, 0],
      [-3e-5, 0],
      [-3e-5, 0],
      [-2e-5, 2],
      [-6e-5, 0],
      [-2e-5, 2],
      [-3e-5, 0],
      [-4e-5, 2],
      [-0.00015, 0],
      [-3e-5, 0],
      [-2e-5, 2],
      [-2e-5, 2],
      [-2e-5, 2],
      [-3e-5, 0],
      [-2e-5, 2],
      [-1e-5, 2],
      [-1e-5, 2],
      [-3e-5, 0],
      [-3e-5, 0],
      [-2e-5, 2],
      [-3e-5, 0],
      [-6e-5, 2]
    ],
    "red_o_points": [],
    "y_categories": ["N", "NOT APPLICABLE", "nan"],
    "blue_o_points": [],
    "blue_x_points": [
      [0.00057, 1],
      [-1e-5, 2],
      [-3e-5, 0],
      [-3e-5, 0],
      [-2e-5, 2],
      [0.00013, 1],
      [0.00013, 1],
      [-3e-5, 0],
      [-2e-5, 2],
      [-3e-5, 0],
      [0.00013, 1],
      [-2e-5, 2],
      [0.00013, 1]
    ]
  },
  "QS_mulTransfSite[AcMc]": {
    "red_x_points": [
      [4e-5, 3],
      [-0.0006, 0],
      [-0.00021, 0],
      [-9e-5, 0],
      [-0.00025, 0],
      [-0.0001, 0],
      [-0.00015, 0],
      [-0.0, 3],
      [-0.00022, 0],
      [-0.00371, 2],
      [3e-5, 3],
      [-2e-5, 0],
      [4e-5, 3],
      [-0.00034, 0],
      [-0.00036, 0],
      [7e-5, 3],
      [2e-5, 3],
      [-1e-5, 3],
      [-0.0, 0],
      [2e-5, 3],
      [-3e-5, 3],
      [-2e-5, 3],
      [0.00013, 0],
      [-0.00016, 0],
      [-5e-5, 3],
      [0.00039, 1],
      [-7e-5, 3],
      [-0.00026, 0],
      [3e-5, 3]
    ],
    "red_o_points": [],
    "y_categories": ["N", "NOT APPLICABLE", "Y", "nan"],
    "blue_o_points": [],
    "blue_x_points": [
      [0.00253, 1],
      [9e-5, 3],
      [0.00033, 0],
      [0.00029, 0],
      [6e-5, 3],
      [0.00075, 1],
      [0.0001, 1],
      [0.00038, 0],
      [9e-5, 3],
      [3e-5, 3],
      [0.0004, 0],
      [0.00029, 1],
      [3e-5, 3],
      [0.00044, 1],
      [7e-5, 3]
    ]
  },
  "QS_mulTransfSite[Other]": {
    "red_x_points": [
      [-0.00101, 3],
      [-0.01254, 0],
      [-0.00998, 0],
      [-0.00862, 0],
      [-0.00976, 0],
      [-0.01046, 0],
      [-0.01047, 0],
      [-0.00135, 3],
      [-0.01094, 0],
      [-0.01077, 0],
      [-0.00096, 3],
      [-0.01083, 0],
      [-0.00167, 3],
      [-0.01324, 0],
      [-0.00958, 0],
      [-0.00093, 3],
      [-0.001, 3],
      [-0.00086, 3],
      [-0.00793, 0],
      [-0.00111, 3],
      [-0.00163, 3],
      [-0.00137, 3],
      [-0.01123, 0],
      [-0.01049, 0],
      [-0.00123, 3],
      [0.01703, 1],
      [-0.00121, 3],
      [-0.01065, 0],
      [-0.00144, 3]
    ],
    "red_o_points": [],
    "y_categories": ["N", "NOT APPLICABLE", "Y", "nan"],
    "blue_o_points": [],
    "blue_x_points": [
      [0.04268, 1],
      [-0.00058, 3],
      [-0.00815, 0],
      [-0.00908, 0],
      [0.00015, 3],
      [0.02698, 1],
      [0.01869, 1],
      [-0.00662, 0],
      [-0.00076, 3],
      [-0.00051, 3],
      [0.05539, 2],
      [0.01877, 1],
      [-0.00036, 3],
      [0.02024, 1],
      [-0.00062, 3]
    ]
  },
  "QA_mulInjOrthesisType[ShoulderSupport]": {
    "red_x_points": [
      [-0.01164, 0],
      [-0.01147, 0],
      [-0.01107, 0],
      [-0.04119, 2],
      [-0.01111, 0],
      [-0.01144, 0],
      [-0.01153, 0],
      [-0.04081, 2],
      [-0.01081, 0],
      [-0.01099, 0],
      [-0.01119, 0],
      [-0.01143, 0],
      [-0.01129, 0],
      [-0.01128, 0],
      [-0.0432, 2],
      [-0.01135, 0],
      [-0.01131, 0],
      [-0.04034, 2],
      [-0.04224, 3],
      [-0.01121, 0],
      [-0.01071, 0],
      [-0.01089, 0],
      [-0.01133, 0],
      [-0.01143, 0],
      [-0.04139, 3],
      [-0.04275, 3],
      [-0.04157, 3],
      [-0.01171, 0],
      [-0.01097, 0]
    ],
    "red_o_points": [],
    "y_categories": ["N", "NOT APPLICABLE", "Y", "nan"],
    "blue_o_points": [],
    "blue_x_points": [
      [-0.01071, 0],
      [-0.01081, 0],
      [-0.01077, 0],
      [-0.01039, 0],
      [0.08254, 1],
      [0.08178, 1],
      [0.07726, 1],
      [0.0825, 1],
      [-0.01057, 0],
      [0.07906, 1],
      [-0.01035, 0],
      [0.07715, 1],
      [0.0811, 1],
      [0.08248, 1],
      [-0.01063, 0]
    ]
  },
  "QS_mulLysisNerve[Ssr]": {
    "red_x_points": [
      [-9e-5, 3],
      [-0.00315, 0],
      [-0.00687, 2],
      [-0.00625, 2],
      [-0.0019, 0],
      [-0.00157, 0],
      [-0.00206, 0],
      [-0.00051, 3],
      [-0.00222, 0],
      [-0.00169, 0],
      [-1e-5, 3],
      [-0.00167, 0],
      [-0.00078, 3],
      [-0.00334, 0],
      [-0.00237, 0],
      [2e-5, 3],
      [-7e-5, 3],
      [-4e-5, 3],
      [-0.0016, 0],
      [1e-5, 3],
      [-0.00071, 3],
      [-0.00062, 3],
      [-0.00194, 0],
      [-0.00181, 0],
      [-0.00036, 3],
      [0.00715, 1],
      [-0.00043, 3],
      [-0.00146, 0],
      [-0.00074, 3]
    ],
    "red_o_points": [],
    "y_categories": ["N", "NOT APPLICABLE", "Y", "nan"],
    "blue_o_points": [],
    "blue_x_points": [
      [0.01473, 1],
      [-0.00026, 3],
      [-0.00089, 0],
      [-0.00142, 0],
      [0.00048, 3],
      [0.00857, 1],
      [0.0041, 1],
      [-0.00108, 0],
      [-0.00025, 3],
      [0.00027, 3],
      [-0.00091, 0],
      [0.00643, 1],
      [0.00015, 3],
      [0.00727, 1],
      [-8e-5, 3]
    ]
  },
  "QS_mulTransfSite[AcSsAA]": {
    "red_x_points": [
      [3e-5, 3],
      [1e-5, 2],
      [-0.00665, 0],
      [-0.00582, 0],
      [0.00123, 2],
      [-0.00583, 0],
      [-0.00757, 0],
      [-0.00076, 3],
      [-0.0091, 0],
      [-0.00682, 0],
      [-9e-5, 3],
      [-0.00691, 0],
      [-0.00088, 3],
      [0.00279, 2],
      [-0.00282, 0],
      [-9e-5, 3],
      [-0.00015, 3],
      [-0.00011, 3],
      [-0.00031, 2],
      [-6e-5, 3],
      [-0.00088, 3],
      [-0.00071, 3],
      [-0.0065, 0],
      [0.00076, 2],
      [-0.00074, 3],
      [0.00662, 1],
      [-0.0009, 3],
      [-0.0042, 0],
      [-0.00071, 3]
    ],
    "red_o_points": [],
    "y_categories": ["N", "NOT APPLICABLE", "Y", "nan"],
    "blue_o_points": [],
    "blue_x_points": [
      [0.0177, 1],
      [-0.00038, 3],
      [0.00869, 2],
      [0.00942, 2],
      [0.00012, 3],
      [0.00553, 1],
      [0.00501, 1],
      [-0.00235, 0],
      [-0.00029, 3],
      [-1e-5, 3],
      [-0.003, 0],
      [0.00828, 1],
      [-0.00011, 3],
      [0.00841, 1],
      [0.00012, 3]
    ]
  },
  "QS_mulLysisRoot[C5]": {
    "red_x_points": [
      [-0.00012, 3],
      [-0.0013, 0],
      [-0.00306, 2],
      [-0.00069, 0],
      [-0.00108, 0],
      [-0.00073, 0],
      [-0.00104, 0],
      [-0.00026, 3],
      [-0.00104, 0],
      [-0.00091, 0],
      [-9e-5, 3],
      [-0.00087, 0],
      [-0.00057, 3],
      [-0.00135, 0],
      [-0.00096, 0],
      [-0.00023, 3],
      [-0.00019, 3],
      [-6e-5, 3],
      [-0.00045, 0],
      [-0.00013, 3],
      [-0.00051, 3],
      [-0.00031, 3],
      [-0.00092, 0],
      [-0.00043, 0],
      [-0.00021, 3],
      [0.00282, 1],
      [-0.00018, 3],
      [-0.00392, 2],
      [-0.00041, 3]
    ],
    "red_o_points": [],
    "y_categories": ["N", "NOT APPLICABLE", "Y", "nan"],
    "blue_o_points": [],
    "blue_x_points": [
      [0.00906, 1],
      [-0.00023, 3],
      [0.00014, 0],
      [-2e-5, 0],
      [0.0001, 3],
      [0.00342, 1],
      [0.0017, 1],
      [-0.00053, 0],
      [-0.00012, 3],
      [-5e-5, 3],
      [0.00018, 0],
      [0.00296, 1],
      [-2e-5, 3],
      [0.00274, 1],
      [-0.0001, 3]
    ]
  },
  "QA_mulInjOrthesisType[ArmSling]": {
    "red_x_points": [
      [-0.01145, 2],
      [-0.01173, 2],
      [-0.0108, 2],
      [-0.01074, 2],
      [-0.01108, 2],
      [-0.01116, 2],
      [-0.01151, 2],
      [-0.01148, 2],
      [-0.01085, 2],
      [-0.01136, 2],
      [-0.01155, 2],
      [-0.01137, 2],
      [-0.0112, 2],
      [-0.01154, 2],
      [-0.03441, 0],
      [-0.01181, 2],
      [-0.01163, 2],
      [-0.0354, 0],
      [-0.03457, 3],
      [-0.01063, 2],
      [-0.01165, 2],
      [-0.01138, 2],
      [-0.01215, 2],
      [-0.01101, 2],
      [-0.03581, 3],
      [-0.03612, 3],
      [-0.03551, 3],
      [-0.01134, 2],
      [-0.01139, 2]
    ],
    "red_o_points": [],
    "y_categories": ["N", "NOT APPLICABLE", "Y", "nan"],
    "blue_o_points": [],
    "blue_x_points": [
      [-0.01022, 2],
      [-0.01078, 2],
      [-0.01036, 2],
      [-0.01022, 2],
      [0.07239, 1],
      [0.06978, 1],
      [0.06406, 1],
      [0.06944, 1],
      [-0.0107, 2],
      [0.07032, 1],
      [-0.01076, 2],
      [0.0657, 1],
      [0.07082, 1],
      [0.06419, 1],
      [-0.01103, 2]
    ]
  },
  "QS_lstBpsurgSide": {
    "red_x_points": [
      [-0.00095, 3],
      [-0.01663, 0],
      [-0.01802, 0],
      [-0.0136, 0],
      [-0.01941, 0],
      [-0.01435, 0],
      [-0.01886, 0],
      [-0.00173, 3],
      [-0.01957, 0],
      [0.00307, 2],
      [-0.00084, 3],
      [0.00254, 2],
      [-0.00236, 3],
      [0.00492, 2],
      [-0.00142, 2],
      [-0.00103, 3],
      [-0.00098, 3],
      [-0.00053, 3],
      [-0.00879, 0],
      [-0.00081, 3],
      [-0.00201, 3],
      [-0.00212, 3],
      [0.00335, 2],
      [0.00354, 2],
      [-0.00172, 3],
      [0.0157, 1],
      [-0.00176, 3],
      [-0.01473, 0],
      [-0.00235, 3]
    ],
    "red_o_points": [],
    "y_categories": ["L", "NOT APPLICABLE", "R", "nan"],
    "blue_o_points": [],
    "blue_x_points": [
      [0.04516, 1],
      [-0.00124, 3],
      [0.00643, 2],
      [0.01321, 2],
      [-1e-5, 3],
      [0.01817, 1],
      [0.0122, 1],
      [-0.00199, 0],
      [-0.00125, 3],
      [-0.00042, 3],
      [0.00603, 2],
      [0.01836, 1],
      [-0.0004, 3],
      [0.01783, 1],
      [-0.00065, 3]
    ]
  },
  "QS_mulBpsurgeryType[Lysis]": {
    "red_x_points": [
      [-0.00102, 3],
      [-0.00692, 0],
      [-0.02188, 2],
      [-0.01953, 2],
      [-0.00416, 0],
      [-0.02122, 2],
      [-0.00424, 0],
      [-0.00193, 3],
      [-0.00429, 0],
      [-0.00387, 0],
      [-0.00085, 3],
      [-0.00364, 0],
      [-0.00246, 3],
      [-0.00661, 0],
      [-0.01858, 2],
      [-0.00115, 3],
      [-0.00078, 3],
      [-0.00073, 3],
      [-0.00372, 0],
      [-0.00093, 3],
      [-0.00226, 3],
      [-0.00185, 3],
      [-0.00421, 0],
      [-0.00387, 0],
      [-0.00179, 3],
      [0.02314, 1],
      [-0.00194, 3],
      [-0.02168, 2],
      [-0.00219, 3]
    ],
    "red_o_points": [],
    "y_categories": ["N", "NOT APPLICABLE", "Y", "nan"],
    "blue_o_points": [],
    "blue_x_points": [
      [0.04836, 1],
      [-0.00076, 3],
      [-0.00101, 0],
      [-0.00178, 0],
      [0.00026, 3],
      [0.03297, 1],
      [0.02076, 1],
      [-0.00185, 0],
      [-0.00077, 3],
      [-0.00058, 3],
      [-0.0009, 0],
      [0.02597, 1],
      [-0.00023, 3],
      [0.02553, 1],
      [-0.00079, 3]
    ]
  },
  "QA_yonInjUnconscio": {
    "red_x_points": [
      [-0.02332, 1],
      [-0.02218, 1],
      [-0.00198, 2],
      [-0.0029, 2],
      [-0.00199, 2],
      [-0.02527, 1],
      [-0.00223, 2],
      [-0.00403, 2],
      [-0.00263, 2],
      [-0.0265, 1],
      [-0.02323, 1],
      [-0.02688, 1],
      [-0.00537, 2],
      [-0.00237, 2],
      [-0.01464, 1],
      [-0.02403, 1],
      [-0.02259, 1],
      [-0.01572, 1],
      [-0.01706, 1],
      [-0.02286, 1],
      [-0.00484, 2],
      [-0.0033, 2],
      [-0.02648, 1],
      [-0.02501, 1],
      [-0.00441, 2],
      [-0.00378, 2],
      [-0.00456, 2],
      [-0.02384, 1],
      [-0.00562, 2]
    ],
    "red_o_points": [],
    "y_categories": ["N", "Y", "nan"],
    "blue_o_points": [],
    "blue_x_points": [
      [-0.00121, 2],
      [-0.0016, 2],
      [0.08538, 0],
      [-0.00056, 2],
      [-0.0101, 1],
      [-0.01198, 1],
      [0.04941, 0],
      [0.06674, 0],
      [-0.00213, 2],
      [0.06122, 0],
      [0.08113, 0],
      [-0.00294, 2],
      [-0.01269, 1],
      [-0.00292, 2],
      [0.09188, 0]
    ]
  },
  "QA_lstPexTouch[C7]": {
    "red_x_points": [
      [-0.0025, 1],
      [-0.01086, 2],
      [-0.00542, 1],
      [-0.00372, 1],
      [-0.01599, 2],
      [-0.00658, 1],
      [-0.00866, 1],
      [-0.00489, 0],
      [-0.01191, 1],
      [-0.01138, 1],
      [-0.00313, 1],
      [-0.02049, 2],
      [-0.00738, 2],
      [-0.02161, 2],
      [-0.00395, 2],
      [-0.00191, 0],
      [-0.004, 1],
      [-0.00435, 0],
      [-0.0101, 2],
      [-0.00521, 0],
      [-0.00731, 2],
      [-0.00565, 0],
      [-0.01289, 1],
      [-0.01521, 2],
      [-0.00517, 0],
      [-0.0003, 1],
      [-0.00156, 2],
      [-0.0026, 1],
      [0.004, 1]
    ],
    "red_o_points": [],
    "y_categories": ["NORM", "NPV", "nan"],
    "blue_o_points": [],
    "blue_x_points": [
      [-0.00011, 1],
      [0.0146, 1],
      [0.04953, 0],
      [0.07026, 0],
      [0.0098, 2],
      [0.0001, 2],
      [-0.0048, 1],
      [0.01543, 1],
      [0.00669, 2],
      [0.04526, 0],
      [-6e-5, 1],
      [-0.00099, 0],
      [0.00046, 0],
      [0.00456, 0]
    ]
  },
  "QA_lstPexInspectio[SurgicalScar]": {
    "red_x_points": [
      [-0.00325, 1],
      [-0.00741, 1],
      [-0.01108, 0],
      [-0.0044, 1],
      [-0.01234, 1],
      [-0.0144, 0],
      [-0.01092, 1],
      [-0.00333, 1],
      [-0.01487, 1],
      [-0.01539, 1],
      [-0.00815, 0],
      [-0.01516, 1],
      [-0.00031, 2],
      [-0.01897, 1],
      [-0.00642, 0],
      [0.00534, 2],
      [0.00552, 2],
      [-0.00132, 1],
      [-0.00574, 1],
      [-0.00375, 1],
      [0.00042, 2],
      [-0.00448, 1],
      [-0.01668, 1],
      [0.01874, 2],
      [-0.00173, 1],
      [-0.00031, 1],
      [-0.00131, 1],
      [0.0074, 2],
      [-0.00156, 1]
    ],
    "red_o_points": [],
    "y_categories": ["ABS", "NAIA", "PT", "nan"],
    "blue_o_points": [],
    "blue_x_points": [
      [-0.00077, 1],
      [0.00907, 2],
      [0.03779, 2],
      [0.0548, 2],
      [0.00284, 1],
      [0.00082, 1],
      [0.00057, 0],
      [-0.0077, 1],
      [-0.00227, 1],
      [0.00189, 1],
      [0.03521, 2],
      [-0.00048, 1],
      [0.00359, 2],
      [0.00164, 0],
      [0.00888, 2]
    ]
  },
  "QS_mulNeuromadSite[T2]": {
    "red_x_points": [
      [3e-5, 2],
      [-0.00053, 0],
      [-0.00015, 0],
      [-7e-5, 0],
      [-0.00018, 0],
      [-3e-5, 0],
      [-0.00021, 0],
      [-1e-5, 2],
      [-0.0002, 0],
      [-0.00014, 0],
      [-1e-5, 2],
      [-0.00013, 0],
      [-4e-5, 2],
      [-0.00043, 0],
      [-0.00024, 0],
      [2e-5, 2],
      [0.0, 2],
      [-0.0, 2],
      [-2e-5, 2],
      [2e-5, 2],
      [-0.00011, 0],
      [-6e-5, 0],
      [0.0, 2],
      [0.00024, 1],
      [0.0, 2],
      [-3e-5, 0],
      [-2e-5, 2]
    ],
    "red_o_points": [],
    "y_categories": ["N", "NOT APPLICABLE", "nan"],
    "blue_o_points": [],
    "blue_x_points": [
      [0.00168, 1],
      [4e-5, 2],
      [-6e-5, 0],
      [-5e-5, 0],
      [4e-5, 2],
      [0.00037, 1],
      [9e-5, 1],
      [4e-5, 2],
      [5e-5, 2],
      [-3e-5, 0],
      [9e-5, 1],
      [0.0, 2],
      [2e-5, 2]
    ]
  },
  "QS_mulLysisSite[Trunk]": {
    "red_x_points": [
      [-0.00033, 3],
      [-0.00435, 0],
      [-0.0025, 0],
      [-0.00222, 0],
      [-0.00268, 0],
      [-0.00984, 2],
      [-0.00249, 0],
      [-0.0006, 3],
      [-0.00281, 0],
      [-0.00284, 0],
      [-0.00026, 3],
      [-0.00266, 0],
      [-0.00089, 3],
      [-0.0043, 0],
      [-0.00834, 2],
      [-0.00046, 3],
      [-0.00035, 3],
      [-0.00026, 3],
      [-0.00244, 0],
      [-0.00013, 3],
      [-0.00092, 3],
      [-0.00058, 3],
      [-0.00294, 0],
      [-0.00241, 0],
      [-0.00059, 3],
      [0.00902, 1],
      [-0.00054, 3],
      [-0.00977, 2],
      [-0.00083, 3]
    ],
    "red_o_points": [],
    "y_categories": ["N", "NOT APPLICABLE", "Y", "nan"],
    "blue_o_points": [],
    "blue_x_points": [
      [0.02027, 1],
      [-0.0003, 3],
      [-0.00056, 0],
      [-0.0012, 0],
      [0.00042, 3],
      [0.01519, 1],
      [0.00996, 1],
      [-0.00148, 0],
      [-0.00026, 3],
      [-5e-5, 3],
      [-0.00052, 0],
      [0.00975, 1],
      [-6e-5, 3],
      [0.00942, 1],
      [-0.00028, 3]
    ]
  },
  "QS_mulGraftTrunk[UpperTrunk]": {
    "red_x_points": [
      [-4e-5, 3],
      [-0.0003, 0],
      [-0.00078, 0],
      [-0.00068, 0],
      [-0.0008, 0],
      [-0.00025, 0],
      [-0.00085, 0],
      [-0.0004, 3],
      [-0.00085, 0],
      [-1e-5, 0],
      [3e-5, 3],
      [-9e-5, 0],
      [-0.00039, 3],
      [-0.00867, 2],
      [-0.00034, 0],
      [5e-5, 3],
      [-2e-5, 3],
      [2e-5, 3],
      [-0.00021, 0],
      [-2e-5, 3],
      [-0.00046, 3],
      [-0.00041, 3],
      [-4e-5, 0],
      [-0.00029, 0],
      [-0.00024, 3],
      [0.00198, 1],
      [-0.00035, 3],
      [-0.00032, 0],
      [-0.00023, 3]
    ],
    "red_o_points": [],
    "y_categories": ["N", "NOT APPLICABLE", "Y", "nan"],
    "blue_o_points": [],
    "blue_x_points": [
      [0.0055, 1],
      [-0.00015, 3],
      [0.00102, 0],
      [0.00189, 0],
      [2e-5, 3],
      [0.00146, 1],
      [0.00069, 1],
      [0.00016, 0],
      [-0.00021, 3],
      [-4e-5, 3],
      [0.00042, 0],
      [0.00226, 1],
      [2e-5, 3],
      [0.00193, 1],
      [1e-5, 3]
    ]
  },
  "QS_mulTransfSite[PhMc]": {
    "red_x_points": [
      [-0.00017, 3],
      [-0.00157, 0],
      [-0.00089, 0],
      [-0.00107, 0],
      [-0.00109, 0],
      [-0.00072, 0],
      [-0.00455, 2],
      [-0.00045, 3],
      [-0.00108, 0],
      [-0.00073, 0],
      [-9e-5, 3],
      [-0.00067, 0],
      [-0.00064, 3],
      [-0.00189, 0],
      [-0.00101, 0],
      [-0.00011, 3],
      [-0.00011, 3],
      [-0.00011, 3],
      [-0.00249, 2],
      [-0.00013, 3],
      [-0.00047, 3],
      [-0.00045, 3],
      [-0.00071, 0],
      [-0.00067, 0],
      [-0.00028, 3],
      [0.00336, 1],
      [-0.00035, 3],
      [-0.00072, 0],
      [-0.00061, 3]
    ],
    "red_o_points": [],
    "y_categories": ["N", "NOT APPLICABLE", "Y", "nan"],
    "blue_o_points": [],
    "blue_x_points": [
      [0.00897, 1],
      [-0.00012, 3],
      [-0.00036, 0],
      [-0.00066, 0],
      [0.00012, 3],
      [0.00398, 1],
      [0.00202, 1],
      [-0.00033, 0],
      [-0.0002, 3],
      [8e-5, 3],
      [-0.00022, 0],
      [0.00332, 1],
      [-8e-5, 3],
      [0.00401, 1],
      [-4e-5, 3]
    ]
  },
  "QA_intPexForearmProna": {
    "red_x_points": [
      [-0.00155, 2],
      [-0.00141, 0],
      [-0.00137, 2],
      [-0.00061, 2],
      [-0.00135, 2],
      [-0.0043, 0],
      [-0.00141, 2],
      [-0.0261, 0],
      [-0.00135, 2],
      [-0.00124, 2],
      [-0.02456, 0],
      [-0.00434, 0],
      [-0.00274, 2],
      [-0.0012, 2],
      [6e-5, 2],
      [-0.02673, 0],
      [-0.0258, 0],
      [-0.02223, 0],
      [-0.00307, 0],
      [-0.00156, 2],
      [-0.00249, 2],
      [-0.00209, 2],
      [-0.00125, 2],
      [-0.00152, 2],
      [0.00022, 2],
      [0.00087, 1],
      [5e-5, 2],
      [-0.00421, 0],
      [-0.00222, 2]
    ],
    "red_o_points": [],
    "y_categories": ["GREATER THAN OR EQUALS TO 80", "LESS THAN 80", "nan"],
    "blue_o_points": [],
    "blue_x_points": [
      [-0.00075, 2],
      [0.08688, 1],
      [-0.00047, 0],
      [-0.0012, 2],
      [0.00131, 2],
      [7e-5, 2],
      [0.00095, 1],
      [0.00014, 2],
      [-0.001, 2],
      [0.00143, 2],
      [-0.00054, 0],
      [7e-5, 2],
      [0.00125, 2],
      [4e-5, 2],
      [0.07735, 1]
    ]
  },
  "QA_yonPexPain": {
    "red_x_points": [
      [-0.00854, 1],
      [-0.00164, 1],
      [-0.00094, 1],
      [-0.00067, 1],
      [-0.00161, 1],
      [-0.00096, 0],
      [-0.0009, 1],
      [-0.00802, 1],
      [0.00023, 0],
      [0.00013, 1],
      [-0.00593, 1],
      [-0.00085, 0],
      [-0.01249, 1],
      [-0.00171, 1],
      [-0.00053, 1],
      [0.01045, 0],
      [-0.00645, 1],
      [0.00743, 0],
      [-0.00062, 1],
      [0.01521, 0],
      [-0.02509, 2],
      [-0.01053, 1],
      [0.00022, 1],
      [-0.00126, 1],
      [-0.01794, 2],
      [-0.00266, 1],
      [-0.00866, 1],
      [-0.00051, 1],
      [-0.01286, 1]
    ],
    "red_o_points": [],
    "y_categories": ["N", "Y", "nan"],
    "blue_o_points": [],
    "blue_x_points": [
      [-0.00065, 1],
      [0.0278, 0],
      [0.00653, 0],
      [-0.00074, 1],
      [-0.00638, 1],
      [0.00128, 2],
      [0.00088, 1],
      [0.03242, 0],
      [0.02218, 0],
      [0.00067, 1],
      [0.00353, 0],
      [0.0152, 0],
      [-0.00046, 1],
      [-0.00455, 1]
    ]
  },
  "QS_mulLysisRoot[C6]": {
    "red_x_points": [
      [-0.00014, 3],
      [-0.00284, 0],
      [-0.00716, 2],
      [-0.00211, 0],
      [-0.00223, 0],
      [-0.00174, 0],
      [-0.00232, 0],
      [-0.0007, 3],
      [-0.0024, 0],
      [-0.00186, 0],
      [-0.00021, 3],
      [-0.00165, 0],
      [-0.00087, 3],
      [-0.00335, 0],
      [-0.00258, 0],
      [-6e-5, 3],
      [-0.00017, 3],
      [-0.00016, 3],
      [-0.00161, 0],
      [-0.00016, 3],
      [-0.0008, 3],
      [-0.00094, 3],
      [-0.00204, 0],
      [-0.00161, 0],
      [-0.00072, 3],
      [0.00735, 1],
      [-0.00081, 3],
      [-0.00691, 2],
      [-0.00081, 3]
    ],
    "red_o_points": [],
    "y_categories": ["N", "NOT APPLICABLE", "Y", "nan"],
    "blue_o_points": [],
    "blue_x_points": [
      [0.01649, 1],
      [-0.00023, 3],
      [-0.00086, 0],
      [-0.00154, 0],
      [-0.0, 3],
      [0.00914, 1],
      [0.006, 1],
      [-0.00115, 0],
      [-0.00028, 3],
      [0.0, 3],
      [-0.00067, 0],
      [0.00749, 1],
      [-8e-5, 3],
      [0.00738, 1],
      [-5e-5, 3]
    ]
  },
  "QS_mulGraftLevel[Trunk]": {
    "red_x_points": [
      [-3e-5, 3],
      [-0.00045, 0],
      [-0.00029, 0],
      [-0.00031, 0],
      [-0.00042, 0],
      [-0.00013, 0],
      [-0.00046, 0],
      [-5e-5, 3],
      [-0.00037, 0],
      [2e-5, 0],
      [4e-5, 3],
      [-1e-5, 0],
      [-6e-5, 3],
      [-0.00677, 2],
      [-0.00039, 0],
      [2e-5, 3],
      [3e-5, 3],
      [3e-5, 3],
      [-7e-5, 0],
      [-2e-5, 3],
      [-0.00011, 3],
      [-8e-5, 3],
      [1e-5, 0],
      [-0.00019, 0],
      [-8e-5, 3],
      [0.00074, 1],
      [-8e-5, 3],
      [-9e-5, 0],
      [-0.00014, 3]
    ],
    "red_o_points": [],
    "y_categories": ["N", "NOT APPLICABLE", "Y", "nan"],
    "blue_o_points": [],
    "blue_x_points": [
      [0.00445, 1],
      [2e-5, 3],
      [0.00079, 0],
      [0.00167, 0],
      [0.00012, 3],
      [0.00079, 1],
      [0.00018, 1],
      [9e-5, 0],
      [-5e-5, 3],
      [0.0001, 3],
      [0.00036, 0],
      [0.00063, 1],
      [3e-5, 3],
      [0.0005, 1],
      [4e-5, 3]
    ]
  }
}
