{
  "QA_lstPexMuscstrength[ElbowFlex]": {
    "red_x_points": [
      [-0.01306, 1],
      [-0.00102, 2],
      [-0.01211, 1],
      [-0.01144, 1],
      [-0.01218, 1],
      [-0.01311, 1],
      [-0.01223, 1],
      [-0.01174, 1],
      [-0.01286, 1],
      [-0.01327, 1],
      [-0.01309, 1],
      [-0.01357, 1],
      [-0.00126, 2],
      [-0.00449, 2],
      [0.0013, 2],
      [-0.01261, 1],
      [-0.01299, 1],
      [-0.01193, 1],
      [-0.01156, 1],
      [-0.01294, 1],
      [-0.00054, 2],
      [-0.01264, 1],
      [-0.01344, 1],
      [-0.01257, 1],
      [-0.01153, 1],
      [0.00078, 2],
      [-0.01121, 1],
      [-0.01269, 1],
      [-0.00068, 2]
    ],
    "red_o_points": [],
    "y_categories": ["GREATER THAN OR EQUALS TO 3", "LESS THAN 3", "nan"],
    "blue_o_points": [],
    "blue_x_points": [
      [0.00138, 2],
      [-0.0118, 1],
      [0.06829, 0],
      [-0.01193, 1],
      [0.004, 2],
      [0.00329, 2],
      [0.04376, 0],
      [-0.01051, 1],
      [-0.01168, 1],
      [0.00269, 2],
      [0.06605, 0],
      [0.04641, 0],
      [0.05682, 0],
      [0.04505, 0],
      [-0.01117, 1]
    ]
  },
  "participant_code": {
    "red_x_points": [
      [-0.04929, 1],
      [-0.0506, 2],
      [-0.04943, 3],
      [-0.0495, 4],
      [-0.05046, 5],
      [-0.05101, 8],
      [-0.05012, 9],
      [-0.05018, 10],
      [-0.04861, 11],
      [-0.04998, 13],
      [-0.04792, 14],
      [-0.04929, 18],
      [-0.04909, 19],
      [-0.0506, 20],
      [-0.04785, 23],
      [-0.04854, 26],
      [-0.04984, 28],
      [-0.05046, 29],
      [-0.04833, 30],
      [-0.04737, 31],
      [-0.05005, 32],
      [-0.0497, 34],
      [-0.04929, 36],
      [-0.04868, 38],
      [-0.04895, 39],
      [-0.04991, 40],
      [-0.05005, 41],
      [-0.04902, 42],
      [-0.04922, 43]
    ],
    "red_o_points": [],
    "y_categories": [
      "P16554",
      "P18297",
      "P19283",
      "P19287",
      "P23172",
      "P23391",
      "P30595",
      "P31645",
      "P31691",
      "P34778",
      "P35046",
      "P36328",
      "P43633",
      "P4544",
      "P46417",
      "P48965",
      "P53068",
      "P5497",
      "P58556",
      "P59529",
      "P62483",
      "P64658",
      "P65202",
      "P66816",
      "P6751",
      "P7408",
      "P75566",
      "P76226",
      "P79971",
      "P82621",
      "P82990",
      "P84549",
      "P84932",
      "P85825",
      "P86989",
      "P8770",
      "P87791",
      "P90550",
      "P93159",
      "P94969",
      "P96710",
      "P97130",
      "P9744",
      "P98500",
      "nan"
    ],
    "blue_o_points": [],
    "blue_x_points": [
      [0.09566, 0],
      [0.09474, 6],
      [0.09408, 7],
      [0.09408, 12],
      [0.09579, 15],
      [0.09527, 16],
      [0.09277, 17],
      [0.09553, 21],
      [0.09606, 22],
      [0.09737, 24],
      [0.09711, 25],
      [0.09224, 27],
      [0.09684, 33],
      [0.0954, 35],
      [0.10039, 37]
    ]
  },
  "QS_mulLysisTrunk[Upper]": {
    "red_x_points": [
      [-0.0004, 3],
      [-0.00504, 0],
      [-0.0025, 0],
      [-0.00238, 0],
      [-0.00269, 0],
      [-0.01105, 2],
      [-0.00279, 0],
      [-0.00079, 3],
      [-0.00261, 0],
      [-0.00249, 0],
      [-0.00072, 3],
      [-0.00246, 0],
      [-0.00109, 3],
      [-0.00488, 0],
      [-0.00953, 2],
      [-0.00094, 3],
      [-0.00087, 3],
      [-0.00041, 3],
      [-0.00249, 0],
      [-0.0005, 3],
      [-0.00127, 3],
      [-0.00068, 3],
      [-0.00264, 0],
      [-0.0024, 0],
      [-0.0007, 3],
      [0.01069, 1],
      [-0.0006, 3],
      [-0.01081, 2],
      [-0.00089, 3]
    ],
    "red_o_points": [],
    "y_categories": ["N", "NOT APPLICABLE", "Y", "nan"],
    "blue_o_points": [],
    "blue_x_points": [
      [0.02237, 1],
      [-0.00049, 3],
      [-0.00042, 0],
      [-0.0012, 0],
      [0.00024, 3],
      [0.01559, 1],
      [0.01043, 1],
      [-0.00165, 0],
      [-0.00036, 3],
      [1e-5, 3],
      [-0.00066, 0],
      [0.01054, 1],
      [-0.00017, 3],
      [0.01202, 1],
      [-0.00033, 3]
    ]
  },
  "QS_mulTransfSite[Oberlin]": {
    "red_x_points": [
      [-0.00175, 3],
      [-0.03372, 0],
      [-0.03308, 0],
      [-0.02827, 0],
      [-0.03397, 0],
      [0.00401, 2],
      [-0.0335, 0],
      [-0.00285, 3],
      [0.00534, 2],
      [0.00393, 2],
      [-0.00181, 3],
      [0.00441, 2],
      [-0.00346, 3],
      [0.00207, 2],
      [-0.02785, 0],
      [-0.00196, 3],
      [-0.0018, 3],
      [-0.00169, 3],
      [-0.02605, 0],
      [-0.00173, 3],
      [-0.00317, 3],
      [-0.00299, 3],
      [0.00399, 2],
      [-0.03262, 0],
      [-0.00269, 3],
      [0.03583, 1],
      [-0.00275, 3],
      [-0.03183, 0],
      [-0.00306, 3]
    ],
    "red_o_points": [],
    "y_categories": ["N", "NOT APPLICABLE", "Y", "nan"],
    "blue_o_points": [],
    "blue_x_points": [
      [0.06423, 1],
      [-0.00187, 3],
      [0.00801, 2],
      [0.01062, 2],
      [-0.00043, 3],
      [0.04645, 1],
      [0.03635, 1],
      [0.00539, 2],
      [-0.0017, 3],
      [-0.00104, 3],
      [0.00787, 2],
      [0.04028, 1],
      [-0.00102, 3],
      [0.04144, 1],
      [-0.00159, 3]
    ]
  },
  "QS_mulTransfSite[IMc]": {
    "red_x_points": [
      [-0.00054, 3],
      [-0.01999, 2],
      [-0.00292, 0],
      [-0.01618, 2],
      [-0.00297, 0],
      [-0.00357, 0],
      [-0.0029, 0],
      [-0.00184, 3],
      [-0.00353, 0],
      [-0.00318, 0],
      [-0.00092, 3],
      [-0.00319, 0],
      [-0.00232, 3],
      [-0.00594, 0],
      [-0.01707, 2],
      [-0.00082, 3],
      [-0.00089, 3],
      [-0.00053, 3],
      [-0.00326, 0],
      [-0.00056, 3],
      [-0.00232, 3],
      [-0.00161, 3],
      [-0.00349, 0],
      [-0.02029, 2],
      [-0.00156, 3],
      [0.02042, 1],
      [-0.00157, 3],
      [-0.01799, 2],
      [-0.00212, 3]
    ],
    "red_o_points": [],
    "y_categories": ["N", "NOT APPLICABLE", "Y", "nan"],
    "blue_o_points": [],
    "blue_x_points": [
      [0.03753, 1],
      [-0.00119, 3],
      [0.00118, 0],
      [0.0007, 0],
      [8e-5, 3],
      [0.02947, 1],
      [0.01755, 1],
      [-0.00163, 0],
      [-0.00093, 3],
      [-0.00046, 3],
      [6e-5, 0],
      [0.02108, 1],
      [-0.0002, 3],
      [0.02116, 1],
      [-0.00077, 3]
    ]
  },
  "QA_mulInjOrthesisType[ArmSling]": {
    "red_x_points": [
      [-0.01082, 2],
      [-0.01044, 2],
      [-0.01084, 2],
      [-0.01052, 2],
      [-0.01002, 2],
      [-0.01069, 2],
      [-0.01065, 2],
      [-0.01004, 2],
      [-0.01051, 2],
      [-0.01046, 2],
      [-0.01048, 2],
      [-0.01078, 2],
      [-0.01063, 2],
      [-0.01053, 2],
      [-0.03283, 0],
      [-0.01063, 2],
      [-0.01031, 2],
      [-0.03216, 0],
      [-0.03256, 3],
      [-0.01053, 2],
      [-0.01036, 2],
      [-0.01037, 2],
      [-0.01084, 2],
      [-0.01048, 2],
      [-0.03275, 3],
      [-0.03414, 3],
      [-0.03188, 3],
      [-0.01072, 2],
      [-0.0105, 2]
    ],
    "red_o_points": [],
    "y_categories": ["N", "NOT APPLICABLE", "Y", "nan"],
    "blue_o_points": [],
    "blue_x_points": [
      [-0.00947, 2],
      [-0.01016, 2],
      [-0.00998, 2],
      [-0.01016, 2],
      [0.06642, 1],
      [0.06342, 1],
      [0.06189, 1],
      [0.06268, 1],
      [-0.01029, 2],
      [0.06523, 1],
      [-0.00977, 2],
      [0.06231, 1],
      [0.06434, 1],
      [0.06224, 1],
      [-0.0102, 2]
    ]
  },
  "QS_mulLysisSite[Nerve]": {
    "red_x_points": [
      [-0.00038, 3],
      [-0.00201, 0],
      [-0.0062, 2],
      [-0.00582, 2],
      [-0.00175, 0],
      [-0.00108, 0],
      [-0.00149, 0],
      [-0.00074, 3],
      [-0.00176, 0],
      [-0.00127, 0],
      [-0.00041, 3],
      [-0.00135, 0],
      [-0.00099, 3],
      [-0.00237, 0],
      [-0.00162, 0],
      [-0.00033, 3],
      [-0.00034, 3],
      [-0.00029, 3],
      [-0.00113, 0],
      [-0.0004, 3],
      [-0.00094, 3],
      [-0.00063, 3],
      [-0.0013, 0],
      [-0.00142, 0],
      [-0.00077, 3],
      [0.00525, 1],
      [-0.00058, 3],
      [-0.00117, 0],
      [-0.00098, 3]
    ],
    "red_o_points": [],
    "y_categories": ["N", "NOT APPLICABLE", "Y", "nan"],
    "blue_o_points": [],
    "blue_x_points": [
      [0.0142, 1],
      [-0.00038, 3],
      [-0.00096, 0],
      [-0.00132, 0],
      [-0.00027, 3],
      [0.00703, 1],
      [0.00542, 1],
      [-0.00077, 0],
      [-0.00039, 3],
      [-0.00022, 3],
      [-0.00095, 0],
      [0.00683, 1],
      [-0.00021, 3],
      [0.00651, 1],
      [-0.00024, 3]
    ]
  },
  "QS_mulNeuromadSite[C8]": {
    "red_x_points": [
      [-2e-5, 2],
      [-0.00017, 0],
      [-2e-5, 0],
      [-2e-5, 0],
      [-2e-5, 0],
      [-2e-5, 0],
      [-3e-5, 2],
      [-0.00019, 0],
      [-6e-5, 0],
      [-2e-5, 2],
      [-3e-5, 2],
      [-2e-5, 2],
      [-2e-5, 0],
      [9e-5, 1],
      [-3e-5, 2]
    ],
    "red_o_points": [],
    "y_categories": ["N", "NOT APPLICABLE", "nan"],
    "blue_o_points": [],
    "blue_x_points": [[0.00028, 1], [8e-5, 2], [9e-5, 1], [9e-5, 2]]
  },
  "QS_mulTransfSite[AcMc]": {
    "red_x_points": [
      [0.0, 3],
      [-0.00061, 0],
      [-0.00024, 0],
      [-0.00023, 0],
      [-0.00039, 0],
      [-0.0001, 0],
      [-0.00052, 0],
      [0.0, 3],
      [-0.00031, 0],
      [-0.00345, 2],
      [2e-5, 3],
      [-1e-5, 0],
      [-0.00013, 3],
      [-0.00052, 0],
      [-0.00045, 0],
      [2e-5, 3],
      [2e-5, 3],
      [2e-5, 3],
      [-0.00016, 0],
      [-7e-5, 3],
      [-0.00016, 3],
      [-4e-5, 3],
      [-1e-5, 0],
      [-0.00017, 0],
      [-3e-5, 3],
      [0.00047, 1],
      [-2e-5, 3],
      [-0.00019, 0],
      [-7e-5, 3]
    ],
    "red_o_points": [],
    "y_categories": ["N", "NOT APPLICABLE", "Y", "nan"],
    "blue_o_points": [],
    "blue_x_points": [
      [0.00372, 1],
      [7e-5, 3],
      [0.0003, 0],
      [0.00014, 0],
      [5e-5, 3],
      [0.00092, 1],
      [0.00028, 1],
      [0.00014, 0],
      [2e-5, 3],
      [-1e-5, 3],
      [0.00034, 0],
      [0.00075, 1],
      [1e-5, 3],
      [0.00057, 1],
      [2e-5, 3]
    ]
  },
  "QS_mulTransfSite[Other]": {
    "red_x_points": [
      [-0.00101, 3],
      [-0.01355, 0],
      [-0.01005, 0],
      [-0.00924, 0],
      [-0.01047, 0],
      [-0.01085, 0],
      [-0.01072, 0],
      [-0.00145, 3],
      [-0.01179, 0],
      [-0.0114, 0],
      [-0.00117, 3],
      [-0.01106, 0],
      [-0.00159, 3],
      [-0.01399, 0],
      [-0.01068, 0],
      [-0.00114, 3],
      [-0.0013, 3],
      [-0.00112, 3],
      [-0.00875, 0],
      [-0.00115, 3],
      [-0.00148, 3],
      [-0.00145, 3],
      [-0.01106, 0],
      [-0.01168, 0],
      [-0.00147, 3],
      [0.01985, 1],
      [-0.00147, 3],
      [-0.01103, 0],
      [-0.00135, 3]
    ],
    "red_o_points": [],
    "y_categories": ["N", "NOT APPLICABLE", "Y", "nan"],
    "blue_o_points": [],
    "blue_x_points": [
      [0.03949, 1],
      [-0.00068, 3],
      [-0.00912, 0],
      [-0.00964, 0],
      [0.00023, 3],
      [0.02802, 1],
      [0.0209, 1],
      [-0.00744, 0],
      [-0.00075, 3],
      [-0.00031, 3],
      [0.0597, 2],
      [0.02232, 1],
      [-0.00053, 3],
      [0.02228, 1],
      [-0.00086, 3]
    ]
  },
  "QA_mulInjOrthesisType[ShoulderSupport]": {
    "red_x_points": [
      [-0.01148, 0],
      [-0.01133, 0],
      [-0.01122, 0],
      [-0.0412, 2],
      [-0.01105, 0],
      [-0.01138, 0],
      [-0.01099, 0],
      [-0.04219, 2],
      [-0.01082, 0],
      [-0.01112, 0],
      [-0.01137, 0],
      [-0.01139, 0],
      [-0.01139, 0],
      [-0.01099, 0],
      [-0.04233, 2],
      [-0.01123, 0],
      [-0.01122, 0],
      [-0.04047, 2],
      [-0.04144, 3],
      [-0.01131, 0],
      [-0.01105, 0],
      [-0.01066, 0],
      [-0.01143, 0],
      [-0.01148, 0],
      [-0.04153, 3],
      [-0.04289, 3],
      [-0.03993, 3],
      [-0.01158, 0],
      [-0.01104, 0]
    ],
    "red_o_points": [],
    "y_categories": ["N", "NOT APPLICABLE", "Y", "nan"],
    "blue_o_points": [],
    "blue_x_points": [
      [-0.0103, 0],
      [-0.01049, 0],
      [-0.01064, 0],
      [-0.01009, 0],
      [0.08087, 1],
      [0.08168, 1],
      [0.07713, 1],
      [0.07939, 1],
      [-0.01073, 0],
      [0.07996, 1],
      [-0.01083, 0],
      [0.08052, 1],
      [0.08304, 1],
      [0.07878, 1],
      [-0.01079, 0]
    ]
  },
  "QS_mulLysisNerve[Ssr]": {
    "red_x_points": [
      [-0.0001, 3],
      [-0.00304, 0],
      [-0.00703, 2],
      [-0.00705, 2],
      [-0.00199, 0],
      [-0.00168, 0],
      [-0.00205, 0],
      [-0.00081, 3],
      [-0.00193, 0],
      [-0.00194, 0],
      [-8e-5, 3],
      [-0.00187, 0],
      [-0.0008, 3],
      [-0.00287, 0],
      [-0.00225, 0],
      [-0.00012, 3],
      [-0.00017, 3],
      [-0.0001, 3],
      [-0.00178, 0],
      [-0.00013, 3],
      [-0.00081, 3],
      [-0.00071, 3],
      [-0.00198, 0],
      [-0.00193, 0],
      [-0.00049, 3],
      [0.00662, 1],
      [-0.00063, 3],
      [-0.0017, 0],
      [-0.00079, 3]
    ],
    "red_o_points": [],
    "y_categories": ["N", "NOT APPLICABLE", "Y", "nan"],
    "blue_o_points": [],
    "blue_x_points": [
      [0.01602, 1],
      [-0.00037, 3],
      [-0.00108, 0],
      [-0.00171, 0],
      [0.00016, 3],
      [0.00874, 1],
      [0.00541, 1],
      [-0.00116, 0],
      [-0.00051, 3],
      [5e-5, 3],
      [-0.00095, 0],
      [0.00777, 1],
      [2e-5, 3],
      [0.00792, 1],
      [-0.00011, 3]
    ]
  },
  "QS_mulTransfSite[AcSsAA]": {
    "red_x_points": [
      [-0.00015, 3],
      [0.00041, 2],
      [-0.00671, 0],
      [-0.00517, 0],
      [0.00149, 2],
      [-0.00551, 0],
      [-0.00706, 0],
      [-0.00079, 3],
      [-0.0088, 0],
      [-0.00618, 0],
      [5e-5, 3],
      [-0.00672, 0],
      [-0.00109, 3],
      [0.00273, 2],
      [-0.00281, 0],
      [-0.00013, 3],
      [-0.00014, 3],
      [-8e-5, 3],
      [-8e-5, 2],
      [-0.00017, 3],
      [-0.00099, 3],
      [-0.00076, 3],
      [-0.00641, 0],
      [0.00146, 2],
      [-0.00077, 3],
      [0.0066, 1],
      [-0.00077, 3],
      [-0.00408, 0],
      [-0.001, 3]
    ],
    "red_o_points": [],
    "y_categories": ["N", "NOT APPLICABLE", "Y", "nan"],
    "blue_o_points": [],
    "blue_x_points": [
      [0.01834, 1],
      [-0.00033, 3],
      [0.00774, 2],
      [0.00935, 2],
      [-3e-5, 3],
      [0.00569, 1],
      [0.00419, 1],
      [-0.0021, 0],
      [-0.00036, 3],
      [-5e-5, 3],
      [-0.00266, 0],
      [0.00638, 1],
      [2e-5, 3],
      [0.0074, 1],
      [6e-5, 3]
    ]
  },
  "QS_mulLysisRoot[C5]": {
    "red_x_points": [
      [-0.00012, 3],
      [-0.00138, 0],
      [-0.00385, 2],
      [-0.00069, 0],
      [-0.00077, 0],
      [-0.00075, 0],
      [-0.0008, 0],
      [-0.00026, 3],
      [-0.00076, 0],
      [-0.00083, 0],
      [-6e-5, 3],
      [-0.00066, 0],
      [-0.00039, 3],
      [-0.00132, 0],
      [-0.00116, 0],
      [-0.00017, 3],
      [-0.00023, 3],
      [-9e-5, 3],
      [-0.00067, 0],
      [-0.00011, 3],
      [-0.00032, 3],
      [-0.00041, 3],
      [-0.00087, 0],
      [-0.0004, 0],
      [-0.00021, 3],
      [0.00278, 1],
      [-0.00024, 3],
      [-0.00431, 2],
      [-0.00043, 3]
    ],
    "red_o_points": [],
    "y_categories": ["N", "NOT APPLICABLE", "Y", "nan"],
    "blue_o_points": [],
    "blue_x_points": [
      [0.0088, 1],
      [-0.00015, 3],
      [1e-5, 0],
      [-0.00017, 0],
      [-3e-5, 3],
      [0.00415, 1],
      [0.00235, 1],
      [-0.00038, 0],
      [-0.00019, 3],
      [-0.00011, 3],
      [-0.00013, 0],
      [0.00247, 1],
      [-3e-5, 3],
      [0.00303, 1],
      [-0.00016, 3]
    ]
  },
  "QS_mulLysisSite[Root]": {
    "red_x_points": [
      [-7e-5, 3],
      [-0.00039, 0],
      [-0.00193, 2],
      [-0.00034, 0],
      [-0.00058, 0],
      [-0.00029, 0],
      [-0.00045, 0],
      [-0.00012, 3],
      [-0.0005, 0],
      [-0.00031, 0],
      [-4e-5, 3],
      [-0.00029, 0],
      [-0.00017, 3],
      [-0.00062, 0],
      [-0.00028, 0],
      [-0.00028, 3],
      [-0.00018, 3],
      [-5e-5, 3],
      [-0.00021, 0],
      [-4e-5, 3],
      [-0.00025, 3],
      [-0.00012, 3],
      [-0.00035, 0],
      [0.0, 0],
      [-5e-5, 3],
      [0.0009, 1],
      [-5e-5, 3],
      [-0.00297, 2],
      [-0.0001, 3]
    ],
    "red_o_points": [],
    "y_categories": ["N", "NOT APPLICABLE", "Y", "nan"],
    "blue_o_points": [],
    "blue_x_points": [
      [0.00403, 1],
      [-7e-5, 3],
      [0.00029, 0],
      [0.00015, 0],
      [-7e-5, 3],
      [0.00126, 1],
      [0.00097, 1],
      [-0.00025, 0],
      [-5e-5, 3],
      [-5e-5, 3],
      [0.00052, 0],
      [0.00174, 1],
      [-5e-5, 3],
      [0.00182, 1],
      [-0.00011, 3]
    ]
  },
  "QS_lstBpsurgSide": {
    "red_x_points": [
      [-0.00057, 3],
      [-0.0149, 0],
      [-0.01591, 0],
      [-0.01165, 0],
      [-0.0157, 0],
      [-0.01361, 0],
      [-0.01587, 0],
      [-0.00144, 3],
      [-0.01681, 0],
      [0.00187, 2],
      [-0.00064, 3],
      [0.00258, 2],
      [-0.00144, 3],
      [0.00293, 2],
      [-0.00208, 2],
      [-0.0007, 3],
      [-0.00055, 3],
      [-0.00046, 3],
      [-0.00748, 0],
      [-0.00061, 3],
      [-0.00158, 3],
      [-0.00161, 3],
      [0.00257, 2],
      [0.00289, 2],
      [-0.00146, 3],
      [0.0125, 1],
      [-0.00135, 3],
      [-0.0137, 0],
      [-0.00168, 3]
    ],
    "red_o_points": [],
    "y_categories": ["L", "NOT APPLICABLE", "R", "nan"],
    "blue_o_points": [],
    "blue_x_points": [
      [0.04007, 1],
      [-0.00071, 3],
      [0.0053, 2],
      [0.0091, 2],
      [0.00012, 3],
      [0.01773, 1],
      [0.01143, 1],
      [-0.00167, 0],
      [-0.00075, 3],
      [-0.00023, 3],
      [0.00455, 2],
      [0.01617, 1],
      [-0.00027, 3],
      [0.01585, 1],
      [-0.0002, 3]
    ]
  },
  "QS_mulBpsurgeryType[Lysis]": {
    "red_x_points": [
      [-0.00072, 3],
      [-0.00649, 0],
      [-0.02114, 2],
      [-0.01762, 2],
      [-0.00368, 0],
      [-0.01949, 2],
      [-0.00357, 0],
      [-0.00179, 3],
      [-0.00391, 0],
      [-0.00392, 0],
      [-0.00075, 3],
      [-0.00373, 0],
      [-0.00187, 3],
      [-0.00631, 0],
      [-0.01794, 2],
      [-0.00121, 3],
      [-0.00103, 3],
      [-0.00068, 3],
      [-0.00355, 0],
      [-0.00083, 3],
      [-0.0018, 3],
      [-0.00174, 3],
      [-0.00386, 0],
      [-0.00384, 0],
      [-0.00168, 3],
      [0.02272, 1],
      [-0.00166, 3],
      [-0.01892, 2],
      [-0.0017, 3]
    ],
    "red_o_points": [],
    "y_categories": ["N", "NOT APPLICABLE", "Y", "nan"],
    "blue_o_points": [],
    "blue_x_points": [
      [0.04092, 1],
      [-0.00096, 3],
      [-0.00088, 0],
      [-0.00156, 0],
      [0.00026, 3],
      [0.03257, 1],
      [0.01956, 1],
      [-0.00172, 0],
      [-0.00095, 3],
      [-0.00027, 3],
      [-0.00104, 0],
      [0.02406, 1],
      [-0.00018, 3],
      [0.02361, 1],
      [-0.00072, 3]
    ]
  },
  "QA_yonInjUnconscio": {
    "red_x_points": [
      [-0.02296, 1],
      [-0.02157, 1],
      [-0.00175, 2],
      [-0.00246, 2],
      [-0.00165, 2],
      [-0.02478, 1],
      [-0.00165, 2],
      [-0.00358, 2],
      [-0.00203, 2],
      [-0.02449, 1],
      [-0.02237, 1],
      [-0.02594, 1],
      [-0.0052, 2],
      [-0.00203, 2],
      [-0.01289, 1],
      [-0.02186, 1],
      [-0.02144, 1],
      [-0.015, 1],
      [-0.01589, 1],
      [-0.02112, 1],
      [-0.00447, 2],
      [-0.00297, 2],
      [-0.02477, 1],
      [-0.02361, 1],
      [-0.00441, 2],
      [-0.00337, 2],
      [-0.00433, 2],
      [-0.0219, 1],
      [-0.00585, 2]
    ],
    "red_o_points": [],
    "y_categories": ["N", "Y", "nan"],
    "blue_o_points": [],
    "blue_x_points": [
      [-0.00094, 2],
      [-0.00142, 2],
      [0.07632, 0],
      [0.0001, 2],
      [-0.00789, 1],
      [-0.01077, 1],
      [0.04468, 0],
      [0.06273, 0],
      [-0.00161, 2],
      [0.05835, 0],
      [0.07946, 0],
      [-0.00239, 2],
      [-0.01124, 1],
      [-0.00266, 2],
      [0.08365, 0]
    ]
  },
  "QA_lstPexTouch[C7]": {
    "red_x_points": [
      [-0.00222, 1],
      [-0.01078, 2],
      [-0.00547, 1],
      [-0.00328, 1],
      [-0.01693, 2],
      [-0.00801, 1],
      [-0.00889, 1],
      [-0.00402, 0],
      [-0.01345, 1],
      [-0.01415, 1],
      [-0.00219, 1],
      [-0.0233, 2],
      [-0.00706, 2],
      [-0.02311, 2],
      [-0.00558, 2],
      [-0.00125, 0],
      [-0.00286, 1],
      [-0.00547, 0],
      [-0.00997, 2],
      [-0.005, 0],
      [-0.00739, 2],
      [-0.00479, 0],
      [-0.01423, 1],
      [-0.01727, 2],
      [-0.00512, 0],
      [-0.00016, 1],
      [0.00028, 2],
      [-0.00343, 1],
      [0.00188, 1]
    ],
    "red_o_points": [],
    "y_categories": ["NORM", "NPV", "nan"],
    "blue_o_points": [],
    "blue_x_points": [
      [-0.00015, 1],
      [0.01211, 1],
      [0.05791, 0],
      [0.07609, 0],
      [0.00899, 2],
      [0.0001, 2],
      [-3e-5, 1],
      [-0.00488, 1],
      [0.01156, 1],
      [0.00895, 2],
      [0.04739, 0],
      [-0.0001, 1],
      [-0.00083, 0],
      [0.00034, 0],
      [0.0058, 0]
    ]
  },
  "QA_lstPexInspectio[SurgicalScar]": {
    "red_x_points": [
      [-0.0034, 1],
      [-0.00696, 1],
      [-0.01111, 0],
      [-0.00481, 1],
      [-0.01162, 1],
      [-0.01658, 0],
      [-0.01031, 1],
      [-0.00319, 1],
      [-0.01514, 1],
      [-0.0145, 1],
      [-0.00903, 0],
      [-0.01547, 1],
      [0.00078, 2],
      [-0.01733, 1],
      [-0.0054, 0],
      [0.0059, 2],
      [0.00592, 2],
      [-0.00216, 1],
      [-0.0055, 1],
      [-0.00417, 1],
      [0.00083, 2],
      [-0.00407, 1],
      [-0.01538, 1],
      [0.01873, 2],
      [-0.00194, 1],
      [-0.00031, 1],
      [-0.0013, 1],
      [0.00904, 2],
      [-0.00141, 1]
    ],
    "red_o_points": [],
    "y_categories": ["ABS", "NAIA", "PT", "nan"],
    "blue_o_points": [],
    "blue_x_points": [
      [-0.00085, 1],
      [0.01045, 2],
      [0.0368, 2],
      [0.05027, 2],
      [0.00183, 1],
      [0.00038, 1],
      [0.00039, 0],
      [-0.00806, 1],
      [-0.00325, 1],
      [0.00161, 1],
      [0.03594, 2],
      [-0.00021, 1],
      [0.0041, 2],
      [0.00097, 0],
      [0.00955, 2]
    ]
  },
  "QS_mulNeuromadSite[T2]": {
    "red_x_points": [
      [-1e-5, 2],
      [-0.00023, 0],
      [-0.00014, 0],
      [-0.0001, 0],
      [-0.00014, 0],
      [-0.0, 2],
      [-9e-5, 0],
      [-1e-5, 0],
      [0.0, 2],
      [-3e-5, 0],
      [-2e-5, 2],
      [-0.00012, 0],
      [-0.00019, 0],
      [0.0, 2],
      [0.0, 2],
      [0.0, 2],
      [-3e-5, 0],
      [-1e-5, 2],
      [-5e-5, 2],
      [-0.0, 2],
      [-3e-5, 0],
      [-4e-5, 0],
      [-0.0, 2],
      [-0.0, 2],
      [-3e-5, 0],
      [-5e-5, 2]
    ],
    "red_o_points": [],
    "y_categories": ["N", "NOT APPLICABLE", "nan"],
    "blue_o_points": [],
    "blue_x_points": [
      [0.00075, 1],
      [-0.0, 2],
      [-4e-5, 0],
      [0.0001, 2],
      [0.00041, 1],
      [-2e-5, 2],
      [0.00014, 1],
      [0.0, 2]
    ]
  },
  "QS_mulLysisSite[Trunk]": {
    "red_x_points": [
      [-0.00034, 3],
      [-0.00368, 0],
      [-0.00239, 0],
      [-0.00201, 0],
      [-0.00239, 0],
      [-0.00923, 2],
      [-0.00242, 0],
      [-0.00042, 3],
      [-0.0029, 0],
      [-0.00202, 0],
      [-0.0002, 3],
      [-0.00216, 0],
      [-0.00057, 3],
      [-0.00334, 0],
      [-0.00863, 2],
      [-0.00034, 3],
      [-0.00029, 3],
      [-0.00028, 3],
      [-0.00197, 0],
      [-0.0003, 3],
      [-0.00056, 3],
      [-0.00043, 3],
      [-0.00233, 0],
      [-0.00199, 0],
      [-0.00047, 3],
      [0.00831, 1],
      [-0.00045, 3],
      [-0.00867, 2],
      [-0.00061, 3]
    ],
    "red_o_points": [],
    "y_categories": ["N", "NOT APPLICABLE", "Y", "nan"],
    "blue_o_points": [],
    "blue_x_points": [
      [0.01901, 1],
      [1e-5, 3],
      [-0.0012, 0],
      [-0.00119, 0],
      [0.00025, 3],
      [0.01219, 1],
      [0.00933, 1],
      [-0.00144, 0],
      [4e-5, 3],
      [-0.00021, 3],
      [-0.00117, 0],
      [0.00911, 1],
      [-0.00013, 3],
      [0.00874, 1],
      [-0.00025, 3]
    ]
  },
  "QS_mulGraftTrunk[UpperTrunk]": {
    "red_x_points": [
      [-0.00011, 3],
      [-0.00066, 0],
      [-0.0005, 0],
      [-0.00045, 0],
      [-0.00068, 0],
      [-0.00022, 0],
      [-0.00074, 0],
      [-0.00021, 3],
      [-0.0004, 0],
      [-0.00016, 0],
      [-8e-5, 3],
      [-0.00018, 0],
      [-0.00017, 3],
      [-0.00739, 2],
      [-0.00035, 0],
      [-3e-5, 3],
      [-6e-5, 3],
      [-1e-5, 3],
      [-0.0001, 0],
      [-0.0001, 3],
      [-0.0003, 3],
      [-0.00018, 3],
      [-9e-5, 0],
      [-0.00014, 0],
      [-0.00015, 3],
      [0.00108, 1],
      [-0.00024, 3],
      [-0.00026, 0],
      [-0.00031, 3]
    ],
    "red_o_points": [],
    "y_categories": ["N", "NOT APPLICABLE", "Y", "nan"],
    "blue_o_points": [],
    "blue_x_points": [
      [0.00596, 1],
      [-1e-5, 3],
      [0.00063, 0],
      [0.00233, 0],
      [-3e-5, 3],
      [0.00099, 1],
      [0.0005, 1],
      [7e-5, 0],
      [2e-5, 3],
      [0.0, 3],
      [0.00011, 0],
      [0.00126, 1],
      [-3e-5, 3],
      [0.00135, 1],
      [-0.0, 3]
    ]
  },
  "QS_mulTransfSite[PhMc]": {
    "red_x_points": [
      [-0.00022, 3],
      [-0.00189, 0],
      [-0.00137, 0],
      [-0.00141, 0],
      [-0.00185, 0],
      [-0.0011, 0],
      [-0.00565, 2],
      [-0.00039, 3],
      [-0.00177, 0],
      [-0.0012, 0],
      [-0.00035, 3],
      [-0.00126, 0],
      [-0.00044, 3],
      [-0.002, 0],
      [-0.00133, 0],
      [-0.00024, 3],
      [-0.00028, 3],
      [-0.0002, 3],
      [-0.00352, 2],
      [-0.00026, 3],
      [-0.0005, 3],
      [-0.00053, 3],
      [-0.00131, 0],
      [-0.00107, 0],
      [-0.00041, 3],
      [0.00443, 1],
      [-0.00042, 3],
      [-0.00082, 0],
      [-0.00048, 3]
    ],
    "red_o_points": [],
    "y_categories": ["N", "NOT APPLICABLE", "Y", "nan"],
    "blue_o_points": [],
    "blue_x_points": [
      [0.01088, 1],
      [-0.0003, 3],
      [-0.00051, 0],
      [-0.00098, 0],
      [-8e-5, 3],
      [0.00599, 1],
      [0.00395, 1],
      [-0.00072, 0],
      [-0.00011, 3],
      [-9e-5, 3],
      [-0.00064, 0],
      [0.00547, 1],
      [-0.00012, 3],
      [0.00523, 1],
      [-0.00015, 3]
    ]
  },
  "QA_intPexForearmProna": {
    "red_x_points": [
      [-0.00187, 2],
      [-0.00116, 0],
      [-0.00133, 2],
      [-0.00053, 2],
      [-0.00112, 2],
      [-0.00343, 0],
      [-0.00109, 2],
      [-0.02634, 0],
      [-0.00115, 2],
      [-0.00113, 2],
      [-0.02649, 0],
      [-0.00339, 0],
      [-0.00233, 2],
      [-0.00109, 2],
      [4e-5, 2],
      [-0.02626, 0],
      [-0.0263, 0],
      [-0.02257, 0],
      [-0.00217, 0],
      [-0.00156, 2],
      [-0.00243, 2],
      [-0.00192, 2],
      [-0.0011, 2],
      [-0.00131, 2],
      [0.00022, 2],
      [0.00095, 1],
      [0.00028, 2],
      [-0.00341, 0],
      [-0.00186, 2]
    ],
    "red_o_points": [],
    "y_categories": ["GREATER THAN OR EQUALS TO 80", "LESS THAN 80", "nan"],
    "blue_o_points": [],
    "blue_x_points": [
      [-0.00065, 2],
      [0.08325, 1],
      [-0.00043, 0],
      [-0.00107, 2],
      [0.00126, 2],
      [5e-5, 2],
      [0.00117, 1],
      [8e-5, 2],
      [-0.00081, 2],
      [0.00157, 2],
      [-0.00042, 0],
      [7e-5, 2],
      [0.00132, 2],
      [6e-5, 2],
      [0.07642, 1]
    ]
  },
  "QA_yonPexPain": {
    "red_x_points": [
      [-0.00835, 1],
      [-0.00117, 1],
      [-0.00082, 1],
      [-0.00056, 1],
      [-0.00146, 1],
      [-0.00095, 0],
      [-0.00081, 1],
      [-0.00778, 1],
      [4e-5, 0],
      [7e-5, 1],
      [-0.00588, 1],
      [-0.00111, 0],
      [-0.01147, 1],
      [-0.00158, 1],
      [-0.00043, 1],
      [0.00959, 0],
      [-0.0068, 1],
      [0.00888, 0],
      [-0.00047, 1],
      [0.01262, 0],
      [-0.02339, 2],
      [-0.0104, 1],
      [0.00022, 1],
      [-0.00121, 1],
      [-0.01694, 2],
      [-0.00174, 1],
      [-0.0086, 1],
      [-0.00052, 1],
      [-0.01184, 1]
    ],
    "red_o_points": [],
    "y_categories": ["N", "Y", "nan"],
    "blue_o_points": [],
    "blue_x_points": [
      [-0.0005, 1],
      [0.02549, 0],
      [0.00599, 0],
      [0.00015, 1],
      [-0.00609, 1],
      [0.00094, 2],
      [-2e-5, 1],
      [0.00113, 1],
      [0.02966, 0],
      [0.02136, 0],
      [0.00084, 1],
      [0.00252, 0],
      [0.01565, 0],
      [-0.00028, 1],
      [-0.004, 1]
    ]
  },
  "QS_mulLysisRoot[C6]": {
    "red_x_points": [
      [-0.00025, 3],
      [-0.00277, 0],
      [-0.00709, 2],
      [-0.00171, 0],
      [-0.00204, 0],
      [-0.00172, 0],
      [-0.00199, 0],
      [-0.00054, 3],
      [-0.00255, 0],
      [-0.00189, 0],
      [-0.00032, 3],
      [-0.00193, 0],
      [-0.00084, 3],
      [-0.00315, 0],
      [-0.00233, 0],
      [-0.00025, 3],
      [-0.00034, 3],
      [-0.00025, 3],
      [-0.00159, 0],
      [-0.00028, 3],
      [-0.00088, 3],
      [-0.00063, 3],
      [-0.0019, 0],
      [-0.00161, 0],
      [-0.00062, 3],
      [0.00568, 1],
      [-0.00061, 3],
      [-0.00736, 2],
      [-0.0007, 3]
    ],
    "red_o_points": [],
    "y_categories": ["N", "NOT APPLICABLE", "Y", "nan"],
    "blue_o_points": [],
    "blue_x_points": [
      [0.01806, 1],
      [-0.00022, 3],
      [-0.00077, 0],
      [-0.00127, 0],
      [-1e-5, 3],
      [0.00917, 1],
      [0.00572, 1],
      [-0.00118, 0],
      [-0.00019, 3],
      [-0.00018, 3],
      [-0.00059, 0],
      [0.00685, 1],
      [-0.00014, 3],
      [0.00734, 1],
      [-0.00017, 3]
    ]
  },
  "QS_mulGraftLevel[Trunk]": {
    "red_x_points": [
      [6e-5, 3],
      [-0.00056, 0],
      [-0.00021, 0],
      [-0.0002, 0],
      [-0.0003, 0],
      [-1e-5, 0],
      [-0.0003, 0],
      [-0.0001, 3],
      [-0.00023, 0],
      [5e-5, 0],
      [-2e-5, 3],
      [-0.0001, 0],
      [-0.00021, 3],
      [-0.00492, 2],
      [-0.00032, 0],
      [-2e-5, 3],
      [1e-5, 3],
      [2e-5, 3],
      [-4e-5, 0],
      [-1e-5, 3],
      [-0.00022, 3],
      [-2e-5, 3],
      [3e-5, 0],
      [-5e-5, 0],
      [-0.00013, 3],
      [0.00045, 1],
      [-9e-5, 3],
      [-0.0001, 0],
      [-0.00024, 3]
    ],
    "red_o_points": [],
    "y_categories": ["N", "NOT APPLICABLE", "Y", "nan"],
    "blue_o_points": [],
    "blue_x_points": [
      [0.00262, 1],
      [-2e-5, 3],
      [0.00059, 0],
      [0.0014, 0],
      [0.00015, 3],
      [0.00086, 1],
      [6e-5, 1],
      [0.00017, 0],
      [7e-5, 3],
      [1e-5, 3],
      [0.00029, 0],
      [0.00075, 1],
      [5e-5, 3],
      [0.00077, 1],
      [-0.0, 3]
    ]
  }
}
