{
  "QA_lstPexPain[C8]": {
    "red_x_points": [
      [0.00829, 0],
      [-0.00698, 2],
      [-0.01136, 2],
      [0.00608, 0],
      [-0.0058, 2],
      [-0.00678, 1],
      [-0.0146, 1],
      [-0.00883, 1],
      [-0.01041, 2],
      [-0.00868, 2],
      [-0.0197, 2],
      [-0.00457, 2],
      [-0.01573, 1],
      [0.00837, 0],
      [-0.01327, 1],
      [-0.01308, 1],
      [-0.00399, 2],
      [-0.01108, 2],
      [-0.0168, 2],
      [-0.00849, 2],
      [-0.01467, 1],
      [-0.00611, 1],
      [-0.01944, 1]
    ],
    "red_o_points": [],
    "y_categories": ["NORM", "NPV", "nan"],
    "blue_o_points": [],
    "blue_x_points": [
      [-0.00642, 1],
      [-0.00595, 1],
      [0.01473, 0],
      [0.00292, 1],
      [0.01996, 0],
      [0.02288, 0],
      [0.01787, 0],
      [0.01655, 0],
      [-0.00737, 2],
      [0.00038, 2],
      [-0.00412, 2],
      [0.00124, 1],
      [-0.00556, 2],
      [0.01729, 0],
      [0.01543, 0],
      [0.01628, 0],
      [-0.00557, 2],
      [0.01686, 0],
      [0.01436, 0],
      [0.0316, 0],
      [0.02428, 0]
    ]
  },
  "QA_lstPexPain[C7]": {
    "red_x_points": [
      [-0.01672, 1],
      [-0.01466, 2],
      [-0.01454, 2],
      [-0.01962, 1],
      [-0.01151, 2],
      [-0.00954, 1],
      [-0.01309, 1],
      [-0.01609, 1],
      [-0.01508, 2],
      [-0.01571, 2],
      [-0.02183, 2],
      [-0.0113, 2],
      [-0.01439, 1],
      [0.01993, 0],
      [-0.01672, 1],
      [-0.01203, 1],
      [-0.01041, 2],
      [-0.02184, 2],
      [-0.02572, 2],
      [-0.01755, 2],
      [-0.02006, 1],
      [-0.00974, 1],
      [-0.01553, 1]
    ],
    "red_o_points": [],
    "y_categories": ["NORM", "NPV", "nan"],
    "blue_o_points": [],
    "blue_x_points": [
      [-0.00916, 1],
      [-0.00898, 1],
      [0.03404, 0],
      [-0.00302, 1],
      [0.04658, 0],
      [-0.00601, 1],
      [0.04357, 0],
      [0.04813, 0],
      [-0.01293, 2],
      [-0.00148, 2],
      [-0.00943, 2],
      [-0.00397, 1],
      [-0.00893, 2],
      [0.0366, 0],
      [0.03418, 0],
      [0.03726, 0],
      [-0.01034, 2],
      [0.03481, 0],
      [0.04626, 0],
      [-0.01056, 1],
      [0.04714, 0]
    ]
  },
  "QA_mulInjOrthesisType[ArmSling]": {
    "red_x_points": [
      [-0.00908, 2],
      [-0.01789, 2],
      [-0.00582, 2],
      [-0.00123, 2],
      [-0.00921, 2],
      [-0.00064, 2],
      [-0.00157, 2],
      [-0.01256, 1],
      [-0.01884, 2],
      [-0.01334, 2],
      [-0.00388, 2],
      [-0.03653, 0],
      [-0.01191, 3],
      [-0.00402, 2],
      [-0.02343, 1],
      [-0.0021, 2],
      [-0.03006, 3],
      [-0.01612, 2],
      [-0.00299, 2],
      [-0.01145, 2],
      [-0.01064, 3],
      [-0.00178, 2],
      [-0.0075, 2]
    ],
    "red_o_points": [],
    "y_categories": ["N", "NOT APPLICABLE", "Y", "nan"],
    "blue_o_points": [],
    "blue_x_points": [
      [0.00334, 2],
      [0.00293, 2],
      [0.00202, 2],
      [0.00605, 2],
      [-0.00082, 2],
      [0.00546, 2],
      [0.00061, 2],
      [-0.00044, 2],
      [0.0809, 1],
      [0.05424, 1],
      [-0.011, 2],
      [0.03316, 1],
      [0.04839, 1],
      [-0.00066, 2],
      [0.01297, 0],
      [-0.00057, 2],
      [-0.01315, 2],
      [0.01602, 1],
      [0.01538, 1],
      [-0.00673, 2],
      [0.00446, 3]
    ]
  },
  "QA_mulInjOrthesisType[ShoulderSupport]": {
    "red_x_points": [
      [-0.00723, 0],
      [-0.01657, 0],
      [-0.00632, 0],
      [-0.02745, 2],
      [-0.00863, 0],
      [-0.00032, 0],
      [-0.00059, 0],
      [-0.0129, 1],
      [-0.01805, 0],
      [-0.01151, 0],
      [-0.00396, 0],
      [-0.02428, 2],
      [-0.01764, 3],
      [-0.00564, 0],
      [-0.02067, 1],
      [-0.00234, 0],
      [-0.02412, 3],
      [-0.01654, 0],
      [-0.00344, 0],
      [-0.01129, 0],
      [-0.01233, 3],
      [-0.00145, 0],
      [-0.00626, 0]
    ],
    "red_o_points": [],
    "y_categories": ["N", "NOT APPLICABLE", "Y", "nan"],
    "blue_o_points": [],
    "blue_x_points": [
      [0.00484, 0],
      [0.00416, 0],
      [0.00165, 0],
      [0.0077, 0],
      [0.01919, 2],
      [0.00855, 0],
      [0.0015, 0],
      [0.00385, 0],
      [0.07097, 1],
      [0.04567, 1],
      [-0.00817, 0],
      [0.02745, 1],
      [0.04076, 1],
      [0.00078, 0],
      [0.0082, 2],
      [-0.00042, 0],
      [-0.01228, 0],
      [0.01449, 1],
      [0.01745, 1],
      [-0.00192, 0],
      [0.00513, 3]
    ]
  },
  "QA_lstPexTouch[C7]": {
    "red_x_points": [
      [-0.02322, 1],
      [-0.00781, 2],
      [-0.01528, 1],
      [-0.01954, 1],
      [-0.00633, 2],
      [-0.01276, 1],
      [-0.01929, 1],
      [-0.0223, 1],
      [-0.0072, 2],
      [-0.01254, 2],
      [-0.02287, 1],
      [-0.00519, 2],
      [-0.02313, 1],
      [0.01374, 0],
      [-0.02513, 1],
      [-0.01889, 1],
      [-0.00338, 2],
      [0.01311, 0],
      [-0.01413, 1],
      [-0.00706, 2],
      [-0.02644, 1],
      [-0.01236, 1],
      [-0.02361, 1]
    ],
    "red_o_points": [],
    "y_categories": ["NORM", "NPV", "nan"],
    "blue_o_points": [],
    "blue_x_points": [
      [-0.0177, 1],
      [-0.01712, 1],
      [0.03144, 0],
      [-0.00897, 1],
      [0.03818, 0],
      [-0.01172, 1],
      [0.03971, 0],
      [-0.01022, 1],
      [-0.00158, 2],
      [0.01049, 2],
      [0.0007, 2],
      [-0.00869, 1],
      [0.00475, 2],
      [0.02702, 0],
      [0.02661, 0],
      [0.02969, 0],
      [0.00491, 2],
      [0.02664, 0],
      [0.04288, 0],
      [0.05158, 0],
      [0.04301, 0]
    ]
  },
  "QA_lstPexTouch[C6]": {
    "red_x_points": [
      [-0.00817, 1],
      [-0.00408, 2],
      [-0.00603, 1],
      [-0.00537, 1],
      [-0.00328, 2],
      [-0.00206, 1],
      [-0.00279, 1],
      [-0.00861, 1],
      [-0.00536, 2],
      [-0.0042, 2],
      [-0.00431, 1],
      [-0.0022, 2],
      [-0.00518, 1],
      [-0.01039, 1],
      [-0.00956, 1],
      [-0.00295, 1],
      [-0.00202, 2],
      [-0.0078, 1],
      [-0.00386, 1],
      [-0.01187, 2],
      [-0.0066, 1],
      [-0.00277, 1],
      [-0.00475, 1]
    ],
    "red_o_points": [],
    "y_categories": ["NORM", "NPV", "nan"],
    "blue_o_points": [],
    "blue_x_points": [
      [-0.0043, 1],
      [-0.00417, 1],
      [0.02498, 0],
      [-0.00324, 1],
      [0.04062, 0],
      [-0.00327, 1],
      [-0.00326, 1],
      [-0.0037, 1],
      [-0.00105, 2],
      [0.00663, 2],
      [9e-5, 2],
      [-0.00377, 1],
      [0.00134, 2],
      [-0.00447, 1],
      [-0.00332, 1],
      [0.02465, 0],
      [0.00153, 2],
      [0.0208, 0],
      [0.04472, 0],
      [-0.00365, 1],
      [-0.00294, 1]
    ]
  },
  "participant_code": {
    "red_x_points": [
      [-0.09751, 0],
      [-0.09635, 2],
      [-0.09635, 3],
      [-0.09673, 4],
      [-0.09722, 5],
      [-0.09751, 9],
      [-0.09732, 14],
      [-0.09703, 17],
      [-0.09654, 19],
      [-0.09703, 20],
      [-0.09508, 22],
      [-0.09732, 23],
      [-0.09955, 24],
      [-0.0979, 26],
      [-0.09596, 28],
      [-0.09538, 29],
      [-0.09528, 31],
      [-0.09547, 35],
      [-0.09567, 37],
      [-0.0978, 39],
      [-0.09635, 41],
      [-0.09761, 42],
      [-0.09654, 43]
    ],
    "red_o_points": [],
    "y_categories": [
      "P16554",
      "P18297",
      "P19283",
      "P19287",
      "P23172",
      "P23391",
      "P30595",
      "P31645",
      "P31691",
      "P34778",
      "P35046",
      "P36328",
      "P43633",
      "P4544",
      "P46417",
      "P48965",
      "P53068",
      "P5497",
      "P58556",
      "P59529",
      "P62483",
      "P64658",
      "P65202",
      "P66816",
      "P67052",
      "P6751",
      "P7408",
      "P75566",
      "P76226",
      "P79971",
      "P82621",
      "P82990",
      "P84549",
      "P84932",
      "P85825",
      "P86989",
      "P8770",
      "P87791",
      "P90550",
      "P93159",
      "P94969",
      "P96710",
      "P9744",
      "P98500",
      "nan"
    ],
    "blue_o_points": [],
    "blue_x_points": [
      [0.10654, 1],
      [0.10489, 6],
      [0.10798, 7],
      [0.10489, 8],
      [0.10746, 10],
      [0.10428, 11],
      [0.10438, 12],
      [0.10448, 13],
      [0.10644, 15],
      [0.10674, 16],
      [0.10654, 18],
      [0.10572, 21],
      [0.10644, 25],
      [0.10757, 27],
      [0.10592, 30],
      [0.10448, 32],
      [0.10726, 33],
      [0.10705, 34],
      [0.10644, 36],
      [0.10633, 38],
      [0.10366, 40]
    ]
  },
  "QA_lstPexArthre[Shoulder]": {
    "red_x_points": [
      [0.0107, 2],
      [-0.00235, 3],
      [-0.00864, 3],
      [0.01116, 2],
      [-0.01802, 0],
      [-0.02644, 1],
      [0.01222, 2],
      [0.01391, 2],
      [-0.00334, 3],
      [0.00647, 2],
      [-0.00756, 3],
      [-0.00169, 3],
      [-0.00828, 3],
      [-0.06814, 1],
      [0.01208, 2],
      [-0.03223, 1],
      [-0.00201, 3],
      [-0.00813, 3],
      [-0.01344, 3],
      [-0.00285, 3],
      [-0.0071, 3],
      [-0.02399, 1],
      [-0.00857, 3]
    ],
    "red_o_points": [],
    "y_categories": ["NAIA", "NPV", "PV", "nan"],
    "blue_o_points": [],
    "blue_x_points": [
      [0.02469, 2],
      [-0.00498, 3],
      [0.01257, 2],
      [0.01803, 2],
      [-0.00049, 3],
      [0.01731, 2],
      [0.01788, 2],
      [0.01937, 2],
      [-0.00164, 3],
      [-0.00079, 3],
      [-0.00188, 3],
      [0.02411, 2],
      [-0.00107, 3],
      [0.01614, 2],
      [0.01017, 2],
      [-0.00417, 1],
      [-0.0017, 3],
      [0.00828, 2],
      [-0.00026, 3],
      [0.01673, 2],
      [0.00795, 2]
    ]
  },
  "QA_lstPexTouch[T1]": {
    "red_x_points": [
      [-0.01981, 1],
      [-0.00426, 2],
      [-0.01023, 1],
      [0.00809, 0],
      [-0.00396, 2],
      [-0.00819, 1],
      [0.00486, 0],
      [-0.01484, 1],
      [-0.00558, 2],
      [-0.00881, 2],
      [-0.01401, 1],
      [-0.00271, 2],
      [-0.01003, 1],
      [-0.03033, 1],
      [-0.01811, 1],
      [-0.0103, 1],
      [-0.00158, 2],
      [0.00244, 0],
      [-0.01568, 1],
      [-0.01002, 2],
      [-0.01537, 1],
      [-0.00781, 1],
      [-0.01102, 1]
    ],
    "red_o_points": [],
    "y_categories": ["NORM", "NPV", "nan"],
    "blue_o_points": [],
    "blue_x_points": [
      [-0.00988, 1],
      [-0.00685, 1],
      [0.02619, 0],
      [-0.01061, 1],
      [-0.00561, 1],
      [0.0317, 0],
      [0.03257, 0],
      [0.03029, 0],
      [-0.00099, 2],
      [0.00648, 2],
      [0.00071, 2],
      [-0.00864, 1],
      [0.00209, 2],
      [0.01869, 0],
      [0.01418, 0],
      [0.01569, 0],
      [0.0042, 2],
      [-0.00648, 1],
      [0.02619, 0],
      [0.02665, 0],
      [0.0207, 0]
    ]
  },
  "QA_yonInjFracture": {
    "red_x_points": [
      [0.00246, 0],
      [-0.01384, 2],
      [0.00557, 0],
      [-0.01724, 2],
      [-0.01453, 1],
      [-0.01471, 1],
      [0.00829, 0],
      [0.01065, 0],
      [-0.02501, 1],
      [-0.01774, 1],
      [0.00609, 0],
      [-0.01001, 1],
      [-0.01744, 1],
      [-0.00607, 0],
      [-0.03794, 1],
      [-0.01999, 1],
      [-0.01243, 1],
      [-0.00082, 0],
      [0.00364, 0],
      [0.00988, 0],
      [-0.016, 1],
      [-0.01142, 1],
      [-0.03459, 1]
    ],
    "red_o_points": [],
    "y_categories": ["N", "Y", "nan"],
    "blue_o_points": [],
    "blue_x_points": [
      [0.01743, 0],
      [0.02349, 0],
      [0.00364, 0],
      [0.01499, 0],
      [0.01042, 2],
      [0.01156, 0],
      [0.00818, 1],
      [0.00856, 1],
      [-0.00768, 1],
      [0.01526, 0],
      [0.0238, 0],
      [0.01612, 0],
      [0.01725, 0],
      [0.00298, 0],
      [0.00486, 0],
      [0.00792, 2],
      [0.02614, 0],
      [0.008, 0],
      [0.00168, 0],
      [0.00279, 1],
      [0.00577, 2]
    ]
  },
  "QA_equInjTbpiTime": {
    "red_x_points": [
      [-0.02584, 0],
      [-0.02246, 0],
      [0.00425, 3],
      [0.00344, 3],
      [-0.01697, 0],
      [-0.01378, 0],
      [-0.01568, 0],
      [-0.02517, 0],
      [0.00675, 3],
      [-0.02254, 0],
      [-0.02126, 0],
      [-0.01775, 0],
      [0.00236, 3],
      [0.00112, 3],
      [-0.02764, 0],
      [-0.01458, 0],
      [-0.02463, 2],
      [-0.05259, 2],
      [-0.01975, 0],
      [-0.03864, 2],
      [-0.02176, 0],
      [0.00396, 3],
      [0.01757, 1]
    ],
    "red_o_points": [],
    "y_categories": [
      "0 TO 6 MONTHS",
      "13 TO 24 MONTHS",
      "25 MONTHS OR MORE",
      "7 TO 12 MONTHS",
      "nan"
    ],
    "blue_o_points": [],
    "blue_x_points": [
      [-0.01739, 0],
      [0.04718, 1],
      [-0.01323, 0],
      [0.0522, 1],
      [0.00888, 3],
      [-0.01693, 0],
      [-0.01099, 0],
      [0.00881, 3],
      [-0.01292, 0],
      [0.0028, 2],
      [0.0571, 1],
      [0.01519, 3],
      [0.04984, 1],
      [0.00941, 3],
      [0.04121, 1],
      [0.03802, 1],
      [0.01512, 3],
      [0.03835, 1],
      [0.01996, 3],
      [0.0159, 3],
      [-0.00692, 0]
    ]
  },
  "QS_mulTransfSite[Oberlin]": {
    "red_x_points": [
      [-0.02736, 1],
      [-0.06376, 0],
      [-0.06427, 0],
      [-0.07063, 0],
      [-0.06301, 0],
      [-0.0614, 0],
      [0.01648, 3],
      [-0.02835, 1],
      [0.0197, 3],
      [0.02211, 2],
      [0.01807, 3],
      [-0.06095, 0],
      [0.01714, 3],
      [0.02515, 2],
      [-0.03142, 1],
      [0.01793, 3],
      [-0.06372, 0],
      [0.01778, 3],
      [0.0288, 2],
      [-0.06949, 0],
      [-0.0249, 1],
      [-0.06105, 0],
      [0.01795, 3]
    ],
    "red_o_points": [],
    "y_categories": ["N", "NOT APPLICABLE", "Y", "nan"],
    "blue_o_points": [],
    "blue_x_points": [
      [0.02406, 3],
      [0.02046, 3],
      [0.03131, 2],
      [0.03668, 2],
      [0.02138, 3],
      [0.03763, 2],
      [0.03247, 2],
      [0.035, 2],
      [0.02469, 3],
      [-0.00166, 1],
      [0.03205, 2],
      [0.03906, 2],
      [0.02265, 3],
      [0.02158, 3],
      [0.02003, 3],
      [0.01889, 3],
      [0.02396, 3],
      [0.01913, 3],
      [-0.00964, 1],
      [0.02097, 3],
      [0.01848, 3]
    ]
  },
  "QA_yonPexPain": {
    "red_x_points": [
      [-0.02185, 1],
      [-0.02562, 1],
      [-0.02225, 1],
      [-0.0214, 1],
      [-0.02435, 1],
      [-0.01891, 1],
      [-0.02131, 1],
      [-0.02199, 1],
      [-0.02843, 1],
      [-0.02692, 1],
      [0.03021, 0],
      [-0.02106, 1],
      [-0.02126, 1],
      [-0.02589, 1],
      [0.02634, 0],
      [-0.02285, 1],
      [-0.02332, 1],
      [-0.02894, 1],
      [-0.0238, 1],
      [-0.02567, 1],
      [-0.02171, 1],
      [-0.01882, 1],
      [-0.02883, 1]
    ],
    "red_o_points": [],
    "y_categories": ["N", "Y", "nan"],
    "blue_o_points": [],
    "blue_x_points": [
      [-0.02328, 1],
      [0.04814, 0],
      [0.03817, 0],
      [0.04345, 0],
      [-0.01876, 1],
      [0.04509, 0],
      [-0.02044, 1],
      [-0.01971, 1],
      [-0.02336, 1],
      [0.05944, 2],
      [0.05447, 0],
      [-0.0237, 1],
      [0.04843, 0],
      [0.03882, 0],
      [0.03685, 0],
      [0.03706, 0],
      [0.06966, 2],
      [0.03912, 0],
      [-0.01825, 1],
      [-0.02271, 1],
      [0.05009, 2]
    ]
  },
  "QA_lstPexMuscstrength[FingersFlex]": {
    "red_x_points": [
      [0.00359, 2],
      [0.00349, 2],
      [-0.05747, 1],
      [0.01939, 0],
      [-0.0533, 1],
      [-0.05185, 1],
      [-0.0632, 1],
      [0.0182, 0],
      [0.00477, 2],
      [0.00331, 2],
      [0.01732, 0],
      [0.00339, 2],
      [-0.06591, 1],
      [0.0176, 0],
      [0.01754, 0],
      [-0.06416, 1],
      [-0.05213, 1],
      [0.00525, 2],
      [0.01713, 0],
      [0.01265, 0],
      [0.00259, 2],
      [-0.0528, 1],
      [0.00283, 2]
    ],
    "red_o_points": [],
    "y_categories": ["GREATER THAN OR EQUALS TO 3", "LESS THAN 3", "nan"],
    "blue_o_points": [],
    "blue_x_points": [
      [0.02786, 0],
      [0.02503, 0],
      [0.01645, 0],
      [0.01783, 0],
      [0.02303, 0],
      [0.01932, 0],
      [0.01882, 0],
      [0.0193, 0],
      [0.00611, 2],
      [0.00729, 2],
      [0.0071, 2],
      [0.00982, 2],
      [0.00755, 2],
      [0.02018, 0],
      [0.01859, 0],
      [0.01935, 0],
      [0.00998, 2],
      [0.00651, 2],
      [0.019, 0],
      [0.00722, 2],
      [0.00545, 2]
    ]
  },
  "QA_lstPexTouch[C8]": {
    "red_x_points": [
      [0.00984, 0],
      [-0.0072, 2],
      [-0.01561, 1],
      [-0.02406, 1],
      [-0.00543, 2],
      [-0.01116, 1],
      [-0.01497, 1],
      [-0.01626, 1],
      [-0.00869, 2],
      [-0.00779, 2],
      [-0.0173, 1],
      [-0.00436, 2],
      [-0.0224, 1],
      [0.01686, 0],
      [-0.01678, 1],
      [-0.01482, 1],
      [-0.00352, 2],
      [0.01124, 0],
      [-0.01458, 1],
      [-0.0103, 2],
      [-0.02133, 1],
      [-0.01362, 1],
      [-0.02282, 1]
    ],
    "red_o_points": [],
    "y_categories": ["NORM", "NPV", "nan"],
    "blue_o_points": [],
    "blue_x_points": [
      [-0.01486, 1],
      [-0.0148, 1],
      [0.02109, 0],
      [-0.00874, 1],
      [0.03363, 0],
      [-0.00945, 1],
      [0.02724, 0],
      [0.03325, 0],
      [-0.00145, 2],
      [0.00305, 2],
      [0.0004, 2],
      [-0.00907, 1],
      [0.00233, 2],
      [0.02227, 0],
      [0.01765, 0],
      [0.0236, 0],
      [0.00279, 2],
      [0.01598, 0],
      [0.02421, 0],
      [0.03776, 0],
      [0.0282, 0]
    ]
  },
  "QA_yonPreFracture": {
    "red_x_points": [
      [-0.05173, 1],
      [0.00092, 2],
      [0.00788, 0],
      [0.00279, 2],
      [0.00742, 0],
      [0.00798, 0],
      [-0.04676, 1],
      [0.01062, 0],
      [0.00031, 2],
      [-0.05622, 1],
      [-0.0662, 1],
      [-0.03817, 1],
      [0.00188, 2],
      [0.0099, 0],
      [0.00993, 0],
      [0.00892, 0],
      [0.00688, 0],
      [0.0119, 0],
      [-0.06127, 1],
      [0.00776, 0],
      [0.00053, 2],
      [-0.03399, 1],
      [0.0012, 2]
    ],
    "red_o_points": [],
    "y_categories": ["N", "Y", "nan"],
    "blue_o_points": [],
    "blue_x_points": [
      [0.01619, 0],
      [0.01286, 2],
      [0.01361, 0],
      [0.01509, 0],
      [0.00767, 2],
      [0.01764, 0],
      [0.01326, 0],
      [0.01545, 2],
      [0.00501, 2],
      [0.0125, 0],
      [0.01824, 0],
      [0.02036, 0],
      [0.01425, 0],
      [0.01031, 0],
      [0.00935, 0],
      [0.00765, 2],
      [0.01546, 0],
      [0.01209, 0],
      [0.01011, 0],
      [0.00514, 2],
      [0.00528, 2]
    ]
  }
}
