{
  "QA_lstPexMuscstrength[ElbowFlex]": {
    "red_x_points": [
      [-0.01299, 1],
      [-0.00132, 2],
      [-0.01226, 1],
      [-0.01132, 1],
      [-0.01216, 1],
      [-0.01279, 1],
      [-0.0124, 1],
      [-0.01208, 1],
      [-0.01264, 1],
      [-0.01363, 1],
      [-0.01271, 1],
      [-0.01401, 1],
      [-0.00147, 2],
      [-0.0052, 2],
      [0.00116, 2],
      [-0.01265, 1],
      [-0.01283, 1],
      [-0.012, 1],
      [-0.01201, 1],
      [-0.01262, 1],
      [-0.00102, 2],
      [-0.0122, 1],
      [-0.01349, 1],
      [-0.01354, 1],
      [-0.01188, 1],
      [0.0005, 2],
      [-0.01145, 1],
      [-0.01272, 1],
      [-0.00131, 2]
    ],
    "red_o_points": [],
    "y_categories": ["GREATER THAN OR EQUALS TO 3", "LESS THAN 3", "nan"],
    "blue_o_points": [],
    "blue_x_points": [
      [0.00143, 2],
      [-0.01171, 1],
      [0.06696, 0],
      [-0.01171, 1],
      [0.00303, 2],
      [0.00284, 2],
      [0.04652, 0],
      [-0.01076, 1],
      [-0.01206, 1],
      [0.0021, 2],
      [0.06692, 0],
      [0.0504, 0],
      [0.056, 0],
      [0.0468, 0],
      [-0.01173, 1]
    ]
  },
  "participant_code": {
    "red_x_points": [
      [-0.04161, 1],
      [-0.04333, 2],
      [-0.04374, 3],
      [-0.0436, 4],
      [-0.04374, 5],
      [-0.04312, 8],
      [-0.04299, 9],
      [-0.04305, 10],
      [-0.04401, 11],
      [-0.04175, 13],
      [-0.04333, 14],
      [-0.04127, 18],
      [-0.04443, 19],
      [-0.04271, 20],
      [-0.04223, 23],
      [-0.04237, 26],
      [-0.04134, 28],
      [-0.04271, 29],
      [-0.04312, 30],
      [-0.04333, 31],
      [-0.04504, 32],
      [-0.04189, 34],
      [-0.04312, 36],
      [-0.04415, 38],
      [-0.04381, 39],
      [-0.04381, 40],
      [-0.04175, 41],
      [-0.04278, 42],
      [-0.04155, 43]
    ],
    "red_o_points": [],
    "y_categories": [
      "P16554",
      "P18297",
      "P19283",
      "P19287",
      "P23172",
      "P23391",
      "P30595",
      "P31645",
      "P31691",
      "P34778",
      "P35046",
      "P36328",
      "P43633",
      "P4544",
      "P46417",
      "P48965",
      "P53068",
      "P5497",
      "P58556",
      "P59529",
      "P62483",
      "P64658",
      "P65202",
      "P66816",
      "P6751",
      "P7408",
      "P75566",
      "P76226",
      "P79971",
      "P82621",
      "P82990",
      "P84549",
      "P84932",
      "P85825",
      "P86989",
      "P8770",
      "P87791",
      "P90550",
      "P93159",
      "P94969",
      "P96710",
      "P97130",
      "P9744",
      "P98500",
      "nan"
    ],
    "blue_o_points": [],
    "blue_x_points": [
      [0.08239, 0],
      [0.08278, 6],
      [0.08252, 7],
      [0.0816, 12],
      [0.08186, 15],
      [0.08344, 16],
      [0.08081, 17],
      [0.08239, 21],
      [0.08462, 22],
      [0.08567, 24],
      [0.08633, 25],
      [0.08252, 27],
      [0.08357, 33],
      [0.08213, 35],
      [0.08305, 37]
    ]
  },
  "QS_mulLysisTrunk[Upper]": {
    "red_x_points": [
      [-0.00066, 3],
      [-0.0049, 0],
      [-0.0029, 0],
      [-0.00282, 0],
      [-0.00299, 0],
      [-0.01325, 2],
      [-0.00337, 0],
      [-0.00091, 3],
      [-0.00328, 0],
      [-0.00289, 0],
      [-0.00064, 3],
      [-0.0032, 0],
      [-0.00108, 3],
      [-0.00441, 0],
      [-0.0118, 2],
      [-0.00084, 3],
      [-0.00068, 3],
      [-0.00063, 3],
      [-0.00291, 0],
      [-0.00062, 3],
      [-0.00112, 3],
      [-0.00103, 3],
      [-0.00324, 0],
      [-0.00292, 0],
      [-0.00095, 3],
      [0.01336, 1],
      [-0.00096, 3],
      [-0.01287, 2],
      [-0.00111, 3]
    ],
    "red_o_points": [],
    "y_categories": ["N", "NOT APPLICABLE", "Y", "nan"],
    "blue_o_points": [],
    "blue_x_points": [
      [0.02414, 1],
      [-0.00069, 3],
      [-0.00143, 0],
      [-0.00201, 0],
      [7e-5, 3],
      [0.01885, 1],
      [0.01337, 1],
      [-0.00188, 0],
      [-0.00055, 3],
      [-0.0003, 3],
      [-0.0015, 0],
      [0.01401, 1],
      [-0.00022, 3],
      [0.01433, 1],
      [-0.00059, 3]
    ]
  },
  "QS_mulNeuromadSite[C5]": {
    "red_x_points": [
      [0.0, 2],
      [-6e-5, 0],
      [-2e-5, 0],
      [-3e-5, 0],
      [-2e-5, 0],
      [-2e-5, 0],
      [-5e-5, 0],
      [-2e-5, 0],
      [-5e-5, 0],
      [-3e-5, 2],
      [-6e-5, 0],
      [1e-5, 2],
      [1e-5, 2],
      [1e-5, 2],
      [-3e-5, 2],
      [-5e-5, 0],
      [-2e-5, 0],
      [6e-5, 1],
      [-2e-5, 0],
      [0.0, 2]
    ],
    "red_o_points": [],
    "y_categories": ["N", "NOT APPLICABLE", "nan"],
    "blue_o_points": [],
    "blue_x_points": [
      [0.00037, 1],
      [1e-5, 2],
      [-2e-5, 0],
      [-3e-5, 0],
      [0.0, 2],
      [-2e-5, 0],
      [6e-5, 1],
      [1e-5, 2]
    ]
  },
  "QS_mulTransfSite[IMc]": {
    "red_x_points": [
      [-0.00071, 3],
      [-0.02032, 2],
      [-0.00318, 0],
      [-0.01614, 2],
      [-0.00345, 0],
      [-0.00283, 0],
      [-0.00327, 0],
      [-0.00138, 3],
      [-0.00348, 0],
      [-0.00327, 0],
      [-0.00062, 3],
      [-0.00323, 0],
      [-0.00145, 3],
      [-0.00523, 0],
      [-0.01715, 2],
      [-0.00104, 3],
      [-0.00097, 3],
      [-0.00089, 3],
      [-0.00291, 0],
      [-0.00078, 3],
      [-0.00147, 3],
      [-0.00126, 3],
      [-0.00331, 0],
      [-0.02143, 2],
      [-0.00131, 3],
      [0.0208, 1],
      [-0.00124, 3],
      [-0.0183, 2],
      [-0.00145, 3]
    ],
    "red_o_points": [],
    "y_categories": ["N", "NOT APPLICABLE", "Y", "nan"],
    "blue_o_points": [],
    "blue_x_points": [
      [0.03818, 1],
      [-0.00081, 3],
      [0.00011, 0],
      [-0.00013, 0],
      [-8e-5, 3],
      [0.02866, 1],
      [0.01839, 1],
      [-0.00163, 0],
      [-0.00074, 3],
      [-0.00028, 3],
      [-0.00054, 0],
      [0.02053, 1],
      [-0.00047, 3],
      [0.02076, 1],
      [-0.00067, 3]
    ]
  },
  "QA_mulInjOrthesisType[ArmSling]": {
    "red_x_points": [
      [-0.01117, 2],
      [-0.01121, 2],
      [-0.01056, 2],
      [-0.01072, 2],
      [-0.01121, 2],
      [-0.01105, 2],
      [-0.01127, 2],
      [-0.01122, 2],
      [-0.01088, 2],
      [-0.01097, 2],
      [-0.01112, 2],
      [-0.0112, 2],
      [-0.01111, 2],
      [-0.01121, 2],
      [-0.0354, 0],
      [-0.011, 2],
      [-0.01066, 2],
      [-0.03405, 0],
      [-0.03332, 3],
      [-0.01098, 2],
      [-0.01139, 2],
      [-0.0111, 2],
      [-0.01113, 2],
      [-0.011, 2],
      [-0.03402, 3],
      [-0.03637, 3],
      [-0.03366, 3],
      [-0.01132, 2],
      [-0.01138, 2]
    ],
    "red_o_points": [],
    "y_categories": ["N", "NOT APPLICABLE", "Y", "nan"],
    "blue_o_points": [],
    "blue_x_points": [
      [-0.0105, 2],
      [-0.01063, 2],
      [-0.01059, 2],
      [-0.01034, 2],
      [0.07057, 1],
      [0.06638, 1],
      [0.06412, 1],
      [0.06756, 1],
      [-0.01096, 2],
      [0.06722, 1],
      [-0.01106, 2],
      [0.06715, 1],
      [0.06709, 1],
      [0.06637, 1],
      [-0.01069, 2]
    ]
  },
  "QS_mulLysisSite[Nerve]": {
    "red_x_points": [
      [-3e-5, 3],
      [-0.00267, 0],
      [-0.00616, 2],
      [-0.00524, 2],
      [-0.00159, 0],
      [-0.00139, 0],
      [-0.00194, 0],
      [-0.00063, 3],
      [-0.00172, 0],
      [-0.00151, 0],
      [-6e-5, 3],
      [-0.00144, 0],
      [-0.00062, 3],
      [-0.00284, 0],
      [-0.00193, 0],
      [-8e-5, 3],
      [-6e-5, 3],
      [-4e-5, 3],
      [-0.00121, 0],
      [-0.0001, 3],
      [-0.0007, 3],
      [-0.00052, 3],
      [-0.00148, 0],
      [-0.00129, 0],
      [-0.00046, 3],
      [0.00578, 1],
      [-0.00055, 3],
      [-0.00129, 0],
      [-0.00083, 3]
    ],
    "red_o_points": [],
    "y_categories": ["N", "NOT APPLICABLE", "Y", "nan"],
    "blue_o_points": [],
    "blue_x_points": [
      [0.01297, 1],
      [-0.00038, 3],
      [-0.00082, 0],
      [-0.00132, 0],
      [0.00034, 3],
      [0.0071, 1],
      [0.00402, 1],
      [-0.00089, 0],
      [-0.00029, 3],
      [5e-5, 3],
      [-0.00076, 0],
      [0.00599, 1],
      [-0.0, 3],
      [0.00665, 1],
      [-6e-5, 3]
    ]
  },
  "QS_mulNeuromadSite[C8]": {
    "red_x_points": [
      [2e-5, 2],
      [-0.00026, 0],
      [-0.0002, 0],
      [-0.00019, 0],
      [-0.00027, 0],
      [-0.00013, 0],
      [-0.00023, 0],
      [-1e-5, 2],
      [-0.00027, 0],
      [-0.00016, 0],
      [2e-5, 2],
      [-0.00017, 0],
      [2e-5, 2],
      [-0.00049, 0],
      [-0.00017, 0],
      [5e-5, 2],
      [5e-5, 2],
      [5e-5, 2],
      [-9e-5, 0],
      [3e-5, 2],
      [-6e-5, 2],
      [-4e-5, 2],
      [-0.00011, 0],
      [-0.00017, 0],
      [-2e-5, 2],
      [0.00025, 1],
      [-2e-5, 2],
      [-0.0001, 0],
      [-6e-5, 2]
    ],
    "red_o_points": [],
    "y_categories": ["N", "NOT APPLICABLE", "nan"],
    "blue_o_points": [],
    "blue_x_points": [
      [0.00159, 1],
      [3e-5, 2],
      [-0.00014, 0],
      [5e-5, 2],
      [0.00076, 1],
      [2e-5, 2],
      [1e-5, 2],
      [0.00021, 1],
      [4e-5, 2],
      [0.00021, 1]
    ]
  },
  "QS_mulTransfSite[AcSsPA]": {
    "red_x_points": [
      [-7e-5, 3],
      [-9e-5, 0],
      [-9e-5, 0],
      [-9e-5, 0],
      [-7e-5, 0],
      [-0.0001, 0],
      [-0.0001, 0],
      [-5e-5, 3],
      [-0.00011, 0],
      [-9e-5, 0],
      [-7e-5, 3],
      [-8e-5, 0],
      [-5e-5, 3],
      [-0.00021, 0],
      [-0.00047, 2],
      [-7e-5, 3],
      [-6e-5, 3],
      [-5e-5, 3],
      [-0.00011, 0],
      [-5e-5, 3],
      [-5e-5, 3],
      [-7e-5, 3],
      [-0.00011, 0],
      [-0.0001, 0],
      [-7e-5, 3],
      [0.00047, 1],
      [-5e-5, 3],
      [-9e-5, 0],
      [-2e-5, 3]
    ],
    "red_o_points": [],
    "y_categories": ["N", "NOT APPLICABLE", "Y", "nan"],
    "blue_o_points": [],
    "blue_x_points": [
      [0.00057, 1],
      [-4e-5, 3],
      [-0.00011, 0],
      [-0.00012, 0],
      [-4e-5, 3],
      [0.0006, 1],
      [0.00039, 1],
      [-8e-5, 0],
      [-3e-5, 3],
      [-0.0, 3],
      [-8e-5, 0],
      [0.0006, 1],
      [-5e-5, 3],
      [0.0006, 1],
      [-5e-5, 3]
    ]
  },
  "QS_mulTransfSite[AcMc]": {
    "red_x_points": [
      [-6e-5, 3],
      [-0.00034, 0],
      [-0.00031, 0],
      [-0.00021, 0],
      [-0.00036, 0],
      [-0.00013, 0],
      [-0.00028, 0],
      [-0.00013, 3],
      [-0.00014, 0],
      [-0.0028, 2],
      [-6e-5, 3],
      [3e-5, 0],
      [-0.00014, 3],
      [-0.0004, 0],
      [-0.0002, 0],
      [-6e-5, 3],
      [-4e-5, 3],
      [1e-5, 3],
      [-0.0001, 0],
      [-0.0, 3],
      [-0.00016, 3],
      [-0.0001, 3],
      [-4e-5, 0],
      [-8e-5, 0],
      [-0.0001, 3],
      [0.00048, 1],
      [-0.0001, 3],
      [-8e-5, 0],
      [-0.0001, 3]
    ],
    "red_o_points": [],
    "y_categories": ["N", "NOT APPLICABLE", "Y", "nan"],
    "blue_o_points": [],
    "blue_x_points": [
      [0.0025, 1],
      [-8e-5, 3],
      [0.00027, 0],
      [0.00029, 0],
      [-4e-5, 3],
      [0.00092, 1],
      [0.00035, 1],
      [0.00011, 0],
      [3e-5, 3],
      [-2e-5, 3],
      [0.00027, 0],
      [0.00062, 1],
      [2e-5, 3],
      [0.0008, 1],
      [-3e-5, 3]
    ]
  },
  "QS_mulTransfSite[Other]": {
    "red_x_points": [
      [-0.00133, 3],
      [-0.01296, 0],
      [-0.00981, 0],
      [-0.00848, 0],
      [-0.01062, 0],
      [-0.01085, 0],
      [-0.01017, 0],
      [-0.00152, 3],
      [-0.01054, 0],
      [-0.01178, 0],
      [-0.00159, 3],
      [-0.01161, 0],
      [-0.00195, 3],
      [-0.01334, 0],
      [-0.01056, 0],
      [-0.00145, 3],
      [-0.00154, 3],
      [-0.0013, 3],
      [-0.0084, 0],
      [-0.00143, 3],
      [-0.00176, 3],
      [-0.00147, 3],
      [-0.01125, 0],
      [-0.01066, 0],
      [-0.00154, 3],
      [0.01907, 1],
      [-0.00144, 3],
      [-0.01055, 0],
      [-0.00157, 3]
    ],
    "red_o_points": [],
    "y_categories": ["N", "NOT APPLICABLE", "Y", "nan"],
    "blue_o_points": [],
    "blue_x_points": [
      [0.03879, 1],
      [-0.001, 3],
      [-0.009, 0],
      [-0.00965, 0],
      [-0.00022, 3],
      [0.02774, 1],
      [0.02203, 1],
      [-0.00767, 0],
      [-0.0011, 3],
      [-0.0006, 3],
      [0.05991, 2],
      [0.02276, 1],
      [-0.0009, 3],
      [0.02222, 1],
      [-0.00087, 3]
    ]
  },
  "QA_mulInjOrthesisType[ShoulderSupport]": {
    "red_x_points": [
      [-0.01085, 0],
      [-0.01069, 0],
      [-0.01025, 0],
      [-0.03755, 2],
      [-0.00991, 0],
      [-0.01083, 0],
      [-0.00995, 0],
      [-0.0382, 2],
      [-0.00998, 0],
      [-0.01015, 0],
      [-0.00998, 0],
      [-0.01071, 0],
      [-0.01026, 0],
      [-0.01027, 0],
      [-0.03819, 2],
      [-0.01004, 0],
      [-0.01059, 0],
      [-0.0387, 2],
      [-0.03786, 3],
      [-0.01026, 0],
      [-0.01009, 0],
      [-0.01041, 0],
      [-0.01009, 0],
      [-0.0102, 0],
      [-0.03744, 3],
      [-0.03808, 3],
      [-0.03767, 3],
      [-0.01026, 0],
      [-0.00995, 0]
    ],
    "red_o_points": [],
    "y_categories": ["N", "NOT APPLICABLE", "Y", "nan"],
    "blue_o_points": [],
    "blue_x_points": [
      [-0.0093, 0],
      [-0.01008, 0],
      [-0.00923, 0],
      [-0.00984, 0],
      [0.07597, 1],
      [0.07302, 1],
      [0.07267, 1],
      [0.07453, 1],
      [-0.0099, 0],
      [0.07073, 1],
      [-0.00969, 0],
      [0.07207, 1],
      [0.07556, 1],
      [0.07266, 1],
      [-0.00977, 0]
    ]
  },
  "QS_mulLysisNerve[Ssr]": {
    "red_x_points": [
      [-0.00029, 3],
      [-0.00298, 0],
      [-0.0066, 2],
      [-0.00665, 2],
      [-0.0021, 0],
      [-0.00173, 0],
      [-0.00193, 0],
      [-0.00065, 3],
      [-0.00186, 0],
      [-0.00167, 0],
      [-0.00024, 3],
      [-0.00176, 0],
      [-0.00098, 3],
      [-0.00303, 0],
      [-0.00266, 0],
      [-0.0003, 3],
      [-0.00037, 3],
      [-0.00032, 3],
      [-0.00151, 0],
      [-0.00043, 3],
      [-0.00086, 3],
      [-0.00097, 3],
      [-0.00184, 0],
      [-0.00164, 0],
      [-0.00081, 3],
      [0.00745, 1],
      [-0.00079, 3],
      [-0.0016, 0],
      [-0.00095, 3]
    ],
    "red_o_points": [],
    "y_categories": ["N", "NOT APPLICABLE", "Y", "nan"],
    "blue_o_points": [],
    "blue_x_points": [
      [0.01484, 1],
      [-0.00058, 3],
      [-0.00119, 0],
      [-0.00154, 0],
      [2e-5, 3],
      [0.00958, 1],
      [0.00568, 1],
      [-0.00111, 0],
      [-0.00048, 3],
      [-0.00011, 3],
      [-0.0009, 0],
      [0.00814, 1],
      [-0.00017, 3],
      [0.00822, 1],
      [-0.00029, 3]
    ]
  },
  "QS_mulTransfSite[AcSsAA]": {
    "red_x_points": [
      [-0.00035, 3],
      [0.0007, 2],
      [-0.00648, 0],
      [-0.00459, 0],
      [0.00128, 2],
      [-0.00604, 0],
      [-0.00698, 0],
      [-0.00063, 3],
      [-0.00812, 0],
      [-0.00652, 0],
      [-0.00025, 3],
      [-0.00749, 0],
      [-0.00082, 3],
      [0.00347, 2],
      [-0.00304, 0],
      [-0.00026, 3],
      [-0.00029, 3],
      [-0.00022, 3],
      [2e-5, 2],
      [-0.00028, 3],
      [-0.00075, 3],
      [-0.00063, 3],
      [-0.00706, 0],
      [0.00163, 2],
      [-0.00056, 3],
      [0.00585, 1],
      [-0.00057, 3],
      [-0.00411, 0],
      [-0.00078, 3]
    ],
    "red_o_points": [],
    "y_categories": ["N", "NOT APPLICABLE", "Y", "nan"],
    "blue_o_points": [],
    "blue_x_points": [
      [0.01857, 1],
      [-0.00031, 3],
      [0.00744, 2],
      [0.00859, 2],
      [-0.0002, 3],
      [0.00558, 1],
      [0.00569, 1],
      [-0.00218, 0],
      [-0.00031, 3],
      [-0.00014, 3],
      [-0.00296, 0],
      [0.00762, 1],
      [-0.00015, 3],
      [0.00671, 1],
      [-0.00011, 3]
    ]
  },
  "QS_mulLysisRoot[C5]": {
    "red_x_points": [
      [-0.00012, 3],
      [-0.00207, 0],
      [-0.00446, 2],
      [-0.00109, 0],
      [-0.00136, 0],
      [-0.00109, 0],
      [-0.00143, 0],
      [-0.00039, 3],
      [-0.00132, 0],
      [-0.00135, 0],
      [-0.0002, 3],
      [-0.00138, 0],
      [-0.00051, 3],
      [-0.00208, 0],
      [-0.00145, 0],
      [-0.00028, 3],
      [-0.00024, 3],
      [-0.00014, 3],
      [-0.00092, 0],
      [-0.00012, 3],
      [-0.00051, 3],
      [-0.00031, 3],
      [-0.0013, 0],
      [-0.00076, 0],
      [-0.00031, 3],
      [0.00396, 1],
      [-0.00033, 3],
      [-0.00456, 2],
      [-0.0004, 3]
    ],
    "red_o_points": [],
    "y_categories": ["N", "NOT APPLICABLE", "Y", "nan"],
    "blue_o_points": [],
    "blue_x_points": [
      [0.01103, 1],
      [-0.00022, 3],
      [-0.00023, 0],
      [-0.00056, 0],
      [-0.0, 3],
      [0.0058, 1],
      [0.0035, 1],
      [-0.00076, 0],
      [-0.00014, 3],
      [-7e-5, 3],
      [-0.00018, 0],
      [0.00448, 1],
      [-8e-5, 3],
      [0.00417, 1],
      [-0.00021, 3]
    ]
  },
  "QS_mulLysisSite[Root]": {
    "red_x_points": [
      [-0.0001, 3],
      [-0.00059, 0],
      [-0.0029, 2],
      [-0.00046, 0],
      [-0.0007, 0],
      [-0.00054, 0],
      [-0.00062, 0],
      [-0.00014, 3],
      [-0.00058, 0],
      [-0.00046, 0],
      [-8e-5, 3],
      [-0.00051, 0],
      [-0.00019, 3],
      [-0.00059, 0],
      [-0.00042, 0],
      [-0.00022, 3],
      [-0.00018, 3],
      [-5e-5, 3],
      [-0.00036, 0],
      [-0.00012, 3],
      [-0.00026, 3],
      [-0.00011, 3],
      [-0.00051, 0],
      [-0.00021, 0],
      [-7e-5, 3],
      [0.00162, 1],
      [-9e-5, 3],
      [-0.00338, 2],
      [-0.00014, 3]
    ],
    "red_o_points": [],
    "y_categories": ["N", "NOT APPLICABLE", "Y", "nan"],
    "blue_o_points": [],
    "blue_x_points": [
      [0.00639, 1],
      [-0.0001, 3],
      [0.00013, 0],
      [-2e-5, 0],
      [-6e-5, 3],
      [0.00186, 1],
      [0.00166, 1],
      [-0.00035, 0],
      [-5e-5, 3],
      [-6e-5, 3],
      [-2e-5, 0],
      [0.00194, 1],
      [-5e-5, 3],
      [0.0019, 1],
      [-0.00015, 3]
    ]
  },
  "QS_lstBpsurgSide": {
    "red_x_points": [
      [-0.00057, 3],
      [-0.01502, 0],
      [-0.01675, 0],
      [-0.01227, 0],
      [-0.01707, 0],
      [-0.01405, 0],
      [-0.0159, 0],
      [-0.00127, 3],
      [-0.01748, 0],
      [0.00316, 2],
      [-0.00065, 3],
      [0.00289, 2],
      [-0.00137, 3],
      [0.00352, 2],
      [-0.00126, 2],
      [-0.00077, 3],
      [-0.00059, 3],
      [-0.00052, 3],
      [-0.00853, 0],
      [-0.00052, 3],
      [-0.00124, 3],
      [-0.00127, 3],
      [0.00268, 2],
      [0.00296, 2],
      [-0.0011, 3],
      [0.01349, 1],
      [-0.00102, 3],
      [-0.01345, 0],
      [-0.00132, 3]
    ],
    "red_o_points": [],
    "y_categories": ["L", "NOT APPLICABLE", "R", "nan"],
    "blue_o_points": [],
    "blue_x_points": [
      [0.03881, 1],
      [-0.00074, 3],
      [0.00577, 2],
      [0.0098, 2],
      [0.00014, 3],
      [0.01745, 1],
      [0.01235, 1],
      [-0.00238, 0],
      [-0.0006, 3],
      [-0.00026, 3],
      [0.0053, 2],
      [0.01485, 1],
      [-0.0002, 3],
      [0.01535, 1],
      [-0.00033, 3]
    ]
  },
  "QS_mulNeuromadSite[T1]": {
    "red_x_points": [
      [1e-5, 2],
      [-6e-5, 0],
      [-0.0, 0],
      [-6e-5, 0],
      [-4e-5, 0],
      [-6e-5, 0],
      [-1e-5, 2],
      [-6e-5, 0],
      [-7e-5, 0],
      [1e-5, 2],
      [-4e-5, 0],
      [-6e-5, 2],
      [-0.0001, 0],
      [-4e-5, 0],
      [1e-5, 2],
      [-1e-5, 2],
      [3e-5, 2],
      [-4e-5, 0],
      [3e-5, 2],
      [-4e-5, 2],
      [-1e-5, 2],
      [-7e-5, 0],
      [-7e-5, 0],
      [-1e-5, 2],
      [7e-5, 1],
      [-1e-5, 2],
      [-4e-5, 0],
      [-5e-5, 2]
    ],
    "red_o_points": [],
    "y_categories": ["N", "NOT APPLICABLE", "nan"],
    "blue_o_points": [],
    "blue_x_points": [
      [0.00048, 1],
      [-2e-5, 2],
      [-0.0, 0],
      [-3e-5, 0],
      [3e-5, 2],
      [0.00016, 1],
      [-1e-5, 2],
      [-0.0, 0],
      [7e-5, 1],
      [3e-5, 2],
      [7e-5, 1]
    ]
  },
  "QA_yonInjUnconscio": {
    "red_x_points": [
      [-0.0192, 1],
      [-0.01817, 1],
      [-0.00119, 2],
      [-0.00193, 2],
      [-0.00093, 2],
      [-0.02067, 1],
      [-0.00114, 2],
      [-0.00254, 2],
      [-0.002, 2],
      [-0.02198, 1],
      [-0.01851, 1],
      [-0.02282, 1],
      [-0.004, 2],
      [-0.00205, 2],
      [-0.01138, 1],
      [-0.01936, 1],
      [-0.0193, 1],
      [-0.01158, 1],
      [-0.01346, 1],
      [-0.01909, 1],
      [-0.00367, 2],
      [-0.00233, 2],
      [-0.02252, 1],
      [-0.0199, 1],
      [-0.00328, 2],
      [-0.0026, 2],
      [-0.00351, 2],
      [-0.01948, 1],
      [-0.0045, 2]
    ],
    "red_o_points": [],
    "y_categories": ["N", "Y", "nan"],
    "blue_o_points": [],
    "blue_x_points": [
      [-0.00031, 2],
      [-0.00085, 2],
      [0.06737, 0],
      [0.00025, 2],
      [-0.00687, 1],
      [-0.00946, 1],
      [0.03653, 0],
      [0.05174, 0],
      [-0.00113, 2],
      [0.04942, 0],
      [0.06682, 0],
      [-0.00196, 2],
      [-0.00954, 1],
      [-0.00187, 2],
      [0.07295, 0]
    ]
  },
  "QA_lstPexTouch[C7]": {
    "red_x_points": [
      [-0.00158, 1],
      [-0.01102, 2],
      [-0.00491, 1],
      [-0.00382, 1],
      [-0.01633, 2],
      [-0.00762, 1],
      [-0.00786, 1],
      [-0.00493, 0],
      [-0.01089, 1],
      [-0.01136, 1],
      [-0.00219, 1],
      [-0.02181, 2],
      [-0.00719, 2],
      [-0.02111, 2],
      [-0.00561, 2],
      [-0.00128, 0],
      [-0.00244, 1],
      [-0.00485, 0],
      [-0.01151, 2],
      [-0.00505, 0],
      [-0.00648, 2],
      [-0.00485, 0],
      [-0.01187, 1],
      [-0.01487, 2],
      [-0.00436, 0],
      [-0.00017, 1],
      [0.00057, 2],
      [-0.00252, 1],
      [0.00285, 1]
    ],
    "red_o_points": [],
    "y_categories": ["NORM", "NPV", "nan"],
    "blue_o_points": [],
    "blue_x_points": [
      [-0.00013, 1],
      [0.01129, 1],
      [0.05237, 0],
      [0.06786, 0],
      [0.00765, 2],
      [0.00012, 2],
      [-0.00482, 1],
      [0.01122, 1],
      [0.00706, 2],
      [0.0473, 0],
      [-4e-5, 1],
      [-7e-5, 0],
      [0.00022, 0],
      [0.00505, 0]
    ]
  },
  "QA_lstPexInspectio[SurgicalScar]": {
    "red_x_points": [
      [-0.00312, 1],
      [-0.00723, 1],
      [-0.01049, 0],
      [-0.0052, 1],
      [-0.01173, 1],
      [-0.01395, 0],
      [-0.00986, 1],
      [-0.00297, 1],
      [-0.01378, 1],
      [-0.01337, 1],
      [-0.00859, 0],
      [-0.01295, 1],
      [0.00145, 2],
      [-0.01664, 1],
      [-0.00572, 0],
      [0.00531, 2],
      [0.00492, 2],
      [-0.00171, 1],
      [-0.00589, 1],
      [-0.00339, 1],
      [0.00089, 2],
      [-0.0038, 1],
      [-0.01348, 1],
      [0.01881, 2],
      [-0.00197, 1],
      [-0.00052, 1],
      [-0.00153, 1],
      [0.00674, 2],
      [-0.00172, 1]
    ],
    "red_o_points": [],
    "y_categories": ["ABS", "NAIA", "PT", "nan"],
    "blue_o_points": [],
    "blue_x_points": [
      [-0.00063, 1],
      [0.00895, 2],
      [0.03606, 2],
      [0.04658, 2],
      [0.00163, 1],
      [0.00064, 1],
      [0.00068, 0],
      [-0.00842, 1],
      [-0.00274, 1],
      [0.0013, 1],
      [0.03402, 2],
      [-0.00034, 1],
      [0.00426, 2],
      [0.00131, 0],
      [0.00819, 2]
    ]
  },
  "QS_mulNeuromadSite[T2]": {
    "red_x_points": [
      [6e-5, 2],
      [-0.00033, 0],
      [-0.00026, 0],
      [-0.00019, 0],
      [-0.00023, 0],
      [-0.00019, 0],
      [-0.00018, 0],
      [0.0, 2],
      [-0.00029, 0],
      [-0.00012, 0],
      [2e-5, 2],
      [-0.00019, 0],
      [3e-5, 2],
      [-0.0004, 0],
      [-0.00018, 0],
      [2e-5, 2],
      [4e-5, 2],
      [1e-5, 2],
      [-9e-5, 0],
      [5e-5, 2],
      [1e-5, 2],
      [2e-5, 2],
      [-0.00014, 0],
      [-0.00016, 0],
      [-1e-5, 2],
      [0.00019, 1],
      [-1e-5, 2],
      [-0.00019, 0],
      [4e-5, 2]
    ],
    "red_o_points": [],
    "y_categories": ["N", "NOT APPLICABLE", "nan"],
    "blue_o_points": [],
    "blue_x_points": [
      [0.00145, 1],
      [4e-5, 2],
      [-3e-5, 0],
      [-0.0002, 0],
      [2e-5, 2],
      [0.00066, 1],
      [0.00013, 1],
      [-2e-5, 0],
      [3e-5, 2],
      [3e-5, 2],
      [-7e-5, 0],
      [0.00022, 1],
      [2e-5, 2],
      [0.00035, 1],
      [2e-5, 2]
    ]
  },
  "QS_mulBpsurgeryType[Lysis]": {
    "red_x_points": [
      [-0.00096, 3],
      [-0.00628, 0],
      [-0.02033, 2],
      [-0.0178, 2],
      [-0.0039, 0],
      [-0.01926, 2],
      [-0.00362, 0],
      [-0.00141, 3],
      [-0.00385, 0],
      [-0.0034, 0],
      [-0.00126, 3],
      [-0.00336, 0],
      [-0.00178, 3],
      [-0.00633, 0],
      [-0.01851, 2],
      [-0.00118, 3],
      [-0.0011, 3],
      [-0.001, 3],
      [-0.00347, 0],
      [-0.00104, 3],
      [-0.00185, 3],
      [-0.00168, 3],
      [-0.00361, 0],
      [-0.00331, 0],
      [-0.00139, 3],
      [0.02205, 1],
      [-0.00143, 3],
      [-0.01875, 2],
      [-0.00161, 3]
    ],
    "red_o_points": [],
    "y_categories": ["N", "NOT APPLICABLE", "Y", "nan"],
    "blue_o_points": [],
    "blue_x_points": [
      [0.04126, 1],
      [-0.00098, 3],
      [-0.00134, 0],
      [-0.00208, 0],
      [-8e-5, 3],
      [0.0311, 1],
      [0.02189, 1],
      [-0.00227, 0],
      [-0.00101, 3],
      [-0.00056, 3],
      [-0.00127, 0],
      [0.02431, 1],
      [-0.00064, 3],
      [0.02379, 1],
      [-0.0007, 3]
    ]
  },
  "QS_mulLysisSite[Trunk]": {
    "red_x_points": [
      [-0.0006, 3],
      [-0.00399, 0],
      [-0.00216, 0],
      [-0.00226, 0],
      [-0.0025, 0],
      [-0.0106, 2],
      [-0.00242, 0],
      [-0.00073, 3],
      [-0.00268, 0],
      [-0.00231, 0],
      [-0.0007, 3],
      [-0.0025, 0],
      [-0.00141, 3],
      [-0.00357, 0],
      [-0.00978, 2],
      [-0.00046, 3],
      [-0.00062, 3],
      [-0.00055, 3],
      [-0.00242, 0],
      [-0.00051, 3],
      [-0.00119, 3],
      [-0.00059, 3],
      [-0.00262, 0],
      [-0.00254, 0],
      [-0.00053, 3],
      [0.01057, 1],
      [-0.00065, 3],
      [-0.01077, 2],
      [-0.00092, 3]
    ],
    "red_o_points": [],
    "y_categories": ["N", "NOT APPLICABLE", "Y", "nan"],
    "blue_o_points": [],
    "blue_x_points": [
      [0.02052, 1],
      [-0.00042, 3],
      [-0.00134, 0],
      [-0.00175, 0],
      [4e-5, 3],
      [0.01534, 1],
      [0.01048, 1],
      [-0.00168, 0],
      [-0.00036, 3],
      [-0.00021, 3],
      [-0.00081, 0],
      [0.01124, 1],
      [-0.00026, 3],
      [0.01162, 1],
      [-0.00036, 3]
    ]
  },
  "QS_mulGraftTrunk[UpperTrunk]": {
    "red_x_points": [
      [-6e-5, 3],
      [-0.00156, 0],
      [-0.00081, 0],
      [-0.00085, 0],
      [-0.00103, 0],
      [-0.00074, 0],
      [-0.00109, 0],
      [-0.00013, 3],
      [-0.0009, 0],
      [-0.00053, 0],
      [-6e-5, 3],
      [-0.00068, 0],
      [-0.00028, 3],
      [-0.00672, 2],
      [-0.00114, 0],
      [2e-5, 3],
      [-5e-5, 3],
      [-1e-5, 3],
      [-0.00068, 0],
      [-0.0001, 3],
      [-0.00027, 3],
      [-0.00019, 3],
      [-0.00072, 0],
      [-0.0008, 0],
      [-0.00018, 3],
      [0.00234, 1],
      [-0.00013, 3],
      [-0.00068, 0],
      [-0.00029, 3]
    ],
    "red_o_points": [],
    "y_categories": ["N", "NOT APPLICABLE", "Y", "nan"],
    "blue_o_points": [],
    "blue_x_points": [
      [0.00602, 1],
      [-0.00012, 3],
      [-0.00013, 0],
      [0.00068, 0],
      [0.00014, 3],
      [0.00407, 1],
      [0.00194, 1],
      [-0.00029, 0],
      [-0.0001, 3],
      [9e-5, 3],
      [1e-5, 0],
      [0.00303, 1],
      [-1e-5, 3],
      [0.00308, 1],
      [-5e-5, 3]
    ]
  },
  "QS_mulTransfSite[PhMc]": {
    "red_x_points": [
      [-0.0003, 3],
      [-0.00213, 0],
      [-0.00147, 0],
      [-0.00137, 0],
      [-0.00136, 0],
      [-0.00135, 0],
      [-0.0059, 2],
      [-0.00067, 3],
      [-0.00202, 0],
      [-0.0015, 0],
      [-0.00021, 3],
      [-0.00137, 0],
      [-0.00075, 3],
      [-0.00222, 0],
      [-0.00172, 0],
      [-0.00025, 3],
      [-0.0003, 3],
      [-0.00024, 3],
      [-0.00438, 2],
      [-0.00013, 3],
      [-0.00075, 3],
      [-0.00064, 3],
      [-0.00153, 0],
      [-0.00135, 0],
      [-0.00059, 3],
      [0.00568, 1],
      [-0.00058, 3],
      [-0.00127, 0],
      [-0.00069, 3]
    ],
    "red_o_points": [],
    "y_categories": ["N", "NOT APPLICABLE", "Y", "nan"],
    "blue_o_points": [],
    "blue_x_points": [
      [0.01199, 1],
      [-0.0003, 3],
      [-0.00069, 0],
      [-0.00124, 0],
      [-6e-5, 3],
      [0.00715, 1],
      [0.00475, 1],
      [-0.0008, 0],
      [-0.00035, 3],
      [-0.00024, 3],
      [-0.00074, 0],
      [0.00639, 1],
      [-3e-5, 3],
      [0.0058, 1],
      [-0.00027, 3]
    ]
  },
  "QA_intPexForearmProna": {
    "red_x_points": [
      [-0.00119, 2],
      [-0.00097, 0],
      [-0.00119, 2],
      [-0.00062, 2],
      [-0.00125, 2],
      [-0.00317, 0],
      [-0.00108, 2],
      [-0.02316, 0],
      [-0.0013, 2],
      [-0.00104, 2],
      [-0.02454, 0],
      [-0.00326, 0],
      [-0.00188, 2],
      [-0.00119, 2],
      [1e-5, 2],
      [-0.02361, 0],
      [-0.02369, 0],
      [-0.02066, 0],
      [-0.00247, 0],
      [-0.00116, 2],
      [-0.00197, 2],
      [-0.0019, 2],
      [-0.0011, 2],
      [-0.00137, 2],
      [0.00026, 2],
      [8e-5, 1],
      [0.00033, 2],
      [-0.00311, 0],
      [-0.00171, 2]
    ],
    "red_o_points": [],
    "y_categories": ["GREATER THAN OR EQUALS TO 80", "LESS THAN 80", "nan"],
    "blue_o_points": [],
    "blue_x_points": [
      [-0.00073, 2],
      [0.07751, 1],
      [-0.00042, 0],
      [-0.00123, 2],
      [0.00117, 2],
      [1e-5, 2],
      [0.00034, 1],
      [0.00011, 2],
      [-0.00079, 2],
      [0.00127, 2],
      [-0.00041, 0],
      [2e-5, 2],
      [0.00132, 2],
      [1e-5, 2],
      [0.06974, 1]
    ]
  },
  "QS_mulTransfSite[Oberlin]": {
    "red_x_points": [
      [-0.00172, 3],
      [-0.03013, 0],
      [-0.02927, 0],
      [-0.0268, 0],
      [-0.02976, 0],
      [0.00471, 2],
      [-0.02958, 0],
      [-0.00188, 3],
      [0.00475, 2],
      [0.00402, 2],
      [-0.00154, 3],
      [0.00431, 2],
      [-0.00249, 3],
      [0.00287, 2],
      [-0.02577, 0],
      [-0.0017, 3],
      [-0.00178, 3],
      [-0.00137, 3],
      [-0.02338, 0],
      [-0.0015, 3],
      [-0.00213, 3],
      [-0.00225, 3],
      [0.00416, 2],
      [-0.02865, 0],
      [-0.00201, 3],
      [0.03361, 1],
      [-0.00184, 3],
      [-0.02838, 0],
      [-0.0022, 3]
    ],
    "red_o_points": [],
    "y_categories": ["N", "NOT APPLICABLE", "Y", "nan"],
    "blue_o_points": [],
    "blue_x_points": [
      [0.05598, 1],
      [-0.00119, 3],
      [0.00747, 2],
      [0.00876, 2],
      [-0.00049, 3],
      [0.03871, 1],
      [0.03208, 1],
      [0.00464, 2],
      [-0.00121, 3],
      [-0.00087, 3],
      [0.0071, 2],
      [0.03292, 1],
      [-0.00092, 3],
      [0.03608, 1],
      [-0.00137, 3]
    ]
  },
  "QA_yonPexPain": {
    "red_x_points": [
      [-0.00789, 1],
      [-0.00118, 1],
      [-0.00063, 1],
      [-0.00061, 1],
      [-0.00115, 1],
      [-0.00076, 0],
      [-0.00072, 1],
      [-0.00765, 1],
      [0.00015, 0],
      [0.00037, 1],
      [-0.00664, 1],
      [-0.00069, 0],
      [-0.01178, 1],
      [-0.00161, 1],
      [-0.0007, 1],
      [0.00992, 0],
      [-0.00719, 1],
      [0.00948, 0],
      [-0.00037, 1],
      [0.01328, 0],
      [-0.02408, 2],
      [-0.01022, 1],
      [0.00017, 1],
      [-0.00091, 1],
      [-0.01708, 2],
      [-0.00253, 1],
      [-0.00854, 1],
      [-0.00038, 1],
      [-0.01181, 1]
    ],
    "red_o_points": [],
    "y_categories": ["N", "Y", "nan"],
    "blue_o_points": [],
    "blue_x_points": [
      [-0.00059, 1],
      [0.02589, 0],
      [0.00396, 0],
      [-0.0007, 1],
      [-0.00601, 1],
      [0.0019, 2],
      [-0.00015, 1],
      [0.00096, 1],
      [0.02939, 0],
      [0.02389, 0],
      [0.0006, 1],
      [0.00261, 0],
      [0.01537, 0],
      [-0.00031, 1],
      [-0.00508, 1]
    ]
  },
  "QS_mulLysisRoot[C6]": {
    "red_x_points": [
      [-0.00018, 3],
      [-0.00343, 0],
      [-0.00873, 2],
      [-0.00226, 0],
      [-0.00274, 0],
      [-0.00227, 0],
      [-0.00266, 0],
      [-0.00076, 3],
      [-0.00278, 0],
      [-0.00249, 0],
      [-0.00034, 3],
      [-0.00257, 0],
      [-0.00095, 3],
      [-0.00375, 0],
      [-0.00298, 0],
      [-0.00048, 3],
      [-0.00054, 3],
      [-0.0002, 3],
      [-0.00201, 0],
      [-0.00028, 3],
      [-0.00094, 3],
      [-0.00068, 3],
      [-0.00243, 0],
      [-0.00181, 0],
      [-0.00068, 3],
      [0.00811, 1],
      [-0.00063, 3],
      [-0.00896, 2],
      [-0.00077, 3]
    ],
    "red_o_points": [],
    "y_categories": ["N", "NOT APPLICABLE", "Y", "nan"],
    "blue_o_points": [],
    "blue_x_points": [
      [0.01866, 1],
      [-0.00035, 3],
      [-0.00094, 0],
      [-0.00135, 0],
      [0.00014, 3],
      [0.01163, 1],
      [0.00739, 1],
      [-0.00147, 0],
      [-0.00041, 3],
      [-5e-5, 3],
      [-0.00111, 0],
      [0.00987, 1],
      [-9e-5, 3],
      [0.00961, 1],
      [-0.00036, 3]
    ]
  },
  "QS_mulGraftLevel[Trunk]": {
    "red_x_points": [
      [-4e-5, 3],
      [-0.00102, 0],
      [-0.0006, 0],
      [-0.00058, 0],
      [-0.00051, 0],
      [-0.00044, 0],
      [-0.00055, 0],
      [-0.00025, 3],
      [-0.00061, 0],
      [-0.00039, 0],
      [-3e-5, 3],
      [-0.00043, 0],
      [-0.00028, 3],
      [-0.00493, 2],
      [-0.00081, 0],
      [-3e-5, 3],
      [-0.0, 3],
      [4e-5, 3],
      [-0.00052, 0],
      [-5e-5, 3],
      [-0.00042, 3],
      [-0.0003, 3],
      [-0.00039, 0],
      [-0.00047, 0],
      [-0.00013, 3],
      [0.00178, 1],
      [-0.00021, 3],
      [-0.00031, 0],
      [-0.00034, 3]
    ],
    "red_o_points": [],
    "y_categories": ["N", "NOT APPLICABLE", "Y", "nan"],
    "blue_o_points": [],
    "blue_x_points": [
      [0.00452, 1],
      [-0.00011, 3],
      [0.0002, 0],
      [0.00056, 0],
      [0.00021, 3],
      [0.00226, 1],
      [0.00109, 1],
      [-0.0001, 0],
      [-0.00017, 3],
      [2e-5, 3],
      [-6e-5, 0],
      [0.00223, 1],
      [4e-5, 3],
      [0.00219, 1],
      [-7e-5, 3]
    ]
  }
}
