{
  "QS_mulGraftNerve[other]": {
    "red_x_points": [
      [-0.00027, 2],
      [-0.00091, 0],
      [-0.00117, 0],
      [-0.001, 0],
      [-0.00091, 0],
      [-0.00087, 0],
      [-0.00098, 0],
      [-0.00027, 2],
      [-0.00094, 0],
      [-0.001, 0],
      [-0.00074, 0],
      [-0.00032, 2],
      [0.00132, 1],
      [-0.00032, 2],
      [-0.00089, 0],
      [-0.00018, 2],
      [-0.00067, 0],
      [-0.00095, 0],
      [-0.00036, 2],
      [-0.00024, 2],
      [-0.00014, 2],
      [-0.00097, 0],
      [-0.00028, 2],
      [-0.00019, 2],
      [-0.00023, 2],
      [-0.0009, 0],
      [-0.00026, 2],
      [-0.00085, 0],
      [-0.00022, 2],
      [0.0016, 1],
      [-0.00099, 0]
    ],
    "red_o_points": [],
    "y_categories": ["N", "NOT APPLICABLE", "nan"],
    "blue_o_points": [],
    "blue_x_points": [
      [0.00385, 1],
      [-0.00012, 2],
      [0.00207, 1],
      [1e-5, 0],
      [-4e-5, 2],
      [0.0017, 1],
      [0.00189, 1]
    ]
  },
  "QS_mulLysisRoot[C6]": {
    "red_x_points": [
      [-0.00074, 3],
      [-0.00115, 0],
      [-0.00209, 2],
      [-0.00109, 0],
      [-0.00096, 0],
      [-0.00108, 0],
      [-0.00103, 0],
      [-0.00087, 3],
      [-0.00114, 0],
      [-0.00128, 0],
      [-0.00121, 0],
      [-0.00068, 3],
      [0.00372, 1],
      [-0.00078, 3],
      [-0.00119, 0],
      [-0.0009, 3],
      [-0.001, 0],
      [-0.00108, 0],
      [-0.0008, 3],
      [-0.00084, 3],
      [-0.00079, 3],
      [-0.001, 0],
      [-0.00095, 3],
      [-0.00059, 3],
      [-0.00068, 3],
      [-0.00104, 0],
      [-0.0008, 3],
      [-0.00113, 0],
      [-0.0007, 3],
      [0.00405, 1],
      [-0.00232, 2]
    ],
    "red_o_points": [],
    "y_categories": ["N", "NOT APPLICABLE", "Y", "nan"],
    "blue_o_points": [],
    "blue_x_points": [
      [0.00495, 1],
      [-0.00037, 3],
      [0.00423, 1],
      [-0.00122, 0],
      [-0.00053, 3],
      [0.0042, 1],
      [0.00369, 1]
    ]
  },
  "QS_mulLysisTrunk[Upper]": {
    "red_x_points": [
      [-0.00204, 3],
      [-0.00278, 0],
      [-0.00245, 0],
      [-0.0027, 0],
      [-0.00276, 0],
      [-0.00567, 2],
      [-0.00286, 0],
      [-0.00187, 3],
      [-0.00279, 0],
      [-0.00268, 0],
      [-0.00271, 0],
      [-0.00172, 3],
      [0.00928, 1],
      [-0.00204, 3],
      [-0.00258, 0],
      [-0.00195, 3],
      [-0.00626, 2],
      [-0.00275, 0],
      [-0.00198, 3],
      [-0.00189, 3],
      [-0.0019, 3],
      [-0.00288, 0],
      [-0.0021, 3],
      [-0.002, 3],
      [-0.00208, 3],
      [-0.00252, 0],
      [-0.00193, 3],
      [-0.00281, 0],
      [-0.00195, 3],
      [0.00934, 1],
      [-0.00443, 2]
    ],
    "red_o_points": [],
    "y_categories": ["N", "NOT APPLICABLE", "Y", "nan"],
    "blue_o_points": [],
    "blue_x_points": [
      [0.0119, 1],
      [-0.0009, 3],
      [0.00986, 1],
      [-0.00113, 0],
      [-0.00091, 3],
      [0.0084, 1],
      [0.01012, 1]
    ]
  },
  "QS_mulGraftTrunk[UpperTrunk]": {
    "red_x_points": [
      [-0.0003, 3],
      [-0.00047, 0],
      [-0.00057, 0],
      [-0.0006, 0],
      [-0.00046, 0],
      [-0.00054, 0],
      [-0.00058, 0],
      [-0.00029, 3],
      [-0.00058, 0],
      [-0.0005, 0],
      [-0.00065, 0],
      [-0.00034, 3],
      [0.00121, 1],
      [-0.00034, 3],
      [-0.00268, 2],
      [-0.00034, 3],
      [-0.00041, 0],
      [-0.00046, 0],
      [-0.00033, 3],
      [-0.00032, 3],
      [-0.00025, 3],
      [-0.0006, 0],
      [-0.00035, 3],
      [-0.00027, 3],
      [-0.00032, 3],
      [-0.00063, 0],
      [-0.00028, 3],
      [-0.00056, 0],
      [-0.00023, 3],
      [0.0017, 1],
      [-0.00052, 0]
    ],
    "red_o_points": [],
    "y_categories": ["N", "NOT APPLICABLE", "Y", "nan"],
    "blue_o_points": [],
    "blue_x_points": [
      [0.00206, 1],
      [-6e-5, 3],
      [0.00185, 1],
      [0.0001, 0],
      [-0.00015, 3],
      [0.00167, 1],
      [0.00226, 1]
    ]
  },
  "QS_mulNeuromadSite[C5]": {
    "red_x_points": [
      [-0.00106, 2],
      [-0.00306, 0],
      [-0.00358, 0],
      [-0.00339, 0],
      [-0.00347, 0],
      [-0.00357, 0],
      [-0.00348, 0],
      [-0.00097, 2],
      [-0.00365, 0],
      [-0.00342, 0],
      [-0.00302, 0],
      [-0.0011, 2],
      [0.00529, 1],
      [-0.00118, 2],
      [-0.00347, 0],
      [-0.00098, 2],
      [-0.00306, 0],
      [-0.00351, 0],
      [-0.00112, 2],
      [-0.00116, 2],
      [-0.00081, 2],
      [-0.00295, 0],
      [-0.00119, 2],
      [-0.00102, 2],
      [-0.00133, 2],
      [-0.00308, 0],
      [-0.00095, 2],
      [-0.00316, 0],
      [-0.00074, 2],
      [0.00538, 1],
      [-0.00299, 0]
    ],
    "red_o_points": [],
    "y_categories": ["N", "NOT APPLICABLE", "nan"],
    "blue_o_points": [],
    "blue_x_points": [
      [0.01469, 1],
      [0.0, 2],
      [0.00642, 1],
      [0.00063, 0],
      [-0.00033, 2],
      [0.00684, 1],
      [0.00802, 1]
    ]
  },
  "QS_mulNeuromadSite[C7]": {
    "red_x_points": [
      [-0.00087, 2],
      [-0.0021, 0],
      [-0.00216, 0],
      [-0.00204, 0],
      [-0.0023, 0],
      [-0.00216, 0],
      [-0.00245, 0],
      [-0.00071, 2],
      [-0.00221, 0],
      [-0.0021, 0],
      [-0.002, 0],
      [-0.00081, 2],
      [0.00322, 1],
      [-0.00076, 2],
      [-0.00233, 0],
      [-0.00085, 2],
      [-0.00192, 0],
      [-0.00233, 0],
      [-0.00088, 2],
      [-0.00084, 2],
      [-0.00055, 2],
      [-0.00164, 0],
      [-0.00093, 2],
      [-0.00085, 2],
      [-0.00085, 2],
      [-0.00191, 0],
      [-0.00104, 2],
      [-0.00213, 0],
      [-0.00053, 2],
      [0.00386, 1],
      [-0.00194, 0]
    ],
    "red_o_points": [],
    "y_categories": ["N", "NOT APPLICABLE", "nan"],
    "blue_o_points": [],
    "blue_x_points": [
      [0.01024, 1],
      [-0.00023, 2],
      [0.00365, 1],
      [0.00023, 0],
      [-0.00016, 2],
      [0.00412, 1],
      [0.00526, 1]
    ]
  },
  "QS_mulTransfSite[IMc]": {
    "red_x_points": [
      [-0.00256, 3],
      [-0.00664, 2],
      [-0.004, 0],
      [-0.00384, 0],
      [-0.00411, 0],
      [-0.00392, 0],
      [-0.00445, 0],
      [-0.00263, 3],
      [-0.00421, 0],
      [-0.00448, 0],
      [-0.00436, 0],
      [-0.00295, 3],
      [0.01061, 1],
      [-0.00298, 3],
      [-0.004, 0],
      [-0.0026, 3],
      [-0.00731, 2],
      [-0.00406, 0],
      [-0.00288, 3],
      [-0.00271, 3],
      [-0.0023, 3],
      [-0.00389, 0],
      [-0.00276, 3],
      [-0.00251, 3],
      [-0.00289, 3],
      [-0.00437, 0],
      [-0.00262, 3],
      [-0.00688, 2],
      [-0.0022, 3],
      [0.0125, 1],
      [-0.00641, 2]
    ],
    "red_o_points": [],
    "y_categories": ["N", "NOT APPLICABLE", "Y", "nan"],
    "blue_o_points": [],
    "blue_x_points": [
      [0.01988, 1],
      [-0.00121, 3],
      [0.01335, 1],
      [-0.00193, 0],
      [-0.00113, 3],
      [0.01378, 1],
      [0.01408, 1]
    ]
  },
  "QA_mulInjOrthesisType[ShoulderSupport]": {
    "red_x_points": [
      [-0.01632, 0],
      [-0.0145, 0],
      [-0.01593, 0],
      [-0.01462, 0],
      [-0.01477, 0],
      [-0.01486, 0],
      [-0.01531, 0],
      [-0.01835, 2],
      [-0.0149, 0],
      [-0.01484, 0],
      [-0.01484, 0],
      [-0.01557, 0],
      [0.03986, 1],
      [-0.01636, 0],
      [-0.01519, 0],
      [-0.01557, 0],
      [-0.01799, 2],
      [-0.01478, 0],
      [-0.01585, 0],
      [-0.01604, 0],
      [-0.01896, 2],
      [-0.01663, 3],
      [-0.01686, 0],
      [0.04547, 1],
      [-0.01638, 0],
      [-0.01527, 0],
      [-0.0163, 0],
      [-0.01494, 0],
      [-0.01897, 3],
      [-0.02733, 3],
      [-0.01508, 0]
    ],
    "red_o_points": [],
    "y_categories": ["N", "NOT APPLICABLE", "Y", "nan"],
    "blue_o_points": [],
    "blue_x_points": [
      [-0.00666, 0],
      [0.04618, 1],
      [0.04052, 1],
      [0.0459, 1],
      [0.04494, 1],
      [0.04009, 1],
      [0.03805, 1]
    ]
  },
  "QA_mulInjOrthesisType[ArmSling]": {
    "red_x_points": [
      [-0.0157, 2],
      [-0.01395, 2],
      [-0.01398, 2],
      [-0.01397, 2],
      [-0.01411, 2],
      [-0.01474, 2],
      [-0.01382, 2],
      [-0.01449, 2],
      [-0.01407, 2],
      [-0.01333, 2],
      [-0.01384, 2],
      [-0.01458, 2],
      [0.03735, 1],
      [-0.01508, 2],
      [-0.01418, 2],
      [-0.01572, 2],
      [-0.01629, 0],
      [-0.01405, 2],
      [-0.01444, 2],
      [-0.01452, 2],
      [-0.01721, 0],
      [-0.01633, 3],
      [-0.01454, 2],
      [0.04196, 1],
      [-0.01455, 2],
      [-0.01427, 2],
      [-0.01505, 2],
      [-0.01364, 2],
      [-0.01798, 3],
      [-0.02381, 3],
      [-0.01421, 2]
    ],
    "red_o_points": [],
    "y_categories": ["N", "NOT APPLICABLE", "Y", "nan"],
    "blue_o_points": [],
    "blue_x_points": [
      [-0.00745, 2],
      [0.04282, 1],
      [0.03746, 1],
      [0.04627, 1],
      [0.04292, 1],
      [0.03553, 1],
      [0.03797, 1]
    ]
  },
  "QS_mulGraftNerve[Ac]": {
    "red_x_points": [
      [-0.00012, 2],
      [-0.00049, 0],
      [-0.00041, 0],
      [-0.00046, 0],
      [-0.0006, 0],
      [-0.0005, 0],
      [-0.00041, 0],
      [-9e-5, 2],
      [-0.00053, 0],
      [-0.00037, 0],
      [-0.0003, 0],
      [-0.00013, 2],
      [0.00079, 1],
      [-7e-5, 2],
      [-0.00055, 0],
      [-8e-5, 2],
      [-0.00026, 0],
      [-0.00053, 0],
      [-0.0001, 2],
      [-8e-5, 2],
      [-9e-5, 2],
      [-0.00047, 0],
      [-0.0001, 2],
      [-9e-5, 2],
      [-0.00016, 2],
      [-0.00031, 0],
      [-0.00013, 2],
      [-0.00037, 0],
      [-9e-5, 2],
      [0.00085, 1],
      [-0.00032, 0]
    ],
    "red_o_points": [],
    "y_categories": ["N", "NOT APPLICABLE", "nan"],
    "blue_o_points": [],
    "blue_x_points": [
      [0.00162, 1],
      [-5e-5, 2],
      [0.00076, 1],
      [-2e-5, 0],
      [0.0, 2],
      [0.00112, 1],
      [0.00124, 1]
    ]
  },
  "QS_mulLysisRoot[C7]": {
    "red_x_points": [
      [-0.00014, 3],
      [-0.0002, 0],
      [-0.00061, 2],
      [-0.00022, 0],
      [-0.00021, 0],
      [-0.00019, 0],
      [-0.00024, 0],
      [-0.00013, 3],
      [-0.00019, 0],
      [-0.00018, 0],
      [-0.00023, 0],
      [-0.00015, 3],
      [0.00076, 1],
      [-8e-5, 3],
      [-0.00023, 0],
      [-0.00017, 3],
      [-0.00017, 0],
      [-0.00019, 0],
      [-0.00014, 3],
      [-0.00016, 3],
      [-0.00016, 3],
      [-0.00017, 0],
      [-0.00015, 3],
      [-0.00014, 3],
      [-0.00021, 3],
      [-0.00026, 0],
      [-0.00018, 3],
      [-0.00017, 0],
      [-0.00011, 3],
      [0.00078, 1],
      [-0.00022, 0]
    ],
    "red_o_points": [],
    "y_categories": ["N", "NOT APPLICABLE", "Y", "nan"],
    "blue_o_points": [],
    "blue_x_points": [
      [0.00066, 1],
      [-7e-5, 3],
      [0.0007, 1],
      [-0.00025, 0],
      [-4e-5, 3],
      [0.00082, 1],
      [0.00083, 1]
    ]
  },
  "QS_mulNeuromadSite[C8]": {
    "red_x_points": [
      [-0.00151, 2],
      [-0.00428, 0],
      [-0.00432, 0],
      [-0.00437, 0],
      [-0.00451, 0],
      [-0.00422, 0],
      [-0.00435, 0],
      [-0.00159, 2],
      [-0.00448, 0],
      [-0.00409, 0],
      [-0.00424, 0],
      [-0.0015, 2],
      [0.00714, 1],
      [-0.00155, 2],
      [-0.00464, 0],
      [-0.00175, 2],
      [-0.00375, 0],
      [-0.00434, 0],
      [-0.00157, 2],
      [-0.00156, 2],
      [-0.00105, 2],
      [-0.00343, 0],
      [-0.00173, 2],
      [-0.00097, 2],
      [-0.0018, 2],
      [-0.00428, 0],
      [-0.00169, 2],
      [-0.0042, 0],
      [-0.00134, 2],
      [0.00865, 1],
      [-0.0045, 0]
    ],
    "red_o_points": [],
    "y_categories": ["N", "NOT APPLICABLE", "nan"],
    "blue_o_points": [],
    "blue_x_points": [
      [0.01927, 1],
      [-0.00032, 2],
      [0.00926, 1],
      [0.0001, 0],
      [-0.00043, 2],
      [0.00927, 1],
      [0.01003, 1]
    ]
  },
  "QS_mulGraftNerve[Ph]": {
    "red_x_points": [
      [-6e-5, 2],
      [-0.00013, 0],
      [-0.00024, 0],
      [-0.00021, 0],
      [-0.00014, 0],
      [-3e-5, 0],
      [-0.0002, 0],
      [-7e-5, 2],
      [-0.00018, 0],
      [-0.00016, 0],
      [-0.00019, 0],
      [-6e-5, 2],
      [-0.0001, 1],
      [-3e-5, 2],
      [-0.00023, 0],
      [-8e-5, 2],
      [-0.00012, 0],
      [-0.0002, 0],
      [-6e-5, 2],
      [-7e-5, 2],
      [-1e-5, 2],
      [-9e-5, 0],
      [-6e-5, 2],
      [-0.0, 2],
      [-0.0001, 2],
      [-0.00011, 0],
      [-6e-5, 2],
      [-0.00018, 0],
      [-6e-5, 2],
      [0.00037, 1],
      [-0.00015, 0]
    ],
    "red_o_points": [],
    "y_categories": ["N", "NOT APPLICABLE", "nan"],
    "blue_o_points": [],
    "blue_x_points": [
      [0.00122, 1],
      [7e-5, 2],
      [9e-5, 1],
      [0.0001, 0],
      [8e-5, 2],
      [0.00028, 1],
      [0.00056, 1]
    ]
  },
  "QS_mulTransfSite[AcSsPA]": {
    "red_x_points": [
      [-0.00031, 3],
      [-0.00043, 0],
      [-0.00047, 0],
      [-0.00042, 0],
      [-0.00032, 0],
      [-0.00044, 0],
      [-0.00027, 0],
      [-0.00027, 3],
      [-0.00037, 0],
      [-0.00041, 0],
      [-0.00037, 0],
      [-0.00025, 3],
      [0.00095, 1],
      [-0.00022, 3],
      [-0.00029, 0],
      [-0.00033, 3],
      [-0.00155, 2],
      [-0.00036, 0],
      [-0.00027, 3],
      [-0.00028, 3],
      [-0.00023, 3],
      [-0.00041, 0],
      [-0.00026, 3],
      [-0.00028, 3],
      [-0.00037, 3],
      [-0.00035, 0],
      [-0.00031, 3],
      [-0.00038, 0],
      [-0.00024, 3],
      [0.00077, 1],
      [-0.00034, 0]
    ],
    "red_o_points": [],
    "y_categories": ["N", "NOT APPLICABLE", "Y", "nan"],
    "blue_o_points": [],
    "blue_x_points": [
      [0.00156, 1],
      [-0.00024, 3],
      [0.00122, 1],
      [0.0, 0],
      [-0.00017, 3],
      [0.00143, 1],
      [0.00147, 1]
    ]
  },
  "QS_mulTransfSite[AcMc]": {
    "red_x_points": [
      [-0.00029, 3],
      [-0.0002, 0],
      [-0.00029, 0],
      [-0.00017, 0],
      [-0.00027, 0],
      [-0.00026, 0],
      [-0.00028, 0],
      [-0.00028, 3],
      [-0.00024, 0],
      [-0.00025, 0],
      [-0.00075, 2],
      [-0.00027, 3],
      [0.00101, 1],
      [-0.00025, 3],
      [-0.00024, 0],
      [-0.00024, 3],
      [-0.00024, 0],
      [-0.00027, 0],
      [-0.00023, 3],
      [-0.00021, 3],
      [-0.00027, 3],
      [-0.00019, 0],
      [-0.00029, 3],
      [-0.00022, 3],
      [-0.0002, 3],
      [-0.00029, 0],
      [-0.00021, 3],
      [-0.00023, 0],
      [-0.00033, 3],
      [0.00102, 1],
      [-0.00021, 0]
    ],
    "red_o_points": [],
    "y_categories": ["N", "NOT APPLICABLE", "Y", "nan"],
    "blue_o_points": [],
    "blue_x_points": [
      [0.00106, 1],
      [-0.00015, 3],
      [0.0008, 1],
      [-0.00032, 0],
      [-8e-5, 3],
      [0.00108, 1],
      [0.00124, 1]
    ]
  },
  "QS_mulTransfSite[Other]": {
    "red_x_points": [
      [-0.00014, 3],
      [-0.00038, 0],
      [-0.00032, 0],
      [-0.0003, 0],
      [-0.00018, 0],
      [-0.00027, 0],
      [-0.00033, 0],
      [-0.00019, 3],
      [-0.00026, 0],
      [-0.00036, 0],
      [-0.00033, 0],
      [-0.00023, 3],
      [0.00084, 1],
      [-0.00013, 3],
      [-0.00034, 0],
      [-0.00023, 3],
      [-0.00033, 0],
      [-0.00338, 2],
      [-0.00018, 3],
      [-8e-5, 3],
      [-0.00018, 3],
      [-0.00023, 0],
      [-0.00022, 3],
      [-0.00024, 3],
      [-0.00021, 3],
      [-0.00027, 0],
      [-0.00052, 3],
      [-0.00032, 0],
      [-0.00026, 3],
      [0.00122, 1],
      [-0.00035, 0]
    ],
    "red_o_points": [],
    "y_categories": ["N", "NOT APPLICABLE", "Y", "nan"],
    "blue_o_points": [],
    "blue_x_points": [
      [0.00123, 1],
      [-0.00017, 3],
      [0.0019, 1],
      [0.00071, 0],
      [0.00015, 3],
      [0.00121, 1],
      [0.00104, 1]
    ]
  },
  "QA_yonInjBpsurg": {
    "red_x_points": [
      [-0.00455, 1],
      [-0.00384, 1],
      [-0.0042, 1],
      [-0.00439, 1],
      [-0.00415, 1],
      [-0.00418, 1],
      [-0.00442, 1],
      [-0.00413, 1],
      [-0.00416, 1],
      [-0.00403, 1],
      [-0.00399, 1],
      [-0.00424, 1],
      [0.00887, 0],
      [-0.00456, 1],
      [-0.00394, 1],
      [-0.0044, 1],
      [-0.00318, 1],
      [-0.0039, 1],
      [-0.00494, 1],
      [-0.00426, 1],
      [-0.00365, 1],
      [-0.00359, 1],
      [-0.00444, 1],
      [-0.00413, 1],
      [-0.00428, 1],
      [-0.0043, 1],
      [-0.00418, 1],
      [-0.00415, 1],
      [-0.00386, 1],
      [0.01076, 0],
      [-0.00404, 1]
    ],
    "red_o_points": [],
    "y_categories": ["N", "Y", "nan"],
    "blue_o_points": [],
    "blue_x_points": [
      [0.02672, 0],
      [-0.00122, 1],
      [0.01202, 0],
      [-0.00263, 1],
      [-0.00129, 1],
      [0.01354, 0],
      [0.01595, 0]
    ]
  },
  "QS_mulNeuromadSite[T1]": {
    "red_x_points": [
      [-0.00197, 2],
      [-0.00463, 0],
      [-0.00503, 0],
      [-0.00507, 0],
      [-0.00436, 0],
      [-0.00471, 0],
      [-0.00458, 0],
      [-0.00176, 2],
      [-0.00509, 0],
      [-0.00498, 0],
      [-0.00491, 0],
      [-0.00185, 2],
      [0.00737, 1],
      [-0.00204, 2],
      [-0.00428, 0],
      [-0.00212, 2],
      [-0.0044, 0],
      [-0.00496, 0],
      [-0.00192, 2],
      [-0.00177, 2],
      [-0.00119, 2],
      [-0.00428, 0],
      [-0.00198, 2],
      [-0.00191, 2],
      [-0.00221, 2],
      [-0.00482, 0],
      [-0.00198, 2],
      [-0.00514, 0],
      [-0.00157, 2],
      [0.00779, 1],
      [-0.00461, 0]
    ],
    "red_o_points": [],
    "y_categories": ["N", "NOT APPLICABLE", "nan"],
    "blue_o_points": [],
    "blue_x_points": [
      [0.02142, 1],
      [0.00016, 2],
      [0.00905, 1],
      [0.0009, 0],
      [-0.00029, 2],
      [0.00963, 1],
      [0.01339, 1]
    ]
  },
  "QS_mulTransfSite[AcSsAA]": {
    "red_x_points": [
      [-0.00299, 3],
      [-0.00835, 2],
      [-0.00384, 0],
      [-0.00856, 2],
      [-0.00948, 2],
      [-0.0038, 0],
      [-0.00361, 0],
      [-0.00289, 3],
      [-0.00355, 0],
      [-0.00836, 2],
      [-0.00339, 0],
      [-0.00285, 3],
      [0.01428, 1],
      [-0.00323, 3],
      [-0.01058, 2],
      [-0.00283, 3],
      [-0.00272, 0],
      [-0.00371, 0],
      [-0.00282, 3],
      [-0.0028, 3],
      [-0.00268, 3],
      [-0.00838, 2],
      [-0.00338, 3],
      [-0.00243, 3],
      [-0.00311, 3],
      [-0.00381, 0],
      [-0.00286, 3],
      [-0.00809, 2],
      [-0.00267, 3],
      [0.01451, 1],
      [-0.00341, 0]
    ],
    "red_o_points": [],
    "y_categories": ["N", "NOT APPLICABLE", "Y", "nan"],
    "blue_o_points": [],
    "blue_x_points": [
      [0.02181, 1],
      [-0.00112, 3],
      [0.01489, 1],
      [0.0001, 0],
      [-0.00091, 3],
      [0.01436, 1],
      [0.01696, 1]
    ]
  },
  "QS_mulLysisRoot[C5]": {
    "red_x_points": [
      [-0.00087, 3],
      [-0.0011, 0],
      [-0.00215, 2],
      [-0.00107, 0],
      [-0.00093, 0],
      [-0.00094, 0],
      [-0.00098, 0],
      [-0.00093, 3],
      [-0.00085, 0],
      [-0.00104, 0],
      [-0.00104, 0],
      [-0.00074, 3],
      [0.0034, 1],
      [-0.00083, 3],
      [-0.00113, 0],
      [-0.00097, 3],
      [-0.00103, 0],
      [-0.00099, 0],
      [-0.00081, 3],
      [-0.00091, 3],
      [-0.00093, 3],
      [-0.00096, 0],
      [-0.00082, 3],
      [-0.00096, 3],
      [-0.00096, 3],
      [-0.0009, 0],
      [-0.00074, 3],
      [-0.0011, 0],
      [-0.00087, 3],
      [0.00384, 1],
      [-0.00202, 2]
    ],
    "red_o_points": [],
    "y_categories": ["N", "NOT APPLICABLE", "Y", "nan"],
    "blue_o_points": [],
    "blue_x_points": [
      [0.00418, 1],
      [-0.00034, 3],
      [0.00394, 1],
      [-0.00108, 0],
      [-0.00059, 3],
      [0.00391, 1],
      [0.00425, 1]
    ]
  },
  "QS_mulNeuromadSite[C6]": {
    "red_x_points": [
      [-0.00053, 2],
      [-0.0013, 0],
      [-0.0014, 0],
      [-0.00109, 0],
      [-0.00129, 0],
      [-0.00142, 0],
      [-0.001, 0],
      [-0.00029, 2],
      [-0.0014, 0],
      [-0.00133, 0],
      [-0.0014, 0],
      [-0.00031, 2],
      [0.00219, 1],
      [-0.00054, 2],
      [-0.0012, 0],
      [-0.00046, 2],
      [-0.00105, 0],
      [-0.00112, 0],
      [-0.00047, 2],
      [-0.0004, 2],
      [-0.0003, 2],
      [-0.00105, 0],
      [-0.00043, 2],
      [-0.00027, 2],
      [-0.00055, 2],
      [-0.00114, 0],
      [-0.00045, 2],
      [-0.00125, 0],
      [-0.00039, 2],
      [0.00165, 1],
      [-0.00127, 0]
    ],
    "red_o_points": [],
    "y_categories": ["N", "NOT APPLICABLE", "nan"],
    "blue_o_points": [],
    "blue_x_points": [
      [0.00583, 1],
      [9e-5, 2],
      [0.00273, 1],
      [-9e-5, 0],
      [-0.00013, 2],
      [0.0024, 1],
      [0.00332, 1]
    ]
  },
  "QS_mulGraftNerve[Ul]": {
    "red_x_points": [
      [-1e-5, 2],
      [-5e-5, 0],
      [-5e-5, 0],
      [-5e-5, 0],
      [-5e-5, 0],
      [-5e-5, 0],
      [-1e-5, 2],
      [-5e-5, 0],
      [-5e-5, 0],
      [-5e-5, 0],
      [-1e-5, 2],
      [0.00012, 1],
      [-1e-5, 2],
      [-5e-5, 0],
      [-1e-5, 2],
      [-5e-5, 0],
      [-5e-5, 0],
      [-1e-5, 2],
      [-1e-5, 2],
      [-5e-5, 0],
      [-1e-5, 2],
      [-1e-5, 2],
      [-5e-5, 0]
    ],
    "red_o_points": [],
    "y_categories": ["N", "NOT APPLICABLE", "nan"],
    "blue_o_points": [],
    "blue_x_points": [
      [0.00012, 1],
      [-1e-5, 2],
      [0.00012, 1],
      [-1e-5, 2],
      [0.00012, 1],
      [0.00012, 1]
    ]
  },
  "QS_mulBpsurgeryType[Lysis]": {
    "red_x_points": [
      [-0.0028, 3],
      [-0.00501, 0],
      [-0.00869, 2],
      [-0.00496, 0],
      [-0.0049, 0],
      [-0.00869, 2],
      [-0.00542, 0],
      [-0.00266, 3],
      [-0.00525, 0],
      [-0.00493, 0],
      [-0.00491, 0],
      [-0.00259, 3],
      [0.0138, 1],
      [-0.0027, 3],
      [-0.0048, 0],
      [-0.00306, 3],
      [-0.00852, 2],
      [-0.00489, 0],
      [-0.00258, 3],
      [-0.00281, 3],
      [-0.00242, 3],
      [-0.005, 0],
      [-0.00288, 3],
      [-0.00252, 3],
      [-0.00298, 3],
      [-0.00443, 0],
      [-0.00269, 3],
      [-0.00484, 0],
      [-0.00279, 3],
      [0.01593, 1],
      [-0.00851, 2]
    ],
    "red_o_points": [],
    "y_categories": ["N", "NOT APPLICABLE", "Y", "nan"],
    "blue_o_points": [],
    "blue_x_points": [
      [0.0208, 1],
      [-0.00091, 3],
      [0.01483, 1],
      [-0.00148, 0],
      [-0.00095, 3],
      [0.01641, 1],
      [0.01642, 1]
    ]
  },
  "QA_yonInjUnconscio": {
    "red_x_points": [
      [-0.0047, 1],
      [-0.00371, 1],
      [-0.0019, 2],
      [-0.00166, 2],
      [0.0072, 0],
      [-0.00428, 1],
      [-0.00223, 2],
      [-0.00424, 2],
      [-0.00223, 2],
      [-0.00148, 2],
      [-0.00395, 1],
      [-0.00472, 1],
      [-0.03297, 1],
      [-0.00471, 2],
      [-0.00172, 2],
      [-0.00509, 2],
      [-0.0037, 1],
      [0.00708, 0],
      [-0.0044, 1],
      [-0.00422, 1],
      [-0.0037, 1],
      [-0.00402, 1],
      [-0.00493, 2],
      [-0.01127, 1],
      [-0.00361, 2],
      [-0.00354, 1],
      [0.01141, 0],
      [-0.00334, 1],
      [-0.00395, 2],
      [4e-5, 2],
      [-0.00392, 1]
    ],
    "red_o_points": [],
    "y_categories": ["N", "Y", "nan"],
    "blue_o_points": [],
    "blue_x_points": [
      [0.00156, 2],
      [-0.00312, 1],
      [0.01721, 0],
      [0.01989, 0],
      [0.02353, 0],
      [0.00392, 2],
      [0.00339, 2]
    ]
  },
  "QS_mulTransfSite[Oberlin]": {
    "red_x_points": [
      [-0.00457, 3],
      [-0.01381, 0],
      [-0.01334, 0],
      [-0.01445, 0],
      [-0.00647, 2],
      [-0.0065, 2],
      [-0.01395, 0],
      [-0.00438, 3],
      [-0.00628, 2],
      [-0.0069, 2],
      [-0.00653, 2],
      [-0.00423, 3],
      [0.02265, 1],
      [-0.00446, 3],
      [-0.00657, 2],
      [-0.00424, 3],
      [-0.01557, 0],
      [-0.00664, 2],
      [-0.00475, 3],
      [-0.00441, 3],
      [-0.00419, 3],
      [-0.01362, 0],
      [-0.00446, 3],
      [-0.00469, 3],
      [-0.00427, 3],
      [-0.00665, 2],
      [-0.00435, 3],
      [-0.01375, 0],
      [-0.004, 3],
      [0.02443, 1],
      [-0.01432, 0]
    ],
    "red_o_points": [],
    "y_categories": ["N", "NOT APPLICABLE", "Y", "nan"],
    "blue_o_points": [],
    "blue_x_points": [
      [0.03328, 1],
      [-0.00206, 3],
      [0.02751, 1],
      [0.00044, 2],
      [-0.00197, 3],
      [0.0266, 1],
      [0.02935, 1]
    ]
  },
  "QA_lstPexMuscstrength[ShoulderAbduc]": {
    "red_x_points": [
      [-0.00814, 1],
      [-0.00804, 1],
      [-0.00798, 1],
      [-0.00806, 1],
      [-0.00866, 1],
      [-0.00818, 1],
      [-0.00809, 1],
      [-0.00803, 1],
      [-0.00806, 1],
      [-0.00812, 1],
      [-0.00781, 1],
      [-0.00792, 1],
      [0.0033, 2],
      [0.0074, 2],
      [0.00661, 2],
      [0.00654, 2],
      [0.00721, 2],
      [-0.00846, 1],
      [-0.00796, 1],
      [-0.00807, 1],
      [-0.00773, 1],
      [-0.00806, 1],
      [0.00729, 2],
      [-0.01141, 1],
      [-0.00778, 1],
      [-0.00776, 1],
      [-0.00847, 1],
      [-0.00818, 1],
      [-0.00768, 1],
      [0.00086, 2],
      [-0.0082, 1]
    ],
    "red_o_points": [],
    "y_categories": ["GREATER THAN OR EQUALS TO 3", "LESS THAN 3", "nan"],
    "blue_o_points": [],
    "blue_x_points": [
      [0.00457, 2],
      [0.0072, 2],
      [0.03438, 0],
      [0.00873, 2],
      [0.00782, 2],
      [0.03506, 0],
      [-0.00137, 1]
    ]
  },
  "participant_code": {
    "red_x_points": [
      [-0.02473, 1],
      [-0.02459, 2],
      [-0.02538, 3],
      [-0.02538, 4],
      [-0.02655, 5],
      [-0.02524, 6],
      [-0.02613, 7],
      [-0.02426, 8],
      [-0.02459, 9],
      [-0.02552, 10],
      [-0.0251, 11],
      [-0.02515, 12],
      [-0.02538, 14],
      [-0.02482, 16],
      [-0.02547, 17],
      [-0.0244, 19],
      [-0.02496, 20],
      [-0.02487, 22],
      [-0.02426, 23],
      [-0.02566, 25],
      [-0.02454, 26],
      [-0.02529, 27],
      [-0.02599, 28],
      [-0.0244, 29],
      [-0.02464, 30],
      [-0.02519, 32],
      [-0.02454, 33],
      [-0.02552, 34],
      [-0.02533, 35],
      [-0.02492, 36],
      [-0.02412, 37]
    ],
    "red_o_points": [],
    "y_categories": [
      "P16554",
      "P18297",
      "P19283",
      "P19287",
      "P23391",
      "P31645",
      "P31691",
      "P34778",
      "P35046",
      "P36328",
      "P43633",
      "P4544",
      "P46417",
      "P48965",
      "P53068",
      "P5497",
      "P59529",
      "P62483",
      "P64658",
      "P65202",
      "P66816",
      "P6751",
      "P7408",
      "P75566",
      "P76226",
      "P79971",
      "P82621",
      "P82990",
      "P84932",
      "P85825",
      "P86989",
      "P8770",
      "P87791",
      "P90550",
      "P93159",
      "P94969",
      "P96710",
      "P9744",
      "nan"
    ],
    "blue_o_points": [],
    "blue_x_points": [
      [0.07389, 0],
      [0.07236, 13],
      [0.07098, 15],
      [0.07129, 18],
      [0.07098, 21],
      [0.07175, 24],
      [0.07634, 31]
    ]
  },
  "QS_mulGraftNerve[Me]": {
    "red_x_points": [
      [-9e-5, 2],
      [-0.00011, 0],
      [-0.0001, 0],
      [-7e-5, 0],
      [-0.00013, 0],
      [-0.00012, 0],
      [-7e-5, 0],
      [-4e-5, 2],
      [-0.00011, 0],
      [-0.00013, 0],
      [-0.00011, 0],
      [-5e-5, 2],
      [-1e-5, 1],
      [-4e-5, 2],
      [-0.00012, 0],
      [-8e-5, 2],
      [-8e-5, 0],
      [-7e-5, 0],
      [-2e-5, 2],
      [-5e-5, 2],
      [-5e-5, 2],
      [-6e-5, 0],
      [-6e-5, 2],
      [-4e-5, 2],
      [-7e-5, 2],
      [-9e-5, 0],
      [-7e-5, 2],
      [-0.0001, 0],
      [-2e-5, 2],
      [0.00012, 1],
      [-0.00012, 0]
    ],
    "red_o_points": [],
    "y_categories": ["N", "NOT APPLICABLE", "nan"],
    "blue_o_points": [],
    "blue_x_points": [
      [0.0008, 1],
      [-1e-5, 2],
      [0.00012, 1],
      [4e-5, 0],
      [3e-5, 2],
      [0.00024, 1],
      [0.00031, 1]
    ]
  },
  "QS_lstBpsurgSide": {
    "red_x_points": [
      [-0.00488, 3],
      [-0.00672, 0],
      [-0.00698, 0],
      [-0.00643, 0],
      [-0.01638, 2],
      [-0.0064, 0],
      [-0.00736, 0],
      [-0.0046, 3],
      [-0.00674, 0],
      [-0.01448, 2],
      [-0.0146, 2],
      [-0.00471, 3],
      [0.02262, 1],
      [-0.00546, 3],
      [-0.0164, 2],
      [-0.00484, 3],
      [-0.01482, 2],
      [-0.01526, 2],
      [-0.00455, 3],
      [-0.00442, 3],
      [-0.00475, 3],
      [-0.00632, 0],
      [-0.00528, 3],
      [-0.00466, 3],
      [-0.00525, 3],
      [-0.0144, 2],
      [-0.00549, 3],
      [-0.01345, 2],
      [-0.00453, 3],
      [0.02491, 1],
      [-0.00683, 0]
    ],
    "red_o_points": [],
    "y_categories": ["L", "NOT APPLICABLE", "R", "nan"],
    "blue_o_points": [],
    "blue_x_points": [
      [0.03983, 1],
      [-0.002, 3],
      [0.02761, 1],
      [0.00323, 0],
      [-0.00168, 3],
      [0.02621, 1],
      [0.0301, 1]
    ]
  },
  "QS_mulNeuromadSite[T2]": {
    "red_x_points": [
      [-0.00194, 2],
      [-0.00693, 0],
      [-0.00757, 0],
      [-0.0076, 0],
      [-0.00658, 0],
      [-0.00668, 0],
      [-0.00721, 0],
      [-0.00193, 2],
      [-0.00744, 0],
      [-0.00689, 0],
      [-0.00688, 0],
      [-0.00213, 2],
      [0.00985, 1],
      [-0.00234, 2],
      [-0.00789, 0],
      [-0.00218, 2],
      [-0.00614, 0],
      [-0.00696, 0],
      [-0.00198, 2],
      [-0.00203, 2],
      [-0.0015, 2],
      [-0.00664, 0],
      [-0.00233, 2],
      [-0.00179, 2],
      [-0.00246, 2],
      [-0.00678, 0],
      [-0.00221, 2],
      [-0.0071, 0],
      [-0.00175, 2],
      [0.01493, 1],
      [-0.00709, 0]
    ],
    "red_o_points": [],
    "y_categories": ["N", "NOT APPLICABLE", "nan"],
    "blue_o_points": [],
    "blue_x_points": [
      [0.0273, 1],
      [-0.0004, 2],
      [0.01388, 1],
      [0.0004, 0],
      [-0.00036, 2],
      [0.01572, 1],
      [0.01778, 1]
    ]
  },
  "QS_mulLysisSite[Trunk]": {
    "red_x_points": [
      [-0.00139, 3],
      [-0.00204, 0],
      [-0.00237, 0],
      [-0.00225, 0],
      [-0.00224, 0],
      [-0.00401, 2],
      [-0.0025, 0],
      [-0.00133, 3],
      [-0.00214, 0],
      [-0.0019, 0],
      [-0.0022, 0],
      [-0.00137, 3],
      [0.00572, 1],
      [-0.00158, 3],
      [-0.00222, 0],
      [-0.00157, 3],
      [-0.00464, 2],
      [-0.00203, 0],
      [-0.0016, 3],
      [-0.00137, 3],
      [-0.00115, 3],
      [-0.00193, 0],
      [-0.00153, 3],
      [-0.00135, 3],
      [-0.00162, 3],
      [-0.00236, 0],
      [-0.00161, 3],
      [-0.00165, 0],
      [-0.0012, 3],
      [0.00706, 1],
      [-0.00392, 2]
    ],
    "red_o_points": [],
    "y_categories": ["N", "NOT APPLICABLE", "Y", "nan"],
    "blue_o_points": [],
    "blue_x_points": [
      [0.01042, 1],
      [-0.00039, 3],
      [0.00694, 1],
      [-0.00101, 0],
      [-0.00041, 3],
      [0.00631, 1],
      [0.007, 1]
    ]
  },
  "QS_mulNeuromadSite[C4]": {
    "red_x_points": [
      [-0.00062, 2],
      [-0.00107, 0],
      [-0.00107, 0],
      [-0.00124, 0],
      [-0.0013, 0],
      [-0.00111, 0],
      [-0.00114, 0],
      [-0.00047, 2],
      [-0.0011, 0],
      [-0.00106, 0],
      [-0.0012, 0],
      [-0.00047, 2],
      [0.00118, 1],
      [-0.00042, 2],
      [-0.00137, 0],
      [-0.00041, 2],
      [-0.00118, 0],
      [-0.00133, 0],
      [-0.00056, 2],
      [-0.00057, 2],
      [-0.00041, 2],
      [-0.00084, 0],
      [-0.0004, 2],
      [-0.00046, 2],
      [-0.0006, 2],
      [-0.00093, 0],
      [-0.00057, 2],
      [-0.00116, 0],
      [-0.00033, 2],
      [0.00197, 1],
      [-0.00119, 0]
    ],
    "red_o_points": [],
    "y_categories": ["N", "NOT APPLICABLE", "nan"],
    "blue_o_points": [],
    "blue_x_points": [
      [0.00479, 1],
      [0.00011, 2],
      [0.00225, 1],
      [0.00041, 0],
      [-0.0, 2],
      [0.00195, 1],
      [0.00378, 1]
    ]
  },
  "QS_mulGraftNerve[Ra]": {
    "red_x_points": [
      [-1e-5, 2],
      [-1e-5, 0],
      [-1e-5, 0],
      [-1e-5, 0],
      [-1e-5, 0],
      [-1e-5, 0],
      [-1e-5, 2],
      [-1e-5, 0],
      [-1e-5, 0],
      [-1e-5, 0],
      [-1e-5, 2],
      [-1e-5, 0],
      [-1e-5, 2],
      [-1e-5, 2],
      [-1e-5, 0],
      [-1e-5, 2],
      [-1e-5, 0]
    ],
    "red_o_points": [],
    "y_categories": ["N", "NOT APPLICABLE", "nan"],
    "blue_o_points": [],
    "blue_x_points": [[0.00019, 1]]
  },
  "QS_mulTransfSite[PhMc]": {
    "red_x_points": [
      [-0.00109, 3],
      [-0.00161, 0],
      [-0.00164, 0],
      [-0.00159, 0],
      [-0.00178, 0],
      [-0.00152, 0],
      [-0.00302, 2],
      [-0.00102, 3],
      [-0.00137, 0],
      [-0.00162, 0],
      [-0.00153, 0],
      [-0.00108, 3],
      [0.00416, 1],
      [-0.0011, 3],
      [-0.00137, 0],
      [-0.00097, 3],
      [-0.00146, 0],
      [-0.00163, 0],
      [-0.00098, 3],
      [-0.00113, 3],
      [-0.00095, 3],
      [-0.00283, 2],
      [-0.00098, 3],
      [-0.00104, 3],
      [-0.00115, 3],
      [-0.00157, 0],
      [-0.00096, 3],
      [-0.0015, 0],
      [-0.00113, 3],
      [0.00546, 1],
      [-0.00147, 0]
    ],
    "red_o_points": [],
    "y_categories": ["N", "NOT APPLICABLE", "Y", "nan"],
    "blue_o_points": [],
    "blue_x_points": [
      [0.00593, 1],
      [-0.00047, 3],
      [0.00554, 1],
      [-0.00134, 0],
      [-0.00058, 3],
      [0.00475, 1],
      [0.00599, 1]
    ]
  },
  "QA_mulInjTbpiCause[Motorcycle]": {
    "red_x_points": [
      [0.00212, 0],
      [-0.00108, 1],
      [-0.00164, 1],
      [-0.00155, 1],
      [-0.00126, 1],
      [-0.00152, 1],
      [-0.0015, 1],
      [-0.00154, 1],
      [-0.00171, 1],
      [-0.00138, 1],
      [-0.00126, 1],
      [0.00252, 0],
      [-0.04939, 1],
      [-0.00172, 1],
      [-0.00156, 1],
      [-0.00156, 1],
      [-0.00147, 1],
      [-0.00144, 1],
      [0.00282, 0],
      [-0.00145, 1],
      [-0.00137, 1],
      [-0.00122, 1],
      [-0.00168, 1],
      [-0.00277, 1],
      [0.00267, 0],
      [-0.00125, 1],
      [-0.0013, 1],
      [-0.00124, 1],
      [-0.00164, 1],
      [-0.04359, 1],
      [-0.00127, 1]
    ],
    "red_o_points": [],
    "y_categories": ["N", "Y", "nan"],
    "blue_o_points": [],
    "blue_x_points": [
      [0.02239, 0],
      [-0.0011, 1],
      [0.01938, 0],
      [-0.00263, 1],
      [-0.00084, 1],
      [0.02066, 0],
      [0.02107, 0]
    ]
  },
  "QS_mulGraftNerve[FI]": {
    "red_x_points": [
      [-8e-5, 2],
      [-0.00013, 0],
      [-0.00017, 0],
      [-0.00018, 0],
      [-8e-5, 0],
      [-0.00014, 0],
      [-0.0001, 0],
      [-1e-5, 2],
      [-0.00018, 0],
      [-0.00013, 0],
      [-0.00013, 0],
      [-5e-5, 2],
      [-1e-5, 1],
      [-0.00012, 2],
      [-0.0001, 0],
      [-0.0001, 2],
      [-9e-5, 0],
      [-8e-5, 0],
      [-5e-5, 2],
      [-3e-5, 2],
      [-3e-5, 2],
      [-0.0001, 0],
      [-0.00015, 2],
      [-4e-5, 2],
      [-9e-5, 2],
      [-0.00014, 0],
      [-5e-5, 2],
      [-0.00013, 0],
      [-7e-5, 2],
      [0.0001, 1],
      [-9e-5, 0]
    ],
    "red_o_points": [],
    "y_categories": ["N", "NOT APPLICABLE", "nan"],
    "blue_o_points": [],
    "blue_x_points": [
      [0.00109, 1],
      [7e-5, 2],
      [0.00012, 1],
      [7e-5, 0],
      [-3e-5, 2],
      [0.00012, 1],
      [0.00034, 1]
    ]
  },
  "QS_mulGraftLevel[Trunk]": {
    "red_x_points": [
      [-0.00017, 3],
      [-0.00033, 0],
      [-0.0003, 0],
      [-0.0003, 0],
      [-0.00033, 0],
      [-0.00022, 0],
      [-0.00026, 0],
      [-0.0002, 3],
      [-0.00029, 0],
      [-0.00023, 0],
      [-0.00025, 0],
      [-0.0002, 3],
      [0.00068, 1],
      [-0.00022, 3],
      [-0.00224, 2],
      [-0.00021, 3],
      [-9e-5, 0],
      [-0.00033, 0],
      [-0.00015, 3],
      [-0.00018, 3],
      [-7e-5, 3],
      [-0.00031, 0],
      [-0.00024, 3],
      [-0.00022, 3],
      [-0.00022, 3],
      [-0.00019, 0],
      [-0.0002, 3],
      [-0.00028, 0],
      [-0.00021, 3],
      [0.00099, 1],
      [-0.00027, 0]
    ],
    "red_o_points": [],
    "y_categories": ["N", "NOT APPLICABLE", "Y", "nan"],
    "blue_o_points": [],
    "blue_x_points": [
      [0.00088, 1],
      [-6e-5, 3],
      [0.00095, 1],
      [0.00094, 0],
      [-0.00018, 3],
      [0.00074, 1],
      [0.00119, 1]
    ]
  }
}
