{
  "QA_lstPexMuscstrength[ElbowFlex]": {
    "red_x_points": [
      [-0.01145, 1],
      [0.00032, 2],
      [-0.01108, 1],
      [-0.01049, 1],
      [-0.01093, 1],
      [-0.01174, 1],
      [-0.0111, 1],
      [-0.01088, 1],
      [-0.01126, 1],
      [-0.01144, 1],
      [-0.01062, 1],
      [-0.01189, 1],
      [-0.00022, 2],
      [-0.00201, 2],
      [0.00101, 2],
      [-0.01197, 1],
      [-0.01173, 1],
      [-0.01133, 1],
      [-0.01073, 1],
      [-0.01132, 1],
      [-0.0, 2],
      [-0.01129, 1],
      [-0.01238, 1],
      [-0.01173, 1],
      [-0.01035, 1],
      [0.00069, 2],
      [-0.01043, 1],
      [-0.01098, 1],
      [8e-5, 2]
    ],
    "red_o_points": [],
    "y_categories": ["GREATER THAN OR EQUALS TO 3", "LESS THAN 3", "nan"],
    "blue_o_points": [],
    "blue_x_points": [
      [0.00169, 2],
      [-0.01035, 1],
      [0.05586, 0],
      [-0.01126, 1],
      [0.00315, 2],
      [0.00258, 2],
      [0.04271, 0],
      [-0.00994, 1],
      [-0.01055, 1],
      [0.00216, 2],
      [0.05426, 0],
      [0.04321, 0],
      [0.05023, 0],
      [0.04391, 0],
      [-0.01041, 1]
    ]
  },
  "QS_mulGraftNerve[other]": {
    "red_x_points": [
      [4e-5, 2],
      [-0.0003, 0],
      [-0.00021, 0],
      [-8e-5, 0],
      [-0.00027, 0],
      [-6e-5, 0],
      [-0.00022, 0],
      [-0.0, 2],
      [-0.00029, 0],
      [-0.00018, 0],
      [-2e-5, 2],
      [-0.00027, 0],
      [5e-5, 2],
      [-0.00042, 0],
      [-0.00015, 0],
      [-5e-5, 2],
      [-2e-5, 2],
      [-4e-5, 2],
      [-8e-5, 0],
      [-1e-5, 2],
      [-0.0, 2],
      [5e-5, 2],
      [-0.00028, 0],
      [-0.00032, 0],
      [-1e-5, 2],
      [7e-5, 1],
      [-0.0, 2],
      [-9e-5, 0],
      [5e-5, 2]
    ],
    "red_o_points": [],
    "y_categories": ["N", "NOT APPLICABLE", "nan"],
    "blue_o_points": [],
    "blue_x_points": [
      [0.0016, 1],
      [3e-5, 2],
      [7e-5, 0],
      [4e-5, 0],
      [0.0001, 2],
      [0.00023, 1],
      [0.0002, 1],
      [-0.00012, 0],
      [6e-5, 2],
      [0.00012, 2],
      [-0.0001, 0],
      [0.00049, 1],
      [-4e-5, 2],
      [0.00049, 1],
      [-6e-5, 2]
    ]
  },
  "QS_mulLysisTrunk[Upper]": {
    "red_x_points": [
      [-0.00037, 3],
      [-0.0054, 0],
      [-0.00353, 0],
      [-0.0032, 0],
      [-0.00403, 0],
      [-0.01533, 2],
      [-0.00384, 0],
      [-0.00079, 3],
      [-0.00362, 0],
      [-0.00314, 0],
      [-0.0007, 3],
      [-0.00408, 0],
      [-0.00071, 3],
      [-0.00486, 0],
      [-0.01235, 2],
      [-0.0008, 3],
      [-0.00059, 3],
      [-0.00049, 3],
      [-0.0033, 0],
      [-0.00065, 3],
      [-0.00051, 3],
      [-0.00042, 3],
      [-0.00392, 0],
      [-0.00397, 0],
      [-0.0008, 3],
      [0.01389, 1],
      [-0.00059, 3],
      [-0.01141, 2],
      [-0.00059, 3]
    ],
    "red_o_points": [],
    "y_categories": ["N", "NOT APPLICABLE", "Y", "nan"],
    "blue_o_points": [],
    "blue_x_points": [
      [0.02402, 1],
      [-3e-5, 3],
      [-0.00064, 0],
      [-0.00145, 0],
      [0.00026, 3],
      [0.01883, 1],
      [0.01292, 1],
      [-0.00217, 0],
      [6e-5, 3],
      [3e-5, 3],
      [-0.00067, 0],
      [0.01486, 1],
      [-0.00048, 3],
      [0.01522, 1],
      [-0.00067, 3]
    ]
  },
  "QS_mulBpsurgeryType[Transf]": {
    "red_x_points": [
      [-0.00014, 3],
      [-0.00047, 2],
      [-0.00284, 0],
      [-0.00053, 2],
      [-0.00065, 2],
      [-0.00039, 2],
      [-0.00058, 2],
      [-0.00032, 3],
      [-0.00054, 2],
      [-0.00037, 2],
      [-0.00013, 3],
      [-0.0003, 2],
      [-0.00027, 3],
      [-0.00056, 2],
      [-0.0004, 2],
      [-0.00015, 3],
      [-0.00014, 3],
      [-0.00016, 3],
      [-0.00039, 2],
      [-0.00011, 3],
      [-0.0003, 3],
      [-0.00031, 3],
      [-0.00047, 2],
      [-0.00035, 2],
      [-0.00025, 3],
      [0.0019, 1],
      [-0.00026, 3],
      [-0.00039, 2],
      [-0.00029, 3]
    ],
    "red_o_points": [],
    "y_categories": ["N", "NOT APPLICABLE", "Y", "nan"],
    "blue_o_points": [],
    "blue_x_points": [
      [0.0036, 1],
      [-0.00019, 3],
      [-0.00012, 2],
      [-0.00042, 2],
      [-9e-5, 3],
      [0.00196, 1],
      [0.00172, 1],
      [-0.00016, 2],
      [-0.0001, 3],
      [-9e-5, 3],
      [-0.00019, 2],
      [0.00205, 1],
      [-6e-5, 3],
      [0.00233, 1],
      [-8e-5, 3]
    ]
  },
  "participant_code": {
    "red_x_points": [
      [-0.03304, 1],
      [-0.03222, 2],
      [-0.03346, 3],
      [-0.03256, 4],
      [-0.03222, 5],
      [-0.03229, 8],
      [-0.03332, 9],
      [-0.03167, 10],
      [-0.03263, 11],
      [-0.03394, 13],
      [-0.03346, 14],
      [-0.03284, 18],
      [-0.034, 19],
      [-0.03298, 20],
      [-0.03284, 23],
      [-0.03256, 26],
      [-0.03291, 28],
      [-0.03373, 29],
      [-0.03332, 30],
      [-0.0327, 31],
      [-0.03366, 32],
      [-0.03188, 34],
      [-0.03215, 36],
      [-0.03298, 38],
      [-0.03366, 39],
      [-0.03236, 40],
      [-0.03318, 41],
      [-0.0338, 42],
      [-0.03161, 43]
    ],
    "red_o_points": [],
    "y_categories": [
      "P16554",
      "P18297",
      "P19283",
      "P19287",
      "P23172",
      "P23391",
      "P30595",
      "P31645",
      "P31691",
      "P34778",
      "P35046",
      "P36328",
      "P43633",
      "P4544",
      "P46417",
      "P48965",
      "P53068",
      "P5497",
      "P58556",
      "P59529",
      "P62483",
      "P64658",
      "P65202",
      "P66816",
      "P6751",
      "P7408",
      "P75566",
      "P76226",
      "P79971",
      "P82621",
      "P82990",
      "P84549",
      "P84932",
      "P85825",
      "P86989",
      "P8770",
      "P87791",
      "P90550",
      "P93159",
      "P94969",
      "P96710",
      "P97130",
      "P9744",
      "P98500",
      "nan"
    ],
    "blue_o_points": [],
    "blue_x_points": [
      [0.0636, 0],
      [0.06294, 6],
      [0.06386, 7],
      [0.0615, 12],
      [0.06307, 15],
      [0.06452, 16],
      [0.06478, 17],
      [0.06255, 21],
      [0.06465, 22],
      [0.06268, 24],
      [0.06439, 25],
      [0.06228, 27],
      [0.06334, 33],
      [0.06544, 35],
      [0.06439, 37]
    ]
  },
  "QS_mulGraftNerve[Ac]": {
    "red_x_points": [
      [-1e-5, 2],
      [-0.0001, 0],
      [-8e-5, 0],
      [-4e-5, 0],
      [-0.0001, 0],
      [-4e-5, 0],
      [-7e-5, 0],
      [5e-5, 2],
      [-0.0001, 0],
      [-6e-5, 0],
      [1e-5, 2],
      [-0.0001, 0],
      [-0.0, 2],
      [-6e-5, 0],
      [-2e-5, 0],
      [-0.0, 2],
      [1e-5, 2],
      [-0.0, 2],
      [-2e-5, 0],
      [-1e-5, 2],
      [5e-5, 2],
      [-1e-5, 2],
      [-0.0001, 0],
      [-8e-5, 0],
      [-0.0, 2],
      [-4e-5, 0],
      [3e-5, 2]
    ],
    "red_o_points": [],
    "y_categories": ["N", "NOT APPLICABLE", "nan"],
    "blue_o_points": [],
    "blue_x_points": [
      [0.0005, 1],
      [5e-5, 2],
      [-2e-5, 0],
      [-4e-5, 0],
      [-0.0, 2],
      [0.00013, 1],
      [0.00013, 1],
      [-2e-5, 0],
      [5e-5, 2],
      [-4e-5, 0],
      [-0.0, 2],
      [0.00013, 1],
      [1e-5, 2]
    ]
  },
  "QS_mulNeuromadSite[C8]": {
    "red_x_points": [
      [-0.00011, 2],
      [-0.00078, 0],
      [-0.00053, 0],
      [-0.00038, 0],
      [-0.00056, 0],
      [-0.00038, 0],
      [-0.00058, 0],
      [-5e-5, 2],
      [-0.00073, 0],
      [-0.00052, 0],
      [-0.00012, 2],
      [-0.00062, 0],
      [-0.00034, 2],
      [-0.00098, 0],
      [-0.00056, 0],
      [-0.00011, 2],
      [-8e-5, 2],
      [-0.00012, 2],
      [-0.00041, 0],
      [-0.00015, 2],
      [-0.00023, 2],
      [-0.0001, 2],
      [-0.00062, 0],
      [-0.00074, 0],
      [-8e-5, 2],
      [0.00105, 1],
      [-9e-5, 2],
      [-0.00036, 0],
      [-0.00033, 2]
    ],
    "red_o_points": [],
    "y_categories": ["N", "NOT APPLICABLE", "nan"],
    "blue_o_points": [],
    "blue_x_points": [
      [0.00459, 1],
      [-3e-5, 2],
      [-7e-5, 0],
      [-0.0001, 0],
      [-5e-5, 2],
      [0.00212, 1],
      [0.00114, 1],
      [-0.00045, 0],
      [0.00026, 2],
      [-2e-5, 2],
      [-0.00015, 0],
      [0.00115, 1],
      [-6e-5, 2],
      [0.00137, 1],
      [-7e-5, 2]
    ]
  },
  "QS_mulGraftNerve[Ph]": {
    "red_x_points": [
      [-0.0, 2],
      [-0.0001, 0],
      [-7e-5, 0],
      [-7e-5, 0],
      [-0.00012, 0],
      [-7e-5, 0],
      [-0.0001, 0],
      [-1e-5, 2],
      [-0.0001, 0],
      [-7e-5, 0],
      [-0.0, 2],
      [-0.00012, 0],
      [-1e-5, 2],
      [-0.00012, 0],
      [-0.0001, 0],
      [-1e-5, 2],
      [-1e-5, 2],
      [0.0, 2],
      [-0.0001, 0],
      [-0.0, 2],
      [-1e-5, 2],
      [-1e-5, 2],
      [-0.00015, 0],
      [-0.00012, 0],
      [-1e-5, 2],
      [0.0001, 1],
      [-1e-5, 2],
      [-5e-5, 0],
      [-1e-5, 2]
    ],
    "red_o_points": [],
    "y_categories": ["N", "NOT APPLICABLE", "nan"],
    "blue_o_points": [],
    "blue_x_points": [
      [0.00053, 1],
      [-1e-5, 2],
      [-2e-5, 0],
      [-0.0001, 0],
      [-0.0, 2],
      [0.0004, 1],
      [0.00023, 1],
      [-5e-5, 0],
      [-1e-5, 2],
      [-1e-5, 2],
      [-5e-5, 0],
      [0.00036, 1],
      [-0.0, 2],
      [0.00023, 1],
      [-1e-5, 2]
    ]
  },
  "QS_mulTransfSite[AcSsPA]": {
    "red_x_points": [
      [-5e-5, 3],
      [-0.00137, 0],
      [-0.00077, 0],
      [-0.00092, 0],
      [-0.00077, 0],
      [-0.00083, 0],
      [-0.00101, 0],
      [-0.00012, 3],
      [-0.00107, 0],
      [-0.00054, 0],
      [-6e-5, 3],
      [-0.00099, 0],
      [-9e-5, 3],
      [-0.00101, 0],
      [-0.00301, 2],
      [-9e-5, 3],
      [-5e-5, 3],
      [-9e-5, 3],
      [-0.00083, 0],
      [-7e-5, 3],
      [-0.00011, 3],
      [-0.0001, 3],
      [-0.00088, 0],
      [-0.00099, 0],
      [-0.00015, 3],
      [0.00235, 1],
      [-0.00011, 3],
      [-0.00096, 0],
      [-9e-5, 3]
    ],
    "red_o_points": [],
    "y_categories": ["N", "NOT APPLICABLE", "Y", "nan"],
    "blue_o_points": [],
    "blue_x_points": [
      [0.00396, 1],
      [-3e-5, 3],
      [-0.00047, 0],
      [-0.00038, 0],
      [9e-5, 3],
      [0.0038, 1],
      [0.00262, 1],
      [-0.00076, 0],
      [-0.0, 3],
      [3e-5, 3],
      [-0.00052, 0],
      [0.00321, 1],
      [-5e-5, 3],
      [0.00343, 1],
      [-0.00017, 3]
    ]
  },
  "QA_lstPexPalle[Elbow]": {
    "red_x_points": [
      [-0.00052, 4],
      [-0.00288, 4],
      [-0.00213, 4],
      [-0.0019, 3],
      [-0.00349, 4],
      [-0.00195, 3],
      [-0.00331, 4],
      [-0.00042, 4],
      [-0.00497, 4],
      [-0.00225, 3],
      [-0.0034, 1],
      [-0.0051, 4],
      [-0.00057, 4],
      [-0.00541, 4],
      [-0.00189, 4],
      [0.00011, 3],
      [-0.00897, 0],
      [-0.00016, 3],
      [-0.00758, 2],
      [-0.00024, 3],
      [-0.00054, 4],
      [-0.00052, 4],
      [-0.00532, 4],
      [-0.00371, 4],
      [-0.00015, 4],
      [-0.02828, 3],
      [-0.00025, 4],
      [-0.00588, 0],
      [-0.00065, 4]
    ],
    "red_o_points": [],
    "y_categories": ["ABS", "HYPO", "NAIA", "PT", "nan"],
    "blue_o_points": [],
    "blue_x_points": [
      [0.00475, 4],
      [9e-5, 4],
      [0.00365, 3],
      [0.03971, 1],
      [0.00068, 4],
      [0.00479, 4],
      [0.00997, 1],
      [-0.00325, 4],
      [0.00054, 4],
      [0.0004, 4],
      [0.02537, 1],
      [0.00503, 4],
      [0.0014, 3],
      [0.00509, 4],
      [0.0041, 3]
    ]
  },
  "QA_lstPexArthre[Index]": {
    "red_x_points": [
      [-0.01225, 0],
      [-0.0049, 2],
      [-0.00333, 2],
      [-0.00597, 0],
      [-0.00905, 0],
      [0.0079, 1],
      [-0.00878, 0],
      [0.0005, 2],
      [0.00982, 1],
      [-0.0133, 0],
      [0.00373, 1],
      [-0.00595, 2],
      [0.00057, 2],
      [0.00863, 1],
      [-0.00246, 2],
      [0.00366, 1],
      [-0.00956, 0],
      [0.00213, 1],
      [-0.00455, 2],
      [-0.01237, 0],
      [0.00053, 2],
      [0.00054, 2],
      [-0.00693, 2],
      [-0.00546, 2],
      [0.00183, 1],
      [-0.0007, 2],
      [0.00056, 2],
      [-0.00576, 0],
      [0.00039, 2]
    ],
    "red_o_points": [],
    "y_categories": ["NPV", "PV", "nan"],
    "blue_o_points": [],
    "blue_x_points": [
      [0.00064, 0],
      [0.00155, 2],
      [0.01265, 1],
      [0.01468, 1],
      [0.00312, 2],
      [-0.00028, 2],
      [0.00149, 1],
      [0.0105, 1],
      [0.00189, 2],
      [0.00125, 2],
      [0.01105, 1],
      [0.00174, 1],
      [0.00376, 1],
      [-0.00024, 2],
      [0.0067, 1]
    ]
  },
  "QA_yonInjTbi": {
    "red_x_points": [
      [0.00948, 0],
      [-0.00168, 2],
      [-0.00226, 0],
      [-0.00247, 0],
      [-0.00251, 2],
      [0.00057, 1],
      [-0.00293, 0],
      [-0.01223, 2],
      [-0.00562, 2],
      [0.00125, 1],
      [-0.00556, 1],
      [-0.00631, 0],
      [0.00732, 0],
      [0.00133, 1],
      [0.00028, 1],
      [-0.00652, 1],
      [-0.00513, 1],
      [-0.00623, 1],
      [0.0011, 1],
      [-0.00581, 1],
      [0.00811, 0],
      [-0.0073, 1],
      [0.00189, 1],
      [0.00147, 1],
      [-0.00568, 1],
      [-0.00026, 2],
      [-0.01117, 2],
      [0.0003, 1],
      [-0.00673, 1]
    ],
    "red_o_points": [],
    "y_categories": ["N", "Y", "nan"],
    "blue_o_points": [],
    "blue_x_points": [
      [0.00058, 0],
      [-0.00322, 1],
      [0.003, 1],
      [0.00337, 1],
      [0.01267, 0],
      [0.0002, 1],
      [0.00434, 1],
      [0.01511, 0],
      [0.01215, 0],
      [0.00217, 1],
      [-2e-5, 2],
      [-0.00447, 1],
      [0.01741, 0]
    ]
  },
  "QA_mulInjOrthesisType[ArmSling]": {
    "red_x_points": [
      [-0.00823, 2],
      [-0.00833, 2],
      [-0.0082, 2],
      [-0.00783, 2],
      [-0.00822, 2],
      [-0.00839, 2],
      [-0.00841, 2],
      [-0.008, 2],
      [-0.00811, 2],
      [-0.0083, 2],
      [-0.00826, 2],
      [-0.00812, 2],
      [-0.00825, 2],
      [-0.00822, 2],
      [-0.02675, 0],
      [-0.00824, 2],
      [-0.0085, 2],
      [-0.02575, 0],
      [-0.02629, 3],
      [-0.00799, 2],
      [-0.00811, 2],
      [-0.00789, 2],
      [-0.00818, 2],
      [-0.00809, 2],
      [-0.02597, 3],
      [-0.02576, 3],
      [-0.02595, 3],
      [-0.00816, 2],
      [-0.00808, 2]
    ],
    "red_o_points": [],
    "y_categories": ["N", "NOT APPLICABLE", "Y", "nan"],
    "blue_o_points": [],
    "blue_x_points": [
      [-0.00789, 2],
      [-0.00762, 2],
      [-0.00792, 2],
      [-0.00806, 2],
      [0.05087, 1],
      [0.05187, 1],
      [0.04796, 1],
      [0.04936, 1],
      [-0.00762, 2],
      [0.04957, 1],
      [-0.00783, 2],
      [0.05058, 1],
      [0.05081, 1],
      [0.0486, 1],
      [-0.00812, 2]
    ]
  },
  "QS_lstBpsurgSide": {
    "red_x_points": [
      [-0.00063, 3],
      [-0.01236, 0],
      [-0.01247, 0],
      [-0.01051, 0],
      [-0.01357, 0],
      [-0.01251, 0],
      [-0.01254, 0],
      [-0.00113, 3],
      [-0.01266, 0],
      [0.00118, 2],
      [-0.00067, 3],
      [0.00053, 2],
      [-0.00134, 3],
      [0.00061, 2],
      [-0.00163, 2],
      [-0.00082, 3],
      [-0.00068, 3],
      [-0.00075, 3],
      [-0.00816, 0],
      [-0.00063, 3],
      [-0.00116, 3],
      [-0.00104, 3],
      [0.00034, 2],
      [0.00057, 2],
      [-0.00126, 3],
      [0.01373, 1],
      [-0.00123, 3],
      [-0.01128, 0],
      [-0.00131, 3]
    ],
    "red_o_points": [],
    "y_categories": ["L", "NOT APPLICABLE", "R", "nan"],
    "blue_o_points": [],
    "blue_x_points": [
      [0.03043, 1],
      [-0.00063, 3],
      [0.0042, 2],
      [0.007, 2],
      [-0.00031, 3],
      [0.01758, 1],
      [0.01344, 1],
      [-0.00208, 0],
      [-0.00051, 3],
      [-0.00032, 3],
      [0.00344, 2],
      [0.01653, 1],
      [-0.00033, 3],
      [0.01512, 1],
      [-0.00019, 3]
    ]
  },
  "QA_mulInjOrthesisType[ShoulderSupport]": {
    "red_x_points": [
      [-0.00854, 0],
      [-0.00806, 0],
      [-0.00807, 0],
      [-0.03044, 2],
      [-0.00801, 0],
      [-0.0081, 0],
      [-0.00817, 0],
      [-0.03174, 2],
      [-0.00789, 0],
      [-0.00826, 0],
      [-0.00841, 0],
      [-0.00803, 0],
      [-0.00823, 0],
      [-0.00782, 0],
      [-0.02999, 2],
      [-0.00818, 0],
      [-0.00799, 0],
      [-0.03126, 2],
      [-0.03035, 3],
      [-0.00835, 0],
      [-0.00807, 0],
      [-0.00804, 0],
      [-0.0085, 0],
      [-0.00834, 0],
      [-0.02881, 3],
      [-0.03192, 3],
      [-0.02984, 3],
      [-0.00866, 0],
      [-0.00848, 0]
    ],
    "red_o_points": [],
    "y_categories": ["N", "NOT APPLICABLE", "Y", "nan"],
    "blue_o_points": [],
    "blue_x_points": [
      [-0.00751, 0],
      [-0.00794, 0],
      [-0.00766, 0],
      [-0.00821, 0],
      [0.06056, 1],
      [0.05886, 1],
      [0.05755, 1],
      [0.06047, 1],
      [-0.00769, 0],
      [0.06046, 1],
      [-0.00756, 0],
      [0.05639, 1],
      [0.05747, 1],
      [0.05947, 1],
      [-0.00811, 0]
    ]
  },
  "QA_yonInjUnconscio": {
    "red_x_points": [
      [-0.01501, 1],
      [-0.01439, 1],
      [-0.00182, 2],
      [-0.00211, 2],
      [-0.00199, 2],
      [-0.01613, 1],
      [-0.00184, 2],
      [-0.00287, 2],
      [-0.00227, 2],
      [-0.01633, 1],
      [-0.01478, 1],
      [-0.01703, 1],
      [-0.00396, 2],
      [-0.0023, 2],
      [-0.01059, 1],
      [-0.01519, 1],
      [-0.01478, 1],
      [-0.01105, 1],
      [-0.0118, 1],
      [-0.01468, 1],
      [-0.00359, 2],
      [-0.00272, 2],
      [-0.01705, 1],
      [-0.01612, 1],
      [-0.003, 2],
      [-0.0027, 2],
      [-0.003, 2],
      [-0.01473, 1],
      [-0.004, 2]
    ],
    "red_o_points": [],
    "y_categories": ["N", "Y", "nan"],
    "blue_o_points": [],
    "blue_x_points": [
      [-0.00125, 2],
      [-0.00149, 2],
      [0.05142, 0],
      [-0.00069, 2],
      [-0.00785, 1],
      [-0.00875, 1],
      [0.03653, 0],
      [0.04808, 0],
      [-0.00167, 2],
      [0.04549, 0],
      [0.05343, 0],
      [-0.00204, 2],
      [-0.00954, 1],
      [-0.00233, 2],
      [0.05847, 0]
    ]
  },
  "QA_lstPexInspectio[SurgicalScar]": {
    "red_x_points": [
      [-0.00333, 1],
      [-0.00468, 1],
      [-0.00754, 0],
      [-0.0043, 1],
      [-0.00732, 1],
      [-0.01062, 0],
      [-0.00694, 1],
      [-0.00319, 1],
      [-0.0092, 1],
      [-0.01057, 1],
      [-0.00829, 0],
      [-0.00922, 1],
      [-0.00158, 2],
      [-0.01009, 1],
      [-0.00466, 0],
      [0.00627, 2],
      [0.00387, 2],
      [-0.00635, 1],
      [-0.0044, 1],
      [-0.00419, 1],
      [-0.0022, 2],
      [-0.00336, 1],
      [-0.00874, 1],
      [0.01317, 2],
      [-0.00322, 1],
      [-0.00305, 1],
      [-0.0017, 1],
      [0.00579, 2],
      [-0.0031, 1]
    ],
    "red_o_points": [],
    "y_categories": ["ABS", "NAIA", "PT", "nan"],
    "blue_o_points": [],
    "blue_x_points": [
      [-0.00095, 1],
      [0.0116, 2],
      [0.02536, 2],
      [0.03014, 2],
      [0.00284, 1],
      [0.00034, 1],
      [0.00063, 0],
      [-0.00407, 1],
      [0.00021, 1],
      [0.00282, 1],
      [0.02312, 2],
      [-0.00036, 1],
      [0.00735, 2],
      [0.00279, 0],
      [0.01092, 2]
    ]
  },
  "QA_intPexWristFlex": {
    "red_x_points": [
      [-0.00019, 2],
      [-0.00072, 2],
      [-0.00038, 2],
      [-0.00052, 2],
      [-0.0007, 2],
      [-0.00101, 0],
      [-0.00082, 2],
      [0.00072, 0],
      [-0.00103, 2],
      [-0.00105, 2],
      [-0.00019, 0],
      [-0.00101, 2],
      [-0.00014, 2],
      [-0.00075, 2],
      [-0.00027, 2],
      [-0.00022, 0],
      [-1e-5, 0],
      [-6e-5, 0],
      [-0.00021, 0],
      [-0.00017, 2],
      [-4e-5, 2],
      [-0.00034, 2],
      [-0.00092, 2],
      [-0.00053, 2],
      [-8e-5, 2],
      [-0.01963, 1],
      [-0.00327, 1],
      [-0.00045, 0],
      [-0.00049, 2]
    ],
    "red_o_points": [],
    "y_categories": ["GREATER THAN OR EQUALS TO 60", "LESS THAN 60", "nan"],
    "blue_o_points": [],
    "blue_x_points": [
      [0.00365, 2],
      [0.00346, 0],
      [0.00049, 0],
      [-0.00063, 2],
      [4e-5, 2],
      [0.00347, 2],
      [0.00481, 0],
      [-0.0006, 2],
      [4e-5, 2],
      [0.00014, 2],
      [0.01127, 1],
      [0.00372, 2],
      [0.00012, 2],
      [0.00355, 2],
      [0.00092, 0]
    ]
  },
  "QS_mulBpsurgeryType[Lysis]": {
    "red_x_points": [
      [-0.00088, 3],
      [-0.00588, 0],
      [-0.01728, 2],
      [-0.01536, 2],
      [-0.00363, 0],
      [-0.01924, 2],
      [-0.00349, 0],
      [-0.00142, 3],
      [-0.00358, 0],
      [-0.00259, 0],
      [-0.00109, 3],
      [-0.00329, 0],
      [-0.00152, 3],
      [-0.00568, 0],
      [-0.01614, 2],
      [-0.00128, 3],
      [-0.00104, 3],
      [-0.00085, 3],
      [-0.00313, 0],
      [-0.00092, 3],
      [-0.00146, 3],
      [-0.00143, 3],
      [-0.00337, 0],
      [-0.00327, 0],
      [-0.00132, 3],
      [0.02064, 1],
      [-0.00116, 3],
      [-0.01609, 2],
      [-0.00138, 3]
    ],
    "red_o_points": [],
    "y_categories": ["N", "NOT APPLICABLE", "Y", "nan"],
    "blue_o_points": [],
    "blue_x_points": [
      [0.03233, 1],
      [-0.00074, 3],
      [-0.00052, 0],
      [-0.00133, 0],
      [-8e-5, 3],
      [0.02716, 1],
      [0.01999, 1],
      [-0.0015, 0],
      [-0.0005, 3],
      [-0.00043, 3],
      [-0.00059, 0],
      [0.02279, 1],
      [-0.00044, 3],
      [0.02148, 1],
      [-0.00048, 3]
    ]
  },
  "QS_mulLysisSite[Trunk]": {
    "red_x_points": [
      [-0.00043, 3],
      [-0.00435, 0],
      [-0.00319, 0],
      [-0.00251, 0],
      [-0.00311, 0],
      [-0.01313, 2],
      [-0.00355, 0],
      [-0.0007, 3],
      [-0.00347, 0],
      [-0.0026, 0],
      [-0.00068, 3],
      [-0.00359, 0],
      [-0.00087, 3],
      [-0.00447, 0],
      [-0.01022, 2],
      [-0.00069, 3],
      [-0.00073, 3],
      [-0.00059, 3],
      [-0.00286, 0],
      [-0.00044, 3],
      [-0.00072, 3],
      [-0.00074, 3],
      [-0.00335, 0],
      [-0.00336, 0],
      [-0.00085, 3],
      [0.01146, 1],
      [-0.0007, 3],
      [-0.01021, 2],
      [-0.00071, 3]
    ],
    "red_o_points": [],
    "y_categories": ["N", "NOT APPLICABLE", "Y", "nan"],
    "blue_o_points": [],
    "blue_x_points": [
      [0.02143, 1],
      [-0.00023, 3],
      [-0.00047, 0],
      [-0.00119, 0],
      [-7e-5, 3],
      [0.01697, 1],
      [0.0122, 1],
      [-0.00174, 0],
      [-0.00014, 3],
      [-0.0002, 3],
      [-0.00088, 0],
      [0.0137, 1],
      [-0.00024, 3],
      [0.01238, 1],
      [-0.00017, 3]
    ]
  },
  "QS_mulGraftTrunk[UpperTrunk]": {
    "red_x_points": [
      [-0.00023, 3],
      [-0.00254, 0],
      [-0.00132, 0],
      [-0.00129, 0],
      [-0.0015, 0],
      [-0.00083, 0],
      [-0.00162, 0],
      [-0.00032, 3],
      [-0.00166, 0],
      [-0.00108, 0],
      [-0.00021, 3],
      [-0.0014, 0],
      [-0.00044, 3],
      [-0.00859, 2],
      [-0.00209, 0],
      [-0.00031, 3],
      [-0.00012, 3],
      [-0.00023, 3],
      [-0.00119, 0],
      [-0.00019, 3],
      [-0.00028, 3],
      [-0.0002, 3],
      [-0.00149, 0],
      [-0.00141, 0],
      [-0.00035, 3],
      [0.00385, 1],
      [-0.00033, 3],
      [-0.00106, 0],
      [-0.00033, 3]
    ],
    "red_o_points": [],
    "y_categories": ["N", "NOT APPLICABLE", "Y", "nan"],
    "blue_o_points": [],
    "blue_x_points": [
      [0.00951, 1],
      [-0.00012, 3],
      [-0.00053, 0],
      [0.00032, 0],
      [0.00014, 3],
      [0.00663, 1],
      [0.00399, 1],
      [-0.00068, 0],
      [-8e-5, 3],
      [0.00012, 3],
      [-0.00045, 0],
      [0.00516, 1],
      [-0.00012, 3],
      [0.0051, 1],
      [-0.00022, 3]
    ]
  },
  "QS_mulTransfSite[PhMc]": {
    "red_x_points": [
      [-0.00025, 3],
      [-0.00289, 0],
      [-0.00221, 0],
      [-0.00213, 0],
      [-0.00234, 0],
      [-0.00193, 0],
      [-0.00737, 2],
      [-0.00077, 3],
      [-0.00241, 0],
      [-0.00198, 0],
      [-0.00021, 3],
      [-0.00223, 0],
      [-0.00065, 3],
      [-0.00297, 0],
      [-0.00295, 0],
      [-0.00017, 3],
      [-0.00013, 3],
      [-0.0002, 3],
      [-0.00612, 2],
      [-0.00019, 3],
      [-0.00069, 3],
      [-0.00061, 3],
      [-0.002, 0],
      [-0.00234, 0],
      [-0.00062, 3],
      [0.00717, 1],
      [-0.00046, 3],
      [-0.00181, 0],
      [-0.00067, 3]
    ],
    "red_o_points": [],
    "y_categories": ["N", "NOT APPLICABLE", "Y", "nan"],
    "blue_o_points": [],
    "blue_x_points": [
      [0.0123, 1],
      [-6e-5, 3],
      [-0.00095, 0],
      [-0.00125, 0],
      [6e-5, 3],
      [0.01051, 1],
      [0.00608, 1],
      [-0.00141, 0],
      [-0.00032, 3],
      [-8e-5, 3],
      [-0.00105, 0],
      [0.00953, 1],
      [-5e-5, 3],
      [0.00911, 1],
      [-0.0003, 3]
    ]
  },
  "QS_mulLysisRoot[C6]": {
    "red_x_points": [
      [-0.00036, 3],
      [-0.00393, 0],
      [-0.01021, 2],
      [-0.00262, 0],
      [-0.00284, 0],
      [-0.00245, 0],
      [-0.0028, 0],
      [-0.00064, 3],
      [-0.00341, 0],
      [-0.00236, 0],
      [-0.00041, 3],
      [-0.00298, 0],
      [-0.00078, 3],
      [-0.00401, 0],
      [-0.00374, 0],
      [-0.00061, 3],
      [-0.00046, 3],
      [-0.00034, 3],
      [-0.00213, 0],
      [-0.00052, 3],
      [-0.00051, 3],
      [-0.00064, 3],
      [-0.00294, 0],
      [-0.00254, 0],
      [-0.00063, 3],
      [0.00909, 1],
      [-0.00069, 3],
      [-0.00808, 2],
      [-0.00074, 3]
    ],
    "red_o_points": [],
    "y_categories": ["N", "NOT APPLICABLE", "Y", "nan"],
    "blue_o_points": [],
    "blue_x_points": [
      [0.01782, 1],
      [-0.00028, 3],
      [-0.00114, 0],
      [-0.0017, 0],
      [0.00014, 3],
      [0.01277, 1],
      [0.00843, 1],
      [-0.00191, 0],
      [-0.00029, 3],
      [-0.00018, 3],
      [-0.00103, 0],
      [0.01227, 1],
      [-0.00025, 3],
      [0.0111, 1],
      [-0.00047, 3]
    ]
  },
  "QA_lstPexInspectio[ShoulderSubdisloc]": {
    "red_x_points": [
      [-0.00217, 1],
      [-0.00496, 1],
      [0.0023, 0],
      [-0.00372, 1],
      [-0.00619, 1],
      [-0.0036, 2],
      [-0.00563, 1],
      [-0.00309, 1],
      [-0.00791, 1],
      [-0.00959, 1],
      [-0.00114, 2],
      [-0.0081, 1],
      [-0.00346, 1],
      [-0.00916, 1],
      [-0.00283, 1],
      [-0.00395, 2],
      [-0.00079, 2],
      [0.00063, 1],
      [-0.00415, 1],
      [-0.00134, 1],
      [-0.01549, 0],
      [0.00438, 2],
      [-0.00257, 2],
      [-0.0006, 2],
      [-0.00214, 1],
      [-0.014, 2],
      [-0.0023, 1],
      [-0.00121, 2],
      [-0.00282, 1]
    ],
    "red_o_points": [],
    "y_categories": ["ABS", "NAIA", "PT", "nan"],
    "blue_o_points": [],
    "blue_x_points": [
      [0.00436, 1],
      [0.00938, 2],
      [0.03362, 0],
      [0.00709, 2],
      [0.00205, 1],
      [0.00586, 1],
      [0.00465, 0],
      [-0.00316, 1],
      [0.0137, 2],
      [0.00138, 1],
      [0.02843, 0],
      [0.00402, 1],
      [0.00299, 1],
      [-0.00146, 2],
      [0.00273, 1]
    ]
  },
  "QS_mulGraftLevel[Trunk]": {
    "red_x_points": [
      [-9e-5, 3],
      [-0.00188, 0],
      [-0.00159, 0],
      [-0.00104, 0],
      [-0.00133, 0],
      [-0.00092, 0],
      [-0.00148, 0],
      [-0.00028, 3],
      [-0.00126, 0],
      [-0.00071, 0],
      [-0.0003, 3],
      [-0.00122, 0],
      [-0.00024, 3],
      [-0.00709, 2],
      [-0.00149, 0],
      [-0.0003, 3],
      [-0.00013, 3],
      [-9e-5, 3],
      [-0.00092, 0],
      [-0.0001, 3],
      [-0.00014, 3],
      [-0.00015, 3],
      [-0.0013, 0],
      [-0.00137, 0],
      [-0.00025, 3],
      [0.00301, 1],
      [-0.00025, 3],
      [-0.00104, 0],
      [-0.00016, 3]
    ],
    "red_o_points": [],
    "y_categories": ["N", "NOT APPLICABLE", "Y", "nan"],
    "blue_o_points": [],
    "blue_x_points": [
      [0.00826, 1],
      [-0.00011, 3],
      [7e-5, 0],
      [0.00046, 0],
      [0.0001, 3],
      [0.00469, 1],
      [0.0034, 1],
      [-0.00055, 0],
      [9e-5, 3],
      [-2e-5, 3],
      [-0.00021, 0],
      [0.0044, 1],
      [-4e-5, 3],
      [0.00381, 1],
      [-0.00022, 3]
    ]
  },
  "QA_lstPexPain[C7]": {
    "red_x_points": [
      [-0.00154, 1],
      [-0.00411, 2],
      [-0.00336, 2],
      [-0.00087, 1],
      [-0.00485, 2],
      [-0.00312, 1],
      [-0.0026, 1],
      [-0.00709, 0],
      [-0.00435, 1],
      [0.00572, 0],
      [-0.00176, 1],
      [-0.0071, 2],
      [0.00269, 2],
      [-0.00629, 2],
      [-0.00171, 2],
      [-0.00729, 0],
      [-0.0002, 1],
      [-0.00629, 0],
      [-0.00336, 2],
      [-0.00598, 0],
      [0.00195, 2],
      [0.00171, 2],
      [-0.00797, 2],
      [-0.00567, 2],
      [-0.00513, 0],
      [-0.00292, 1],
      [-0.0007, 1],
      [-0.00216, 1],
      [-0.00114, 1]
    ],
    "red_o_points": [],
    "y_categories": ["NORM", "NPV", "nan"],
    "blue_o_points": [],
    "blue_x_points": [
      [0.00022, 1],
      [0.00542, 1],
      [0.01507, 0],
      [0.02281, 0],
      [0.00554, 2],
      [0.00013, 2],
      [0.00183, 1],
      [0.00654, 2],
      [0.00538, 2],
      [0.01299, 0],
      [-0.00211, 0],
      [0.00288, 0],
      [0.00878, 1]
    ]
  },
  "QS_mulTransfSite[AcSsAA]": {
    "red_x_points": [
      [-0.00018, 3],
      [-0.00172, 2],
      [-0.00555, 0],
      [-0.00525, 0],
      [-0.00063, 2],
      [-0.00668, 0],
      [-0.00611, 0],
      [-0.00084, 3],
      [-0.00654, 0],
      [-0.0071, 0],
      [-0.00041, 3],
      [-0.00596, 0],
      [-0.00076, 3],
      [-0.00057, 2],
      [-0.00368, 0],
      [-0.0008, 3],
      [-0.00015, 3],
      [-0.00026, 3],
      [-0.0012, 2],
      [-0.00064, 3],
      [-0.00071, 3],
      [-0.00048, 3],
      [-0.00621, 0],
      [-0.0007, 2],
      [-0.00051, 3],
      [0.00699, 1],
      [-0.0005, 3],
      [-0.00397, 0],
      [-0.00056, 3]
    ],
    "red_o_points": [],
    "y_categories": ["N", "NOT APPLICABLE", "Y", "nan"],
    "blue_o_points": [],
    "blue_x_points": [
      [0.0166, 1],
      [-4e-5, 3],
      [0.00795, 2],
      [0.00978, 2],
      [0.00013, 3],
      [0.00882, 1],
      [0.00608, 1],
      [-0.00294, 0],
      [-0.0004, 3],
      [6e-5, 3],
      [-0.0023, 0],
      [0.00859, 1],
      [-0.00023, 3],
      [0.0096, 1],
      [-1e-5, 3]
    ]
  },
  "QS_mulGraftNerve[Ra]": {
    "red_x_points": [
      [-3e-5, 2],
      [-2e-5, 0],
      [-2e-5, 0],
      [-2e-5, 0],
      [-2e-5, 0],
      [-3e-5, 2],
      [-2e-5, 0],
      [-3e-5, 2],
      [-2e-5, 0],
      [-3e-5, 2],
      [-2e-5, 0],
      [-2e-5, 0],
      [-3e-5, 2],
      [-3e-5, 2],
      [-3e-5, 2],
      [-2e-5, 0],
      [-3e-5, 2],
      [-3e-5, 2],
      [-2e-5, 0],
      [-3e-5, 2],
      [0.0001, 1],
      [-2e-5, 0],
      [-3e-5, 2]
    ],
    "red_o_points": [],
    "y_categories": ["N", "NOT APPLICABLE", "nan"],
    "blue_o_points": [],
    "blue_x_points": [
      [0.0001, 1],
      [-3e-5, 2],
      [-2e-5, 0],
      [-2e-5, 0],
      [0.0001, 1],
      [0.0001, 1],
      [-2e-5, 0],
      [-3e-5, 2],
      [-2e-5, 0],
      [0.0001, 1],
      [0.0001, 1],
      [-3e-5, 2]
    ]
  },
  "QS_mulGraftNerve[Ax]": {
    "red_x_points": [[-9e-5, 0], [1e-5, 2], [1e-5, 1], [1e-5, 2]],
    "red_o_points": [],
    "y_categories": ["N", "NOT APPLICABLE", "nan"],
    "blue_o_points": [],
    "blue_x_points": [[1e-5, 2], [1e-5, 1], [1e-5, 2]]
  },
  "QS_mulNeuromadSite[C5]": {
    "red_x_points": [
      [4e-5, 2],
      [-0.00031, 0],
      [-0.00014, 0],
      [-0.0002, 0],
      [-0.00016, 0],
      [-0.00023, 0],
      [-0.00021, 0],
      [-1e-5, 2],
      [-0.00021, 0],
      [-0.00018, 0],
      [3e-5, 2],
      [-0.00019, 0],
      [2e-5, 2],
      [-0.00018, 0],
      [-0.00021, 0],
      [4e-5, 2],
      [2e-5, 2],
      [1e-5, 2],
      [-0.00015, 0],
      [5e-5, 2],
      [2e-5, 2],
      [-0.0, 2],
      [-0.00021, 0],
      [-0.00023, 0],
      [-0.0, 2],
      [0.00053, 1],
      [-1e-5, 2],
      [-0.0002, 0],
      [1e-5, 2]
    ],
    "red_o_points": [],
    "y_categories": ["N", "NOT APPLICABLE", "nan"],
    "blue_o_points": [],
    "blue_x_points": [
      [0.00084, 1],
      [1e-5, 2],
      [-0.00012, 0],
      [-0.00016, 0],
      [6e-5, 2],
      [0.00057, 1],
      [0.00028, 1],
      [-0.0001, 0],
      [1e-5, 2],
      [3e-5, 2],
      [-5e-5, 0],
      [0.00037, 1],
      [3e-5, 2],
      [0.00045, 1],
      [2e-5, 2]
    ]
  },
  "QS_mulNeuromadSite[C7]": {
    "red_x_points": [
      [-2e-5, 2],
      [-0.00016, 0],
      [-0.00017, 0],
      [-0.0002, 0],
      [-0.00018, 0],
      [-0.00012, 0],
      [-0.00021, 0],
      [-3e-5, 2],
      [-0.00017, 0],
      [-0.00021, 0],
      [0.0, 2],
      [-0.00016, 0],
      [-6e-5, 2],
      [-0.00028, 0],
      [-0.0002, 0],
      [1e-5, 2],
      [-2e-5, 2],
      [1e-5, 2],
      [-0.00019, 0],
      [-2e-5, 2],
      [-8e-5, 2],
      [-6e-5, 2],
      [-0.00015, 0],
      [-0.00017, 0],
      [-5e-5, 2],
      [0.00046, 1],
      [-5e-5, 2],
      [-0.00018, 0],
      [-8e-5, 2]
    ],
    "red_o_points": [],
    "y_categories": ["N", "NOT APPLICABLE", "nan"],
    "blue_o_points": [],
    "blue_x_points": [
      [0.00135, 1],
      [-5e-5, 2],
      [-0.0001, 0],
      [-0.00018, 0],
      [1e-5, 2],
      [0.00083, 1],
      [0.00028, 1],
      [-0.00012, 0],
      [-3e-5, 2],
      [-3e-5, 2],
      [-7e-5, 0],
      [0.00046, 1],
      [1e-5, 2],
      [0.00041, 1],
      [-1e-5, 2]
    ]
  },
  "QA_lstPexMuscstrength[WristExte]": {
    "red_x_points": [
      [-0.00701, 1],
      [-0.00502, 2],
      [-0.00516, 1],
      [-0.00418, 1],
      [-0.00758, 1],
      [-0.00697, 1],
      [-0.00666, 1],
      [-1e-5, 0],
      [0.00808, 0],
      [-0.01048, 1],
      [-0.00033, 0],
      [0.00643, 0],
      [-0.00385, 2],
      [-0.00868, 2],
      [-0.00291, 2],
      [-0.00311, 0],
      [-0.00165, 1],
      [-0.0018, 0],
      [-0.00602, 1],
      [-0.00642, 1],
      [-0.00379, 2],
      [-0.00648, 1],
      [0.00779, 0],
      [0.00589, 0],
      [-0.0029, 2],
      [-0.00076, 2],
      [-0.00407, 1],
      [-0.00305, 1],
      [-0.00367, 2]
    ],
    "red_o_points": [],
    "y_categories": ["GREATER THAN OR EQUALS TO 3", "LESS THAN 3", "nan"],
    "blue_o_points": [],
    "blue_x_points": [
      [0.00256, 0],
      [0.00509, 1],
      [0.00949, 0],
      [0.01345, 0],
      [0.00186, 2],
      [-8e-5, 2],
      [0.00049, 0],
      [0.00985, 0],
      [0.01783, 0],
      [0.0013, 2],
      [0.00776, 0],
      [-5e-5, 1],
      [0.00807, 0],
      [0.0011, 0],
      [0.00564, 1]
    ]
  },
  "QS_mulGraftNerve[TD]": {
    "red_x_points": [
      [-1e-5, 2],
      [-3e-5, 0],
      [-3e-5, 0],
      [-3e-5, 0],
      [-3e-5, 0],
      [-3e-5, 0],
      [-1e-5, 2],
      [-3e-5, 0],
      [-3e-5, 0],
      [-1e-5, 2],
      [-3e-5, 0],
      [-1e-5, 2],
      [-3e-5, 0],
      [-1e-5, 2],
      [-1e-5, 2],
      [-1e-5, 2],
      [-1e-5, 2],
      [-3e-5, 0],
      [-3e-5, 0],
      [-1e-5, 2],
      [-1e-5, 2],
      [-3e-5, 0],
      [-1e-5, 2]
    ],
    "red_o_points": [],
    "y_categories": ["N", "NOT APPLICABLE", "nan"],
    "blue_o_points": [],
    "blue_x_points": [
      [0.00013, 1],
      [-1e-5, 2],
      [-3e-5, 0],
      [-3e-5, 0],
      [-1e-5, 2],
      [0.00013, 1],
      [-1e-5, 2],
      [-1e-5, 2],
      [-3e-5, 0],
      [0.00013, 1],
      [0.00013, 1],
      [-1e-5, 2]
    ]
  },
  "QA_intPexForearmSupin": {
    "red_x_points": [
      [-0.0012, 2],
      [-0.00422, 0],
      [-0.00089, 2],
      [-0.00056, 2],
      [-0.00123, 2],
      [0.00446, 1],
      [-0.00123, 2],
      [0.00295, 1],
      [-0.00142, 2],
      [-0.00176, 2],
      [-0.00917, 0],
      [-0.0087, 0],
      [-0.00094, 2],
      [-0.00178, 2],
      [-0.00046, 2],
      [0.0055, 1],
      [-0.00839, 0],
      [0.00163, 1],
      [0.00206, 1],
      [-0.00094, 2],
      [-0.00096, 2],
      [-0.0009, 2],
      [-0.00168, 2],
      [-0.00139, 2],
      [-2e-5, 2],
      [-0.02613, 1],
      [-0.00018, 2],
      [-0.00443, 0],
      [-0.00115, 2]
    ],
    "red_o_points": [],
    "y_categories": ["GREATER THAN OR EQUALS TO 80", "LESS THAN 80", "nan"],
    "blue_o_points": [],
    "blue_x_points": [
      [0.00477, 2],
      [0.00847, 1],
      [0.0113, 1],
      [-0.0011, 2],
      [0.00013, 2],
      [0.00437, 2],
      [0.00648, 0],
      [-0.00025, 2],
      [-0.00019, 2],
      [0.0001, 2],
      [0.01057, 1],
      [0.00492, 2],
      [0.00021, 2],
      [0.00531, 2],
      [0.00804, 1]
    ]
  },
  "QS_mulGraftNerve[SS]": {
    "red_x_points": [
      [0.0, 2],
      [-3e-5, 0],
      [-3e-5, 0],
      [-3e-5, 0],
      [-3e-5, 0],
      [-1e-5, 2],
      [-3e-5, 0],
      [-3e-5, 0],
      [-3e-5, 0],
      [-3e-5, 0],
      [-3e-5, 0],
      [0.0, 2],
      [0.0, 2],
      [0.0, 2],
      [-3e-5, 0],
      [0.0, 2],
      [-1e-5, 2],
      [-1e-5, 2],
      [-3e-5, 0],
      [-3e-5, 0],
      [-1e-5, 2],
      [7e-5, 1],
      [-1e-5, 2]
    ],
    "red_o_points": [],
    "y_categories": ["N", "NOT APPLICABLE", "nan"],
    "blue_o_points": [],
    "blue_x_points": [
      [7e-5, 1],
      [-1e-5, 2],
      [-3e-5, 0],
      [0.0, 2],
      [0.00017, 1],
      [-1e-5, 2],
      [7e-5, 1]
    ]
  },
  "QA_yonInjChesttube": {
    "red_x_points": [
      [-0.00308, 2],
      [-0.00209, 2],
      [0.00221, 0],
      [-0.00184, 2],
      [-0.00306, 2],
      [0.00146, 0],
      [-0.00457, 1],
      [-0.00221, 2],
      [-0.00364, 2],
      [-0.00302, 2],
      [0.00116, 0],
      [0.00278, 0],
      [-0.00412, 2],
      [-0.00317, 2],
      [0.00034, 0],
      [0.00116, 0],
      [0.00091, 0],
      [0.00141, 0],
      [-0.00357, 1],
      [-0.00187, 2],
      [-0.01958, 1],
      [-0.00378, 2],
      [-0.00355, 2],
      [0.00203, 0],
      [-0.00316, 2],
      [-5e-5, 2],
      [-0.00315, 2],
      [0.00038, 0],
      [-0.00373, 2]
    ],
    "red_o_points": [],
    "y_categories": ["N", "Y", "nan"],
    "blue_o_points": [],
    "blue_x_points": [
      [-0.0, 1],
      [-0.00128, 2],
      [0.00345, 0],
      [0.00513, 0],
      [-0.00189, 2],
      [-2e-5, 2],
      [0.00753, 0],
      [0.02034, 0],
      [0.01725, 0],
      [0.00322, 0],
      [-1e-5, 2],
      [0.00568, 0],
      [-4e-5, 2],
      [6e-5, 2]
    ]
  },
  "QS_mulTransfSite[IMc]": {
    "red_x_points": [
      [-0.00075, 3],
      [-0.01784, 2],
      [-0.00312, 0],
      [-0.01442, 2],
      [-0.00309, 0],
      [-0.0028, 0],
      [-0.00307, 0],
      [-0.00119, 3],
      [-0.00302, 0],
      [-0.00251, 0],
      [-0.00089, 3],
      [-0.00298, 0],
      [-0.00134, 3],
      [-0.00532, 0],
      [-0.01511, 2],
      [-0.00096, 3],
      [-0.00089, 3],
      [-0.00086, 3],
      [-0.00263, 0],
      [-0.00085, 3],
      [-0.00136, 3],
      [-0.00113, 3],
      [-0.00325, 0],
      [-0.01664, 2],
      [-0.00132, 3],
      [0.01745, 1],
      [-0.00128, 3],
      [-0.01528, 2],
      [-0.0012, 3]
    ],
    "red_o_points": [],
    "y_categories": ["N", "NOT APPLICABLE", "Y", "nan"],
    "blue_o_points": [],
    "blue_x_points": [
      [0.02983, 1],
      [-0.00081, 3],
      [-0.00068, 0],
      [-0.00071, 0],
      [5e-5, 3],
      [0.02416, 1],
      [0.01842, 1],
      [-0.00175, 0],
      [-0.00064, 3],
      [-0.00035, 3],
      [-0.00102, 0],
      [0.02165, 1],
      [-0.00065, 3],
      [0.02088, 1],
      [-0.00071, 3]
    ]
  },
  "QS_mulLysisRoot[C7]": {
    "red_x_points": [
      [-0.00024, 3],
      [-0.00082, 0],
      [-0.00396, 2],
      [-0.00081, 0],
      [-0.0009, 0],
      [-0.00072, 0],
      [-0.00095, 0],
      [-0.00023, 3],
      [-0.00088, 0],
      [-0.00071, 0],
      [-0.0002, 3],
      [-0.00066, 0],
      [-0.0003, 3],
      [-0.00079, 0],
      [-0.00069, 0],
      [-0.00025, 3],
      [-0.00019, 3],
      [-0.00023, 3],
      [-0.00072, 0],
      [-0.00021, 3],
      [-0.00029, 3],
      [-0.00024, 3],
      [-0.00086, 0],
      [-0.00085, 0],
      [-0.00024, 3],
      [0.00224, 1],
      [-0.00021, 3],
      [-0.00058, 0],
      [-0.00023, 3]
    ],
    "red_o_points": [],
    "y_categories": ["N", "NOT APPLICABLE", "Y", "nan"],
    "blue_o_points": [],
    "blue_x_points": [
      [0.00483, 1],
      [-0.00017, 3],
      [-0.00027, 0],
      [-0.00064, 0],
      [-0.00012, 3],
      [0.00343, 1],
      [0.00283, 1],
      [-0.00029, 0],
      [-8e-5, 3],
      [-0.00011, 3],
      [-7e-5, 0],
      [0.00363, 1],
      [-0.00017, 3],
      [0.00312, 1],
      [-0.00019, 3]
    ]
  },
  "QS_mulTransfSite[AcMc]": {
    "red_x_points": [
      [-4e-5, 3],
      [-0.00178, 0],
      [-0.00138, 0],
      [-0.00087, 0],
      [-0.00109, 0],
      [-0.00109, 0],
      [-0.00133, 0],
      [-0.0003, 3],
      [-0.0014, 0],
      [-0.01181, 2],
      [-9e-5, 3],
      [-0.00135, 0],
      [-0.00027, 3],
      [-0.00152, 0],
      [-0.00157, 0],
      [-0.0005, 3],
      [1e-5, 3],
      [-0.00014, 3],
      [-0.00123, 0],
      [-0.00037, 3],
      [-0.00019, 3],
      [-0.00034, 3],
      [-0.00115, 0],
      [-0.0015, 0],
      [-0.00013, 3],
      [0.00296, 1],
      [-4e-5, 3],
      [-0.00107, 0],
      [-0.00036, 3]
    ],
    "red_o_points": [],
    "y_categories": ["N", "NOT APPLICABLE", "Y", "nan"],
    "blue_o_points": [],
    "blue_x_points": [
      [0.00784, 1],
      [1e-5, 3],
      [0.00266, 0],
      [0.00232, 0],
      [0.00015, 3],
      [0.00519, 1],
      [0.00318, 1],
      [-0.00051, 0],
      [4e-5, 3],
      [5e-5, 3],
      [0.00138, 0],
      [0.00404, 1],
      [1e-5, 3],
      [0.00394, 1],
      [-0.00034, 3]
    ]
  },
  "QS_mulTransfSite[Other]": {
    "red_x_points": [
      [-0.00098, 3],
      [-0.01058, 0],
      [-0.00814, 0],
      [-0.00732, 0],
      [-0.00871, 0],
      [-0.00853, 0],
      [-0.00828, 0],
      [-0.00103, 3],
      [-0.00875, 0],
      [-0.00872, 0],
      [-0.00113, 3],
      [-0.00888, 0],
      [-0.00115, 3],
      [-0.01033, 0],
      [-0.00925, 0],
      [-0.00116, 3],
      [-0.00109, 3],
      [-0.00068, 3],
      [-0.00762, 0],
      [-0.00092, 3],
      [-0.00113, 3],
      [-0.00108, 3],
      [-0.00931, 0],
      [-0.00857, 0],
      [-0.00122, 3],
      [0.01712, 1],
      [-0.00117, 3],
      [-0.0086, 0],
      [-0.00103, 3]
    ],
    "red_o_points": [],
    "y_categories": ["N", "NOT APPLICABLE", "Y", "nan"],
    "blue_o_points": [],
    "blue_x_points": [
      [0.03, 1],
      [-0.00047, 3],
      [-0.00705, 0],
      [-0.00679, 0],
      [-0.00025, 3],
      [0.02242, 1],
      [0.01787, 1],
      [-0.00652, 0],
      [-0.00073, 3],
      [-0.00043, 3],
      [0.04191, 2],
      [0.01926, 1],
      [-0.00063, 3],
      [0.02043, 1],
      [-0.00079, 3]
    ]
  },
  "QA_yonInjBpsurg": {
    "red_x_points": [
      [-0.00038, 1],
      [-0.00051, 1],
      [-0.0005, 1],
      [-0.00054, 1],
      [-0.00051, 1],
      [-0.00031, 1],
      [-0.00069, 1],
      [-0.00064, 1],
      [-0.00064, 1],
      [-0.00031, 1],
      [-0.00043, 1],
      [-0.00028, 1],
      [-0.00098, 1],
      [-0.001, 1],
      [-0.00031, 1],
      [-0.00037, 1],
      [-0.00032, 1],
      [-0.00029, 1],
      [-0.00026, 1],
      [-0.00033, 1],
      [-0.0012, 1],
      [-0.00061, 1],
      [-0.00033, 1],
      [-0.00035, 1],
      [-0.00067, 1],
      [0.00188, 0],
      [-0.00073, 1],
      [-0.00023, 1],
      [-0.00112, 1]
    ],
    "red_o_points": [],
    "y_categories": ["N", "Y", "nan"],
    "blue_o_points": [],
    "blue_x_points": [
      [0.00583, 0],
      [-0.00036, 1],
      [-0.00031, 1],
      [-0.00063, 1],
      [-0.00018, 1],
      [0.00234, 0],
      [0.00185, 0],
      [-0.0003, 1],
      [-0.00036, 1],
      [-0.00027, 1],
      [-0.00028, 1],
      [0.00324, 0],
      [-0.00023, 1],
      [0.00278, 0],
      [-0.00015, 1]
    ]
  },
  "QA_lstPexTouch[C8]": {
    "red_x_points": [
      [-0.0016, 1],
      [-0.00502, 2],
      [-0.00242, 1],
      [-0.00203, 1],
      [-0.00578, 2],
      [-0.00455, 1],
      [-0.00281, 1],
      [-0.00329, 0],
      [-0.00552, 1],
      [0.00862, 0],
      [-0.00132, 1],
      [-0.01053, 2],
      [-0.00271, 2],
      [-0.00835, 2],
      [-0.00219, 2],
      [-0.00126, 0],
      [-0.00143, 1],
      [-0.00221, 0],
      [-0.0036, 2],
      [-0.00084, 0],
      [-0.00246, 2],
      [-0.00562, 0],
      [-0.00639, 1],
      [-0.0074, 2],
      [-0.00292, 0],
      [-0.00756, 1],
      [-0.00138, 2],
      [-0.00233, 1],
      [-0.00055, 1]
    ],
    "red_o_points": [],
    "y_categories": ["NORM", "NPV", "nan"],
    "blue_o_points": [],
    "blue_x_points": [
      [0.0044, 0],
      [0.00864, 1],
      [0.01878, 0],
      [0.02391, 0],
      [0.00415, 2],
      [0.0013, 2],
      [-0.00036, 1],
      [-0.0013, 1],
      [0.00759, 1],
      [0.00335, 2],
      [0.01695, 0],
      [-0.00053, 1],
      [-0.00043, 0],
      [0.0046, 0],
      [0.00442, 0]
    ]
  },
  "QA_lstPexPalle[Clavicle]": {
    "red_x_points": [
      [-0.00057, 3],
      [-0.00165, 3],
      [-0.001, 3],
      [0.00165, 2],
      [-0.00173, 3],
      [0.00294, 2],
      [-0.0016, 3],
      [-0.00014, 3],
      [-0.00252, 3],
      [0.00406, 2],
      [-0.01531, 0],
      [-0.00304, 3],
      [-0.00055, 3],
      [-0.00298, 3],
      [-0.00057, 3],
      [-0.01769, 0],
      [-0.01393, 0],
      [0.01021, 2],
      [-0.0041, 1],
      [-0.01641, 1],
      [-0.00041, 3],
      [-0.00038, 3],
      [-0.00288, 3],
      [-0.00311, 3],
      [-0.0001, 3],
      [-0.02637, 2],
      [-6e-5, 3],
      [-0.00223, 0],
      [-0.00046, 3]
    ],
    "red_o_points": [],
    "y_categories": ["HYPO", "NAIA", "PT", "nan"],
    "blue_o_points": [],
    "blue_x_points": [
      [0.00458, 3],
      [0.00046, 3],
      [0.00794, 2],
      [0.00952, 2],
      [0.00075, 3],
      [0.00489, 3],
      [0.0067, 0],
      [-0.00171, 3],
      [0.00014, 3],
      [0.0004, 3],
      [0.00996, 0],
      [0.005, 3],
      [0.01959, 2],
      [0.00516, 3],
      [0.02755, 2]
    ]
  },
  "QS_mulBpsurgeryType[Graft]": {
    "red_x_points": [
      [-0.00013, 3],
      [-0.0008, 0],
      [-0.00049, 0],
      [-0.00039, 0],
      [-0.0006, 0],
      [-0.00037, 0],
      [-0.00062, 0],
      [-0.00013, 3],
      [-0.00035, 0],
      [-0.00039, 0],
      [-0.00011, 3],
      [-0.00049, 0],
      [-0.00013, 3],
      [-0.00535, 2],
      [-0.00069, 0],
      [-0.00014, 3],
      [-4e-5, 3],
      [-3e-5, 3],
      [-0.00036, 0],
      [-0.00015, 3],
      [-0.00018, 3],
      [-0.0001, 3],
      [-0.00041, 0],
      [-0.00049, 0],
      [-9e-5, 3],
      [0.00154, 1],
      [-0.00014, 3],
      [-0.00038, 0],
      [-0.00019, 3]
    ],
    "red_o_points": [],
    "y_categories": ["N", "NOT APPLICABLE", "Y", "nan"],
    "blue_o_points": [],
    "blue_x_points": [
      [0.00369, 1],
      [-7e-5, 3],
      [0.00033, 0],
      [0.00068, 0],
      [-2e-5, 3],
      [0.00204, 1],
      [0.0012, 1],
      [1e-5, 0],
      [-5e-5, 3],
      [3e-5, 3],
      [0.00019, 0],
      [0.00218, 1],
      [-1e-5, 3],
      [0.00197, 1],
      [1e-5, 3]
    ]
  },
  "QS_mulLysisRoot[C5]": {
    "red_x_points": [
      [-0.00023, 3],
      [-0.00308, 0],
      [-0.00762, 2],
      [-0.00185, 0],
      [-0.00203, 0],
      [-0.00158, 0],
      [-0.00206, 0],
      [-0.00049, 3],
      [-0.00255, 0],
      [-0.00182, 0],
      [-0.0003, 3],
      [-0.00194, 0],
      [-0.00073, 3],
      [-0.00293, 0],
      [-0.00279, 0],
      [-0.00037, 3],
      [-0.00024, 3],
      [-0.00035, 3],
      [-0.00178, 0],
      [-0.00034, 3],
      [-0.00087, 3],
      [-0.00057, 3],
      [-0.00223, 0],
      [-0.00203, 0],
      [-0.00053, 3],
      [0.00693, 1],
      [-0.00052, 3],
      [-0.00647, 2],
      [-0.00055, 3]
    ],
    "red_o_points": [],
    "y_categories": ["N", "NOT APPLICABLE", "Y", "nan"],
    "blue_o_points": [],
    "blue_x_points": [
      [0.01465, 1],
      [-0.00019, 3],
      [-0.00074, 0],
      [-0.00145, 0],
      [9e-5, 3],
      [0.00905, 1],
      [0.00702, 1],
      [-0.00093, 0],
      [-0.00018, 3],
      [-0.00026, 3],
      [-0.00076, 0],
      [0.00781, 1],
      [-0.00011, 3],
      [0.00825, 1],
      [-0.00035, 3]
    ]
  },
  "QS_mulNeuromadSite[C6]": {
    "red_x_points": [
      [2e-5, 2],
      [-0.00032, 0],
      [-0.00029, 0],
      [-0.00028, 0],
      [-0.00037, 0],
      [-0.00026, 0],
      [-0.00032, 0],
      [-7e-5, 2],
      [-0.00039, 0],
      [-0.00034, 0],
      [-6e-5, 2],
      [-0.0003, 0],
      [-2e-5, 2],
      [-0.00041, 0],
      [-0.00033, 0],
      [1e-5, 2],
      [3e-5, 2],
      [-0.0, 2],
      [-0.0002, 0],
      [2e-5, 2],
      [-6e-5, 2],
      [-7e-5, 2],
      [-0.00032, 0],
      [-0.00027, 0],
      [-5e-5, 2],
      [0.00067, 1],
      [-2e-5, 2],
      [-0.00022, 0],
      [-5e-5, 2]
    ],
    "red_o_points": [],
    "y_categories": ["N", "NOT APPLICABLE", "nan"],
    "blue_o_points": [],
    "blue_x_points": [
      [0.00152, 1],
      [-1e-5, 2],
      [-0.00015, 0],
      [-0.00027, 0],
      [4e-5, 2],
      [0.00103, 1],
      [0.0006, 1],
      [-0.00023, 0],
      [-9e-5, 2],
      [-1e-5, 2],
      [-0.00011, 0],
      [0.00094, 1],
      [-1e-5, 2],
      [0.00103, 1],
      [-3e-5, 2]
    ]
  },
  "QS_mulNeuromadSite[T1]": {
    "red_x_points": [
      [0.0, 2],
      [-0.00069, 0],
      [-0.00069, 0],
      [-0.0004, 0],
      [-0.0007, 0],
      [-0.00027, 0],
      [-0.00067, 0],
      [-4e-5, 2],
      [-0.00052, 0],
      [-0.00039, 0],
      [0.0, 2],
      [-0.00053, 0],
      [0.0, 2],
      [-0.00065, 0],
      [-0.00061, 0],
      [3e-5, 2],
      [-0.0, 2],
      [-5e-5, 2],
      [-0.00031, 0],
      [2e-5, 2],
      [-8e-5, 2],
      [-0.00012, 2],
      [-0.00047, 0],
      [-0.00051, 0],
      [-4e-5, 2],
      [0.0007, 1],
      [-9e-5, 2],
      [-0.00043, 0],
      [4e-5, 2]
    ],
    "red_o_points": [],
    "y_categories": ["N", "NOT APPLICABLE", "nan"],
    "blue_o_points": [],
    "blue_x_points": [
      [0.00274, 1],
      [5e-5, 2],
      [-0.00011, 0],
      [-0.0004, 0],
      [0.00013, 2],
      [0.00178, 1],
      [0.00099, 1],
      [-0.00016, 0],
      [3e-5, 2],
      [3e-5, 2],
      [-0.00014, 0],
      [0.00112, 1],
      [4e-5, 2],
      [0.0014, 1],
      [-1e-5, 2]
    ]
  },
  "QA_lstPexTouch[C7]": {
    "red_x_points": [
      [-0.00159, 1],
      [-0.00917, 2],
      [-0.00385, 1],
      [-0.00376, 1],
      [-0.01081, 2],
      [-0.00584, 1],
      [-0.00568, 1],
      [-0.00504, 0],
      [-0.00802, 1],
      [-0.00878, 1],
      [-0.00176, 1],
      [-0.01509, 2],
      [-0.00306, 2],
      [-0.01404, 2],
      [-0.00499, 2],
      [-0.00284, 0],
      [-0.00169, 1],
      [-0.00311, 0],
      [-0.00793, 2],
      [-0.00222, 0],
      [-0.00251, 2],
      [-0.0082, 0],
      [-0.00882, 1],
      [-0.01198, 2],
      [-0.00374, 0],
      [-0.00416, 1],
      [-0.00154, 2],
      [-0.00253, 1],
      [0.00015, 1]
    ],
    "red_o_points": [],
    "y_categories": ["NORM", "NPV", "nan"],
    "blue_o_points": [],
    "blue_x_points": [
      [-0.00013, 1],
      [0.01192, 1],
      [0.04055, 0],
      [0.04783, 0],
      [0.00717, 2],
      [4e-5, 2],
      [-0.00372, 1],
      [0.01025, 1],
      [0.0062, 2],
      [0.03487, 0],
      [-0.00102, 0],
      [0.00391, 0],
      [0.00469, 0]
    ]
  },
  "QA_yonInjPhysio": {
    "red_x_points": [
      [-0.00959, 0],
      [0.00084, 0],
      [0.00018, 0],
      [0.00044, 0],
      [-0.00199, 2],
      [0.0002, 0],
      [0.00048, 0],
      [-0.00756, 0],
      [0.00091, 0],
      [-0.0081, 1],
      [-0.00672, 0],
      [0.00136, 0],
      [-0.01, 0],
      [-0.005, 1],
      [-0.00155, 1],
      [0.00408, 1],
      [-0.00727, 0],
      [0.00458, 1],
      [0.00036, 0],
      [-0.00729, 0],
      [0.00568, 1],
      [0.00445, 1],
      [0.00168, 0],
      [-0.00654, 1],
      [-0.01014, 2],
      [-0.01735, 1],
      [-0.0114, 2],
      [-0.00038, 0],
      [0.00592, 1]
    ],
    "red_o_points": [],
    "y_categories": ["N", "Y", "nan"],
    "blue_o_points": [],
    "blue_x_points": [
      [0.0068, 0],
      [0.00991, 1],
      [0.00508, 0],
      [0.00671, 0],
      [0.00995, 1],
      [0.00667, 0],
      [0.00329, 0],
      [0.00176, 0],
      [-0.00217, 0],
      [0.00905, 1],
      [0.00408, 0],
      [0.00378, 0],
      [0.00801, 1],
      [-0.00272, 1],
      [0.00949, 1]
    ]
  },
  "QS_mulLysisSite[Root]": {
    "red_x_points": [
      [-0.00012, 3],
      [-0.00174, 0],
      [-0.00546, 2],
      [-0.00116, 0],
      [-0.00152, 0],
      [-0.0012, 0],
      [-0.00138, 0],
      [-0.00036, 3],
      [-0.00144, 0],
      [-0.0013, 0],
      [-0.00021, 3],
      [-0.00144, 0],
      [-0.00052, 3],
      [-0.00167, 0],
      [-0.00122, 0],
      [-0.00021, 3],
      [-0.00014, 3],
      [-0.0003, 3],
      [-0.00098, 0],
      [-0.00024, 3],
      [-0.00043, 3],
      [-0.00034, 3],
      [-0.00142, 0],
      [-0.00133, 0],
      [-0.00042, 3],
      [0.00493, 1],
      [-0.00036, 3],
      [-0.00563, 2],
      [-0.00041, 3]
    ],
    "red_o_points": [],
    "y_categories": ["N", "NOT APPLICABLE", "Y", "nan"],
    "blue_o_points": [],
    "blue_x_points": [
      [0.00957, 1],
      [-8e-5, 3],
      [-0.00069, 0],
      [-0.00081, 0],
      [-9e-5, 3],
      [0.00596, 1],
      [0.00488, 1],
      [-0.00103, 0],
      [3e-5, 3],
      [-0.00023, 3],
      [-0.00045, 0],
      [0.00568, 1],
      [-0.0002, 3],
      [0.00567, 1],
      [-0.00023, 3]
    ]
  },
  "QS_mulNeuromadSite[T2]": {
    "red_x_points": [
      [-0.0001, 2],
      [-0.00055, 0],
      [-0.00035, 0],
      [-0.00032, 0],
      [-0.0004, 0],
      [-0.0004, 0],
      [-0.00055, 0],
      [-0.00013, 2],
      [-0.0006, 0],
      [-0.00042, 0],
      [-0.00013, 2],
      [-0.00049, 0],
      [-8e-5, 2],
      [-0.00056, 0],
      [-0.0005, 0],
      [-0.0001, 2],
      [-9e-5, 2],
      [-0.00012, 2],
      [-0.00033, 0],
      [-0.00012, 2],
      [-0.00017, 2],
      [-0.00015, 2],
      [-0.00052, 0],
      [-0.00042, 0],
      [-0.00012, 2],
      [0.00088, 1],
      [-0.00013, 2],
      [-0.0003, 0],
      [-0.0001, 2]
    ],
    "red_o_points": [],
    "y_categories": ["N", "NOT APPLICABLE", "nan"],
    "blue_o_points": [],
    "blue_x_points": [
      [0.00318, 1],
      [-5e-5, 2],
      [-0.00024, 0],
      [-0.00032, 0],
      [-1e-5, 2],
      [0.00179, 1],
      [0.00143, 1],
      [-0.00028, 0],
      [1e-5, 2],
      [-7e-5, 2],
      [-0.00028, 0],
      [0.00121, 1],
      [-8e-5, 2],
      [0.00121, 1],
      [-0.00011, 2]
    ]
  },
  "QS_mulGraftNerve[MC]": {
    "red_x_points": [
      [-5e-5, 0],
      [0.0, 2],
      [-5e-5, 0],
      [-5e-5, 0],
      [0.0, 2],
      [0.0, 2]
    ],
    "red_o_points": [],
    "y_categories": ["N", "NOT APPLICABLE", "nan"],
    "blue_o_points": [],
    "blue_x_points": [[0.0, 2], [0.00015, 1]]
  },
  "QS_mulNeuromadSite[C4]": {
    "red_x_points": [
      [0.0, 2],
      [-8e-5, 0],
      [-8e-5, 0],
      [-9e-5, 0],
      [-0.00012, 0],
      [-8e-5, 0],
      [-0.00012, 0],
      [1e-5, 2],
      [-6e-5, 0],
      [-8e-5, 0],
      [0.0, 2],
      [-8e-5, 0],
      [0.0, 2],
      [-9e-5, 0],
      [0.0, 2],
      [0.0, 2],
      [0.0, 2],
      [-8e-5, 0],
      [0.0, 2],
      [1e-5, 2],
      [1e-5, 2],
      [-8e-5, 0],
      [-3e-5, 0],
      [0.0, 2],
      [9e-5, 1],
      [0.0, 2],
      [-8e-5, 0],
      [-0.0, 2]
    ],
    "red_o_points": [],
    "y_categories": ["N", "NOT APPLICABLE", "nan"],
    "blue_o_points": [],
    "blue_x_points": [
      [0.00036, 1],
      [1e-5, 2],
      [-3e-5, 0],
      [-3e-5, 0],
      [0.0, 2],
      [0.00013, 1],
      [0.00022, 1],
      [-8e-5, 0],
      [1e-5, 2],
      [0.0, 2],
      [-3e-5, 0],
      [0.00022, 1],
      [0.0, 2],
      [0.00022, 1],
      [0.0, 2]
    ]
  },
  "QS_mulLysisNerve[Ssr]": {
    "red_x_points": [
      [-0.00033, 3],
      [-0.00431, 0],
      [-0.01035, 2],
      [-0.00868, 2],
      [-0.00265, 0],
      [-0.00238, 0],
      [-0.00267, 0],
      [-0.00083, 3],
      [-0.00295, 0],
      [-0.00247, 0],
      [-0.00045, 3],
      [-0.00287, 0],
      [-0.00074, 3],
      [-0.0041, 0],
      [-0.00348, 0],
      [-0.00044, 3],
      [-0.00023, 3],
      [-0.00036, 3],
      [-0.00227, 0],
      [-0.00026, 3],
      [-0.00082, 3],
      [-0.00056, 3],
      [-0.00331, 0],
      [-0.00317, 0],
      [-0.00078, 3],
      [0.00939, 1],
      [-0.00068, 3],
      [-0.00227, 0],
      [-0.00076, 3]
    ],
    "red_o_points": [],
    "y_categories": ["N", "NOT APPLICABLE", "Y", "nan"],
    "blue_o_points": [],
    "blue_x_points": [
      [0.01883, 1],
      [-8e-5, 3],
      [-0.00104, 0],
      [-0.00173, 0],
      [5e-5, 3],
      [0.01284, 1],
      [0.00908, 1],
      [-0.00196, 0],
      [-0.00025, 3],
      [-0.00015, 3],
      [-0.00116, 0],
      [0.01026, 1],
      [-0.00013, 3],
      [0.01151, 1],
      [-0.00031, 3]
    ]
  },
  "QS_mulTransfSite[Oberlin]": {
    "red_x_points": [
      [-0.00158, 3],
      [-0.02621, 0],
      [-0.02579, 0],
      [-0.02353, 0],
      [-0.02614, 0],
      [0.00396, 2],
      [-0.02556, 0],
      [-0.00198, 3],
      [0.00411, 2],
      [0.00403, 2],
      [-0.00158, 3],
      [0.00371, 2],
      [-0.00222, 3],
      [0.00197, 2],
      [-0.02338, 0],
      [-0.00167, 3],
      [-0.00176, 3],
      [-0.00149, 3],
      [-0.02258, 0],
      [-0.00159, 3],
      [-0.00217, 3],
      [-0.00211, 3],
      [0.00403, 2],
      [-0.02553, 0],
      [-0.00218, 3],
      [0.02815, 1],
      [-0.00204, 3],
      [-0.02561, 0],
      [-0.00218, 3]
    ],
    "red_o_points": [],
    "y_categories": ["N", "NOT APPLICABLE", "Y", "nan"],
    "blue_o_points": [],
    "blue_x_points": [
      [0.04548, 1],
      [-0.0012, 3],
      [0.00641, 2],
      [0.00741, 2],
      [-0.00039, 3],
      [0.03678, 1],
      [0.03034, 1],
      [0.00507, 2],
      [-0.00116, 3],
      [-0.00104, 3],
      [0.00616, 2],
      [0.03442, 1],
      [-0.00109, 3],
      [0.03298, 1],
      [-0.00123, 3]
    ]
  },
  "QA_intPexForearmProna": {
    "red_x_points": [
      [-0.00079, 2],
      [-0.00087, 0],
      [-0.00068, 2],
      [-0.00039, 2],
      [-0.00066, 2],
      [-0.00248, 0],
      [-0.0007, 2],
      [-0.0199, 0],
      [-0.00073, 2],
      [-0.00093, 2],
      [-0.02005, 0],
      [-0.00231, 0],
      [-0.0013, 2],
      [-0.00052, 2],
      [2e-5, 2],
      [-0.02104, 0],
      [-0.0196, 0],
      [-0.01752, 0],
      [-0.00157, 0],
      [-0.00105, 2],
      [-0.00124, 2],
      [-0.00119, 2],
      [-0.00063, 2],
      [-0.00061, 2],
      [0.0002, 2],
      [0.00074, 1],
      [0.00028, 2],
      [-0.00214, 0],
      [-0.0011, 2]
    ],
    "red_o_points": [],
    "y_categories": ["GREATER THAN OR EQUALS TO 80", "LESS THAN 80", "nan"],
    "blue_o_points": [],
    "blue_x_points": [
      [-0.00042, 2],
      [0.05892, 1],
      [-0.00052, 0],
      [-0.00056, 2],
      [0.0009, 2],
      [2e-5, 2],
      [0.00091, 1],
      [0.00012, 2],
      [-0.00016, 2],
      [0.00098, 2],
      [-0.00076, 0],
      [5e-5, 2],
      [0.00111, 2],
      [7e-5, 2],
      [0.05809, 1]
    ]
  },
  "QS_mulLysisSite[Nerve]": {
    "red_x_points": [
      [-0.00019, 3],
      [-0.00337, 0],
      [-0.00821, 2],
      [-0.00714, 2],
      [-0.00273, 0],
      [-0.00214, 0],
      [-0.00228, 0],
      [-0.00054, 3],
      [-0.00243, 0],
      [-0.00173, 0],
      [-0.00038, 3],
      [-0.00246, 0],
      [-0.00062, 3],
      [-0.00325, 0],
      [-0.00316, 0],
      [-0.00028, 3],
      [-0.00013, 3],
      [-0.00019, 3],
      [-0.00186, 0],
      [-0.00029, 3],
      [-0.00057, 3],
      [-0.00045, 3],
      [-0.00252, 0],
      [-0.00237, 0],
      [-0.00054, 3],
      [0.00671, 1],
      [-0.00047, 3],
      [-0.00187, 0],
      [-0.00054, 3]
    ],
    "red_o_points": [],
    "y_categories": ["N", "NOT APPLICABLE", "Y", "nan"],
    "blue_o_points": [],
    "blue_x_points": [
      [0.01487, 1],
      [-0.00011, 3],
      [-0.00069, 0],
      [-0.0014, 0],
      [0.00029, 3],
      [0.01043, 1],
      [0.00714, 1],
      [-0.00154, 0],
      [-0.00017, 3],
      [6e-5, 3],
      [-0.00089, 0],
      [0.00915, 1],
      [-0.00015, 3],
      [0.00918, 1],
      [-0.00018, 3]
    ]
  },
  "QA_yonPexPain": {
    "red_x_points": [
      [-0.00784, 1],
      [-0.00097, 1],
      [-0.00083, 1],
      [-0.00037, 1],
      [-0.00077, 1],
      [-0.00206, 0],
      [-0.00052, 1],
      [-0.00832, 1],
      [-0.00289, 0],
      [-0.00074, 1],
      [-0.00476, 1],
      [-0.00082, 0],
      [-0.01085, 1],
      [-0.00085, 1],
      [-0.00057, 1],
      [0.00577, 0],
      [-0.00497, 1],
      [0.00522, 0],
      [-0.00071, 1],
      [0.00824, 0],
      [-0.0215, 2],
      [-0.01023, 1],
      [-1e-5, 1],
      [-0.00087, 1],
      [-0.01507, 2],
      [-0.00205, 1],
      [-0.00827, 1],
      [-0.00033, 1],
      [-0.01095, 1]
    ],
    "red_o_points": [],
    "y_categories": ["N", "Y", "nan"],
    "blue_o_points": [],
    "blue_x_points": [
      [-0.0003, 1],
      [0.02637, 0],
      [0.00295, 0],
      [0.00139, 1],
      [-0.00575, 1],
      [0.00109, 2],
      [2e-5, 1],
      [0.00395, 1],
      [0.03094, 0],
      [0.02411, 0],
      [0.00161, 1],
      [0.00189, 0],
      [0.01057, 0],
      [-0.00045, 1],
      [0.00052, 1]
    ]
  },
  "QS_mulGraftNerve[FI]": {
    "red_x_points": [
      [4e-5, 2],
      [-0.00018, 0],
      [-9e-5, 0],
      [-4e-5, 0],
      [-0.00013, 0],
      [-6e-5, 0],
      [-5e-5, 0],
      [-1e-5, 2],
      [-7e-5, 0],
      [-9e-5, 0],
      [0.0, 2],
      [-0.00013, 0],
      [-0.0, 2],
      [-0.00021, 0],
      [-4e-5, 0],
      [0.0, 2],
      [-1e-5, 2],
      [-1e-5, 2],
      [-4e-5, 0],
      [1e-5, 2],
      [-2e-5, 2],
      [4e-5, 2],
      [-9e-5, 0],
      [-9e-5, 0],
      [-1e-5, 2],
      [-1e-5, 2],
      [-2e-5, 0],
      [0.0, 2]
    ],
    "red_o_points": [],
    "y_categories": ["N", "NOT APPLICABLE", "nan"],
    "blue_o_points": [],
    "blue_x_points": [
      [0.00073, 1],
      [0.0, 2],
      [-2e-5, 0],
      [-2e-5, 0],
      [-3e-5, 2],
      [0.00025, 1],
      [0.00013, 1],
      [-4e-5, 0],
      [4e-5, 2],
      [-1e-5, 2],
      [-4e-5, 0],
      [0.00013, 1],
      [0.00013, 1],
      [0.0, 2]
    ]
  },
  "QA_lstPexPalle[Ulna]": {
    "red_x_points": [
      [-0.00098, 4],
      [-0.00325, 4],
      [-0.00207, 4],
      [-0.00716, 2],
      [-0.00356, 4],
      [-0.01244, 1],
      [-0.003, 4],
      [-0.00067, 4],
      [-0.00443, 4],
      [0.01212, 3],
      [-0.0113, 1],
      [-0.00412, 4],
      [-0.00097, 4],
      [-0.00398, 4],
      [-0.00118, 4],
      [0.00482, 3],
      [-0.01103, 0],
      [0.00313, 3],
      [-0.00768, 0],
      [0.00541, 3],
      [-0.00097, 4],
      [-0.00075, 4],
      [-0.00431, 4],
      [-0.00349, 4],
      [-5e-5, 4],
      [0.00224, 3],
      [-0.00025, 4],
      [-0.00831, 0],
      [-0.00084, 4]
    ],
    "red_o_points": [],
    "y_categories": ["ABS", "HYPO", "NAIA", "PT", "nan"],
    "blue_o_points": [],
    "blue_x_points": [
      [-0.00058, 4],
      [6e-5, 4],
      [0.01823, 3],
      [0.02097, 3],
      [7e-5, 4],
      [-0.00011, 4],
      [0.00151, 3],
      [-0.00276, 4],
      [0.00043, 4],
      [0.00047, 4],
      [0.01655, 3],
      [-8e-5, 4],
      [0.00375, 3],
      [-0.0001, 4],
      [0.01065, 3]
    ]
  }
}
