{
  "participant_code": {
    "red_x_points": [
      [-0.07299, 1],
      [-0.06999, 2],
      [-0.07246, 3],
      [-0.07375, 4],
      [-0.07251, 5],
      [-0.07204, 6],
      [-0.07069, 7],
      [-0.07275, 8],
      [-0.07222, 9],
      [-0.07063, 10],
      [-0.07157, 11],
      [-0.07122, 12],
      [-0.07163, 13],
      [-0.07057, 15],
      [-0.07263, 17],
      [-0.07146, 18],
      [-0.07287, 20],
      [-0.07281, 21],
      [-0.07075, 22],
      [-0.07381, 24],
      [-0.07263, 26],
      [-0.07204, 27],
      [-0.07193, 28],
      [-0.07328, 30],
      [-0.07269, 31],
      [-0.07169, 32],
      [-0.07052, 34],
      [-0.07228, 36],
      [-0.0731, 38],
      [-0.07416, 39],
      [-0.0721, 40],
      [-0.07057, 41]
    ],
    "red_o_points": [],
    "y_categories": [
      "P16554",
      "P18297",
      "P19283",
      "P19287",
      "P23391",
      "P30595",
      "P31645",
      "P31691",
      "P34778",
      "P35046",
      "P36328",
      "P43633",
      "P4544",
      "P46417",
      "P48965",
      "P53068",
      "P5497",
      "P59529",
      "P62483",
      "P64658",
      "P65202",
      "P66816",
      "P6751",
      "P7408",
      "P75566",
      "P76226",
      "P79971",
      "P82621",
      "P82990",
      "P84549",
      "P84932",
      "P85825",
      "P86989",
      "P8770",
      "P87791",
      "P90550",
      "P93159",
      "P94969",
      "P96710",
      "P97130",
      "P9744",
      "P98500",
      "nan"
    ],
    "blue_o_points": [],
    "blue_x_points": [
      [0.1475, 0],
      [0.15131, 14],
      [0.14806, 16],
      [0.15061, 19],
      [0.14976, 23],
      [0.1523, 25],
      [0.14976, 29],
      [0.14948, 33],
      [0.15117, 35],
      [0.15046, 37]
    ]
  },
  "QA_mulInjTbpiCause[Motorcycle]": {
    "red_x_points": [
      [0.0486, 0],
      [-0.01683, 1],
      [-0.01649, 1],
      [-0.01681, 1],
      [-0.01647, 1],
      [-0.0164, 1],
      [-0.01646, 1],
      [-0.01604, 1],
      [-0.01586, 1],
      [-0.01561, 1],
      [-0.01638, 1],
      [-0.01651, 1],
      [0.04733, 0],
      [-0.01594, 1],
      [-0.01621, 1],
      [-0.01639, 1],
      [-0.0168, 1],
      [-0.01613, 1],
      [-0.01657, 1],
      [0.04731, 0],
      [-0.01648, 1],
      [-0.01612, 1],
      [-0.0163, 1],
      [-0.01583, 1],
      [-0.01685, 1],
      [0.04651, 0],
      [-0.01651, 1],
      [-0.016, 1],
      [-0.01638, 1],
      [-0.01663, 1],
      [-0.01596, 1],
      [-0.01635, 1]
    ],
    "red_o_points": [],
    "y_categories": ["N", "Y", "nan"],
    "blue_o_points": [],
    "blue_x_points": [
      [0.05355, 0],
      [-0.01118, 1],
      [0.05294, 0],
      [-0.01177, 1],
      [-0.01192, 1],
      [0.05565, 0],
      [-0.01219, 1],
      [0.05532, 0],
      [-0.0119, 1],
      [-0.01251, 1]
    ]
  },
  "QA_yonInjUnconscio": {
    "red_x_points": [
      [-0.03392, 1],
      [-0.03481, 1],
      [-0.01046, 2],
      [-0.01118, 2],
      [-0.01155, 2],
      [0.09063, 0],
      [-0.03456, 1],
      [-0.01189, 2],
      [-0.01084, 2],
      [-0.01135, 2],
      [-0.01161, 2],
      [-0.03391, 1],
      [-0.03376, 1],
      [-0.03454, 1],
      [-0.01198, 2],
      [-0.0119, 2],
      [-0.01222, 2],
      [-0.03388, 1],
      [0.08809, 0],
      [-0.03322, 1],
      [-0.03412, 1],
      [-0.0338, 1],
      [-0.03401, 1],
      [-0.01154, 2],
      [-0.034, 1],
      [-0.01207, 2],
      [-0.03349, 1],
      [-0.03336, 1],
      [-0.01121, 2],
      [-0.01117, 2],
      [-0.03411, 1],
      [-0.01154, 2]
    ],
    "red_o_points": [],
    "y_categories": ["N", "Y", "nan"],
    "blue_o_points": [],
    "blue_x_points": [
      [-0.00535, 2],
      [-0.02239, 1],
      [0.09171, 0],
      [0.0921, 0],
      [0.09356, 0],
      [-0.00542, 2],
      [-0.02368, 1],
      [-0.00574, 2],
      [0.09417, 0],
      [-0.00491, 2]
    ]
  }
}
