{
  "QA_lstPexMuscstrength[ElbowFlex]": {
    "red_x_points": [
      [-0.00469, 1],
      [0.00067, 2],
      [-0.00211, 1],
      [-0.00228, 1],
      [0.0023, 0],
      [-0.0019, 1],
      [-0.00248, 1],
      [-0.00446, 1],
      [-0.00236, 1],
      [-0.00177, 1],
      [-0.00189, 1],
      [-0.00394, 1],
      [0.00114, 2],
      [0.00406, 2],
      [0.00039, 2],
      [-0.00434, 1],
      [0.00068, 2],
      [0.00202, 0],
      [-0.00431, 1],
      [-0.00391, 1],
      [-0.00425, 1],
      [-0.00222, 1],
      [0.00375, 2],
      [0.00031, 0],
      [-0.00439, 1],
      [-0.00234, 1],
      [-0.00384, 1],
      [-0.00211, 1],
      [-0.00419, 1],
      [0.0009, 2],
      [-0.00193, 1]
    ],
    "red_o_points": [],
    "y_categories": ["GREATER THAN OR EQUALS TO 3", "LESS THAN 3", "nan"],
    "blue_o_points": [],
    "blue_x_points": [
      [0.00072, 2],
      [0.00642, 2],
      [0.00504, 0],
      [0.00071, 1],
      [0.00583, 2],
      [0.00648, 0],
      [0.00499, 0]
    ]
  },
  "QS_mulLysisTrunk[Upper]": {
    "red_x_points": [
      [-0.00156, 3],
      [-0.00275, 0],
      [-0.00348, 0],
      [-0.00285, 0],
      [-0.00314, 0],
      [-0.00565, 2],
      [-0.00285, 0],
      [-0.00144, 3],
      [-0.00288, 0],
      [-0.00303, 0],
      [-0.00257, 0],
      [-0.00167, 3],
      [0.00687, 1],
      [-0.00181, 3],
      [-0.00289, 0],
      [-0.00182, 3],
      [-0.00584, 2],
      [-0.00295, 0],
      [-0.00168, 3],
      [-0.00155, 3],
      [-0.00147, 3],
      [-0.00244, 0],
      [-0.00181, 3],
      [-0.0021, 3],
      [-0.00162, 3],
      [-0.00269, 0],
      [-0.00156, 3],
      [-0.00292, 0],
      [-0.00143, 3],
      [0.00758, 1],
      [-0.00488, 2]
    ],
    "red_o_points": [],
    "y_categories": ["N", "NOT APPLICABLE", "Y", "nan"],
    "blue_o_points": [],
    "blue_x_points": [
      [0.0115, 1],
      [-0.00093, 3],
      [0.00968, 1],
      [-0.00121, 0],
      [-0.00073, 3],
      [0.01002, 1],
      [0.01152, 1]
    ]
  },
  "QS_mulBpsurgeryType[Transf]": {
    "red_x_points": [
      [-0.00025, 3],
      [-0.00035, 2],
      [-0.00088, 0],
      [-0.00037, 2],
      [-0.00034, 2],
      [-0.0003, 2],
      [-0.00041, 2],
      [-0.00027, 3],
      [-0.00039, 2],
      [-0.00032, 2],
      [-0.00037, 2],
      [-0.00022, 3],
      [0.00125, 1],
      [-0.0002, 3],
      [-0.0003, 2],
      [-0.00025, 3],
      [-0.00041, 2],
      [-0.00032, 2],
      [-0.00023, 3],
      [-0.00019, 3],
      [-0.00016, 3],
      [-0.00034, 2],
      [-0.00011, 3],
      [-0.00023, 3],
      [-0.00024, 3],
      [-0.00042, 2],
      [-0.00024, 3],
      [-0.00036, 2],
      [-0.0002, 3],
      [0.00112, 1],
      [-0.00026, 2]
    ],
    "red_o_points": [],
    "y_categories": ["N", "NOT APPLICABLE", "Y", "nan"],
    "blue_o_points": [],
    "blue_x_points": [
      [0.0014, 1],
      [-1e-5, 3],
      [0.001, 1],
      [-0.00041, 2],
      [-0.00014, 3],
      [0.00125, 1],
      [0.00094, 1]
    ]
  },
  "QS_mulNeuromadSite[T1]": {
    "red_x_points": [
      [-0.00133, 2],
      [-0.00422, 0],
      [-0.00388, 0],
      [-0.00347, 0],
      [-0.00468, 0],
      [-0.00377, 0],
      [-0.00371, 0],
      [-0.00143, 2],
      [-0.00353, 0],
      [-0.00365, 0],
      [-0.00385, 0],
      [-0.00151, 2],
      [0.0068, 1],
      [-0.00129, 2],
      [-0.00389, 0],
      [-0.00182, 2],
      [-0.00384, 0],
      [-0.00415, 0],
      [-0.00157, 2],
      [-0.00119, 2],
      [-0.00119, 2],
      [-0.00323, 0],
      [-0.00134, 2],
      [-0.00229, 2],
      [-0.00149, 2],
      [-0.00342, 0],
      [-0.00127, 2],
      [-0.00401, 0],
      [-0.00105, 2],
      [0.00714, 1],
      [-0.00368, 0]
    ],
    "red_o_points": [],
    "y_categories": ["N", "NOT APPLICABLE", "nan"],
    "blue_o_points": [],
    "blue_x_points": [
      [0.01485, 1],
      [7e-5, 2],
      [0.00797, 1],
      [-8e-5, 0],
      [0.00027, 2],
      [0.00938, 1],
      [0.01027, 1]
    ]
  },
  "QS_mulNeuromadSite[T2]": {
    "red_x_points": [
      [-0.00201, 2],
      [-0.00547, 0],
      [-0.00668, 0],
      [-0.00583, 0],
      [-0.00599, 0],
      [-0.00593, 0],
      [-0.00552, 0],
      [-0.0015, 2],
      [-0.00539, 0],
      [-0.0057, 0],
      [-0.00584, 0],
      [-0.00212, 2],
      [0.00895, 1],
      [-0.00168, 2],
      [-0.00619, 0],
      [-0.00178, 2],
      [-0.0057, 0],
      [-0.00651, 0],
      [-0.00191, 2],
      [-0.00165, 2],
      [-0.00139, 2],
      [-0.00504, 0],
      [-0.00164, 2],
      [-0.00213, 2],
      [-0.00191, 2],
      [-0.00565, 0],
      [-0.00201, 2],
      [-0.00651, 0],
      [-0.00124, 2],
      [0.0107, 1],
      [-0.00494, 0]
    ],
    "red_o_points": [],
    "y_categories": ["N", "NOT APPLICABLE", "nan"],
    "blue_o_points": [],
    "blue_x_points": [
      [0.02333, 1],
      [-3e-5, 2],
      [0.01318, 1],
      [0.00015, 0],
      [3e-5, 2],
      [0.01196, 1],
      [0.01298, 1]
    ]
  },
  "QA_mulInjOrthesisType[ShoulderSupport]": {
    "red_x_points": [
      [-0.0134, 0],
      [-0.01224, 0],
      [-0.01179, 0],
      [-0.01223, 0],
      [-0.01276, 0],
      [-0.01145, 0],
      [-0.01239, 0],
      [-0.01559, 2],
      [-0.0128, 0],
      [-0.01288, 0],
      [-0.01225, 0],
      [-0.01293, 0],
      [0.03488, 1],
      [-0.0131, 0],
      [-0.01232, 0],
      [-0.0133, 0],
      [-0.01599, 2],
      [-0.01257, 0],
      [-0.01319, 0],
      [-0.01311, 0],
      [-0.01551, 2],
      [-0.01508, 3],
      [-0.01311, 0],
      [0.03591, 1],
      [-0.01294, 0],
      [-0.01257, 0],
      [-0.01325, 0],
      [-0.01202, 0],
      [-0.01635, 3],
      [-0.0223, 3],
      [-0.01288, 0]
    ],
    "red_o_points": [],
    "y_categories": ["N", "NOT APPLICABLE", "Y", "nan"],
    "blue_o_points": [],
    "blue_x_points": [
      [-0.00619, 0],
      [0.0383, 1],
      [0.03258, 1],
      [0.03966, 1],
      [0.03788, 1],
      [0.03298, 1],
      [0.03287, 1]
    ]
  },
  "QS_mulGraftRoot[T1]": {
    "red_x_points": [
      [-0.0, 2],
      [-5e-5, 0],
      [-5e-5, 0],
      [-5e-5, 0],
      [-5e-5, 0],
      [-5e-5, 0],
      [-5e-5, 0],
      [-5e-5, 0],
      [-0.0, 2],
      [0.00011, 1],
      [-5e-5, 0],
      [-0.0, 2],
      [-5e-5, 0],
      [-0.0, 2],
      [-0.0, 2],
      [-0.0, 2],
      [-5e-5, 0],
      [-0.0, 2],
      [-0.0, 2],
      [-0.0, 2],
      [-5e-5, 0],
      [-5e-5, 0],
      [-0.0, 2]
    ],
    "red_o_points": [],
    "y_categories": ["N", "NOT APPLICABLE", "nan"],
    "blue_o_points": [],
    "blue_x_points": [
      [0.00011, 1],
      [-0.0, 2],
      [0.00011, 1],
      [-0.0, 2],
      [0.00011, 1]
    ]
  },
  "QS_mulGraftTrunk[MiddleTrunk]": {
    "red_x_points": [
      [-1e-5, 2],
      [-5e-5, 0],
      [-5e-5, 0],
      [-5e-5, 0],
      [-5e-5, 0],
      [-5e-5, 0],
      [-1e-5, 2],
      [-5e-5, 0],
      [-1e-5, 2],
      [0.0001, 1],
      [-5e-5, 0],
      [-1e-5, 2],
      [-5e-5, 0],
      [-5e-5, 0],
      [-1e-5, 2],
      [-5e-5, 0],
      [-1e-5, 2],
      [-1e-5, 2],
      [-5e-5, 0],
      [-5e-5, 0],
      [-1e-5, 2],
      [0.0001, 1],
      [-5e-5, 0]
    ],
    "red_o_points": [],
    "y_categories": ["N", "NOT APPLICABLE", "nan"],
    "blue_o_points": [],
    "blue_x_points": [[-1e-5, 2], [0.0001, 1], [0.0001, 1]]
  },
  "QS_mulGraftNerve[Ac]": {
    "red_x_points": [
      [-0.00044, 2],
      [-0.00149, 0],
      [-0.00111, 0],
      [-0.0013, 0],
      [-0.00133, 0],
      [-0.00129, 0],
      [-0.00095, 0],
      [-0.00059, 2],
      [-0.00132, 0],
      [-0.00104, 0],
      [-0.00119, 0],
      [-0.00043, 2],
      [0.00156, 1],
      [-0.0004, 2],
      [-0.0015, 0],
      [-0.00047, 2],
      [-0.00125, 0],
      [-0.00139, 0],
      [-0.00055, 2],
      [-0.00043, 2],
      [-0.0004, 2],
      [-0.001, 0],
      [-0.00047, 2],
      [-0.00054, 2],
      [-0.00042, 2],
      [-0.0011, 0],
      [-0.00044, 2],
      [-0.00128, 0],
      [-0.00047, 2],
      [0.00182, 1],
      [-0.00116, 0]
    ],
    "red_o_points": [],
    "y_categories": ["N", "NOT APPLICABLE", "nan"],
    "blue_o_points": [],
    "blue_x_points": [
      [0.00468, 1],
      [0.0001, 2],
      [0.00281, 1],
      [1e-5, 0],
      [6e-5, 2],
      [0.00278, 1],
      [0.00362, 1]
    ]
  },
  "QS_mulNeuromadSite[C8]": {
    "red_x_points": [
      [-0.00144, 2],
      [-0.00375, 0],
      [-0.00376, 0],
      [-0.00375, 0],
      [-0.0046, 0],
      [-0.00362, 0],
      [-0.00375, 0],
      [-0.00134, 2],
      [-0.00353, 0],
      [-0.00375, 0],
      [-0.00341, 0],
      [-0.00155, 2],
      [0.00588, 1],
      [-0.00104, 2],
      [-0.00428, 0],
      [-0.00164, 2],
      [-0.00352, 0],
      [-0.00426, 0],
      [-0.00129, 2],
      [-0.00145, 2],
      [-0.001, 2],
      [-0.00316, 0],
      [-0.00115, 2],
      [-0.00195, 2],
      [-0.00177, 2],
      [-0.00395, 0],
      [-0.0012, 2],
      [-0.00365, 0],
      [-0.00121, 2],
      [0.00771, 1],
      [-0.00367, 0]
    ],
    "red_o_points": [],
    "y_categories": ["N", "NOT APPLICABLE", "nan"],
    "blue_o_points": [],
    "blue_x_points": [
      [0.01436, 1],
      [0.00061, 2],
      [0.00793, 1],
      [0.00038, 0],
      [0.00011, 2],
      [0.0081, 1],
      [0.00932, 1]
    ]
  },
  "QS_mulGraftNerve[Ph]": {
    "red_x_points": [
      [-0.00031, 2],
      [-0.00048, 0],
      [-0.00064, 0],
      [-0.00059, 0],
      [-0.00055, 0],
      [-0.00051, 0],
      [-0.00066, 0],
      [-0.00019, 2],
      [-0.00064, 0],
      [-0.00058, 0],
      [-0.00062, 0],
      [-0.00014, 2],
      [0.00132, 1],
      [-0.00032, 2],
      [-0.00054, 0],
      [-0.00028, 2],
      [-0.00048, 0],
      [-0.00061, 0],
      [-0.00025, 2],
      [-0.00026, 2],
      [-0.00023, 2],
      [-0.00062, 0],
      [-0.0002, 2],
      [-0.00022, 2],
      [-0.00014, 2],
      [-0.0006, 0],
      [-0.00022, 2],
      [-0.0007, 0],
      [-0.00019, 2],
      [0.00079, 1],
      [-0.00039, 0]
    ],
    "red_o_points": [],
    "y_categories": ["N", "NOT APPLICABLE", "nan"],
    "blue_o_points": [],
    "blue_x_points": [
      [0.00197, 1],
      [5e-5, 2],
      [0.00149, 1],
      [-0.00015, 0],
      [0.0, 2],
      [0.00083, 1],
      [0.00185, 1]
    ]
  },
  "QS_mulTransfSite[AcSsPA]": {
    "red_x_points": [
      [-0.00054, 3],
      [-0.00081, 0],
      [-0.00092, 0],
      [-0.00083, 0],
      [-0.00094, 0],
      [-0.00102, 0],
      [-0.00085, 0],
      [-0.00054, 3],
      [-0.00095, 0],
      [-0.00071, 0],
      [-0.00092, 0],
      [-0.0006, 3],
      [0.00244, 1],
      [-0.00054, 3],
      [-0.00083, 0],
      [-0.00052, 3],
      [-0.00235, 2],
      [-0.00086, 0],
      [-0.00054, 3],
      [-0.0005, 3],
      [-0.00057, 3],
      [-0.00074, 0],
      [-0.00047, 3],
      [-0.00047, 3],
      [-0.00047, 3],
      [-0.00082, 0],
      [-0.00058, 3],
      [-0.00096, 0],
      [-0.00063, 3],
      [0.00224, 1],
      [-0.00093, 0]
    ],
    "red_o_points": [],
    "y_categories": ["N", "NOT APPLICABLE", "Y", "nan"],
    "blue_o_points": [],
    "blue_x_points": [
      [0.00299, 1],
      [-0.0003, 3],
      [0.00303, 1],
      [-0.00045, 0],
      [-0.00018, 3],
      [0.00305, 1],
      [0.00304, 1]
    ]
  },
  "QA_lstPexMuscstrength[ScapulaAbducSuprot]": {
    "red_x_points": [
      [-0.00018, 0],
      [0.0003, 2],
      [-0.00051, 1],
      [-0.00042, 1],
      [-0.00017, 0],
      [-0.00039, 1],
      [-0.00084, 1],
      [-0.00076, 1],
      [-0.00029, 0],
      [-8e-5, 0],
      [-0.00037, 1],
      [-0.00045, 1],
      [0.00019, 2],
      [0.0004, 2],
      [0.00016, 2],
      [0.00056, 2],
      [0.00019, 2],
      [-4e-5, 0],
      [-0.00026, 0],
      [-0.00062, 1],
      [-0.00032, 0],
      [-0.0005, 1],
      [0.00017, 2],
      [-0.0002, 0],
      [0.0003, 2],
      [-0.00047, 1],
      [-0.00076, 1],
      [-8e-5, 0],
      [0.00033, 2],
      [0.00036, 2],
      [-0.00041, 1]
    ],
    "red_o_points": [],
    "y_categories": ["GREATER THAN OR EQUALS TO 3", "LESS THAN 3", "nan"],
    "blue_o_points": [],
    "blue_x_points": [
      [0.00015, 2],
      [0.00036, 2],
      [0.00011, 0],
      [0.0009, 2],
      [0.00058, 2],
      [0.00037, 0],
      [4e-5, 2]
    ]
  },
  "participant_code": {
    "red_x_points": [
      [-0.01871, 1],
      [-0.01918, 2],
      [-0.01936, 3],
      [-0.0188, 4],
      [-0.01974, 5],
      [-0.01843, 6],
      [-0.01876, 7],
      [-0.01857, 8],
      [-0.01927, 9],
      [-0.01904, 10],
      [-0.01922, 11],
      [-0.01908, 12],
      [-0.01913, 14],
      [-0.01838, 16],
      [-0.01904, 17],
      [-0.01913, 19],
      [-0.01913, 20],
      [-0.01876, 22],
      [-0.01838, 23],
      [-0.01922, 25],
      [-0.01782, 26],
      [-0.02016, 27],
      [-0.02006, 28],
      [-0.01857, 29],
      [-0.01913, 30],
      [-0.0181, 32],
      [-0.01927, 33],
      [-0.01834, 34],
      [-0.01764, 35],
      [-0.01885, 36],
      [-0.01866, 37]
    ],
    "red_o_points": [],
    "y_categories": [
      "P16554",
      "P18297",
      "P19283",
      "P19287",
      "P23391",
      "P31645",
      "P31691",
      "P34778",
      "P35046",
      "P36328",
      "P43633",
      "P4544",
      "P46417",
      "P48965",
      "P53068",
      "P5497",
      "P59529",
      "P62483",
      "P64658",
      "P65202",
      "P66816",
      "P6751",
      "P7408",
      "P75566",
      "P76226",
      "P79971",
      "P82621",
      "P82990",
      "P84932",
      "P85825",
      "P86989",
      "P8770",
      "P87791",
      "P90550",
      "P93159",
      "P94969",
      "P96710",
      "P9744",
      "nan"
    ],
    "blue_o_points": [],
    "blue_x_points": [
      [0.05458, 0],
      [0.05703, 13],
      [0.05902, 15],
      [0.05258, 18],
      [0.05519, 21],
      [0.05182, 24],
      [0.05412, 31]
    ]
  },
  "QA_lstPexMuscstrength[ShoulderExrot]": {
    "red_x_points": [
      [-0.00209, 1],
      [0.00023, 2],
      [0.00262, 0],
      [-0.00183, 1],
      [-0.00195, 1],
      [-0.00177, 1],
      [0.00014, 2],
      [-0.00209, 1],
      [-0.00195, 1],
      [-0.00178, 1],
      [0.0002, 2],
      [-0.00186, 1],
      [-0.00079, 2],
      [0.00016, 2],
      [0.00018, 2],
      [0.0002, 2],
      [0.0002, 2],
      [-0.0021, 1],
      [-0.00187, 1],
      [-0.00193, 1],
      [-0.00196, 1],
      [0.0002, 2],
      [0.0001, 2],
      [0.00019, 2],
      [0.00018, 2],
      [-0.00203, 1],
      [0.00018, 2],
      [0.00275, 0],
      [0.0001, 2],
      [-0.00071, 2],
      [-0.00187, 1]
    ],
    "red_o_points": [],
    "y_categories": ["GREATER THAN OR EQUALS TO 3", "LESS THAN 3", "nan"],
    "blue_o_points": [],
    "blue_x_points": [
      [-0.00011, 2],
      [0.00021, 2],
      [0.0054, 0],
      [0.00035, 2],
      [0.00021, 2],
      [0.00558, 0],
      [0.0002, 1]
    ]
  },
  "QA_mulInjOrthesisType[ArmSling]": {
    "red_x_points": [
      [-0.01233, 2],
      [-0.01124, 2],
      [-0.01183, 2],
      [-0.01099, 2],
      [-0.01156, 2],
      [-0.01145, 2],
      [-0.01113, 2],
      [-0.01215, 2],
      [-0.01153, 2],
      [-0.0104, 2],
      [-0.0113, 2],
      [-0.01216, 2],
      [0.03072, 1],
      [-0.01199, 2],
      [-0.01135, 2],
      [-0.01155, 2],
      [-0.01325, 0],
      [-0.01145, 2],
      [-0.01259, 2],
      [-0.01175, 2],
      [-0.01451, 0],
      [-0.01344, 3],
      [-0.01186, 2],
      [0.03162, 1],
      [-0.01234, 2],
      [-0.01119, 2],
      [-0.0116, 2],
      [-0.01108, 2],
      [-0.01371, 3],
      [-0.02071, 3],
      [-0.01163, 2]
    ],
    "red_o_points": [],
    "y_categories": ["N", "NOT APPLICABLE", "Y", "nan"],
    "blue_o_points": [],
    "blue_x_points": [
      [-0.0051, 2],
      [0.03301, 1],
      [0.02934, 1],
      [0.03766, 1],
      [0.03418, 1],
      [0.0298, 1],
      [0.03246, 1]
    ]
  },
  "QS_mulGraftNerve[Ul]": {
    "red_x_points": [
      [-0.0001, 2],
      [-0.00041, 0],
      [-0.00039, 0],
      [-0.00043, 0],
      [-0.00042, 0],
      [-0.00039, 0],
      [-0.00044, 0],
      [-0.00012, 2],
      [-0.00044, 0],
      [-0.00043, 0],
      [-0.00052, 0],
      [-0.00011, 2],
      [0.00063, 1],
      [-0.00015, 2],
      [-0.00055, 0],
      [-0.0001, 2],
      [-0.00031, 0],
      [-0.00046, 0],
      [-0.00011, 2],
      [-0.00012, 2],
      [-3e-5, 2],
      [-0.00042, 0],
      [-9e-5, 2],
      [-4e-5, 2],
      [-0.00014, 2],
      [-0.00052, 0],
      [-0.00014, 2],
      [-0.00042, 0],
      [-4e-5, 2],
      [0.00086, 1],
      [-0.00051, 0]
    ],
    "red_o_points": [],
    "y_categories": ["N", "NOT APPLICABLE", "nan"],
    "blue_o_points": [],
    "blue_x_points": [
      [0.00171, 1],
      [2e-5, 2],
      [0.00105, 1],
      [-1e-5, 0],
      [0.0, 2],
      [0.00092, 1],
      [0.00103, 1]
    ]
  },
  "QS_mulGraftNerve[Ssr]": {
    "red_x_points": [
      [-2e-5, 2],
      [-0.0, 0],
      [-0.0, 0],
      [-0.0, 0],
      [-0.0, 0],
      [-2e-5, 2],
      [-0.0, 0],
      [-0.0, 0],
      [5e-5, 1],
      [-2e-5, 2],
      [-0.0, 0],
      [-0.0, 0],
      [-2e-5, 2],
      [-2e-5, 2],
      [-2e-5, 2],
      [-2e-5, 2],
      [-2e-5, 2],
      [-2e-5, 2],
      [-0.0, 0],
      [-2e-5, 2],
      [-2e-5, 2],
      [5e-5, 1],
      [-0.0, 0]
    ],
    "red_o_points": [],
    "y_categories": ["N", "NOT APPLICABLE", "nan"],
    "blue_o_points": [],
    "blue_x_points": [[5e-5, 1], [-0.0, 0], [-2e-5, 2], [5e-5, 1]]
  },
  "QA_yonInjUnconscio": {
    "red_x_points": [
      [-0.00342, 1],
      [-0.00357, 1],
      [-0.00157, 2],
      [-0.00163, 2],
      [0.00754, 0],
      [-0.00413, 1],
      [-0.00219, 2],
      [-0.00441, 2],
      [-0.00216, 2],
      [-0.00131, 2],
      [-0.00432, 1],
      [-0.00361, 1],
      [-0.02343, 1],
      [-0.00474, 2],
      [-0.00208, 2],
      [-0.00409, 2],
      [-0.00357, 1],
      [0.00685, 0],
      [-0.00306, 1],
      [-0.00379, 1],
      [-0.00341, 1],
      [-0.0039, 1],
      [-0.00351, 2],
      [-0.00773, 1],
      [-0.00392, 2],
      [-0.00419, 1],
      [0.00878, 0],
      [-0.00303, 1],
      [-0.00424, 2],
      [-0.0004, 2],
      [-0.00344, 1]
    ],
    "red_o_points": [],
    "y_categories": ["N", "Y", "nan"],
    "blue_o_points": [],
    "blue_x_points": [
      [0.00111, 2],
      [-0.00059, 1],
      [0.01242, 0],
      [0.01847, 0],
      [0.02055, 0],
      [0.00234, 2],
      [0.00211, 2]
    ]
  },
  "QS_mulGraftNerve[MCA]": {
    "red_x_points": [
      [-5e-5, 2],
      [-4e-5, 0],
      [-2e-5, 0],
      [-2e-5, 0],
      [-4e-5, 0],
      [-2e-5, 0],
      [-4e-5, 0],
      [-5e-5, 2],
      [-4e-5, 0],
      [-4e-5, 0],
      [-4e-5, 0],
      [-7e-5, 2],
      [-7e-5, 2],
      [-2e-5, 0],
      [-7e-5, 2],
      [-2e-5, 0],
      [-2e-5, 0],
      [-2e-5, 2],
      [-5e-5, 2],
      [-5e-5, 2],
      [-5e-5, 2],
      [-5e-5, 2],
      [-7e-5, 2],
      [-4e-5, 0],
      [-2e-5, 2],
      [-2e-5, 0],
      [-5e-5, 2],
      [0.00012, 1],
      [-4e-5, 0]
    ],
    "red_o_points": [],
    "y_categories": ["N", "NOT APPLICABLE", "nan"],
    "blue_o_points": [],
    "blue_x_points": [[0.00018, 1], [0.00012, 1], [-2e-5, 0], [0.00012, 1]]
  },
  "QA_lstPexInspectio[SurgicalScar]": {
    "red_x_points": [
      [0.00186, 1],
      [0.00114, 1],
      [-0.00026, 0],
      [0.00091, 1],
      [-0.00429, 2],
      [-0.00027, 0],
      [0.00125, 1],
      [0.00159, 1],
      [0.00103, 1],
      [-0.00257, 2],
      [0.00106, 1],
      [-0.00208, 0],
      [-0.00074, 1],
      [-0.00506, 2],
      [0.00127, 1],
      [0.00221, 1],
      [-0.0011, 0],
      [-0.00402, 2],
      [-0.00446, 2],
      [-0.00421, 2],
      [0.002, 1],
      [0.00091, 1],
      [-0.00504, 2],
      [-0.01374, 2],
      [0.00163, 1],
      [0.00093, 1],
      [-0.00573, 2],
      [-0.00286, 2],
      [0.00181, 1],
      [-0.00042, 1],
      [-0.00255, 2]
    ],
    "red_o_points": [],
    "y_categories": ["ABS", "NAIA", "PT", "nan"],
    "blue_o_points": [],
    "blue_x_points": [
      [0.00064, 1],
      [0.004, 1],
      [0.0052, 0],
      [0.00401, 1],
      [0.00563, 1],
      [0.00072, 1],
      [0.00532, 0]
    ]
  },
  "QS_mulGraftNerve[Me]": {
    "red_x_points": [
      [-0.00017, 2],
      [-0.0003, 0],
      [-0.00033, 0],
      [-0.00036, 0],
      [-0.00031, 0],
      [-0.00041, 0],
      [-0.00033, 0],
      [-0.00011, 2],
      [-0.00032, 0],
      [-0.00025, 0],
      [-0.00038, 0],
      [-0.00016, 2],
      [0.00061, 1],
      [-0.00013, 2],
      [-0.00035, 0],
      [-0.00013, 2],
      [-0.00019, 0],
      [-0.00024, 0],
      [-0.00012, 2],
      [-0.00014, 2],
      [-7e-5, 2],
      [-0.00027, 0],
      [-0.00013, 2],
      [-7e-5, 2],
      [-0.00015, 2],
      [-0.00036, 0],
      [-0.00012, 2],
      [-0.00034, 0],
      [-0.0001, 2],
      [0.00064, 1],
      [-0.0003, 0]
    ],
    "red_o_points": [],
    "y_categories": ["N", "NOT APPLICABLE", "nan"],
    "blue_o_points": [],
    "blue_x_points": [
      [0.00202, 1],
      [-0.00011, 2],
      [0.00093, 1],
      [-0.00021, 0],
      [-3e-5, 2],
      [0.00074, 1],
      [0.00057, 1]
    ]
  },
  "QS_mulGraftNerve[Ax]": {
    "red_x_points": [
      [4e-5, 2],
      [-0.00035, 0],
      [-0.00045, 0],
      [-0.00036, 0],
      [-0.0003, 0],
      [-0.00039, 0],
      [-0.0004, 0],
      [-1e-5, 2],
      [-0.00036, 0],
      [-0.00045, 0],
      [-0.00017, 0],
      [-5e-5, 2],
      [0.00048, 1],
      [-6e-5, 2],
      [-0.00045, 0],
      [-2e-5, 2],
      [-0.0003, 0],
      [-0.00039, 0],
      [-5e-5, 2],
      [-3e-5, 2],
      [3e-5, 2],
      [-0.00035, 0],
      [-4e-5, 2],
      [-7e-5, 2],
      [-5e-5, 2],
      [-0.00034, 0],
      [0.0, 2],
      [-0.00038, 0],
      [-0.0, 2],
      [0.00078, 1],
      [-0.00036, 0]
    ],
    "red_o_points": [],
    "y_categories": ["N", "NOT APPLICABLE", "nan"],
    "blue_o_points": [],
    "blue_x_points": [
      [0.00095, 1],
      [9e-5, 2],
      [0.00068, 1],
      [3e-5, 0],
      [0.00021, 2],
      [0.00061, 1],
      [0.00067, 1]
    ]
  },
  "QS_mulLysisSite[Trunk]": {
    "red_x_points": [
      [-0.00162, 3],
      [-0.00239, 0],
      [-0.00246, 0],
      [-0.00226, 0],
      [-0.00261, 0],
      [-0.00509, 2],
      [-0.00246, 0],
      [-0.00174, 3],
      [-0.00243, 0],
      [-0.00251, 0],
      [-0.00264, 0],
      [-0.00167, 3],
      [0.007, 1],
      [-0.00155, 3],
      [-0.00232, 0],
      [-0.00191, 3],
      [-0.00493, 2],
      [-0.00284, 0],
      [-0.00169, 3],
      [-0.00173, 3],
      [-0.00163, 3],
      [-0.00238, 0],
      [-0.00165, 3],
      [-0.00154, 3],
      [-0.00167, 3],
      [-0.00257, 0],
      [-0.00166, 3],
      [-0.00231, 0],
      [-0.0014, 3],
      [0.00762, 1],
      [-0.00518, 2]
    ],
    "red_o_points": [],
    "y_categories": ["N", "NOT APPLICABLE", "Y", "nan"],
    "blue_o_points": [],
    "blue_x_points": [
      [0.01175, 1],
      [-0.00065, 3],
      [0.00832, 1],
      [-0.00143, 0],
      [-0.00052, 3],
      [0.00942, 1],
      [0.00937, 1]
    ]
  },
  "QS_mulGraftTrunk[UpperTrunk]": {
    "red_x_points": [
      [-0.00067, 3],
      [-0.00135, 0],
      [-0.0017, 0],
      [-0.00132, 0],
      [-0.00124, 0],
      [-0.00134, 0],
      [-0.00133, 0],
      [-0.00065, 3],
      [-0.00148, 0],
      [-0.00136, 0],
      [-0.00139, 0],
      [-0.00069, 3],
      [0.00262, 1],
      [-0.00061, 3],
      [-0.00335, 2],
      [-0.00089, 3],
      [-0.00134, 0],
      [-0.00121, 0],
      [-0.00059, 3],
      [-0.00065, 3],
      [-0.00077, 3],
      [-0.00122, 0],
      [-0.00075, 3],
      [-0.00069, 3],
      [-0.00086, 3],
      [-0.00111, 0],
      [-0.00042, 3],
      [-0.00157, 0],
      [-0.00059, 3],
      [0.0029, 1],
      [-0.00124, 0]
    ],
    "red_o_points": [],
    "y_categories": ["N", "NOT APPLICABLE", "Y", "nan"],
    "blue_o_points": [],
    "blue_x_points": [
      [0.00561, 1],
      [-3e-5, 3],
      [0.00382, 1],
      [-0.00045, 0],
      [-0.00014, 3],
      [0.00368, 1],
      [0.00465, 1]
    ]
  },
  "QS_mulTransfSite[PhMc]": {
    "red_x_points": [
      [-0.00126, 3],
      [-0.0026, 0],
      [-0.00207, 0],
      [-0.00236, 0],
      [-0.00287, 0],
      [-0.00239, 0],
      [-0.00483, 2],
      [-0.00114, 3],
      [-0.00233, 0],
      [-0.00278, 0],
      [-0.00238, 0],
      [-0.00146, 3],
      [0.00758, 1],
      [-0.00107, 3],
      [-0.00268, 0],
      [-0.00123, 3],
      [-0.00248, 0],
      [-0.00253, 0],
      [-0.0014, 3],
      [-0.00132, 3],
      [-0.00125, 3],
      [-0.00424, 2],
      [-0.00126, 3],
      [-0.00137, 3],
      [-0.00117, 3],
      [-0.0026, 0],
      [-0.00117, 3],
      [-0.00241, 0],
      [-0.00112, 3],
      [0.00655, 1],
      [-0.00226, 0]
    ],
    "red_o_points": [],
    "y_categories": ["N", "NOT APPLICABLE", "Y", "nan"],
    "blue_o_points": [],
    "blue_x_points": [
      [0.00896, 1],
      [-0.0003, 3],
      [0.0073, 1],
      [-0.00169, 0],
      [-0.00031, 3],
      [0.0066, 1],
      [0.00796, 1]
    ]
  },
  "QA_mulInjTbpiCause[Motorcycle]": {
    "red_x_points": [
      [0.00104, 0],
      [-0.00078, 1],
      [-0.0017, 1],
      [-0.00083, 1],
      [-0.00168, 1],
      [-0.0008, 1],
      [-0.00081, 1],
      [-0.00079, 1],
      [-0.00092, 1],
      [-0.00097, 1],
      [-0.00068, 1],
      [-0.00052, 0],
      [-0.0353, 1],
      [-0.00099, 1],
      [-0.00116, 1],
      [-0.00094, 1],
      [-0.00078, 1],
      [-0.00189, 1],
      [0.00043, 0],
      [-0.0006, 1],
      [-0.00058, 1],
      [-0.00081, 1],
      [-0.00086, 1],
      [-0.00238, 1],
      [0.00146, 0],
      [-0.00068, 1],
      [-0.00053, 1],
      [-0.00074, 1],
      [-0.00081, 1],
      [-0.03096, 1],
      [-0.00057, 1]
    ],
    "red_o_points": [],
    "y_categories": ["N", "Y", "nan"],
    "blue_o_points": [],
    "blue_x_points": [
      [0.0149, 0],
      [-0.00075, 1],
      [0.01438, 0],
      [-0.00198, 1],
      [0.0007, 1],
      [0.01459, 0],
      [0.01575, 0]
    ]
  },
  "QS_mulLysisRoot[C6]": {
    "red_x_points": [
      [-0.00082, 3],
      [-0.00192, 0],
      [-0.00381, 2],
      [-0.00186, 0],
      [-0.00195, 0],
      [-0.00192, 0],
      [-0.00189, 0],
      [-0.00083, 3],
      [-0.00194, 0],
      [-0.00182, 0],
      [-0.00185, 0],
      [-0.00077, 3],
      [0.00576, 1],
      [-0.00094, 3],
      [-0.00182, 0],
      [-0.00078, 3],
      [-0.00168, 0],
      [-0.00171, 0],
      [-0.00081, 3],
      [-0.0009, 3],
      [-0.00089, 3],
      [-0.00183, 0],
      [-0.00102, 3],
      [-0.00095, 3],
      [-0.00087, 3],
      [-0.00175, 0],
      [-0.00081, 3],
      [-0.00187, 0],
      [-0.00087, 3],
      [0.0055, 1],
      [-0.00309, 2]
    ],
    "red_o_points": [],
    "y_categories": ["N", "NOT APPLICABLE", "Y", "nan"],
    "blue_o_points": [],
    "blue_x_points": [
      [0.00593, 1],
      [-0.00055, 3],
      [0.00587, 1],
      [-0.00158, 0],
      [-0.00054, 3],
      [0.00527, 1],
      [0.00694, 1]
    ]
  },
  "QA_yonInjOrtsurg": {
    "red_x_points": [
      [-0.00414, 2],
      [-0.00034, 2],
      [1e-5, 2],
      [-0.00011, 2],
      [-1e-5, 2],
      [1e-5, 2],
      [-0.00015, 1],
      [-0.00467, 2],
      [5e-5, 0],
      [-0.00011, 1],
      [-0.00012, 1],
      [-0.00422, 2],
      [-0.00505, 0],
      [9e-5, 1],
      [-0.00021, 2],
      [-0.00513, 2],
      [-0.00012, 0],
      [1e-5, 2],
      [0.00382, 0],
      [-0.00065, 1],
      [-0.00415, 2],
      [-0.0002, 1],
      [-0.00559, 2],
      [-0.00488, 2],
      [-0.00466, 2],
      [7e-5, 0],
      [-0.00125, 1],
      [9e-5, 0],
      [-0.00431, 2],
      [-0.00189, 1],
      [-9e-5, 1]
    ],
    "red_o_points": [],
    "y_categories": ["N", "Y", "nan"],
    "blue_o_points": [],
    "blue_x_points": [
      [0.00052, 2],
      [0.00655, 1],
      [0.00069, 2],
      [0.00031, 2],
      [0.01939, 0],
      [0.0007, 2],
      [0.00071, 2]
    ]
  },
  "QS_mulGraftLevel[Trunk]": {
    "red_x_points": [
      [-0.00045, 3],
      [-0.00056, 0],
      [-0.00054, 0],
      [-0.00054, 0],
      [-0.00039, 0],
      [-0.00058, 0],
      [-0.0004, 0],
      [-0.00046, 3],
      [-0.00059, 0],
      [-0.00063, 0],
      [-0.00064, 0],
      [-0.00037, 3],
      [0.00148, 1],
      [-0.00033, 3],
      [-0.00239, 2],
      [-0.00047, 3],
      [-0.00042, 0],
      [-0.00067, 0],
      [-0.00042, 3],
      [-0.00027, 3],
      [-0.00031, 3],
      [-0.00058, 0],
      [-0.00039, 3],
      [-0.00038, 3],
      [-0.00038, 3],
      [-0.0006, 0],
      [-0.0005, 3],
      [-0.0006, 0],
      [-0.00041, 3],
      [0.00192, 1],
      [-0.00059, 0]
    ],
    "red_o_points": [],
    "y_categories": ["N", "NOT APPLICABLE", "Y", "nan"],
    "blue_o_points": [],
    "blue_x_points": [
      [0.00254, 1],
      [-0.00017, 3],
      [0.00173, 1],
      [0.00032, 0],
      [-0.00013, 3],
      [0.002, 1],
      [0.00199, 1]
    ]
  },
  "QS_mulGraftNerve[FI]": {
    "red_x_points": [
      [-0.00016, 2],
      [-0.0006, 0],
      [-0.00062, 0],
      [-0.00075, 0],
      [-0.0006, 0],
      [-0.00062, 0],
      [-0.00069, 0],
      [-0.00032, 2],
      [-0.00071, 0],
      [-0.00067, 0],
      [-0.0005, 0],
      [-0.00021, 2],
      [0.00078, 1],
      [-0.00033, 2],
      [-0.00089, 0],
      [-0.00035, 2],
      [-0.00041, 0],
      [-0.00044, 0],
      [-0.00024, 2],
      [-0.00018, 2],
      [-0.00017, 2],
      [-0.00061, 0],
      [-0.00044, 2],
      [-0.00045, 2],
      [-0.0005, 2],
      [-0.00049, 0],
      [-0.00038, 2],
      [-0.0006, 0],
      [-0.00025, 2],
      [0.00146, 1],
      [-0.00056, 0]
    ],
    "red_o_points": [],
    "y_categories": ["N", "NOT APPLICABLE", "nan"],
    "blue_o_points": [],
    "blue_x_points": [
      [0.00249, 1],
      [4e-5, 2],
      [0.00096, 1],
      [0.00012, 0],
      [-1e-5, 2],
      [0.00176, 1],
      [0.00156, 1]
    ]
  },
  "QS_mulGraftNerve[other]": {
    "red_x_points": [
      [-0.00061, 2],
      [-0.0017, 0],
      [-0.00205, 0],
      [-0.00164, 0],
      [-0.00189, 0],
      [-0.00145, 0],
      [-0.00176, 0],
      [-0.00062, 2],
      [-0.00164, 0],
      [-0.00175, 0],
      [-0.00149, 0],
      [-0.0008, 2],
      [0.00283, 1],
      [-0.00064, 2],
      [-0.00191, 0],
      [-0.00066, 2],
      [-0.00171, 0],
      [-0.00159, 0],
      [-0.00061, 2],
      [-0.00061, 2],
      [-0.0005, 2],
      [-0.00165, 0],
      [-0.00065, 2],
      [-0.00066, 2],
      [-0.00078, 2],
      [-0.00186, 0],
      [-0.00073, 2],
      [-0.00186, 0],
      [-0.0005, 2],
      [0.00326, 1],
      [-0.00164, 0]
    ],
    "red_o_points": [],
    "y_categories": ["N", "NOT APPLICABLE", "nan"],
    "blue_o_points": [],
    "blue_x_points": [
      [0.00667, 1],
      [-9e-5, 2],
      [0.00408, 1],
      [-0.0, 0],
      [1e-5, 2],
      [0.00362, 1],
      [0.00498, 1]
    ]
  },
  "QS_mulTransfSite[AcSsAA]": {
    "red_x_points": [
      [-0.00259, 3],
      [-0.00785, 2],
      [-0.00342, 0],
      [-0.0075, 2],
      [-0.00829, 2],
      [-0.00331, 0],
      [-0.00314, 0],
      [-0.00234, 3],
      [-0.00313, 0],
      [-0.00824, 2],
      [-0.00332, 0],
      [-0.00243, 3],
      [0.01401, 1],
      [-0.00272, 3],
      [-0.00952, 2],
      [-0.00276, 3],
      [-0.00291, 0],
      [-0.00296, 0],
      [-0.00261, 3],
      [-0.00248, 3],
      [-0.0027, 3],
      [-0.00789, 2],
      [-0.00283, 3],
      [-0.00251, 3],
      [-0.00288, 3],
      [-0.00297, 0],
      [-0.00274, 3],
      [-0.00822, 2],
      [-0.00281, 3],
      [0.01414, 1],
      [-0.00312, 0]
    ],
    "red_o_points": [],
    "y_categories": ["N", "NOT APPLICABLE", "Y", "nan"],
    "blue_o_points": [],
    "blue_x_points": [
      [0.01886, 1],
      [-0.00127, 3],
      [0.01487, 1],
      [-0.00027, 0],
      [-0.00112, 3],
      [0.01322, 1],
      [0.01516, 1]
    ]
  },
  "QS_mulGraftNerve[LP]": {
    "red_x_points": [
      [-3e-5, 2],
      [-5e-5, 0],
      [-5e-5, 0],
      [-5e-5, 0],
      [-3e-5, 2],
      [-5e-5, 0],
      [-5e-5, 0],
      [-5e-5, 0],
      [-3e-5, 2],
      [-3e-5, 2],
      [-5e-5, 0],
      [-5e-5, 0],
      [-5e-5, 0],
      [-3e-5, 2],
      [-3e-5, 2],
      [-5e-5, 0],
      [-3e-5, 2],
      [-3e-5, 2],
      [-3e-5, 2],
      [-5e-5, 0],
      [-5e-5, 0],
      [-3e-5, 2],
      [0.00012, 1]
    ],
    "red_o_points": [],
    "y_categories": ["N", "NOT APPLICABLE", "nan"],
    "blue_o_points": [],
    "blue_x_points": [
      [0.00012, 1],
      [-3e-5, 2],
      [0.00012, 1],
      [0.00012, 1],
      [0.00012, 1]
    ]
  },
  "QA_lstPexMuscstrength[WristFlex]": {
    "red_x_points": [
      [-0.00374, 1],
      [-0.00041, 2],
      [-0.00141, 1],
      [-0.00162, 1],
      [0.00026, 0],
      [0.00072, 0],
      [-0.00178, 1],
      [-0.00201, 0],
      [0.00079, 0],
      [0.00027, 0],
      [0.00055, 0],
      [-0.00148, 0],
      [-0.00078, 2],
      [0.00219, 2],
      [-7e-5, 2],
      [-0.00144, 0],
      [-8e-5, 2],
      [0.00031, 0],
      [-0.00107, 0],
      [-0.00285, 1],
      [-0.00177, 0],
      [-0.00176, 1],
      [0.00188, 2],
      [-0.00875, 1],
      [-0.00161, 0],
      [0.00033, 0],
      [-0.00331, 1],
      [0.00031, 0],
      [0.00169, 2],
      [-3e-5, 2],
      [-0.00117, 1]
    ],
    "red_o_points": [],
    "y_categories": ["GREATER THAN OR EQUALS TO 3", "LESS THAN 3", "nan"],
    "blue_o_points": [],
    "blue_x_points": [
      [0.00061, 0],
      [0.0036, 2],
      [0.00104, 0],
      [0.00322, 0],
      [0.00411, 2],
      [0.00183, 0],
      [0.0015, 0]
    ]
  },
  "QS_mulNeuromadSite[C5]": {
    "red_x_points": [
      [-0.001, 2],
      [-0.00421, 0],
      [-0.00383, 0],
      [-0.0037, 0],
      [-0.00349, 0],
      [-0.00368, 0],
      [-0.00336, 0],
      [-0.0011, 2],
      [-0.00347, 0],
      [-0.00361, 0],
      [-0.00337, 0],
      [-0.00105, 2],
      [0.00589, 1],
      [-0.00109, 2],
      [-0.00365, 0],
      [-0.00159, 2],
      [-0.00301, 0],
      [-0.00364, 0],
      [-0.00132, 2],
      [-0.00098, 2],
      [-0.00105, 2],
      [-0.00305, 0],
      [-0.00114, 2],
      [-0.0013, 2],
      [-0.00112, 2],
      [-0.00358, 0],
      [-0.00126, 2],
      [-0.0038, 0],
      [-0.00079, 2],
      [0.00622, 1],
      [-0.00374, 0]
    ],
    "red_o_points": [],
    "y_categories": ["N", "NOT APPLICABLE", "nan"],
    "blue_o_points": [],
    "blue_x_points": [
      [0.01348, 1],
      [0.00018, 2],
      [0.00756, 1],
      [0.00065, 0],
      [-0.00031, 2],
      [0.00773, 1],
      [0.00833, 1]
    ]
  },
  "QS_mulNeuromadSite[C7]": {
    "red_x_points": [
      [-0.00101, 2],
      [-0.00266, 0],
      [-0.00267, 0],
      [-0.00299, 0],
      [-0.00258, 0],
      [-0.0025, 0],
      [-0.00286, 0],
      [-0.00116, 2],
      [-0.00269, 0],
      [-0.00279, 0],
      [-0.00286, 0],
      [-0.0011, 2],
      [0.0048, 1],
      [-0.00117, 2],
      [-0.00292, 0],
      [-0.00124, 2],
      [-0.00253, 0],
      [-0.00321, 0],
      [-0.0012, 2],
      [-0.00096, 2],
      [-0.00075, 2],
      [-0.00247, 0],
      [-0.00108, 2],
      [-0.0014, 2],
      [-0.0012, 2],
      [-0.00269, 0],
      [-0.00117, 2],
      [-0.00233, 0],
      [-0.0009, 2],
      [0.00587, 1],
      [-0.00257, 0]
    ],
    "red_o_points": [],
    "y_categories": ["N", "NOT APPLICABLE", "nan"],
    "blue_o_points": [],
    "blue_x_points": [
      [0.01147, 1],
      [-0.00045, 2],
      [0.00584, 1],
      [6e-5, 0],
      [-0.00018, 2],
      [0.00617, 1],
      [0.00711, 1]
    ]
  },
  "QA_lstPexMuscstrength[WristExte]": {
    "red_x_points": [
      [-0.00306, 1],
      [-0.00029, 2],
      [-0.00142, 1],
      [-0.00148, 1],
      [0.00068, 0],
      [-0.00135, 1],
      [-0.0015, 1],
      [-0.00124, 0],
      [0.00117, 0],
      [0.00048, 0],
      [-0.00171, 1],
      [-0.00127, 0],
      [-0.00146, 2],
      [0.00179, 2],
      [-0.00016, 2],
      [-0.00142, 0],
      [6e-5, 2],
      [0.00068, 0],
      [-0.00079, 0],
      [-0.00288, 1],
      [-0.00178, 0],
      [-0.00162, 1],
      [0.00151, 2],
      [-0.00091, 0],
      [-0.00291, 1],
      [0.00078, 0],
      [-0.00248, 1],
      [0.00042, 0],
      [0.0016, 2],
      [-0.00147, 2],
      [-0.00142, 1]
    ],
    "red_o_points": [],
    "y_categories": ["GREATER THAN OR EQUALS TO 3", "LESS THAN 3", "nan"],
    "blue_o_points": [],
    "blue_x_points": [
      [0.00132, 0],
      [0.00393, 2],
      [0.00083, 0],
      [0.00194, 0],
      [0.00419, 2],
      [0.00075, 1],
      [0.00103, 0]
    ]
  },
  "QA_lstPexMuscstrength[ElbowExte]": {
    "red_x_points": [
      [-0.00261, 1],
      [-1e-5, 2],
      [2e-5, 1],
      [-2e-5, 1],
      [-0.00156, 0],
      [0.00011, 1],
      [2e-5, 1],
      [-0.00256, 1],
      [-0.00118, 0],
      [-0.00046, 0],
      [3e-5, 1],
      [-0.00256, 1],
      [4e-5, 2],
      [0.00288, 2],
      [-1e-5, 2],
      [-0.00266, 1],
      [4e-5, 2],
      [0.00034, 1],
      [-0.00217, 0],
      [-0.00247, 1],
      [-0.00248, 0],
      [-2e-5, 1],
      [0.00238, 2],
      [-0.00215, 0],
      [-0.00287, 0],
      [0.00032, 1],
      [-0.00167, 1],
      [-0.00027, 2],
      [-0.00244, 1],
      [-2e-5, 1]
    ],
    "red_o_points": [],
    "y_categories": ["GREATER THAN OR EQUALS TO 3", "LESS THAN 3", "nan"],
    "blue_o_points": [],
    "blue_x_points": [
      [0.00013, 2],
      [0.00629, 2],
      [0.00136, 1],
      [0.00692, 2],
      [5e-5, 0]
    ]
  },
  "QS_mulGraftNerve[SS]": {
    "red_x_points": [
      [-5e-5, 2],
      [-0.00014, 0],
      [-0.00011, 0],
      [-0.00013, 0],
      [-0.00011, 0],
      [-0.00017, 0],
      [-0.0001, 0],
      [-0.00022, 2],
      [-0.00027, 0],
      [-0.00025, 0],
      [-5e-5, 0],
      [-0.00011, 2],
      [0.00043, 1],
      [-7e-5, 2],
      [-0.0002, 0],
      [-0.00021, 2],
      [-0.00023, 0],
      [-0.00019, 0],
      [-7e-5, 2],
      [-8e-5, 2],
      [-9e-5, 2],
      [-0.00015, 0],
      [-0.00012, 2],
      [-7e-5, 2],
      [-0.00016, 2],
      [-0.0001, 0],
      [-0.0001, 2],
      [-0.00016, 0],
      [-0.00017, 2],
      [0.0003, 1],
      [-0.00016, 0]
    ],
    "red_o_points": [],
    "y_categories": ["N", "NOT APPLICABLE", "nan"],
    "blue_o_points": [],
    "blue_x_points": [
      [0.00107, 1],
      [-3e-5, 2],
      [0.00022, 1],
      [-6e-5, 0],
      [-2e-5, 2],
      [0.00043, 1],
      [0.00062, 1]
    ]
  },
  "QS_mulNeuromadSite[C6]": {
    "red_x_points": [
      [-0.00049, 2],
      [-0.00228, 0],
      [-0.00238, 0],
      [-0.0023, 0],
      [-0.00259, 0],
      [-0.00246, 0],
      [-0.00221, 0],
      [-0.00065, 2],
      [-0.00249, 0],
      [-0.00254, 0],
      [-0.0024, 0],
      [-0.00063, 2],
      [0.0044, 1],
      [-0.00044, 2],
      [-0.0024, 0],
      [-0.00053, 2],
      [-0.00268, 0],
      [-0.00233, 0],
      [-0.00046, 2],
      [-0.00047, 2],
      [-0.00026, 2],
      [-0.00224, 0],
      [-0.0007, 2],
      [-0.0005, 2],
      [-0.00062, 2],
      [-0.00234, 0],
      [-0.00047, 2],
      [-0.0021, 0],
      [-0.00037, 2],
      [0.00462, 1],
      [-0.00227, 0]
    ],
    "red_o_points": [],
    "y_categories": ["N", "NOT APPLICABLE", "nan"],
    "blue_o_points": [],
    "blue_x_points": [
      [0.00776, 1],
      [0.0003, 2],
      [0.00433, 1],
      [7e-5, 0],
      [-4e-5, 2],
      [0.00514, 1],
      [0.00631, 1]
    ]
  },
  "QS_mulLysisSite[Nerve]": {
    "red_x_points": [
      [-0.00025, 3],
      [-0.00034, 0],
      [-0.00114, 2],
      [-0.00025, 0],
      [-0.00027, 0],
      [-0.00035, 0],
      [-0.0003, 0],
      [-0.00024, 3],
      [-0.00032, 0],
      [-0.00035, 0],
      [-0.00031, 0],
      [-0.00039, 3],
      [0.00101, 1],
      [-0.00025, 3],
      [-0.00035, 0],
      [-0.00028, 3],
      [-0.0003, 0],
      [-0.00028, 0],
      [-0.00033, 3],
      [-0.00037, 3],
      [-0.00028, 3],
      [-0.00032, 0],
      [-0.00037, 3],
      [-0.00032, 3],
      [-0.00029, 3],
      [-0.00027, 0],
      [-0.0004, 3],
      [-0.00038, 0],
      [-0.00033, 3],
      [0.0013, 1],
      [-0.00035, 0]
    ],
    "red_o_points": [],
    "y_categories": ["N", "NOT APPLICABLE", "Y", "nan"],
    "blue_o_points": [],
    "blue_x_points": [
      [0.00185, 1],
      [-8e-5, 3],
      [0.00098, 1],
      [-0.00034, 0],
      [-0.00016, 3],
      [0.00141, 1],
      [0.00161, 1]
    ]
  },
  "QS_mulGraftNerve[TD]": {
    "red_x_points": [
      [-7e-5, 2],
      [-9e-5, 0],
      [-9e-5, 0],
      [-9e-5, 0],
      [-8e-5, 0],
      [-9e-5, 0],
      [-9e-5, 0],
      [-9e-5, 2],
      [-0.00014, 0],
      [-0.00014, 0],
      [-9e-5, 0],
      [-0.0001, 2],
      [0.0003, 1],
      [-6e-5, 2],
      [-9e-5, 0],
      [-6e-5, 2],
      [-9e-5, 0],
      [-0.00017, 0],
      [-7e-5, 2],
      [-7e-5, 2],
      [-4e-5, 2],
      [-9e-5, 0],
      [-7e-5, 2],
      [-4e-5, 2],
      [-6e-5, 2],
      [-9e-5, 0],
      [-4e-5, 2],
      [-5e-5, 0],
      [-1e-5, 2],
      [0.0003, 1],
      [-0.00014, 0]
    ],
    "red_o_points": [],
    "y_categories": ["N", "NOT APPLICABLE", "nan"],
    "blue_o_points": [],
    "blue_x_points": [
      [0.0003, 1],
      [-7e-5, 2],
      [0.0003, 1],
      [-1e-5, 2],
      [0.0002, 1],
      [0.00047, 1]
    ]
  },
  "QS_mulLysisRoot[C7]": {
    "red_x_points": [
      [-0.00025, 3],
      [-0.00049, 0],
      [-0.00131, 2],
      [-0.00061, 0],
      [-0.00062, 0],
      [-0.00064, 0],
      [-0.00065, 0],
      [-0.00032, 3],
      [-0.00052, 0],
      [-0.00062, 0],
      [-0.00064, 0],
      [-0.0003, 3],
      [0.002, 1],
      [-0.0003, 3],
      [-0.00051, 0],
      [-0.00033, 3],
      [-0.00051, 0],
      [-0.00058, 0],
      [-0.00035, 3],
      [-0.00032, 3],
      [-0.00025, 3],
      [-0.00063, 0],
      [-0.0002, 3],
      [-0.00035, 3],
      [-0.00027, 3],
      [-0.00059, 0],
      [-0.00033, 3],
      [-0.00048, 0],
      [-0.00014, 3],
      [0.00195, 1],
      [-0.00058, 0]
    ],
    "red_o_points": [],
    "y_categories": ["N", "NOT APPLICABLE", "Y", "nan"],
    "blue_o_points": [],
    "blue_x_points": [
      [0.00163, 1],
      [-0.00011, 3],
      [0.00152, 1],
      [-0.00071, 0],
      [-0.00012, 3],
      [0.00198, 1],
      [0.00187, 1]
    ]
  },
  "QS_mulTransfSite[IMc]": {
    "red_x_points": [
      [-0.00238, 3],
      [-0.00646, 2],
      [-0.00344, 0],
      [-0.00317, 0],
      [-0.00389, 0],
      [-0.00343, 0],
      [-0.00368, 0],
      [-0.00229, 3],
      [-0.00316, 0],
      [-0.00341, 0],
      [-0.00355, 0],
      [-0.0023, 3],
      [0.009, 1],
      [-0.00217, 3],
      [-0.00362, 0],
      [-0.00233, 3],
      [-0.00635, 2],
      [-0.00367, 0],
      [-0.00211, 3],
      [-0.0022, 3],
      [-0.00225, 3],
      [-0.00368, 0],
      [-0.00223, 3],
      [-0.00246, 3],
      [-0.00239, 3],
      [-0.00362, 0],
      [-0.00211, 3],
      [-0.00608, 2],
      [-0.00197, 3],
      [0.01087, 1],
      [-0.00605, 2]
    ],
    "red_o_points": [],
    "y_categories": ["N", "NOT APPLICABLE", "Y", "nan"],
    "blue_o_points": [],
    "blue_x_points": [
      [0.01555, 1],
      [-0.00084, 3],
      [0.01128, 1],
      [-0.00111, 0],
      [-0.00092, 3],
      [0.01268, 1],
      [0.01264, 1]
    ]
  },
  "QA_lstPexTouch[T1]": {
    "red_x_points": [
      [-0.00149, 1],
      [-0.00024, 2],
      [0.00036, 1],
      [-0.00032, 2],
      [-0.00214, 0],
      [0.00051, 1],
      [0.00076, 1],
      [-0.00165, 1],
      [-0.00198, 0],
      [-0.00123, 0],
      [-0.00119, 0],
      [-0.003, 0],
      [-0.01006, 2],
      [0.00256, 2],
      [-0.00049, 2],
      [-0.00154, 1],
      [1e-5, 2],
      [0.00074, 1],
      [-0.00242, 0],
      [-0.00148, 1],
      [-0.00295, 0],
      [-0.00021, 2],
      [0.00263, 2],
      [-0.0014, 1],
      [-0.00301, 0],
      [0.00065, 1],
      [-0.00349, 0],
      [-0.00025, 2],
      [-0.00251, 0],
      [0.00102, 1],
      [0.00035, 1]
    ],
    "red_o_points": [],
    "y_categories": ["NORM", "NPV", "nan"],
    "blue_o_points": [],
    "blue_x_points": [
      [0.00116, 1],
      [0.0045, 2],
      [0.00116, 1],
      [0.0027, 1],
      [0.00525, 2],
      [0.00089, 1],
      [0.00526, 0]
    ]
  },
  "QS_mulTransfSite[AcMc]": {
    "red_x_points": [
      [-0.00041, 3],
      [-0.00051, 0],
      [-0.00055, 0],
      [-0.00057, 0],
      [-0.00045, 0],
      [-0.00051, 0],
      [-0.00047, 0],
      [-0.00041, 3],
      [-0.00062, 0],
      [-0.00047, 0],
      [-0.00188, 2],
      [-0.00053, 3],
      [0.0022, 1],
      [-0.0006, 3],
      [-0.00057, 0],
      [-0.00055, 3],
      [-0.00052, 0],
      [-0.00044, 0],
      [-0.00051, 3],
      [-0.00045, 3],
      [-0.00054, 3],
      [-0.00056, 0],
      [-0.00041, 3],
      [-0.0005, 3],
      [-0.00044, 3],
      [-0.00052, 0],
      [-0.00041, 3],
      [-0.00042, 0],
      [-0.00032, 3],
      [0.00173, 1],
      [-0.00056, 0]
    ],
    "red_o_points": [],
    "y_categories": ["N", "NOT APPLICABLE", "Y", "nan"],
    "blue_o_points": [],
    "blue_x_points": [
      [0.0023, 1],
      [-0.00023, 3],
      [0.00128, 1],
      [-0.00033, 0],
      [-0.00025, 3],
      [0.00189, 1],
      [0.00185, 1]
    ]
  },
  "QS_mulTransfSite[Other]": {
    "red_x_points": [
      [-0.00045, 3],
      [-0.0008, 0],
      [-0.00084, 0],
      [-0.00069, 0],
      [-0.00057, 0],
      [-0.00052, 0],
      [-0.00075, 0],
      [-0.00071, 3],
      [-0.00054, 0],
      [-0.00057, 0],
      [-0.00074, 0],
      [-0.00059, 3],
      [0.00216, 1],
      [-0.00032, 3],
      [-0.00082, 0],
      [-0.00088, 3],
      [-0.00071, 0],
      [-0.00352, 2],
      [-0.00067, 3],
      [-0.00039, 3],
      [-0.0007, 3],
      [-0.00084, 0],
      [-0.00038, 3],
      [-0.0007, 3],
      [-0.00051, 3],
      [-0.00061, 0],
      [-0.00053, 3],
      [-0.00069, 0],
      [-0.0003, 3],
      [0.00194, 1],
      [-0.00058, 0]
    ],
    "red_o_points": [],
    "y_categories": ["N", "NOT APPLICABLE", "Y", "nan"],
    "blue_o_points": [],
    "blue_x_points": [
      [0.00389, 1],
      [-0.00022, 3],
      [0.00283, 1],
      [-7e-5, 0],
      [-0.00016, 3],
      [0.00216, 1],
      [0.00231, 1]
    ]
  },
  "QA_yonInjBpsurg": {
    "red_x_points": [
      [-0.00398, 1],
      [-0.00361, 1],
      [-0.00468, 1],
      [-0.0039, 1],
      [-0.00394, 1],
      [-0.00378, 1],
      [-0.00388, 1],
      [-0.00374, 1],
      [-0.00419, 1],
      [-0.00407, 1],
      [-0.00338, 1],
      [-0.00391, 1],
      [0.00658, 0],
      [-0.0041, 1],
      [-0.00393, 1],
      [-0.00406, 1],
      [-0.00317, 1],
      [-0.00447, 1],
      [-0.00418, 1],
      [-0.00393, 1],
      [-0.00317, 1],
      [-0.00313, 1],
      [-0.00452, 1],
      [-0.00443, 1],
      [-0.00428, 1],
      [-0.00359, 1],
      [-0.00346, 1],
      [-0.0045, 1],
      [-0.00354, 1],
      [0.01063, 0],
      [-0.0035, 1]
    ],
    "red_o_points": [],
    "y_categories": ["N", "Y", "nan"],
    "blue_o_points": [],
    "blue_x_points": [
      [0.02174, 0],
      [-0.00052, 1],
      [0.01349, 0],
      [-0.003, 1],
      [-0.00069, 1],
      [0.01441, 0],
      [0.01406, 0]
    ]
  },
  "QA_equInjTbpiAge": {
    "red_x_points": [
      [-0.00095, 1],
      [-6e-5, 1],
      [0.00013, 1],
      [-0.00014, 0],
      [-0.00107, 0],
      [0.00015, 1],
      [0.00016, 1],
      [0.0003, 0],
      [-0.00049, 0],
      [-0.00021, 0],
      [6e-5, 1],
      [0.00041, 0],
      [-0.0157, 1],
      [-0.00083, 1],
      [-1e-5, 1],
      [-0.00097, 1],
      [-0.00013, 0],
      [-0.00116, 0],
      [-0.00099, 1],
      [0.00098, 0],
      [-0.0005, 1],
      [2e-5, 1],
      [-0.00097, 1],
      [-0.0031, 1],
      [0.00081, 0],
      [0.00014, 1],
      [-0.00137, 1],
      [2e-5, 1],
      [-0.00093, 1],
      [-0.01263, 1],
      [-0.00028, 0]
    ],
    "red_o_points": [],
    "y_categories": ["GREATER THAN OR EQUALS TO 30", "LESS THAN 30", "nan"],
    "blue_o_points": [],
    "blue_x_points": [
      [-0.00426, 1],
      [-0.00191, 1],
      [0.00737, 0],
      [0.00047, 1],
      [0.00614, 0],
      [0.00733, 0],
      [0.00813, 0]
    ]
  },
  "QS_mulLysisNerve[Ssr]": {
    "red_x_points": [
      [-0.00023, 3],
      [-0.00042, 0],
      [-0.00087, 2],
      [-0.00036, 0],
      [-0.00022, 0],
      [-0.00033, 0],
      [-0.00024, 0],
      [-0.00011, 3],
      [-0.00027, 0],
      [-0.00037, 0],
      [-0.0003, 0],
      [-0.00013, 3],
      [0.00142, 1],
      [-0.00013, 3],
      [-0.00026, 0],
      [-0.00023, 3],
      [-0.00035, 0],
      [-0.00032, 0],
      [-0.00013, 3],
      [-0.0001, 3],
      [-0.00018, 3],
      [-0.00031, 0],
      [-0.00018, 3],
      [-0.0002, 3],
      [-0.00013, 3],
      [-0.00035, 0],
      [-0.00018, 3],
      [-0.0003, 0],
      [-0.00019, 3],
      [0.00083, 1],
      [-0.00032, 0]
    ],
    "red_o_points": [],
    "y_categories": ["N", "NOT APPLICABLE", "Y", "nan"],
    "blue_o_points": [],
    "blue_x_points": [
      [0.00075, 1],
      [-0.00012, 3],
      [0.00109, 1],
      [-0.00036, 0],
      [-8e-5, 3],
      [0.00113, 1],
      [0.00109, 1]
    ]
  },
  "QS_mulBpsurgeryType[Graft]": {
    "red_x_points": [
      [-0.00026, 3],
      [-0.00033, 0],
      [-0.00015, 0],
      [-0.00044, 0],
      [-0.00031, 0],
      [-0.00037, 0],
      [-0.0003, 0],
      [-0.0003, 3],
      [-0.00045, 0],
      [-0.00047, 0],
      [-0.00032, 0],
      [-0.0002, 3],
      [0.00114, 1],
      [-0.00029, 3],
      [-0.00155, 2],
      [-0.00018, 3],
      [-0.00039, 0],
      [-0.00038, 0],
      [-0.00026, 3],
      [-0.00015, 3],
      [-0.00029, 3],
      [-0.00033, 0],
      [-0.00025, 3],
      [-0.00028, 3],
      [-0.00017, 3],
      [-0.00037, 0],
      [-0.00015, 3],
      [-0.00034, 0],
      [-0.00037, 3],
      [0.00052, 1],
      [-0.00036, 0]
    ],
    "red_o_points": [],
    "y_categories": ["N", "NOT APPLICABLE", "Y", "nan"],
    "blue_o_points": [],
    "blue_x_points": [
      [0.00161, 1],
      [-6e-5, 3],
      [0.00084, 1],
      [0.0001, 0],
      [-5e-5, 3],
      [0.00139, 1],
      [0.00159, 1]
    ]
  },
  "QS_mulLysisRoot[C5]": {
    "red_x_points": [
      [-0.00104, 3],
      [-0.00179, 0],
      [-0.00315, 2],
      [-0.00155, 0],
      [-0.00176, 0],
      [-0.00184, 0],
      [-0.00161, 0],
      [-0.001, 3],
      [-0.00167, 0],
      [-0.00157, 0],
      [-0.00175, 0],
      [-0.00131, 3],
      [0.00507, 1],
      [-0.00093, 3],
      [-0.00132, 0],
      [-0.00106, 3],
      [-0.00193, 0],
      [-0.00152, 0],
      [-0.00109, 3],
      [-0.00096, 3],
      [-0.00118, 3],
      [-0.00173, 0],
      [-0.00094, 3],
      [-0.00115, 3],
      [-0.00104, 3],
      [-0.00172, 0],
      [-0.00098, 3],
      [-0.00168, 0],
      [-0.00096, 3],
      [0.00527, 1],
      [-0.00291, 2]
    ],
    "red_o_points": [],
    "y_categories": ["N", "NOT APPLICABLE", "Y", "nan"],
    "blue_o_points": [],
    "blue_x_points": [
      [0.0071, 1],
      [-0.0006, 3],
      [0.00538, 1],
      [-0.00141, 0],
      [-0.00046, 3],
      [0.00476, 1],
      [0.00608, 1]
    ]
  },
  "QS_mulLysisSite[Root]": {
    "red_x_points": [
      [-0.00052, 3],
      [-0.00075, 0],
      [-0.00184, 2],
      [-0.00072, 0],
      [-0.00073, 0],
      [-0.00082, 0],
      [-0.0009, 0],
      [-0.00049, 3],
      [-0.00073, 0],
      [-0.00074, 0],
      [-0.00077, 0],
      [-0.00061, 3],
      [0.0021, 1],
      [-0.0005, 3],
      [-0.00083, 0],
      [-0.00057, 3],
      [-0.00073, 0],
      [-0.00075, 0],
      [-0.00038, 3],
      [-0.00064, 3],
      [-0.00038, 3],
      [-0.00072, 0],
      [-0.00051, 3],
      [-0.0006, 3],
      [-0.0005, 3],
      [-0.00077, 0],
      [-0.00059, 3],
      [-0.00069, 0],
      [-0.00042, 3],
      [0.00316, 1],
      [-0.00207, 2]
    ],
    "red_o_points": [],
    "y_categories": ["N", "NOT APPLICABLE", "Y", "nan"],
    "blue_o_points": [],
    "blue_x_points": [
      [0.0034, 1],
      [-0.00038, 3],
      [0.00306, 1],
      [-0.00091, 0],
      [-0.00013, 3],
      [0.0029, 1],
      [0.00252, 1]
    ]
  },
  "QS_mulBpsurgeryType[Lysis]": {
    "red_x_points": [
      [-0.00277, 3],
      [-0.00492, 0],
      [-0.00727, 2],
      [-0.0045, 0],
      [-0.0047, 0],
      [-0.00862, 2],
      [-0.00468, 0],
      [-0.00296, 3],
      [-0.00476, 0],
      [-0.00478, 0],
      [-0.00451, 0],
      [-0.0032, 3],
      [0.01107, 1],
      [-0.00253, 3],
      [-0.00494, 0],
      [-0.00302, 3],
      [-0.00822, 2],
      [-0.00475, 0],
      [-0.00297, 3],
      [-0.00264, 3],
      [-0.00285, 3],
      [-0.00457, 0],
      [-0.00249, 3],
      [-0.00343, 3],
      [-0.00263, 3],
      [-0.00464, 0],
      [-0.00277, 3],
      [-0.00516, 0],
      [-0.00234, 3],
      [0.01202, 1],
      [-0.00763, 2]
    ],
    "red_o_points": [],
    "y_categories": ["N", "NOT APPLICABLE", "Y", "nan"],
    "blue_o_points": [],
    "blue_x_points": [
      [0.01913, 1],
      [-0.00056, 3],
      [0.01573, 1],
      [-0.00127, 0],
      [-0.0008, 3],
      [0.01576, 1],
      [0.01752, 1]
    ]
  },
  "QS_mulGraftNerve[LT]": {
    "red_x_points": [
      [-7e-5, 2],
      [-7e-5, 0],
      [1e-5, 0],
      [1e-5, 0],
      [6e-5, 1],
      [1e-5, 0],
      [-7e-5, 0],
      [-7e-5, 2],
      [-7e-5, 2]
    ],
    "red_o_points": [],
    "y_categories": ["N", "NOT APPLICABLE", "nan"],
    "blue_o_points": [],
    "blue_x_points": [[6e-5, 1], [0.00013, 1], [1e-5, 0], [6e-5, 1]]
  },
  "QA_lstPexMuscstrength[ShoulderAbduc]": {
    "red_x_points": [
      [-0.00591, 1],
      [-0.00625, 1],
      [-0.00607, 1],
      [-0.00583, 1],
      [-0.00599, 1],
      [-0.00595, 1],
      [-0.0056, 1],
      [-0.00606, 1],
      [-0.00623, 1],
      [-0.00595, 1],
      [-0.00567, 1],
      [-0.00607, 1],
      [0.00228, 2],
      [0.00523, 2],
      [0.00488, 2],
      [0.00479, 2],
      [0.00492, 2],
      [-0.00569, 1],
      [-0.00578, 1],
      [-0.00583, 1],
      [-0.00587, 1],
      [-0.00585, 1],
      [0.00476, 2],
      [-0.00798, 1],
      [-0.00629, 1],
      [-0.00642, 1],
      [-0.00573, 1],
      [-0.00621, 1],
      [-0.00625, 1],
      [0.00275, 2],
      [-0.00549, 1]
    ],
    "red_o_points": [],
    "y_categories": ["GREATER THAN OR EQUALS TO 3", "LESS THAN 3", "nan"],
    "blue_o_points": [],
    "blue_x_points": [
      [0.00361, 2],
      [0.00536, 2],
      [0.02491, 0],
      [0.00595, 2],
      [0.00551, 2],
      [0.02397, 0],
      [-0.00055, 1]
    ]
  },
  "QS_mulNeuromadSite[C4]": {
    "red_x_points": [
      [-0.00075, 2],
      [-0.00198, 0],
      [-0.00197, 0],
      [-0.00166, 0],
      [-0.00248, 0],
      [-0.00215, 0],
      [-0.00178, 0],
      [-0.00073, 2],
      [-0.0019, 0],
      [-0.00215, 0],
      [-0.00207, 0],
      [-0.00075, 2],
      [0.00297, 1],
      [-0.00065, 2],
      [-0.00202, 0],
      [-0.00079, 2],
      [-0.00193, 0],
      [-0.00215, 0],
      [-0.00081, 2],
      [-0.00069, 2],
      [-0.00042, 2],
      [-0.00138, 0],
      [-0.0007, 2],
      [-0.00092, 2],
      [-0.00099, 2],
      [-0.00221, 0],
      [-0.00075, 2],
      [-0.00184, 0],
      [-0.00043, 2],
      [0.00376, 1],
      [-0.00189, 0]
    ],
    "red_o_points": [],
    "y_categories": ["N", "NOT APPLICABLE", "nan"],
    "blue_o_points": [],
    "blue_x_points": [
      [0.00826, 1],
      [-0.00011, 2],
      [0.00452, 1],
      [0.00013, 0],
      [-0.0001, 2],
      [0.00432, 1],
      [0.00528, 1]
    ]
  },
  "QS_lstBpsurgSide": {
    "red_x_points": [
      [-0.00417, 3],
      [-0.0053, 0],
      [-0.00538, 0],
      [-0.00487, 0],
      [-0.0131, 2],
      [-0.00494, 0],
      [-0.00505, 0],
      [-0.00415, 3],
      [-0.00504, 0],
      [-0.01204, 2],
      [-0.01183, 2],
      [-0.00428, 3],
      [0.01954, 1],
      [-0.00397, 3],
      [-0.01269, 2],
      [-0.00424, 3],
      [-0.01187, 2],
      [-0.01236, 2],
      [-0.00424, 3],
      [-0.00385, 3],
      [-0.00405, 3],
      [-0.00451, 0],
      [-0.00402, 3],
      [-0.00447, 3],
      [-0.00427, 3],
      [-0.012, 2],
      [-0.0039, 3],
      [-0.01195, 2],
      [-0.00409, 3],
      [0.02102, 1],
      [-0.00513, 0]
    ],
    "red_o_points": [],
    "y_categories": ["L", "NOT APPLICABLE", "R", "nan"],
    "blue_o_points": [],
    "blue_x_points": [
      [0.02831, 1],
      [-0.00129, 3],
      [0.02264, 1],
      [0.00157, 0],
      [-0.00105, 3],
      [0.02128, 1],
      [0.02442, 1]
    ]
  },
  "QS_mulGraftNerve[IS]": {
    "red_x_points": [
      [-6e-5, 2],
      [-0.00015, 0],
      [-0.00016, 0],
      [-0.00015, 0],
      [-0.00016, 0],
      [-0.00024, 0],
      [-0.00015, 0],
      [-0.00014, 2],
      [-0.0001, 0],
      [-0.0002, 0],
      [-0.00014, 0],
      [-0.00026, 2],
      [0.00032, 1],
      [-5e-5, 2],
      [-0.00015, 0],
      [-0.00015, 2],
      [-0.00023, 0],
      [-0.0002, 0],
      [-9e-5, 2],
      [-9e-5, 2],
      [-7e-5, 2],
      [-8e-5, 0],
      [-6e-5, 2],
      [-7e-5, 2],
      [-5e-5, 2],
      [-0.00012, 0],
      [-6e-5, 2],
      [-0.0002, 0],
      [-8e-5, 2],
      [0.00031, 1],
      [-0.00014, 0]
    ],
    "red_o_points": [],
    "y_categories": ["N", "NOT APPLICABLE", "nan"],
    "blue_o_points": [],
    "blue_x_points": [
      [0.00096, 1],
      [-5e-5, 2],
      [0.0002, 1],
      [-4e-5, 0],
      [-5e-5, 2],
      [0.00022, 1],
      [0.00068, 1]
    ]
  },
  "QS_mulGraftNerve[MC]": {
    "red_x_points": [
      [-5e-5, 2],
      [-0.00021, 0],
      [-0.00015, 0],
      [-0.00022, 0],
      [-0.00018, 0],
      [-0.0001, 0],
      [-0.00026, 0],
      [-0.00027, 0],
      [-0.00022, 0],
      [-0.00024, 0],
      [-8e-5, 2],
      [0.00042, 1],
      [-7e-5, 2],
      [-0.00018, 0],
      [-0.00023, 2],
      [-0.00022, 0],
      [-0.00019, 0],
      [-4e-5, 2],
      [-9e-5, 2],
      [-7e-5, 2],
      [-0.0002, 0],
      [-0.00013, 2],
      [-7e-5, 2],
      [-0.0002, 2],
      [-0.00022, 0],
      [-2e-5, 2],
      [-0.00036, 0],
      [-6e-5, 2],
      [0.00033, 1],
      [-0.00021, 0]
    ],
    "red_o_points": [],
    "y_categories": ["N", "NOT APPLICABLE", "nan"],
    "blue_o_points": [],
    "blue_x_points": [
      [0.00104, 1],
      [-3e-5, 2],
      [0.00058, 1],
      [1e-5, 0],
      [-9e-5, 2],
      [0.00042, 1],
      [0.00059, 1]
    ]
  },
  "QA_yonPreOrtsurg": {
    "red_x_points": [
      [-0.00397, 0],
      [-0.0004, 2],
      [-8e-5, 0],
      [-0.00017, 0],
      [-0.0001, 0],
      [-1e-5, 0],
      [-7e-5, 0],
      [-0.00078, 2],
      [-7e-5, 0],
      [-7e-5, 0],
      [-0.00027, 2],
      [0.0059, 1],
      [-0.00147, 0],
      [-0.00109, 2],
      [-0.00075, 0],
      [-0.00468, 0],
      [0.00047, 1],
      [-9e-5, 0],
      [-0.00372, 0],
      [-0.00373, 0],
      [-0.00373, 0],
      [-0.0002, 0],
      [-0.0053, 0],
      [-0.00535, 0],
      [-0.00386, 0],
      [-0.00024, 2],
      [-0.00087, 2],
      [-4e-5, 0],
      [-0.00089, 2],
      [-0.00067, 2],
      [0.00015, 1]
    ],
    "red_o_points": [],
    "y_categories": ["N", "Y", "nan"],
    "blue_o_points": [],
    "blue_x_points": [
      [1e-5, 0],
      [0.00171, 2],
      [-6e-5, 0],
      [0.00014, 0],
      [0.02028, 1],
      [-0.0001, 0],
      [-7e-5, 0]
    ]
  },
  "QS_mulGraftNerve[Ra]": {
    "red_x_points": [
      [-0.00032, 2],
      [-0.00076, 0],
      [-0.00068, 0],
      [-0.00062, 0],
      [-0.00081, 0],
      [-0.0006, 0],
      [-0.00072, 0],
      [-0.00029, 2],
      [-0.00064, 0],
      [-0.00067, 0],
      [-0.00075, 0],
      [-0.00019, 2],
      [0.00111, 1],
      [-0.00026, 2],
      [-0.00081, 0],
      [-0.00022, 2],
      [-0.0004, 0],
      [-0.0007, 0],
      [-0.00025, 2],
      [-0.00027, 2],
      [-0.00025, 2],
      [-0.00045, 0],
      [-0.00022, 2],
      [-0.00019, 2],
      [-0.00029, 2],
      [-0.00052, 0],
      [-0.00034, 2],
      [-0.00061, 0],
      [-0.0002, 2],
      [0.00125, 1],
      [-0.0008, 0]
    ],
    "red_o_points": [],
    "y_categories": ["N", "NOT APPLICABLE", "nan"],
    "blue_o_points": [],
    "blue_x_points": [
      [0.00284, 1],
      [-8e-5, 2],
      [0.00119, 1],
      [0.00014, 0],
      [-0.00013, 2],
      [0.00157, 1],
      [0.00136, 1]
    ]
  },
  "QS_mulTransfSite[Oberlin]": {
    "red_x_points": [
      [-0.00351, 3],
      [-0.01096, 0],
      [-0.01114, 0],
      [-0.01175, 0],
      [-0.00595, 2],
      [-0.0053, 2],
      [-0.01161, 0],
      [-0.00358, 3],
      [-0.00563, 2],
      [-0.00584, 2],
      [-0.00559, 2],
      [-0.00391, 3],
      [0.01669, 1],
      [-0.00354, 3],
      [-0.00596, 2],
      [-0.004, 3],
      [-0.01112, 0],
      [-0.00599, 2],
      [-0.00386, 3],
      [-0.0041, 3],
      [-0.00318, 3],
      [-0.01008, 0],
      [-0.00385, 3],
      [-0.00422, 3],
      [-0.00412, 3],
      [-0.0051, 2],
      [-0.00377, 3],
      [-0.01134, 0],
      [-0.00361, 3],
      [0.01907, 1],
      [-0.01141, 0]
    ],
    "red_o_points": [],
    "y_categories": ["N", "NOT APPLICABLE", "Y", "nan"],
    "blue_o_points": [],
    "blue_x_points": [
      [0.02955, 1],
      [-0.00059, 3],
      [0.01962, 1],
      [0.00142, 2],
      [-0.00081, 3],
      [0.02012, 1],
      [0.02416, 1]
    ]
  },
  "QA_lstPexKine[Index]": {
    "red_x_points": [
      [-0.00114, 0],
      [-0.00051, 2],
      [-0.00042, 2],
      [-0.00041, 2],
      [8e-5, 1],
      [0.00046, 1],
      [-0.00166, 0],
      [0.00016, 2],
      [0.00051, 1],
      [3e-5, 1],
      [0.00033, 1],
      [-0.00033, 1],
      [-0.00012, 2],
      [0.00038, 2],
      [0.00032, 1],
      [-0.00022, 2],
      [-5e-5, 2],
      [0.00012, 1],
      [-0.00043, 1],
      [-0.00082, 0],
      [-0.00027, 1],
      [-0.0005, 2],
      [0.0004, 2],
      [-0.00026, 1],
      [5e-5, 2],
      [-0.00065, 2],
      [-0.00044, 1],
      [-0.00014, 2],
      [-0.00035, 1],
      [-0.00038, 2],
      [-0.00065, 0]
    ],
    "red_o_points": [],
    "y_categories": ["NPV", "PV", "nan"],
    "blue_o_points": [],
    "blue_x_points": [
      [0.00045, 1],
      [0.00063, 2],
      [0.00012, 1],
      [0.0021, 1],
      [0.00056, 2],
      [0.0002, 1],
      [6e-5, 2]
    ]
  }
}
