{
  "QA_lstPexPain[C8]": {
    "red_x_points": [
      [-0.00929, 1],
      [-0.00223, 2],
      [-0.00204, 2],
      [-0.00249, 2],
      [-0.00882, 1],
      [0.00084, 0],
      [-0.00041, 1],
      [-0.00068, 1],
      [0.00677, 0],
      [-0.00115, 0],
      [0.0005, 0],
      [-0.00033, 0],
      [-0.00957, 1],
      [-0.01108, 2],
      [-0.00444, 2],
      [-0.00243, 2],
      [-0.00468, 2],
      [-0.00208, 2],
      [-0.00504, 2],
      [0.00746, 0],
      [-0.0093, 1],
      [0.00615, 0],
      [-0.00227, 2],
      [-0.00487, 2],
      [0.00466, 0],
      [-0.00524, 2],
      [-0.00331, 2],
      [-0.00213, 2],
      [-0.00864, 1],
      [-0.01024, 1],
      [-0.00147, 1],
      [-0.01025, 1]
    ],
    "red_o_points": [],
    "y_categories": ["NORM", "NPV", "nan"],
    "blue_o_points": [],
    "blue_x_points": [
      [0.00868, 0],
      [-0.00109, 2],
      [0.00032, 1],
      [0.00875, 1],
      [0.00337, 0],
      [0.00117, 1],
      [0.0121, 0],
      [0.00479, 0],
      [0.01114, 0],
      [0.013, 0]
    ]
  },
  "QS_mulLysisRoot[C6]": {
    "red_x_points": [
      [-0.00071, 3],
      [-0.00218, 0],
      [-0.0055, 2],
      [-0.00216, 0],
      [-0.00062, 3],
      [-0.00237, 0],
      [-0.00176, 0],
      [-0.00192, 0],
      [-0.00068, 3],
      [-0.00213, 0],
      [-0.00216, 0],
      [-0.00214, 0],
      [-0.00076, 3],
      [0.00397, 1],
      [-0.00059, 3],
      [-0.00228, 0],
      [-0.00069, 3],
      [-0.0019, 0],
      [-0.00064, 3],
      [-0.00072, 3],
      [-0.00055, 3],
      [-0.00053, 3],
      [-0.00205, 0],
      [-0.00042, 3],
      [-0.00043, 3],
      [-0.00053, 3],
      [-0.00213, 0],
      [-0.00202, 0],
      [0.00539, 1],
      [-0.00048, 3],
      [-0.00539, 2],
      [-0.00056, 3]
    ],
    "red_o_points": [],
    "y_categories": ["N", "NOT APPLICABLE", "Y", "nan"],
    "blue_o_points": [],
    "blue_x_points": [
      [0.00732, 1],
      [-0.00018, 3],
      [0.00496, 1],
      [-2e-5, 0],
      [-0.00095, 0],
      [0.00629, 1],
      [-0.00045, 3],
      [0.00644, 1],
      [-0.00041, 3],
      [-0.00016, 3]
    ]
  },
  "QS_mulLysisTrunk[Upper]": {
    "red_x_points": [
      [-0.00138, 3],
      [-0.00456, 0],
      [-0.00459, 0],
      [-0.0048, 0],
      [-0.00154, 3],
      [-0.00481, 0],
      [-0.00963, 2],
      [-0.00458, 0],
      [-0.00201, 3],
      [-0.00501, 0],
      [-0.00529, 0],
      [-0.00438, 0],
      [-0.00122, 3],
      [0.01065, 1],
      [-0.00124, 3],
      [-0.00476, 0],
      [-0.00174, 3],
      [-0.00988, 2],
      [-0.00177, 3],
      [-0.002, 3],
      [-0.00117, 3],
      [-0.0016, 3],
      [-0.00429, 0],
      [-0.00136, 3],
      [-0.00169, 3],
      [-0.00112, 3],
      [-0.00452, 0],
      [-0.00436, 0],
      [0.00966, 1],
      [-0.00097, 3],
      [-0.00911, 2],
      [-0.00145, 3]
    ],
    "red_o_points": [],
    "y_categories": ["N", "NOT APPLICABLE", "Y", "nan"],
    "blue_o_points": [],
    "blue_x_points": [
      [0.01549, 1],
      [-0.00029, 3],
      [0.01306, 1],
      [0.00021, 0],
      [-0.00138, 0],
      [0.01288, 1],
      [-0.00055, 3],
      [0.01318, 1],
      [-0.00056, 3],
      [-0.00048, 3]
    ]
  },
  "QS_mulBpsurgeryType[Transf]": {
    "red_x_points": [
      [-0.00013, 3],
      [-0.00032, 2],
      [-0.0019, 0],
      [-0.00035, 2],
      [-7e-5, 3],
      [-0.00036, 2],
      [-0.00039, 2],
      [-0.00047, 2],
      [-0.00011, 3],
      [-0.00044, 2],
      [-0.00045, 2],
      [-0.00022, 2],
      [-0.00014, 3],
      [0.00119, 1],
      [-0.00014, 3],
      [-0.00035, 2],
      [-0.00014, 3],
      [-0.00035, 2],
      [-0.00015, 3],
      [-0.00013, 3],
      [-5e-5, 3],
      [-0.00011, 3],
      [-0.00026, 2],
      [-0.00012, 3],
      [-9e-5, 3],
      [-8e-5, 3],
      [-0.00043, 2],
      [-0.00031, 2],
      [0.001, 1],
      [-0.00014, 3],
      [-0.00026, 2],
      [-0.00011, 3]
    ],
    "red_o_points": [],
    "y_categories": ["N", "NOT APPLICABLE", "Y", "nan"],
    "blue_o_points": [],
    "blue_x_points": [
      [0.00121, 1],
      [-7e-5, 3],
      [0.00092, 1],
      [0.00023, 2],
      [-0.00029, 2],
      [0.001, 1],
      [-1e-5, 3],
      [0.00107, 1],
      [-6e-5, 3],
      [-0.00011, 3]
    ]
  },
  "QS_equBpsurgTime": {
    "red_x_points": [
      [0.00063, 3],
      [-0.007, 0],
      [0.00627, 2],
      [-0.00698, 0],
      [0.00064, 3],
      [-0.01242, 0],
      [-0.00855, 1],
      [-0.00693, 1],
      [0.0006, 3],
      [-0.00927, 1],
      [-0.00854, 0],
      [0.00911, 2],
      [0.00054, 3],
      [0.0007, 3],
      [0.00067, 3],
      [-0.00876, 1],
      [0.00077, 3],
      [0.00577, 2],
      [0.00053, 3],
      [0.0007, 3],
      [0.0006, 3],
      [0.0006, 3],
      [-0.00616, 0],
      [0.00056, 3],
      [0.00063, 3],
      [0.00076, 3],
      [-0.00825, 0],
      [-0.00663, 0],
      [0.00071, 3],
      [0.00063, 3],
      [0.00523, 2],
      [0.00057, 3]
    ],
    "red_o_points": [],
    "y_categories": [
      "0 TO 6 MONTHS",
      "13 TO 24 MONTHS",
      "7 TO 12 MONTHS",
      "nan"
    ],
    "blue_o_points": [],
    "blue_x_points": [
      [0.00057, 3],
      [0.00064, 3],
      [0.00061, 3],
      [0.01367, 2],
      [0.01446, 2],
      [0.00058, 3],
      [0.00078, 3],
      [0.00043, 3],
      [0.00095, 3],
      [0.00063, 3]
    ]
  },
  "QA_equInjTbpiTime": {
    "red_x_points": [
      [-0.00151, 0],
      [-0.0031, 0],
      [0.00766, 3],
      [-0.00411, 0],
      [-0.00468, 1],
      [-0.00732, 0],
      [-0.00736, 1],
      [-0.005, 0],
      [0.0001, 3],
      [-0.00648, 0],
      [-0.00573, 0],
      [0.01056, 3],
      [-0.00125, 0],
      [-0.03564, 2],
      [-0.00078, 3],
      [-0.00411, 0],
      [-5e-5, 0],
      [-0.00237, 0],
      [-0.01332, 1],
      [0.00047, 3],
      [-0.00228, 0],
      [-0.00622, 1],
      [-0.00852, 2],
      [-0.00012, 3],
      [-0.01239, 1],
      [-0.01428, 2],
      [-0.00549, 0],
      [-0.00761, 2],
      [0.0014, 0],
      [0.0, 0],
      [0.00624, 3],
      [-0.00685, 1]
    ],
    "red_o_points": [],
    "y_categories": [
      "0 TO 6 MONTHS",
      "13 TO 24 MONTHS",
      "25 MONTHS OR MORE",
      "7 TO 12 MONTHS",
      "nan"
    ],
    "blue_o_points": [],
    "blue_x_points": [
      [0.00341, 0],
      [0.00974, 0],
      [0.004, 0],
      [0.01699, 3],
      [0.01586, 3],
      [0.00418, 0],
      [0.0051, 1],
      [0.01071, 3],
      [0.00965, 3],
      [0.00718, 0]
    ]
  },
  "QS_mulNeuromadSite[T2]": {
    "red_x_points": [
      [-0.00017, 2],
      [-0.00163, 0],
      [-0.00152, 0],
      [-0.00205, 0],
      [-0.00043, 2],
      [-0.00209, 0],
      [-0.00165, 0],
      [-0.00194, 0],
      [-0.00093, 2],
      [-0.00226, 0],
      [-0.00245, 0],
      [-0.00136, 0],
      [-0.00069, 2],
      [0.00185, 1],
      [-0.00022, 2],
      [-0.00204, 0],
      [-0.0005, 2],
      [-0.0015, 0],
      [-0.00058, 2],
      [-0.00058, 2],
      [-0.00016, 2],
      [-0.00063, 2],
      [-0.00156, 0],
      [-0.00039, 2],
      [-0.0008, 2],
      [-0.00031, 2],
      [-0.00163, 0],
      [-0.00145, 0],
      [0.0027, 1],
      [-3e-5, 2],
      [-0.00134, 0],
      [-0.00042, 2]
    ],
    "red_o_points": [],
    "y_categories": ["N", "NOT APPLICABLE", "nan"],
    "blue_o_points": [],
    "blue_x_points": [
      [0.00467, 1],
      [7e-5, 2],
      [0.00429, 1],
      [0.00065, 0],
      [-0.00038, 0],
      [0.00381, 1],
      [-6e-5, 2],
      [0.00497, 1],
      [2e-5, 2],
      [0.00052, 2]
    ]
  },
  "QA_lstPexMuscstrength[FingersAddu]": {
    "red_x_points": [
      [0.0015, 0],
      [0.00027, 2],
      [-0.00458, 1],
      [-0.00422, 1],
      [-0.00594, 1],
      [0.0015, 0],
      [0.00133, 0],
      [-0.00475, 1],
      [0.00138, 0],
      [0.00131, 0],
      [0.00041, 2],
      [0.00163, 0],
      [0.00151, 0],
      [0.00026, 2],
      [0.00035, 2],
      [0.00017, 2],
      [0.00151, 0],
      [0.0002, 2],
      [0.00034, 2],
      [0.00167, 0],
      [-0.00618, 1],
      [0.00142, 0],
      [-0.00381, 1],
      [0.00046, 2],
      [0.00045, 2],
      [0.00058, 2],
      [0.00034, 2],
      [-0.00436, 1],
      [0.00024, 2],
      [-0.00628, 1],
      [-0.00463, 1],
      [0.00043, 2]
    ],
    "red_o_points": [],
    "y_categories": ["GREATER THAN OR EQUALS TO 3", "LESS THAN 3", "nan"],
    "blue_o_points": [],
    "blue_x_points": [
      [0.00033, 2],
      [0.00065, 2],
      [0.00145, 0],
      [0.00145, 2],
      [0.00342, 0],
      [0.00153, 0],
      [0.0037, 0],
      [0.00152, 0],
      [0.00119, 2],
      [0.00091, 2]
    ]
  },
  "QS_mulNeuromadSite[T1]": {
    "red_x_points": [
      [-9e-5, 2],
      [-0.00128, 0],
      [-0.0011, 0],
      [-0.0015, 0],
      [-0.0001, 2],
      [-0.00135, 0],
      [-0.00095, 0],
      [-0.00125, 0],
      [-0.00024, 2],
      [-0.00128, 0],
      [-0.00105, 0],
      [-0.00121, 0],
      [-0.00014, 2],
      [0.00086, 1],
      [-5e-5, 2],
      [-0.00136, 0],
      [-0.00039, 2],
      [-0.00128, 0],
      [-0.00015, 2],
      [-0.00024, 2],
      [-2e-5, 2],
      [-0.0002, 2],
      [-0.00096, 0],
      [-0.00022, 2],
      [-0.00033, 2],
      [-0.00011, 2],
      [-0.00121, 0],
      [-0.0009, 0],
      [0.00185, 1],
      [-6e-5, 2],
      [-0.00074, 0],
      [-0.00037, 2]
    ],
    "red_o_points": [],
    "y_categories": ["N", "NOT APPLICABLE", "nan"],
    "blue_o_points": [],
    "blue_x_points": [
      [0.0039, 1],
      [0.0001, 2],
      [0.00232, 1],
      [0.00052, 0],
      [-0.00048, 0],
      [0.00279, 1],
      [-0.00014, 2],
      [0.00265, 1],
      [7e-5, 2],
      [0.0002, 2]
    ]
  },
  "QA_yonInjFracture": {
    "red_x_points": [
      [-0.00936, 0],
      [-0.00135, 2],
      [0.0008, 0],
      [-0.00157, 1],
      [-0.00763, 0],
      [0.00131, 0],
      [0.00094, 0],
      [-0.00295, 1],
      [0.00543, 2],
      [0.00169, 0],
      [-0.00247, 1],
      [-0.00552, 1],
      [-0.00918, 0],
      [-0.00084, 0],
      [0.00478, 1],
      [-0.00266, 1],
      [-0.00939, 0],
      [-0.00299, 1],
      [-0.00854, 0],
      [-0.0112, 0],
      [0.00502, 1],
      [-0.01069, 0],
      [-0.00139, 1],
      [-0.00853, 0],
      [-0.01051, 0],
      [-0.00955, 0],
      [0.00105, 0],
      [0.00081, 0],
      [-0.00935, 1],
      [0.00532, 2],
      [-0.0029, 1],
      [0.00479, 1]
    ],
    "red_o_points": [],
    "y_categories": ["N", "Y", "nan"],
    "blue_o_points": [],
    "blue_x_points": [
      [0.00274, 0],
      [0.0103, 1],
      [0.00142, 0],
      [0.00597, 0],
      [0.0043, 0],
      [0.0006, 1],
      [0.01079, 2],
      [0.00131, 0],
      [0.01368, 1],
      [0.01173, 2]
    ]
  },
  "QS_mulGraftNerve[Ac]": {
    "red_x_points": [
      [-7e-5, 2],
      [-0.00037, 0],
      [-0.00023, 0],
      [-0.00028, 0],
      [-0.00014, 2],
      [-0.00036, 0],
      [-0.00041, 0],
      [-0.00032, 0],
      [-6e-5, 2],
      [-0.0004, 0],
      [-0.00052, 0],
      [-0.00038, 0],
      [-4e-5, 2],
      [0.00068, 1],
      [-0.00011, 2],
      [-0.0005, 0],
      [-0.00016, 2],
      [-0.00028, 0],
      [-0.0001, 2],
      [-7e-5, 2],
      [-1e-5, 2],
      [-0.00012, 2],
      [-0.00032, 0],
      [-7e-5, 2],
      [-0.00012, 2],
      [-0.0001, 2],
      [-0.00027, 0],
      [-0.0003, 0],
      [0.00063, 1],
      [-0.00015, 2],
      [-0.00037, 0],
      [-9e-5, 2]
    ],
    "red_o_points": [],
    "y_categories": ["N", "NOT APPLICABLE", "nan"],
    "blue_o_points": [],
    "blue_x_points": [
      [0.00103, 1],
      [2e-5, 2],
      [0.00068, 1],
      [3e-5, 0],
      [-0.00015, 0],
      [0.00065, 1],
      [-2e-5, 2],
      [0.00093, 1],
      [-3e-5, 2],
      [6e-5, 2]
    ]
  },
  "QS_mulGraftNerve[Me]": {
    "red_x_points": [
      [-6e-5, 2],
      [-0.00016, 0],
      [-0.00011, 0],
      [-0.00012, 0],
      [0.0, 2],
      [-7e-5, 0],
      [-0.00016, 0],
      [-8e-5, 2],
      [-8e-5, 0],
      [-0.00016, 0],
      [-0.00011, 0],
      [-6e-5, 2],
      [7e-5, 1],
      [-4e-5, 2],
      [-7e-5, 0],
      [-6e-5, 2],
      [-0.00011, 0],
      [0.0, 2],
      [-4e-5, 2],
      [-5e-5, 2],
      [-5e-5, 2],
      [-4e-5, 0],
      [-8e-5, 2],
      [-4e-5, 2],
      [-4e-5, 2],
      [-7e-5, 0],
      [-4e-5, 0],
      [0.00029, 1],
      [-6e-5, 2],
      [-0.00011, 0],
      [-4e-5, 2]
    ],
    "red_o_points": [],
    "y_categories": ["N", "NOT APPLICABLE", "nan"],
    "blue_o_points": [],
    "blue_x_points": [
      [0.00019, 1],
      [-2e-5, 2],
      [0.00045, 1],
      [-4e-5, 0],
      [-6e-5, 0],
      [0.00037, 1],
      [0.0, 2],
      [0.00038, 1],
      [-3e-5, 2],
      [-4e-5, 2]
    ]
  },
  "QA_lstPexMuscstrength[FingersAbdu]": {
    "red_x_points": [
      [0.00053, 2],
      [7e-5, 2],
      [-0.00318, 1],
      [-0.00257, 1],
      [0.00014, 1],
      [0.00084, 0],
      [0.001, 0],
      [-0.00273, 1],
      [-0.00677, 0],
      [0.00105, 0],
      [-0.0001, 2],
      [-0.00495, 1],
      [-0.00539, 0],
      [0.00022, 2],
      [0.00052, 2],
      [2e-5, 2],
      [-0.0041, 0],
      [-0.00012, 2],
      [0.00056, 2],
      [-0.00825, 0],
      [-0.00042, 1],
      [-0.00847, 0],
      [-0.00184, 1],
      [0.00042, 2],
      [0.00022, 2],
      [0.00077, 2],
      [-0.00295, 1],
      [-0.00233, 1],
      [0.00015, 2],
      [-0.00103, 1],
      [-0.00287, 1],
      [0.0003, 2]
    ],
    "red_o_points": [],
    "y_categories": ["GREATER THAN OR EQUALS TO 3", "LESS THAN 3", "nan"],
    "blue_o_points": [],
    "blue_x_points": [
      [0.00012, 2],
      [0.00105, 2],
      [0.00099, 0],
      [0.00249, 2],
      [0.00534, 0],
      [0.0009, 0],
      [0.01215, 1],
      [0.00121, 0],
      [0.00343, 2],
      [0.00348, 2]
    ]
  },
  "QS_mulNeuromadSite[C8]": {
    "red_x_points": [
      [-0.00043, 2],
      [-0.00273, 0],
      [-0.00248, 0],
      [-0.00286, 0],
      [-0.00062, 2],
      [-0.00332, 0],
      [-0.00241, 0],
      [-0.00289, 0],
      [-0.00091, 2],
      [-0.00324, 0],
      [-0.00322, 0],
      [-0.00227, 0],
      [-0.00092, 2],
      [0.00189, 1],
      [-0.00043, 2],
      [-0.00313, 0],
      [-0.00087, 2],
      [-0.00227, 0],
      [-0.00127, 2],
      [-0.00056, 2],
      [-0.00023, 2],
      [-0.00041, 2],
      [-0.00233, 0],
      [-0.0005, 2],
      [-0.00102, 2],
      [-0.00048, 2],
      [-0.00238, 0],
      [-0.00237, 0],
      [0.00368, 1],
      [-0.00065, 2],
      [-0.00187, 0],
      [-0.00066, 2]
    ],
    "red_o_points": [],
    "y_categories": ["N", "NOT APPLICABLE", "nan"],
    "blue_o_points": [],
    "blue_x_points": [
      [0.00723, 1],
      [9e-5, 2],
      [0.00638, 1],
      [0.00098, 0],
      [-0.0002, 0],
      [0.00638, 1],
      [-0.00011, 2],
      [0.00602, 1],
      [0.0001, 2],
      [0.00027, 2]
    ]
  },
  "QS_mulGraftNerve[Ph]": {
    "red_x_points": [
      [-0.00011, 2],
      [-0.00019, 0],
      [-0.00018, 0],
      [-0.00029, 0],
      [-8e-5, 2],
      [-0.00026, 0],
      [-0.00023, 0],
      [-0.00025, 0],
      [-9e-5, 2],
      [-0.00045, 0],
      [-0.00034, 0],
      [-0.00033, 0],
      [-9e-5, 2],
      [8e-5, 1],
      [-3e-5, 2],
      [-0.00033, 0],
      [-9e-5, 2],
      [-0.00021, 0],
      [-6e-5, 2],
      [-3e-5, 2],
      [-5e-5, 2],
      [-0.00012, 2],
      [-0.00028, 0],
      [-8e-5, 2],
      [-0.00011, 2],
      [-7e-5, 2],
      [-0.00021, 0],
      [-0.00017, 0],
      [0.00038, 1],
      [-0.00013, 2],
      [-0.00024, 0],
      [-8e-5, 2]
    ],
    "red_o_points": [],
    "y_categories": ["N", "NOT APPLICABLE", "nan"],
    "blue_o_points": [],
    "blue_x_points": [
      [0.00096, 1],
      [1e-5, 2],
      [0.0005, 1],
      [-1e-5, 0],
      [-8e-5, 0],
      [0.00091, 1],
      [-0.0001, 2],
      [0.00077, 1],
      [-0.0, 2],
      [0.00011, 2]
    ]
  },
  "QS_mulTransfSite[AcSsPA]": {
    "red_x_points": [
      [-0.00036, 3],
      [-0.00199, 0],
      [-0.00174, 0],
      [-0.00193, 0],
      [-0.0003, 3],
      [-0.0018, 0],
      [-0.00151, 0],
      [-0.00193, 0],
      [-0.0004, 3],
      [-0.00171, 0],
      [-0.00208, 0],
      [-0.00183, 0],
      [-0.00032, 3],
      [0.00352, 1],
      [-0.00038, 3],
      [-0.0019, 0],
      [-0.0004, 3],
      [-0.00409, 2],
      [-0.00075, 3],
      [-0.0005, 3],
      [-0.00028, 3],
      [-0.00032, 3],
      [-0.00184, 0],
      [-0.00044, 3],
      [-0.00056, 3],
      [-0.00049, 3],
      [-0.00193, 0],
      [-0.00178, 0],
      [0.00341, 1],
      [-0.00046, 3],
      [-0.00165, 0],
      [-0.00054, 3]
    ],
    "red_o_points": [],
    "y_categories": ["N", "NOT APPLICABLE", "Y", "nan"],
    "blue_o_points": [],
    "blue_x_points": [
      [0.00607, 1],
      [-0.00013, 3],
      [0.00409, 1],
      [0.0001, 0],
      [-0.00089, 0],
      [0.00336, 1],
      [-0.00018, 3],
      [0.00482, 1],
      [-9e-5, 3],
      [2e-5, 3]
    ]
  },
  "QA_lstPexMuscstrength[FingersFlex]": {
    "red_x_points": [
      [0.00012, 0],
      [0.00026, 2],
      [-0.00186, 1],
      [-0.00143, 1],
      [0.00014, 0],
      [0.00037, 0],
      [0.00013, 0],
      [-0.00289, 1],
      [-0.00012, 0],
      [0.00035, 0],
      [0.00026, 0],
      [0.00039, 0],
      [-0.0041, 1],
      [0.00013, 2],
      [0.00044, 2],
      [0.00015, 2],
      [-9e-5, 0],
      [-1e-5, 2],
      [0.00044, 2],
      [0.00014, 0],
      [-0.00383, 1],
      [6e-5, 0],
      [-0.00208, 1],
      [0.00048, 2],
      [0.00041, 2],
      [0.00034, 2],
      [0.0003, 0],
      [0.00018, 0],
      [0.00024, 2],
      [-0.00465, 1],
      [-0.00255, 1],
      [0.00061, 2]
    ],
    "red_o_points": [],
    "y_categories": ["GREATER THAN OR EQUALS TO 3", "LESS THAN 3", "nan"],
    "blue_o_points": [],
    "blue_x_points": [
      [0.00012, 2],
      [0.00066, 2],
      [0.00029, 0],
      [0.00162, 2],
      [0.00141, 0],
      [0.00055, 0],
      [0.00177, 0],
      [0.00028, 0],
      [0.00157, 2],
      [0.00247, 2]
    ]
  },
  "QA_lstPexMuscstrength[ScapulaAbducSuprot]": {
    "red_x_points": [
      [-0.00401, 0],
      [0.00015, 2],
      [-0.00215, 1],
      [-0.00105, 1],
      [-0.00391, 0],
      [6e-5, 0],
      [-0.00284, 1],
      [-0.0021, 1],
      [-0.00028, 1],
      [0.00029, 0],
      [-0.00022, 0],
      [-0.00402, 1],
      [-0.00014, 1],
      [0.00015, 2],
      [0.00028, 2],
      [2e-5, 2],
      [0.00111, 2],
      [6e-5, 2],
      [0.00067, 2],
      [-0.00742, 0],
      [0.00113, 1],
      [-0.00885, 0],
      [-0.00092, 1],
      [0.00041, 2],
      [-0.00718, 0],
      [0.00126, 2],
      [-0.00258, 1],
      [0.00018, 0],
      [8e-5, 2],
      [-0.00365, 0],
      [-0.00184, 1],
      [0.00056, 2]
    ],
    "red_o_points": [],
    "y_categories": ["GREATER THAN OR EQUALS TO 3", "LESS THAN 3", "nan"],
    "blue_o_points": [],
    "blue_x_points": [
      [0.00013, 2],
      [0.00112, 2],
      [0.00054, 0],
      [0.00399, 2],
      [0.00594, 0],
      [0.00032, 0],
      [0.00467, 2],
      [0.00034, 2],
      [0.00898, 1],
      [0.00394, 2]
    ]
  },
  "participant_code": {
    "red_x_points": [
      [-0.02611, 1],
      [-0.02305, 2],
      [-0.02376, 3],
      [-0.02341, 4],
      [-0.02358, 5],
      [-0.02452, 6],
      [-0.0237, 7],
      [-0.02411, 8],
      [-0.02423, 9],
      [-0.02411, 10],
      [-0.02423, 11],
      [-0.02423, 12],
      [-0.02276, 13],
      [-0.02417, 15],
      [-0.02376, 17],
      [-0.02364, 18],
      [-0.02411, 20],
      [-0.02335, 21],
      [-0.02347, 22],
      [-0.02335, 24],
      [-0.02329, 26],
      [-0.02511, 27],
      [-0.02411, 28],
      [-0.02482, 30],
      [-0.0247, 31],
      [-0.02382, 32],
      [-0.02458, 34],
      [-0.02535, 36],
      [-0.024, 38],
      [-0.02358, 39],
      [-0.02452, 40],
      [-0.0237, 41]
    ],
    "red_o_points": [],
    "y_categories": [
      "P16554",
      "P18297",
      "P19283",
      "P19287",
      "P23391",
      "P30595",
      "P31645",
      "P31691",
      "P34778",
      "P35046",
      "P36328",
      "P43633",
      "P4544",
      "P46417",
      "P48965",
      "P53068",
      "P5497",
      "P59529",
      "P62483",
      "P64658",
      "P65202",
      "P66816",
      "P6751",
      "P7408",
      "P75566",
      "P76226",
      "P79971",
      "P82621",
      "P82990",
      "P84549",
      "P84932",
      "P85825",
      "P86989",
      "P8770",
      "P87791",
      "P90550",
      "P93159",
      "P94969",
      "P96710",
      "P97130",
      "P9744",
      "P98500",
      "nan"
    ],
    "blue_o_points": [],
    "blue_x_points": [
      [0.04771, 0],
      [0.04926, 14],
      [0.04686, 16],
      [0.04983, 19],
      [0.04983, 23],
      [0.05293, 25],
      [0.04884, 29],
      [0.04968, 33],
      [0.05575, 35],
      [0.04813, 37]
    ]
  },
  "QA_lstPexTouch[T1]": {
    "red_x_points": [
      [-0.00885, 1],
      [-0.00176, 2],
      [0.00058, 1],
      [-0.00192, 2],
      [-0.01037, 1],
      [-0.0079, 0],
      [0.00163, 1],
      [0.00125, 1],
      [-0.01169, 1],
      [-0.00499, 0],
      [-0.00413, 0],
      [-0.00668, 0],
      [0.00597, 0],
      [-0.00811, 2],
      [-0.00461, 2],
      [-0.00352, 2],
      [-0.01046, 1],
      [-0.00185, 2],
      [-0.00497, 2],
      [0.00706, 0],
      [-0.0106, 1],
      [0.00802, 0],
      [-0.00197, 2],
      [-0.00478, 2],
      [-0.01007, 1],
      [0.00798, 0],
      [0.002, 1],
      [-0.00193, 2],
      [-0.00154, 1],
      [-0.00518, 2],
      [0.0005, 1],
      [-0.01139, 1]
    ],
    "red_o_points": [],
    "y_categories": ["NORM", "NPV", "nan"],
    "blue_o_points": [],
    "blue_x_points": [
      [0.00042, 1],
      [0.00124, 2],
      [0.00132, 1],
      [0.0068, 1],
      [0.01129, 1],
      [0.00063, 1],
      [0.01281, 0],
      [0.00411, 0],
      [0.0125, 0],
      [0.01457, 0]
    ]
  },
  "QA_mulInjOrthesisType[ArmSling]": {
    "red_x_points": [
      [-0.00454, 2],
      [-0.00506, 2],
      [-0.00498, 2],
      [-0.00477, 2],
      [-0.00513, 2],
      [-0.00563, 2],
      [-0.00561, 2],
      [-0.00525, 2],
      [-0.00477, 2],
      [-0.00564, 2],
      [-0.00525, 2],
      [-0.00553, 2],
      [-0.00511, 2],
      [0.00913, 1],
      [-0.00677, 2],
      [-0.00557, 2],
      [-0.00611, 2],
      [-0.00946, 0],
      [0.01097, 1],
      [-0.00497, 2],
      [-0.00505, 2],
      [-0.01366, 0],
      [-0.00245, 3],
      [-0.00649, 2],
      [0.00771, 1],
      [-0.00582, 2],
      [-0.00514, 2],
      [-0.0048, 2],
      [-0.00891, 3],
      [-0.00134, 3],
      [-0.00425, 2],
      [-0.00566, 2]
    ],
    "red_o_points": [],
    "y_categories": ["N", "NOT APPLICABLE", "Y", "nan"],
    "blue_o_points": [],
    "blue_x_points": [
      [0.00181, 2],
      [0.01762, 1],
      [0.01393, 1],
      [0.02637, 1],
      [-0.00393, 2],
      [0.01237, 1],
      [-0.00236, 2],
      [0.01209, 1],
      [-0.00208, 2],
      [0.01013, 3]
    ]
  },
  "QS_mulGraftNerve[Ul]": {
    "red_x_points": [
      [-0.0001, 2],
      [-0.00019, 0],
      [-0.00035, 0],
      [-0.00029, 0],
      [-0.00013, 2],
      [-0.00025, 0],
      [-0.00032, 0],
      [-0.00019, 0],
      [-0.00013, 2],
      [-0.00039, 0],
      [-0.0004, 0],
      [-0.00034, 0],
      [-8e-5, 2],
      [0.00046, 1],
      [-5e-5, 2],
      [-0.0003, 0],
      [-0.00011, 2],
      [-0.00029, 0],
      [-0.0001, 2],
      [-0.00013, 2],
      [-7e-5, 2],
      [-0.00011, 2],
      [-0.00011, 0],
      [-7e-5, 2],
      [-0.00012, 2],
      [-0.0001, 2],
      [-0.00025, 0],
      [-0.00014, 0],
      [0.00067, 1],
      [-0.00013, 2],
      [-0.00021, 0],
      [-6e-5, 2]
    ],
    "red_o_points": [],
    "y_categories": ["N", "NOT APPLICABLE", "nan"],
    "blue_o_points": [],
    "blue_x_points": [
      [0.00069, 1],
      [-3e-5, 2],
      [0.00075, 1],
      [-0.0001, 0],
      [-9e-5, 0],
      [0.00091, 1],
      [-0.0001, 2],
      [0.00052, 1],
      [6e-5, 2],
      [-4e-5, 2]
    ]
  },
  "QA_mulInjOrthesisType[ShoulderSupport]": {
    "red_x_points": [
      [-0.00644, 0],
      [-0.00611, 0],
      [-0.00579, 0],
      [-0.00642, 0],
      [-0.00635, 0],
      [-0.00613, 0],
      [-0.00642, 0],
      [-0.00578, 0],
      [-0.0163, 2],
      [-0.00663, 0],
      [-0.00635, 0],
      [-0.00595, 0],
      [-0.00611, 0],
      [0.01376, 1],
      [-0.00833, 0],
      [-0.00655, 0],
      [-0.00746, 0],
      [-0.01185, 2],
      [0.01543, 1],
      [-0.00528, 0],
      [-0.00624, 0],
      [-0.01717, 2],
      [-0.00452, 3],
      [-0.00817, 0],
      [0.01109, 1],
      [-0.0073, 0],
      [-0.00643, 0],
      [-0.00577, 0],
      [-0.00928, 3],
      [-0.003, 3],
      [-0.0058, 0],
      [-0.00649, 0]
    ],
    "red_o_points": [],
    "y_categories": ["N", "NOT APPLICABLE", "Y", "nan"],
    "blue_o_points": [],
    "blue_x_points": [
      [0.00096, 0],
      [0.02386, 1],
      [0.01602, 1],
      [0.03003, 1],
      [-0.00388, 0],
      [0.0174, 1],
      [-0.00194, 0],
      [0.01546, 1],
      [-0.00112, 0],
      [0.00883, 3]
    ]
  },
  "QA_yonInjUnconscio": {
    "red_x_points": [
      [-0.00608, 1],
      [-0.00718, 1],
      [-0.00433, 2],
      [-0.00398, 2],
      [-0.00343, 2],
      [0.01963, 0],
      [-0.00803, 1],
      [-0.00426, 2],
      [-0.00371, 2],
      [-0.0057, 2],
      [-0.00427, 2],
      [-0.01071, 1],
      [-0.00812, 1],
      [-0.01622, 1],
      [-0.0061, 2],
      [-0.00415, 2],
      [-0.00403, 2],
      [-0.00657, 1],
      [0.00287, 0],
      [-0.00933, 1],
      [-0.00723, 1],
      [-0.0086, 1],
      [-0.00676, 1],
      [-0.00548, 2],
      [-0.00834, 1],
      [-0.00459, 2],
      [-0.00811, 1],
      [-0.00737, 1],
      [-0.00178, 2],
      [-0.00351, 2],
      [-0.00705, 1],
      [-0.0034, 2]
    ],
    "red_o_points": [],
    "y_categories": ["N", "Y", "nan"],
    "blue_o_points": [],
    "blue_x_points": [
      [0.00043, 2],
      [0.00893, 1],
      [0.01691, 0],
      [0.02664, 0],
      [0.02599, 0],
      [0.00046, 2],
      [-0.00196, 1],
      [0.00073, 2],
      [0.02616, 0],
      [7e-5, 2]
    ]
  },
  "QS_mulTransfSite[Other]": {
    "red_x_points": [
      [-0.00182, 3],
      [-0.01257, 0],
      [-0.01295, 0],
      [-0.0129, 0],
      [-0.002, 3],
      [-0.0131, 0],
      [-0.01353, 0],
      [-0.01262, 0],
      [-0.00178, 3],
      [-0.01342, 0],
      [-0.01402, 0],
      [-0.01314, 0],
      [-0.00205, 3],
      [0.019, 1],
      [-0.00195, 3],
      [-0.01263, 0],
      [-0.0022, 3],
      [-0.0119, 0],
      [-0.00238, 3],
      [-0.00193, 3],
      [-0.00194, 3],
      [-0.00195, 3],
      [-0.01237, 0],
      [-0.0019, 3],
      [-0.00267, 3],
      [-0.00212, 3],
      [-0.01302, 0],
      [-0.01175, 0],
      [0.01957, 1],
      [-0.00177, 3],
      [-0.0122, 0],
      [-0.00217, 3]
    ],
    "red_o_points": [],
    "y_categories": ["N", "NOT APPLICABLE", "Y", "nan"],
    "blue_o_points": [],
    "blue_x_points": [
      [0.02347, 1],
      [-0.00079, 3],
      [0.01945, 1],
      [-0.00532, 0],
      [0.04303, 2],
      [0.02022, 1],
      [-0.00066, 3],
      [0.01996, 1],
      [-0.00059, 3],
      [-0.00073, 3]
    ]
  },
  "QS_mulGraftNerve[MCA]": {
    "red_x_points": [
      [-2e-5, 2],
      [-1e-5, 0],
      [-1e-5, 0],
      [-1e-5, 0],
      [-2e-5, 2],
      [-1e-5, 0],
      [-1e-5, 0],
      [-2e-5, 2],
      [-1e-5, 0],
      [-2e-5, 2],
      [0.0001, 1],
      [-2e-5, 2],
      [-1e-5, 0],
      [-2e-5, 2],
      [-2e-5, 2],
      [-2e-5, 2],
      [-2e-5, 2],
      [-2e-5, 2],
      [-2e-5, 2],
      [-1e-5, 0],
      [-1e-5, 0],
      [-2e-5, 2],
      [-1e-5, 0],
      [-2e-5, 2]
    ],
    "red_o_points": [],
    "y_categories": ["N", "NOT APPLICABLE", "nan"],
    "blue_o_points": [],
    "blue_x_points": [
      [0.0001, 1],
      [-1e-5, 0],
      [-1e-5, 0],
      [0.0001, 1],
      [-2e-5, 2],
      [0.0001, 1],
      [-2e-5, 2]
    ]
  },
  "QA_lstInjTpbiSide": {
    "red_x_points": [
      [-0.00343, 1],
      [0.00053, 0],
      [0.0001, 0],
      [0.00018, 0],
      [0.00017, 0],
      [-0.0011, 1],
      [-0.00099, 0],
      [-0.00127, 0],
      [-0.0037, 1],
      [-0.00055, 0],
      [-0.00217, 1],
      [-0.00147, 1],
      [-0.00307, 1],
      [-0.01215, 0],
      [-0.00816, 1],
      [-0.0021, 1],
      [0.00061, 0],
      [-0.00212, 1],
      [-0.0087, 1],
      [-0.00062, 0],
      [0.00025, 0],
      [-0.00056, 0],
      [-0.00062, 0],
      [0.00293, 0],
      [-0.00601, 1],
      [-0.00596, 1],
      [-0.00165, 1],
      [-0.00057, 1],
      [-0.0124, 0],
      [-0.00581, 1],
      [-0.0004, 0],
      [0.00242, 0]
    ],
    "red_o_points": [],
    "y_categories": ["L", "R", "nan"],
    "blue_o_points": [],
    "blue_x_points": [
      [-0.00412, 0],
      [0.00793, 0],
      [0.00701, 1],
      [0.00415, 0],
      [0.00236, 1],
      [0.00767, 1],
      [0.00377, 1],
      [0.00707, 1],
      [0.00639, 0],
      [0.00594, 0]
    ]
  },
  "QA_intPexWristFlex": {
    "red_x_points": [
      [-0.00028, 2],
      [-0.00118, 2],
      [-0.00099, 2],
      [-0.00115, 2],
      [-0.00107, 0],
      [-0.00508, 0],
      [-0.0032, 0],
      [-0.00114, 2],
      [-0.00155, 0],
      [-0.00152, 2],
      [-0.00168, 2],
      [-0.00171, 2],
      [-0.00129, 0],
      [0.0002, 2],
      [-0.00022, 2],
      [-0.00137, 2],
      [-7e-5, 2],
      [-0.00093, 2],
      [0.0, 2],
      [-0.00136, 0],
      [-0.0009, 0],
      [-0.00136, 0],
      [-0.00215, 0],
      [-0.0003, 2],
      [-0.00041, 2],
      [-9e-5, 2],
      [-0.00162, 2],
      [-0.00117, 2],
      [-0.01475, 1],
      [-0.00046, 1],
      [-0.00229, 0],
      [-0.00022, 2]
    ],
    "red_o_points": [],
    "y_categories": ["GREATER THAN OR EQUALS TO 60", "LESS THAN 60", "nan"],
    "blue_o_points": [],
    "blue_x_points": [
      [0.00127, 2],
      [8e-5, 2],
      [0.00508, 0],
      [-0.00045, 2],
      [0.02289, 1],
      [0.00155, 2],
      [0.00011, 2],
      [0.00121, 2],
      [0.00103, 0],
      [0.0001, 2]
    ]
  },
  "QA_lstPexArthre[Shoulder]": {
    "red_x_points": [
      [-0.00043, 2],
      [-0.00154, 3],
      [-0.00264, 3],
      [-0.0024, 0],
      [-0.00402, 3],
      [-0.00505, 2],
      [-0.00127, 2],
      [0.00169, 1],
      [-0.00579, 3],
      [-0.00158, 2],
      [-0.00184, 2],
      [-0.00251, 2],
      [-0.00165, 2],
      [-0.00078, 3],
      [-0.00315, 3],
      [-0.00113, 2],
      [-0.00348, 3],
      [-0.00164, 3],
      [-0.00203, 3],
      [-0.00279, 2],
      [-0.00051, 1],
      [-0.00263, 2],
      [-0.00175, 3],
      [-0.00208, 3],
      [-0.00223, 2],
      [-0.0043, 3],
      [-0.00437, 3],
      [-0.00218, 3],
      [-0.00066, 3],
      [-0.00295, 3],
      [-0.00016, 1],
      [-0.00365, 3]
    ],
    "red_o_points": [],
    "y_categories": ["NAIA", "NPV", "PV", "nan"],
    "blue_o_points": [],
    "blue_x_points": [
      [0.00011, 2],
      [-0.00119, 3],
      [3e-5, 2],
      [0.00166, 2],
      [0.01955, 1],
      [-0.00011, 2],
      [0.02114, 1],
      [-8e-5, 3],
      [0.00372, 2],
      [0.00187, 2]
    ]
  },
  "QS_mulGraftRoot[T2]": {
    "red_x_points": [[-7e-5, 0], [1e-5, 2], [-7e-5, 0], [-7e-5, 0], [1e-5, 2]],
    "red_o_points": [],
    "y_categories": ["N", "NOT APPLICABLE", "nan"],
    "blue_o_points": [],
    "blue_x_points": [
      [8e-5, 1],
      [-7e-5, 0],
      [1e-5, 2],
      [8e-5, 1],
      [1e-5, 2],
      [1e-5, 2]
    ]
  },
  "QS_mulGraftNerve[Ax]": {
    "red_x_points": [
      [-2e-5, 2],
      [-1e-5, 0],
      [-4e-5, 0],
      [-4e-5, 0],
      [1e-5, 2],
      [-3e-5, 0],
      [-6e-5, 0],
      [1e-5, 2],
      [-4e-5, 0],
      [-7e-5, 0],
      [-1e-5, 0],
      [2e-5, 2],
      [-1e-5, 2],
      [-6e-5, 0],
      [-2e-5, 2],
      [-0.00013, 0],
      [-4e-5, 2],
      [1e-5, 2],
      [2e-5, 2],
      [1e-5, 2],
      [-3e-5, 0],
      [-4e-5, 2],
      [-3e-5, 2],
      [1e-5, 2],
      [-7e-5, 0],
      [-4e-5, 0],
      [4e-5, 1],
      [1e-5, 2],
      [-3e-5, 0],
      [-4e-5, 2]
    ],
    "red_o_points": [],
    "y_categories": ["N", "NOT APPLICABLE", "nan"],
    "blue_o_points": [],
    "blue_x_points": [
      [0.00021, 1],
      [1e-5, 2],
      [7e-5, 1],
      [4e-5, 0],
      [-1e-5, 2],
      [0.00034, 1],
      [1e-5, 2],
      [2e-5, 2]
    ]
  },
  "QA_lstPexPain[C5]": {
    "red_x_points": [
      [-0.00222, 1],
      [-0.00462, 2],
      [-0.00476, 2],
      [-0.00469, 2],
      [-0.00227, 1],
      [-0.00094, 1],
      [-0.00074, 1],
      [-0.00094, 1],
      [-0.00296, 1],
      [-0.00107, 1],
      [-0.00103, 1],
      [-0.00094, 1],
      [-0.00248, 1],
      [-0.01466, 2],
      [-0.00649, 2],
      [-0.00485, 2],
      [-0.00647, 2],
      [-0.005, 2],
      [-0.00582, 2],
      [-0.00242, 1],
      [-0.00224, 1],
      [-0.00238, 1],
      [-0.00521, 2],
      [-0.00693, 2],
      [-0.00244, 1],
      [-0.00709, 2],
      [-0.0044, 2],
      [-0.00417, 2],
      [-0.00482, 1],
      [-0.00384, 1],
      [-0.00072, 1],
      [-0.00289, 1]
    ],
    "red_o_points": [],
    "y_categories": ["NORM", "NPV", "nan"],
    "blue_o_points": [],
    "blue_x_points": [
      [0.02213, 0],
      [-0.00316, 2],
      [3e-5, 1],
      [-0.00025, 1],
      [-0.00046, 1],
      [-4e-5, 1],
      [-0.00128, 1],
      [0.01961, 0],
      [-0.00087, 1],
      [0.04072, 0]
    ]
  },
  "QS_mulBpsurgeryType[Lysis]": {
    "red_x_points": [
      [-0.00185, 3],
      [-0.00558, 0],
      [-0.01289, 2],
      [-0.00523, 0],
      [-0.00209, 3],
      [-0.0061, 0],
      [-0.01316, 2],
      [-0.00503, 0],
      [-0.00213, 3],
      [-0.00536, 0],
      [-0.00643, 0],
      [-0.00509, 0],
      [-0.00177, 3],
      [0.01142, 1],
      [-0.00167, 3],
      [-0.0055, 0],
      [-0.00161, 3],
      [-0.01274, 2],
      [-0.00178, 3],
      [-0.00226, 3],
      [-0.00136, 3],
      [-0.00177, 3],
      [-0.00525, 0],
      [-0.0017, 3],
      [-0.0022, 3],
      [-0.00178, 3],
      [-0.00458, 0],
      [-0.00511, 0],
      [0.01181, 1],
      [-0.00162, 3],
      [-0.01162, 2],
      [-0.00163, 3]
    ],
    "red_o_points": [],
    "y_categories": ["N", "NOT APPLICABLE", "Y", "nan"],
    "blue_o_points": [],
    "blue_x_points": [
      [0.01919, 1],
      [-0.00011, 3],
      [0.01781, 1],
      [0.00184, 0],
      [-0.00052, 0],
      [0.01702, 1],
      [-0.00078, 3],
      [0.0165, 1],
      [-0.00072, 3],
      [3e-5, 3]
    ]
  },
  "QS_mulLysisSite[Trunk]": {
    "red_x_points": [
      [-0.00166, 3],
      [-0.00379, 0],
      [-0.0038, 0],
      [-0.00448, 0],
      [-0.00128, 3],
      [-0.00445, 0],
      [-0.01076, 2],
      [-0.00371, 0],
      [-0.00168, 3],
      [-0.00442, 0],
      [-0.00395, 0],
      [-0.00384, 0],
      [-0.00156, 3],
      [0.00852, 1],
      [-0.00112, 3],
      [-0.00369, 0],
      [-0.00126, 3],
      [-0.00858, 2],
      [-0.00201, 3],
      [-0.00157, 3],
      [-0.00146, 3],
      [-0.00138, 3],
      [-0.00399, 0],
      [-0.00117, 3],
      [-0.00164, 3],
      [-0.0011, 3],
      [-0.00433, 0],
      [-0.00365, 0],
      [0.00923, 1],
      [-0.00109, 3],
      [-0.0085, 2],
      [-0.00115, 3]
    ],
    "red_o_points": [],
    "y_categories": ["N", "NOT APPLICABLE", "Y", "nan"],
    "blue_o_points": [],
    "blue_x_points": [
      [0.01425, 1],
      [-0.00056, 3],
      [0.01225, 1],
      [0.00089, 0],
      [-0.00138, 0],
      [0.01146, 1],
      [-0.00072, 3],
      [0.01115, 1],
      [-0.00017, 3],
      [-8e-5, 3]
    ]
  },
  "QA_lstPexTouch[C8]": {
    "red_x_points": [
      [-0.00903, 1],
      [-0.00235, 2],
      [-0.00234, 1],
      [-0.00197, 2],
      [-0.00868, 1],
      [0.00217, 0],
      [-0.00287, 1],
      [-0.00273, 1],
      [0.0064, 0],
      [-0.00307, 1],
      [0.00236, 0],
      [0.00242, 0],
      [-0.00955, 1],
      [-0.0098, 2],
      [-0.00455, 2],
      [-0.00266, 2],
      [-0.00936, 1],
      [-0.00189, 2],
      [-0.00427, 2],
      [0.00648, 0],
      [-0.00951, 1],
      [0.00559, 0],
      [-0.00251, 2],
      [-0.00434, 2],
      [0.00343, 0],
      [0.00727, 0],
      [-0.00221, 1],
      [-0.00205, 2],
      [-0.00714, 1],
      [-0.00409, 2],
      [-0.00267, 1],
      [-0.00968, 1]
    ],
    "red_o_points": [],
    "y_categories": ["NORM", "NPV", "nan"],
    "blue_o_points": [],
    "blue_x_points": [
      [0.00935, 0],
      [-0.00038, 2],
      [0.00075, 1],
      [0.00197, 1],
      [0.00547, 0],
      [0.0002, 1],
      [0.00929, 0],
      [0.0043, 0],
      [0.00974, 0],
      [0.01094, 0]
    ]
  },
  "QS_mulGraftTrunk[UpperTrunk]": {
    "red_x_points": [
      [-0.00069, 3],
      [-0.00093, 0],
      [-0.00108, 0],
      [-0.00111, 0],
      [-0.00067, 3],
      [-0.00102, 0],
      [-0.00111, 0],
      [-0.00113, 0],
      [-0.00077, 3],
      [-0.00093, 0],
      [-0.00118, 0],
      [-0.00111, 0],
      [-0.00065, 3],
      [0.00223, 1],
      [-0.00054, 3],
      [-0.0044, 2],
      [-0.00083, 3],
      [-0.00107, 0],
      [-0.00048, 3],
      [-0.00068, 3],
      [-0.0004, 3],
      [-0.00069, 3],
      [-0.00108, 0],
      [-0.00071, 3],
      [-0.00055, 3],
      [-0.00068, 3],
      [-0.00127, 0],
      [-0.00122, 0],
      [0.00188, 1],
      [-0.00068, 3],
      [-0.00123, 0],
      [-0.00049, 3]
    ],
    "red_o_points": [],
    "y_categories": ["N", "NOT APPLICABLE", "Y", "nan"],
    "blue_o_points": [],
    "blue_x_points": [
      [0.00463, 1],
      [-5e-5, 3],
      [0.00406, 1],
      [0.00056, 0],
      [-0.00049, 0],
      [0.00437, 1],
      [-0.00026, 3],
      [0.00424, 1],
      [-0.00016, 3],
      [-8e-5, 3]
    ]
  },
  "QS_mulTransfSite[PhMc]": {
    "red_x_points": [
      [-0.00056, 3],
      [-0.00237, 0],
      [-0.00194, 0],
      [-0.0027, 0],
      [-0.00069, 3],
      [-0.00317, 0],
      [-0.00232, 0],
      [-0.00684, 2],
      [-0.00076, 3],
      [-0.00284, 0],
      [-0.00271, 0],
      [-0.00259, 0],
      [-0.00102, 3],
      [0.00496, 1],
      [-0.0006, 3],
      [-0.00254, 0],
      [-0.00082, 3],
      [-0.00215, 0],
      [-0.00064, 3],
      [-0.0007, 3],
      [-0.00058, 3],
      [-0.00054, 3],
      [-0.00476, 2],
      [-0.00068, 3],
      [-0.00068, 3],
      [-0.00067, 3],
      [-0.00256, 0],
      [-0.00268, 0],
      [0.00543, 1],
      [-0.00049, 3],
      [-0.00224, 0],
      [-0.00079, 3]
    ],
    "red_o_points": [],
    "y_categories": ["N", "NOT APPLICABLE", "Y", "nan"],
    "blue_o_points": [],
    "blue_x_points": [
      [0.00943, 1],
      [-0.00026, 3],
      [0.00676, 1],
      [-0.0005, 0],
      [-0.00059, 0],
      [0.00687, 1],
      [-0.00051, 3],
      [0.00627, 1],
      [-0.00022, 3],
      [-6e-5, 3]
    ]
  },
  "QA_mulInjTbpiCause[Motorcycle]": {
    "red_x_points": [
      [-0.00349, 0],
      [-0.00053, 1],
      [-0.00077, 1],
      [-0.00054, 1],
      [-0.00025, 1],
      [-0.00072, 1],
      [-0.00017, 1],
      [-0.00056, 1],
      [0.00027, 1],
      [-0.00084, 1],
      [-0.00036, 1],
      [-0.00023, 1],
      [-0.00597, 0],
      [-0.03446, 1],
      [-0.00052, 1],
      [-0.00089, 1],
      [-0.0004, 1],
      [-0.00058, 1],
      [-0.00116, 1],
      [-0.00966, 0],
      [0.00074, 1],
      [0.00187, 1],
      [-0.0003, 1],
      [-0.0007, 1],
      [-0.00039, 1],
      [-0.0053, 0],
      [-0.00033, 1],
      [-0.00032, 1],
      [-0.03698, 1],
      [-0.00028, 1],
      [-0.00022, 1],
      [-0.00055, 1]
    ],
    "red_o_points": [],
    "y_categories": ["N", "Y", "nan"],
    "blue_o_points": [],
    "blue_x_points": [
      [0.01761, 0],
      [-8e-5, 1],
      [0.01352, 0],
      [-0.00106, 1],
      [9e-5, 1],
      [0.01546, 0],
      [0.00288, 1],
      [0.01418, 0],
      [0.00267, 1],
      [0.00317, 1]
    ]
  },
  "QS_mulLysisSite[Root]": {
    "red_x_points": [
      [-0.00023, 3],
      [-0.00153, 0],
      [-0.00542, 2],
      [-0.00165, 0],
      [-0.00036, 3],
      [-0.00163, 0],
      [-0.00115, 0],
      [-0.00132, 0],
      [-0.00064, 3],
      [-0.00149, 0],
      [-0.0012, 0],
      [-0.00137, 0],
      [-0.00044, 3],
      [0.00354, 1],
      [-0.00046, 3],
      [-0.0017, 0],
      [-0.00025, 3],
      [-0.00132, 0],
      [-0.00048, 3],
      [-0.00071, 3],
      [-0.0003, 3],
      [-0.0002, 3],
      [-0.00145, 0],
      [-0.0005, 3],
      [-0.00041, 3],
      [-0.00025, 3],
      [-0.00162, 0],
      [-0.00145, 0],
      [0.00383, 1],
      [-0.00023, 3],
      [-0.00509, 2],
      [-0.00027, 3]
    ],
    "red_o_points": [],
    "y_categories": ["N", "NOT APPLICABLE", "Y", "nan"],
    "blue_o_points": [],
    "blue_x_points": [
      [0.00458, 1],
      [-9e-5, 3],
      [0.004, 1],
      [0.00023, 0],
      [0.00014, 0],
      [0.00391, 1],
      [-0.0001, 3],
      [0.00408, 1],
      [-0.00026, 3],
      [-3e-5, 3]
    ]
  },
  "QA_yonInjOrtsurg": {
    "red_x_points": [
      [-0.00101, 2],
      [-0.00019, 2],
      [-0.00015, 2],
      [-0.00016, 2],
      [-0.00134, 2],
      [0.00012, 2],
      [8e-5, 2],
      [0.00022, 1],
      [-0.0014, 2],
      [-0.00135, 0],
      [0.00047, 1],
      [0.00038, 1],
      [-0.00101, 2],
      [-0.00625, 0],
      [0.00465, 1],
      [-0.00018, 2],
      [-0.00162, 2],
      [-0.00235, 0],
      [-0.01131, 0],
      [-0.01054, 0],
      [0.00287, 1],
      [-0.00156, 2],
      [0.0003, 1],
      [-0.00261, 2],
      [-0.00156, 2],
      [-0.0017, 2],
      [-0.00156, 0],
      [-0.00167, 0],
      [0.00079, 1],
      [-0.00174, 2],
      [0.00043, 1],
      [-0.00149, 2]
    ],
    "red_o_points": [],
    "y_categories": ["N", "Y", "nan"],
    "blue_o_points": [],
    "blue_x_points": [
      [0.0002, 2],
      [0.01152, 1],
      [0.00082, 2],
      [0.00111, 2],
      [0.00061, 2],
      [0.00075, 2],
      [-0.00066, 2],
      [0.00062, 2],
      [0.01181, 1],
      [-0.00084, 2]
    ]
  },
  "QS_mulGraftLevel[Trunk]": {
    "red_x_points": [
      [-0.00024, 3],
      [-0.00113, 0],
      [-0.00112, 0],
      [-0.00148, 0],
      [-0.00027, 3],
      [-0.00099, 0],
      [-0.00113, 0],
      [-0.00134, 0],
      [-0.00032, 3],
      [-0.00128, 0],
      [-0.00105, 0],
      [-0.00117, 0],
      [-0.0004, 3],
      [0.00239, 1],
      [-0.00026, 3],
      [-0.00503, 2],
      [-0.00036, 3],
      [-0.00086, 0],
      [-0.00034, 3],
      [-0.0003, 3],
      [-0.00028, 3],
      [-0.00029, 3],
      [-0.00118, 0],
      [-0.00025, 3],
      [-0.00019, 3],
      [-0.00021, 3],
      [-0.00102, 0],
      [-0.00068, 0],
      [0.00198, 1],
      [-0.00032, 3],
      [-0.00129, 0],
      [-0.00015, 3]
    ],
    "red_o_points": [],
    "y_categories": ["N", "NOT APPLICABLE", "Y", "nan"],
    "blue_o_points": [],
    "blue_x_points": [
      [0.00388, 1],
      [0.00013, 3],
      [0.00277, 1],
      [0.00031, 0],
      [-0.00078, 0],
      [0.00343, 1],
      [-4e-5, 3],
      [0.00279, 1],
      [-0.00014, 3],
      [0.0, 3]
    ]
  },
  "QS_mulGraftNerve[other]": {
    "red_x_points": [
      [-3e-5, 2],
      [-0.0002, 0],
      [-0.00022, 0],
      [-0.00018, 0],
      [-5e-5, 2],
      [-0.00021, 0],
      [-0.00021, 0],
      [-0.00023, 0],
      [-2e-5, 2],
      [-0.00025, 0],
      [-0.00011, 0],
      [-0.00019, 0],
      [-4e-5, 2],
      [0.0003, 1],
      [-5e-5, 2],
      [-0.00023, 0],
      [-0.0001, 2],
      [-0.0002, 0],
      [-0.00024, 2],
      [-6e-5, 2],
      [-2e-5, 2],
      [-3e-5, 2],
      [-0.00016, 0],
      [-8e-5, 2],
      [-0.0001, 2],
      [-5e-5, 2],
      [-0.00019, 0],
      [-0.00013, 0],
      [0.00043, 1],
      [-0.0, 2],
      [-0.00017, 0],
      [-3e-5, 2]
    ],
    "red_o_points": [],
    "y_categories": ["N", "NOT APPLICABLE", "nan"],
    "blue_o_points": [],
    "blue_x_points": [
      [0.00086, 1],
      [0.00015, 2],
      [0.0004, 1],
      [1e-5, 0],
      [-4e-5, 0],
      [0.00032, 1],
      [-0.0, 2],
      [0.00025, 1],
      [-3e-5, 2],
      [-1e-5, 2]
    ]
  },
  "QS_mulTransfSite[AcSsAA]": {
    "red_x_points": [
      [-0.00195, 3],
      [-0.01343, 2],
      [-0.00407, 0],
      [-0.0129, 2],
      [-0.00211, 3],
      [-0.01729, 2],
      [-0.00375, 0],
      [-0.00451, 0],
      [-0.00205, 3],
      [-0.00458, 0],
      [-0.01385, 2],
      [-0.00351, 0],
      [-0.00209, 3],
      [0.01563, 1],
      [-0.00178, 3],
      [-0.01379, 2],
      [-0.00176, 3],
      [-0.00405, 0],
      [-0.0022, 3],
      [-0.00212, 3],
      [-0.00181, 3],
      [-0.00219, 3],
      [-0.01264, 2],
      [-0.0021, 3],
      [-0.00225, 3],
      [-0.002, 3],
      [-0.00372, 0],
      [-0.01272, 2],
      [0.01532, 1],
      [-0.00195, 3],
      [-0.00369, 0],
      [-0.00169, 3]
    ],
    "red_o_points": [],
    "y_categories": ["N", "NOT APPLICABLE", "Y", "nan"],
    "blue_o_points": [],
    "blue_x_points": [
      [0.02175, 1],
      [-0.00105, 3],
      [0.01822, 1],
      [0.00072, 0],
      [0.0009, 0],
      [0.01774, 1],
      [-0.00064, 3],
      [0.01788, 1],
      [-0.00078, 3],
      [-0.00049, 3]
    ]
  },
  "QS_mulGraftNerve[LP]": {
    "red_x_points": [
      [-1e-5, 2],
      [-0.0, 0],
      [-1e-5, 2],
      [-0.0, 0],
      [-0.0, 0],
      [-0.0, 0],
      [-0.0, 0],
      [-1e-5, 2],
      [-0.0, 0],
      [-1e-5, 2],
      [-1e-5, 2],
      [-1e-5, 2],
      [-0.0, 0],
      [-0.0, 0],
      [-0.0, 0],
      [-1e-5, 2]
    ],
    "red_o_points": [],
    "y_categories": ["N", "NOT APPLICABLE", "nan"],
    "blue_o_points": [],
    "blue_x_points": [[0.00016, 1], [-0.0, 0], [-1e-5, 2]]
  },
  "QA_lstPexMuscstrength[WristFlex]": {
    "red_x_points": [
      [-0.00278, 1],
      [-0.00089, 2],
      [-0.00341, 1],
      [-0.00176, 1],
      [-0.00096, 0],
      [0.00092, 0],
      [0.0011, 0],
      [-0.00437, 1],
      [-0.00284, 0],
      [0.00117, 0],
      [0.00026, 0],
      [0.00071, 0],
      [-0.0022, 0],
      [-0.0017, 2],
      [-0.00074, 2],
      [-0.00082, 2],
      [-0.00139, 0],
      [-0.00103, 2],
      [-0.00101, 2],
      [-0.00401, 0],
      [-0.00138, 1],
      [-0.00395, 0],
      [-0.00212, 1],
      [-0.00088, 2],
      [-0.00747, 1],
      [-0.00235, 0],
      [0.00101, 0],
      [0.00058, 0],
      [-0.00103, 2],
      [-0.0023, 1],
      [-0.00322, 1],
      [-0.00066, 2]
    ],
    "red_o_points": [],
    "y_categories": ["GREATER THAN OR EQUALS TO 3", "LESS THAN 3", "nan"],
    "blue_o_points": [],
    "blue_x_points": [
      [0.00104, 0],
      [0.00063, 2],
      [0.00177, 0],
      [0.0046, 0],
      [0.00276, 0],
      [0.00181, 0],
      [0.00117, 0],
      [0.00159, 0],
      [0.00943, 1],
      [0.00565, 2]
    ]
  },
  "QS_mulNeuromadSite[C5]": {
    "red_x_points": [
      [-0.00017, 2],
      [-0.00072, 0],
      [-0.00084, 0],
      [-0.0009, 0],
      [-0.00037, 2],
      [-0.00079, 0],
      [-0.00068, 0],
      [-0.00084, 0],
      [-0.0004, 2],
      [-0.00091, 0],
      [-0.00083, 0],
      [-0.00092, 0],
      [-0.00018, 2],
      [0.00118, 1],
      [-0.00013, 2],
      [-0.00092, 0],
      [-0.00031, 2],
      [-0.00072, 0],
      [-0.00013, 2],
      [-0.00024, 2],
      [-8e-5, 2],
      [-0.00027, 2],
      [-0.00068, 0],
      [-0.00021, 2],
      [-0.00026, 2],
      [-0.00013, 2],
      [-0.00081, 0],
      [-0.00077, 0],
      [0.00145, 1],
      [-0.00014, 2],
      [-0.00061, 0],
      [-0.00024, 2]
    ],
    "red_o_points": [],
    "y_categories": ["N", "NOT APPLICABLE", "nan"],
    "blue_o_points": [],
    "blue_x_points": [
      [0.00238, 1],
      [-2e-5, 2],
      [0.00141, 1],
      [0.0001, 0],
      [-0.0003, 0],
      [0.00191, 1],
      [-0.00013, 2],
      [0.00176, 1],
      [-5e-5, 2],
      [-3e-5, 2]
    ]
  },
  "QS_mulNeuromadSite[C7]": {
    "red_x_points": [
      [-0.0002, 2],
      [-0.00087, 0],
      [-0.00061, 0],
      [-0.00084, 0],
      [-0.00013, 2],
      [-0.00084, 0],
      [-0.00069, 0],
      [-0.00099, 0],
      [-0.0003, 2],
      [-0.00097, 0],
      [-0.00078, 0],
      [-0.00069, 0],
      [-0.00036, 2],
      [0.00074, 1],
      [-3e-5, 2],
      [-0.00078, 0],
      [-0.00035, 2],
      [-0.00086, 0],
      [0.0, 2],
      [-0.00043, 2],
      [-0.00025, 2],
      [-0.00027, 2],
      [-0.00078, 0],
      [-5e-5, 2],
      [-0.00022, 2],
      [-0.0001, 2],
      [-0.00082, 0],
      [-0.00081, 0],
      [0.00122, 1],
      [-0.00021, 2],
      [-0.00077, 0],
      [-0.0001, 2]
    ],
    "red_o_points": [],
    "y_categories": ["N", "NOT APPLICABLE", "nan"],
    "blue_o_points": [],
    "blue_x_points": [
      [0.00259, 1],
      [8e-5, 2],
      [0.00193, 1],
      [-0.00025, 0],
      [-8e-5, 0],
      [0.00185, 1],
      [2e-5, 2],
      [0.00168, 1],
      [-7e-5, 2],
      [0.00013, 2]
    ]
  },
  "QS_mulLysisRoot[C5]": {
    "red_x_points": [
      [-0.00121, 3],
      [-0.00276, 0],
      [-0.0077, 2],
      [-0.00288, 0],
      [-0.00128, 3],
      [-0.00336, 0],
      [-0.00267, 0],
      [-0.00237, 0],
      [-0.00143, 3],
      [-0.00348, 0],
      [-0.00335, 0],
      [-0.00262, 0],
      [-0.00133, 3],
      [0.00549, 1],
      [-0.00112, 3],
      [-0.00332, 0],
      [-0.00118, 3],
      [-0.0025, 0],
      [-0.00105, 3],
      [-0.00117, 3],
      [-0.00117, 3],
      [-0.00104, 3],
      [-0.00236, 0],
      [-0.001, 3],
      [-0.00088, 3],
      [-0.001, 3],
      [-0.00277, 0],
      [-0.00225, 0],
      [0.00645, 1],
      [-0.00087, 3],
      [-0.00746, 2],
      [-0.00108, 3]
    ],
    "red_o_points": [],
    "y_categories": ["N", "NOT APPLICABLE", "Y", "nan"],
    "blue_o_points": [],
    "blue_x_points": [
      [0.00935, 1],
      [-0.00019, 3],
      [0.00893, 1],
      [0.00013, 0],
      [0.00011, 0],
      [0.00854, 1],
      [-0.00035, 3],
      [0.00962, 1],
      [-0.00064, 3],
      [-7e-5, 3]
    ]
  },
  "QS_mulGraftNerve[TD]": {
    "red_x_points": [
      [-2e-5, 2],
      [-0.00015, 0],
      [-0.00015, 0],
      [-1e-5, 2],
      [-6e-5, 0],
      [-9e-5, 0],
      [-6e-5, 0],
      [-1e-5, 2],
      [-0.00015, 0],
      [-0.00015, 0],
      [-0.00015, 0],
      [-1e-5, 2],
      [8e-5, 1],
      [0.0, 2],
      [-0.00015, 0],
      [-2e-5, 2],
      [-9e-5, 0],
      [-1e-5, 2],
      [-1e-5, 2],
      [0.0, 2],
      [-2e-5, 2],
      [-9e-5, 0],
      [-2e-5, 2],
      [0.0, 2],
      [0.0, 2],
      [-9e-5, 0],
      [-0.00015, 0],
      [0.0003, 1],
      [-1e-5, 2],
      [-0.00015, 0],
      [-1e-5, 2]
    ],
    "red_o_points": [],
    "y_categories": ["N", "NOT APPLICABLE", "nan"],
    "blue_o_points": [],
    "blue_x_points": [
      [0.00022, 1],
      [-1e-5, 2],
      [8e-5, 1],
      [-3e-5, 0],
      [0.00011, 1],
      [0.0, 2],
      [0.00019, 1],
      [-2e-5, 2],
      [-1e-5, 2]
    ]
  },
  "QS_mulGraftNerve[SS]": {
    "red_x_points": [
      [0.0, 2],
      [-6e-5, 0],
      [-1e-5, 0],
      [-7e-5, 0],
      [-0.00013, 0],
      [-6e-5, 0],
      [-0.00013, 0],
      [-1e-5, 2],
      [-6e-5, 0],
      [-6e-5, 0],
      [-7e-5, 0],
      [2e-5, 2],
      [8e-5, 1],
      [0.0, 2],
      [-0.00013, 0],
      [2e-5, 2],
      [-7e-5, 0],
      [0.0, 2],
      [-1e-5, 2],
      [2e-5, 2],
      [0.0, 2],
      [-6e-5, 0],
      [-1e-5, 2],
      [-3e-5, 2],
      [-1e-5, 2],
      [-0.00013, 0],
      [7e-5, 1],
      [2e-5, 2],
      [-7e-5, 0],
      [-3e-5, 2]
    ],
    "red_o_points": [],
    "y_categories": ["N", "NOT APPLICABLE", "nan"],
    "blue_o_points": [],
    "blue_x_points": [
      [0.00022, 1],
      [2e-5, 2],
      [0.00015, 1],
      [0.00011, 0],
      [0.00015, 1],
      [0.0, 2],
      [0.00019, 1],
      [-2e-5, 2],
      [1e-5, 2]
    ]
  },
  "QS_mulNeuromadSite[C6]": {
    "red_x_points": [
      [1e-5, 2],
      [-0.00076, 0],
      [-0.00083, 0],
      [-0.00103, 0],
      [-0.00012, 2],
      [-0.00115, 0],
      [-0.00103, 0],
      [-0.00089, 0],
      [-0.00016, 2],
      [-0.0013, 0],
      [-0.00117, 0],
      [-0.00116, 0],
      [-1e-5, 2],
      [0.00064, 1],
      [-0.00022, 2],
      [-0.001, 0],
      [-0.00019, 2],
      [-0.00078, 0],
      [-0.00024, 2],
      [-8e-5, 2],
      [4e-5, 2],
      [-5e-5, 2],
      [-0.00044, 0],
      [-5e-5, 2],
      [-9e-5, 2],
      [-0.00014, 2],
      [-0.00089, 0],
      [-0.00072, 0],
      [0.00115, 1],
      [-0.00022, 2],
      [-0.00091, 0],
      [-0.00013, 2]
    ],
    "red_o_points": [],
    "y_categories": ["N", "NOT APPLICABLE", "nan"],
    "blue_o_points": [],
    "blue_x_points": [
      [0.0024, 1],
      [7e-5, 2],
      [0.00209, 1],
      [0.00019, 0],
      [-0.00029, 0],
      [0.00275, 1],
      [-1e-5, 2],
      [0.00177, 1],
      [9e-5, 2],
      [-2e-5, 2]
    ]
  },
  "QA_lstPexArthre[Index]": {
    "red_x_points": [
      [-0.00286, 0],
      [-0.00166, 2],
      [-0.00225, 2],
      [-0.002, 0],
      [-0.00346, 2],
      [0.00132, 1],
      [0.00213, 1],
      [-0.00393, 0],
      [-0.00544, 2],
      [0.00208, 1],
      [0.00123, 1],
      [-0.00554, 0],
      [0.00149, 1],
      [-0.00091, 2],
      [-0.00238, 2],
      [0.00109, 1],
      [-0.00325, 2],
      [-0.00168, 2],
      [-0.00206, 2],
      [-0.00043, 1],
      [-0.00431, 0],
      [-0.00184, 1],
      [-0.0016, 2],
      [-0.00228, 2],
      [4e-5, 1],
      [-0.00376, 2],
      [-0.00263, 2],
      [-0.00118, 2],
      [-0.00114, 2],
      [-0.003, 2],
      [-0.00401, 0],
      [-0.00346, 2]
    ],
    "red_o_points": [],
    "y_categories": ["NPV", "PV", "nan"],
    "blue_o_points": [],
    "blue_x_points": [
      [0.002, 0],
      [-0.00108, 2],
      [0.00084, 1],
      [0.00543, 1],
      [0.00466, 1],
      [0.00061, 1],
      [0.01193, 0],
      [-0.00028, 2],
      [0.00685, 1],
      [0.00451, 1]
    ]
  },
  "QA_lstPexMuscstrength[ElbowExte]": {
    "red_x_points": [
      [-0.00045, 1],
      [-0.00106, 2],
      [-0.0, 1],
      [0.00044, 1],
      [-0.00109, 1],
      [-0.00807, 0],
      [0.00062, 1],
      [0.00041, 1],
      [-0.00056, 1],
      [-0.00521, 0],
      [-0.00408, 0],
      [0.00087, 1],
      [-0.00023, 1],
      [-0.00057, 2],
      [-0.00191, 2],
      [-0.00199, 2],
      [-0.00138, 1],
      [-0.00072, 2],
      [-0.00226, 2],
      [-0.00403, 0],
      [-0.00128, 1],
      [-0.00509, 0],
      [3e-5, 1],
      [-0.00194, 2],
      [-0.00535, 0],
      [-0.0041, 0],
      [0.00122, 1],
      [-0.00137, 2],
      [-0.00064, 2],
      [-0.00149, 1],
      [-0.0, 1],
      [-0.00196, 2]
    ],
    "red_o_points": [],
    "y_categories": ["GREATER THAN OR EQUALS TO 3", "LESS THAN 3", "nan"],
    "blue_o_points": [],
    "blue_x_points": [
      [0.00015, 2],
      [-0.00024, 2],
      [0.00014, 0],
      [0.00518, 1],
      [0.00674, 1],
      [0.00064, 0],
      [0.00503, 0],
      [0.00075, 0],
      [0.00869, 1],
      [0.0064, 1]
    ]
  },
  "QS_mulLysisRoot[C7]": {
    "red_x_points": [
      [-0.00024, 3],
      [-0.00099, 0],
      [-0.00347, 2],
      [-0.00111, 0],
      [-0.00027, 3],
      [-0.00101, 0],
      [-0.00093, 0],
      [-0.00093, 0],
      [-0.00031, 3],
      [-0.00086, 0],
      [-0.00107, 0],
      [-0.00076, 0],
      [-0.00029, 3],
      [0.00147, 1],
      [-0.00052, 3],
      [-0.00101, 0],
      [-0.00031, 3],
      [-0.00073, 0],
      [-0.00029, 3],
      [-0.00033, 3],
      [-0.00024, 3],
      [-0.00018, 3],
      [-0.00076, 0],
      [-0.00047, 3],
      [-0.00021, 3],
      [-0.00034, 3],
      [-0.00091, 0],
      [-0.00095, 0],
      [0.00227, 1],
      [-0.00027, 3],
      [-0.00081, 0],
      [-0.00021, 3]
    ],
    "red_o_points": [],
    "y_categories": ["N", "NOT APPLICABLE", "Y", "nan"],
    "blue_o_points": [],
    "blue_x_points": [
      [0.00315, 1],
      [-0.00018, 3],
      [0.00266, 1],
      [4e-5, 0],
      [-0.00034, 0],
      [0.00205, 1],
      [-8e-5, 3],
      [0.00364, 1],
      [-0.00013, 3],
      [-0.00013, 3]
    ]
  },
  "QS_mulTransfSite[IMc]": {
    "red_x_points": [
      [-0.00112, 3],
      [-0.01061, 2],
      [-0.00308, 0],
      [-0.00434, 0],
      [-0.00135, 3],
      [-0.00498, 0],
      [-0.00377, 0],
      [-0.00431, 0],
      [-0.00199, 3],
      [-0.00469, 0],
      [-0.0046, 0],
      [-0.00384, 0],
      [-0.00181, 3],
      [0.00979, 1],
      [-0.00159, 3],
      [-0.00416, 0],
      [-0.00162, 3],
      [-0.0098, 2],
      [-0.00166, 3],
      [-0.00166, 3],
      [-0.0013, 3],
      [-0.00187, 3],
      [-0.0039, 0],
      [-0.0015, 3],
      [-0.00135, 3],
      [-0.00148, 3],
      [-0.00419, 0],
      [-0.0095, 2],
      [0.01141, 1],
      [-0.00129, 3],
      [-0.00958, 2],
      [-0.00155, 3]
    ],
    "red_o_points": [],
    "y_categories": ["N", "NOT APPLICABLE", "Y", "nan"],
    "blue_o_points": [],
    "blue_x_points": [
      [0.01474, 1],
      [-0.0002, 3],
      [0.01346, 1],
      [8e-5, 0],
      [-0.00186, 0],
      [0.01546, 1],
      [-0.0008, 3],
      [0.01441, 1],
      [-0.00069, 3],
      [-0.00032, 3]
    ]
  },
  "QS_lstBpsurgSide": {
    "red_x_points": [
      [-0.00124, 3],
      [-0.00598, 0],
      [-0.0063, 0],
      [-0.00615, 0],
      [-0.00139, 3],
      [-0.00683, 2],
      [-0.00779, 0],
      [-0.00656, 0],
      [-0.00211, 3],
      [-0.00814, 0],
      [-0.00767, 2],
      [-0.00763, 2],
      [-0.00212, 3],
      [0.01033, 1],
      [-0.00116, 3],
      [-0.00786, 2],
      [-0.00189, 3],
      [-0.00703, 2],
      [-0.00154, 3],
      [-0.00256, 3],
      [-0.00148, 3],
      [-0.0019, 3],
      [-0.00605, 0],
      [-0.00127, 3],
      [-0.00151, 3],
      [-0.00129, 3],
      [-0.0071, 2],
      [-0.00632, 2],
      [0.01206, 1],
      [-0.00133, 3],
      [-0.00707, 0],
      [-0.00124, 3]
    ],
    "red_o_points": [],
    "y_categories": ["L", "NOT APPLICABLE", "R", "nan"],
    "blue_o_points": [],
    "blue_x_points": [
      [0.0154, 1],
      [-0.00016, 3],
      [0.01565, 1],
      [0.0028, 0],
      [0.00112, 2],
      [0.01473, 1],
      [-0.00054, 3],
      [0.01586, 1],
      [-8e-5, 3],
      [-0.00024, 3]
    ]
  },
  "QA_lstPexPain[T1]": {
    "red_x_points": [
      [-0.00844, 1],
      [-0.00224, 2],
      [-0.00239, 2],
      [-0.00191, 2],
      [-0.00871, 1],
      [-0.00558, 0],
      [0.00075, 1],
      [0.00073, 1],
      [0.00684, 0],
      [0.00212, 1],
      [-0.00223, 0],
      [-0.0049, 0],
      [0.00607, 0],
      [-0.00986, 2],
      [-0.00542, 2],
      [-0.00331, 2],
      [-0.00439, 2],
      [-0.00188, 2],
      [-0.00568, 2],
      [0.00585, 0],
      [-0.01059, 1],
      [0.00692, 0],
      [-0.00261, 2],
      [-0.00492, 2],
      [-0.00994, 1],
      [-0.00629, 2],
      [-0.00386, 2],
      [-0.00272, 2],
      [-0.00473, 1],
      [-0.0102, 1],
      [-0.00027, 1],
      [-0.0093, 1]
    ],
    "red_o_points": [],
    "y_categories": ["NORM", "NPV", "nan"],
    "blue_o_points": [],
    "blue_x_points": [
      [0.00032, 1],
      [-0.00054, 2],
      [0.00478, 0],
      [0.00654, 1],
      [0.0102, 1],
      [3e-5, 1],
      [0.01053, 0],
      [0.00439, 0],
      [0.01117, 0],
      [0.0156, 0]
    ]
  },
  "QS_mulTransfSite[AcMc]": {
    "red_x_points": [
      [-0.00051, 3],
      [-0.00101, 0],
      [-0.00061, 0],
      [-0.00098, 0],
      [-0.00042, 3],
      [-0.00108, 0],
      [-0.00087, 0],
      [-0.00087, 0],
      [-0.00069, 3],
      [-0.00079, 0],
      [-0.00109, 0],
      [-0.00759, 2],
      [-0.00054, 3],
      [0.00201, 1],
      [-0.00026, 3],
      [-0.0008, 0],
      [-0.00052, 3],
      [-0.00085, 0],
      [-6e-5, 3],
      [-0.00061, 3],
      [-0.00018, 3],
      [-0.00058, 3],
      [-0.00074, 0],
      [-0.00016, 3],
      [-0.00021, 3],
      [-0.00022, 3],
      [-0.00096, 0],
      [-0.00092, 0],
      [0.00206, 1],
      [-0.00025, 3],
      [-0.00057, 0],
      [-0.00026, 3]
    ],
    "red_o_points": [],
    "y_categories": ["N", "NOT APPLICABLE", "Y", "nan"],
    "blue_o_points": [],
    "blue_x_points": [
      [0.00301, 1],
      [-0.0, 3],
      [0.00296, 1],
      [0.00085, 0],
      [0.00043, 0],
      [0.00302, 1],
      [-0.00058, 3],
      [0.00351, 1],
      [-4e-5, 3],
      [-9e-5, 3]
    ]
  },
  "QA_lstPexKine[Shoulder]": {
    "red_x_points": [
      [-0.00127, 1],
      [-0.00228, 2],
      [-0.00239, 2],
      [-0.00213, 2],
      [-0.00525, 2],
      [-0.00448, 1],
      [-0.00236, 1],
      [0.00418, 0],
      [-0.00598, 2],
      [-0.0025, 1],
      [-0.00223, 1],
      [-0.00268, 1],
      [-0.00224, 1],
      [-0.00067, 2],
      [-0.00344, 2],
      [-0.00128, 1],
      [-0.00464, 2],
      [-0.0015, 2],
      [-0.00296, 2],
      [-0.00294, 1],
      [-0.00139, 1],
      [-0.00224, 1],
      [-0.00169, 2],
      [-0.00409, 2],
      [-0.00191, 1],
      [-0.00555, 2],
      [-0.00414, 2],
      [-0.00257, 2],
      [-0.00084, 2],
      [-0.00395, 2],
      [-0.00111, 1],
      [-0.00439, 2]
    ],
    "red_o_points": [],
    "y_categories": ["NPV", "PV", "nan"],
    "blue_o_points": [],
    "blue_x_points": [
      [-3e-5, 1],
      [-0.00171, 2],
      [-0.00032, 1],
      [0.0007, 1],
      [0.02119, 0],
      [-0.00033, 1],
      [0.03362, 0],
      [-0.00021, 2],
      [-5e-5, 1],
      [0.00057, 1]
    ]
  },
  "QA_yonInjBpsurg": {
    "red_x_points": [
      [-0.00203, 1],
      [-0.00134, 1],
      [-0.00175, 1],
      [-0.00162, 1],
      [-0.00185, 1],
      [-0.00204, 1],
      [-0.0016, 1],
      [-0.00157, 1],
      [-0.00223, 1],
      [-0.00215, 1],
      [-0.00167, 1],
      [-0.00155, 1],
      [-0.00206, 1],
      [0.00313, 0],
      [-0.00167, 1],
      [-0.00163, 1],
      [-0.00215, 1],
      [-0.00123, 1],
      [-0.00174, 1],
      [-0.0022, 1],
      [-0.0017, 1],
      [-0.00172, 1],
      [-0.00109, 1],
      [-0.00162, 1],
      [-0.00226, 1],
      [-0.00205, 1],
      [-0.00139, 1],
      [-0.00139, 1],
      [0.00404, 0],
      [-0.00148, 1],
      [-0.00126, 1],
      [-0.00164, 1]
    ],
    "red_o_points": [],
    "y_categories": ["N", "Y", "nan"],
    "blue_o_points": [],
    "blue_x_points": [
      [0.00796, 0],
      [-0.00038, 1],
      [0.00738, 0],
      [-0.00142, 1],
      [-0.00152, 1],
      [0.00743, 0],
      [-0.00077, 1],
      [0.00786, 0],
      [-0.00098, 1],
      [-0.00055, 1]
    ]
  },
  "QA_equInjTbpiAge": {
    "red_x_points": [
      [0.0011, 1],
      [0.00011, 1],
      [-4e-5, 1],
      [-0.00025, 0],
      [0.00148, 1],
      [-0.001, 0],
      [-0.00047, 1],
      [-0.00031, 1],
      [-0.01084, 0],
      [-0.00171, 0],
      [-0.00113, 0],
      [-0.00133, 1],
      [-0.00733, 0],
      [-0.01414, 1],
      [0.00148, 1],
      [-0.00029, 1],
      [0.00083, 1],
      [-0.00181, 0],
      [-0.00772, 0],
      [0.00171, 1],
      [-0.00744, 0],
      [0.00181, 1],
      [0.00014, 1],
      [0.00136, 1],
      [-1e-5, 1],
      [-0.0085, 0],
      [-0.00122, 1],
      [-0.00015, 1],
      [-0.01263, 1],
      [0.00164, 1],
      [-0.00071, 0],
      [0.00137, 1]
    ],
    "red_o_points": [],
    "y_categories": ["GREATER THAN OR EQUALS TO 30", "LESS THAN 30", "nan"],
    "blue_o_points": [],
    "blue_x_points": [
      [-0.0045, 1],
      [0.00303, 1],
      [0.00682, 0],
      [0.00277, 1],
      [0.00287, 0],
      [0.00853, 0],
      [0.00457, 1],
      [0.00704, 0],
      [0.00492, 1],
      [0.0047, 1]
    ]
  },
  "QS_mulLysisNerve[Ssr]": {
    "red_x_points": [
      [-0.00011, 3],
      [-0.00047, 0],
      [-0.00336, 2],
      [-0.00067, 0],
      [-0.00013, 3],
      [-0.00064, 0],
      [-0.00046, 0],
      [-0.00053, 0],
      [-0.00022, 3],
      [-0.00043, 0],
      [-0.00071, 0],
      [-0.00053, 0],
      [-0.00011, 3],
      [0.00152, 1],
      [-0.00013, 3],
      [-0.00049, 0],
      [-0.00012, 3],
      [-0.00061, 0],
      [-0.0002, 3],
      [-0.00037, 3],
      [-6e-5, 3],
      [-1e-5, 3],
      [-0.00045, 0],
      [-0.00028, 3],
      [-0.00031, 3],
      [-0.00013, 3],
      [-0.00067, 0],
      [-0.00059, 0],
      [0.00111, 1],
      [0.0, 3],
      [-0.00043, 0],
      [-6e-5, 3]
    ],
    "red_o_points": [],
    "y_categories": ["N", "NOT APPLICABLE", "Y", "nan"],
    "blue_o_points": [],
    "blue_x_points": [
      [0.00146, 1],
      [-8e-5, 3],
      [0.00157, 1],
      [0.00038, 0],
      [0.00011, 0],
      [0.00175, 1],
      [-1e-5, 3],
      [0.00147, 1],
      [-0.00011, 3],
      [-4e-5, 3]
    ]
  },
  "QS_mulBpsurgeryType[Graft]": {
    "red_x_points": [
      [-0.00022, 3],
      [-0.00058, 0],
      [-0.00066, 0],
      [-0.00054, 0],
      [-0.00013, 3],
      [-0.00052, 0],
      [-0.00061, 0],
      [-0.00065, 0],
      [-0.00018, 3],
      [-0.00052, 0],
      [-0.00053, 0],
      [-0.00063, 0],
      [-0.00018, 3],
      [0.00124, 1],
      [-0.00023, 3],
      [-0.00289, 2],
      [-0.0002, 3],
      [-0.00032, 0],
      [-0.00014, 3],
      [-0.00015, 3],
      [-8e-5, 3],
      [-0.00015, 3],
      [-0.00054, 0],
      [-0.00021, 3],
      [-0.0002, 3],
      [-0.00018, 3],
      [-0.00056, 0],
      [-0.00063, 0],
      [0.00147, 1],
      [-9e-5, 3],
      [-0.00056, 0],
      [-0.00021, 3]
    ],
    "red_o_points": [],
    "y_categories": ["N", "NOT APPLICABLE", "Y", "nan"],
    "blue_o_points": [],
    "blue_x_points": [
      [0.00187, 1],
      [-6e-5, 3],
      [0.00162, 1],
      [0.00031, 0],
      [-0.00044, 0],
      [0.00186, 1],
      [-6e-5, 3],
      [0.00181, 1],
      [-0.00013, 3],
      [-8e-5, 3]
    ]
  },
  "QA_lstPexMuscstrength[WristExte]": {
    "red_x_points": [
      [0.00097, 1],
      [-0.00141, 2],
      [-0.00365, 1],
      [-0.00145, 1],
      [0.00101, 1],
      [0.00055, 0],
      [-0.00273, 1],
      [-0.00351, 1],
      [-0.00994, 0],
      [0.00182, 0],
      [0.00052, 0],
      [-0.0047, 1],
      [-0.00723, 0],
      [-0.00102, 2],
      [-7e-5, 2],
      [-0.0011, 2],
      [-0.0049, 0],
      [-0.00209, 2],
      [0.00037, 2],
      [-0.01261, 0],
      [0.00122, 1],
      [-0.01186, 0],
      [-0.00164, 1],
      [-0.00035, 2],
      [-0.00775, 0],
      [0.00191, 1],
      [0.00175, 0],
      [0.00123, 0],
      [-0.00112, 2],
      [0.0012, 1],
      [-0.00398, 1],
      [2e-5, 2]
    ],
    "red_o_points": [],
    "y_categories": ["GREATER THAN OR EQUALS TO 3", "LESS THAN 3", "nan"],
    "blue_o_points": [],
    "blue_x_points": [
      [0.0008, 0],
      [0.00162, 2],
      [0.00023, 0],
      [0.00701, 0],
      [0.00478, 0],
      [0.00064, 1],
      [0.00896, 1],
      [0.00026, 0],
      [0.01148, 1],
      [0.00795, 2]
    ]
  },
  "QS_mulGraftNerve[FI]": {
    "red_x_points": [
      [-0.00023, 2],
      [-0.00069, 0],
      [-0.0005, 0],
      [-0.00045, 0],
      [-7e-5, 2],
      [-0.00064, 0],
      [-0.00048, 0],
      [-0.00071, 0],
      [-0.00019, 2],
      [-0.00031, 0],
      [-0.0006, 0],
      [-0.00057, 0],
      [-0.00016, 2],
      [0.00087, 1],
      [-0.00015, 2],
      [-0.00071, 0],
      [-0.00037, 2],
      [-0.00068, 0],
      [-0.0002, 2],
      [-0.00036, 2],
      [-9e-5, 2],
      [-0.00025, 2],
      [-0.00048, 0],
      [-9e-5, 2],
      [-0.00016, 2],
      [-0.00013, 2],
      [-0.00067, 0],
      [-0.00036, 0],
      [0.00083, 1],
      [-8e-5, 2],
      [-0.00042, 0],
      [-3e-5, 2]
    ],
    "red_o_points": [],
    "y_categories": ["N", "NOT APPLICABLE", "nan"],
    "blue_o_points": [],
    "blue_x_points": [
      [0.00131, 1],
      [-4e-5, 2],
      [0.00124, 1],
      [-9e-5, 0],
      [-0.00016, 0],
      [0.00108, 1],
      [-0.0001, 2],
      [0.00167, 1],
      [-5e-5, 2],
      [0.00011, 2]
    ]
  },
  "QA_lstPexPalle[Clavicle]": {
    "red_x_points": [
      [-0.00279, 3],
      [-0.00105, 3],
      [-0.00103, 3],
      [-0.00113, 3],
      [-0.00273, 3],
      [-0.00854, 2],
      [-0.00595, 2],
      [-0.0014, 3],
      [-0.00284, 3],
      [-0.00172, 3],
      [-0.00526, 2],
      [-0.00701, 2],
      [-0.00708, 0],
      [0.00035, 3],
      [-0.00258, 3],
      [-0.00134, 3],
      [-0.00271, 3],
      [-0.00069, 3],
      [-0.00199, 3],
      [-0.00676, 0],
      [-0.00689, 0],
      [-0.00369, 2],
      [0.00046, 1],
      [-0.00287, 3],
      [-0.00561, 2],
      [-0.00252, 3],
      [-0.00188, 3],
      [-0.00105, 3],
      [-0.01621, 2],
      [-0.002, 3],
      [0.00091, 0],
      [-0.00269, 3]
    ],
    "red_o_points": [],
    "y_categories": ["HYPO", "NAIA", "PT", "nan"],
    "blue_o_points": [],
    "blue_x_points": [
      [0.00108, 3],
      [-0.00089, 3],
      [0.00787, 0],
      [0.00017, 3],
      [0.01787, 0],
      [0.00177, 3],
      [0.0343, 1],
      [0.00116, 3],
      [0.00829, 2],
      [-0.00013, 3]
    ]
  },
  "QA_lstPexTouch[C7]": {
    "red_x_points": [
      [-0.00762, 1],
      [-0.00166, 2],
      [-0.00213, 1],
      [-0.00181, 2],
      [-0.00754, 1],
      [0.00174, 0],
      [-0.00263, 1],
      [-0.00329, 1],
      [0.00527, 0],
      [-0.00283, 1],
      [0.00229, 0],
      [-0.00345, 1],
      [-0.00775, 1],
      [-0.00753, 2],
      [-0.00377, 2],
      [-0.00221, 2],
      [-0.00767, 1],
      [-0.00166, 2],
      [-0.00385, 2],
      [0.00559, 0],
      [-0.00867, 1],
      [0.00523, 0],
      [-0.00239, 2],
      [-0.00383, 2],
      [0.00372, 0],
      [0.00517, 0],
      [-0.00286, 1],
      [-0.00249, 2],
      [-0.00296, 1],
      [-0.00457, 2],
      [-0.00258, 1],
      [-0.00868, 1]
    ],
    "red_o_points": [],
    "y_categories": ["NORM", "NPV", "nan"],
    "blue_o_points": [],
    "blue_x_points": [
      [0.00041, 1],
      [0.00061, 2],
      [0.0011, 1],
      [0.00135, 1],
      [0.00948, 0],
      [0.00112, 1],
      [0.00941, 0],
      [0.0038, 0],
      [0.00959, 0],
      [0.01047, 0]
    ]
  },
  "QA_lstPexMuscstrength[ShoulderAbduc]": {
    "red_x_points": [
      [-0.004, 1],
      [-0.00337, 1],
      [-0.00312, 1],
      [-0.00351, 1],
      [-0.00389, 1],
      [-0.00379, 1],
      [-0.00378, 1],
      [-0.00372, 1],
      [-0.00374, 1],
      [-0.00384, 1],
      [-0.00371, 1],
      [-0.00336, 1],
      [-0.00409, 1],
      [0.00129, 2],
      [0.00152, 2],
      [0.00136, 2],
      [0.00165, 2],
      [0.00162, 2],
      [0.00143, 2],
      [-0.00423, 1],
      [-0.0037, 1],
      [-0.00392, 1],
      [-0.00358, 1],
      [0.0017, 2],
      [-0.00406, 1],
      [-0.00348, 1],
      [-0.00387, 1],
      [-0.0031, 1],
      [0.00167, 2],
      [-0.00352, 1],
      [-0.00331, 1],
      [0.00191, 2]
    ],
    "red_o_points": [],
    "y_categories": ["GREATER THAN OR EQUALS TO 3", "LESS THAN 3", "nan"],
    "blue_o_points": [],
    "blue_x_points": [
      [0.00178, 2],
      [0.00227, 2],
      [0.01879, 0],
      [0.00268, 2],
      [-0.00277, 1],
      [0.01856, 0],
      [0.00249, 2],
      [-0.00147, 1],
      [-0.00271, 1],
      [-0.00216, 1]
    ]
  },
  "QA_lstPexMuscstrength[ThumbOppo]": {
    "red_x_points": [
      [-0.00613, 1],
      [0.00035, 2],
      [-0.00393, 1],
      [-0.00383, 1],
      [-0.00707, 1],
      [0.00142, 0],
      [0.00126, 0],
      [-0.00522, 1],
      [0.00104, 0],
      [0.00139, 0],
      [0.0014, 0],
      [0.0014, 0],
      [0.00139, 0],
      [0.00016, 2],
      [0.0005, 2],
      [6e-5, 2],
      [0.00076, 0],
      [0.00024, 2],
      [0.00052, 2],
      [0.00125, 0],
      [-0.0068, 1],
      [0.00046, 0],
      [-0.00368, 1],
      [0.00061, 2],
      [0.00082, 2],
      [0.00065, 2],
      [0.00122, 0],
      [-0.00368, 1],
      [0.00026, 2],
      [-0.00674, 1],
      [-0.00395, 1],
      [0.00092, 2]
    ],
    "red_o_points": [],
    "y_categories": ["GREATER THAN OR EQUALS TO 3", "LESS THAN 3", "nan"],
    "blue_o_points": [],
    "blue_x_points": [
      [0.00032, 2],
      [0.00113, 2],
      [0.0014, 0],
      [0.00232, 2],
      [0.00312, 0],
      [0.00142, 0],
      [0.00493, 0],
      [0.0013, 0],
      [0.00194, 2],
      [0.0024, 2]
    ]
  },
  "QS_mulGraftNerve[IS]": {
    "red_x_points": [
      [-0.0, 2],
      [-9e-5, 0],
      [-9e-5, 0],
      [-0.0, 2],
      [-9e-5, 0],
      [-9e-5, 0],
      [-9e-5, 0],
      [-9e-5, 0],
      [-9e-5, 0],
      [-1e-5, 2],
      [0.00018, 1],
      [-0.0, 2],
      [-9e-5, 0],
      [-0.0, 2],
      [-9e-5, 0],
      [0.0, 2],
      [-1e-5, 2],
      [-0.0, 2],
      [-0.0, 2],
      [-9e-5, 0],
      [0.0, 2],
      [-0.0, 2],
      [-0.0, 2],
      [-4e-5, 0],
      [-9e-5, 0],
      [7e-5, 1],
      [-0.0, 2]
    ],
    "red_o_points": [],
    "y_categories": ["N", "NOT APPLICABLE", "nan"],
    "blue_o_points": [],
    "blue_x_points": [
      [0.00018, 1],
      [0.0, 2],
      [0.00018, 1],
      [-9e-5, 0],
      [7e-5, 1],
      [-0.0, 2],
      [0.00011, 1],
      [-0.0, 2],
      [-1e-5, 2]
    ]
  },
  "QS_mulGraftNerve[MC]": {
    "red_x_points": [
      [-6e-5, 2],
      [-0.00014, 0],
      [-8e-5, 0],
      [-6e-5, 0],
      [-4e-5, 2],
      [-0.00015, 0],
      [-0.00019, 0],
      [-0.0001, 0],
      [-4e-5, 2],
      [-0.00015, 0],
      [-0.00011, 0],
      [-0.00015, 0],
      [-6e-5, 2],
      [0.00026, 1],
      [-5e-5, 2],
      [-0.00014, 0],
      [-4e-5, 2],
      [-8e-5, 0],
      [-3e-5, 2],
      [-4e-5, 2],
      [-6e-5, 2],
      [-4e-5, 2],
      [-0.00014, 0],
      [-3e-5, 2],
      [-5e-5, 2],
      [-3e-5, 2],
      [-0.0001, 0],
      [-0.0001, 0],
      [0.00027, 1],
      [-1e-5, 2],
      [-0.00014, 0],
      [-5e-5, 2]
    ],
    "red_o_points": [],
    "y_categories": ["N", "NOT APPLICABLE", "nan"],
    "blue_o_points": [],
    "blue_x_points": [
      [0.00037, 1],
      [-2e-5, 2],
      [0.00052, 1],
      [-0.0001, 0],
      [-6e-5, 0],
      [0.00021, 1],
      [-2e-5, 2],
      [0.00027, 1],
      [-5e-5, 2],
      [-4e-5, 2]
    ]
  },
  "QS_mulNeuromadSite[C4]": {
    "red_x_points": [
      [-0.00047, 2],
      [-0.00117, 0],
      [-0.00138, 0],
      [-0.00153, 0],
      [-0.00032, 2],
      [-0.00176, 0],
      [-0.00133, 0],
      [-0.00151, 0],
      [-0.00033, 2],
      [-0.00119, 0],
      [-0.00189, 0],
      [-0.00165, 0],
      [-0.00044, 2],
      [0.00209, 1],
      [-0.00016, 2],
      [-0.00174, 0],
      [-0.00028, 2],
      [-0.00121, 0],
      [-0.00015, 2],
      [-0.00075, 2],
      [-0.00023, 2],
      [-0.00064, 2],
      [-0.00132, 0],
      [-0.00031, 2],
      [-0.00042, 2],
      [-0.00017, 2],
      [-0.00157, 0],
      [-0.00097, 0],
      [0.00168, 1],
      [-0.0005, 2],
      [-0.00121, 0],
      [-0.00048, 2]
    ],
    "red_o_points": [],
    "y_categories": ["N", "NOT APPLICABLE", "nan"],
    "blue_o_points": [],
    "blue_x_points": [
      [0.00395, 1],
      [7e-5, 2],
      [0.00338, 1],
      [-3e-5, 0],
      [-7e-5, 0],
      [0.00408, 1],
      [-0.00016, 2],
      [0.00319, 1],
      [4e-5, 2],
      [0.00019, 2]
    ]
  },
  "QS_mulGraftNerve[Ra]": {
    "red_x_points": [
      [-2e-5, 0],
      [-2e-5, 0],
      [-4e-5, 2],
      [-4e-5, 0],
      [-4e-5, 0],
      [-2e-5, 0],
      [0.0, 0],
      [-4e-5, 0],
      [-9e-5, 2],
      [0.00011, 1],
      [-4e-5, 2],
      [-2e-5, 0],
      [-9e-5, 2],
      [-4e-5, 2],
      [-9e-5, 2],
      [-4e-5, 2],
      [-2e-5, 0],
      [-4e-5, 2],
      [-2e-5, 2],
      [-4e-5, 2],
      [-4e-5, 0],
      [-0.00011, 1],
      [-4e-5, 2],
      [-2e-5, 0],
      [-4e-5, 2]
    ],
    "red_o_points": [],
    "y_categories": ["N", "NOT APPLICABLE", "nan"],
    "blue_o_points": [],
    "blue_x_points": [
      [0.00011, 1],
      [0.00011, 1],
      [0.0, 0],
      [-4e-5, 0],
      [0.00011, 1],
      [-9e-5, 2],
      [0.00022, 1],
      [2e-5, 2]
    ]
  },
  "QS_mulTransfSite[Oberlin]": {
    "red_x_points": [
      [-0.00226, 3],
      [-0.0153, 0],
      [-0.01652, 0],
      [-0.016, 0],
      [-0.0023, 3],
      [-0.00391, 2],
      [-0.00269, 2],
      [-0.01581, 0],
      [-0.00204, 3],
      [-0.00337, 2],
      [-0.00424, 2],
      [-0.00336, 2],
      [-0.00202, 3],
      [0.01908, 1],
      [-0.00241, 3],
      [-0.00359, 2],
      [-0.002, 3],
      [-0.01552, 0],
      [-0.00275, 3],
      [-0.00211, 3],
      [-0.00207, 3],
      [-0.00196, 3],
      [-0.01612, 0],
      [-0.00229, 3],
      [-0.00273, 3],
      [-0.00201, 3],
      [-0.00355, 2],
      [-0.01444, 0],
      [0.01884, 1],
      [-0.0021, 3],
      [-0.01595, 0],
      [-0.00218, 3]
    ],
    "red_o_points": [],
    "y_categories": ["N", "NOT APPLICABLE", "Y", "nan"],
    "blue_o_points": [],
    "blue_x_points": [
      [0.02427, 1],
      [-0.00062, 3],
      [0.02005, 1],
      [0.00179, 2],
      [0.00106, 2],
      [0.02257, 1],
      [-0.00086, 3],
      [0.0224, 1],
      [-0.00088, 3],
      [-0.00063, 3]
    ]
  },
  "QS_mulLysisSite[Nerve]": {
    "red_x_points": [
      [-0.00012, 3],
      [-0.0008, 0],
      [-0.0025, 2],
      [-0.00068, 0],
      [-0.00013, 3],
      [-0.00071, 0],
      [-0.00074, 0],
      [-0.00061, 0],
      [-0.00016, 3],
      [-0.00056, 0],
      [-0.00089, 0],
      [-0.00045, 0],
      [-0.00019, 3],
      [0.00177, 1],
      [-0.00013, 3],
      [-0.00073, 0],
      [-0.00019, 3],
      [-0.00072, 0],
      [-0.00016, 3],
      [-0.00019, 3],
      [-0.00014, 3],
      [-0.00012, 3],
      [-0.00084, 0],
      [-0.00027, 3],
      [-0.00012, 3],
      [-0.00018, 3],
      [-0.00053, 0],
      [-0.0007, 0],
      [0.00173, 1],
      [-0.00016, 3],
      [-0.00059, 0],
      [-0.00016, 3]
    ],
    "red_o_points": [],
    "y_categories": ["N", "NOT APPLICABLE", "Y", "nan"],
    "blue_o_points": [],
    "blue_x_points": [
      [0.0024, 1],
      [-2e-5, 3],
      [0.00155, 1],
      [-0.00023, 0],
      [-0.00035, 0],
      [0.0021, 1],
      [-0.0001, 3],
      [0.00141, 1],
      [-0.00013, 3],
      [-6e-5, 3]
    ]
  },
  "QA_lstPexMuscstrength[ElbowFlex]": {
    "red_x_points": [
      [-0.00246, 1],
      [-0.00228, 2],
      [-0.00342, 1],
      [-0.00308, 1],
      [-0.00296, 1],
      [0.00706, 0],
      [-0.00335, 1],
      [-0.00382, 1],
      [-0.00285, 1],
      [-0.00409, 1],
      [-0.00388, 1],
      [-0.00406, 1],
      [-0.00292, 1],
      [-0.00223, 2],
      [-0.0023, 2],
      [-0.00307, 2],
      [-0.00297, 1],
      [-0.00203, 2],
      [-0.00261, 2],
      [-0.00279, 1],
      [-0.00236, 1],
      [-0.00261, 1],
      [-0.0028, 1],
      [-0.00213, 2],
      [0.00347, 0],
      [-0.00283, 1],
      [-0.00394, 1],
      [-0.00305, 1],
      [-0.0024, 2],
      [-0.00283, 1],
      [-0.00327, 1],
      [-0.00259, 2]
    ],
    "red_o_points": [],
    "y_categories": ["GREATER THAN OR EQUALS TO 3", "LESS THAN 3", "nan"],
    "blue_o_points": [],
    "blue_x_points": [
      [-0.00045, 2],
      [-0.00093, 2],
      [0.00913, 0],
      [-0.00044, 1],
      [0.01967, 0],
      [0.00897, 0],
      [-0.0013, 1],
      [0.01063, 0],
      [-0.00041, 1],
      [-0.00077, 1]
    ]
  },
  "QA_lstPexKine[Index]": {
    "red_x_points": [
      [-0.00259, 0],
      [-0.00045, 2],
      [-0.00235, 2],
      [-0.00073, 2],
      [-0.00359, 2],
      [0.00027, 1],
      [0.00049, 1],
      [-0.00288, 0],
      [-0.00543, 2],
      [0.00082, 1],
      [0.00013, 1],
      [0.00046, 1],
      [0.00014, 1],
      [-0.00051, 2],
      [-0.00222, 2],
      [0.00073, 1],
      [-0.0025, 2],
      [-0.00083, 2],
      [-0.00185, 2],
      [-0.0006, 1],
      [-0.003, 0],
      [-0.00196, 1],
      [-0.00069, 2],
      [-0.00202, 2],
      [-0.00072, 1],
      [-0.00371, 2],
      [-0.00172, 2],
      [-0.00061, 2],
      [-0.00046, 2],
      [-0.00305, 2],
      [-0.00303, 0],
      [-0.00296, 2]
    ],
    "red_o_points": [],
    "y_categories": ["NPV", "PV", "nan"],
    "blue_o_points": [],
    "blue_x_points": [
      [0.00044, 1],
      [-0.00091, 2],
      [0.00026, 1],
      [0.0033, 1],
      [0.00276, 1],
      [0.00099, 1],
      [0.01357, 0],
      [-0.00013, 2],
      [0.00512, 1],
      [0.00412, 1]
    ]
  }
}
