{
  "QA_lstPexPain[C8]": {
    "red_x_points": [
      [0.00648, 0],
      [-0.00588, 2],
      [-0.00477, 2],
      [0.00709, 0],
      [-0.00552, 2],
      [-0.0076, 1],
      [-0.01073, 1],
      [-0.01136, 1],
      [-0.00813, 2],
      [-0.00682, 2],
      [-0.01068, 2],
      [-0.00562, 2],
      [-0.01123, 1],
      [0.00697, 0],
      [-0.01052, 1],
      [-0.00763, 1],
      [-0.00551, 2],
      [-0.0083, 2],
      [-0.00923, 2],
      [-0.00614, 2],
      [-0.01259, 1],
      [-0.00606, 1],
      [-0.01431, 1]
    ],
    "red_o_points": [],
    "y_categories": ["NORM", "NPV", "nan"],
    "blue_o_points": [],
    "blue_x_points": [
      [-0.00805, 1],
      [-0.00659, 1],
      [0.0116, 0],
      [-0.00253, 1],
      [0.01756, 0],
      [0.01563, 0],
      [0.0151, 0],
      [0.01217, 0],
      [-0.00548, 2],
      [-0.00048, 2],
      [-0.0046, 2],
      [-0.00097, 1],
      [-0.00426, 2],
      [0.01522, 0],
      [0.01388, 0],
      [0.01455, 0],
      [-0.00595, 2],
      [0.01437, 0],
      [0.01525, 0],
      [0.02127, 0],
      [0.02039, 0]
    ]
  },
  "QA_lstPexPain[C7]": {
    "red_x_points": [
      [-0.01061, 1],
      [-0.00967, 2],
      [-0.0082, 2],
      [-0.00974, 1],
      [-0.00865, 2],
      [-0.00688, 1],
      [-0.00801, 1],
      [-0.01065, 1],
      [-0.01088, 2],
      [-0.00964, 2],
      [-0.01181, 2],
      [-0.00854, 2],
      [-0.00952, 1],
      [0.01368, 0],
      [-0.01003, 1],
      [-0.00757, 1],
      [-0.0081, 2],
      [-0.01168, 2],
      [-0.01057, 2],
      [-0.00893, 2],
      [-0.0109, 1],
      [-0.00664, 1],
      [-0.00952, 1]
    ],
    "red_o_points": [],
    "y_categories": ["NORM", "NPV", "nan"],
    "blue_o_points": [],
    "blue_x_points": [
      [-0.00639, 1],
      [-0.00684, 1],
      [0.02403, 0],
      [-0.00402, 1],
      [0.02944, 0],
      [-0.00521, 1],
      [0.02665, 0],
      [0.02516, 0],
      [-0.00884, 2],
      [-0.00515, 2],
      [-0.00808, 2],
      [-0.00553, 1],
      [-0.00755, 2],
      [0.02382, 0],
      [0.02371, 0],
      [0.0256, 0],
      [-0.00828, 2],
      [0.02435, 0],
      [0.03127, 0],
      [-0.00825, 1],
      [0.03316, 0]
    ]
  },
  "QA_lstPexTouch[C6]": {
    "red_x_points": [
      [-0.00598, 1],
      [-0.00228, 2],
      [-0.00307, 1],
      [-0.00279, 1],
      [-0.00207, 2],
      [-0.00297, 1],
      [-0.00291, 1],
      [-0.0054, 1],
      [-0.00287, 2],
      [-0.00249, 2],
      [-0.00442, 1],
      [-0.00166, 2],
      [-0.00355, 1],
      [-0.0043, 1],
      [-0.00605, 1],
      [-0.00262, 1],
      [-0.00147, 2],
      [-0.00494, 1],
      [-0.00381, 1],
      [-0.00373, 2],
      [-0.00491, 1],
      [-0.00233, 1],
      [-0.00399, 1]
    ],
    "red_o_points": [],
    "y_categories": ["NORM", "NPV", "nan"],
    "blue_o_points": [],
    "blue_x_points": [
      [-0.00347, 1],
      [-0.00348, 1],
      [0.01693, 0],
      [-0.0023, 1],
      [0.02633, 0],
      [-0.00273, 1],
      [-0.0023, 1],
      [-0.00229, 1],
      [-0.00058, 2],
      [0.00273, 2],
      [0.0, 2],
      [-0.00292, 1],
      [0.00044, 2],
      [-0.00263, 1],
      [-0.00263, 1],
      [0.01832, 0],
      [-0.00015, 2],
      [0.01845, 0],
      [0.02852, 0],
      [-0.0027, 1],
      [-0.00292, 1]
    ]
  },
  "QS_equBpsurgTime": {
    "red_x_points": [
      [0.00116, 3],
      [-0.01299, 0],
      [-0.0013, 2],
      [-0.01514, 0],
      [-0.00755, 0],
      [-0.00298, 1],
      [-0.00043, 3],
      [-0.00113, 3],
      [0.00197, 3],
      [-0.01081, 1],
      [0.00051, 3],
      [0.00149, 2],
      [0.0011, 3],
      [-0.01298, 2],
      [0.00063, 3],
      [3e-5, 3],
      [-0.00512, 0],
      [0.00177, 3],
      [-0.01524, 0],
      [-0.00845, 0],
      [7e-5, 3],
      [-0.00243, 2],
      [0.00078, 3]
    ],
    "red_o_points": [],
    "y_categories": [
      "0 TO 6 MONTHS",
      "13 TO 24 MONTHS",
      "7 TO 12 MONTHS",
      "nan"
    ],
    "blue_o_points": [],
    "blue_x_points": [
      [0.00217, 3],
      [0.00161, 3],
      [0.00117, 0],
      [0.0139, 1],
      [0.00268, 3],
      [0.009, 1],
      [0.00383, 0],
      [0.00771, 2],
      [0.00256, 3],
      [0.00247, 3],
      [0.01147, 2],
      [0.01103, 2],
      [0.00252, 3],
      [0.00137, 3],
      [0.00137, 3],
      [0.00143, 3],
      [0.00289, 3],
      [0.00144, 3],
      [0.00211, 3],
      [0.00216, 3],
      [0.00214, 3]
    ]
  },
  "QA_equInjTbpiTime": {
    "red_x_points": [
      [-0.01274, 0],
      [-0.01133, 0],
      [0.00255, 3],
      [0.00152, 3],
      [-0.01126, 0],
      [-0.00894, 0],
      [-0.00942, 0],
      [-0.0106, 0],
      [0.00215, 3],
      [-0.01167, 0],
      [-0.01171, 0],
      [-0.01151, 0],
      [2e-5, 3],
      [-0.00013, 3],
      [-0.01166, 0],
      [-0.00843, 0],
      [-0.01424, 2],
      [-0.02609, 2],
      [-0.01172, 0],
      [-0.0172, 2],
      [-0.01192, 0],
      [0.00162, 3],
      [0.01183, 1]
    ],
    "red_o_points": [],
    "y_categories": [
      "0 TO 6 MONTHS",
      "13 TO 24 MONTHS",
      "25 MONTHS OR MORE",
      "7 TO 12 MONTHS",
      "nan"
    ],
    "blue_o_points": [],
    "blue_x_points": [
      [-0.00661, 0],
      [0.02549, 1],
      [-0.00779, 0],
      [0.02705, 1],
      [0.00493, 3],
      [-0.00788, 0],
      [-0.00558, 0],
      [0.00476, 3],
      [-0.00695, 0],
      [-0.00112, 2],
      [0.0313, 1],
      [0.00651, 3],
      [0.02848, 1],
      [0.00477, 3],
      [0.02199, 1],
      [0.0219, 1],
      [0.00702, 3],
      [0.02022, 1],
      [0.00928, 3],
      [0.00742, 3],
      [-0.00434, 0]
    ]
  },
  "QA_lstPexInspectio[ScapulaAlata]": {
    "red_x_points": [
      [-0.00202, 1],
      [-0.00013, 1],
      [-0.00028, 1],
      [-0.00018, 1],
      [-0.00015, 1],
      [-0.00012, 1],
      [-0.00088, 1],
      [-0.00273, 1],
      [-0.00036, 1],
      [-0.00011, 1],
      [-0.00093, 1],
      [-0.00014, 1],
      [-0.0002, 1],
      [-0.00125, 1],
      [-0.00236, 1],
      [-0.00051, 1],
      [-0.00012, 1],
      [-0.00072, 1],
      [-0.00028, 1],
      [-0.00041, 1],
      [-0.00128, 1],
      [-0.00039, 1],
      [-0.00028, 1]
    ],
    "red_o_points": [],
    "y_categories": ["ABS", "NAIA", "PT", "nan"],
    "blue_o_points": [],
    "blue_x_points": [
      [-0.00037, 1],
      [-0.00022, 1],
      [-0.0003, 1],
      [-0.00032, 1],
      [-0.00029, 1],
      [-0.0003, 1],
      [-0.00038, 1],
      [-0.00026, 1],
      [-0.00016, 1],
      [-0.00099, 1],
      [-9e-5, 1],
      [-0.00023, 1],
      [-0.00011, 1],
      [0.00737, 0],
      [-0.00022, 1],
      [-0.0002, 1],
      [-0.00023, 1],
      [-4e-5, 1],
      [0.01358, 2],
      [-0.00026, 1],
      [-0.00015, 1]
    ]
  },
  "QA_yonInjFracture": {
    "red_x_points": [
      [0.00574, 0],
      [-0.00611, 2],
      [0.00365, 0],
      [-0.0058, 2],
      [-0.0091, 1],
      [-0.01357, 1],
      [0.00274, 0],
      [0.0026, 0],
      [-0.01675, 1],
      [-0.01305, 1],
      [0.00324, 0],
      [-0.01036, 1],
      [-0.01467, 1],
      [-0.00435, 0],
      [-0.01688, 1],
      [-0.00922, 1],
      [-0.00826, 1],
      [0.00352, 0],
      [0.00265, 0],
      [0.00448, 0],
      [-0.01059, 1],
      [-0.00755, 1],
      [-0.02304, 1]
    ],
    "red_o_points": [],
    "y_categories": ["N", "Y", "nan"],
    "blue_o_points": [],
    "blue_x_points": [
      [0.01122, 0],
      [0.01184, 0],
      [0.00274, 0],
      [0.00676, 0],
      [0.00981, 2],
      [0.00901, 0],
      [0.00366, 1],
      [0.00305, 1],
      [-0.00663, 1],
      [0.0106, 0],
      [0.01297, 0],
      [0.01296, 0],
      [0.01152, 0],
      [0.00301, 0],
      [0.00417, 0],
      [0.00451, 2],
      [0.01285, 0],
      [0.0056, 0],
      [0.00568, 0],
      [-0.00294, 1],
      [0.00828, 2]
    ]
  },
  "QS_mulGraftNerve[Ac]": {
    "red_x_points": [
      [-0.00014, 1],
      [-0.00033, 0],
      [-0.00013, 0],
      [3e-5, 0],
      [-0.0002, 0],
      [6e-5, 0],
      [-0.00029, 1],
      [0.00013, 2],
      [-0.00028, 0],
      [0.00013, 2],
      [-0.00033, 0],
      [0.0, 2],
      [-0.00045, 1],
      [0.0, 2],
      [-0.00015, 0],
      [8e-5, 2],
      [-0.00017, 0],
      [-0.00013, 0],
      [-0.00032, 1],
      [4e-5, 0],
      [7e-5, 2]
    ],
    "red_o_points": [],
    "y_categories": ["N", "NOT APPLICABLE", "nan"],
    "blue_o_points": [],
    "blue_x_points": [
      [0.00011, 2],
      [1e-5, 2],
      [4e-5, 0],
      [8e-5, 0],
      [7e-5, 2],
      [0.00014, 0],
      [2e-5, 0],
      [-1e-5, 0],
      [0.00022, 2],
      [0.00073, 1],
      [-6e-5, 0],
      [0.00021, 0],
      [0.00027, 2],
      [5e-5, 2],
      [9e-5, 2],
      [7e-5, 2],
      [0.00022, 2],
      [7e-5, 2],
      [2e-5, 1],
      [4e-5, 2]
    ]
  },
  "QA_lstPexArthre[Shoulder]": {
    "red_x_points": [
      [0.00531, 2],
      [-0.00211, 3],
      [-0.00374, 3],
      [0.00621, 2],
      [-0.01504, 0],
      [-0.02031, 1],
      [0.00622, 2],
      [0.00573, 2],
      [-0.00242, 3],
      [0.005, 2],
      [-0.00345, 3],
      [-0.00162, 3],
      [-0.00384, 3],
      [-0.02873, 1],
      [0.00539, 2],
      [-0.0154, 1],
      [-0.00225, 3],
      [-0.00318, 3],
      [-0.00671, 3],
      [-0.0023, 3],
      [-0.00278, 3],
      [-0.01535, 1],
      [-0.00349, 3]
    ],
    "red_o_points": [],
    "y_categories": ["NAIA", "NPV", "PV", "nan"],
    "blue_o_points": [],
    "blue_x_points": [
      [0.01186, 2],
      [-0.00216, 3],
      [0.00736, 2],
      [0.01269, 2],
      [-0.00087, 3],
      [0.01162, 2],
      [0.01054, 2],
      [0.00943, 2],
      [-0.00143, 3],
      [-0.00132, 3],
      [-0.00163, 3],
      [0.01432, 2],
      [-0.00122, 3],
      [0.00786, 2],
      [0.00591, 2],
      [-0.00133, 1],
      [-0.00145, 3],
      [0.00543, 2],
      [-0.00074, 3],
      [0.00835, 2],
      [0.00567, 2]
    ]
  },
  "QS_mulNeuromadSite[C8]": {
    "red_x_points": [
      [-0.00282, 1],
      [-0.0026, 0],
      [-0.00047, 0],
      [0.00049, 0],
      [-0.00125, 0],
      [0.00061, 0],
      [-0.00015, 2],
      [-0.00319, 1],
      [0.00116, 2],
      [-0.00169, 0],
      [0.00027, 2],
      [-0.00168, 0],
      [-9e-5, 2],
      [-7e-5, 0],
      [-0.00581, 1],
      [-8e-5, 2],
      [-0.00134, 0],
      [0.00025, 2],
      [-0.00056, 0],
      [-0.00225, 0],
      [-0.00413, 1],
      [0.00045, 0],
      [-7e-5, 2]
    ],
    "red_o_points": [],
    "y_categories": ["N", "NOT APPLICABLE", "nan"],
    "blue_o_points": [],
    "blue_x_points": [
      [0.00088, 2],
      [0.00062, 2],
      [0.00062, 0],
      [0.0016, 0],
      [0.00031, 2],
      [0.00187, 0],
      [0.00078, 0],
      [0.00088, 0],
      [0.00211, 2],
      [0.00566, 1],
      [-0.00094, 0],
      [0.00286, 0],
      [0.00183, 2],
      [0.00048, 2],
      [0.00051, 2],
      [0.00028, 2],
      [0.00202, 2],
      [0.00055, 2],
      [0.00068, 1],
      [0.00077, 2],
      [0.00066, 2]
    ]
  },
  "QS_mulGraftNerve[Ph]": {
    "red_x_points": [
      [-0.00067, 1],
      [-0.00034, 0],
      [-6e-5, 0],
      [0.00011, 0],
      [-0.00012, 0],
      [3e-5, 0],
      [4e-5, 2],
      [-0.00067, 1],
      [0.00021, 2],
      [-0.0002, 0],
      [-0.00018, 2],
      [-0.00032, 0],
      [-2e-5, 2],
      [-1e-5, 0],
      [-0.00108, 1],
      [-2e-5, 2],
      [-0.00027, 0],
      [-5e-5, 2],
      [9e-5, 0],
      [-0.00024, 0],
      [-0.00079, 1],
      [4e-5, 0],
      [-7e-5, 2]
    ],
    "red_o_points": [],
    "y_categories": ["N", "NOT APPLICABLE", "nan"],
    "blue_o_points": [],
    "blue_x_points": [
      [0.00033, 2],
      [0.00013, 2],
      [0.00017, 0],
      [0.00024, 0],
      [0.00036, 0],
      [0.00021, 0],
      [0.00014, 0],
      [0.00014, 2],
      [0.00096, 1],
      [-0.00012, 0],
      [0.00029, 0],
      [0.0002, 2],
      [0.00013, 2],
      [0.00022, 2],
      [0.00011, 2],
      [0.00024, 2],
      [0.00013, 2],
      [0.00022, 1],
      [0.0002, 2],
      [0.00028, 2]
    ]
  },
  "QA_lstPexMuscstrength[FingersFlex]": {
    "red_x_points": [
      [0.00248, 2],
      [0.00261, 2],
      [-0.03103, 1],
      [0.01007, 0],
      [-0.03276, 1],
      [-0.03322, 1],
      [-0.03171, 1],
      [0.00941, 0],
      [0.00257, 2],
      [0.00235, 2],
      [0.01042, 0],
      [0.0025, 2],
      [-0.03664, 1],
      [0.00993, 0],
      [0.01074, 0],
      [-0.03228, 1],
      [-0.03064, 1],
      [0.00273, 2],
      [0.01017, 0],
      [0.00892, 0],
      [0.00232, 2],
      [-0.03163, 1],
      [0.00178, 2]
    ],
    "red_o_points": [],
    "y_categories": ["GREATER THAN OR EQUALS TO 3", "LESS THAN 3", "nan"],
    "blue_o_points": [],
    "blue_x_points": [
      [0.01364, 0],
      [0.01356, 0],
      [0.01014, 0],
      [0.01086, 0],
      [0.01224, 0],
      [0.0113, 0],
      [0.01118, 0],
      [0.0108, 0],
      [0.0038, 2],
      [0.00362, 2],
      [0.00382, 2],
      [0.0044, 2],
      [0.00359, 2],
      [0.01085, 0],
      [0.01021, 0],
      [0.01119, 0],
      [0.00416, 2],
      [0.0033, 2],
      [0.01118, 0],
      [0.00377, 2],
      [0.00331, 2]
    ]
  },
  "QA_lstPexPalle[Elbow]": {
    "red_x_points": [
      [-0.00145, 4],
      [-0.00137, 4],
      [-0.00133, 4],
      [0.01084, 3],
      [-0.0012, 4],
      [-0.00135, 4],
      [-0.01783, 1],
      [-0.01486, 1],
      [-0.00155, 4],
      [-0.00148, 4],
      [-0.00199, 4],
      [-0.00122, 4],
      [-0.00138, 4],
      [-0.01902, 1],
      [-0.00139, 4],
      [-0.02607, 0],
      [-0.02098, 2],
      [-0.00179, 4],
      [-0.00204, 4],
      [-0.00152, 4],
      [0.01045, 3],
      [-0.02068, 0],
      [-0.00168, 4]
    ],
    "red_o_points": [],
    "y_categories": ["ABS", "HYPO", "NAIA", "PT", "nan"],
    "blue_o_points": [],
    "blue_x_points": [
      [-0.0014, 4],
      [-0.00119, 4],
      [0.01636, 3],
      [0.01978, 3],
      [-0.00107, 4],
      [-0.00108, 4],
      [-0.00737, 1],
      [0.01593, 3],
      [-0.00138, 4],
      [-0.00117, 4],
      [-0.00106, 4],
      [-0.00092, 4],
      [-0.00121, 4],
      [0.0183, 3],
      [0.01849, 3],
      [0.01751, 3],
      [-0.00131, 4],
      [0.01757, 3],
      [-0.00123, 4],
      [0.01874, 3],
      [-0.00141, 4]
    ]
  },
  "QA_lstPexPain[T1]": {
    "red_x_points": [
      [-0.00592, 1],
      [-0.00343, 2],
      [-0.00361, 2],
      [0.00021, 0],
      [-0.00251, 2],
      [-0.00162, 1],
      [-0.00025, 0],
      [-0.00036, 0],
      [-0.00655, 2],
      [-0.00441, 2],
      [-0.00619, 2],
      [-0.00297, 2],
      [-0.00679, 1],
      [-0.01104, 1],
      [-0.00291, 1],
      [-0.00238, 1],
      [-0.00282, 2],
      [-0.00777, 2],
      [-0.0062, 2],
      [-0.00318, 2],
      [-0.00761, 1],
      [-0.00225, 1],
      [-0.00713, 1]
    ],
    "red_o_points": [],
    "y_categories": ["NORM", "NPV", "nan"],
    "blue_o_points": [],
    "blue_x_points": [
      [0.00069, 1],
      [-0.00193, 1],
      [0.00533, 0],
      [0.00209, 1],
      [0.01399, 0],
      [0.00113, 1],
      [0.01075, 0],
      [0.01016, 0],
      [-0.00175, 2],
      [0.00035, 2],
      [-0.002, 2],
      [0.00156, 1],
      [-0.00189, 2],
      [0.00694, 0],
      [0.0059, 0],
      [0.0089, 0],
      [-0.00222, 2],
      [-0.00354, 1],
      [0.01041, 0],
      [0.0155, 0],
      [0.01733, 0]
    ]
  },
  "QA_lstPexMuscstrength[ScapulaAbducSuprot]": {
    "red_x_points": [
      [-0.00181, 2],
      [-0.00079, 2],
      [-0.00528, 1],
      [-0.00211, 2],
      [-0.00632, 1],
      [-0.00948, 1],
      [-0.00969, 1],
      [0.00273, 0],
      [-0.00142, 2],
      [-0.00127, 2],
      [-0.00382, 2],
      [-0.00067, 2],
      [-0.01006, 1],
      [-0.00413, 0],
      [0.00479, 0],
      [-0.00854, 1],
      [-0.00264, 1],
      [-0.00161, 2],
      [-0.00844, 1],
      [0.00124, 0],
      [-0.00148, 2],
      [-0.00301, 1],
      [-0.00634, 2]
    ],
    "red_o_points": [],
    "y_categories": ["GREATER THAN OR EQUALS TO 3", "LESS THAN 3", "nan"],
    "blue_o_points": [],
    "blue_x_points": [
      [0.021, 0],
      [0.01992, 0],
      [0.00374, 0],
      [-0.00025, 1],
      [-0.0012, 1],
      [0.01171, 0],
      [0.00647, 0],
      [0.00153, 1],
      [-0.00072, 2],
      [0.00047, 2],
      [0.00115, 2],
      [0.00262, 2],
      [0.00032, 2],
      [0.00585, 0],
      [0.00589, 0],
      [-0.00058, 2],
      [-0.00014, 2],
      [0.0045, 0],
      [0.00106, 2],
      [-0.00205, 1],
      [-0.00115, 2]
    ]
  },
  "participant_code": {
    "red_x_points": [
      [-0.04468, 0],
      [-0.04468, 2],
      [-0.04584, 3],
      [-0.04458, 4],
      [-0.04584, 5],
      [-0.04477, 9],
      [-0.04448, 14],
      [-0.04409, 17],
      [-0.04594, 19],
      [-0.04623, 20],
      [-0.04361, 22],
      [-0.04565, 23],
      [-0.04584, 24],
      [-0.04429, 26],
      [-0.04545, 28],
      [-0.04575, 29],
      [-0.04477, 31],
      [-0.04545, 35],
      [-0.04555, 37],
      [-0.0473, 39],
      [-0.04584, 41],
      [-0.04662, 42],
      [-0.04643, 43]
    ],
    "red_o_points": [],
    "y_categories": [
      "P16554",
      "P18297",
      "P19283",
      "P19287",
      "P23172",
      "P23391",
      "P30595",
      "P31645",
      "P31691",
      "P34778",
      "P35046",
      "P36328",
      "P43633",
      "P4544",
      "P46417",
      "P48965",
      "P53068",
      "P5497",
      "P58556",
      "P59529",
      "P62483",
      "P64658",
      "P65202",
      "P66816",
      "P67052",
      "P6751",
      "P7408",
      "P75566",
      "P76226",
      "P79971",
      "P82621",
      "P82990",
      "P84549",
      "P84932",
      "P85825",
      "P86989",
      "P8770",
      "P87791",
      "P90550",
      "P93159",
      "P94969",
      "P96710",
      "P9744",
      "P98500",
      "nan"
    ],
    "blue_o_points": [],
    "blue_x_points": [
      [0.05049, 1],
      [0.04885, 6],
      [0.0506, 7],
      [0.0508, 8],
      [0.04874, 10],
      [0.04977, 11],
      [0.05008, 12],
      [0.04967, 13],
      [0.05039, 15],
      [0.04874, 16],
      [0.05018, 18],
      [0.0507, 21],
      [0.04833, 25],
      [0.0506, 27],
      [0.04885, 30],
      [0.04957, 32],
      [0.05018, 33],
      [0.04957, 34],
      [0.04998, 36],
      [0.04957, 38],
      [0.04802, 40]
    ]
  },
  "QS_mulNeuromadSite[T2]": {
    "red_x_points": [
      [-0.00223, 1],
      [-0.00136, 0],
      [2e-5, 0],
      [0.00023, 0],
      [-0.00061, 0],
      [0.00035, 0],
      [0.00013, 2],
      [-0.00305, 1],
      [0.00061, 2],
      [-0.00103, 0],
      [0.00022, 2],
      [-0.00127, 0],
      [0.00018, 2],
      [-0.00022, 0],
      [-0.00427, 1],
      [2e-5, 2],
      [-0.00092, 0],
      [0.00029, 2],
      [-0.00055, 0],
      [-0.00143, 0],
      [-0.00196, 1],
      [0.00022, 0],
      [0.00014, 2]
    ],
    "red_o_points": [],
    "y_categories": ["N", "NOT APPLICABLE", "nan"],
    "blue_o_points": [],
    "blue_x_points": [
      [0.00104, 2],
      [0.00056, 2],
      [0.00027, 0],
      [0.0015, 0],
      [0.00032, 2],
      [0.00129, 0],
      [0.00052, 0],
      [0.00035, 0],
      [0.00125, 2],
      [0.00329, 1],
      [-0.00052, 0],
      [0.00094, 0],
      [0.00094, 2],
      [0.00042, 2],
      [0.00057, 2],
      [0.00038, 2],
      [0.00136, 2],
      [0.00054, 2],
      [0.00049, 1],
      [0.00062, 2],
      [0.00034, 2]
    ]
  },
  "QA_mulInjOrthesisType[ArmSling]": {
    "red_x_points": [
      [-0.00764, 2],
      [-0.00851, 2],
      [-0.00413, 2],
      [-0.00238, 2],
      [-0.00486, 2],
      [-0.00284, 2],
      [-0.00128, 2],
      [-0.00223, 1],
      [-0.00884, 2],
      [-0.00745, 2],
      [-0.00415, 2],
      [-0.02372, 0],
      [-0.00566, 3],
      [-0.00159, 2],
      [-0.00163, 1],
      [-0.00126, 2],
      [-0.01066, 3],
      [-0.00844, 2],
      [-0.00473, 2],
      [-0.00612, 2],
      [-0.00632, 3],
      [-0.00109, 2],
      [-0.0061, 2]
    ],
    "red_o_points": [],
    "y_categories": ["N", "NOT APPLICABLE", "Y", "nan"],
    "blue_o_points": [],
    "blue_x_points": [
      [-0.00078, 2],
      [-0.00108, 2],
      [0.00032, 2],
      [-1e-5, 2],
      [-0.00139, 2],
      [-0.00106, 2],
      [-0.0003, 2],
      [-0.00044, 2],
      [0.04071, 1],
      [0.03188, 1],
      [-0.00612, 2],
      [0.02381, 1],
      [0.02749, 1],
      [-0.00039, 2],
      [0.00609, 0],
      [-0.00085, 2],
      [-0.00753, 2],
      [0.00988, 1],
      [0.01075, 1],
      [-0.00293, 2],
      [0.00356, 3]
    ]
  },
  "QS_mulGraftNerve[Ssr]": {
    "red_x_points": [
      [-0.00037, 1],
      [-0.00011, 0],
      [-1e-5, 0],
      [2e-5, 0],
      [-5e-5, 0],
      [0.00023, 0],
      [-5e-5, 2],
      [-0.00072, 1],
      [1e-5, 2],
      [-0.00025, 0],
      [6e-5, 2],
      [-0.00011, 0],
      [-2e-5, 2],
      [3e-5, 0],
      [-0.00098, 1],
      [2e-5, 2],
      [-0.00014, 0],
      [-3e-5, 2],
      [-7e-5, 0],
      [-0.00027, 0],
      [-0.00033, 1],
      [4e-5, 0],
      [-7e-5, 2]
    ],
    "red_o_points": [],
    "y_categories": ["N", "NOT APPLICABLE", "nan"],
    "blue_o_points": [],
    "blue_x_points": [
      [0.00012, 2],
      [1e-5, 2],
      [8e-5, 0],
      [0.00022, 0],
      [0.00011, 2],
      [0.00048, 0],
      [0.00027, 0],
      [7e-5, 0],
      [0.00014, 2],
      [0.00074, 1],
      [-5e-5, 0],
      [0.00041, 0],
      [9e-5, 2],
      [0.00012, 2],
      [5e-5, 2],
      [4e-5, 2],
      [0.0001, 2],
      [-1e-5, 2],
      [7e-5, 1],
      [5e-5, 2],
      [2e-5, 2]
    ]
  },
  "QA_lstPexKine[Shoulder]": {
    "red_x_points": [
      [0.00098, 1],
      [-0.00093, 2],
      [-0.0022, 2],
      [0.00159, 1],
      [-0.0015, 2],
      [-0.01493, 0],
      [0.00074, 1],
      [0.00087, 1],
      [-0.00076, 2],
      [0.00176, 1],
      [-0.00137, 2],
      [-0.00077, 2],
      [-0.00189, 2],
      [-0.02641, 0],
      [0.00135, 1],
      [0.00105, 1],
      [-0.00151, 2],
      [-0.00204, 2],
      [-0.00539, 2],
      [-0.00137, 2],
      [-0.00082, 2],
      [0.00126, 1],
      [-0.00169, 2]
    ],
    "red_o_points": [],
    "y_categories": ["NPV", "PV", "nan"],
    "blue_o_points": [],
    "blue_x_points": [
      [0.00424, 1],
      [-0.00088, 2],
      [0.00475, 1],
      [0.00658, 1],
      [-0.00074, 2],
      [0.00771, 1],
      [0.00629, 1],
      [0.00682, 1],
      [-0.00031, 2],
      [-0.00022, 2],
      [-0.00112, 2],
      [0.00864, 1],
      [-0.00044, 2],
      [0.00307, 1],
      [0.00233, 1],
      [0.00127, 0],
      [-0.00054, 2],
      [0.0022, 1],
      [-0.00046, 2],
      [0.00275, 1],
      [0.00204, 1]
    ]
  },
  "QA_lstPexInspectio[Swelling]": {
    "red_x_points": [
      [0.00151, 1],
      [0.00181, 1],
      [-0.00299, 0],
      [0.0012, 1],
      [-0.01428, 2],
      [0.00191, 1],
      [-0.02254, 2],
      [-0.00201, 0],
      [-0.0106, 0],
      [0.00142, 1],
      [-0.01101, 0],
      [0.00169, 1],
      [0.00337, 1],
      [-0.03934, 2],
      [0.00176, 1],
      [-0.01722, 2],
      [0.00175, 1],
      [0.00282, 1],
      [0.00128, 1],
      [-0.00197, 0],
      [-0.00594, 0],
      [-0.00234, 0],
      [0.00437, 1]
    ],
    "red_o_points": [],
    "y_categories": ["ABS", "NAIA", "PT", "nan"],
    "blue_o_points": [],
    "blue_x_points": [
      [0.00894, 1],
      [0.00656, 1],
      [0.00478, 0],
      [0.0069, 0],
      [0.00627, 1],
      [0.00407, 1],
      [0.00882, 0],
      [0.00558, 1],
      [0.00593, 1],
      [0.00276, 1],
      [0.00295, 1],
      [0.00442, 1],
      [0.0049, 1],
      [0.00261, 0],
      [0.00471, 1],
      [0.00466, 1],
      [-0.0002, 0],
      [0.00403, 1],
      [0.00485, 0],
      [0.00586, 1],
      [0.00596, 1]
    ]
  },
  "QA_mulInjOrthesisType[ShoulderSupport]": {
    "red_x_points": [
      [-0.00773, 0],
      [-0.00736, 0],
      [-0.00352, 0],
      [-0.01569, 2],
      [-0.00455, 0],
      [-0.00253, 0],
      [-0.00143, 0],
      [-0.00319, 1],
      [-0.00976, 0],
      [-0.00722, 0],
      [-0.00521, 0],
      [-0.01578, 2],
      [-0.00928, 3],
      [-0.00199, 0],
      [-0.00264, 1],
      [-0.00158, 0],
      [-0.01014, 3],
      [-0.00919, 0],
      [-0.00433, 0],
      [-0.00516, 0],
      [-0.00955, 3],
      [-0.00097, 0],
      [-0.00675, 0]
    ],
    "red_o_points": [],
    "y_categories": ["N", "NOT APPLICABLE", "Y", "nan"],
    "blue_o_points": [],
    "blue_x_points": [
      [-0.00119, 0],
      [-0.00176, 0],
      [0.00092, 0],
      [0.00148, 0],
      [0.01328, 2],
      [0.00042, 0],
      [0.00043, 0],
      [0.00136, 0],
      [0.03646, 1],
      [0.02823, 1],
      [-0.00524, 0],
      [0.02348, 1],
      [0.0254, 1],
      [0.00015, 0],
      [0.00441, 2],
      [-0.00085, 0],
      [-0.0074, 0],
      [0.01392, 1],
      [0.011, 1],
      [-0.00218, 0],
      [0.00323, 3]
    ]
  },
  "QA_lstPexPain[C6]": {
    "red_x_points": [
      [-0.00081, 1],
      [-0.00261, 2],
      [-0.00235, 2],
      [-0.00071, 1],
      [-0.00171, 2],
      [-0.00029, 1],
      [-0.00086, 1],
      [-0.00079, 1],
      [-0.00305, 2],
      [-0.00247, 2],
      [-0.00531, 2],
      [-0.00252, 2],
      [-0.0014, 1],
      [-0.0026, 1],
      [-0.00028, 1],
      [-0.00097, 1],
      [-0.00189, 2],
      [-0.00529, 2],
      [-0.00378, 2],
      [-0.00237, 2],
      [-0.00063, 1],
      [-0.00058, 1],
      [-0.00134, 1]
    ],
    "red_o_points": [],
    "y_categories": ["NORM", "NPV", "nan"],
    "blue_o_points": [],
    "blue_x_points": [
      [-0.00019, 1],
      [-0.00022, 1],
      [0.00785, 0],
      [-0.00017, 1],
      [0.01605, 0],
      [0.00013, 1],
      [4e-5, 1],
      [-0.00024, 1],
      [-0.00198, 2],
      [-0.00166, 2],
      [-0.00183, 2],
      [-0.00021, 1],
      [-0.00173, 2],
      [0.01169, 0],
      [-0.00011, 1],
      [0.01086, 0],
      [-0.002, 2],
      [0.00904, 0],
      [-0.00028, 1],
      [-0.00027, 1],
      [-0.00016, 1]
    ]
  },
  "QS_mulGraftTrunk[LowerTrunk]": {
    "red_x_points": [
      [-0.00054, 1],
      [-0.0003, 0],
      [-2e-5, 0],
      [0.00015, 0],
      [-0.0001, 0],
      [0.0001, 0],
      [-2e-5, 2],
      [-0.0002, 1],
      [7e-5, 2],
      [-0.00017, 0],
      [-5e-5, 2],
      [-6e-5, 0],
      [-1e-5, 2],
      [-0.00015, 0],
      [-0.00055, 1],
      [1e-5, 2],
      [-0.00013, 0],
      [5e-5, 2],
      [5e-5, 0],
      [-0.00019, 0],
      [-0.00032, 1],
      [1e-5, 0],
      [-6e-5, 2]
    ],
    "red_o_points": [],
    "y_categories": ["N", "NOT APPLICABLE", "nan"],
    "blue_o_points": [],
    "blue_x_points": [
      [9e-5, 2],
      [0.00011, 2],
      [0.00013, 0],
      [9e-5, 0],
      [5e-5, 2],
      [0.00028, 0],
      [5e-5, 0],
      [9e-5, 0],
      [0.00012, 2],
      [0.00067, 1],
      [-0.00017, 0],
      [0.00056, 0],
      [0.00014, 2],
      [5e-5, 2],
      [0.00014, 2],
      [5e-5, 1],
      [-2e-5, 2]
    ]
  },
  "QS_mulGraftTrunk[UpperTrunk]": {
    "red_x_points": [
      [-0.00778, 1],
      [-0.00431, 0],
      [-0.00196, 0],
      [0.00089, 0],
      [-0.00309, 0],
      [0.00014, 0],
      [0.0004, 3],
      [-0.00643, 1],
      [0.00301, 3],
      [-0.02159, 2],
      [0.00136, 3],
      [-0.00349, 0],
      [0.00089, 3],
      [0.00035, 0],
      [-0.01012, 1],
      [0.00043, 3],
      [-0.00281, 0],
      [0.00169, 3],
      [-0.00187, 0],
      [-0.00492, 0],
      [-0.00682, 1],
      [0.00052, 0],
      [0.00137, 3]
    ],
    "red_o_points": [],
    "y_categories": ["N", "NOT APPLICABLE", "Y", "nan"],
    "blue_o_points": [],
    "blue_x_points": [
      [0.00335, 3],
      [0.0017, 3],
      [0.00222, 0],
      [0.00337, 0],
      [0.00116, 3],
      [0.00441, 0],
      [0.00312, 0],
      [0.00193, 0],
      [0.00531, 3],
      [0.01242, 1],
      [-0.00124, 0],
      [0.00471, 0],
      [0.00428, 3],
      [0.00167, 3],
      [0.00143, 3],
      [0.00094, 3],
      [0.00538, 3],
      [0.00159, 3],
      [0.00132, 1],
      [0.00279, 3],
      [0.00225, 3]
    ]
  },
  "QS_mulTransfSite[PhMc]": {
    "red_x_points": [
      [-0.00671, 1],
      [-0.0028, 0],
      [-0.00089, 0],
      [0.00162, 0],
      [-0.00214, 0],
      [-0.01193, 2],
      [0.00031, 3],
      [-0.00614, 1],
      [0.00218, 3],
      [-0.00218, 0],
      [0.00099, 3],
      [-0.0024, 0],
      [0.0008, 3],
      [0.00021, 0],
      [-0.0101, 1],
      [0.00035, 3],
      [-0.00746, 2],
      [0.00143, 3],
      [-0.00036, 0],
      [-0.00368, 0],
      [-0.00831, 1],
      [0.00224, 0],
      [0.00138, 3]
    ],
    "red_o_points": [],
    "y_categories": ["N", "NOT APPLICABLE", "Y", "nan"],
    "blue_o_points": [],
    "blue_x_points": [
      [0.00277, 3],
      [0.00239, 3],
      [0.00082, 0],
      [0.00391, 0],
      [0.00147, 3],
      [0.0049, 0],
      [0.00086, 0],
      [0.00204, 0],
      [0.0032, 3],
      [0.00866, 1],
      [-0.00099, 0],
      [0.00567, 0],
      [0.00326, 3],
      [0.00144, 3],
      [0.00183, 3],
      [0.00106, 3],
      [0.00325, 3],
      [0.00121, 3],
      [0.00173, 1],
      [0.00246, 3],
      [0.00164, 3]
    ]
  },
  "QA_yonPexPain": {
    "red_x_points": [
      [-0.01342, 1],
      [-0.01514, 1],
      [-0.01305, 1],
      [-0.01361, 1],
      [-0.01439, 1],
      [-0.01319, 1],
      [-0.01376, 1],
      [-0.01297, 1],
      [-0.01615, 1],
      [-0.01592, 1],
      [0.0159, 0],
      [-0.0143, 1],
      [-0.01403, 1],
      [-0.01509, 1],
      [0.01579, 0],
      [-0.01335, 1],
      [-0.01342, 1],
      [-0.0154, 1],
      [-0.01487, 1],
      [-0.01478, 1],
      [-0.0141, 1],
      [-0.01187, 1],
      [-0.01604, 1]
    ],
    "red_o_points": [],
    "y_categories": ["N", "Y", "nan"],
    "blue_o_points": [],
    "blue_x_points": [
      [-0.01296, 1],
      [0.02769, 0],
      [0.02298, 0],
      [0.02723, 0],
      [-0.01184, 1],
      [0.02566, 0],
      [-0.01231, 1],
      [-0.01265, 1],
      [-0.01405, 1],
      [0.03676, 2],
      [0.03233, 0],
      [-0.01338, 1],
      [0.02894, 0],
      [0.02414, 0],
      [0.02228, 0],
      [0.02266, 0],
      [0.0403, 2],
      [0.02467, 0],
      [-0.01105, 1],
      [-0.01378, 1],
      [0.03352, 2]
    ]
  },
  "QS_mulLysisNerve[Ssr]": {
    "red_x_points": [
      [-0.00446, 1],
      [-0.0005, 0],
      [-0.0087, 2],
      [-0.02082, 2],
      [-0.00032, 0],
      [0.00153, 0],
      [0.00059, 3],
      [-0.00481, 1],
      [0.00103, 3],
      [-0.00032, 0],
      [0.00111, 3],
      [-0.00052, 0],
      [0.00084, 3],
      [0.00075, 0],
      [-0.00503, 1],
      [0.00045, 3],
      [-0.00036, 0],
      [0.00074, 3],
      [0.00116, 0],
      [-0.00062, 0],
      [-0.00571, 1],
      [0.0013, 0],
      [0.00075, 3]
    ],
    "red_o_points": [],
    "y_categories": ["N", "NOT APPLICABLE", "Y", "nan"],
    "blue_o_points": [],
    "blue_x_points": [
      [0.00188, 3],
      [0.00141, 3],
      [0.00129, 0],
      [0.00434, 0],
      [0.00133, 3],
      [0.00311, 0],
      [0.00227, 0],
      [0.00458, 0],
      [0.00098, 3],
      [0.00165, 1],
      [7e-5, 0],
      [0.00427, 0],
      [0.00092, 3],
      [0.00189, 3],
      [0.00208, 3],
      [0.00145, 3],
      [0.00126, 3],
      [0.00154, 3],
      [0.00133, 1],
      [0.003, 3],
      [0.00128, 3]
    ]
  },
  "QS_mulGraftLevel[Trunk]": {
    "red_x_points": [
      [-0.00694, 1],
      [-0.00335, 0],
      [-0.00126, 0],
      [0.00039, 0],
      [-0.00226, 0],
      [0.00026, 0],
      [0.0004, 3],
      [-0.00762, 1],
      [0.00266, 3],
      [-0.01922, 2],
      [0.00101, 3],
      [-0.0036, 0],
      [0.00052, 3],
      [0.00032, 0],
      [-0.01091, 1],
      [4e-5, 3],
      [-0.00267, 0],
      [0.00111, 3],
      [-0.00113, 0],
      [-0.00433, 0],
      [-0.00619, 1],
      [0.00036, 0],
      [0.00053, 3]
    ],
    "red_o_points": [],
    "y_categories": ["N", "NOT APPLICABLE", "Y", "nan"],
    "blue_o_points": [],
    "blue_x_points": [
      [0.00309, 3],
      [0.00126, 3],
      [0.00261, 0],
      [0.00288, 0],
      [0.00088, 3],
      [0.00504, 0],
      [0.00286, 0],
      [0.00225, 0],
      [0.00466, 3],
      [0.00978, 1],
      [-3e-5, 0],
      [0.00551, 0],
      [0.00425, 3],
      [0.00163, 3],
      [0.00215, 3],
      [0.00075, 3],
      [0.00433, 3],
      [0.00182, 3],
      [0.00133, 1],
      [0.00259, 3],
      [0.00226, 3]
    ]
  },
  "QS_mulGraftNerve[FI]": {
    "red_x_points": [
      [-0.00083, 1],
      [-0.00052, 0],
      [-0.00037, 0],
      [0.00015, 0],
      [-0.00019, 0],
      [0.00025, 0],
      [-3e-5, 2],
      [-0.00097, 1],
      [9e-5, 2],
      [-0.00015, 0],
      [2e-5, 2],
      [-0.00042, 0],
      [-1e-5, 2],
      [5e-5, 0],
      [-0.00099, 1],
      [1e-5, 2],
      [-0.00019, 0],
      [0.00016, 2],
      [-0.00018, 0],
      [-0.00066, 0],
      [-0.00102, 1],
      [0.00012, 0],
      [3e-5, 2]
    ],
    "red_o_points": [],
    "y_categories": ["N", "NOT APPLICABLE", "nan"],
    "blue_o_points": [],
    "blue_x_points": [
      [0.00026, 2],
      [0.00015, 2],
      [0.00026, 0],
      [0.00058, 0],
      [9e-5, 2],
      [0.00024, 0],
      [0.00016, 0],
      [3e-5, 0],
      [0.00051, 2],
      [0.00092, 1],
      [-8e-5, 0],
      [0.00064, 0],
      [0.00037, 2],
      [0.00024, 2],
      [0.0001, 2],
      [0.00011, 2],
      [0.00048, 2],
      [0.00011, 2],
      [0.00017, 1],
      [0.00025, 2],
      [9e-5, 2]
    ]
  },
  "QS_mulGraftNerve[other]": {
    "red_x_points": [
      [-0.00333, 1],
      [-0.00129, 0],
      [-0.00083, 0],
      [0.00021, 0],
      [-0.00187, 0],
      [0.00057, 0],
      [0.00015, 2],
      [-0.0029, 1],
      [0.00117, 2],
      [-0.00163, 0],
      [0.00019, 2],
      [-0.00168, 0],
      [0.00031, 2],
      [-5e-5, 0],
      [-0.00529, 1],
      [5e-5, 2],
      [-0.00184, 0],
      [0.00019, 2],
      [-0.00101, 0],
      [-0.00252, 0],
      [-0.00283, 1],
      [0.00013, 0],
      [0.00027, 2]
    ],
    "red_o_points": [],
    "y_categories": ["N", "NOT APPLICABLE", "nan"],
    "blue_o_points": [],
    "blue_x_points": [
      [0.00125, 2],
      [0.00062, 2],
      [0.00072, 0],
      [0.00138, 0],
      [0.0004, 2],
      [0.00199, 0],
      [0.00091, 0],
      [0.00061, 0],
      [0.0017, 2],
      [0.00557, 1],
      [-0.00054, 0],
      [0.00179, 0],
      [0.00163, 2],
      [0.00052, 2],
      [0.0006, 2],
      [0.00026, 2],
      [0.00188, 2],
      [0.00053, 2],
      [0.00079, 1],
      [0.00063, 2],
      [0.00057, 2]
    ]
  },
  "QS_mulBpsurgeryType[Graft]": {
    "red_x_points": [
      [-0.00416, 1],
      [-0.00139, 0],
      [-0.00059, 0],
      [0.00023, 0],
      [-0.00136, 0],
      [-0.00011, 0],
      [0.00024, 3],
      [-0.00259, 1],
      [0.0017, 3],
      [-0.01422, 2],
      [0.00077, 3],
      [-0.0016, 0],
      [0.00017, 3],
      [6e-5, 0],
      [-0.00346, 1],
      [0.00016, 3],
      [-0.00146, 0],
      [0.00079, 3],
      [-0.00052, 0],
      [-0.00206, 0],
      [-0.00211, 1],
      [4e-5, 0],
      [0.00063, 3]
    ],
    "red_o_points": [],
    "y_categories": ["N", "NOT APPLICABLE", "Y", "nan"],
    "blue_o_points": [],
    "blue_x_points": [
      [0.00172, 3],
      [0.00063, 3],
      [0.00095, 0],
      [0.001, 0],
      [0.00044, 3],
      [0.00269, 0],
      [0.0018, 0],
      [0.00078, 0],
      [0.00238, 3],
      [0.00575, 1],
      [-0.00023, 0],
      [0.00258, 0],
      [0.00241, 3],
      [0.00055, 3],
      [0.00063, 3],
      [0.00046, 3],
      [0.00253, 3],
      [0.00095, 3],
      [0.00053, 1],
      [0.00112, 3],
      [0.00115, 3]
    ]
  },
  "QS_mulGraftNerve[Ax]": {
    "red_x_points": [
      [-0.00093, 1],
      [-0.00036, 0],
      [-0.00025, 0],
      [0.00015, 0],
      [-0.00018, 0],
      [0.0002, 0],
      [5e-5, 2],
      [-0.0012, 1],
      [0.0003, 2],
      [-0.00046, 0],
      [4e-5, 2],
      [-0.00038, 0],
      [5e-5, 2],
      [4e-5, 0],
      [-0.00227, 1],
      [-2e-5, 2],
      [-0.00056, 0],
      [-0.00014, 2],
      [-0.00036, 0],
      [-0.0007, 0],
      [-0.00067, 1],
      [8e-5, 0],
      [2e-5, 2]
    ],
    "red_o_points": [],
    "y_categories": ["N", "NOT APPLICABLE", "nan"],
    "blue_o_points": [],
    "blue_x_points": [
      [0.0006, 2],
      [0.00026, 2],
      [0.00036, 0],
      [0.00042, 0],
      [0.00011, 2],
      [0.00064, 0],
      [0.0003, 0],
      [0.0002, 0],
      [0.00044, 2],
      [0.00156, 1],
      [4e-5, 0],
      [0.00048, 0],
      [0.00043, 2],
      [0.00011, 2],
      [0.00029, 2],
      [4e-5, 2],
      [0.00031, 2],
      [0.00018, 2],
      [0.00027, 1],
      [0.00038, 2],
      [0.00015, 2]
    ]
  },
  "QA_lstPexMuscstrength[WristFlex]": {
    "red_x_points": [
      [-0.00253, 0],
      [-0.00119, 2],
      [-0.00876, 1],
      [0.00032, 0],
      [-0.00586, 1],
      [-0.01298, 1],
      [-0.00187, 0],
      [0.00022, 0],
      [-0.00165, 2],
      [-0.00312, 2],
      [-0.00147, 0],
      [-0.00219, 2],
      [-0.00675, 1],
      [0.00107, 0],
      [0.00076, 0],
      [-0.00293, 1],
      [-0.0062, 1],
      [-0.00525, 0],
      [0.00181, 0],
      [0.00065, 0],
      [-0.00219, 2],
      [-0.00618, 1],
      [-0.00517, 2]
    ],
    "red_o_points": [],
    "y_categories": ["GREATER THAN OR EQUALS TO 3", "LESS THAN 3", "nan"],
    "blue_o_points": [],
    "blue_x_points": [
      [0.00494, 1],
      [0.00711, 0],
      [0.00126, 0],
      [0.00406, 0],
      [0.00391, 0],
      [0.00631, 0],
      [0.00273, 0],
      [0.00312, 0],
      [0.00183, 2],
      [0.0008, 2],
      [0.0049, 0],
      [0.00757, 0],
      [0.00151, 2],
      [0.00033, 0],
      [0.00092, 0],
      [0.00236, 0],
      [0.00228, 2],
      [0.00356, 1],
      [0.00113, 0],
      [0.00961, 1],
      [0.00124, 2]
    ]
  },
  "QS_mulNeuromadSite[C5]": {
    "red_x_points": [
      [-0.00118, 1],
      [-0.00105, 0],
      [-0.00037, 0],
      [0.00015, 0],
      [-0.00029, 0],
      [0.00016, 0],
      [0.00011, 2],
      [-0.00142, 1],
      [0.00047, 2],
      [-0.00101, 0],
      [5e-5, 2],
      [-0.00102, 0],
      [3e-5, 2],
      [1e-5, 0],
      [-0.00265, 1],
      [1e-5, 2],
      [-0.00072, 0],
      [0.00019, 2],
      [-0.00067, 0],
      [-0.00134, 0],
      [-0.00132, 1],
      [0.0002, 0],
      [9e-5, 2]
    ],
    "red_o_points": [],
    "y_categories": ["N", "NOT APPLICABLE", "nan"],
    "blue_o_points": [],
    "blue_x_points": [
      [0.00049, 2],
      [0.00033, 2],
      [0.00048, 0],
      [0.00095, 0],
      [0.00018, 2],
      [0.00074, 0],
      [0.0002, 0],
      [0.00039, 0],
      [0.00056, 2],
      [0.00332, 1],
      [-0.00028, 0],
      [0.00097, 0],
      [0.00062, 2],
      [0.00025, 2],
      [0.00023, 2],
      [0.00013, 2],
      [0.00069, 2],
      [0.00034, 2],
      [0.00042, 1],
      [0.00027, 2],
      [0.0003, 2]
    ]
  },
  "QS_mulNeuromadSite[C7]": {
    "red_x_points": [
      [-0.0073, 1],
      [-0.00445, 0],
      [-0.00183, 0],
      [5e-5, 0],
      [-0.00317, 0],
      [0.00077, 0],
      [-0.00045, 2],
      [-0.00776, 1],
      [0.00229, 2],
      [-0.003, 0],
      [0.00081, 2],
      [-0.00421, 0],
      [0.00059, 2],
      [-0.00023, 0],
      [-0.01215, 1],
      [0.00026, 2],
      [-0.00346, 0],
      [0.00058, 2],
      [-0.00163, 0],
      [-0.00547, 0],
      [-0.00733, 1],
      [0.00036, 0],
      [4e-5, 2]
    ],
    "red_o_points": [],
    "y_categories": ["N", "NOT APPLICABLE", "nan"],
    "blue_o_points": [],
    "blue_x_points": [
      [0.00262, 2],
      [0.00123, 2],
      [0.00209, 0],
      [0.00319, 0],
      [0.00124, 2],
      [0.00478, 0],
      [0.00243, 0],
      [0.0011, 0],
      [0.00349, 2],
      [0.01323, 1],
      [-0.00131, 0],
      [0.00391, 0],
      [0.00373, 2],
      [0.00166, 2],
      [0.00161, 2],
      [0.00098, 2],
      [0.00345, 2],
      [0.00145, 2],
      [0.00201, 1],
      [0.0022, 2],
      [0.00164, 2]
    ]
  },
  "QS_mulGraftNerve[TD]": {
    "red_x_points": [
      [-0.00085, 1],
      [-0.00029, 0],
      [-0.00025, 0],
      [1e-5, 0],
      [-0.00043, 0],
      [5e-5, 0],
      [-3e-5, 2],
      [-0.00072, 1],
      [0.00025, 2],
      [-0.00014, 0],
      [-0.0, 2],
      [-0.00035, 0],
      [7e-5, 2],
      [9e-5, 0],
      [-0.00066, 1],
      [-9e-5, 2],
      [-0.00047, 0],
      [0.0001, 2],
      [-0.00025, 0],
      [-0.00053, 0],
      [-0.00041, 1],
      [-6e-5, 2]
    ],
    "red_o_points": [],
    "y_categories": ["N", "NOT APPLICABLE", "nan"],
    "blue_o_points": [],
    "blue_x_points": [
      [0.00011, 2],
      [-0.0, 2],
      [0.0001, 0],
      [0.00034, 0],
      [3e-5, 2],
      [0.0005, 0],
      [0.00021, 0],
      [0.00013, 0],
      [0.00036, 2],
      [0.00133, 1],
      [-0.0002, 0],
      [0.0005, 0],
      [0.00038, 2],
      [7e-5, 2],
      [5e-5, 2],
      [7e-5, 2],
      [0.00052, 2],
      [0.00025, 2],
      [6e-5, 2],
      [0.00016, 2]
    ]
  },
  "QA_intPexForearmSupin": {
    "red_x_points": [
      [-0.00078, 2],
      [-0.0076, 0],
      [-0.00088, 2],
      [-0.00103, 2],
      [-0.00082, 2],
      [-0.00122, 2],
      [-0.02042, 0],
      [-0.0143, 0],
      [-0.00121, 2],
      [-0.00072, 2],
      [-0.00141, 2],
      [-0.00033, 2],
      [-0.00162, 2],
      [0.00453, 1],
      [-0.00088, 2],
      [-0.01658, 0],
      [0.00059, 1],
      [-0.00106, 2],
      [-0.0011, 2],
      [-0.00083, 2],
      [0.00561, 1],
      [-0.01244, 0],
      [-0.00189, 2]
    ],
    "red_o_points": [],
    "y_categories": ["GREATER THAN OR EQUALS TO 80", "LESS THAN 80", "nan"],
    "blue_o_points": [],
    "blue_x_points": [
      [-0.00057, 2],
      [0.01813, 1],
      [0.00557, 1],
      [0.01281, 1],
      [0.01039, 1],
      [-0.00022, 2],
      [-0.00019, 2],
      [-0.00021, 2],
      [-0.00055, 2],
      [-0.0002, 2],
      [0.0025, 0],
      [-0.00023, 2],
      [-0.00051, 2],
      [0.00954, 1],
      [0.0081, 1],
      [-0.00069, 2],
      [-0.00066, 2],
      [-0.00032, 2],
      [-6e-5, 2],
      [0.01411, 1],
      [-0.00035, 2]
    ]
  },
  "QA_lstPexTinel[TinelSign]": {
    "red_x_points": [
      [0.00113, 1],
      [-0.00047, 1],
      [-0.01109, 2],
      [0.00106, 1],
      [0.0008, 1],
      [0.00144, 1],
      [-0.01496, 2],
      [-0.01243, 2],
      [-0.00694, 1],
      [-0.0002, 1],
      [-0.01759, 2],
      [-0.00859, 2],
      [-0.00071, 1],
      [-0.01694, 2],
      [0.00218, 1],
      [-0.0112, 2],
      [0.0009, 1],
      [-0.00198, 1],
      [-0.01427, 2],
      [-0.00943, 2],
      [-9e-5, 1],
      [-0.00747, 2],
      [-0.00283, 1]
    ],
    "red_o_points": [],
    "y_categories": ["ABS", "NAIA", "PT", "nan"],
    "blue_o_points": [],
    "blue_x_points": [
      [0.00759, 1],
      [0.03563, 0],
      [0.01635, 0],
      [-0.00688, 2],
      [0.00402, 1],
      [0.00613, 1],
      [-0.00696, 2],
      [0.00583, 1],
      [0.00509, 2],
      [0.00172, 1],
      [0.00635, 1],
      [0.00692, 1],
      [0.00122, 1],
      [0.0208, 0],
      [0.00463, 1],
      [0.00444, 1],
      [0.00422, 2],
      [0.00295, 1],
      [0.00502, 1],
      [0.00248, 1],
      [0.00217, 1]
    ]
  },
  "QA_lstPexTouch[C5]": {
    "red_x_points": [
      [-0.00196, 0],
      [-0.00061, 2],
      [-0.00139, 1],
      [-0.00076, 1],
      [-0.00049, 2],
      [-0.00032, 1],
      [-0.00091, 1],
      [-0.00386, 1],
      [-0.00113, 2],
      [-0.00082, 2],
      [-0.00237, 1],
      [-0.0004, 2],
      [-0.00237, 1],
      [-0.0011, 1],
      [-0.00324, 1],
      [-0.0009, 1],
      [-0.00092, 2],
      [-0.00457, 1],
      [-0.00133, 1],
      [-0.00138, 2],
      [-0.00229, 1],
      [-0.00023, 1],
      [-0.00266, 1]
    ],
    "red_o_points": [],
    "y_categories": ["NORM", "NPV", "nan"],
    "blue_o_points": [],
    "blue_x_points": [
      [-0.00146, 1],
      [-0.00182, 1],
      [-0.00031, 1],
      [-0.00051, 1],
      [0.01409, 0],
      [-0.00016, 1],
      [-0.00022, 1],
      [-0.00016, 1],
      [0.00167, 2],
      [0.00327, 2],
      [0.00035, 2],
      [-0.00066, 1],
      [0.00201, 2],
      [-0.00076, 1],
      [0.00505, 0],
      [-0.00039, 1],
      [0.00191, 2],
      [0.0056, 0],
      [0.00992, 0],
      [-0.00063, 1],
      [-0.00082, 1]
    ]
  },
  "QA_lstPexArthre[Index]": {
    "red_x_points": [
      [-0.00897, 0],
      [-0.00174, 2],
      [-0.00286, 2],
      [-0.00878, 0],
      [-0.00398, 0],
      [-0.01013, 0],
      [-0.00096, 1],
      [0.00093, 1],
      [-0.00146, 2],
      [0.00212, 1],
      [-0.00193, 2],
      [-0.00181, 2],
      [-0.00254, 2],
      [-0.00084, 1],
      [0.00099, 1],
      [-0.00413, 0],
      [-0.00115, 2],
      [-0.00267, 2],
      [-0.00654, 2],
      [-0.00092, 2],
      [-0.00259, 2],
      [-0.00632, 0],
      [-0.00376, 2]
    ],
    "red_o_points": [],
    "y_categories": ["NPV", "PV", "nan"],
    "blue_o_points": [],
    "blue_x_points": [
      [0.00352, 0],
      [-0.00094, 2],
      [0.00318, 1],
      [0.00861, 1],
      [0.00021, 2],
      [0.01107, 1],
      [0.00568, 1],
      [0.00176, 0],
      [-0.00096, 2],
      [-0.00018, 2],
      [-0.00063, 2],
      [0.0144, 1],
      [-0.00063, 2],
      [0.00278, 1],
      [0.00278, 1],
      [0.0004, 0],
      [-0.00059, 2],
      [0.00406, 1],
      [0.00035, 2],
      [0.00841, 1],
      [0.00679, 1]
    ]
  },
  "QA_lstPexMuscstrength[ElbowExte]": {
    "red_x_points": [
      [-0.00323, 2],
      [-0.00368, 2],
      [-0.00376, 1],
      [-0.00289, 1],
      [-0.00645, 1],
      [-0.0038, 1],
      [-0.00302, 1],
      [0.00082, 0],
      [-0.00158, 2],
      [-0.00661, 2],
      [-0.00487, 1],
      [-0.00369, 2],
      [-0.00029, 1],
      [-0.00728, 1],
      [-0.00027, 0],
      [-0.00177, 1],
      [-0.00495, 1],
      [-0.00648, 0],
      [-0.00684, 1],
      [-0.00359, 2],
      [-0.00211, 2],
      [-0.00188, 1],
      [-0.00487, 2]
    ],
    "red_o_points": [],
    "y_categories": ["GREATER THAN OR EQUALS TO 3", "LESS THAN 3", "nan"],
    "blue_o_points": [],
    "blue_x_points": [
      [0.00094, 1],
      [0.00025, 1],
      [0.00798, 0],
      [-0.0027, 1],
      [-0.00055, 1],
      [0.01368, 0],
      [0.01306, 0],
      [-0.00225, 1],
      [0.00021, 2],
      [-0.00013, 2],
      [0.01997, 0],
      [0.00029, 1],
      [0.00079, 2],
      [0.00707, 0],
      [0.00496, 0],
      [0.00643, 0],
      [0.00091, 2],
      [0.00349, 0],
      [0.00464, 0],
      [0.00232, 1],
      [0.00173, 1]
    ]
  },
  "QA_lstPexMuscstrength[FingersAddu]": {
    "red_x_points": [
      [0.00011, 2],
      [0.00047, 2],
      [-0.02201, 1],
      [8e-5, 2],
      [-0.01821, 1],
      [-0.02153, 1],
      [0.00658, 0],
      [0.00646, 0],
      [0.00054, 2],
      [0.00026, 2],
      [0.00432, 0],
      [0.00079, 2],
      [-0.01948, 1],
      [0.00873, 0],
      [0.00727, 0],
      [-0.0166, 1],
      [-0.01582, 1],
      [0.00054, 2],
      [-0.00055, 2],
      [-0.01724, 1],
      [0.00017, 2],
      [-0.01776, 1],
      [-0.00131, 2]
    ],
    "red_o_points": [],
    "y_categories": ["GREATER THAN OR EQUALS TO 3", "LESS THAN 3", "nan"],
    "blue_o_points": [],
    "blue_x_points": [
      [0.01381, 0],
      [-0.00465, 1],
      [0.00738, 0],
      [0.01108, 0],
      [0.01156, 0],
      [0.01363, 0],
      [0.00208, 2],
      [0.01063, 0],
      [0.00126, 2],
      [0.00146, 2],
      [0.00169, 2],
      [0.00255, 2],
      [0.00162, 2],
      [0.00876, 0],
      [0.00739, 0],
      [0.00765, 0],
      [0.0026, 2],
      [0.00125, 2],
      [0.01036, 0],
      [0.00128, 2],
      [0.00081, 2]
    ]
  },
  "QS_mulTransfSite[IMc]": {
    "red_x_points": [
      [-0.0128, 1],
      [-0.02276, 2],
      [9e-5, 0],
      [-0.02846, 2],
      [-0.0022, 0],
      [0.00441, 0],
      [0.00255, 3],
      [-0.0152, 1],
      [0.00709, 3],
      [-0.00106, 0],
      [0.00356, 3],
      [-0.01975, 2],
      [0.00322, 3],
      [0.00218, 0],
      [-0.01832, 1],
      [0.00227, 3],
      [-0.00348, 0],
      [0.00419, 3],
      [0.00132, 0],
      [-0.02065, 2],
      [-0.01672, 1],
      [-0.01333, 2],
      [0.00392, 3]
    ],
    "red_o_points": [],
    "y_categories": ["N", "NOT APPLICABLE", "Y", "nan"],
    "blue_o_points": [],
    "blue_x_points": [
      [0.00652, 3],
      [0.0054, 3],
      [0.00518, 0],
      [0.00968, 0],
      [0.00483, 3],
      [0.00866, 0],
      [0.00553, 0],
      [0.00756, 0],
      [0.00902, 3],
      [0.0135, 1],
      [0.00264, 0],
      [0.01032, 0],
      [0.00861, 3],
      [0.00495, 3],
      [0.00542, 3],
      [0.00431, 3],
      [0.0089, 3],
      [0.00584, 3],
      [0.00095, 1],
      [0.00715, 3],
      [0.00495, 3]
    ]
  },
  "QA_lstPexTouch[T1]": {
    "red_x_points": [
      [-0.01155, 1],
      [-0.0026, 2],
      [-0.00613, 1],
      [0.00574, 0],
      [-0.00294, 2],
      [-0.0078, 1],
      [0.00464, 0],
      [-0.01016, 1],
      [-0.00221, 2],
      [-0.00427, 2],
      [-0.01012, 1],
      [-0.00223, 2],
      [-0.00772, 1],
      [-0.01335, 1],
      [-0.01031, 1],
      [-0.00646, 1],
      [-0.00224, 2],
      [0.00153, 0],
      [-0.0098, 1],
      [-0.00439, 2],
      [-0.01112, 1],
      [-0.00566, 1],
      [-0.00972, 1]
    ],
    "red_o_points": [],
    "y_categories": ["NORM", "NPV", "nan"],
    "blue_o_points": [],
    "blue_x_points": [
      [-0.00516, 1],
      [-0.00497, 1],
      [0.01355, 0],
      [-0.00558, 1],
      [-0.00527, 1],
      [0.0182, 0],
      [0.01925, 0],
      [0.01558, 0],
      [0.00156, 2],
      [0.00377, 2],
      [0.00044, 2],
      [-0.0048, 1],
      [0.00186, 2],
      [0.01202, 0],
      [0.01086, 0],
      [0.01157, 0],
      [0.00272, 2],
      [-0.00455, 1],
      [0.01817, 0],
      [0.01418, 0],
      [0.01547, 0]
    ]
  },
  "QA_lstPexArthre[Elbow]": {
    "red_x_points": [
      [-0.00043, 2],
      [-0.00087, 3],
      [-0.00103, 3],
      [0.00017, 2],
      [-0.00487, 0],
      [-0.00561, 1],
      [-0.00295, 2],
      [-0.00015, 2],
      [-0.00052, 3],
      [0.00045, 2],
      [-0.0019, 3],
      [-0.00113, 3],
      [-0.00137, 3],
      [0.00032, 2],
      [-0.00032, 2],
      [-0.00345, 2],
      [-0.00055, 3],
      [-0.00106, 3],
      [-0.00317, 3],
      [-0.00056, 3],
      [-0.00033, 3],
      [0.00027, 2],
      [-0.00162, 3]
    ],
    "red_o_points": [],
    "y_categories": ["NAIA", "NPV", "PV", "nan"],
    "blue_o_points": [],
    "blue_x_points": [
      [0.01621, 1],
      [-0.00039, 3],
      [0.00088, 2],
      [0.00121, 2],
      [-0.00021, 3],
      [0.00374, 2],
      [0.00157, 2],
      [0.00149, 2],
      [-0.00022, 3],
      [-8e-5, 3],
      [-0.00018, 3],
      [0.00288, 2],
      [-0.0002, 3],
      [3e-5, 2],
      [0.00014, 2],
      [0.00306, 1],
      [-0.00021, 3],
      [0.00026, 2],
      [-0.00016, 3],
      [0.00023, 2],
      [0.00064, 2]
    ]
  },
  "QS_mulTransfSite[AcMc]": {
    "red_x_points": [
      [-0.00844, 1],
      [-0.00676, 0],
      [-0.00313, 0],
      [-0.00654, 0],
      [-0.00418, 0],
      [-0.00069, 0],
      [0.00061, 3],
      [-0.00907, 1],
      [0.00365, 3],
      [-0.00368, 0],
      [0.00122, 3],
      [-0.00428, 0],
      [0.00187, 3],
      [-0.0049, 0],
      [-0.0124, 1],
      [0.00063, 3],
      [-0.00401, 0],
      [0.00149, 3],
      [-0.00364, 0],
      [-0.00529, 0],
      [-0.0088, 1],
      [-0.00066, 0],
      [0.00139, 3]
    ],
    "red_o_points": [],
    "y_categories": ["N", "NOT APPLICABLE", "Y", "nan"],
    "blue_o_points": [],
    "blue_x_points": [
      [0.004, 3],
      [0.00229, 3],
      [0.00065, 0],
      [0.00206, 0],
      [0.00282, 3],
      [0.00188, 0],
      [0.00026, 0],
      [0.01988, 2],
      [0.00463, 3],
      [0.01077, 1],
      [-0.00235, 0],
      [0.00199, 0],
      [0.00408, 3],
      [0.00264, 3],
      [0.00238, 3],
      [0.00283, 3],
      [0.00455, 3],
      [0.0018, 3],
      [0.00241, 1],
      [0.00362, 3],
      [0.00244, 3]
    ]
  },
  "QS_mulTransfSite[Other]": {
    "red_x_points": [
      [-0.00486, 1],
      [-0.0015, 0],
      [-0.00059, 0],
      [0.00054, 0],
      [-0.00094, 0],
      [0.0008, 0],
      [-0.00017, 3],
      [-0.00815, 1],
      [0.00106, 3],
      [-0.00074, 0],
      [0.00068, 3],
      [-0.00134, 0],
      [0.00041, 3],
      [-0.03059, 2],
      [-0.00711, 1],
      [0.0006, 3],
      [-0.00134, 0],
      [0.00068, 3],
      [0.00023, 0],
      [-0.00129, 0],
      [-0.00458, 1],
      [0.00044, 0],
      [0.00031, 3]
    ],
    "red_o_points": [],
    "y_categories": ["N", "NOT APPLICABLE", "Y", "nan"],
    "blue_o_points": [],
    "blue_x_points": [
      [0.00217, 3],
      [0.00171, 3],
      [0.00452, 0],
      [0.00529, 0],
      [0.00224, 3],
      [0.00369, 0],
      [0.00658, 0],
      [0.00422, 0],
      [0.00123, 3],
      [0.00474, 1],
      [-0.00028, 0],
      [0.00311, 0],
      [0.00113, 3],
      [0.00395, 3],
      [0.00313, 3],
      [0.00209, 3],
      [0.00139, 3],
      [0.00256, 3],
      [9e-5, 1],
      [0.00239, 3],
      [0.00152, 3]
    ]
  },
  "QA_yonInjBpsurg": {
    "red_x_points": [
      [-0.00774, 0],
      [0.00029, 1],
      [0.00024, 1],
      [0.00079, 1],
      [0.00017, 1],
      [0.001, 1],
      [0.0005, 1],
      [-0.00696, 0],
      [5e-5, 1],
      [0.00056, 1],
      [0.00032, 1],
      [0.00023, 1],
      [0.00036, 1],
      [0.00068, 1],
      [-0.00916, 0],
      [0.0007, 1],
      [-0.00105, 1],
      [-0.00139, 1],
      [0.00043, 1],
      [-0.00105, 1],
      [-0.01029, 0],
      [0.00048, 1],
      [0.00058, 1]
    ],
    "red_o_points": [],
    "y_categories": ["N", "Y", "nan"],
    "blue_o_points": [],
    "blue_x_points": [
      [0.00252, 1],
      [0.00157, 1],
      [0.00169, 1],
      [0.00162, 1],
      [0.00081, 1],
      [0.00233, 1],
      [0.00179, 1],
      [0.00153, 1],
      [0.00046, 1],
      [0.00385, 0],
      [0.00029, 1],
      [0.00152, 1],
      [0.00036, 1],
      [0.00134, 1],
      [0.00153, 1],
      [0.0011, 1],
      [0.00029, 1],
      [0.00151, 1],
      [0.00033, 0],
      [0.00182, 1],
      [0.00199, 1]
    ]
  },
  "QA_lstPexTouch[C8]": {
    "red_x_points": [
      [0.0075, 0],
      [-0.00345, 2],
      [-0.00837, 1],
      [-0.01374, 1],
      [-0.00318, 2],
      [-0.00788, 1],
      [-0.01172, 1],
      [-0.01099, 1],
      [-0.00295, 2],
      [-0.00418, 2],
      [-0.01241, 1],
      [-0.00341, 2],
      [-0.01403, 1],
      [0.00945, 0],
      [-0.01038, 1],
      [-0.00987, 1],
      [-0.0029, 2],
      [0.00651, 0],
      [-0.0102, 1],
      [-0.0043, 2],
      [-0.01545, 1],
      [-0.0077, 1],
      [-0.01316, 1]
    ],
    "red_o_points": [],
    "y_categories": ["NORM", "NPV", "nan"],
    "blue_o_points": [],
    "blue_x_points": [
      [-0.00879, 1],
      [-0.00966, 1],
      [0.01416, 0],
      [-0.00749, 1],
      [0.01856, 0],
      [-0.0069, 1],
      [0.01818, 0],
      [0.0184, 0],
      [0.00043, 2],
      [0.00164, 2],
      [-0.00093, 2],
      [-0.00656, 1],
      [0.00155, 2],
      [0.01502, 0],
      [0.01389, 0],
      [0.01555, 0],
      [0.00202, 2],
      [0.01325, 0],
      [0.01514, 0],
      [0.02021, 0],
      [0.01914, 0]
    ]
  },
  "QA_lstPexPalle[Clavicle]": {
    "red_x_points": [
      [-0.0009, 3],
      [-0.00073, 3],
      [-0.00088, 3],
      [0.00708, 2],
      [-0.00075, 3],
      [-0.00087, 3],
      [-0.01755, 0],
      [-0.01617, 0],
      [-0.00081, 3],
      [-0.00109, 3],
      [-0.00091, 3],
      [-0.00075, 3],
      [-0.00068, 3],
      [-0.0251, 0],
      [-0.00072, 3],
      [-0.0158, 0],
      [-0.00626, 1],
      [-0.00097, 3],
      [-0.0016, 3],
      [-0.00084, 3],
      [0.00686, 2],
      [-0.01369, 0],
      [-0.00072, 3]
    ],
    "red_o_points": [],
    "y_categories": ["HYPO", "NAIA", "PT", "nan"],
    "blue_o_points": [],
    "blue_x_points": [
      [-1e-5, 3],
      [-0.00041, 3],
      [0.01291, 2],
      [0.01812, 2],
      [3e-5, 3],
      [-0.00084, 3],
      [0.01827, 2],
      [0.01488, 2],
      [-0.00058, 3],
      [-0.00053, 3],
      [-0.00076, 3],
      [-0.00048, 3],
      [-0.00056, 3],
      [-0.00855, 0],
      [0.01305, 2],
      [0.00694, 1],
      [-0.00062, 3],
      [0.01065, 2],
      [-0.00042, 3],
      [0.01325, 2],
      [-0.00049, 3]
    ]
  },
  "QS_mulTransfSite[AcSsAA]": {
    "red_x_points": [
      [-0.01119, 1],
      [-0.0209, 2],
      [-0.00166, 0],
      [-0.00108, 0],
      [-0.01364, 2],
      [0.00076, 0],
      [-0.00018, 3],
      [-0.01228, 1],
      [0.00658, 3],
      [-0.02052, 2],
      [0.00311, 3],
      [-0.00199, 0],
      [0.00203, 3],
      [-0.01048, 0],
      [-0.01396, 1],
      [0.00082, 3],
      [-0.01204, 2],
      [0.00399, 3],
      [-0.00351, 0],
      [-0.01578, 2],
      [-0.01149, 1],
      [0.00017, 0],
      [0.00308, 3]
    ],
    "red_o_points": [],
    "y_categories": ["N", "NOT APPLICABLE", "Y", "nan"],
    "blue_o_points": [],
    "blue_x_points": [
      [0.00555, 3],
      [0.00336, 3],
      [0.00648, 2],
      [0.00384, 0],
      [0.00423, 3],
      [0.00495, 0],
      [0.01312, 2],
      [0.00059, 0],
      [0.00942, 3],
      [0.01737, 1],
      [0.0089, 0],
      [0.00621, 0],
      [0.00776, 3],
      [0.00407, 3],
      [0.00425, 3],
      [0.00317, 3],
      [0.01026, 3],
      [0.00379, 3],
      [0.00313, 1],
      [0.00518, 3],
      [0.00453, 3]
    ]
  },
  "QS_mulLysisRoot[C5]": {
    "red_x_points": [
      [-0.00347, 1],
      [-0.00092, 0],
      [-0.01089, 2],
      [0.00171, 0],
      [-0.00073, 0],
      [0.00224, 0],
      [0.00015, 3],
      [-0.00559, 1],
      [0.00089, 3],
      [-0.00046, 0],
      [0.00104, 3],
      [-0.00077, 0],
      [0.00086, 3],
      [0.00097, 0],
      [-0.00512, 1],
      [0.0005, 3],
      [-0.00069, 0],
      [0.00099, 3],
      [0.00093, 0],
      [-0.00041, 0],
      [-0.00411, 1],
      [-0.00778, 2],
      [0.00083, 3]
    ],
    "red_o_points": [],
    "y_categories": ["N", "NOT APPLICABLE", "Y", "nan"],
    "blue_o_points": [],
    "blue_x_points": [
      [0.00153, 3],
      [0.00148, 3],
      [0.00056, 0],
      [0.0051, 0],
      [0.00067, 3],
      [0.00241, 0],
      [0.0022, 0],
      [0.00163, 0],
      [0.00087, 3],
      [0.00272, 1],
      [-0.00065, 0],
      [0.00403, 0],
      [0.00093, 3],
      [0.00085, 3],
      [0.00054, 3],
      [0.00011, 3],
      [0.00176, 3],
      [0.00026, 3],
      [0.00135, 1],
      [0.00083, 3],
      [0.00066, 3]
    ]
  },
  "QS_mulNeuromadSite[C6]": {
    "red_x_points": [
      [-0.00346, 1],
      [-0.00219, 0],
      [-0.00072, 0],
      [0.00044, 0],
      [-0.00148, 0],
      [0.00055, 0],
      [-0.0001, 2],
      [-0.00405, 1],
      [0.00123, 2],
      [-0.00191, 0],
      [0.00036, 2],
      [-0.00234, 0],
      [0.00018, 2],
      [-0.00048, 0],
      [-0.00581, 1],
      [5e-5, 2],
      [-0.00164, 0],
      [0.00023, 2],
      [-0.00106, 0],
      [-0.00241, 0],
      [-0.00425, 1],
      [0.0003, 0],
      [0.00023, 2]
    ],
    "red_o_points": [],
    "y_categories": ["N", "NOT APPLICABLE", "nan"],
    "blue_o_points": [],
    "blue_x_points": [
      [0.00122, 2],
      [0.00077, 2],
      [0.00049, 0],
      [0.00173, 0],
      [0.00045, 2],
      [0.002, 0],
      [0.00114, 0],
      [0.00068, 0],
      [0.00212, 2],
      [0.00624, 1],
      [-0.00075, 0],
      [0.00253, 0],
      [0.00203, 2],
      [0.00086, 2],
      [0.00103, 2],
      [0.00039, 2],
      [0.00205, 2],
      [0.00086, 2],
      [0.00078, 1],
      [0.00117, 2],
      [0.00053, 2]
    ]
  },
  "QS_mulNeuromadSite[T1]": {
    "red_x_points": [
      [-0.00129, 1],
      [-0.00109, 0],
      [-0.0003, 0],
      [0.00015, 0],
      [-0.00059, 0],
      [4e-5, 0],
      [-5e-5, 2],
      [-0.00102, 1],
      [0.00062, 2],
      [-0.00056, 0],
      [0.00028, 2],
      [-0.00097, 0],
      [9e-5, 2],
      [-2e-5, 0],
      [-0.00263, 1],
      [3e-5, 2],
      [-0.00067, 0],
      [6e-5, 2],
      [-0.00019, 0],
      [-0.00098, 0],
      [-0.00105, 1],
      [-3e-5, 0],
      [8e-5, 2]
    ],
    "red_o_points": [],
    "y_categories": ["N", "NOT APPLICABLE", "nan"],
    "blue_o_points": [],
    "blue_x_points": [
      [0.00034, 2],
      [0.00019, 2],
      [0.00031, 0],
      [0.00074, 0],
      [7e-5, 2],
      [0.00086, 0],
      [0.00017, 0],
      [0.00016, 0],
      [0.00085, 2],
      [0.00295, 1],
      [-0.0002, 0],
      [0.00049, 0],
      [0.00044, 2],
      [0.00027, 2],
      [0.00028, 2],
      [0.00015, 2],
      [0.00084, 2],
      [0.00027, 2],
      [0.00022, 1],
      [0.00036, 2],
      [0.00033, 2]
    ]
  },
  "QA_lstPexMuscstrength[ThumbOppo]": {
    "red_x_points": [
      [2e-5, 2],
      [0.00018, 2],
      [-0.01077, 1],
      [-0.02175, 1],
      [-0.0074, 1],
      [-0.01108, 1],
      [-0.00122, 0],
      [0.00185, 0],
      [0.00014, 2],
      [3e-5, 2],
      [-0.00277, 0],
      [0.00061, 2],
      [-0.00884, 1],
      [0.00319, 0],
      [0.00108, 0],
      [-0.0063, 1],
      [-0.00754, 1],
      [7e-5, 2],
      [0.00292, 0],
      [-0.00815, 1],
      [-0.0002, 2],
      [-0.00982, 1],
      [-0.00205, 2]
    ],
    "red_o_points": [],
    "y_categories": ["GREATER THAN OR EQUALS TO 3", "LESS THAN 3", "nan"],
    "blue_o_points": [],
    "blue_x_points": [
      [0.00238, 1],
      [0.00388, 1],
      [0.00449, 0],
      [0.00782, 0],
      [0.00702, 0],
      [0.00756, 0],
      [0.00621, 0],
      [0.00948, 0],
      [0.00096, 2],
      [0.00149, 2],
      [0.00213, 2],
      [0.00691, 2],
      [0.0014, 2],
      [0.00444, 0],
      [0.00389, 0],
      [0.0051, 0],
      [0.00249, 2],
      [0.00115, 2],
      [0.00555, 0],
      [0.00287, 2],
      [0.00058, 2]
    ]
  },
  "QA_lstPexMuscstrength[ShoulderAbduc]": {
    "red_x_points": [
      [-0.00128, 2],
      [0.00021, 1],
      [0.00012, 1],
      [0.00043, 1],
      [0.00011, 1],
      [0.00055, 1],
      [0.00057, 1],
      [-0.01538, 0],
      [-0.00044, 2],
      [-0.00045, 2],
      [-0.00404, 2],
      [-0.0003, 2],
      [0.00046, 1],
      [0.00126, 1],
      [-0.02441, 0],
      [0.00021, 1],
      [7e-5, 1],
      [0.00045, 1],
      [0.00052, 1],
      [0.00042, 1],
      [-0.00106, 2],
      [0.00019, 1],
      [-0.00066, 2]
    ],
    "red_o_points": [],
    "y_categories": ["GREATER THAN OR EQUALS TO 3", "LESS THAN 3", "nan"],
    "blue_o_points": [],
    "blue_x_points": [
      [0.00376, 1],
      [0.00283, 1],
      [0.00301, 1],
      [0.00305, 1],
      [0.00251, 1],
      [0.00466, 1],
      [0.00187, 1],
      [0.00125, 1],
      [0.00033, 2],
      [0.00066, 2],
      [0.0013, 1],
      [0.00108, 2],
      [7e-5, 2],
      [0.00275, 1],
      [0.00291, 1],
      [-0.00131, 2],
      [0.00021, 2],
      [0.00216, 1],
      [0.00766, 1],
      [0.00048, 1],
      [0.00121, 1]
    ]
  },
  "QA_lstPexTouch[C7]": {
    "red_x_points": [
      [-0.01308, 1],
      [-0.00395, 2],
      [-0.00892, 1],
      [-0.01034, 1],
      [-0.00324, 2],
      [-0.00806, 1],
      [-0.01069, 1],
      [-0.01256, 1],
      [-0.00352, 2],
      [-0.00435, 2],
      [-0.01346, 1],
      [-0.00427, 2],
      [-0.01333, 1],
      [0.00916, 0],
      [-0.01304, 1],
      [-0.00964, 1],
      [-0.00337, 2],
      [0.01055, 0],
      [-0.00922, 1],
      [-0.0036, 2],
      [-0.01462, 1],
      [-0.00785, 1],
      [-0.01308, 1]
    ],
    "red_o_points": [],
    "y_categories": ["NORM", "NPV", "nan"],
    "blue_o_points": [],
    "blue_x_points": [
      [-0.00929, 1],
      [-0.00927, 1],
      [0.01912, 0],
      [-0.00702, 1],
      [0.02197, 0],
      [-0.00713, 1],
      [0.02132, 0],
      [-0.00631, 1],
      [0.00045, 2],
      [0.0031, 2],
      [-0.00097, 2],
      [-0.00663, 1],
      [0.0018, 2],
      [0.0177, 0],
      [0.01633, 0],
      [0.01836, 0],
      [0.0011, 2],
      [0.01755, 0],
      [0.02427, 0],
      [0.02323, 0],
      [0.02477, 0]
    ]
  },
  "QA_lstPexMuscstrength[ShoulderExrot]": {
    "red_x_points": [
      [-0.00121, 2],
      [-0.00016, 2],
      [-0.01344, 0],
      [-0.00069, 2],
      [0.00315, 1],
      [-0.00051, 2],
      [0.00207, 1],
      [-0.01974, 0],
      [-0.00046, 2],
      [-0.0003, 2],
      [-0.00128, 2],
      [-0.00019, 2],
      [-0.00055, 2],
      [0.00385, 1],
      [-0.02966, 0],
      [0.00182, 1],
      [0.00017, 2],
      [8e-5, 2],
      [0.00493, 1],
      [-0.01746, 0],
      [-0.00108, 2],
      [0.00231, 1],
      [-0.00067, 2]
    ],
    "red_o_points": [],
    "y_categories": ["GREATER THAN OR EQUALS TO 3", "LESS THAN 3", "nan"],
    "blue_o_points": [],
    "blue_x_points": [
      [0.00969, 1],
      [1e-5, 2],
      [0.00594, 1],
      [0.00565, 1],
      [0.00674, 1],
      [0.00915, 1],
      [0.00543, 1],
      [0.0, 2],
      [0.0001, 2],
      [0.00054, 2],
      [0.00054, 2],
      [0.00044, 2],
      [0.00065, 2],
      [0.0056, 1],
      [0.00607, 1],
      [-0.00013, 2],
      [0.00033, 2],
      [0.00046, 2],
      [0.01192, 1],
      [3e-5, 2],
      [-0.00013, 2]
    ]
  },
  "QA_txtInjMedicatioListNer": {
    "red_x_points": [
      [-0.00782, 1],
      [-0.00661, 1],
      [-0.00609, 1],
      [-0.00445, 1],
      [-0.00696, 1],
      [-0.00116, 2],
      [-0.0079, 1],
      [0.00325, 0],
      [-0.00813, 2],
      [-0.00371, 2],
      [-0.00256, 2],
      [-0.00304, 2],
      [-0.00888, 1],
      [-0.00589, 1],
      [-0.00142, 2],
      [-0.0069, 1],
      [-0.00281, 2],
      [-0.00851, 1],
      [-0.00987, 1],
      [-0.00691, 1],
      [-0.00389, 1],
      [-5e-5, 2],
      [-0.0025, 2]
    ],
    "red_o_points": [],
    "y_categories": ["N", "Y", "nan"],
    "blue_o_points": [],
    "blue_x_points": [
      [0.03245, 0],
      [0.00132, 2],
      [0.01171, 0],
      [-0.00325, 1],
      [0.00109, 2],
      [0.00126, 2],
      [0.00177, 2],
      [-0.00417, 1],
      [-0.00278, 1],
      [-0.0043, 1],
      [0.03086, 0],
      [-0.00041, 2],
      [0.02434, 0],
      [-0.00376, 1],
      [0.0012, 2],
      [0.0004, 2],
      [-0.00348, 1],
      [0.01377, 0],
      [0.01906, 0],
      [-0.00403, 1],
      [-0.00022, 2]
    ]
  },
  "QA_lstPexKine[Elbow]": {
    "red_x_points": [
      [-0.00011, 1],
      [-0.00034, 2],
      [-0.00128, 2],
      [0.00106, 1],
      [-0.00084, 2],
      [-0.00735, 0],
      [-0.00058, 1],
      [-0.00044, 1],
      [-0.00069, 2],
      [0.00043, 1],
      [-0.0015, 2],
      [-0.00054, 2],
      [-0.00103, 2],
      [-0.0, 1],
      [8e-5, 1],
      [-0.00197, 0],
      [-0.00025, 2],
      [-0.00087, 2],
      [-0.00273, 2],
      [-0.00069, 2],
      [-0.00035, 2],
      [-0.00518, 0],
      [-0.00136, 2]
    ],
    "red_o_points": [],
    "y_categories": ["NPV", "PV", "nan"],
    "blue_o_points": [],
    "blue_x_points": [
      [0.00535, 0],
      [-0.00019, 2],
      [0.0004, 1],
      [0.00356, 1],
      [1e-5, 2],
      [0.00391, 1],
      [0.00142, 1],
      [0.00118, 1],
      [-0.00018, 2],
      [-0.00021, 2],
      [-0.00034, 2],
      [0.00568, 1],
      [-0.00041, 2],
      [0.00051, 1],
      [0.00047, 1],
      [0.00273, 0],
      [-0.00023, 2],
      [0.00084, 1],
      [5e-5, 2],
      [0.00085, 1],
      [0.00116, 1]
    ]
  },
  "QS_mulNeuromadSite[C4]": {
    "red_x_points": [
      [-0.00566, 1],
      [-0.0039, 0],
      [-0.00139, 0],
      [0.00031, 0],
      [-0.00207, 0],
      [0.00092, 0],
      [-0.0, 2],
      [-0.00655, 1],
      [0.00183, 2],
      [-0.00309, 0],
      [0.00083, 2],
      [-0.00316, 0],
      [0.0004, 2],
      [0.00037, 0],
      [-0.00951, 1],
      [0.00028, 2],
      [-0.00246, 0],
      [0.00044, 2],
      [-0.0012, 0],
      [-0.00406, 0],
      [-0.00568, 1],
      [0.00064, 0],
      [0.00072, 2]
    ],
    "red_o_points": [],
    "y_categories": ["N", "NOT APPLICABLE", "nan"],
    "blue_o_points": [],
    "blue_x_points": [
      [0.00125, 2],
      [0.00128, 2],
      [0.00153, 0],
      [0.00306, 0],
      [0.00052, 2],
      [0.00299, 0],
      [0.00166, 0],
      [0.00136, 0],
      [0.00277, 2],
      [0.01003, 1],
      [-0.00139, 0],
      [0.00281, 0],
      [0.00305, 2],
      [0.0014, 2],
      [0.00141, 2],
      [0.00053, 2],
      [0.00349, 2],
      [0.00097, 2],
      [0.00094, 1],
      [0.00141, 2],
      [0.00092, 2]
    ]
  },
  "QS_mulTransfSite[Oberlin]": {
    "red_x_points": [
      [-0.01358, 1],
      [-0.03846, 0],
      [-0.03716, 0],
      [-0.04001, 0],
      [-0.0372, 0],
      [-0.03674, 0],
      [0.0097, 3],
      [-0.01335, 1],
      [0.0116, 3],
      [0.01437, 2],
      [0.01122, 3],
      [-0.03525, 0],
      [0.01117, 3],
      [0.01431, 2],
      [-0.01543, 1],
      [0.01021, 3],
      [-0.03695, 0],
      [0.01108, 3],
      [0.01579, 2],
      [-0.03847, 0],
      [-0.01534, 1],
      [-0.03469, 0],
      [0.01021, 3]
    ],
    "red_o_points": [],
    "y_categories": ["N", "NOT APPLICABLE", "Y", "nan"],
    "blue_o_points": [],
    "blue_x_points": [
      [0.01246, 3],
      [0.01215, 3],
      [0.01824, 2],
      [0.02014, 2],
      [0.01214, 3],
      [0.0211, 2],
      [0.01881, 2],
      [0.01961, 2],
      [0.01321, 3],
      [-0.00224, 1],
      [0.01902, 2],
      [0.02165, 2],
      [0.01296, 3],
      [0.01158, 3],
      [0.01128, 3],
      [0.01067, 3],
      [0.01246, 3],
      [0.01106, 3],
      [-0.00632, 1],
      [0.01196, 3],
      [0.01105, 3]
    ]
  },
  "QS_mulLysisSite[Nerve]": {
    "red_x_points": [
      [-0.00549, 1],
      [-0.00111, 0],
      [-0.00996, 2],
      [-0.02249, 2],
      [-0.00099, 0],
      [0.00267, 0],
      [0.00032, 3],
      [-0.00647, 1],
      [0.0013, 3],
      [-0.00065, 0],
      [0.0008, 3],
      [-0.00116, 0],
      [0.0008, 3],
      [0.00022, 0],
      [-0.00713, 1],
      [0.00037, 3],
      [-0.00087, 0],
      [0.00108, 3],
      [0.00115, 0],
      [-0.00108, 0],
      [-0.00899, 1],
      [0.00193, 0],
      [0.0006, 3]
    ],
    "red_o_points": [],
    "y_categories": ["N", "NOT APPLICABLE", "Y", "nan"],
    "blue_o_points": [],
    "blue_x_points": [
      [0.00267, 3],
      [0.00208, 3],
      [0.00205, 0],
      [0.00506, 0],
      [0.00175, 3],
      [0.00452, 0],
      [0.00204, 0],
      [0.00549, 0],
      [0.00137, 3],
      [0.00317, 1],
      [-0.00036, 0],
      [0.00551, 0],
      [0.0017, 3],
      [0.0025, 3],
      [0.00252, 3],
      [0.00236, 3],
      [0.00201, 3],
      [0.00188, 3],
      [0.00193, 1],
      [0.00333, 3],
      [0.00159, 3]
    ]
  },
  "QA_yonPreFracture": {
    "red_x_points": [
      [-0.03092, 1],
      [0.00128, 2],
      [0.00496, 0],
      [0.00187, 2],
      [0.00563, 0],
      [0.0051, 0],
      [-0.0277, 1],
      [0.00544, 0],
      [0.00104, 2],
      [-0.03448, 1],
      [-0.03629, 1],
      [-0.02863, 1],
      [0.00222, 2],
      [0.00545, 0],
      [0.00549, 0],
      [0.00472, 0],
      [0.0047, 0],
      [0.00753, 0],
      [-0.03479, 1],
      [0.00573, 0],
      [0.00083, 2],
      [-0.02216, 1],
      [0.00104, 2]
    ],
    "red_o_points": [],
    "y_categories": ["N", "Y", "nan"],
    "blue_o_points": [],
    "blue_x_points": [
      [0.00853, 0],
      [0.00512, 2],
      [0.00706, 0],
      [0.00761, 0],
      [0.00565, 2],
      [0.00832, 0],
      [0.00795, 0],
      [0.00613, 2],
      [0.00327, 2],
      [0.01005, 0],
      [0.01057, 0],
      [0.01122, 0],
      [0.01104, 0],
      [0.00621, 0],
      [0.00624, 0],
      [0.00492, 2],
      [0.01046, 0],
      [0.00815, 0],
      [0.0067, 0],
      [0.00341, 2],
      [0.00333, 2]
    ]
  },
  "QA_lstPexKine[Index]": {
    "red_x_points": [
      [-0.00066, 1],
      [-0.00054, 2],
      [-0.00237, 2],
      [0.00085, 1],
      [-0.00081, 2],
      [-0.00993, 0],
      [-0.00099, 1],
      [-0.0002, 1],
      [-0.00034, 2],
      [0.0006, 1],
      [-0.00144, 2],
      [-0.0005, 2],
      [-0.00151, 2],
      [0.00055, 1],
      [-0.00051, 1],
      [-0.00162, 0],
      [-0.00049, 2],
      [-0.0008, 2],
      [-0.00401, 2],
      [-0.00068, 2],
      [-0.00026, 2],
      [-0.00621, 0],
      [-0.00122, 2]
    ],
    "red_o_points": [],
    "y_categories": ["NPV", "PV", "nan"],
    "blue_o_points": [],
    "blue_x_points": [
      [0.00633, 0],
      [-0.00011, 2],
      [0.00048, 1],
      [0.00438, 1],
      [-0.00016, 2],
      [0.00545, 1],
      [0.00186, 1],
      [0.00267, 1],
      [-0.00019, 2],
      [-8e-5, 2],
      [-0.00044, 2],
      [0.00682, 1],
      [-0.0002, 2],
      [0.00046, 1],
      [0.00036, 1],
      [0.00234, 0],
      [-0.00023, 2],
      [0.00055, 1],
      [9e-5, 2],
      [0.00158, 1],
      [0.00111, 1]
    ]
  },
  "QA_lstPexPalle[Ulna]": {
    "red_x_points": [
      [-0.00115, 4],
      [-0.0013, 4],
      [-0.00141, 4],
      [-0.02967, 2],
      [-0.0014, 4],
      [-0.00128, 4],
      [-0.01212, 1],
      [0.00676, 3],
      [-0.00185, 4],
      [-0.00152, 4],
      [-0.00175, 4],
      [-0.00146, 4],
      [-0.00165, 4],
      [0.00786, 3],
      [-0.00139, 4],
      [-0.02358, 0],
      [-0.01882, 0],
      [-0.00166, 4],
      [-0.00165, 4],
      [-0.00144, 4],
      [0.00724, 3],
      [-0.01864, 0],
      [-0.00167, 4]
    ],
    "red_o_points": [],
    "y_categories": ["ABS", "HYPO", "NAIA", "PT", "nan"],
    "blue_o_points": [],
    "blue_x_points": [
      [-0.00115, 4],
      [-0.00119, 4],
      [0.00992, 3],
      [0.01248, 1],
      [-0.00087, 4],
      [-0.00051, 4],
      [0.01268, 3],
      [0.01347, 3],
      [-0.00142, 4],
      [-0.00123, 4],
      [-0.0011, 4],
      [-0.00078, 4],
      [-0.00124, 4],
      [0.0135, 3],
      [0.01323, 3],
      [0.0133, 3],
      [-0.00122, 4],
      [0.01182, 3],
      [-0.001, 4],
      [0.01592, 3],
      [-0.00107, 4]
    ]
  }
}
