{
  "QA_lstPexMuscstrength[ElbowFlex]": {
    "red_x_points": [
      [-0.01132, 1],
      [-0.00098, 2],
      [-0.01082, 1],
      [-0.01011, 1],
      [-0.01136, 1],
      [-0.01124, 1],
      [-0.0113, 1],
      [-0.0108, 1],
      [-0.01163, 1],
      [-0.01164, 1],
      [-0.01101, 1],
      [-0.01227, 1],
      [-0.00095, 2],
      [-0.00218, 2],
      [0.00087, 2],
      [-0.01103, 1],
      [-0.01098, 1],
      [-0.01036, 1],
      [-0.01087, 1],
      [-0.01124, 1],
      [-0.00047, 2],
      [-0.01111, 1],
      [-0.01172, 1],
      [-0.01097, 1],
      [-0.01089, 1],
      [0.00013, 2],
      [-0.01054, 1],
      [-0.01107, 1],
      [-0.00087, 2]
    ],
    "red_o_points": [],
    "y_categories": ["GREATER THAN OR EQUALS TO 3", "LESS THAN 3", "nan"],
    "blue_o_points": [],
    "blue_x_points": [
      [0.00137, 2],
      [-0.01029, 1],
      [0.05772, 0],
      [-0.01137, 1],
      [0.00224, 2],
      [0.00217, 2],
      [0.04192, 0],
      [-0.00992, 1],
      [-0.0108, 1],
      [0.00207, 2],
      [0.0557, 0],
      [0.04488, 0],
      [0.04818, 0],
      [0.04552, 0],
      [-0.01065, 1]
    ]
  },
  "QS_mulGraftNerve[other]": {
    "red_x_points": [
      [-2e-5, 2],
      [-0.00012, 0],
      [-0.00012, 0],
      [-6e-5, 0],
      [-0.00012, 0],
      [-7e-5, 0],
      [-0.00012, 0],
      [-5e-5, 2],
      [-0.00011, 0],
      [-0.00017, 0],
      [-3e-5, 2],
      [-6e-5, 0],
      [-4e-5, 2],
      [-0.00015, 0],
      [-4e-5, 0],
      [-3e-5, 2],
      [-3e-5, 2],
      [-3e-5, 2],
      [-7e-5, 0],
      [-0.0, 2],
      [-4e-5, 2],
      [-2e-5, 2],
      [-8e-5, 0],
      [-8e-5, 0],
      [-3e-5, 2],
      [0.00036, 1],
      [-2e-5, 2],
      [-5e-5, 0],
      [-3e-5, 2]
    ],
    "red_o_points": [],
    "y_categories": ["N", "NOT APPLICABLE", "nan"],
    "blue_o_points": [],
    "blue_x_points": [
      [0.00078, 1],
      [-4e-5, 2],
      [-8e-5, 0],
      [-8e-5, 0],
      [-3e-5, 2],
      [0.00028, 1],
      [0.00019, 1],
      [-7e-5, 0],
      [-3e-5, 2],
      [-2e-5, 2],
      [-4e-5, 0],
      [0.00026, 1],
      [-1e-5, 2],
      [0.00036, 1],
      [-2e-5, 2]
    ]
  },
  "QS_mulLysisTrunk[Upper]": {
    "red_x_points": [
      [-0.00057, 3],
      [-0.00493, 0],
      [-0.00349, 0],
      [-0.00297, 0],
      [-0.00318, 0],
      [-0.01389, 2],
      [-0.00325, 0],
      [-0.00068, 3],
      [-0.00319, 0],
      [-0.00317, 0],
      [-0.00108, 3],
      [-0.00392, 0],
      [-0.00081, 3],
      [-0.00407, 0],
      [-0.01147, 2],
      [-0.001, 3],
      [-0.00067, 3],
      [-0.001, 3],
      [-0.00322, 0],
      [-0.00069, 3],
      [-0.00073, 3],
      [-0.00078, 3],
      [-0.00375, 0],
      [-0.0038, 0],
      [-0.00097, 3],
      [0.01206, 1],
      [-0.00067, 3],
      [-0.01153, 2],
      [-0.00059, 3]
    ],
    "red_o_points": [],
    "y_categories": ["N", "NOT APPLICABLE", "Y", "nan"],
    "blue_o_points": [],
    "blue_x_points": [
      [0.02205, 1],
      [-0.00032, 3],
      [-0.0014, 0],
      [-0.00138, 0],
      [-2e-5, 3],
      [0.019, 1],
      [0.01392, 1],
      [-0.00224, 0],
      [-0.00032, 3],
      [-0.00013, 3],
      [-0.00162, 0],
      [0.01552, 1],
      [-0.00055, 3],
      [0.01615, 1],
      [-0.00068, 3]
    ]
  },
  "QS_mulBpsurgeryType[Transf]": {
    "red_x_points": [
      [-5e-5, 3],
      [-0.00052, 2],
      [-0.00228, 0],
      [-0.00033, 2],
      [-0.00049, 2],
      [-0.00033, 2],
      [-0.00047, 2],
      [-0.0001, 3],
      [-0.00035, 2],
      [-0.00033, 2],
      [-2e-5, 3],
      [-0.00045, 2],
      [-0.00014, 3],
      [-0.00044, 2],
      [-0.00037, 2],
      [-4e-5, 3],
      [-4e-5, 3],
      [-1e-5, 3],
      [-0.00027, 2],
      [-5e-5, 3],
      [-0.00014, 3],
      [-5e-5, 3],
      [-0.00049, 2],
      [-0.00051, 2],
      [-0.00012, 3],
      [0.00134, 1],
      [-9e-5, 3],
      [-0.00038, 2],
      [-0.00014, 3]
    ],
    "red_o_points": [],
    "y_categories": ["N", "NOT APPLICABLE", "Y", "nan"],
    "blue_o_points": [],
    "blue_x_points": [
      [0.00308, 1],
      [-5e-5, 3],
      [-0.00018, 2],
      [-0.00028, 2],
      [-0.0, 3],
      [0.00113, 1],
      [0.00126, 1],
      [-0.00035, 2],
      [-9e-5, 3],
      [0.0, 3],
      [-0.00012, 2],
      [0.00167, 1],
      [-4e-5, 3],
      [0.00161, 1],
      [1e-5, 3]
    ]
  },
  "participant_code": {
    "red_x_points": [
      [-0.03256, 1],
      [-0.03222, 2],
      [-0.03167, 3],
      [-0.03277, 4],
      [-0.03113, 5],
      [-0.03263, 8],
      [-0.03236, 9],
      [-0.03147, 10],
      [-0.03071, 11],
      [-0.03195, 13],
      [-0.03256, 14],
      [-0.03195, 18],
      [-0.03188, 19],
      [-0.0325, 20],
      [-0.03195, 23],
      [-0.03181, 26],
      [-0.03188, 28],
      [-0.03174, 29],
      [-0.03236, 30],
      [-0.03195, 31],
      [-0.03119, 32],
      [-0.03085, 34],
      [-0.0325, 36],
      [-0.03167, 38],
      [-0.03113, 39],
      [-0.0325, 40],
      [-0.03215, 41],
      [-0.0314, 42],
      [-0.03215, 43]
    ],
    "red_o_points": [],
    "y_categories": [
      "P16554",
      "P18297",
      "P19283",
      "P19287",
      "P23172",
      "P23391",
      "P30595",
      "P31645",
      "P31691",
      "P34778",
      "P35046",
      "P36328",
      "P43633",
      "P4544",
      "P46417",
      "P48965",
      "P53068",
      "P5497",
      "P58556",
      "P59529",
      "P62483",
      "P64658",
      "P65202",
      "P66816",
      "P6751",
      "P7408",
      "P75566",
      "P76226",
      "P79971",
      "P82621",
      "P82990",
      "P84549",
      "P84932",
      "P85825",
      "P86989",
      "P8770",
      "P87791",
      "P90550",
      "P93159",
      "P94969",
      "P96710",
      "P97130",
      "P9744",
      "P98500",
      "nan"
    ],
    "blue_o_points": [],
    "blue_x_points": [
      [0.06097, 0],
      [0.0615, 6],
      [0.06202, 7],
      [0.06031, 12],
      [0.06176, 15],
      [0.06334, 16],
      [0.05926, 17],
      [0.06045, 21],
      [0.06018, 22],
      [0.0632, 24],
      [0.06242, 25],
      [0.06228, 27],
      [0.0636, 33],
      [0.06268, 35],
      [0.06163, 37]
    ]
  },
  "QS_mulNeuromadSite[C8]": {
    "red_x_points": [
      [-2e-5, 2],
      [-0.00044, 0],
      [-0.00022, 0],
      [-0.00024, 0],
      [-0.00034, 0],
      [-0.00023, 0],
      [-0.00027, 0],
      [-0.00015, 2],
      [-0.00049, 0],
      [-0.00019, 0],
      [-0.00027, 2],
      [-0.00034, 0],
      [-8e-5, 2],
      [-0.00058, 0],
      [-0.00055, 0],
      [-0.0001, 2],
      [-1e-5, 2],
      [-0.0001, 2],
      [-0.0002, 0],
      [-1e-5, 2],
      [-2e-5, 2],
      [-2e-5, 2],
      [-0.00034, 0],
      [-0.00034, 0],
      [-2e-5, 2],
      [0.0004, 1],
      [-2e-5, 2],
      [-0.00021, 0],
      [-2e-5, 2]
    ],
    "red_o_points": [],
    "y_categories": ["N", "NOT APPLICABLE", "nan"],
    "blue_o_points": [],
    "blue_x_points": [
      [0.00243, 1],
      [5e-5, 2],
      [-0.00016, 0],
      [-0.00012, 0],
      [5e-5, 2],
      [0.0009, 1],
      [0.00076, 1],
      [-0.00013, 0],
      [-0.00014, 2],
      [0.0001, 2],
      [-0.00013, 0],
      [0.00075, 1],
      [-2e-5, 2],
      [0.00104, 1],
      [4e-5, 2]
    ]
  },
  "QS_mulGraftNerve[Ph]": {
    "red_x_points": [
      [5e-5, 2],
      [-0.00018, 0],
      [-0.00019, 0],
      [-4e-5, 0],
      [-5e-5, 0],
      [-8e-5, 0],
      [-0.00017, 0],
      [3e-5, 2],
      [-0.00022, 0],
      [-8e-5, 0],
      [1e-5, 2],
      [-0.00019, 0],
      [3e-5, 2],
      [-0.00024, 0],
      [-0.0002, 0],
      [-1e-5, 2],
      [1e-5, 2],
      [1e-5, 2],
      [-4e-5, 0],
      [1e-5, 2],
      [5e-5, 2],
      [1e-5, 2],
      [-0.00015, 0],
      [-0.00012, 0],
      [2e-5, 2],
      [5e-5, 1],
      [1e-5, 2],
      [-4e-5, 0],
      [2e-5, 2]
    ],
    "red_o_points": [],
    "y_categories": ["N", "NOT APPLICABLE", "nan"],
    "blue_o_points": [],
    "blue_x_points": [
      [0.00065, 1],
      [5e-5, 2],
      [-6e-5, 0],
      [5e-5, 2],
      [0.00034, 1],
      [0.00013, 1],
      [-8e-5, 0],
      [3e-5, 2],
      [3e-5, 2],
      [0.00013, 1],
      [1e-5, 2],
      [0.00042, 1],
      [-1e-5, 2]
    ]
  },
  "QS_mulTransfSite[AcSsPA]": {
    "red_x_points": [
      [-9e-5, 3],
      [-0.00118, 0],
      [-0.00091, 0],
      [-0.00075, 0],
      [-0.00104, 0],
      [-0.0008, 0],
      [-0.001, 0],
      [-0.00012, 3],
      [-0.00101, 0],
      [-0.00085, 0],
      [-0.00013, 3],
      [-0.00114, 0],
      [-0.00015, 3],
      [-0.00113, 0],
      [-0.00325, 2],
      [-0.00011, 3],
      [-0.00012, 3],
      [-0.00013, 3],
      [-0.00068, 0],
      [-0.0001, 3],
      [-0.00012, 3],
      [-0.00014, 3],
      [-0.00089, 0],
      [-0.00101, 0],
      [-0.00013, 3],
      [0.00286, 1],
      [-0.00012, 3],
      [-0.00094, 0],
      [-0.00017, 3]
    ],
    "red_o_points": [],
    "y_categories": ["N", "NOT APPLICABLE", "Y", "nan"],
    "blue_o_points": [],
    "blue_x_points": [
      [0.00441, 1],
      [-0.00013, 3],
      [-0.00058, 0],
      [-0.00068, 0],
      [-7e-5, 3],
      [0.00363, 1],
      [0.00284, 1],
      [-0.00063, 0],
      [-0.00013, 3],
      [-7e-5, 3],
      [-0.00059, 0],
      [0.00357, 1],
      [-8e-5, 3],
      [0.00389, 1],
      [-3e-5, 3]
    ]
  },
  "QA_lstPexPalle[Elbow]": {
    "red_x_points": [
      [-0.00065, 4],
      [-0.00347, 4],
      [-0.00251, 4],
      [-0.00242, 3],
      [-0.00416, 4],
      [-0.00126, 3],
      [-0.0039, 4],
      [-0.0005, 4],
      [-0.0053, 4],
      [-0.00106, 3],
      [-0.00509, 1],
      [-0.00499, 4],
      [-0.00079, 4],
      [-0.00526, 4],
      [-0.00149, 4],
      [0.00072, 3],
      [-0.01022, 0],
      [0.00046, 3],
      [-0.00777, 2],
      [0.00058, 3],
      [-0.00057, 4],
      [-0.0009, 4],
      [-0.00581, 4],
      [-0.00466, 4],
      [-0.00038, 4],
      [-0.02785, 3],
      [-0.00035, 4],
      [-0.00629, 0],
      [-0.00074, 4]
    ],
    "red_o_points": [],
    "y_categories": ["ABS", "HYPO", "NAIA", "PT", "nan"],
    "blue_o_points": [],
    "blue_x_points": [
      [0.00463, 4],
      [4e-5, 4],
      [0.00465, 3],
      [0.03898, 1],
      [0.00043, 4],
      [0.00481, 4],
      [0.00884, 1],
      [-0.00338, 4],
      [0.00056, 4],
      [0.00046, 4],
      [0.02842, 1],
      [0.00503, 4],
      [0.00217, 3],
      [0.00509, 4],
      [0.00589, 3]
    ]
  },
  "QA_lstPexArthre[Index]": {
    "red_x_points": [
      [-0.0125, 0],
      [-0.00461, 2],
      [-0.00323, 2],
      [-0.0059, 0],
      [-0.00846, 0],
      [0.00635, 1],
      [-0.0082, 0],
      [0.0007, 2],
      [0.00874, 1],
      [-0.01367, 0],
      [0.00332, 1],
      [-0.00682, 2],
      [0.00052, 2],
      [0.00828, 1],
      [-0.00243, 2],
      [0.00411, 1],
      [-0.01107, 0],
      [0.0024, 1],
      [-0.00423, 2],
      [-0.01247, 0],
      [0.00089, 2],
      [0.00119, 2],
      [-0.00783, 2],
      [-0.00522, 2],
      [0.00265, 1],
      [-0.00077, 2],
      [0.00074, 2],
      [-0.0056, 0],
      [0.00073, 2]
    ],
    "red_o_points": [],
    "y_categories": ["NPV", "PV", "nan"],
    "blue_o_points": [],
    "blue_x_points": [
      [0.00057, 0],
      [0.0021, 2],
      [0.01251, 1],
      [0.01424, 1],
      [0.00289, 2],
      [-0.00017, 2],
      [0.00167, 1],
      [0.01104, 1],
      [0.00192, 2],
      [0.00138, 2],
      [0.01258, 1],
      [0.0015, 1],
      [0.00303, 1],
      [-0.00021, 2],
      [0.00735, 1]
    ]
  },
  "QA_yonInjTbi": {
    "red_x_points": [
      [0.00951, 0],
      [-0.00166, 2],
      [-0.00233, 0],
      [-0.0012, 0],
      [-0.00222, 2],
      [0.00046, 1],
      [-0.00217, 0],
      [-0.01211, 2],
      [-0.00469, 2],
      [0.00072, 1],
      [-0.00585, 1],
      [-0.00544, 0],
      [0.00785, 0],
      [0.0011, 1],
      [6e-5, 1],
      [-0.00729, 1],
      [-0.00542, 1],
      [-0.00639, 1],
      [0.00094, 1],
      [-0.00701, 1],
      [0.00882, 0],
      [-0.00715, 1],
      [0.00198, 1],
      [0.0009, 1],
      [-0.00546, 1],
      [-0.00061, 2],
      [-0.01144, 2],
      [2e-5, 1],
      [-0.00793, 1]
    ],
    "red_o_points": [],
    "y_categories": ["N", "Y", "nan"],
    "blue_o_points": [],
    "blue_x_points": [
      [0.00069, 0],
      [-0.00354, 1],
      [0.00244, 1],
      [0.00309, 1],
      [0.01366, 0],
      [6e-5, 1],
      [-1e-5, 1],
      [0.00356, 1],
      [0.01583, 0],
      [0.01279, 0],
      [0.00266, 1],
      [7e-5, 2],
      [-0.00471, 1],
      [0.01743, 0]
    ]
  },
  "QA_mulInjOrthesisType[ArmSling]": {
    "red_x_points": [
      [-0.00838, 2],
      [-0.00846, 2],
      [-0.008, 2],
      [-0.00819, 2],
      [-0.00824, 2],
      [-0.00841, 2],
      [-0.00785, 2],
      [-0.00806, 2],
      [-0.00843, 2],
      [-0.00824, 2],
      [-0.00848, 2],
      [-0.00847, 2],
      [-0.00831, 2],
      [-0.00805, 2],
      [-0.02581, 0],
      [-0.00853, 2],
      [-0.00848, 2],
      [-0.0261, 0],
      [-0.02556, 3],
      [-0.00851, 2],
      [-0.0086, 2],
      [-0.00781, 2],
      [-0.00853, 2],
      [-0.00834, 2],
      [-0.02597, 3],
      [-0.02645, 3],
      [-0.02547, 3],
      [-0.00831, 2],
      [-0.0083, 2]
    ],
    "red_o_points": [],
    "y_categories": ["N", "NOT APPLICABLE", "Y", "nan"],
    "blue_o_points": [],
    "blue_x_points": [
      [-0.00788, 2],
      [-0.00787, 2],
      [-0.00791, 2],
      [-0.00783, 2],
      [0.0511, 1],
      [0.05013, 1],
      [0.04842, 1],
      [0.05008, 1],
      [-0.00766, 2],
      [0.05137, 1],
      [-0.00777, 2],
      [0.04918, 1],
      [0.05058, 1],
      [0.05066, 1],
      [-0.00826, 2]
    ]
  },
  "QS_mulGraftNerve[Ul]": {
    "red_x_points": [
      [1e-5, 2],
      [-0.00013, 0],
      [-3e-5, 0],
      [-3e-5, 0],
      [-3e-5, 0],
      [-3e-5, 0],
      [-2e-5, 2],
      [-3e-5, 0],
      [1e-5, 2],
      [-2e-5, 2],
      [1e-5, 2],
      [-1e-5, 2]
    ],
    "red_o_points": [],
    "y_categories": ["N", "NOT APPLICABLE", "nan"],
    "blue_o_points": [],
    "blue_x_points": [
      [0.00027, 1],
      [-2e-5, 2],
      [0.0001, 1],
      [1e-5, 2],
      [-2e-5, 2]
    ]
  },
  "QA_mulInjOrthesisType[ShoulderSupport]": {
    "red_x_points": [
      [-0.0088, 0],
      [-0.00889, 0],
      [-0.00889, 0],
      [-0.03252, 2],
      [-0.00861, 0],
      [-0.00883, 0],
      [-0.00879, 0],
      [-0.03318, 2],
      [-0.00892, 0],
      [-0.00887, 0],
      [-0.00878, 0],
      [-0.00882, 0],
      [-0.00866, 0],
      [-0.00855, 0],
      [-0.03195, 2],
      [-0.00906, 0],
      [-0.00879, 0],
      [-0.03167, 2],
      [-0.03138, 3],
      [-0.00857, 0],
      [-0.00859, 0],
      [-0.00857, 0],
      [-0.00852, 0],
      [-0.00871, 0],
      [-0.03326, 3],
      [-0.03236, 3],
      [-0.03191, 3],
      [-0.00896, 0],
      [-0.0087, 0]
    ],
    "red_o_points": [],
    "y_categories": ["N", "NOT APPLICABLE", "Y", "nan"],
    "blue_o_points": [],
    "blue_x_points": [
      [-0.00872, 0],
      [-0.00805, 0],
      [-0.00827, 0],
      [-0.00813, 0],
      [0.06376, 1],
      [0.06315, 1],
      [0.06084, 1],
      [0.06235, 1],
      [-0.00807, 0],
      [0.06424, 1],
      [-0.00841, 0],
      [0.06045, 1],
      [0.06349, 1],
      [0.06217, 1],
      [-0.00869, 0]
    ]
  },
  "QA_yonInjUnconscio": {
    "red_x_points": [
      [-0.0149, 1],
      [-0.01438, 1],
      [-0.00208, 2],
      [-0.00243, 2],
      [-0.00194, 2],
      [-0.01679, 1],
      [-0.00203, 2],
      [-0.00284, 2],
      [-0.00208, 2],
      [-0.01633, 1],
      [-0.01482, 1],
      [-0.0164, 1],
      [-0.00419, 2],
      [-0.00249, 2],
      [-0.01066, 1],
      [-0.01532, 1],
      [-0.01508, 1],
      [-0.01145, 1],
      [-0.01202, 1],
      [-0.01502, 1],
      [-0.00369, 2],
      [-0.00277, 2],
      [-0.01744, 1],
      [-0.01588, 1],
      [-0.00286, 2],
      [-0.00253, 2],
      [-0.00322, 2],
      [-0.0151, 1],
      [-0.00379, 2]
    ],
    "red_o_points": [],
    "y_categories": ["N", "Y", "nan"],
    "blue_o_points": [],
    "blue_x_points": [
      [-0.00123, 2],
      [-0.00161, 2],
      [0.05295, 0],
      [-0.00081, 2],
      [-0.00803, 1],
      [-0.00918, 1],
      [0.03863, 0],
      [0.04793, 0],
      [-0.00159, 2],
      [0.04328, 0],
      [0.055, 0],
      [-0.00194, 2],
      [-0.00982, 1],
      [-0.00217, 2],
      [0.0591, 0]
    ]
  },
  "QA_lstPexInspectio[SurgicalScar]": {
    "red_x_points": [
      [-0.0026, 1],
      [-0.00458, 1],
      [-0.00793, 0],
      [-0.00382, 1],
      [-0.00726, 1],
      [-0.00995, 0],
      [-0.00567, 1],
      [-0.00271, 1],
      [-0.00812, 1],
      [-0.01063, 1],
      [-0.01054, 0],
      [-0.00861, 1],
      [-0.00028, 2],
      [-0.01002, 1],
      [-0.00512, 0],
      [0.0069, 2],
      [0.00493, 2],
      [-0.00549, 1],
      [-0.00415, 1],
      [-0.00566, 1],
      [-0.00133, 2],
      [-0.00327, 1],
      [-0.00887, 1],
      [0.01297, 2],
      [-0.00364, 1],
      [-0.0055, 1],
      [-0.00208, 1],
      [0.00512, 2],
      [-0.00296, 1]
    ],
    "red_o_points": [],
    "y_categories": ["ABS", "NAIA", "PT", "nan"],
    "blue_o_points": [],
    "blue_x_points": [
      [-0.00036, 1],
      [0.0107, 2],
      [0.02476, 2],
      [0.02996, 2],
      [0.0018, 1],
      [0.00057, 1],
      [0.00126, 0],
      [-0.00499, 1],
      [-0.00108, 1],
      [0.0022, 1],
      [0.02156, 2],
      [-0.00039, 1],
      [0.00878, 2],
      [0.00455, 0],
      [0.01156, 2]
    ]
  },
  "QS_mulBpsurgeryType[Lysis]": {
    "red_x_points": [
      [-0.00077, 3],
      [-0.00576, 0],
      [-0.01784, 2],
      [-0.01477, 2],
      [-0.00351, 0],
      [-0.01728, 2],
      [-0.00394, 0],
      [-0.00146, 3],
      [-0.00403, 0],
      [-0.00323, 0],
      [-0.00107, 3],
      [-0.00379, 0],
      [-0.00186, 3],
      [-0.00526, 0],
      [-0.0151, 2],
      [-0.00091, 3],
      [-0.0008, 3],
      [-0.00075, 3],
      [-0.00352, 0],
      [-0.00066, 3],
      [-0.00124, 3],
      [-0.00141, 3],
      [-0.00374, 0],
      [-0.00362, 0],
      [-0.00155, 3],
      [0.01943, 1],
      [-0.00136, 3],
      [-0.01697, 2],
      [-0.00149, 3]
    ],
    "red_o_points": [],
    "y_categories": ["N", "NOT APPLICABLE", "Y", "nan"],
    "blue_o_points": [],
    "blue_x_points": [
      [0.03367, 1],
      [-0.00062, 3],
      [-0.00087, 0],
      [-0.00127, 0],
      [3e-5, 3],
      [0.02748, 1],
      [0.02007, 1],
      [-0.00178, 0],
      [-0.00069, 3],
      [-0.0003, 3],
      [-0.00133, 0],
      [0.02344, 1],
      [-0.00042, 3],
      [0.02164, 1],
      [-0.00077, 3]
    ]
  },
  "QS_mulLysisSite[Trunk]": {
    "red_x_points": [
      [-0.00027, 3],
      [-0.00522, 0],
      [-0.00355, 0],
      [-0.00338, 0],
      [-0.00352, 0],
      [-0.0134, 2],
      [-0.00384, 0],
      [-0.00077, 3],
      [-0.0036, 0],
      [-0.00337, 0],
      [-0.0003, 3],
      [-0.00358, 0],
      [-0.00092, 3],
      [-0.00504, 0],
      [-0.01156, 2],
      [-0.00051, 3],
      [-0.00029, 3],
      [-0.00039, 3],
      [-0.00294, 0],
      [-0.00038, 3],
      [-0.00072, 3],
      [-0.00056, 3],
      [-0.00359, 0],
      [-0.00316, 0],
      [-0.00064, 3],
      [0.01243, 1],
      [-0.00066, 3],
      [-0.01158, 2],
      [-0.00073, 3]
    ],
    "red_o_points": [],
    "y_categories": ["N", "NOT APPLICABLE", "Y", "nan"],
    "blue_o_points": [],
    "blue_x_points": [
      [0.02451, 1],
      [-0.00034, 3],
      [-0.00193, 0],
      [-0.00166, 0],
      [9e-5, 3],
      [0.01735, 1],
      [0.0132, 1],
      [-0.00189, 0],
      [-0.00011, 3],
      [-0.0001, 3],
      [-0.0018, 0],
      [0.01477, 1],
      [-0.00019, 3],
      [0.01462, 1],
      [-0.00045, 3]
    ]
  },
  "QS_mulGraftTrunk[UpperTrunk]": {
    "red_x_points": [
      [-3e-5, 3],
      [-0.00225, 0],
      [-0.00161, 0],
      [-0.00116, 0],
      [-0.00167, 0],
      [-0.00103, 0],
      [-0.00162, 0],
      [-0.00019, 3],
      [-0.00161, 0],
      [-0.001, 0],
      [-0.00023, 3],
      [-0.00157, 0],
      [-0.00025, 3],
      [-0.00754, 2],
      [-0.00171, 0],
      [-0.00022, 3],
      [-2e-5, 3],
      [-0.00017, 3],
      [-0.00102, 0],
      [-0.00013, 3],
      [-0.00024, 3],
      [-0.00024, 3],
      [-0.00148, 0],
      [-0.00161, 0],
      [-0.00029, 3],
      [0.00319, 1],
      [-0.00021, 3],
      [-0.00118, 0],
      [-0.00029, 3]
    ],
    "red_o_points": [],
    "y_categories": ["N", "NOT APPLICABLE", "Y", "nan"],
    "blue_o_points": [],
    "blue_x_points": [
      [0.01005, 1],
      [-2e-5, 3],
      [8e-5, 0],
      [5e-5, 0],
      [0.00033, 3],
      [0.00578, 1],
      [0.00323, 1],
      [-0.00062, 0],
      [6e-5, 3],
      [0.00011, 3],
      [-0.00032, 0],
      [0.00376, 1],
      [-1e-5, 3],
      [0.00499, 1],
      [-0.00012, 3]
    ]
  },
  "QS_mulTransfSite[PhMc]": {
    "red_x_points": [
      [-0.00013, 3],
      [-0.00303, 0],
      [-0.00225, 0],
      [-0.0017, 0],
      [-0.00245, 0],
      [-0.00192, 0],
      [-0.00769, 2],
      [-0.00063, 3],
      [-0.00226, 0],
      [-0.0018, 0],
      [-0.00028, 3],
      [-0.00221, 0],
      [-0.00049, 3],
      [-0.00285, 0],
      [-0.00266, 0],
      [-0.00034, 3],
      [-0.00014, 3],
      [-0.00034, 3],
      [-0.00608, 2],
      [-0.00026, 3],
      [-0.0005, 3],
      [-0.00056, 3],
      [-0.00232, 0],
      [-0.00244, 0],
      [-0.00066, 3],
      [0.00791, 1],
      [-0.00054, 3],
      [-0.00185, 0],
      [-0.00051, 3]
    ],
    "red_o_points": [],
    "y_categories": ["N", "NOT APPLICABLE", "Y", "nan"],
    "blue_o_points": [],
    "blue_x_points": [
      [0.0123, 1],
      [-0.00016, 3],
      [-0.00106, 0],
      [-0.00112, 0],
      [5e-5, 3],
      [0.01026, 1],
      [0.00598, 1],
      [-0.00089, 0],
      [-0.00018, 3],
      [-0.00013, 3],
      [-0.00123, 0],
      [0.00886, 1],
      [-0.00022, 3],
      [0.00873, 1],
      [-0.00021, 3]
    ]
  },
  "QS_mulLysisRoot[C6]": {
    "red_x_points": [
      [-0.00033, 3],
      [-0.00479, 0],
      [-0.00967, 2],
      [-0.00248, 0],
      [-0.00344, 0],
      [-0.00279, 0],
      [-0.00291, 0],
      [-0.00082, 3],
      [-0.00357, 0],
      [-0.00267, 0],
      [-0.00061, 3],
      [-0.00293, 0],
      [-0.00071, 3],
      [-0.00448, 0],
      [-0.00391, 0],
      [-0.00061, 3],
      [-0.00044, 3],
      [-0.00039, 3],
      [-0.00248, 0],
      [-0.00033, 3],
      [-0.00089, 3],
      [-0.0007, 3],
      [-0.00329, 0],
      [-0.0031, 0],
      [-0.00069, 3],
      [0.00815, 1],
      [-0.0008, 3],
      [-0.00878, 2],
      [-0.00076, 3]
    ],
    "red_o_points": [],
    "y_categories": ["N", "NOT APPLICABLE", "Y", "nan"],
    "blue_o_points": [],
    "blue_x_points": [
      [0.01866, 1],
      [-0.0004, 3],
      [-0.00112, 0],
      [-0.00115, 0],
      [0.00011, 3],
      [0.01485, 1],
      [0.00978, 1],
      [-0.00191, 0],
      [-2e-5, 3],
      [-8e-5, 3],
      [-0.0011, 0],
      [0.01186, 1],
      [-0.00019, 3],
      [0.01229, 1],
      [-0.00036, 3]
    ]
  },
  "QA_lstPexInspectio[ShoulderSubdisloc]": {
    "red_x_points": [
      [-0.00272, 1],
      [-0.00434, 1],
      [0.00323, 0],
      [-0.00326, 1],
      [-0.00596, 1],
      [-0.00194, 2],
      [-0.00583, 1],
      [-0.00276, 1],
      [-0.00749, 1],
      [-0.00849, 1],
      [-0.00163, 2],
      [-0.00803, 1],
      [-0.00209, 1],
      [-0.00921, 1],
      [-0.00254, 1],
      [-0.00433, 2],
      [-0.0011, 2],
      [0.00084, 1],
      [-0.00375, 1],
      [-0.00105, 1],
      [-0.01498, 0],
      [0.00455, 2],
      [-0.00183, 2],
      [-0.00089, 2],
      [-0.00185, 1],
      [-0.01783, 2],
      [-0.00186, 1],
      [-0.00083, 2],
      [-0.00376, 1]
    ],
    "red_o_points": [],
    "y_categories": ["ABS", "NAIA", "PT", "nan"],
    "blue_o_points": [],
    "blue_x_points": [
      [0.00626, 1],
      [0.00962, 2],
      [0.03006, 0],
      [0.00744, 2],
      [0.00215, 1],
      [0.00688, 1],
      [0.00509, 0],
      [-0.00334, 1],
      [0.01186, 2],
      [0.00157, 1],
      [0.02697, 0],
      [0.00469, 1],
      [0.00304, 1],
      [-0.00369, 2],
      [0.00314, 1]
    ]
  },
  "QS_mulGraftLevel[Trunk]": {
    "red_x_points": [
      [-0.0001, 3],
      [-0.00228, 0],
      [-0.00099, 0],
      [-0.00097, 0],
      [-0.00119, 0],
      [-0.0009, 0],
      [-0.00135, 0],
      [-0.00035, 3],
      [-0.00131, 0],
      [-0.00077, 0],
      [-0.00011, 3],
      [-0.00096, 0],
      [-0.0004, 3],
      [-0.00783, 2],
      [-0.0019, 0],
      [-0.00014, 3],
      [-0.00014, 3],
      [-6e-5, 3],
      [-0.00114, 0],
      [-0.00018, 3],
      [-0.00025, 3],
      [-0.00019, 3],
      [-0.00117, 0],
      [-0.00126, 0],
      [-0.00022, 3],
      [0.00392, 1],
      [-0.00025, 3],
      [-0.00092, 0],
      [-0.00029, 3]
    ],
    "red_o_points": [],
    "y_categories": ["N", "NOT APPLICABLE", "Y", "nan"],
    "blue_o_points": [],
    "blue_x_points": [
      [0.00712, 1],
      [-0.0001, 3],
      [0.00024, 0],
      [0.00046, 0],
      [0.00018, 3],
      [0.0049, 1],
      [0.00317, 1],
      [-0.00065, 0],
      [-7e-5, 3],
      [-2e-5, 3],
      [-0.00023, 0],
      [0.00453, 1],
      [-1e-5, 3],
      [0.00437, 1],
      [-0.00021, 3]
    ]
  },
  "QA_lstPexPain[C7]": {
    "red_x_points": [
      [-0.00141, 1],
      [-0.00419, 2],
      [-0.00286, 2],
      [-0.00102, 1],
      [-0.0051, 2],
      [-0.00255, 1],
      [-0.0021, 1],
      [-0.0047, 0],
      [-0.00412, 1],
      [0.00748, 0],
      [-0.00164, 1],
      [-0.00728, 2],
      [0.00102, 2],
      [-0.00639, 2],
      [-0.00219, 2],
      [-0.006, 0],
      [-0.00087, 1],
      [-0.0046, 0],
      [-0.00341, 2],
      [-0.00541, 0],
      [0.00081, 2],
      [0.00199, 2],
      [-0.00746, 2],
      [-0.00617, 2],
      [-0.00397, 0],
      [-0.00335, 1],
      [-0.00079, 1],
      [-0.00191, 1],
      [-0.00085, 1]
    ],
    "red_o_points": [],
    "y_categories": ["NORM", "NPV", "nan"],
    "blue_o_points": [],
    "blue_x_points": [
      [-5e-5, 1],
      [0.00345, 1],
      [0.01557, 0],
      [0.02144, 0],
      [0.00515, 2],
      [7e-5, 2],
      [4e-5, 1],
      [0.00033, 1],
      [0.00653, 2],
      [0.00508, 2],
      [0.01286, 0],
      [4e-5, 1],
      [-0.0018, 0],
      [0.00328, 0],
      [0.00703, 1]
    ]
  },
  "QS_mulBpsurgeryType[Graft]": {
    "red_x_points": [
      [-8e-5, 3],
      [-0.00042, 0],
      [-0.00045, 0],
      [-0.00048, 0],
      [-0.00054, 0],
      [-0.00016, 0],
      [-0.00067, 0],
      [-0.0001, 3],
      [-0.00035, 0],
      [-0.00044, 0],
      [-5e-5, 3],
      [-0.00043, 0],
      [-0.00019, 3],
      [-0.00466, 2],
      [-0.00041, 0],
      [-7e-5, 3],
      [-3e-5, 3],
      [-5e-5, 3],
      [-0.00031, 0],
      [-6e-5, 3],
      [-0.00011, 3],
      [-0.00023, 3],
      [-0.00051, 0],
      [-0.00045, 0],
      [-0.00012, 3],
      [0.00134, 1],
      [-0.00013, 3],
      [-0.00044, 0],
      [-0.0001, 3]
    ],
    "red_o_points": [],
    "y_categories": ["N", "NOT APPLICABLE", "Y", "nan"],
    "blue_o_points": [],
    "blue_x_points": [
      [0.00363, 1],
      [-3e-5, 3],
      [0.00031, 0],
      [0.00086, 0],
      [0.0, 3],
      [0.00191, 1],
      [0.00127, 1],
      [-1e-5, 0],
      [0.0001, 3],
      [-4e-5, 3],
      [0.00022, 0],
      [0.00155, 1],
      [-0.0, 3],
      [0.00096, 1],
      [-5e-5, 3]
    ]
  },
  "QS_mulNeuromadSite[C5]": {
    "red_x_points": [
      [-1e-5, 2],
      [-0.00031, 0],
      [-0.00011, 0],
      [-0.00013, 0],
      [-0.0002, 0],
      [-4e-5, 0],
      [-0.00022, 0],
      [-6e-5, 2],
      [-0.00018, 0],
      [-0.00018, 0],
      [-6e-5, 2],
      [-0.00012, 0],
      [-0.0001, 2],
      [-0.0004, 0],
      [-0.00028, 0],
      [-9e-5, 2],
      [-1e-5, 2],
      [-0.00016, 2],
      [-4e-5, 0],
      [-0.00016, 2],
      [-3e-5, 2],
      [-5e-5, 2],
      [-0.0002, 0],
      [-0.00017, 0],
      [-3e-5, 2],
      [0.00035, 1],
      [-3e-5, 2],
      [-9e-5, 0],
      [-8e-5, 2]
    ],
    "red_o_points": [],
    "y_categories": ["N", "NOT APPLICABLE", "nan"],
    "blue_o_points": [],
    "blue_x_points": [
      [0.00164, 1],
      [-3e-5, 2],
      [0.0001, 0],
      [0.0001, 0],
      [-5e-5, 2],
      [0.00063, 1],
      [0.00021, 1],
      [-3e-5, 0],
      [-0.0001, 2],
      [2e-5, 2],
      [0.0001, 0],
      [0.00027, 1],
      [-9e-5, 2],
      [0.00041, 1],
      [-4e-5, 2]
    ]
  },
  "QS_mulNeuromadSite[C7]": {
    "red_x_points": [
      [2e-5, 2],
      [-0.00017, 0],
      [-4e-5, 0],
      [-0.00012, 0],
      [-0.00015, 0],
      [-0.00011, 0],
      [-0.0002, 0],
      [1e-5, 2],
      [-0.00018, 0],
      [-9e-5, 0],
      [-0.0, 2],
      [-0.00013, 0],
      [4e-5, 2],
      [-0.00028, 0],
      [-0.00014, 0],
      [-0.0, 2],
      [-0.0, 2],
      [-1e-5, 2],
      [-5e-5, 0],
      [1e-5, 2],
      [5e-5, 2],
      [-0.0, 2],
      [-0.00011, 0],
      [-9e-5, 0],
      [-0.0, 2],
      [0.0003, 1],
      [-0.0, 2],
      [-0.00013, 0],
      [-5e-5, 2]
    ],
    "red_o_points": [],
    "y_categories": ["N", "NOT APPLICABLE", "nan"],
    "blue_o_points": [],
    "blue_x_points": [
      [0.00106, 1],
      [5e-5, 2],
      [-4e-5, 0],
      [-8e-5, 0],
      [1e-5, 2],
      [0.00024, 1],
      [0.00016, 1],
      [-7e-5, 0],
      [5e-5, 2],
      [2e-5, 2],
      [-7e-5, 0],
      [0.0001, 1],
      [-0.0, 2],
      [0.00018, 1],
      [1e-5, 2]
    ]
  },
  "QS_mulLysisRoot[C5]": {
    "red_x_points": [
      [-0.00015, 3],
      [-0.00321, 0],
      [-0.0088, 2],
      [-0.00168, 0],
      [-0.00227, 0],
      [-0.00178, 0],
      [-0.00206, 0],
      [-0.00035, 3],
      [-0.00219, 0],
      [-0.0021, 0],
      [-0.00027, 3],
      [-0.00196, 0],
      [-0.00052, 3],
      [-0.00337, 0],
      [-0.00283, 0],
      [-0.00025, 3],
      [-0.00022, 3],
      [-0.00034, 3],
      [-0.00174, 0],
      [-0.00027, 3],
      [-0.00039, 3],
      [-0.00033, 3],
      [-0.00229, 0],
      [-0.00214, 0],
      [-0.00059, 3],
      [0.00651, 1],
      [-0.0004, 3],
      [-0.00689, 2],
      [-0.00049, 3]
    ],
    "red_o_points": [],
    "y_categories": ["N", "NOT APPLICABLE", "Y", "nan"],
    "blue_o_points": [],
    "blue_x_points": [
      [0.01455, 1],
      [2e-5, 3],
      [-0.00077, 0],
      [-0.00135, 0],
      [0.00013, 3],
      [0.0096, 1],
      [0.00651, 1],
      [-0.00121, 0],
      [-0.0001, 3],
      [-1e-5, 3],
      [-0.00081, 0],
      [0.00889, 1],
      [-0.0002, 3],
      [0.00832, 1],
      [-0.00018, 3]
    ]
  },
  "QS_mulTransfSite[IMc]": {
    "red_x_points": [
      [-0.00086, 3],
      [-0.01799, 2],
      [-0.00328, 0],
      [-0.01518, 2],
      [-0.0032, 0],
      [-0.00288, 0],
      [-0.00332, 0],
      [-0.00149, 3],
      [-0.00351, 0],
      [-0.00262, 0],
      [-0.00117, 3],
      [-0.00329, 0],
      [-0.00145, 3],
      [-0.00479, 0],
      [-0.01566, 2],
      [-0.00138, 3],
      [-0.00104, 3],
      [-0.00104, 3],
      [-0.00315, 0],
      [-0.0011, 3],
      [-0.00153, 3],
      [-0.00144, 3],
      [-0.00341, 0],
      [-0.01735, 2],
      [-0.00149, 3],
      [0.02027, 1],
      [-0.00125, 3],
      [-0.0169, 2],
      [-0.00144, 3]
    ],
    "red_o_points": [],
    "y_categories": ["N", "NOT APPLICABLE", "Y", "nan"],
    "blue_o_points": [],
    "blue_x_points": [
      [0.03343, 1],
      [-0.00057, 3],
      [-0.00085, 0],
      [-0.00048, 0],
      [-7e-5, 3],
      [0.02545, 1],
      [0.01982, 1],
      [-0.0017, 0],
      [-0.00064, 3],
      [-0.00056, 3],
      [-0.00077, 0],
      [0.02109, 1],
      [-0.00081, 3],
      [0.02064, 1],
      [-0.00104, 3]
    ]
  },
  "QS_mulLysisSite[Nerve]": {
    "red_x_points": [
      [-0.00019, 3],
      [-0.00338, 0],
      [-0.00861, 2],
      [-0.00743, 2],
      [-0.00255, 0],
      [-0.0023, 0],
      [-0.00256, 0],
      [-0.00063, 3],
      [-0.0024, 0],
      [-0.00224, 0],
      [-0.0002, 3],
      [-0.0022, 0],
      [-0.00074, 3],
      [-0.00366, 0],
      [-0.00317, 0],
      [-0.00021, 3],
      [-0.00024, 3],
      [3e-5, 3],
      [-0.00209, 0],
      [-0.00031, 3],
      [-0.00069, 3],
      [-0.0007, 3],
      [-0.00249, 0],
      [-0.00252, 0],
      [-0.0006, 3],
      [0.00855, 1],
      [-0.00066, 3],
      [-0.00231, 0],
      [-0.0007, 3]
    ],
    "red_o_points": [],
    "y_categories": ["N", "NOT APPLICABLE", "Y", "nan"],
    "blue_o_points": [],
    "blue_x_points": [
      [0.01621, 1],
      [-0.00018, 3],
      [-0.00106, 0],
      [-0.00169, 0],
      [0.00021, 3],
      [0.01167, 1],
      [0.00622, 1],
      [-0.00159, 0],
      [-0.00019, 3],
      [-0.00015, 3],
      [-0.00101, 0],
      [0.00993, 1],
      [0.00013, 3],
      [0.00898, 1],
      [-0.00027, 3]
    ]
  },
  "QS_mulLysisRoot[C7]": {
    "red_x_points": [
      [-0.00013, 3],
      [-0.00076, 0],
      [-0.00263, 2],
      [-0.00069, 0],
      [-0.00067, 0],
      [-0.0006, 0],
      [-0.00071, 0],
      [-0.00013, 3],
      [-0.00078, 0],
      [-0.00062, 0],
      [-6e-5, 3],
      [-0.00061, 0],
      [-0.00015, 3],
      [-0.00069, 0],
      [-0.00068, 0],
      [-0.0001, 3],
      [-7e-5, 3],
      [-4e-5, 3],
      [-0.00051, 0],
      [-9e-5, 3],
      [-0.00016, 3],
      [-0.00012, 3],
      [-0.00079, 0],
      [-0.00075, 0],
      [-0.00016, 3],
      [0.00168, 1],
      [-0.00014, 3],
      [-0.00063, 0],
      [-0.00018, 3]
    ],
    "red_o_points": [],
    "y_categories": ["N", "NOT APPLICABLE", "Y", "nan"],
    "blue_o_points": [],
    "blue_x_points": [
      [0.00473, 1],
      [-0.00011, 3],
      [-0.00031, 0],
      [-0.00055, 0],
      [-4e-5, 3],
      [0.0025, 1],
      [0.00189, 1],
      [-0.00048, 0],
      [-9e-5, 3],
      [-4e-5, 3],
      [-0.0003, 0],
      [0.00235, 1],
      [-2e-5, 3],
      [0.00249, 1],
      [-7e-5, 3]
    ]
  },
  "QS_lstBpsurgSide": {
    "red_x_points": [
      [-0.00087, 3],
      [-0.01256, 0],
      [-0.01348, 0],
      [-0.01053, 0],
      [-0.01316, 0],
      [-0.01166, 0],
      [-0.01271, 0],
      [-0.00143, 3],
      [-0.01409, 0],
      [0.00104, 2],
      [-0.00089, 3],
      [0.00036, 2],
      [-0.00145, 3],
      [0.0009, 2],
      [-0.00216, 2],
      [-0.00107, 3],
      [-0.00073, 3],
      [-0.00091, 3],
      [-0.00871, 0],
      [-0.00073, 3],
      [-0.00113, 3],
      [-0.00131, 3],
      [0.00012, 2],
      [0.00101, 2],
      [-0.00161, 3],
      [0.01455, 1],
      [-0.00121, 3],
      [-0.0111, 0],
      [-0.00119, 3]
    ],
    "red_o_points": [],
    "y_categories": ["L", "NOT APPLICABLE", "R", "nan"],
    "blue_o_points": [],
    "blue_x_points": [
      [0.0313, 1],
      [-0.00061, 3],
      [0.00442, 2],
      [0.0064, 2],
      [6e-5, 3],
      [0.01872, 1],
      [0.01432, 1],
      [-0.00356, 0],
      [-0.00081, 3],
      [-0.00023, 3],
      [0.00365, 2],
      [0.01712, 1],
      [-0.00055, 3],
      [0.01728, 1],
      [-0.00081, 3]
    ]
  },
  "QS_mulTransfSite[AcMc]": {
    "red_x_points": [
      [-5e-5, 3],
      [-0.00175, 0],
      [-0.00126, 0],
      [-0.00118, 0],
      [-0.00115, 0],
      [-0.0012, 0],
      [-0.00142, 0],
      [-0.00023, 3],
      [-0.00142, 0],
      [-0.01109, 2],
      [-0.00013, 3],
      [-0.00131, 0],
      [-0.00033, 3],
      [-0.00189, 0],
      [-0.00144, 0],
      [-0.00032, 3],
      [-8e-5, 3],
      [-0.00031, 3],
      [-0.00116, 0],
      [-0.00023, 3],
      [-0.00032, 3],
      [-0.00015, 3],
      [-0.00128, 0],
      [-0.00135, 0],
      [-0.00031, 3],
      [0.00317, 1],
      [-9e-5, 3],
      [-0.0012, 0],
      [-0.00018, 3]
    ],
    "red_o_points": [],
    "y_categories": ["N", "NOT APPLICABLE", "Y", "nan"],
    "blue_o_points": [],
    "blue_x_points": [
      [0.00786, 1],
      [-8e-5, 3],
      [0.00202, 0],
      [0.00207, 0],
      [0.00023, 3],
      [0.00553, 1],
      [0.00294, 1],
      [-0.00059, 0],
      [1e-5, 3],
      [-1e-5, 3],
      [0.00135, 0],
      [0.00413, 1],
      [2e-5, 3],
      [0.00435, 1],
      [-0.00021, 3]
    ]
  },
  "QS_mulTransfSite[Other]": {
    "red_x_points": [
      [-0.00135, 3],
      [-0.00949, 0],
      [-0.00849, 0],
      [-0.00774, 0],
      [-0.00863, 0],
      [-0.00858, 0],
      [-0.00814, 0],
      [-0.0016, 3],
      [-0.00852, 0],
      [-0.00805, 0],
      [-0.00159, 3],
      [-0.00845, 0],
      [-0.00127, 3],
      [-0.00959, 0],
      [-0.00816, 0],
      [-0.00158, 3],
      [-0.00122, 3],
      [-0.00128, 3],
      [-0.00749, 0],
      [-0.0012, 3],
      [-0.0015, 3],
      [-0.00144, 3],
      [-0.00879, 0],
      [-0.00862, 0],
      [-0.00134, 3],
      [0.0169, 1],
      [-0.0013, 3],
      [-0.00787, 0],
      [-0.00161, 3]
    ],
    "red_o_points": [],
    "y_categories": ["N", "NOT APPLICABLE", "Y", "nan"],
    "blue_o_points": [],
    "blue_x_points": [
      [0.02946, 1],
      [-0.00076, 3],
      [-0.00695, 0],
      [-0.00731, 0],
      [-0.00058, 3],
      [0.02322, 1],
      [0.01905, 1],
      [-0.00638, 0],
      [-0.00101, 3],
      [-0.00071, 3],
      [0.04297, 2],
      [0.02042, 1],
      [-0.0009, 3],
      [0.01856, 1],
      [-0.00107, 3]
    ]
  },
  "QA_yonInjBpsurg": {
    "red_x_points": [
      [-0.00044, 1],
      [-0.00048, 1],
      [-0.00049, 1],
      [-0.0006, 1],
      [-0.0006, 1],
      [-0.00029, 1],
      [-0.00064, 1],
      [-0.00064, 1],
      [-0.00051, 1],
      [-0.00035, 1],
      [-0.00044, 1],
      [-0.00039, 1],
      [-0.00082, 1],
      [-0.00065, 1],
      [-0.00027, 1],
      [-0.00043, 1],
      [-0.00044, 1],
      [-0.00041, 1],
      [-0.00035, 1],
      [-0.00044, 1],
      [-0.00087, 1],
      [-0.00059, 1],
      [-0.00037, 1],
      [-0.00039, 1],
      [-0.00051, 1],
      [0.00178, 0],
      [-0.00064, 1],
      [-0.00035, 1],
      [-0.0007, 1]
    ],
    "red_o_points": [],
    "y_categories": ["N", "Y", "nan"],
    "blue_o_points": [],
    "blue_x_points": [
      [0.00493, 0],
      [-0.00033, 1],
      [-0.00036, 1],
      [-0.00061, 1],
      [-0.00031, 1],
      [0.00223, 0],
      [0.00223, 0],
      [-0.00042, 1],
      [-0.00044, 1],
      [-0.0003, 1],
      [-0.00036, 1],
      [0.00327, 0],
      [-0.00023, 1],
      [0.00326, 0],
      [-0.00025, 1]
    ]
  },
  "QA_lstPexTouch[C8]": {
    "red_x_points": [
      [-0.0012, 1],
      [-0.0043, 2],
      [-0.00305, 1],
      [-0.00175, 1],
      [-0.00604, 2],
      [-0.00397, 1],
      [-0.00347, 1],
      [-0.00409, 0],
      [-0.00513, 1],
      [0.00957, 0],
      [-0.00145, 1],
      [-0.01044, 2],
      [-0.00279, 2],
      [-0.00901, 2],
      [-0.00259, 2],
      [-0.00226, 0],
      [-0.00106, 1],
      [-0.00252, 0],
      [-0.00367, 2],
      [-0.0022, 0],
      [-0.00332, 2],
      [-0.00594, 0],
      [-0.00682, 1],
      [-0.00759, 2],
      [-0.00268, 0],
      [-0.00876, 1],
      [-0.00082, 2],
      [-0.00193, 1],
      [0.00028, 1]
    ],
    "red_o_points": [],
    "y_categories": ["NORM", "NPV", "nan"],
    "blue_o_points": [],
    "blue_x_points": [
      [0.00564, 0],
      [0.00868, 1],
      [0.01762, 0],
      [0.02517, 0],
      [0.00361, 2],
      [0.00145, 2],
      [-0.00026, 1],
      [-0.0009, 1],
      [0.00971, 1],
      [0.00427, 2],
      [0.01565, 0],
      [-0.00033, 1],
      [-0.001, 0],
      [0.00484, 0],
      [0.00486, 0]
    ]
  },
  "QS_mulLysisNerve[Ssr]": {
    "red_x_points": [
      [-0.00041, 3],
      [-0.00357, 0],
      [-0.00838, 2],
      [-0.00663, 2],
      [-0.0024, 0],
      [-0.00196, 0],
      [-0.00238, 0],
      [-0.00078, 3],
      [-0.00215, 0],
      [-0.00216, 0],
      [-0.00065, 3],
      [-0.00237, 0],
      [-0.00084, 3],
      [-0.00361, 0],
      [-0.00319, 0],
      [-0.0006, 3],
      [-0.0005, 3],
      [-0.00043, 3],
      [-0.00217, 0],
      [-0.00039, 3],
      [-0.00079, 3],
      [-0.00089, 3],
      [-0.00236, 0],
      [-0.0023, 0],
      [-0.00069, 3],
      [0.00745, 1],
      [-0.00064, 3],
      [-0.00196, 0],
      [-0.00086, 3]
    ],
    "red_o_points": [],
    "y_categories": ["N", "NOT APPLICABLE", "Y", "nan"],
    "blue_o_points": [],
    "blue_x_points": [
      [0.01676, 1],
      [-0.00042, 3],
      [-0.00092, 0],
      [-0.00141, 0],
      [-3e-5, 3],
      [0.01206, 1],
      [0.00705, 1],
      [-0.00139, 0],
      [-0.00032, 3],
      [-5e-5, 3],
      [-0.00111, 0],
      [0.00967, 1],
      [-0.00026, 3],
      [0.00945, 1],
      [-0.00048, 3]
    ]
  },
  "QS_mulTransfSite[AcSsAA]": {
    "red_x_points": [
      [-0.00022, 3],
      [-0.00052, 2],
      [-0.00592, 0],
      [-0.00488, 0],
      [0.0003, 2],
      [-0.00633, 0],
      [-0.00608, 0],
      [-0.00068, 3],
      [-0.00712, 0],
      [-0.00685, 0],
      [-0.00047, 3],
      [-0.00592, 0],
      [-0.00059, 3],
      [0.00067, 2],
      [-0.00373, 0],
      [-0.00067, 3],
      [-0.00018, 3],
      [-0.00057, 3],
      [-0.00032, 2],
      [-0.00043, 3],
      [-0.00054, 3],
      [-0.00052, 3],
      [-0.00631, 0],
      [0.00034, 2],
      [-0.00069, 3],
      [0.00661, 1],
      [-0.00044, 3],
      [-0.00443, 0],
      [-0.00056, 3]
    ],
    "red_o_points": [],
    "y_categories": ["N", "NOT APPLICABLE", "Y", "nan"],
    "blue_o_points": [],
    "blue_x_points": [
      [0.0163, 1],
      [-0.00023, 3],
      [0.00748, 2],
      [0.00742, 2],
      [8e-5, 3],
      [0.00774, 1],
      [0.0067, 1],
      [-0.00271, 0],
      [-0.00029, 3],
      [-2e-5, 3],
      [-0.00278, 0],
      [0.00923, 1],
      [-0.00033, 3],
      [0.00874, 1],
      [-0.00028, 3]
    ]
  },
  "QA_lstPexMuscstrength[WristExte]": {
    "red_x_points": [
      [-0.00504, 1],
      [-0.0042, 2],
      [-0.0041, 1],
      [-0.00353, 1],
      [-0.00598, 1],
      [-0.00617, 1],
      [-0.00506, 1],
      [0.00135, 0],
      [0.00524, 0],
      [-0.00921, 1],
      [0.00087, 0],
      [0.00546, 0],
      [-0.00298, 2],
      [-0.00605, 2],
      [-0.00193, 2],
      [-0.00066, 0],
      [-0.00239, 1],
      [-0.00042, 0],
      [-0.00502, 1],
      [-0.00387, 1],
      [-0.0034, 2],
      [-0.00334, 1],
      [0.00538, 0],
      [0.00514, 0],
      [-0.00198, 2],
      [-0.0008, 2],
      [-0.00274, 1],
      [-0.00299, 1],
      [-0.00285, 2]
    ],
    "red_o_points": [],
    "y_categories": ["GREATER THAN OR EQUALS TO 3", "LESS THAN 3", "nan"],
    "blue_o_points": [],
    "blue_x_points": [
      [0.00211, 0],
      [0.00183, 1],
      [0.00836, 0],
      [0.0108, 0],
      [0.00209, 2],
      [-0.0002, 2],
      [0.0012, 0],
      [0.00731, 0],
      [0.01175, 0],
      [0.00079, 2],
      [0.00727, 0],
      [-0.00011, 1],
      [0.0027, 0],
      [0.00159, 0],
      [0.00379, 1]
    ]
  },
  "QS_mulNeuromadSite[C6]": {
    "red_x_points": [
      [1e-5, 2],
      [-0.00044, 0],
      [-5e-5, 0],
      [-4e-5, 0],
      [-0.00016, 0],
      [-5e-5, 0],
      [-0.00017, 0],
      [-1e-5, 2],
      [-0.00013, 0],
      [-0.00016, 0],
      [-1e-5, 2],
      [-0.0001, 0],
      [3e-5, 2],
      [-0.00046, 0],
      [-0.00018, 0],
      [-0.0, 2],
      [-0.0, 2],
      [-1e-5, 2],
      [-3e-5, 0],
      [1e-5, 2],
      [2e-5, 2],
      [1e-5, 2],
      [-8e-5, 0],
      [-4e-5, 0],
      [-1e-5, 2],
      [0.00027, 1],
      [-0.0, 2],
      [-5e-5, 0],
      [-4e-5, 2]
    ],
    "red_o_points": [],
    "y_categories": ["N", "NOT APPLICABLE", "nan"],
    "blue_o_points": [],
    "blue_x_points": [
      [0.00115, 1],
      [1e-5, 2],
      [-1e-5, 0],
      [-3e-5, 0],
      [4e-5, 2],
      [0.00036, 1],
      [0.0001, 1],
      [-4e-5, 0],
      [-0.0, 2],
      [2e-5, 2],
      [-6e-5, 0],
      [0.00027, 1],
      [-1e-5, 2],
      [0.0001, 1],
      [-0.0, 2]
    ]
  },
  "QS_mulNeuromadSite[T1]": {
    "red_x_points": [
      [-0.0, 2],
      [-0.0014, 0],
      [-0.00051, 0],
      [-0.00051, 0],
      [-0.00069, 0],
      [-0.00053, 0],
      [-0.0007, 0],
      [-0.00011, 2],
      [-0.00056, 0],
      [-0.00047, 0],
      [-8e-5, 2],
      [-0.00086, 0],
      [-0.0001, 2],
      [-0.00094, 0],
      [-0.0009, 0],
      [-0.00011, 2],
      [0.0, 2],
      [-0.0001, 2],
      [-0.00067, 0],
      [0.0, 2],
      [-0.00011, 2],
      [-0.0001, 2],
      [-0.00075, 0],
      [-0.00066, 0],
      [-0.00016, 2],
      [0.00128, 1],
      [-0.0001, 2],
      [-0.00046, 0],
      [-7e-5, 2]
    ],
    "red_o_points": [],
    "y_categories": ["N", "NOT APPLICABLE", "nan"],
    "blue_o_points": [],
    "blue_x_points": [
      [0.00406, 1],
      [-5e-5, 2],
      [-0.00031, 0],
      [-0.00039, 0],
      [0.00012, 2],
      [0.00295, 1],
      [0.00158, 1],
      [-0.00035, 0],
      [-3e-5, 2],
      [0.00012, 2],
      [-0.0002, 0],
      [0.00173, 1],
      [-0.0001, 2],
      [0.00133, 1],
      [-9e-5, 2]
    ]
  },
  "QA_lstPexTouch[C7]": {
    "red_x_points": [
      [-0.00284, 1],
      [-0.00981, 2],
      [-0.00369, 1],
      [-0.00335, 1],
      [-0.01156, 2],
      [-0.00625, 1],
      [-0.00602, 1],
      [-0.00357, 0],
      [-0.0079, 1],
      [-0.00869, 1],
      [-0.00245, 1],
      [-0.01555, 2],
      [-0.00419, 2],
      [-0.01565, 2],
      [-0.00565, 2],
      [-0.00143, 0],
      [-0.00177, 1],
      [-0.00268, 0],
      [-0.00785, 2],
      [-0.00229, 0],
      [-0.00318, 2],
      [-0.00666, 0],
      [-0.00937, 1],
      [-0.01275, 2],
      [-0.00301, 0],
      [-0.00573, 1],
      [-0.0004, 2],
      [-0.00299, 1],
      [-8e-5, 1]
    ],
    "red_o_points": [],
    "y_categories": ["NORM", "NPV", "nan"],
    "blue_o_points": [],
    "blue_x_points": [
      [-0.00021, 1],
      [0.00829, 1],
      [0.04201, 0],
      [0.04804, 0],
      [0.00585, 2],
      [0.00019, 2],
      [-0.00017, 1],
      [-0.004, 1],
      [0.00954, 1],
      [0.00508, 2],
      [0.0387, 0],
      [-3e-5, 1],
      [0.00049, 0],
      [0.00584, 0],
      [0.00776, 0]
    ]
  },
  "QA_yonInjPhysio": {
    "red_x_points": [
      [-0.00783, 0],
      [0.00052, 0],
      [0.00019, 0],
      [0.0001, 0],
      [-0.00207, 2],
      [0.00064, 0],
      [0.00046, 0],
      [-0.00556, 0],
      [0.00084, 0],
      [-0.00625, 1],
      [-0.00582, 0],
      [0.00125, 0],
      [-0.00823, 0],
      [-0.00539, 1],
      [-0.0013, 1],
      [0.0028, 1],
      [-0.00671, 0],
      [0.00471, 1],
      [0.00061, 0],
      [-0.00792, 0],
      [0.00433, 1],
      [0.00361, 1],
      [0.00118, 0],
      [-0.00739, 1],
      [-0.00924, 2],
      [-0.01274, 1],
      [-0.00909, 2],
      [-6e-5, 0],
      [0.00532, 1]
    ],
    "red_o_points": [],
    "y_categories": ["N", "Y", "nan"],
    "blue_o_points": [],
    "blue_x_points": [
      [0.00505, 0],
      [0.00756, 1],
      [0.0053, 0],
      [0.00764, 0],
      [0.00919, 1],
      [0.00475, 0],
      [0.00349, 0],
      [0.00186, 0],
      [-0.00224, 0],
      [0.00675, 1],
      [0.00388, 0],
      [0.00408, 0],
      [0.00757, 1],
      [-0.00398, 1],
      [0.00815, 1]
    ]
  },
  "QS_mulLysisSite[Root]": {
    "red_x_points": [
      [-0.00024, 3],
      [-0.00143, 0],
      [-0.00573, 2],
      [-0.00119, 0],
      [-0.00143, 0],
      [-0.00114, 0],
      [-0.00136, 0],
      [-0.00047, 3],
      [-0.00138, 0],
      [-0.0011, 0],
      [-0.00024, 3],
      [-0.00149, 0],
      [-0.00055, 3],
      [-0.00148, 0],
      [-0.00136, 0],
      [-0.00021, 3],
      [-0.00028, 3],
      [-0.00012, 3],
      [-0.00127, 0],
      [-0.00033, 3],
      [-0.00046, 3],
      [-0.00043, 3],
      [-0.0014, 0],
      [-0.00125, 0],
      [-0.00035, 3],
      [0.00465, 1],
      [-0.00037, 3],
      [-0.00533, 2],
      [-0.00046, 3]
    ],
    "red_o_points": [],
    "y_categories": ["N", "NOT APPLICABLE", "Y", "nan"],
    "blue_o_points": [],
    "blue_x_points": [
      [0.00963, 1],
      [-0.00016, 3],
      [-0.00074, 0],
      [-0.00098, 0],
      [-0.0002, 3],
      [0.00618, 1],
      [0.00527, 1],
      [-0.00095, 0],
      [-0.00018, 3],
      [-7e-5, 3],
      [-0.0006, 0],
      [0.00554, 1],
      [-8e-5, 3],
      [0.00571, 1],
      [-0.00019, 3]
    ]
  },
  "QS_mulNeuromadSite[T2]": {
    "red_x_points": [
      [-7e-5, 2],
      [-0.00085, 0],
      [-0.00047, 0],
      [-0.0003, 0],
      [-0.00057, 0],
      [-0.00033, 0],
      [-0.00064, 0],
      [-0.00023, 2],
      [-0.00053, 0],
      [-0.00044, 0],
      [1e-5, 2],
      [-0.00054, 0],
      [-0.00017, 2],
      [-0.00103, 0],
      [-0.00084, 0],
      [-3e-5, 2],
      [-4e-5, 2],
      [-5e-5, 2],
      [-0.0004, 0],
      [-5e-5, 2],
      [-0.00015, 2],
      [-2e-5, 2],
      [-0.00059, 0],
      [-0.0005, 0],
      [-0.0001, 2],
      [0.00096, 1],
      [-9e-5, 2],
      [-0.00037, 0],
      [-0.00014, 2]
    ],
    "red_o_points": [],
    "y_categories": ["N", "NOT APPLICABLE", "nan"],
    "blue_o_points": [],
    "blue_x_points": [
      [0.0037, 1],
      [-5e-5, 2],
      [-0.00023, 0],
      [-0.00024, 0],
      [-0.0, 2],
      [0.00221, 1],
      [0.00092, 1],
      [-0.00024, 0],
      [1e-5, 2],
      [-5e-5, 2],
      [-0.00036, 0],
      [0.00139, 1],
      [-4e-5, 2],
      [0.00155, 1],
      [-1e-5, 2]
    ]
  },
  "QS_mulGraftNerve[MC]": {
    "red_x_points": [
      [-4e-5, 0],
      [-4e-5, 0],
      [-4e-5, 0],
      [-1e-5, 2],
      [-4e-5, 0],
      [-1e-5, 2],
      [-4e-5, 0],
      [-4e-5, 0],
      [-1e-5, 2],
      [-1e-5, 2],
      [-4e-5, 0],
      [-1e-5, 2],
      [-1e-5, 2],
      [-1e-5, 2]
    ],
    "red_o_points": [],
    "y_categories": ["N", "NOT APPLICABLE", "nan"],
    "blue_o_points": [],
    "blue_x_points": [
      [-1e-5, 2],
      [-1e-5, 2],
      [0.00013, 1],
      [-4e-5, 0],
      [-1e-5, 2],
      [0.00013, 1],
      [0.00013, 1]
    ]
  },
  "QS_mulNeuromadSite[C4]": {
    "red_x_points": [
      [0.0, 2],
      [-0.00016, 0],
      [-0.00012, 0],
      [-0.00014, 0],
      [-0.00015, 0],
      [-0.00019, 0],
      [-0.00012, 0],
      [-1e-5, 2],
      [-0.00012, 0],
      [-0.00019, 0],
      [1e-5, 2],
      [-0.00019, 0],
      [-1e-5, 2],
      [-0.00011, 0],
      [-0.00018, 0],
      [0.0, 2],
      [-0.0, 2],
      [0.0, 2],
      [-0.00016, 0],
      [-1e-5, 2],
      [-2e-5, 2],
      [-0.0, 2],
      [-0.00023, 0],
      [-0.00023, 0],
      [-1e-5, 2],
      [0.00036, 1],
      [-2e-5, 2],
      [-0.00016, 0],
      [-2e-5, 2]
    ],
    "red_o_points": [],
    "y_categories": ["N", "NOT APPLICABLE", "nan"],
    "blue_o_points": [],
    "blue_x_points": [
      [0.0008, 1],
      [0.0, 2],
      [-4e-5, 0],
      [-0.00017, 0],
      [0.0, 2],
      [0.00065, 1],
      [0.00032, 1],
      [-0.00014, 0],
      [-1e-5, 2],
      [-1e-5, 2],
      [-0.0001, 0],
      [0.00049, 1],
      [2e-5, 2],
      [0.00032, 1],
      [0.0, 2]
    ]
  },
  "QS_mulGraftNerve[Ra]": {
    "red_x_points": [
      [-2e-5, 0],
      [-9e-5, 0],
      [-2e-5, 0],
      [-2e-5, 0],
      [-9e-5, 0],
      [-2e-5, 2],
      [-9e-5, 0],
      [-2e-5, 0],
      [-1e-5, 2],
      [-2e-5, 0],
      [-2e-5, 2],
      [-9e-5, 0],
      [-1e-5, 2],
      [-1e-5, 2],
      [-1e-5, 2],
      [-2e-5, 0],
      [-1e-5, 2],
      [-1e-5, 2],
      [-2e-5, 0],
      [-2e-5, 2],
      [8e-5, 1],
      [-2e-5, 2],
      [-2e-5, 2]
    ],
    "red_o_points": [],
    "y_categories": ["N", "NOT APPLICABLE", "nan"],
    "blue_o_points": [],
    "blue_x_points": [
      [0.00021, 1],
      [-2e-5, 2],
      [-2e-5, 0],
      [-2e-5, 0],
      [8e-5, 1],
      [-2e-5, 0],
      [-2e-5, 2],
      [-1e-5, 2],
      [-2e-5, 0],
      [0.00013, 1],
      [-1e-5, 2],
      [0.00021, 1],
      [-1e-5, 2]
    ]
  },
  "QS_mulTransfSite[Oberlin]": {
    "red_x_points": [
      [-0.00148, 3],
      [-0.02347, 0],
      [-0.0235, 0],
      [-0.02189, 0],
      [-0.02459, 0],
      [0.00313, 2],
      [-0.02425, 0],
      [-0.00168, 3],
      [0.00371, 2],
      [0.00307, 2],
      [-0.00113, 3],
      [0.00358, 2],
      [-0.0019, 3],
      [0.00275, 2],
      [-0.02128, 0],
      [-0.00138, 3],
      [-0.00134, 3],
      [-0.00127, 3],
      [-0.02069, 0],
      [-0.00127, 3],
      [-0.00192, 3],
      [-0.00205, 3],
      [0.00337, 2],
      [-0.02386, 0],
      [-0.00184, 3],
      [0.02622, 1],
      [-0.00179, 3],
      [-0.02496, 0],
      [-0.00197, 3]
    ],
    "red_o_points": [],
    "y_categories": ["N", "NOT APPLICABLE", "Y", "nan"],
    "blue_o_points": [],
    "blue_x_points": [
      [0.04459, 1],
      [-0.00108, 3],
      [0.00551, 2],
      [0.00668, 2],
      [-0.00049, 3],
      [0.03377, 1],
      [0.02879, 1],
      [0.00418, 2],
      [-0.00118, 3],
      [-0.00076, 3],
      [0.00506, 2],
      [0.02959, 1],
      [-0.00068, 3],
      [0.03071, 1],
      [-0.00097, 3]
    ]
  },
  "QA_intPexForearmProna": {
    "red_x_points": [
      [-0.00068, 2],
      [-0.0011, 0],
      [-0.00069, 2],
      [-0.00043, 2],
      [-0.00077, 2],
      [-0.00328, 0],
      [-0.00081, 2],
      [-0.01591, 0],
      [-0.00065, 2],
      [-0.00093, 2],
      [-0.01566, 0],
      [-0.0029, 0],
      [-0.001, 2],
      [-0.00065, 2],
      [5e-5, 2],
      [-0.01718, 0],
      [-0.01553, 0],
      [-0.01482, 0],
      [-0.002, 0],
      [-0.00083, 2],
      [-0.00084, 2],
      [-0.00105, 2],
      [-0.00061, 2],
      [-0.00058, 2],
      [0.00035, 2],
      [0.00051, 1],
      [0.00032, 2],
      [-0.00313, 0],
      [-0.00088, 2]
    ],
    "red_o_points": [],
    "y_categories": ["GREATER THAN OR EQUALS TO 80", "LESS THAN 80", "nan"],
    "blue_o_points": [],
    "blue_x_points": [
      [-0.00069, 2],
      [0.05036, 1],
      [-0.00052, 0],
      [-0.00046, 2],
      [0.00074, 2],
      [1e-5, 2],
      [0.00145, 1],
      [0.0002, 2],
      [-1e-5, 2],
      [0.00079, 2],
      [-0.00067, 0],
      [0.0001, 2],
      [0.0012, 2],
      [5e-5, 2],
      [0.04914, 1]
    ]
  },
  "QA_yonInjChesttube": {
    "red_x_points": [
      [-0.00239, 2],
      [-0.00255, 2],
      [0.00208, 0],
      [-0.00142, 2],
      [-0.00307, 2],
      [0.00121, 0],
      [-0.00398, 1],
      [-0.00146, 2],
      [-0.00315, 2],
      [-0.00276, 2],
      [0.00105, 0],
      [0.00277, 0],
      [-0.00355, 2],
      [-0.00316, 2],
      [0.00063, 0],
      [0.00156, 0],
      [0.00097, 0],
      [0.0011, 0],
      [-0.00375, 1],
      [-0.00165, 2],
      [-0.01742, 1],
      [-0.00316, 2],
      [-0.00339, 2],
      [0.0028, 0],
      [-0.00223, 2],
      [-8e-5, 2],
      [-0.00226, 2],
      [0.00051, 0],
      [-0.00309, 2]
    ],
    "red_o_points": [],
    "y_categories": ["N", "Y", "nan"],
    "blue_o_points": [],
    "blue_x_points": [
      [0.0003, 1],
      [-0.00091, 2],
      [0.00372, 0],
      [0.00559, 0],
      [-0.00192, 2],
      [0.00486, 0],
      [0.01661, 0],
      [0.01427, 0],
      [0.00315, 0],
      [-1e-5, 2],
      [0.00412, 0],
      [-1e-5, 2],
      [5e-5, 2]
    ]
  },
  "QA_yonPexPain": {
    "red_x_points": [
      [-0.00731, 1],
      [-0.00072, 1],
      [-0.00155, 1],
      [-0.00046, 1],
      [-0.00095, 1],
      [-0.0018, 0],
      [-0.00071, 1],
      [-0.00781, 1],
      [-0.00185, 0],
      [-0.00058, 1],
      [-0.00555, 1],
      [-0.00132, 0],
      [-0.00932, 1],
      [-0.00096, 1],
      [-0.0006, 1],
      [0.00668, 0],
      [-0.0062, 1],
      [0.00679, 0],
      [-0.00034, 1],
      [0.00789, 0],
      [-0.01997, 2],
      [-0.00944, 1],
      [1e-5, 1],
      [-0.00103, 1],
      [-0.01428, 2],
      [-0.00219, 1],
      [-0.00794, 1],
      [-0.00026, 1],
      [-0.00935, 1]
    ],
    "red_o_points": [],
    "y_categories": ["N", "Y", "nan"],
    "blue_o_points": [],
    "blue_x_points": [
      [-0.0004, 1],
      [0.02629, 0],
      [0.00344, 0],
      [0.00213, 1],
      [-0.00438, 1],
      [0.00065, 2],
      [5e-5, 1],
      [0.00282, 1],
      [0.02789, 0],
      [0.01898, 0],
      [0.0014, 1],
      [0.00335, 0],
      [0.00978, 0],
      [-0.00038, 1],
      [-0.00047, 1]
    ]
  },
  "QS_mulGraftNerve[FI]": {
    "red_x_points": [
      [0.0, 2],
      [-0.00015, 0],
      [-8e-5, 0],
      [-8e-5, 0],
      [-8e-5, 0],
      [-8e-5, 0],
      [-8e-5, 0],
      [1e-5, 2],
      [-3e-5, 0],
      [-8e-5, 0],
      [0.0, 2],
      [-0.00012, 0],
      [1e-5, 2],
      [-8e-5, 0],
      [-3e-5, 0],
      [0.0, 2],
      [0.0, 2],
      [0.0, 2],
      [-5e-5, 0],
      [0.0, 2],
      [1e-5, 2],
      [1e-5, 2],
      [-0.00015, 0],
      [-7e-5, 0],
      [0.0, 2],
      [0.00016, 1],
      [0.0, 2],
      [-8e-5, 0],
      [1e-5, 2]
    ],
    "red_o_points": [],
    "y_categories": ["N", "NOT APPLICABLE", "nan"],
    "blue_o_points": [],
    "blue_x_points": [
      [0.00022, 1],
      [1e-5, 2],
      [-3e-5, 0],
      [-3e-5, 0],
      [0.0, 2],
      [0.00029, 1],
      [0.00013, 1],
      [-5e-5, 0],
      [1e-5, 2],
      [1e-5, 2],
      [-3e-5, 0],
      [0.00022, 1],
      [0.0, 2],
      [0.00029, 1],
      [0.0, 2]
    ]
  },
  "QA_lstPexPalle[Ulna]": {
    "red_x_points": [
      [-0.0012, 4],
      [-0.00359, 4],
      [-0.00231, 4],
      [-0.00766, 2],
      [-0.00383, 4],
      [-0.01293, 1],
      [-0.00347, 4],
      [-0.0008, 4],
      [-0.00516, 4],
      [0.01398, 3],
      [-0.01162, 1],
      [-0.00496, 4],
      [-0.0011, 4],
      [-0.00528, 4],
      [-0.00146, 4],
      [0.00561, 3],
      [-0.01226, 0],
      [0.00356, 3],
      [-0.00883, 0],
      [0.00591, 3],
      [-0.00094, 4],
      [-0.00093, 4],
      [-0.00486, 4],
      [-0.00385, 4],
      [-0.00042, 4],
      [0.00299, 3],
      [-0.0005, 4],
      [-0.00802, 0],
      [-0.00117, 4]
    ],
    "red_o_points": [],
    "y_categories": ["ABS", "HYPO", "NAIA", "PT", "nan"],
    "blue_o_points": [],
    "blue_x_points": [
      [-0.00073, 4],
      [-0.00066, 4],
      [0.02023, 3],
      [0.02261, 3],
      [-2e-5, 4],
      [-0.00021, 4],
      [0.00237, 3],
      [-0.00318, 4],
      [-0.00016, 4],
      [0.00029, 4],
      [0.01852, 3],
      [-0.00027, 4],
      [0.0049, 3],
      [-0.00014, 4],
      [0.01158, 3]
    ]
  }
}
