{
  "QS_mulGraftNerve[other]": {
    "red_x_points": [
      [-0.00019, 2],
      [-0.00034, 0],
      [-0.00039, 0],
      [-0.00035, 0],
      [-0.00032, 0],
      [-0.00034, 0],
      [-0.0005, 0],
      [-0.00023, 2],
      [-0.00042, 0],
      [-0.00035, 0],
      [-0.00031, 0],
      [-0.00011, 2],
      [6e-5, 1],
      [-0.00029, 2],
      [-0.00026, 0],
      [-0.00026, 2],
      [-0.00042, 0],
      [-0.00043, 0],
      [-8e-5, 2],
      [-0.00014, 2],
      [-0.00011, 2],
      [-0.0004, 0],
      [-0.00029, 2],
      [-0.00011, 2],
      [-0.00028, 2],
      [-0.00023, 0],
      [-0.00012, 2],
      [-0.00025, 0],
      [-9e-5, 2],
      [0.00067, 1],
      [-0.00043, 0]
    ],
    "red_o_points": [],
    "y_categories": ["N", "NOT APPLICABLE", "nan"],
    "blue_o_points": [],
    "blue_x_points": [
      [0.00238, 1],
      [7e-5, 2],
      [0.00073, 1],
      [0.00031, 0],
      [-3e-5, 2],
      [0.00083, 1],
      [0.00124, 1]
    ]
  },
  "participant_code": {
    "red_x_points": [
      [-0.02725, 1],
      [-0.02823, 2],
      [-0.02617, 3],
      [-0.02734, 4],
      [-0.02701, 5],
      [-0.02683, 6],
      [-0.02776, 7],
      [-0.02739, 8],
      [-0.02743, 9],
      [-0.02706, 10],
      [-0.02776, 11],
      [-0.02715, 12],
      [-0.02692, 14],
      [-0.02655, 16],
      [-0.02734, 17],
      [-0.02715, 19],
      [-0.02659, 20],
      [-0.02776, 22],
      [-0.02753, 23],
      [-0.02594, 25],
      [-0.02645, 26],
      [-0.02711, 27],
      [-0.02622, 28],
      [-0.02753, 29],
      [-0.02813, 30],
      [-0.02692, 32],
      [-0.02748, 33],
      [-0.02762, 34],
      [-0.02743, 35],
      [-0.02799, 36],
      [-0.02846, 37]
    ],
    "red_o_points": [],
    "y_categories": [
      "P16554",
      "P18297",
      "P19283",
      "P19287",
      "P23391",
      "P31645",
      "P31691",
      "P34778",
      "P35046",
      "P36328",
      "P43633",
      "P4544",
      "P46417",
      "P48965",
      "P53068",
      "P5497",
      "P59529",
      "P62483",
      "P64658",
      "P65202",
      "P66816",
      "P6751",
      "P7408",
      "P75566",
      "P76226",
      "P79971",
      "P82621",
      "P82990",
      "P84932",
      "P85825",
      "P86989",
      "P8770",
      "P87791",
      "P90550",
      "P93159",
      "P94969",
      "P96710",
      "P9744",
      "nan"
    ],
    "blue_o_points": [],
    "blue_x_points": [
      [0.08156, 0],
      [0.08202, 13],
      [0.0814, 15],
      [0.07849, 18],
      [0.07634, 21],
      [0.07696, 24],
      [0.08018, 31]
    ]
  },
  "QS_mulLysisTrunk[Upper]": {
    "red_x_points": [
      [-0.00134, 3],
      [-0.00238, 0],
      [-0.00217, 0],
      [-0.00224, 0],
      [-0.00245, 0],
      [-0.00435, 2],
      [-0.00235, 0],
      [-0.00107, 3],
      [-0.00196, 0],
      [-0.00234, 0],
      [-0.00244, 0],
      [-0.00129, 3],
      [0.0068, 1],
      [-0.00111, 3],
      [-0.00179, 0],
      [-0.0014, 3],
      [-0.00499, 2],
      [-0.00233, 0],
      [-0.00128, 3],
      [-0.00134, 3],
      [-0.00112, 3],
      [-0.00234, 0],
      [-0.00121, 3],
      [-0.00116, 3],
      [-0.00117, 3],
      [-0.00234, 0],
      [-0.00114, 3],
      [-0.0024, 0],
      [-0.00115, 3],
      [0.007, 1],
      [-0.00354, 2]
    ],
    "red_o_points": [],
    "y_categories": ["N", "NOT APPLICABLE", "Y", "nan"],
    "blue_o_points": [],
    "blue_x_points": [
      [0.00806, 1],
      [-0.00038, 3],
      [0.00742, 1],
      [-0.00133, 0],
      [-0.00075, 3],
      [0.00706, 1],
      [0.00839, 1]
    ]
  },
  "QS_mulGraftTrunk[UpperTrunk]": {
    "red_x_points": [
      [-0.00033, 3],
      [-0.00071, 0],
      [-0.00065, 0],
      [-0.00073, 0],
      [-0.00077, 0],
      [-0.00076, 0],
      [-0.00069, 0],
      [-0.00019, 3],
      [-0.00086, 0],
      [-0.00062, 0],
      [-0.0007, 0],
      [-0.0003, 3],
      [0.00204, 1],
      [-0.00045, 3],
      [-0.00252, 2],
      [-0.00033, 3],
      [-0.00057, 0],
      [-0.0007, 0],
      [-0.00028, 3],
      [-0.00024, 3],
      [-0.00024, 3],
      [-0.00058, 0],
      [-0.00031, 3],
      [-0.0002, 3],
      [-0.00023, 3],
      [-0.00081, 0],
      [-0.0002, 3],
      [-0.00068, 0],
      [-0.00023, 3],
      [0.00228, 1],
      [-0.00075, 0]
    ],
    "red_o_points": [],
    "y_categories": ["N", "NOT APPLICABLE", "Y", "nan"],
    "blue_o_points": [],
    "blue_x_points": [
      [0.00232, 1],
      [-0.00017, 3],
      [0.00157, 1],
      [-0.00013, 0],
      [-5e-5, 3],
      [0.00169, 1],
      [0.0027, 1]
    ]
  },
  "QS_mulNeuromadSite[C5]": {
    "red_x_points": [
      [-0.0011, 2],
      [-0.00323, 0],
      [-0.00324, 0],
      [-0.00336, 0],
      [-0.00311, 0],
      [-0.00312, 0],
      [-0.00332, 0],
      [-0.0011, 2],
      [-0.0034, 0],
      [-0.00356, 0],
      [-0.00326, 0],
      [-0.00107, 2],
      [0.00489, 1],
      [-0.00105, 2],
      [-0.00295, 0],
      [-0.00103, 2],
      [-0.00303, 0],
      [-0.00324, 0],
      [-0.00117, 2],
      [-0.00118, 2],
      [-0.00057, 2],
      [-0.00307, 0],
      [-0.00123, 2],
      [-0.00083, 2],
      [-0.00099, 2],
      [-0.00326, 0],
      [-0.00119, 2],
      [-0.00338, 0],
      [-0.00087, 2],
      [0.00543, 1],
      [-0.00267, 0]
    ],
    "red_o_points": [],
    "y_categories": ["N", "NOT APPLICABLE", "nan"],
    "blue_o_points": [],
    "blue_x_points": [
      [0.01351, 1],
      [-0.00015, 2],
      [0.00614, 1],
      [0.00025, 0],
      [-0.00015, 2],
      [0.00672, 1],
      [0.00882, 1]
    ]
  },
  "QS_mulNeuromadSite[C7]": {
    "red_x_points": [
      [-0.00074, 2],
      [-0.00199, 0],
      [-0.00178, 0],
      [-0.00192, 0],
      [-0.00177, 0],
      [-0.00186, 0],
      [-0.00167, 0],
      [-0.00066, 2],
      [-0.00194, 0],
      [-0.00196, 0],
      [-0.00168, 0],
      [-0.00087, 2],
      [0.00241, 1],
      [-0.00074, 2],
      [-0.00198, 0],
      [-0.00078, 2],
      [-0.00145, 0],
      [-0.00171, 0],
      [-0.00078, 2],
      [-0.00075, 2],
      [-0.00041, 2],
      [-0.00168, 0],
      [-0.00069, 2],
      [-0.00055, 2],
      [-0.0007, 2],
      [-0.00186, 0],
      [-0.00072, 2],
      [-0.00171, 0],
      [-0.00061, 2],
      [0.00381, 1],
      [-0.0017, 0]
    ],
    "red_o_points": [],
    "y_categories": ["N", "NOT APPLICABLE", "nan"],
    "blue_o_points": [],
    "blue_x_points": [
      [0.00954, 1],
      [-0.00016, 2],
      [0.00299, 1],
      [9e-5, 0],
      [-0.00021, 2],
      [0.00341, 1],
      [0.00451, 1]
    ]
  },
  "QS_mulTransfSite[IMc]": {
    "red_x_points": [
      [-0.00263, 3],
      [-0.00708, 2],
      [-0.00424, 0],
      [-0.0043, 0],
      [-0.00424, 0],
      [-0.00409, 0],
      [-0.0046, 0],
      [-0.00278, 3],
      [-0.00446, 0],
      [-0.00437, 0],
      [-0.00438, 0],
      [-0.00269, 3],
      [0.01224, 1],
      [-0.00291, 3],
      [-0.00403, 0],
      [-0.00307, 3],
      [-0.00771, 2],
      [-0.00393, 0],
      [-0.00285, 3],
      [-0.00294, 3],
      [-0.00253, 3],
      [-0.00394, 0],
      [-0.0031, 3],
      [-0.00302, 3],
      [-0.00299, 3],
      [-0.00416, 0],
      [-0.00294, 3],
      [-0.00747, 2],
      [-0.00266, 3],
      [0.01256, 1],
      [-0.00716, 2]
    ],
    "red_o_points": [],
    "y_categories": ["N", "NOT APPLICABLE", "Y", "nan"],
    "blue_o_points": [],
    "blue_x_points": [
      [0.01816, 1],
      [-0.00113, 3],
      [0.01436, 1],
      [-0.00152, 0],
      [-0.0011, 3],
      [0.01453, 1],
      [0.01538, 1]
    ]
  },
  "QA_mulInjOrthesisType[ShoulderSupport]": {
    "red_x_points": [
      [-0.01736, 0],
      [-0.01604, 0],
      [-0.01531, 0],
      [-0.01505, 0],
      [-0.01695, 0],
      [-0.01702, 0],
      [-0.01611, 0],
      [-0.02037, 2],
      [-0.01616, 0],
      [-0.01577, 0],
      [-0.01572, 0],
      [-0.01668, 0],
      [0.04251, 1],
      [-0.01773, 0],
      [-0.0159, 0],
      [-0.01713, 0],
      [-0.0189, 2],
      [-0.01579, 0],
      [-0.01659, 0],
      [-0.01702, 0],
      [-0.02059, 2],
      [-0.01896, 3],
      [-0.01742, 0],
      [0.04536, 1],
      [-0.01623, 0],
      [-0.01614, 0],
      [-0.01695, 0],
      [-0.01512, 0],
      [-0.02041, 3],
      [-0.02948, 3],
      [-0.01599, 0]
    ],
    "red_o_points": [],
    "y_categories": ["N", "NOT APPLICABLE", "Y", "nan"],
    "blue_o_points": [],
    "blue_x_points": [
      [-0.00697, 0],
      [0.05044, 1],
      [0.03926, 1],
      [0.05346, 1],
      [0.05142, 1],
      [0.0435, 1],
      [0.04031, 1]
    ]
  },
  "QA_mulInjOrthesisType[ArmSling]": {
    "red_x_points": [
      [-0.01415, 2],
      [-0.01323, 2],
      [-0.01393, 2],
      [-0.0138, 2],
      [-0.01274, 2],
      [-0.01356, 2],
      [-0.01408, 2],
      [-0.01471, 2],
      [-0.01303, 2],
      [-0.01358, 2],
      [-0.01358, 2],
      [-0.0153, 2],
      [0.03732, 1],
      [-0.01383, 2],
      [-0.01249, 2],
      [-0.01406, 2],
      [-0.01566, 0],
      [-0.01356, 2],
      [-0.01453, 2],
      [-0.01409, 2],
      [-0.017, 0],
      [-0.01704, 3],
      [-0.01473, 2],
      [0.03887, 1],
      [-0.01471, 2],
      [-0.01417, 2],
      [-0.01407, 2],
      [-0.01375, 2],
      [-0.01752, 3],
      [-0.02431, 3],
      [-0.01332, 2]
    ],
    "red_o_points": [],
    "y_categories": ["N", "NOT APPLICABLE", "Y", "nan"],
    "blue_o_points": [],
    "blue_x_points": [
      [-0.00639, 2],
      [0.04026, 1],
      [0.03517, 1],
      [0.04381, 1],
      [0.04073, 1],
      [0.03449, 1],
      [0.03636, 1]
    ]
  },
  "QS_mulGraftNerve[Ac]": {
    "red_x_points": [
      [-0.00015, 2],
      [-0.00022, 0],
      [-0.00034, 0],
      [-0.00035, 0],
      [-0.00032, 0],
      [-0.00037, 0],
      [-0.00041, 0],
      [-0.00013, 2],
      [-0.00039, 0],
      [-0.00026, 0],
      [-0.00032, 0],
      [-9e-5, 2],
      [-1e-5, 1],
      [-0.00016, 2],
      [-0.00043, 0],
      [-0.00021, 2],
      [-0.00035, 0],
      [-0.00038, 0],
      [-0.00012, 2],
      [-0.00015, 2],
      [-7e-5, 2],
      [-0.00024, 0],
      [-0.00013, 2],
      [-2e-5, 2],
      [-0.00023, 2],
      [-0.0003, 0],
      [-0.00013, 2],
      [-0.00026, 0],
      [-0.00014, 2],
      [0.00044, 1],
      [-0.00029, 0]
    ],
    "red_o_points": [],
    "y_categories": ["N", "NOT APPLICABLE", "nan"],
    "blue_o_points": [],
    "blue_x_points": [
      [0.00166, 1],
      [0.00014, 2],
      [0.00057, 1],
      [-1e-5, 0],
      [0.00013, 2],
      [0.00072, 1],
      [0.00093, 1]
    ]
  },
  "QS_mulNeuromadSite[C8]": {
    "red_x_points": [
      [-0.0013, 2],
      [-0.00406, 0],
      [-0.00432, 0],
      [-0.00449, 0],
      [-0.00413, 0],
      [-0.00412, 0],
      [-0.00495, 0],
      [-0.00143, 2],
      [-0.0043, 0],
      [-0.00433, 0],
      [-0.00442, 0],
      [-0.00135, 2],
      [0.00675, 1],
      [-0.0014, 2],
      [-0.00448, 0],
      [-0.00155, 2],
      [-0.00401, 0],
      [-0.00435, 0],
      [-0.00139, 2],
      [-0.00138, 2],
      [-0.00099, 2],
      [-0.00328, 0],
      [-0.00144, 2],
      [-0.00123, 2],
      [-0.00153, 2],
      [-0.00397, 0],
      [-0.00137, 2],
      [-0.00383, 0],
      [-0.00091, 2],
      [0.0074, 1],
      [-0.00405, 0]
    ],
    "red_o_points": [],
    "y_categories": ["N", "NOT APPLICABLE", "nan"],
    "blue_o_points": [],
    "blue_x_points": [
      [0.01861, 1],
      [-0.00013, 2],
      [0.00726, 1],
      [0.00066, 0],
      [-0.00013, 2],
      [0.00819, 1],
      [0.01146, 1]
    ]
  },
  "QS_mulGraftNerve[Ph]": {
    "red_x_points": [
      [-6e-5, 2],
      [-9e-5, 0],
      [-0.00015, 0],
      [-0.00016, 0],
      [-0.00016, 0],
      [-0.0001, 0],
      [-0.00015, 0],
      [-2e-5, 2],
      [-0.00018, 0],
      [-0.00018, 0],
      [-0.00016, 0],
      [-6e-5, 2],
      [7e-5, 1],
      [-2e-5, 2],
      [-0.00022, 0],
      [-6e-5, 2],
      [-0.00024, 0],
      [-0.00013, 0],
      [-8e-5, 2],
      [-6e-5, 2],
      [-6e-5, 2],
      [-9e-5, 0],
      [-2e-5, 2],
      [-6e-5, 2],
      [-7e-5, 2],
      [-0.00016, 0],
      [-6e-5, 2],
      [-7e-5, 0],
      [-2e-5, 2],
      [0.00022, 1],
      [-8e-5, 0]
    ],
    "red_o_points": [],
    "y_categories": ["N", "NOT APPLICABLE", "nan"],
    "blue_o_points": [],
    "blue_x_points": [
      [0.00089, 1],
      [3e-5, 2],
      [0.00032, 1],
      [7e-5, 0],
      [-1e-5, 2],
      [0.00032, 1],
      [0.00023, 1]
    ]
  },
  "QS_mulTransfSite[AcSsPA]": {
    "red_x_points": [
      [-0.00025, 3],
      [-0.00048, 0],
      [-0.00037, 0],
      [-0.00032, 0],
      [-0.00033, 0],
      [-0.00041, 0],
      [-0.00043, 0],
      [-0.00022, 3],
      [-0.00047, 0],
      [-0.00046, 0],
      [-0.00038, 0],
      [-0.00027, 3],
      [0.0012, 1],
      [-0.00032, 3],
      [-0.00023, 0],
      [-0.00033, 3],
      [-0.00143, 2],
      [-0.00032, 0],
      [-0.00021, 3],
      [-0.00024, 3],
      [-0.00022, 3],
      [-0.00041, 0],
      [-0.00023, 3],
      [-0.00021, 3],
      [-0.0003, 3],
      [-0.00047, 0],
      [-0.00029, 3],
      [-0.00043, 0],
      [-0.00025, 3],
      [0.00116, 1],
      [-0.00043, 0]
    ],
    "red_o_points": [],
    "y_categories": ["N", "NOT APPLICABLE", "Y", "nan"],
    "blue_o_points": [],
    "blue_x_points": [
      [0.00125, 1],
      [-0.0, 3],
      [0.00129, 1],
      [-0.00031, 0],
      [-0.00018, 3],
      [0.00102, 1],
      [0.00149, 1]
    ]
  },
  "QS_mulTransfSite[AcMc]": {
    "red_x_points": [
      [-0.00019, 3],
      [-0.00037, 0],
      [-0.00046, 0],
      [-0.00043, 0],
      [-0.0005, 0],
      [-0.00044, 0],
      [-0.00044, 0],
      [-0.00024, 3],
      [-0.00042, 0],
      [-0.00047, 0],
      [-0.00103, 2],
      [-0.00028, 3],
      [0.00112, 1],
      [-0.00015, 3],
      [-0.00039, 0],
      [-0.00028, 3],
      [-0.00034, 0],
      [-0.00033, 0],
      [-0.00031, 3],
      [-0.00033, 3],
      [-0.00022, 3],
      [-0.00046, 0],
      [-0.00032, 3],
      [-0.00039, 3],
      [-0.00031, 3],
      [-0.0003, 0],
      [-0.00027, 3],
      [-0.00038, 0],
      [-0.0003, 3],
      [0.00109, 1],
      [-0.00041, 0]
    ],
    "red_o_points": [],
    "y_categories": ["N", "NOT APPLICABLE", "Y", "nan"],
    "blue_o_points": [],
    "blue_x_points": [
      [0.0014, 1],
      [-0.00011, 3],
      [0.00171, 1],
      [-0.00055, 0],
      [-6e-5, 3],
      [0.00147, 1],
      [0.00137, 1]
    ]
  },
  "QS_mulTransfSite[Other]": {
    "red_x_points": [
      [-0.00021, 3],
      [-0.00027, 0],
      [-0.0004, 0],
      [-0.00033, 0],
      [-0.0002, 0],
      [-0.00037, 0],
      [-0.00038, 0],
      [-0.00016, 3],
      [-0.00034, 0],
      [-0.00033, 0],
      [-0.00033, 0],
      [-0.00012, 3],
      [0.00132, 1],
      [-0.00013, 3],
      [-0.00023, 0],
      [-0.00021, 3],
      [-0.00023, 0],
      [-0.00384, 2],
      [-0.00019, 3],
      [-0.00014, 3],
      [-0.00019, 3],
      [-0.00032, 0],
      [-0.00016, 3],
      [-0.00019, 3],
      [-0.00019, 3],
      [-0.00033, 0],
      [-0.00018, 3],
      [-0.00029, 0],
      [-0.00014, 3],
      [0.00109, 1],
      [-0.00038, 0]
    ],
    "red_o_points": [],
    "y_categories": ["N", "NOT APPLICABLE", "Y", "nan"],
    "blue_o_points": [],
    "blue_x_points": [
      [0.00127, 1],
      [-0.0002, 3],
      [0.00169, 1],
      [0.00054, 0],
      [0.00023, 3],
      [0.00098, 1],
      [0.00099, 1]
    ]
  },
  "QA_yonInjBpsurg": {
    "red_x_points": [
      [-0.0049, 1],
      [-0.00422, 1],
      [-0.0048, 1],
      [-0.00465, 1],
      [-0.00432, 1],
      [-0.00447, 1],
      [-0.0046, 1],
      [-0.00414, 1],
      [-0.00472, 1],
      [-0.00479, 1],
      [-0.0044, 1],
      [-0.00526, 1],
      [0.01043, 0],
      [-0.00477, 1],
      [-0.00431, 1],
      [-0.00465, 1],
      [-0.00332, 1],
      [-0.00434, 1],
      [-0.00487, 1],
      [-0.00446, 1],
      [-0.00403, 1],
      [-0.00383, 1],
      [-0.00468, 1],
      [-0.00369, 1],
      [-0.00526, 1],
      [-0.00435, 1],
      [-0.00458, 1],
      [-0.00414, 1],
      [-0.00406, 1],
      [0.0122, 0],
      [-0.00415, 1]
    ],
    "red_o_points": [],
    "y_categories": ["N", "Y", "nan"],
    "blue_o_points": [],
    "blue_x_points": [
      [0.02828, 0],
      [-0.00118, 1],
      [0.0134, 0],
      [-0.00333, 1],
      [-0.00124, 1],
      [0.01373, 0],
      [0.01564, 0]
    ]
  },
  "QS_mulNeuromadSite[T1]": {
    "red_x_points": [
      [-0.00153, 2],
      [-0.0047, 0],
      [-0.0051, 0],
      [-0.00474, 0],
      [-0.00477, 0],
      [-0.00502, 0],
      [-0.0052, 0],
      [-0.00148, 2],
      [-0.00499, 0],
      [-0.00519, 0],
      [-0.00469, 0],
      [-0.00166, 2],
      [0.00686, 1],
      [-0.00198, 2],
      [-0.00531, 0],
      [-0.00195, 2],
      [-0.00426, 0],
      [-0.00483, 0],
      [-0.00163, 2],
      [-0.00162, 2],
      [-0.00099, 2],
      [-0.00429, 0],
      [-0.00168, 2],
      [-0.00149, 2],
      [-0.00166, 2],
      [-0.00457, 0],
      [-0.00165, 2],
      [-0.00488, 0],
      [-0.0011, 2],
      [0.00932, 1],
      [-0.00509, 0]
    ],
    "red_o_points": [],
    "y_categories": ["N", "NOT APPLICABLE", "nan"],
    "blue_o_points": [],
    "blue_x_points": [
      [0.02117, 1],
      [-0.00018, 2],
      [0.01002, 1],
      [0.00095, 0],
      [-0.00037, 2],
      [0.00971, 1],
      [0.01178, 1]
    ]
  },
  "QS_mulTransfSite[AcSsAA]": {
    "red_x_points": [
      [-0.00319, 3],
      [-0.00956, 2],
      [-0.00349, 0],
      [-0.00937, 2],
      [-0.00996, 2],
      [-0.00386, 0],
      [-0.00405, 0],
      [-0.00311, 3],
      [-0.00378, 0],
      [-0.00886, 2],
      [-0.00378, 0],
      [-0.00301, 3],
      [0.01681, 1],
      [-0.00298, 3],
      [-0.00959, 2],
      [-0.00347, 3],
      [-0.00357, 0],
      [-0.00364, 0],
      [-0.00296, 3],
      [-0.00278, 3],
      [-0.0028, 3],
      [-0.0086, 2],
      [-0.00324, 3],
      [-0.00296, 3],
      [-0.00314, 3],
      [-0.00375, 0],
      [-0.00336, 3],
      [-0.00868, 2],
      [-0.00321, 3],
      [0.01586, 1],
      [-0.00378, 0]
    ],
    "red_o_points": [],
    "y_categories": ["N", "NOT APPLICABLE", "Y", "nan"],
    "blue_o_points": [],
    "blue_x_points": [
      [0.02218, 1],
      [-0.00167, 3],
      [0.01643, 1],
      [-0.0015, 0],
      [-0.00166, 3],
      [0.01703, 1],
      [0.01793, 1]
    ]
  },
  "QS_mulLysisRoot[C5]": {
    "red_x_points": [
      [-0.00048, 3],
      [-0.00093, 0],
      [-0.00163, 2],
      [-0.00087, 0],
      [-0.00068, 0],
      [-0.0008, 0],
      [-0.00076, 0],
      [-0.0005, 3],
      [-0.00085, 0],
      [-0.00086, 0],
      [-0.00074, 0],
      [-0.00052, 3],
      [0.00304, 1],
      [-0.00061, 3],
      [-0.00084, 0],
      [-0.00038, 3],
      [-0.00078, 0],
      [-0.00087, 0],
      [-0.00044, 3],
      [-0.00049, 3],
      [-0.00045, 3],
      [-0.00083, 0],
      [-0.00053, 3],
      [-0.00051, 3],
      [-0.00058, 3],
      [-0.00094, 0],
      [-0.00063, 3],
      [-0.00074, 0],
      [-0.00049, 3],
      [0.00261, 1],
      [-0.00164, 2]
    ],
    "red_o_points": [],
    "y_categories": ["N", "NOT APPLICABLE", "Y", "nan"],
    "blue_o_points": [],
    "blue_x_points": [
      [0.00301, 1],
      [-0.00027, 3],
      [0.00244, 1],
      [-0.00098, 0],
      [-0.00027, 3],
      [0.00324, 1],
      [0.00308, 1]
    ]
  },
  "QS_mulNeuromadSite[C6]": {
    "red_x_points": [
      [-0.00052, 2],
      [-0.00145, 0],
      [-0.00135, 0],
      [-0.00166, 0],
      [-0.00157, 0],
      [-0.00144, 0],
      [-0.00169, 0],
      [-0.0004, 2],
      [-0.00134, 0],
      [-0.00144, 0],
      [-0.00161, 0],
      [-0.00061, 2],
      [0.00234, 1],
      [-0.00065, 2],
      [-0.00175, 0],
      [-0.00065, 2],
      [-0.00095, 0],
      [-0.00173, 0],
      [-0.00055, 2],
      [-0.00053, 2],
      [-0.00026, 2],
      [-0.00124, 0],
      [-0.00077, 2],
      [-0.00043, 2],
      [-0.00062, 2],
      [-0.00154, 0],
      [-0.00059, 2],
      [-0.0017, 0],
      [-0.00036, 2],
      [0.00241, 1],
      [-0.00159, 0]
    ],
    "red_o_points": [],
    "y_categories": ["N", "NOT APPLICABLE", "nan"],
    "blue_o_points": [],
    "blue_x_points": [
      [0.00727, 1],
      [-9e-5, 2],
      [0.00289, 1],
      [0.0004, 0],
      [-0.00013, 2],
      [0.00295, 1],
      [0.00331, 1]
    ]
  },
  "QS_mulGraftNerve[Ul]": {
    "red_x_points": [
      [-4e-5, 0],
      [-4e-5, 0],
      [-4e-5, 2],
      [-4e-5, 0],
      [-4e-5, 2],
      [-4e-5, 0],
      [-4e-5, 2],
      [-4e-5, 2],
      [-4e-5, 2]
    ],
    "red_o_points": [],
    "y_categories": ["N", "NOT APPLICABLE", "nan"],
    "blue_o_points": [],
    "blue_x_points": [[0.00016, 1]]
  },
  "QS_mulBpsurgeryType[Lysis]": {
    "red_x_points": [
      [-0.00256, 3],
      [-0.00475, 0],
      [-0.00741, 2],
      [-0.00442, 0],
      [-0.00424, 0],
      [-0.00823, 2],
      [-0.00441, 0],
      [-0.0025, 3],
      [-0.00471, 0],
      [-0.00461, 0],
      [-0.0045, 0],
      [-0.00296, 3],
      [0.01133, 1],
      [-0.00312, 3],
      [-0.00432, 0],
      [-0.00332, 3],
      [-0.00787, 2],
      [-0.00461, 0],
      [-0.00295, 3],
      [-0.00288, 3],
      [-0.00231, 3],
      [-0.0038, 0],
      [-0.00342, 3],
      [-0.00281, 3],
      [-0.00298, 3],
      [-0.00453, 0],
      [-0.00262, 3],
      [-0.00419, 0],
      [-0.00266, 3],
      [0.01366, 1],
      [-0.00778, 2]
    ],
    "red_o_points": [],
    "y_categories": ["N", "NOT APPLICABLE", "Y", "nan"],
    "blue_o_points": [],
    "blue_x_points": [
      [0.02351, 1],
      [-0.00076, 3],
      [0.01391, 1],
      [-0.00094, 0],
      [-0.0008, 3],
      [0.01365, 1],
      [0.01367, 1]
    ]
  },
  "QA_yonInjUnconscio": {
    "red_x_points": [
      [-0.00472, 1],
      [-0.0047, 1],
      [-0.00239, 2],
      [-0.00194, 2],
      [0.00764, 0],
      [-0.00458, 1],
      [-0.00223, 2],
      [-0.00482, 2],
      [-0.00272, 2],
      [-0.00204, 2],
      [-0.00461, 1],
      [-0.00462, 1],
      [-0.0364, 1],
      [-0.0056, 2],
      [-0.00218, 2],
      [-0.00571, 2],
      [-0.00457, 1],
      [0.00827, 0],
      [-0.00436, 1],
      [-0.00451, 1],
      [-0.0045, 1],
      [-0.00444, 1],
      [-0.00594, 2],
      [-0.01133, 1],
      [-0.00479, 2],
      [-0.00423, 1],
      [0.01187, 0],
      [-0.00366, 1],
      [-0.005, 2],
      [-0.00036, 2],
      [-0.00461, 1]
    ],
    "red_o_points": [],
    "y_categories": ["N", "Y", "nan"],
    "blue_o_points": [],
    "blue_x_points": [
      [0.00153, 2],
      [-0.00423, 1],
      [0.01924, 0],
      [0.02231, 0],
      [0.02699, 0],
      [0.00351, 2],
      [0.00411, 2]
    ]
  },
  "QS_mulTransfSite[Oberlin]": {
    "red_x_points": [
      [-0.00544, 3],
      [-0.01482, 0],
      [-0.01446, 0],
      [-0.01505, 0],
      [-0.00762, 2],
      [-0.00646, 2],
      [-0.01493, 0],
      [-0.0051, 3],
      [-0.00717, 2],
      [-0.00731, 2],
      [-0.00692, 2],
      [-0.00505, 3],
      [0.02478, 1],
      [-0.00593, 3],
      [-0.0076, 2],
      [-0.00561, 3],
      [-0.01518, 0],
      [-0.00738, 2],
      [-0.00511, 3],
      [-0.00535, 3],
      [-0.00469, 3],
      [-0.01426, 0],
      [-0.0058, 3],
      [-0.00506, 3],
      [-0.00579, 3],
      [-0.00671, 2],
      [-0.00549, 3],
      [-0.01493, 0],
      [-0.00508, 3],
      [0.02679, 1],
      [-0.01456, 0]
    ],
    "red_o_points": [],
    "y_categories": ["N", "NOT APPLICABLE", "Y", "nan"],
    "blue_o_points": [],
    "blue_x_points": [
      [0.04017, 1],
      [-0.00239, 3],
      [0.0264, 1],
      [0.00064, 2],
      [-0.00207, 3],
      [0.02889, 1],
      [0.03016, 1]
    ]
  },
  "QA_lstPexMuscstrength[ShoulderAbduc]": {
    "red_x_points": [
      [-0.00736, 1],
      [-0.00708, 1],
      [-0.00751, 1],
      [-0.00717, 1],
      [-0.00742, 1],
      [-0.00691, 1],
      [-0.0076, 1],
      [-0.00695, 1],
      [-0.00697, 1],
      [-0.0073, 1],
      [-0.00695, 1],
      [-0.00704, 1],
      [0.00309, 2],
      [0.00657, 2],
      [0.00628, 2],
      [0.00634, 2],
      [0.00614, 2],
      [-0.00762, 1],
      [-0.00712, 1],
      [-0.00718, 1],
      [-0.00741, 1],
      [-0.00695, 1],
      [0.00622, 2],
      [-0.01192, 1],
      [-0.00713, 1],
      [-0.00739, 1],
      [-0.00791, 1],
      [-0.00708, 1],
      [-0.00752, 1],
      [0.00213, 2],
      [-0.00755, 1]
    ],
    "red_o_points": [],
    "y_categories": ["GREATER THAN OR EQUALS TO 3", "LESS THAN 3", "nan"],
    "blue_o_points": [],
    "blue_x_points": [
      [0.00439, 2],
      [0.00689, 2],
      [0.03103, 0],
      [0.00753, 2],
      [0.00739, 2],
      [0.03092, 0],
      [-0.00081, 1]
    ]
  },
  "QS_mulGraftNerve[Me]": {
    "red_x_points": [
      [-1e-5, 2],
      [-6e-5, 0],
      [-6e-5, 0],
      [-6e-5, 0],
      [-1e-5, 0],
      [-6e-5, 0],
      [-6e-5, 0],
      [-0.0, 2],
      [-5e-5, 0],
      [-6e-5, 0],
      [-1e-5, 2],
      [-6e-5, 1],
      [-0.0, 2],
      [-6e-5, 0],
      [-1e-5, 2],
      [-5e-5, 0],
      [-5e-5, 0],
      [-1e-5, 2],
      [-1e-5, 2],
      [-0.0, 2],
      [-5e-5, 0],
      [-1e-5, 2],
      [-0.0, 2],
      [-1e-5, 2],
      [-1e-5, 0],
      [-0.0, 2],
      [-6e-5, 0],
      [-0.0, 2]
    ],
    "red_o_points": [],
    "y_categories": ["N", "NOT APPLICABLE", "nan"],
    "blue_o_points": [],
    "blue_x_points": [
      [0.0003, 1],
      [3e-5, 2],
      [0.00011, 1],
      [3e-5, 0],
      [3e-5, 2],
      [0.00011, 1]
    ]
  },
  "QS_lstBpsurgSide": {
    "red_x_points": [
      [-0.00535, 3],
      [-0.00674, 0],
      [-0.00832, 0],
      [-0.00843, 0],
      [-0.01512, 2],
      [-0.00735, 0],
      [-0.00789, 0],
      [-0.00483, 3],
      [-0.00765, 0],
      [-0.01507, 2],
      [-0.01432, 2],
      [-0.00516, 3],
      [0.02506, 1],
      [-0.00535, 3],
      [-0.01676, 2],
      [-0.00551, 3],
      [-0.01516, 2],
      [-0.01662, 2],
      [-0.00488, 3],
      [-0.00506, 3],
      [-0.00499, 3],
      [-0.00731, 0],
      [-0.00551, 3],
      [-0.0049, 3],
      [-0.00527, 3],
      [-0.01434, 2],
      [-0.00541, 3],
      [-0.01455, 2],
      [-0.00497, 3],
      [0.02818, 1],
      [-0.00726, 0]
    ],
    "red_o_points": [],
    "y_categories": ["L", "NOT APPLICABLE", "R", "nan"],
    "blue_o_points": [],
    "blue_x_points": [
      [0.03695, 1],
      [-0.00189, 3],
      [0.02831, 1],
      [0.00236, 0],
      [-0.00202, 3],
      [0.0298, 1],
      [0.0312, 1]
    ]
  },
  "QS_mulNeuromadSite[T2]": {
    "red_x_points": [
      [-0.00231, 2],
      [-0.00655, 0],
      [-0.00685, 0],
      [-0.00696, 0],
      [-0.00673, 0],
      [-0.00677, 0],
      [-0.00724, 0],
      [-0.00226, 2],
      [-0.00688, 0],
      [-0.00679, 0],
      [-0.00686, 0],
      [-0.00259, 2],
      [0.01113, 1],
      [-0.00244, 2],
      [-0.00754, 0],
      [-0.00234, 2],
      [-0.00573, 0],
      [-0.00639, 0],
      [-0.00242, 2],
      [-0.0023, 2],
      [-0.00163, 2],
      [-0.00611, 0],
      [-0.00268, 2],
      [-0.00264, 2],
      [-0.00274, 2],
      [-0.00641, 0],
      [-0.00247, 2],
      [-0.00674, 0],
      [-0.00174, 2],
      [0.0122, 1],
      [-0.00662, 0]
    ],
    "red_o_points": [],
    "y_categories": ["N", "NOT APPLICABLE", "nan"],
    "blue_o_points": [],
    "blue_x_points": [
      [0.02974, 1],
      [-0.00058, 2],
      [0.01234, 1],
      [0.00066, 0],
      [-0.0005, 2],
      [0.01476, 1],
      [0.01752, 1]
    ]
  },
  "QS_mulLysisSite[Trunk]": {
    "red_x_points": [
      [-0.00132, 3],
      [-0.0019, 0],
      [-0.00211, 0],
      [-0.00203, 0],
      [-0.00173, 0],
      [-0.00384, 2],
      [-0.0017, 0],
      [-0.00127, 3],
      [-0.00197, 0],
      [-0.00184, 0],
      [-0.00168, 0],
      [-0.00133, 3],
      [0.00711, 1],
      [-0.00124, 3],
      [-0.00185, 0],
      [-0.00128, 3],
      [-0.00436, 2],
      [-0.00165, 0],
      [-0.00118, 3],
      [-0.00121, 3],
      [-0.00123, 3],
      [-0.00183, 0],
      [-0.00135, 3],
      [-0.00125, 3],
      [-0.00125, 3],
      [-0.00173, 0],
      [-0.00106, 3],
      [-0.00198, 0],
      [-0.00129, 3],
      [0.0062, 1],
      [-0.00379, 2]
    ],
    "red_o_points": [],
    "y_categories": ["N", "NOT APPLICABLE", "Y", "nan"],
    "blue_o_points": [],
    "blue_x_points": [
      [0.00836, 1],
      [-0.0007, 3],
      [0.00675, 1],
      [-0.00115, 0],
      [-0.00054, 3],
      [0.00565, 1],
      [0.00683, 1]
    ]
  },
  "QS_mulNeuromadSite[C4]": {
    "red_x_points": [
      [-0.00035, 2],
      [-0.00099, 0],
      [-0.00098, 0],
      [-0.00095, 0],
      [-0.00084, 0],
      [-0.00109, 0],
      [-0.00111, 0],
      [-0.00032, 2],
      [-0.00089, 0],
      [-0.00117, 0],
      [-0.00097, 0],
      [-0.00039, 2],
      [0.0008, 1],
      [-0.00044, 2],
      [-0.00125, 0],
      [-0.00035, 2],
      [-0.00091, 0],
      [-0.00101, 0],
      [-0.00038, 2],
      [-0.00044, 2],
      [-0.0002, 2],
      [-0.00085, 0],
      [-0.00044, 2],
      [-0.00037, 2],
      [-0.00034, 2],
      [-0.00105, 0],
      [-0.00037, 2],
      [-0.00101, 0],
      [-0.0002, 2],
      [0.00194, 1],
      [-0.00093, 0]
    ],
    "red_o_points": [],
    "y_categories": ["N", "NOT APPLICABLE", "nan"],
    "blue_o_points": [],
    "blue_x_points": [
      [0.00566, 1],
      [8e-5, 2],
      [0.00275, 1],
      [5e-5, 0],
      [5e-5, 2],
      [0.00163, 1],
      [0.0025, 1]
    ]
  },
  "QS_mulGraftNerve[Ra]": {
    "red_x_points": [
      [-1e-5, 0],
      [-1e-5, 0],
      [-1e-5, 0],
      [-1e-5, 0],
      [-1e-5, 0],
      [-1e-5, 2],
      [-1e-5, 0],
      [-1e-5, 0],
      [-1e-5, 0],
      [-1e-5, 2],
      [-1e-5, 2],
      [-1e-5, 0],
      [-1e-5, 2],
      [-1e-5, 2],
      [-1e-5, 2],
      [-1e-5, 0],
      [-1e-5, 0],
      [-1e-5, 0]
    ],
    "red_o_points": [],
    "y_categories": ["N", "NOT APPLICABLE", "nan"],
    "blue_o_points": [],
    "blue_x_points": [[0.00019, 1]]
  },
  "QS_mulTransfSite[PhMc]": {
    "red_x_points": [
      [-0.00083, 3],
      [-0.00137, 0],
      [-0.00152, 0],
      [-0.00157, 0],
      [-0.00157, 0],
      [-0.00134, 0],
      [-0.00285, 2],
      [-0.00062, 3],
      [-0.00142, 0],
      [-0.00154, 0],
      [-0.00152, 0],
      [-0.00079, 3],
      [0.00408, 1],
      [-0.00086, 3],
      [-0.00167, 0],
      [-0.00091, 3],
      [-0.00126, 0],
      [-0.00151, 0],
      [-0.00068, 3],
      [-0.00085, 3],
      [-0.00078, 3],
      [-0.00277, 2],
      [-0.00067, 3],
      [-0.0007, 3],
      [-0.00083, 3],
      [-0.0015, 0],
      [-0.0006, 3],
      [-0.00138, 0],
      [-0.00073, 3],
      [0.00455, 1],
      [-0.00122, 0]
    ],
    "red_o_points": [],
    "y_categories": ["N", "NOT APPLICABLE", "Y", "nan"],
    "blue_o_points": [],
    "blue_x_points": [
      [0.00547, 1],
      [-0.00033, 3],
      [0.00407, 1],
      [-0.00126, 0],
      [-0.00028, 3],
      [0.00439, 1],
      [0.00497, 1]
    ]
  },
  "QA_mulInjTbpiCause[Motorcycle]": {
    "red_x_points": [
      [0.00132, 0],
      [-0.001, 1],
      [-0.00148, 1],
      [-0.00149, 1],
      [-0.00091, 1],
      [-0.00078, 1],
      [-0.0014, 1],
      [-0.0012, 1],
      [-0.00136, 1],
      [-0.00126, 1],
      [-0.00101, 1],
      [0.0015, 0],
      [-0.04919, 1],
      [-0.00155, 1],
      [-0.0017, 1],
      [-0.0016, 1],
      [-0.00099, 1],
      [-0.00097, 1],
      [0.0016, 0],
      [-0.00086, 1],
      [-0.00097, 1],
      [-0.00073, 1],
      [-0.00149, 1],
      [-0.00233, 1],
      [0.00265, 0],
      [-0.0009, 1],
      [-0.00077, 1],
      [-0.00082, 1],
      [-0.00123, 1],
      [-0.04362, 1],
      [-0.00092, 1]
    ],
    "red_o_points": [],
    "y_categories": ["N", "Y", "nan"],
    "blue_o_points": [],
    "blue_x_points": [
      [0.02136, 0],
      [-0.00134, 1],
      [0.01912, 0],
      [-0.00234, 1],
      [-0.00092, 1],
      [0.01973, 0],
      [0.022, 0]
    ]
  },
  "QS_mulLysisRoot[C6]": {
    "red_x_points": [
      [-0.00071, 3],
      [-0.0013, 0],
      [-0.00264, 2],
      [-0.00124, 0],
      [-0.0012, 0],
      [-0.00124, 0],
      [-0.00097, 0],
      [-0.00076, 3],
      [-0.00119, 0],
      [-0.00117, 0],
      [-0.00134, 0],
      [-0.00081, 3],
      [0.00432, 1],
      [-0.00092, 3],
      [-0.00111, 0],
      [-0.00075, 3],
      [-0.00106, 0],
      [-0.00137, 0],
      [-0.00082, 3],
      [-0.00089, 3],
      [-0.0007, 3],
      [-0.00113, 0],
      [-0.00087, 3],
      [-0.00082, 3],
      [-0.00093, 3],
      [-0.00121, 0],
      [-0.00077, 3],
      [-0.00116, 0],
      [-0.0007, 3],
      [0.00387, 1],
      [-0.00247, 2]
    ],
    "red_o_points": [],
    "y_categories": ["N", "NOT APPLICABLE", "Y", "nan"],
    "blue_o_points": [],
    "blue_x_points": [
      [0.0044, 1],
      [-0.0003, 3],
      [0.0034, 1],
      [-0.00128, 0],
      [-0.00041, 3],
      [0.00432, 1],
      [0.00372, 1]
    ]
  },
  "QS_mulGraftNerve[FI]": {
    "red_x_points": [
      [-0.00014, 2],
      [-0.00019, 0],
      [-0.00027, 0],
      [-0.00032, 0],
      [-0.00039, 0],
      [-0.00016, 0],
      [-0.00022, 0],
      [-0.00014, 2],
      [-0.00014, 0],
      [-0.00025, 0],
      [-0.00015, 0],
      [-0.00014, 2],
      [-2e-5, 1],
      [-0.00014, 2],
      [-0.00026, 0],
      [-9e-5, 2],
      [-0.00014, 0],
      [-0.00028, 0],
      [-0.00013, 2],
      [-0.00017, 2],
      [-0.0001, 2],
      [-0.00021, 0],
      [-0.0001, 2],
      [-6e-5, 2],
      [-0.00013, 2],
      [-0.00027, 0],
      [-0.00013, 2],
      [-0.00025, 0],
      [-0.00012, 2],
      [0.00023, 1],
      [-0.00019, 0]
    ],
    "red_o_points": [],
    "y_categories": ["N", "NOT APPLICABLE", "nan"],
    "blue_o_points": [],
    "blue_x_points": [
      [0.00131, 1],
      [0.0, 2],
      [0.00064, 1],
      [3e-5, 0],
      [6e-5, 2],
      [0.00053, 1],
      [0.00077, 1]
    ]
  }
}
