{
  "QS_mulLysisTrunk[Upper]": {
    "red_x_points": [
      [-0.00066, 3],
      [-0.00449, 0],
      [-0.00338, 0],
      [-0.00266, 0],
      [-0.00314, 0],
      [-0.0123, 2],
      [-0.00307, 0],
      [-0.00089, 3],
      [-0.00296, 0],
      [-0.00283, 0],
      [-0.0012, 3],
      [-0.00299, 0],
      [-0.00069, 3],
      [-0.0044, 0],
      [-0.01112, 2],
      [-0.00093, 3],
      [-0.00094, 3],
      [-0.00098, 3],
      [-0.00289, 0],
      [-0.00069, 3],
      [-0.0007, 3],
      [-0.00083, 3],
      [-0.00345, 0],
      [-0.00323, 0],
      [-0.00094, 3],
      [0.01264, 1],
      [-0.00065, 3],
      [-0.01086, 2],
      [-0.00075, 3]
    ],
    "red_o_points": [],
    "y_categories": ["N", "NOT APPLICABLE", "Y", "nan"],
    "blue_o_points": [],
    "blue_x_points": [
      [0.02108, 1],
      [-0.00037, 3],
      [-0.00155, 0],
      [-0.00205, 0],
      [-0.00023, 3],
      [0.01683, 1],
      [0.01433, 1],
      [-0.00232, 0],
      [-0.00048, 3],
      [-0.00035, 3],
      [-0.0012, 0],
      [0.01488, 1],
      [-0.00064, 3],
      [0.01492, 1],
      [-0.00086, 3]
    ]
  },
  "QS_mulLysisCord[Medial]": {
    "red_x_points": [
      [-1e-5, 2],
      [-2e-5, 0],
      [-2e-5, 0],
      [-2e-5, 0],
      [-2e-5, 0],
      [-2e-5, 0],
      [-2e-5, 0],
      [-1e-5, 2],
      [-2e-5, 0],
      [-1e-5, 2],
      [-2e-5, 0],
      [-1e-5, 2],
      [-1e-5, 2],
      [-1e-5, 2],
      [-2e-5, 0],
      [-1e-5, 2],
      [-1e-5, 2],
      [-1e-5, 2],
      [-2e-5, 0],
      [-1e-5, 2],
      [9e-5, 1],
      [-1e-5, 2],
      [-1e-5, 2]
    ],
    "red_o_points": [],
    "y_categories": ["N", "NOT APPLICABLE", "nan"],
    "blue_o_points": [],
    "blue_x_points": [
      [9e-5, 1],
      [-1e-5, 2],
      [-2e-5, 0],
      [9e-5, 1],
      [9e-5, 1],
      [-2e-5, 0],
      [-1e-5, 2],
      [-1e-5, 2],
      [-2e-5, 0],
      [9e-5, 1],
      [-1e-5, 2],
      [-1e-5, 2]
    ]
  },
  "QS_mulBpsurgeryType[Transf]": {
    "red_x_points": [
      [-0.00031, 3],
      [-0.00113, 2],
      [-0.00424, 0],
      [-0.00091, 2],
      [-0.00096, 2],
      [-0.00082, 2],
      [-0.00086, 2],
      [-0.00024, 3],
      [-0.00085, 2],
      [-0.00089, 2],
      [-0.00033, 3],
      [-0.00094, 2],
      [-0.00028, 3],
      [-0.00105, 2],
      [-0.00105, 2],
      [-0.00029, 3],
      [-0.00038, 3],
      [-0.00033, 3],
      [-0.00071, 2],
      [-0.00034, 3],
      [-0.00034, 3],
      [-0.00033, 3],
      [-0.00093, 2],
      [-0.00083, 2],
      [-0.00037, 3],
      [0.00342, 1],
      [-0.00032, 3],
      [-0.00102, 2],
      [-0.00033, 3]
    ],
    "red_o_points": [],
    "y_categories": ["N", "NOT APPLICABLE", "Y", "nan"],
    "blue_o_points": [],
    "blue_x_points": [
      [0.00524, 1],
      [-0.00024, 3],
      [-0.00025, 2],
      [-0.0007, 2],
      [-0.00025, 3],
      [0.00443, 1],
      [0.00344, 1],
      [-0.00081, 2],
      [-0.00021, 3],
      [-0.00027, 3],
      [-0.00046, 2],
      [0.00427, 1],
      [-0.00018, 3],
      [0.00411, 1],
      [-0.00014, 3]
    ]
  },
  "QS_mulGraftRoot[T1]": {
    "red_x_points": [
      [-2e-5, 2],
      [-3e-5, 0],
      [-3e-5, 0],
      [-3e-5, 0],
      [-3e-5, 0],
      [-3e-5, 0],
      [-2e-5, 2],
      [-3e-5, 0],
      [-2e-5, 2],
      [-3e-5, 0],
      [-2e-5, 2],
      [-3e-5, 0],
      [-2e-5, 2],
      [-2e-5, 2],
      [-2e-5, 2],
      [-2e-5, 2],
      [-2e-5, 2],
      [-3e-5, 0],
      [-3e-5, 0],
      [-2e-5, 2],
      [-2e-5, 2],
      [-3e-5, 0],
      [-2e-5, 2]
    ],
    "red_o_points": [],
    "y_categories": ["N", "NOT APPLICABLE", "nan"],
    "blue_o_points": [],
    "blue_x_points": [
      [0.00013, 1],
      [-2e-5, 2],
      [-3e-5, 0],
      [0.00013, 1],
      [0.00013, 1],
      [-3e-5, 0],
      [-2e-5, 2],
      [-2e-5, 2],
      [-3e-5, 0],
      [0.00013, 1],
      [0.00013, 1],
      [-2e-5, 2]
    ]
  },
  "QS_mulGraftTrunk[MiddleTrunk]": {
    "red_x_points": [
      [1e-5, 2],
      [-0.00019, 0],
      [-0.00011, 0],
      [-2e-5, 0],
      [-7e-5, 0],
      [-6e-5, 0],
      [-7e-5, 0],
      [1e-5, 2],
      [-0.00013, 0],
      [-6e-5, 0],
      [-2e-5, 2],
      [-0.00013, 0],
      [1e-5, 2],
      [-0.00011, 0],
      [-0.00013, 0],
      [-2e-5, 2],
      [-2e-5, 2],
      [-2e-5, 2],
      [-6e-5, 0],
      [-2e-5, 2],
      [-2e-5, 2],
      [-2e-5, 2],
      [-0.00013, 0],
      [-0.00013, 0],
      [-1e-5, 2],
      [0.00028, 1],
      [-1e-5, 2],
      [-8e-5, 0],
      [5e-5, 2]
    ],
    "red_o_points": [],
    "y_categories": ["N", "NOT APPLICABLE", "nan"],
    "blue_o_points": [],
    "blue_x_points": [
      [0.00019, 1],
      [1e-5, 2],
      [-8e-5, 0],
      [-6e-5, 0],
      [5e-5, 2],
      [0.00019, 1],
      [0.00028, 1],
      [-7e-5, 0],
      [2e-5, 2],
      [5e-5, 2],
      [-4e-5, 0],
      [0.00041, 1],
      [-2e-5, 2],
      [0.00041, 1],
      [-1e-5, 2]
    ]
  },
  "QS_mulGraftNerve[Ph]": {
    "red_x_points": [
      [-8e-5, 2],
      [-0.00053, 0],
      [-0.00046, 0],
      [-0.00036, 0],
      [-0.00037, 0],
      [-0.00032, 0],
      [-0.00039, 0],
      [-9e-5, 2],
      [-0.00037, 0],
      [-0.00035, 0],
      [-6e-5, 2],
      [-0.00041, 0],
      [-0.00015, 2],
      [-0.0005, 0],
      [-0.00041, 0],
      [-2e-5, 2],
      [-9e-5, 2],
      [-7e-5, 2],
      [-0.00028, 0],
      [-7e-5, 2],
      [-0.00012, 2],
      [-7e-5, 2],
      [-0.00046, 0],
      [-0.00036, 0],
      [-0.0001, 2],
      [0.00091, 1],
      [-9e-5, 2],
      [-0.0004, 0],
      [-2e-5, 2]
    ],
    "red_o_points": [],
    "y_categories": ["N", "NOT APPLICABLE", "nan"],
    "blue_o_points": [],
    "blue_x_points": [
      [0.00266, 1],
      [-6e-5, 2],
      [-0.00032, 0],
      [-0.00028, 0],
      [-6e-5, 2],
      [0.00131, 1],
      [0.00113, 1],
      [-0.0003, 0],
      [-1e-5, 2],
      [-4e-5, 2],
      [-0.00033, 0],
      [0.00094, 1],
      [-2e-5, 2],
      [0.00146, 1],
      [1e-5, 2]
    ]
  },
  "QA_lstPexMuscstrength[ScapulaElev]": {
    "red_x_points": [
      [0.00012, 0],
      [-0.00056, 2],
      [-0.00082, 2],
      [-0.00053, 2],
      [-0.00228, 1],
      [0.00085, 0],
      [-0.00099, 2],
      [-0.0032, 1],
      [0.00163, 0],
      [-0.00074, 2],
      [-0.00017, 0],
      [-0.00074, 2],
      [-0.00027, 2],
      [-0.00086, 2],
      [0.00027, 0],
      [-7e-5, 0],
      [-0.00017, 0],
      [-0.00016, 0],
      [-0.00046, 2],
      [0.00014, 2],
      [-0.00017, 2],
      [-0.0002, 2],
      [0.00088, 0],
      [0.00056, 0],
      [-0.00024, 2],
      [-0.00023, 2],
      [-0.00029, 2],
      [-0.00125, 1],
      [-0.00023, 2]
    ],
    "red_o_points": [],
    "y_categories": ["GREATER THAN OR EQUALS TO 3", "LESS THAN 3", "nan"],
    "blue_o_points": [],
    "blue_x_points": [
      [-0.00015, 2],
      [-0.00027, 2],
      [0.00147, 0],
      [0.00273, 0],
      [0.00013, 2],
      [1e-5, 2],
      [1e-5, 0],
      [-0.00032, 2],
      [0.00322, 0],
      [0.00011, 2],
      [0.00163, 0],
      [0.00041, 0],
      [0.00016, 2],
      [0.00087, 0],
      [0.00019, 2]
    ]
  },
  "QA_mulInjOrthesisType[ArmSling]": {
    "red_x_points": [
      [-0.00595, 2],
      [-0.00595, 2],
      [-0.00557, 2],
      [-0.00585, 2],
      [-0.00603, 2],
      [-0.00561, 2],
      [-0.00593, 2],
      [-0.00601, 2],
      [-0.00578, 2],
      [-0.00626, 2],
      [-0.00596, 2],
      [-0.00571, 2],
      [-0.00596, 2],
      [-0.00585, 2],
      [-0.01753, 0],
      [-0.0063, 2],
      [-0.00634, 2],
      [-0.01882, 0],
      [-0.01868, 3],
      [-0.00584, 2],
      [-0.00612, 2],
      [-0.00593, 2],
      [-0.006, 2],
      [-0.00586, 2],
      [-0.01894, 3],
      [-0.0193, 3],
      [-0.01885, 3],
      [-0.00565, 2],
      [-0.00596, 2]
    ],
    "red_o_points": [],
    "y_categories": ["N", "NOT APPLICABLE", "Y", "nan"],
    "blue_o_points": [],
    "blue_x_points": [
      [-0.00567, 2],
      [-0.00567, 2],
      [-0.00591, 2],
      [-0.00588, 2],
      [0.03666, 1],
      [0.03558, 1],
      [0.03587, 1],
      [0.03714, 1],
      [-0.0053, 2],
      [0.03683, 1],
      [-0.00573, 2],
      [0.03436, 1],
      [0.03616, 1],
      [0.03607, 1],
      [-0.00595, 2]
    ]
  },
  "QA_mulInjOrthesisType[ShoulderSupport]": {
    "red_x_points": [
      [-0.00548, 0],
      [-0.00529, 0],
      [-0.00534, 0],
      [-0.01953, 2],
      [-0.00543, 0],
      [-0.00526, 0],
      [-0.00533, 0],
      [-0.02048, 2],
      [-0.00534, 0],
      [-0.0053, 0],
      [-0.00531, 0],
      [-0.00555, 0],
      [-0.00534, 0],
      [-0.00546, 0],
      [-0.01968, 2],
      [-0.00535, 0],
      [-0.00534, 0],
      [-0.01954, 2],
      [-0.01899, 3],
      [-0.00513, 0],
      [-0.00528, 0],
      [-0.00513, 0],
      [-0.00533, 0],
      [-0.00511, 0],
      [-0.02032, 3],
      [-0.01992, 3],
      [-0.02046, 3],
      [-0.00549, 0],
      [-0.00539, 0]
    ],
    "red_o_points": [],
    "y_categories": ["N", "NOT APPLICABLE", "Y", "nan"],
    "blue_o_points": [],
    "blue_x_points": [
      [-0.00515, 0],
      [-0.00517, 0],
      [-0.00478, 0],
      [-0.00523, 0],
      [0.03938, 1],
      [0.03593, 1],
      [0.03798, 1],
      [0.03771, 1],
      [-0.00518, 0],
      [0.03945, 1],
      [-0.00522, 0],
      [0.03797, 1],
      [0.03997, 1],
      [0.03824, 1],
      [-0.00497, 0]
    ]
  },
  "QA_yonInjUnconscio": {
    "red_x_points": [
      [-0.01019, 1],
      [-0.01053, 1],
      [-0.00156, 2],
      [-0.00194, 2],
      [-0.00176, 2],
      [-0.01114, 1],
      [-0.00188, 2],
      [-0.00216, 2],
      [-0.00165, 2],
      [-0.01166, 1],
      [-0.01056, 1],
      [-0.01194, 1],
      [-0.00227, 2],
      [-0.00179, 2],
      [-0.00866, 1],
      [-0.01047, 1],
      [-0.01105, 1],
      [-0.00884, 1],
      [-0.00901, 1],
      [-0.01035, 1],
      [-0.00245, 2],
      [-0.00208, 2],
      [-0.01184, 1],
      [-0.01068, 1],
      [-0.00251, 2],
      [-0.00212, 2],
      [-0.00247, 2],
      [-0.00994, 1],
      [-0.00261, 2]
    ],
    "red_o_points": [],
    "y_categories": ["N", "Y", "nan"],
    "blue_o_points": [],
    "blue_x_points": [
      [-0.0012, 2],
      [-0.00148, 2],
      [0.03865, 0],
      [-0.00106, 2],
      [-0.00654, 1],
      [-0.0072, 1],
      [0.02996, 0],
      [0.03356, 0],
      [-0.00186, 2],
      [0.03409, 0],
      [0.03951, 0],
      [-0.00164, 2],
      [-0.00779, 1],
      [-0.00147, 2],
      [0.04058, 0]
    ]
  },
  "QA_lstPexInspectio[SurgicalScar]": {
    "red_x_points": [
      [-0.00297, 1],
      [-0.00394, 1],
      [-0.00518, 0],
      [-0.0032, 1],
      [-0.00528, 1],
      [-0.00862, 0],
      [-0.00442, 1],
      [-0.00223, 1],
      [-0.00719, 1],
      [-0.00765, 1],
      [-0.00574, 0],
      [-0.006, 1],
      [-0.00284, 2],
      [-0.006, 1],
      [-0.00486, 0],
      [0.00349, 2],
      [0.00313, 2],
      [-0.00545, 1],
      [-0.00404, 1],
      [-0.0034, 1],
      [-0.00244, 2],
      [-0.0023, 1],
      [-0.00625, 1],
      [0.01083, 2],
      [-0.00254, 1],
      [-0.00298, 1],
      [-0.00227, 1],
      [0.00639, 2],
      [-0.00255, 1]
    ],
    "red_o_points": [],
    "y_categories": ["ABS", "NAIA", "PT", "nan"],
    "blue_o_points": [],
    "blue_x_points": [
      [-0.00026, 1],
      [0.0086, 2],
      [0.01849, 2],
      [0.02108, 2],
      [0.00108, 1],
      [0.00011, 1],
      [0.00124, 0],
      [-0.00395, 1],
      [0.00167, 1],
      [0.00134, 1],
      [0.01832, 2],
      [-0.00064, 1],
      [0.00779, 2],
      [0.00254, 0],
      [0.00907, 2]
    ]
  },
  "QA_intPexWristFlex": {
    "red_x_points": [
      [-0.00027, 2],
      [-0.00053, 2],
      [-0.0006, 2],
      [-0.00074, 2],
      [-0.00079, 2],
      [-0.00059, 0],
      [-0.0008, 2],
      [0.0004, 0],
      [-0.001, 2],
      [-0.00097, 2],
      [-0.00023, 0],
      [-0.00094, 2],
      [-0.00015, 2],
      [-0.00088, 2],
      [-0.00044, 2],
      [1e-5, 0],
      [-0.0, 0],
      [-5e-5, 0],
      [-0.00048, 0],
      [-0.00025, 2],
      [-0.00021, 2],
      [-0.00021, 2],
      [-0.00097, 2],
      [-0.00087, 2],
      [-4e-5, 2],
      [-0.0225, 1],
      [-0.00228, 1],
      [-0.00036, 0],
      [-0.00019, 2]
    ],
    "red_o_points": [],
    "y_categories": ["GREATER THAN OR EQUALS TO 60", "LESS THAN 60", "nan"],
    "blue_o_points": [],
    "blue_x_points": [
      [0.0041, 2],
      [0.0023, 0],
      [0.00079, 0],
      [-0.00075, 2],
      [-2e-5, 2],
      [0.00408, 2],
      [0.00526, 0],
      [-0.00074, 2],
      [-1e-5, 2],
      [0.0001, 2],
      [0.0123, 1],
      [0.00423, 2],
      [5e-5, 2],
      [0.00451, 2],
      [0.00073, 0]
    ]
  },
  "QS_mulGraftNerve[Me]": {
    "red_x_points": [
      [-4e-5, 2],
      [-0.0006, 0],
      [-0.00052, 0],
      [-0.00042, 0],
      [-0.00034, 0],
      [-0.00038, 0],
      [-0.00051, 0],
      [-3e-5, 2],
      [-0.00049, 0],
      [-0.00031, 0],
      [1e-5, 2],
      [-0.00048, 0],
      [9e-5, 2],
      [-0.00056, 0],
      [-0.00052, 0],
      [-6e-5, 2],
      [-0.0, 2],
      [-6e-5, 2],
      [-0.00025, 0],
      [-5e-5, 2],
      [8e-5, 2],
      [-2e-5, 2],
      [-0.00045, 0],
      [-0.00046, 0],
      [1e-5, 2],
      [0.00088, 1],
      [4e-5, 2],
      [-0.00037, 0],
      [-0.00012, 2]
    ],
    "red_o_points": [],
    "y_categories": ["N", "NOT APPLICABLE", "nan"],
    "blue_o_points": [],
    "blue_x_points": [
      [0.0022, 1],
      [0.0, 2],
      [-0.00023, 0],
      [-0.00031, 0],
      [7e-5, 2],
      [0.00142, 1],
      [0.00097, 1],
      [-0.00023, 0],
      [0.00014, 2],
      [0.00012, 2],
      [-0.00028, 0],
      [0.00082, 1],
      [-2e-5, 2],
      [0.00127, 1],
      [-1e-5, 2]
    ]
  },
  "QS_mulGraftRoot[T2]": {
    "red_x_points": [
      [0.0, 2],
      [-2e-5, 0],
      [-9e-5, 0],
      [-3e-5, 0],
      [-9e-5, 0],
      [-2e-5, 0],
      [-3e-5, 2],
      [-3e-5, 0],
      [-2e-5, 0],
      [0.0, 2],
      [-2e-5, 0],
      [-2e-5, 2],
      [-3e-5, 0],
      [-2e-5, 0],
      [0.0, 2],
      [0.0, 2],
      [0.0, 2],
      [-2e-5, 0],
      [0.0, 2],
      [-2e-5, 2],
      [-2e-5, 2],
      [-2e-5, 0],
      [-3e-5, 2],
      [9e-5, 1],
      [-3e-5, 2],
      [-2e-5, 0]
    ],
    "red_o_points": [],
    "y_categories": ["N", "NOT APPLICABLE", "nan"],
    "blue_o_points": [],
    "blue_x_points": [
      [0.00022, 1],
      [1e-5, 2],
      [-3e-5, 0],
      [0.00017, 1],
      [-2e-5, 2],
      [9e-5, 1],
      [0.0, 2],
      [9e-5, 1]
    ]
  },
  "QS_mulGraftRoot[C7]": {
    "red_x_points": [
      [-1e-5, 2],
      [-2e-5, 0],
      [-2e-5, 0],
      [-2e-5, 0],
      [-2e-5, 0],
      [-2e-5, 0],
      [-1e-5, 2],
      [-2e-5, 0],
      [-1e-5, 2],
      [-2e-5, 0],
      [-1e-5, 2],
      [-2e-5, 0],
      [-1e-5, 2],
      [-1e-5, 2],
      [-1e-5, 2],
      [-1e-5, 2],
      [-1e-5, 2],
      [-1e-5, 2],
      [-2e-5, 0],
      [-2e-5, 0],
      [-1e-5, 2],
      [9e-5, 1],
      [-1e-5, 2]
    ],
    "red_o_points": [],
    "y_categories": ["N", "NOT APPLICABLE", "nan"],
    "blue_o_points": [],
    "blue_x_points": [
      [9e-5, 1],
      [-1e-5, 2],
      [-2e-5, 0],
      [-2e-5, 0],
      [9e-5, 1],
      [-2e-5, 0],
      [-1e-5, 2],
      [-1e-5, 2],
      [9e-5, 1],
      [-1e-5, 2],
      [9e-5, 1],
      [-1e-5, 2]
    ]
  },
  "QS_mulLysisSite[Trunk]": {
    "red_x_points": [
      [-0.00052, 3],
      [-0.00354, 0],
      [-0.00303, 0],
      [-0.00299, 0],
      [-0.0031, 0],
      [-0.01248, 2],
      [-0.00278, 0],
      [-0.00087, 3],
      [-0.00309, 0],
      [-0.00302, 0],
      [-0.00087, 3],
      [-0.00314, 0],
      [-0.00094, 3],
      [-0.00317, 0],
      [-0.0106, 2],
      [-0.00067, 3],
      [-0.00058, 3],
      [-0.00066, 3],
      [-0.0029, 0],
      [-0.00062, 3],
      [-0.00085, 3],
      [-0.00072, 3],
      [-0.00316, 0],
      [-0.00318, 0],
      [-0.00087, 3],
      [0.01233, 1],
      [-0.00089, 3],
      [-0.0111, 2],
      [-0.00087, 3]
    ],
    "red_o_points": [],
    "y_categories": ["N", "NOT APPLICABLE", "Y", "nan"],
    "blue_o_points": [],
    "blue_x_points": [
      [0.02026, 1],
      [-0.00055, 3],
      [-0.00126, 0],
      [-0.00171, 0],
      [-0.00015, 3],
      [0.01617, 1],
      [0.01287, 1],
      [-0.00223, 0],
      [-0.00036, 3],
      [-0.00051, 3],
      [-0.00137, 0],
      [0.01417, 1],
      [-0.0004, 3],
      [0.01427, 1],
      [-0.00029, 3]
    ]
  },
  "QS_mulTransfSite[PhMc]": {
    "red_x_points": [
      [-0.00045, 3],
      [-0.00385, 0],
      [-0.00336, 0],
      [-0.00292, 0],
      [-0.00319, 0],
      [-0.00271, 0],
      [-0.0102, 2],
      [-0.00092, 3],
      [-0.00316, 0],
      [-0.00282, 0],
      [-0.00047, 3],
      [-0.00367, 0],
      [-0.00082, 3],
      [-0.00373, 0],
      [-0.0037, 0],
      [-0.00068, 3],
      [-0.00053, 3],
      [-0.00066, 3],
      [-0.00948, 2],
      [-0.0004, 3],
      [-0.00082, 3],
      [-0.00085, 3],
      [-0.00331, 0],
      [-0.00306, 0],
      [-0.00081, 3],
      [0.0118, 1],
      [-0.00085, 3],
      [-0.00264, 0],
      [-0.00077, 3]
    ],
    "red_o_points": [],
    "y_categories": ["N", "NOT APPLICABLE", "Y", "nan"],
    "blue_o_points": [],
    "blue_x_points": [
      [0.01603, 1],
      [-0.00051, 3],
      [-0.00186, 0],
      [-0.0022, 0],
      [-0.00028, 3],
      [0.01612, 1],
      [0.01106, 1],
      [-0.00268, 0],
      [-0.00067, 3],
      [-0.00049, 3],
      [-0.00216, 0],
      [0.01335, 1],
      [-0.00026, 3],
      [0.01424, 1],
      [-0.00064, 3]
    ]
  },
  "QS_mulLysisSite[Root]": {
    "red_x_points": [
      [-0.00032, 3],
      [-0.00184, 0],
      [-0.00726, 2],
      [-0.0019, 0],
      [-0.00182, 0],
      [-0.00186, 0],
      [-0.00182, 0],
      [-0.00057, 3],
      [-0.00206, 0],
      [-0.00196, 0],
      [-0.00039, 3],
      [-0.00198, 0],
      [-0.0005, 3],
      [-0.0021, 0],
      [-0.00235, 0],
      [-0.00036, 3],
      [-0.00036, 3],
      [-0.00028, 3],
      [-0.00187, 0],
      [-0.00037, 3],
      [-0.00056, 3],
      [-0.00067, 3],
      [-0.00205, 0],
      [-0.0019, 0],
      [-0.00044, 3],
      [0.0066, 1],
      [-0.00045, 3],
      [-0.0067, 2],
      [-0.00051, 3]
    ],
    "red_o_points": [],
    "y_categories": ["N", "NOT APPLICABLE", "Y", "nan"],
    "blue_o_points": [],
    "blue_x_points": [
      [0.01127, 1],
      [-0.00029, 3],
      [-0.00113, 0],
      [-0.00136, 0],
      [2e-5, 3],
      [0.00976, 1],
      [0.00745, 1],
      [-0.00156, 0],
      [-0.00017, 3],
      [-0.00015, 3],
      [-0.00106, 0],
      [0.0082, 1],
      [-0.00024, 3],
      [0.00821, 1],
      [-0.00029, 3]
    ]
  },
  "QS_mulLysisDivision[PDivisionUTrunk]": {
    "red_x_points": [
      [2e-5, 2],
      [-2e-5, 0],
      [-7e-5, 0],
      [-5e-5, 0],
      [-7e-5, 0],
      [-4e-5, 0],
      [-7e-5, 0],
      [-7e-5, 0],
      [-6e-5, 0],
      [2e-5, 2],
      [-6e-5, 0],
      [1e-5, 2],
      [-4e-5, 0],
      [1e-5, 2],
      [2e-5, 2],
      [1e-5, 2],
      [1e-5, 2],
      [1e-5, 2],
      [0.0, 2],
      [-2e-5, 0],
      [-6e-5, 0],
      [0.0, 2],
      [8e-5, 1],
      [0.0, 2],
      [-6e-5, 0],
      [1e-5, 2]
    ],
    "red_o_points": [],
    "y_categories": ["N", "NOT APPLICABLE", "nan"],
    "blue_o_points": [],
    "blue_x_points": [
      [0.00023, 1],
      [1e-5, 2],
      [-2e-5, 0],
      [1e-5, 2],
      [0.00016, 1],
      [1e-5, 2],
      [-2e-5, 0],
      [1e-5, 2],
      [8e-5, 1],
      [1e-5, 2]
    ]
  },
  "QS_mulGraftNerve[other]": {
    "red_x_points": [
      [-8e-5, 2],
      [-0.00082, 0],
      [-0.00076, 0],
      [-0.00056, 0],
      [-0.00055, 0],
      [-0.0006, 0],
      [-0.00054, 0],
      [-0.00015, 2],
      [-0.00069, 0],
      [-0.0007, 0],
      [-8e-5, 2],
      [-0.00056, 0],
      [-0.00012, 2],
      [-0.0009, 0],
      [-0.00058, 0],
      [-8e-5, 2],
      [-7e-5, 2],
      [-0.00012, 2],
      [-0.00056, 0],
      [-7e-5, 2],
      [-3e-5, 2],
      [-0.00014, 2],
      [-0.00066, 0],
      [-0.00063, 0],
      [-7e-5, 2],
      [0.00174, 1],
      [-0.00011, 2],
      [-0.00065, 0],
      [-8e-5, 2]
    ],
    "red_o_points": [],
    "y_categories": ["N", "NOT APPLICABLE", "nan"],
    "blue_o_points": [],
    "blue_x_points": [
      [0.00317, 1],
      [-0.00012, 2],
      [-0.00026, 0],
      [-0.00059, 0],
      [6e-5, 2],
      [0.00235, 1],
      [0.00165, 1],
      [-0.00054, 0],
      [-7e-5, 2],
      [6e-5, 2],
      [-0.0004, 0],
      [0.00215, 1],
      [3e-5, 2],
      [0.0018, 1],
      [-8e-5, 2]
    ]
  },
  "QS_mulGraftNerve[DS]": {
    "red_x_points": [
      [-0.0, 2],
      [-0.0001, 0],
      [-7e-5, 0],
      [-4e-5, 0],
      [-7e-5, 0],
      [-3e-5, 0],
      [-7e-5, 0],
      [1e-5, 2],
      [-9e-5, 0],
      [-4e-5, 0],
      [-0.0, 2],
      [-4e-5, 0],
      [-0.0, 2],
      [-0.00015, 0],
      [-7e-5, 0],
      [-2e-5, 2],
      [-2e-5, 2],
      [-2e-5, 2],
      [-2e-5, 0],
      [-1e-5, 2],
      [-2e-5, 2],
      [2e-5, 2],
      [-9e-5, 0],
      [-9e-5, 0],
      [-2e-5, 2],
      [5e-5, 1],
      [-2e-5, 2],
      [-4e-5, 0],
      [0.0, 2]
    ],
    "red_o_points": [],
    "y_categories": ["N", "NOT APPLICABLE", "nan"],
    "blue_o_points": [],
    "blue_x_points": [
      [0.00061, 1],
      [2e-5, 2],
      [-4e-5, 0],
      [-4e-5, 0],
      [0.0, 2],
      [0.00018, 1],
      [-7e-5, 0],
      [2e-5, 2],
      [0.0, 2],
      [-4e-5, 0],
      [0.00013, 1],
      [-2e-5, 2],
      [0.00026, 1],
      [-1e-5, 2]
    ]
  },
  "QS_mulGraftNerve[LP]": {
    "red_x_points": [
      [1e-5, 2],
      [-0.00027, 0],
      [-0.00018, 0],
      [-0.00023, 0],
      [-0.00025, 0],
      [-0.00014, 0],
      [-0.00026, 0],
      [-9e-5, 2],
      [-0.00031, 0],
      [-0.00027, 0],
      [2e-5, 2],
      [-0.00029, 0],
      [-3e-5, 2],
      [-0.00027, 0],
      [-0.00024, 0],
      [1e-5, 2],
      [-0.0, 2],
      [1e-5, 2],
      [-0.00019, 0],
      [-1e-5, 2],
      [-1e-5, 2],
      [-2e-5, 2],
      [-0.00027, 0],
      [-0.00027, 0],
      [-2e-5, 2],
      [0.00056, 1],
      [-3e-5, 2],
      [-0.00017, 0],
      [-2e-5, 2]
    ],
    "red_o_points": [],
    "y_categories": ["N", "NOT APPLICABLE", "nan"],
    "blue_o_points": [],
    "blue_x_points": [
      [0.00103, 1],
      [-2e-5, 2],
      [-0.00015, 0],
      [-0.0002, 0],
      [1e-5, 2],
      [0.00089, 1],
      [0.0006, 1],
      [-7e-5, 0],
      [-2e-5, 2],
      [-1e-5, 2],
      [-0.00019, 0],
      [0.00083, 1],
      [2e-5, 2],
      [0.00051, 1],
      [-1e-5, 2]
    ]
  },
  "QA_lstPexMuscstrength[WristFlex]": {
    "red_x_points": [
      [-0.00248, 1],
      [-0.00171, 2],
      [-0.00266, 1],
      [0.00108, 0],
      [-0.00341, 1],
      [0.00097, 0],
      [-0.00255, 1],
      [-0.00095, 0],
      [0.00199, 0],
      [0.00104, 0],
      [-0.00125, 0],
      [0.00114, 0],
      [-0.00176, 2],
      [-0.00316, 2],
      [-0.00073, 2],
      [-0.00441, 0],
      [-6e-5, 1],
      [-0.00738, 0],
      [-0.00209, 1],
      [-0.00337, 0],
      [-0.00175, 2],
      [-0.00057, 0],
      [0.00108, 0],
      [0.00135, 0],
      [-0.00193, 2],
      [-0.00079, 2],
      [-0.00143, 1],
      [-0.00166, 1],
      [-0.00245, 2]
    ],
    "red_o_points": [],
    "y_categories": ["GREATER THAN OR EQUALS TO 3", "LESS THAN 3", "nan"],
    "blue_o_points": [],
    "blue_x_points": [
      [0.00107, 0],
      [0.0019, 0],
      [0.00192, 0],
      [0.00278, 0],
      [0.00101, 2],
      [-5e-5, 2],
      [0.00018, 0],
      [0.00148, 0],
      [0.00314, 0],
      [0.00107, 2],
      [0.00197, 0],
      [0.00083, 0],
      [0.01138, 1],
      [0.00075, 0],
      [0.01049, 1]
    ]
  },
  "QS_mulNeuromadSite[C5]": {
    "red_x_points": [
      [-0.00019, 2],
      [-0.00148, 0],
      [-0.00121, 0],
      [-0.0009, 0],
      [-0.001, 0],
      [-0.00098, 0],
      [-0.00128, 0],
      [-0.00034, 2],
      [-0.00133, 0],
      [-0.00082, 0],
      [-0.00022, 2],
      [-0.00113, 0],
      [-0.00019, 2],
      [-0.00145, 0],
      [-0.00134, 0],
      [-0.00021, 2],
      [-0.00016, 2],
      [-0.00021, 2],
      [-0.00093, 0],
      [-0.00018, 2],
      [-0.0003, 2],
      [-0.00028, 2],
      [-0.00125, 0],
      [-0.00115, 0],
      [-0.00028, 2],
      [0.0029, 1],
      [-0.00034, 2],
      [-0.00097, 0],
      [-0.00026, 2]
    ],
    "red_o_points": [],
    "y_categories": ["N", "NOT APPLICABLE", "nan"],
    "blue_o_points": [],
    "blue_x_points": [
      [0.00485, 1],
      [-0.00021, 2],
      [-0.00068, 0],
      [-0.00091, 0],
      [1e-5, 2],
      [0.00517, 1],
      [0.00276, 1],
      [-0.00066, 0],
      [-0.00026, 2],
      [-0.00013, 2],
      [-0.00072, 0],
      [0.00423, 1],
      [-9e-5, 2],
      [0.00438, 1],
      [-0.00024, 2]
    ]
  },
  "QS_mulNeuromadSite[C7]": {
    "red_x_points": [
      [-0.0001, 2],
      [-0.00111, 0],
      [-0.00083, 0],
      [-0.00072, 0],
      [-0.00085, 0],
      [-0.00071, 0],
      [-0.00081, 0],
      [-0.00011, 2],
      [-0.00087, 0],
      [-0.00062, 0],
      [-0.00029, 2],
      [-0.00083, 0],
      [-0.00012, 2],
      [-0.00107, 0],
      [-0.00099, 0],
      [-0.00017, 2],
      [-7e-5, 2],
      [-7e-5, 2],
      [-0.00057, 0],
      [-0.00012, 2],
      [-0.00014, 2],
      [-0.00013, 2],
      [-0.0009, 0],
      [-0.00081, 0],
      [-0.00013, 2],
      [0.00228, 1],
      [-0.00015, 2],
      [-0.00064, 0],
      [-0.00012, 2]
    ],
    "red_o_points": [],
    "y_categories": ["N", "NOT APPLICABLE", "nan"],
    "blue_o_points": [],
    "blue_x_points": [
      [0.0042, 1],
      [-4e-5, 2],
      [-0.00051, 0],
      [-0.00053, 0],
      [-7e-5, 2],
      [0.00256, 1],
      [0.00234, 1],
      [-0.00074, 0],
      [-0.0001, 2],
      [-4e-5, 2],
      [-0.00048, 0],
      [0.00273, 1],
      [-6e-5, 2],
      [0.00251, 1],
      [1e-5, 2]
    ]
  },
  "QA_lstPexMuscstrength[WristExte]": {
    "red_x_points": [
      [-0.00453, 1],
      [-0.00326, 2],
      [-0.00366, 1],
      [-0.0036, 1],
      [-0.00535, 1],
      [-0.00484, 1],
      [-0.00454, 1],
      [-0.00035, 0],
      [0.00583, 0],
      [-0.00757, 1],
      [0.00033, 0],
      [0.00461, 0],
      [-0.0016, 2],
      [-0.00477, 2],
      [-0.00259, 2],
      [-0.00113, 0],
      [-0.00156, 1],
      [-0.00104, 0],
      [-0.00399, 1],
      [-0.00418, 1],
      [-0.00117, 2],
      [-0.00462, 1],
      [0.00488, 0],
      [0.00435, 0],
      [-0.00131, 2],
      [-0.00115, 2],
      [-0.00359, 1],
      [-0.00289, 1],
      [-0.00117, 2]
    ],
    "red_o_points": [],
    "y_categories": ["GREATER THAN OR EQUALS TO 3", "LESS THAN 3", "nan"],
    "blue_o_points": [],
    "blue_x_points": [
      [0.00253, 0],
      [0.00162, 1],
      [0.00706, 0],
      [0.00799, 0],
      [0.00141, 2],
      [-0.0002, 2],
      [0.00114, 0],
      [0.00686, 0],
      [0.00986, 0],
      [0.00112, 2],
      [0.00552, 0],
      [0.0, 1],
      [0.00407, 0],
      [0.00187, 0],
      [0.00359, 1]
    ]
  },
  "QS_mulGraftNerve[TD]": {
    "red_x_points": [
      [-3e-5, 2],
      [-0.00011, 0],
      [-8e-5, 0],
      [-9e-5, 0],
      [-6e-5, 0],
      [-8e-5, 0],
      [-7e-5, 0],
      [0.0, 2],
      [-0.00012, 0],
      [-0.00012, 0],
      [-1e-5, 2],
      [-0.00011, 0],
      [-2e-5, 2],
      [-0.00011, 0],
      [-8e-5, 0],
      [-1e-5, 2],
      [-1e-5, 2],
      [-1e-5, 2],
      [-3e-5, 0],
      [-2e-5, 2],
      [-3e-5, 2],
      [-3e-5, 2],
      [-3e-5, 0],
      [-5e-5, 0],
      [-1e-5, 2],
      [0.00027, 1],
      [-1e-5, 2],
      [-3e-5, 0],
      [-2e-5, 2]
    ],
    "red_o_points": [],
    "y_categories": ["N", "NOT APPLICABLE", "nan"],
    "blue_o_points": [],
    "blue_x_points": [
      [0.0006, 1],
      [-1e-5, 2],
      [-3e-5, 0],
      [-6e-5, 0],
      [-1e-5, 2],
      [0.00018, 1],
      [0.00018, 1],
      [-8e-5, 0],
      [-3e-5, 2],
      [-1e-5, 2],
      [-8e-5, 0],
      [0.00027, 1],
      [-1e-5, 2],
      [0.00018, 1],
      [-0.0, 2]
    ]
  },
  "QS_mulGraftNerve[SS]": {
    "red_x_points": [
      [-5e-5, 2],
      [-0.00031, 0],
      [-0.00039, 0],
      [-0.00025, 0],
      [-0.00032, 0],
      [-0.00034, 0],
      [-0.00031, 0],
      [-9e-5, 2],
      [-0.00016, 0],
      [-0.00033, 0],
      [-6e-5, 2],
      [-0.00034, 0],
      [-6e-5, 2],
      [-0.00039, 0],
      [-0.00028, 0],
      [-6e-5, 2],
      [-3e-5, 2],
      [-3e-5, 2],
      [-0.00032, 0],
      [-0.00015, 2],
      [-5e-5, 2],
      [-6e-5, 2],
      [-0.00021, 0],
      [-0.00025, 0],
      [-9e-5, 2],
      [0.0011, 1],
      [-9e-5, 2],
      [-0.00024, 0],
      [-0.0001, 2]
    ],
    "red_o_points": [],
    "y_categories": ["N", "NOT APPLICABLE", "nan"],
    "blue_o_points": [],
    "blue_x_points": [
      [0.00121, 1],
      [-6e-5, 2],
      [-0.00024, 0],
      [-0.00025, 0],
      [-1e-5, 2],
      [0.00113, 1],
      [0.00115, 1],
      [-0.00026, 0],
      [-9e-5, 2],
      [-6e-5, 2],
      [-0.00027, 0],
      [0.0012, 1],
      [-2e-5, 2],
      [0.00091, 1],
      [-6e-5, 2]
    ]
  },
  "QS_mulGraftLevel[Nerve]": {
    "red_x_points": [
      [-2e-5, 0],
      [-2e-5, 0],
      [-2e-5, 0],
      [-2e-5, 0],
      [-2e-5, 0],
      [-0.0, 2],
      [-2e-5, 0],
      [-2e-5, 0],
      [-0.0, 2],
      [-2e-5, 0],
      [-0.0, 2],
      [-2e-5, 0],
      [-0.0, 2],
      [-0.0, 2],
      [-2e-5, 0],
      [-0.0, 2],
      [-0.0, 2],
      [-2e-5, 0],
      [-2e-5, 0],
      [-0.0, 2],
      [-0.0, 2],
      [-2e-5, 0],
      [-0.0, 2]
    ],
    "red_o_points": [],
    "y_categories": ["N", "NOT APPLICABLE", "nan"],
    "blue_o_points": [],
    "blue_x_points": [
      [-0.0, 2],
      [-2e-5, 0],
      [-2e-5, 0],
      [-0.0, 2],
      [0.00013, 1],
      [0.00013, 1],
      [-2e-5, 0],
      [-0.0, 2],
      [-0.0, 2],
      [-2e-5, 0],
      [-0.0, 2],
      [0.00013, 1]
    ]
  },
  "QA_lstPexArthre[Index]": {
    "red_x_points": [
      [-0.00977, 0],
      [-0.00462, 2],
      [-0.0038, 2],
      [-0.0061, 0],
      [-0.00793, 0],
      [0.00711, 1],
      [-0.00746, 0],
      [0.00053, 2],
      [0.00847, 1],
      [-0.00956, 0],
      [0.00232, 1],
      [-0.00618, 2],
      [0.00033, 2],
      [0.00798, 1],
      [-0.00353, 2],
      [0.00238, 1],
      [-0.00687, 0],
      [0.00188, 1],
      [-0.00456, 2],
      [-0.0088, 0],
      [0.00034, 2],
      [0.00033, 2],
      [-0.00621, 2],
      [-0.0055, 2],
      [0.00182, 1],
      [-0.0007, 2],
      [0.00022, 2],
      [-0.00586, 0],
      [0.00044, 2]
    ],
    "red_o_points": [],
    "y_categories": ["NPV", "PV", "nan"],
    "blue_o_points": [],
    "blue_x_points": [
      [0.00023, 0],
      [0.00125, 2],
      [0.01181, 1],
      [0.01227, 1],
      [0.00157, 2],
      [-0.00019, 2],
      [0.00166, 1],
      [0.01095, 1],
      [0.0012, 2],
      [0.00107, 2],
      [0.01092, 1],
      [0.00188, 1],
      [0.00408, 1],
      [-0.00024, 2],
      [0.00483, 1]
    ]
  },
  "QS_mulLysisRoot[C7]": {
    "red_x_points": [
      [-0.00011, 3],
      [-0.00187, 0],
      [-0.00528, 2],
      [-0.00133, 0],
      [-0.00136, 0],
      [-0.0014, 0],
      [-0.00166, 0],
      [-0.00027, 3],
      [-0.00164, 0],
      [-0.00135, 0],
      [-0.00018, 3],
      [-0.00142, 0],
      [-0.0003, 3],
      [-0.00171, 0],
      [-0.00149, 0],
      [-0.00015, 3],
      [-0.00014, 3],
      [-0.00021, 3],
      [-0.0013, 0],
      [-0.00019, 3],
      [-0.00025, 3],
      [-0.00029, 3],
      [-0.00145, 0],
      [-0.00133, 0],
      [-0.00033, 3],
      [0.00426, 1],
      [-0.00029, 3],
      [-0.00132, 0],
      [-0.00022, 3]
    ],
    "red_o_points": [],
    "y_categories": ["N", "NOT APPLICABLE", "Y", "nan"],
    "blue_o_points": [],
    "blue_x_points": [
      [0.00718, 1],
      [-0.00016, 3],
      [-0.0007, 0],
      [-0.0012, 0],
      [0.0, 3],
      [0.00553, 1],
      [0.00528, 1],
      [-0.00125, 0],
      [-0.00019, 3],
      [-3e-5, 3],
      [-0.00092, 0],
      [0.00551, 1],
      [-6e-5, 3],
      [0.00563, 1],
      [-2e-5, 3]
    ]
  },
  "QA_yonInjBpsurg": {
    "red_x_points": [
      [-0.00066, 1],
      [-0.00069, 1],
      [-0.00055, 1],
      [-0.00064, 1],
      [-0.00085, 1],
      [-0.00049, 1],
      [-0.00075, 1],
      [-0.00075, 1],
      [-0.00082, 1],
      [-0.00055, 1],
      [-0.00074, 1],
      [-0.00049, 1],
      [-0.00093, 1],
      [-0.00083, 1],
      [-0.00056, 1],
      [-0.00064, 1],
      [-0.00062, 1],
      [-0.00057, 1],
      [-0.0005, 1],
      [-0.00058, 1],
      [-0.00102, 1],
      [-0.00077, 1],
      [-0.00058, 1],
      [-0.00061, 1],
      [-0.00076, 1],
      [0.00319, 0],
      [-0.00084, 1],
      [-0.00043, 1],
      [-0.00082, 1]
    ],
    "red_o_points": [],
    "y_categories": ["N", "Y", "nan"],
    "blue_o_points": [],
    "blue_x_points": [
      [0.00573, 0],
      [-0.00057, 1],
      [-0.00066, 1],
      [-0.00098, 1],
      [-0.00044, 1],
      [0.00349, 0],
      [0.00332, 0],
      [-0.00061, 1],
      [-0.00055, 1],
      [-0.00038, 1],
      [-0.00067, 1],
      [0.00439, 0],
      [-0.00052, 1],
      [0.00469, 0],
      [-0.00039, 1]
    ]
  },
  "QS_mulNeuromadSite[T1]": {
    "red_x_points": [
      [-2e-5, 2],
      [-0.00151, 0],
      [-0.00094, 0],
      [-0.00105, 0],
      [-0.0011, 0],
      [-0.00101, 0],
      [-0.0012, 0],
      [-0.00035, 2],
      [-0.00126, 0],
      [-0.00091, 0],
      [-0.00016, 2],
      [-0.00117, 0],
      [-0.00016, 2],
      [-0.00132, 0],
      [-0.00121, 0],
      [-0.00019, 2],
      [-0.00011, 2],
      [-0.00017, 2],
      [-0.00095, 0],
      [-0.00021, 2],
      [-0.0002, 2],
      [-0.00034, 2],
      [-0.00102, 0],
      [-0.00107, 0],
      [-0.00021, 2],
      [0.00252, 1],
      [-0.00017, 2],
      [-0.00105, 0],
      [-0.00022, 2]
    ],
    "red_o_points": [],
    "y_categories": ["N", "NOT APPLICABLE", "nan"],
    "blue_o_points": [],
    "blue_x_points": [
      [0.00511, 1],
      [-0.00019, 2],
      [-0.00061, 0],
      [-0.00066, 0],
      [4e-5, 2],
      [0.0047, 1],
      [0.00299, 1],
      [-0.00072, 0],
      [-0.00011, 2],
      [-1e-5, 2],
      [-0.00065, 0],
      [0.00368, 1],
      [-2e-5, 2],
      [0.00341, 1],
      [-0.00019, 2]
    ]
  },
  "QS_mulBpsurgeryType[Graft]": {
    "red_x_points": [
      [-0.00024, 3],
      [-0.00146, 0],
      [-0.00121, 0],
      [-0.00106, 0],
      [-0.00119, 0],
      [-0.00092, 0],
      [-0.00117, 0],
      [-0.00024, 3],
      [-0.00101, 0],
      [-0.00105, 0],
      [-0.0003, 3],
      [-0.00119, 0],
      [-0.00027, 3],
      [-0.00505, 2],
      [-0.00136, 0],
      [-0.00032, 3],
      [-0.00026, 3],
      [-0.00031, 3],
      [-0.00114, 0],
      [-0.00021, 3],
      [-0.00024, 3],
      [-0.00019, 3],
      [-0.00118, 0],
      [-0.00126, 0],
      [-0.0004, 3],
      [0.00383, 1],
      [-0.00024, 3],
      [-0.00107, 0],
      [-0.00029, 3]
    ],
    "red_o_points": [],
    "y_categories": ["N", "NOT APPLICABLE", "Y", "nan"],
    "blue_o_points": [],
    "blue_x_points": [
      [0.00649, 1],
      [-0.00026, 3],
      [-0.00059, 0],
      [-0.00084, 0],
      [-0.00011, 3],
      [0.00475, 1],
      [0.0043, 1],
      [-0.00071, 0],
      [-0.00015, 3],
      [-5e-5, 3],
      [-0.00059, 0],
      [0.00482, 1],
      [-0.00019, 3],
      [0.00447, 1],
      [-0.00033, 3]
    ]
  },
  "QS_mulLysisRoot[C6]": {
    "red_x_points": [
      [-0.00047, 3],
      [-0.00383, 0],
      [-0.01038, 2],
      [-0.00287, 0],
      [-0.00316, 0],
      [-0.00298, 0],
      [-0.00319, 0],
      [-0.0006, 3],
      [-0.0031, 0],
      [-0.00299, 0],
      [-0.00062, 3],
      [-0.00323, 0],
      [-0.00073, 3],
      [-0.00412, 0],
      [-0.00387, 0],
      [-0.00051, 3],
      [-0.00038, 3],
      [-0.00039, 3],
      [-0.00311, 0],
      [-0.00041, 3],
      [-0.00055, 3],
      [-0.0007, 3],
      [-0.00358, 0],
      [-0.00321, 0],
      [-0.00057, 3],
      [0.01071, 1],
      [-0.00057, 3],
      [-0.00928, 2],
      [-0.0006, 3]
    ],
    "red_o_points": [],
    "y_categories": ["N", "NOT APPLICABLE", "Y", "nan"],
    "blue_o_points": [],
    "blue_x_points": [
      [0.01726, 1],
      [6e-5, 3],
      [-0.00185, 0],
      [-0.00219, 0],
      [1e-5, 3],
      [0.01375, 1],
      [0.01077, 1],
      [-0.00222, 0],
      [-0.00018, 3],
      [-0.00013, 3],
      [-0.00172, 0],
      [0.01327, 1],
      [-0.00022, 3],
      [0.01304, 1],
      [-0.00033, 3]
    ]
  },
  "QA_lstPexPalle[Clavicle]": {
    "red_x_points": [
      [-0.00018, 3],
      [-0.00165, 3],
      [-0.00071, 3],
      [0.00139, 2],
      [-0.00154, 3],
      [0.00182, 2],
      [-0.00122, 3],
      [1e-5, 3],
      [-0.00219, 3],
      [0.00252, 2],
      [-0.01153, 0],
      [-0.00204, 3],
      [-0.0002, 3],
      [-0.00183, 3],
      [-0.00084, 3],
      [-0.01284, 0],
      [-0.01076, 0],
      [0.00873, 2],
      [-0.00308, 1],
      [-0.01225, 1],
      [-0.00011, 3],
      [-0.0003, 3],
      [-0.00272, 3],
      [-0.00261, 3],
      [-0.00017, 3],
      [-0.02259, 2],
      [-8e-5, 3],
      [-0.00117, 0],
      [-0.00011, 3]
    ],
    "red_o_points": [],
    "y_categories": ["HYPO", "NAIA", "PT", "nan"],
    "blue_o_points": [],
    "blue_x_points": [
      [0.00407, 3],
      [0.00061, 3],
      [0.00525, 2],
      [0.0065, 2],
      [0.00065, 3],
      [0.00419, 3],
      [0.00576, 0],
      [-0.00145, 3],
      [0.00066, 3],
      [0.00045, 3],
      [0.0085, 0],
      [0.00421, 3],
      [0.01413, 2],
      [0.00436, 3],
      [0.02034, 2]
    ]
  },
  "QS_mulGraftNerve[LT]": {
    "red_x_points": [
      [-4e-5, 2],
      [-0.00013, 0],
      [-0.00018, 0],
      [-0.00014, 0],
      [-0.00018, 0],
      [-0.00013, 0],
      [-0.00016, 0],
      [-4e-5, 2],
      [-0.0001, 0],
      [-0.0001, 0],
      [-6e-5, 2],
      [-0.0002, 0],
      [-3e-5, 2],
      [-0.00017, 0],
      [-0.00022, 0],
      [-6e-5, 2],
      [-2e-5, 2],
      [-6e-5, 2],
      [-0.00013, 0],
      [-2e-5, 2],
      [-4e-5, 2],
      [2e-5, 2],
      [-0.00016, 0],
      [-0.00018, 0],
      [0.0, 2],
      [0.00015, 1],
      [2e-5, 2],
      [-0.00013, 0],
      [0.0, 2]
    ],
    "red_o_points": [],
    "y_categories": ["N", "NOT APPLICABLE", "nan"],
    "blue_o_points": [],
    "blue_x_points": [
      [0.00071, 1],
      [2e-5, 2],
      [-7e-5, 0],
      [-0.00013, 0],
      [0.0, 2],
      [0.00059, 1],
      [0.00071, 1],
      [-0.00019, 0],
      [-3e-5, 2],
      [4e-5, 2],
      [-0.00013, 0],
      [0.00026, 1],
      [-4e-5, 2],
      [0.0008, 1],
      [-1e-5, 2]
    ]
  },
  "QA_yonInjPhysio": {
    "red_x_points": [
      [-0.00706, 0],
      [0.00041, 0],
      [0.00037, 0],
      [0.00042, 0],
      [-0.00147, 2],
      [0.00063, 0],
      [0.00042, 0],
      [-0.00466, 0],
      [0.00067, 0],
      [-0.00609, 1],
      [-0.00446, 0],
      [0.00106, 0],
      [-0.0056, 0],
      [-0.00426, 1],
      [-0.00154, 1],
      [0.00244, 1],
      [-0.00476, 0],
      [0.00375, 1],
      [0.00026, 0],
      [-0.00556, 0],
      [0.00325, 1],
      [0.00374, 1],
      [0.00105, 0],
      [-0.00551, 1],
      [-0.00724, 2],
      [-0.01105, 1],
      [-0.00791, 2],
      [0.00017, 0],
      [0.00482, 1]
    ],
    "red_o_points": [],
    "y_categories": ["N", "Y", "nan"],
    "blue_o_points": [],
    "blue_x_points": [
      [0.00394, 0],
      [0.00632, 1],
      [0.00387, 0],
      [0.00511, 0],
      [0.00658, 1],
      [0.00354, 0],
      [0.00277, 0],
      [0.00175, 0],
      [-0.00129, 0],
      [0.00557, 1],
      [0.00322, 0],
      [0.00334, 0],
      [0.00465, 1],
      [-0.00205, 1],
      [0.00641, 1]
    ]
  },
  "QA_lstPexTouch[C7]": {
    "red_x_points": [
      [-0.00153, 1],
      [-0.00733, 2],
      [-0.00318, 1],
      [-0.0031, 1],
      [-0.00876, 2],
      [-0.00427, 1],
      [-0.00444, 1],
      [-0.00346, 0],
      [-0.00596, 1],
      [-0.00628, 1],
      [-0.00106, 1],
      [-0.01038, 2],
      [-0.00182, 2],
      [-0.00943, 2],
      [-0.00564, 2],
      [-0.00169, 0],
      [-0.0016, 1],
      [-0.00195, 0],
      [-0.00695, 2],
      [-0.00243, 0],
      [-0.00165, 2],
      [-0.005, 0],
      [-0.00632, 1],
      [-0.00936, 2],
      [-0.0038, 0],
      [-0.00268, 1],
      [-0.00051, 2],
      [-0.00256, 1],
      [-0.0003, 1]
    ],
    "red_o_points": [],
    "y_categories": ["NORM", "NPV", "nan"],
    "blue_o_points": [],
    "blue_x_points": [
      [-7e-5, 1],
      [0.00623, 1],
      [0.03194, 0],
      [0.03421, 0],
      [0.00561, 2],
      [0.00013, 2],
      [-0.00025, 1],
      [-0.00294, 1],
      [0.00815, 1],
      [0.00496, 2],
      [0.03014, 0],
      [2e-5, 1],
      [0.00015, 0],
      [0.00247, 0],
      [0.00271, 0]
    ]
  },
  "QS_mulGraftNerve[IS]": {
    "red_x_points": [
      [-2e-5, 2],
      [-6e-5, 0],
      [-8e-5, 0],
      [-0.00011, 0],
      [-9e-5, 0],
      [-6e-5, 0],
      [-8e-5, 0],
      [-6e-5, 2],
      [-6e-5, 0],
      [-0.00014, 0],
      [-2e-5, 2],
      [-9e-5, 0],
      [0.0, 2],
      [-8e-5, 0],
      [-6e-5, 0],
      [-3e-5, 2],
      [-2e-5, 2],
      [-2e-5, 2],
      [-3e-5, 0],
      [-2e-5, 2],
      [-2e-5, 2],
      [-1e-5, 2],
      [-9e-5, 0],
      [-7e-5, 0],
      [-1e-5, 2],
      [0.00018, 1],
      [-2e-5, 2],
      [-9e-5, 0],
      [-2e-5, 2]
    ],
    "red_o_points": [],
    "y_categories": ["N", "NOT APPLICABLE", "nan"],
    "blue_o_points": [],
    "blue_x_points": [
      [0.00063, 1],
      [1e-5, 2],
      [-9e-5, 0],
      [-6e-5, 0],
      [-2e-5, 2],
      [0.00031, 1],
      [0.00022, 1],
      [-7e-5, 0],
      [-1e-5, 2],
      [-1e-5, 2],
      [-8e-5, 0],
      [9e-5, 1],
      [-1e-5, 2],
      [0.00031, 1],
      [-2e-5, 2]
    ]
  },
  "QS_mulGraftNerve[MC]": {
    "red_x_points": [
      [-2e-5, 2],
      [-0.00037, 0],
      [-0.00029, 0],
      [-0.00023, 0],
      [-0.00025, 0],
      [-0.00022, 0],
      [-0.00016, 0],
      [-4e-5, 2],
      [-0.00026, 0],
      [-0.0002, 0],
      [-0.0, 2],
      [-0.0002, 0],
      [-1e-5, 2],
      [-0.00043, 0],
      [-0.00045, 0],
      [1e-5, 2],
      [-1e-5, 2],
      [-1e-5, 2],
      [-8e-5, 0],
      [-2e-5, 2],
      [-4e-5, 2],
      [-2e-5, 2],
      [-0.00023, 0],
      [-0.00016, 0],
      [-2e-5, 2],
      [0.00055, 1],
      [-2e-5, 2],
      [-0.0002, 0],
      [7e-5, 2]
    ],
    "red_o_points": [],
    "y_categories": ["N", "NOT APPLICABLE", "nan"],
    "blue_o_points": [],
    "blue_x_points": [
      [0.00123, 1],
      [-1e-5, 2],
      [-0.0002, 0],
      [-8e-5, 0],
      [0.00016, 2],
      [0.00094, 1],
      [0.00047, 1],
      [-0.00014, 0],
      [1e-5, 2],
      [8e-5, 2],
      [-0.00018, 0],
      [0.00065, 1],
      [0.0, 2],
      [0.00042, 1],
      [-4e-5, 2]
    ]
  },
  "QS_mulGraftRoot[C8]": {
    "red_x_points": [
      [-0.0, 2],
      [-4e-5, 0],
      [-4e-5, 0],
      [-4e-5, 0],
      [-4e-5, 0],
      [-0.0, 2],
      [-4e-5, 0],
      [-4e-5, 0],
      [-4e-5, 0],
      [-0.0, 2],
      [-4e-5, 0],
      [-0.0, 2],
      [-0.0, 2],
      [-4e-5, 0],
      [-0.0, 2],
      [-0.0, 2],
      [-0.0, 2],
      [-4e-5, 0],
      [-4e-5, 0],
      [-0.0, 2],
      [0.0001, 1],
      [-4e-5, 0],
      [-0.0, 2]
    ],
    "red_o_points": [],
    "y_categories": ["N", "NOT APPLICABLE", "nan"],
    "blue_o_points": [],
    "blue_x_points": [
      [0.0001, 1],
      [-0.0, 2],
      [-4e-5, 0],
      [-4e-5, 0],
      [-0.0, 2],
      [0.0001, 1],
      [0.0001, 1],
      [-0.0, 2],
      [-0.0, 2],
      [0.0001, 1],
      [-0.0, 2],
      [0.0001, 1]
    ]
  },
  "QS_mulGraftLevel[Trunk]": {
    "red_x_points": [
      [-0.00023, 3],
      [-0.00257, 0],
      [-0.00197, 0],
      [-0.00164, 0],
      [-0.00199, 0],
      [-0.00167, 0],
      [-0.00197, 0],
      [-0.00032, 3],
      [-0.00182, 0],
      [-0.00185, 0],
      [-0.00045, 3],
      [-0.0022, 0],
      [-0.0003, 3],
      [-0.00681, 2],
      [-0.00209, 0],
      [-0.00058, 3],
      [-0.00023, 3],
      [-0.00064, 3],
      [-0.00172, 0],
      [-0.00036, 3],
      [-0.00029, 3],
      [-0.00026, 3],
      [-0.00216, 0],
      [-0.00201, 0],
      [-0.00053, 3],
      [0.00585, 1],
      [-0.00034, 3],
      [-0.0017, 0],
      [-0.00029, 3]
    ],
    "red_o_points": [],
    "y_categories": ["N", "NOT APPLICABLE", "Y", "nan"],
    "blue_o_points": [],
    "blue_x_points": [
      [0.00966, 1],
      [-0.00013, 3],
      [-0.00084, 0],
      [-0.00129, 0],
      [-5e-5, 3],
      [0.00781, 1],
      [0.00583, 1],
      [-0.00112, 0],
      [-0.00032, 3],
      [-5e-5, 3],
      [-0.00069, 0],
      [0.00757, 1],
      [-0.00039, 3],
      [0.00755, 1],
      [-0.00037, 3]
    ]
  },
  "QA_lstPexMuscstrength[ElbowFlex]": {
    "red_x_points": [
      [-0.00718, 1],
      [0.0003, 2],
      [-0.00616, 1],
      [-0.0066, 1],
      [-0.00672, 1],
      [-0.00643, 1],
      [-0.00662, 1],
      [-0.00704, 1],
      [-0.0071, 1],
      [-0.00714, 1],
      [-0.00706, 1],
      [-0.00652, 1],
      [3e-5, 2],
      [-0.00106, 2],
      [0.00039, 2],
      [-0.00715, 1],
      [-0.00712, 1],
      [-0.00727, 1],
      [-0.00682, 1],
      [-0.00686, 1],
      [-0.00015, 2],
      [-0.00693, 1],
      [-0.00687, 1],
      [-0.00723, 1],
      [-0.00656, 1],
      [0.00032, 2],
      [-0.007, 1],
      [-0.00665, 1],
      [-0.00021, 2]
    ],
    "red_o_points": [],
    "y_categories": ["GREATER THAN OR EQUALS TO 3", "LESS THAN 3", "nan"],
    "blue_o_points": [],
    "blue_x_points": [
      [0.00087, 2],
      [-0.007, 1],
      [0.03206, 0],
      [-0.00655, 1],
      [0.00146, 2],
      [0.00144, 2],
      [0.02628, 0],
      [-0.00617, 1],
      [-0.00642, 1],
      [0.0013, 2],
      [0.03287, 0],
      [0.02724, 0],
      [0.03183, 0],
      [0.02857, 0],
      [-0.00638, 1]
    ]
  },
  "QS_mulGraftRoot[C6]": {
    "red_x_points": [
      [-4e-5, 0],
      [-4e-5, 0],
      [-4e-5, 0],
      [-4e-5, 0],
      [1e-5, 2],
      [-4e-5, 0],
      [-4e-5, 0],
      [1e-5, 2],
      [1e-5, 2],
      [-4e-5, 0],
      [1e-5, 2],
      [1e-5, 2],
      [1e-5, 2]
    ],
    "red_o_points": [],
    "y_categories": ["N", "NOT APPLICABLE", "nan"],
    "blue_o_points": [],
    "blue_x_points": [
      [0.00013, 1],
      [1e-5, 2],
      [-4e-5, 0],
      [1e-5, 2],
      [1e-5, 2],
      [0.00013, 1],
      [1e-5, 2]
    ]
  },
  "QA_yonInjDisloc": {
    "red_x_points": [
      [1e-5, 2],
      [0.0, 2],
      [1e-5, 2],
      [1e-5, 2],
      [-0.00071, 0],
      [1e-5, 2],
      [2e-5, 2],
      [0.0, 2],
      [0.0, 2]
    ],
    "red_o_points": [],
    "y_categories": ["N", "Y", "nan"],
    "blue_o_points": [],
    "blue_x_points": [
      [2e-5, 2],
      [2e-5, 2],
      [2e-5, 2],
      [2e-5, 2],
      [1e-5, 2],
      [2e-5, 2],
      [0.00049, 1],
      [2e-5, 2],
      [0.0, 2]
    ]
  },
  "QS_mulGraftNerve[Ac]": {
    "red_x_points": [
      [-5e-5, 2],
      [-0.00058, 0],
      [-0.00035, 0],
      [-0.00021, 0],
      [-0.0003, 0],
      [-0.00031, 0],
      [-0.00031, 0],
      [-0.00012, 2],
      [-0.00033, 0],
      [-0.00029, 0],
      [-8e-5, 2],
      [-0.0004, 0],
      [-0.00012, 2],
      [-0.00043, 0],
      [-0.00049, 0],
      [-2e-5, 2],
      [-6e-5, 2],
      [-4e-5, 2],
      [-0.00036, 0],
      [-6e-5, 2],
      [-0.00013, 2],
      [-9e-5, 2],
      [-0.00038, 0],
      [-0.00035, 0],
      [-5e-5, 2],
      [0.0012, 1],
      [-7e-5, 2],
      [-0.00035, 0],
      [-0.00012, 2]
    ],
    "red_o_points": [],
    "y_categories": ["N", "NOT APPLICABLE", "nan"],
    "blue_o_points": [],
    "blue_x_points": [
      [0.00205, 1],
      [-9e-5, 2],
      [-0.0002, 0],
      [-0.00023, 0],
      [4e-5, 2],
      [0.00146, 1],
      [0.00064, 1],
      [-0.00023, 0],
      [-5e-5, 2],
      [-3e-5, 2],
      [-0.00022, 0],
      [0.00123, 1],
      [1e-5, 2],
      [0.00089, 1],
      [-5e-5, 2]
    ]
  },
  "QS_mulNeuromadSite[C8]": {
    "red_x_points": [
      [-0.00011, 2],
      [-0.00124, 0],
      [-0.001, 0],
      [-0.001, 0],
      [-0.00115, 0],
      [-0.00075, 0],
      [-0.00119, 0],
      [-0.0002, 2],
      [-0.00118, 0],
      [-0.00101, 0],
      [-0.00037, 2],
      [-0.0009, 0],
      [-0.00019, 2],
      [-0.00134, 0],
      [-0.00125, 0],
      [-0.00027, 2],
      [-0.00017, 2],
      [-0.00021, 2],
      [-0.00092, 0],
      [-0.0002, 2],
      [-0.00013, 2],
      [-0.0002, 2],
      [-0.00118, 0],
      [-0.00101, 0],
      [-0.00041, 2],
      [0.00263, 1],
      [-0.00026, 2],
      [-0.00089, 0],
      [-0.00022, 2]
    ],
    "red_o_points": [],
    "y_categories": ["N", "NOT APPLICABLE", "nan"],
    "blue_o_points": [],
    "blue_x_points": [
      [0.00499, 1],
      [-0.00017, 2],
      [-0.00049, 0],
      [-0.00076, 0],
      [-0.0, 2],
      [0.00419, 1],
      [0.00276, 1],
      [-0.00078, 0],
      [-0.0002, 2],
      [-0.00011, 2],
      [-0.00067, 0],
      [0.00384, 1],
      [-9e-5, 2],
      [0.00396, 1],
      [-0.00017, 2]
    ]
  },
  "QS_mulTransfSite[AcSsPA]": {
    "red_x_points": [
      [-0.00036, 3],
      [-0.00148, 0],
      [-0.00132, 0],
      [-0.00135, 0],
      [-0.00137, 0],
      [-0.00115, 0],
      [-0.00134, 0],
      [-0.00041, 3],
      [-0.00136, 0],
      [-0.00109, 0],
      [-0.00036, 3],
      [-0.00128, 0],
      [-0.00029, 3],
      [-0.00166, 0],
      [-0.00445, 2],
      [-0.0003, 3],
      [-0.00018, 3],
      [-0.00031, 3],
      [-0.00114, 0],
      [-0.00024, 3],
      [-0.00032, 3],
      [-0.00033, 3],
      [-0.00124, 0],
      [-0.00128, 0],
      [-0.0003, 3],
      [0.00362, 1],
      [-0.00034, 3],
      [-0.0012, 0],
      [-0.00031, 3]
    ],
    "red_o_points": [],
    "y_categories": ["N", "NOT APPLICABLE", "Y", "nan"],
    "blue_o_points": [],
    "blue_x_points": [
      [0.00634, 1],
      [-0.00011, 3],
      [-0.00085, 0],
      [-0.0012, 0],
      [-0.00013, 3],
      [0.0061, 1],
      [0.00466, 1],
      [-0.00091, 0],
      [-0.00019, 3],
      [-0.00016, 3],
      [-0.00092, 0],
      [0.00525, 1],
      [-0.0003, 3],
      [0.00577, 1],
      [-0.00022, 3]
    ]
  },
  "QA_lstPexPalle[Elbow]": {
    "red_x_points": [
      [-0.00061, 4],
      [-0.0029, 4],
      [-0.00237, 4],
      [-0.00085, 3],
      [-0.00335, 4],
      [-0.00094, 3],
      [-0.00336, 4],
      [-0.00036, 4],
      [-0.00413, 4],
      [-0.00012, 3],
      [-0.00291, 1],
      [-0.00414, 4],
      [-0.00046, 4],
      [-0.00413, 4],
      [-0.00199, 4],
      [0.00014, 3],
      [-0.00831, 0],
      [0.00091, 3],
      [-0.00724, 2],
      [0.00052, 3],
      [-0.00037, 4],
      [-0.00041, 4],
      [-0.00416, 4],
      [-0.00377, 4],
      [-0.00035, 4],
      [-0.02287, 3],
      [-0.00034, 4],
      [-0.00611, 0],
      [-0.00043, 4]
    ],
    "red_o_points": [],
    "y_categories": ["ABS", "HYPO", "NAIA", "PT", "nan"],
    "blue_o_points": [],
    "blue_x_points": [
      [0.00386, 4],
      [3e-5, 4],
      [0.00293, 3],
      [0.02919, 1],
      [-0.00011, 4],
      [0.00402, 4],
      [0.00934, 1],
      [-0.00248, 4],
      [-6e-5, 4],
      [0.0001, 4],
      [0.02406, 1],
      [0.0038, 4],
      [0.0026, 3],
      [0.00431, 4],
      [0.00384, 3]
    ]
  },
  "QS_mulGraftRoot[C5]": {
    "red_x_points": [
      [-1e-5, 2],
      [-7e-5, 0],
      [-0.0001, 0],
      [-5e-5, 0],
      [-0.0001, 0],
      [-0.0001, 0],
      [-7e-5, 0],
      [-3e-5, 2],
      [-4e-5, 0],
      [-7e-5, 0],
      [-3e-5, 2],
      [-0.0001, 0],
      [-3e-5, 2],
      [-8e-5, 0],
      [-8e-5, 0],
      [-3e-5, 2],
      [-2e-5, 2],
      [-3e-5, 2],
      [-5e-5, 0],
      [-3e-5, 2],
      [-2e-5, 2],
      [-3e-5, 2],
      [-0.0001, 0],
      [-7e-5, 0],
      [-3e-5, 2],
      [0.00026, 1],
      [-3e-5, 2],
      [-0.0001, 0],
      [-4e-5, 2]
    ],
    "red_o_points": [],
    "y_categories": ["N", "NOT APPLICABLE", "nan"],
    "blue_o_points": [],
    "blue_x_points": [
      [0.00054, 1],
      [-4e-5, 2],
      [-0.0001, 0],
      [-0.0001, 0],
      [-3e-5, 2],
      [0.0003, 1],
      [0.00031, 1],
      [-3e-5, 0],
      [-2e-5, 2],
      [-2e-5, 2],
      [-0.0001, 0],
      [0.0004, 1],
      [-1e-5, 2],
      [0.00022, 1],
      [-3e-5, 2]
    ]
  },
  "QA_lstPexMuscstrength[ScapulaAbducSuprot]": {
    "red_x_points": [
      [0.00239, 0],
      [-0.0011, 2],
      [-0.00732, 1],
      [-0.00066, 2],
      [-0.00897, 1],
      [-0.00862, 1],
      [-0.0081, 1],
      [-0.00576, 1],
      [0.00939, 0],
      [-0.00977, 1],
      [-0.00551, 1],
      [-0.00145, 2],
      [-0.00068, 2],
      [-0.00171, 2],
      [-0.00054, 2],
      [0.0025, 0],
      [-0.00515, 1],
      [0.0012, 0],
      [-0.00654, 1],
      [-0.00186, 2],
      [-0.00056, 2],
      [-0.00054, 2],
      [-0.00947, 1],
      [0.00726, 0],
      [-0.00024, 2],
      [0.00016, 2],
      [0.00278, 0],
      [-0.00613, 1],
      [-0.00025, 2]
    ],
    "red_o_points": [],
    "y_categories": ["GREATER THAN OR EQUALS TO 3", "LESS THAN 3", "nan"],
    "blue_o_points": [],
    "blue_x_points": [
      [0.00012, 2],
      [0.00635, 0],
      [0.01356, 0],
      [0.01443, 0],
      [0.00045, 2],
      [0.00026, 2],
      [0.00254, 0],
      [0.00124, 2],
      [0.00185, 2],
      [0.0009, 2],
      [0.0117, 0],
      [0.00323, 0],
      [0.00337, 0],
      [0.00026, 2],
      [0.005, 1]
    ]
  },
  "participant_code": {
    "red_x_points": [
      [-0.0205, 1],
      [-0.02077, 2],
      [-0.02112, 3],
      [-0.02146, 4],
      [-0.02029, 5],
      [-0.01988, 8],
      [-0.02057, 9],
      [-0.02009, 10],
      [-0.0192, 11],
      [-0.02125, 13],
      [-0.01968, 14],
      [-0.0207, 18],
      [-0.02091, 19],
      [-0.01974, 20],
      [-0.01926, 23],
      [-0.02064, 26],
      [-0.02064, 28],
      [-0.02002, 29],
      [-0.02057, 30],
      [-0.02057, 31],
      [-0.02016, 32],
      [-0.02016, 34],
      [-0.02139, 36],
      [-0.02043, 38],
      [-0.01981, 39],
      [-0.01947, 40],
      [-0.02016, 41],
      [-0.0216, 42],
      [-0.02029, 43]
    ],
    "red_o_points": [],
    "y_categories": [
      "P16554",
      "P18297",
      "P19283",
      "P19287",
      "P23172",
      "P23391",
      "P30595",
      "P31645",
      "P31691",
      "P34778",
      "P35046",
      "P36328",
      "P43633",
      "P4544",
      "P46417",
      "P48965",
      "P53068",
      "P5497",
      "P58556",
      "P59529",
      "P62483",
      "P64658",
      "P65202",
      "P66816",
      "P6751",
      "P7408",
      "P75566",
      "P76226",
      "P79971",
      "P82621",
      "P82990",
      "P84549",
      "P84932",
      "P85825",
      "P86989",
      "P8770",
      "P87791",
      "P90550",
      "P93159",
      "P94969",
      "P96710",
      "P97130",
      "P9744",
      "P98500",
      "nan"
    ],
    "blue_o_points": [],
    "blue_x_points": [
      [0.04008, 0],
      [0.04021, 6],
      [0.04113, 7],
      [0.04034, 12],
      [0.03995, 15],
      [0.04008, 16],
      [0.03732, 17],
      [0.03942, 21],
      [0.04047, 22],
      [0.03811, 24],
      [0.03916, 25],
      [0.03798, 27],
      [0.03942, 33],
      [0.03955, 35],
      [0.03811, 37]
    ]
  },
  "QA_lstPexMuscstrength[ShoulderExrot]": {
    "red_x_points": [
      [-7e-5, 1],
      [-0.00042, 2],
      [-0.00117, 0],
      [-0.00023, 2],
      [0.00028, 1],
      [0.00025, 1],
      [-0.00035, 2],
      [-4e-5, 1],
      [0.00044, 1],
      [-0.00091, 2],
      [-5e-5, 1],
      [-0.00097, 2],
      [-7e-5, 2],
      [-0.00095, 2],
      [-0.00053, 2],
      [-9e-5, 1],
      [-0.00017, 1],
      [-0.00041, 2],
      [-2e-5, 2],
      [-1e-5, 2],
      [0.00109, 1],
      [-0.00503, 0],
      [3e-5, 2],
      [-3e-5, 2],
      [1e-5, 2],
      [0.00036, 1],
      [-1e-5, 2]
    ],
    "red_o_points": [],
    "y_categories": ["GREATER THAN OR EQUALS TO 3", "LESS THAN 3", "nan"],
    "blue_o_points": [],
    "blue_x_points": [
      [0.00021, 2],
      [0.00269, 1],
      [0.00308, 1],
      [0.00028, 0],
      [-7e-5, 2],
      [0.00216, 1],
      [0.00059, 0],
      [9e-5, 2],
      [2e-5, 2]
    ]
  },
  "QA_yonInjTbi": {
    "red_x_points": [
      [0.0071, 0],
      [-0.00204, 2],
      [-0.00229, 0],
      [-0.0014, 0],
      [-0.00196, 2],
      [0.00048, 1],
      [-0.00173, 0],
      [-0.00963, 2],
      [-0.00392, 2],
      [0.00118, 1],
      [-0.00398, 1],
      [-0.00358, 0],
      [0.00687, 0],
      [0.00098, 1],
      [7e-5, 1],
      [-0.00442, 1],
      [-0.00375, 1],
      [-0.00439, 1],
      [0.00077, 1],
      [-0.00466, 1],
      [0.00579, 0],
      [-0.00572, 1],
      [0.00104, 1],
      [0.00102, 1],
      [-0.00459, 1],
      [-0.00055, 2],
      [-0.00819, 2],
      [0.00031, 1],
      [-0.00552, 1]
    ],
    "red_o_points": [],
    "y_categories": ["N", "Y", "nan"],
    "blue_o_points": [],
    "blue_x_points": [
      [0.00032, 0],
      [-0.0026, 1],
      [0.00192, 1],
      [0.00276, 1],
      [0.01031, 0],
      [-2e-5, 1],
      [0.0, 1],
      [0.00248, 1],
      [0.01165, 0],
      [0.00925, 0],
      [0.00227, 1],
      [-0.00324, 1],
      [2e-5, 2],
      [0.01159, 0]
    ]
  },
  "QS_mulGraftNerve[Ul]": {
    "red_x_points": [
      [-2e-5, 2],
      [-0.00037, 0],
      [-0.00026, 0],
      [-0.00022, 0],
      [-0.00025, 0],
      [-0.00015, 0],
      [-0.00023, 0],
      [-5e-5, 2],
      [-0.00016, 0],
      [-0.00016, 0],
      [3e-5, 2],
      [-0.00032, 0],
      [-6e-5, 2],
      [-0.00034, 0],
      [-0.00022, 0],
      [2e-5, 2],
      [-1e-5, 2],
      [1e-5, 2],
      [-0.00023, 0],
      [2e-5, 2],
      [-3e-5, 2],
      [-3e-5, 2],
      [-0.00027, 0],
      [-0.00027, 0],
      [-4e-5, 2],
      [0.00059, 1],
      [2e-5, 2],
      [-0.0002, 0],
      [-0.0, 2]
    ],
    "red_o_points": [],
    "y_categories": ["N", "NOT APPLICABLE", "nan"],
    "blue_o_points": [],
    "blue_x_points": [
      [0.00098, 1],
      [-2e-5, 2],
      [-0.00016, 0],
      [-8e-5, 0],
      [0.00014, 2],
      [0.00075, 1],
      [0.00042, 1],
      [-0.00019, 0],
      [2e-5, 2],
      [0.0001, 2],
      [-0.0001, 0],
      [0.00072, 1],
      [2e-5, 2],
      [0.00061, 1],
      [-1e-5, 2]
    ]
  },
  "QS_mulGraftNerve[Ssr]": {
    "red_x_points": [
      [3e-5, 2],
      [-4e-5, 0],
      [-4e-5, 0],
      [-4e-5, 0],
      [-4e-5, 0],
      [-4e-5, 0],
      [3e-5, 2],
      [-4e-5, 0]
    ],
    "red_o_points": [],
    "y_categories": ["N", "NOT APPLICABLE", "nan"],
    "blue_o_points": [],
    "blue_x_points": [[0.00016, 1], [3e-5, 2]]
  },
  "QA_intPexShoulderFlex": {
    "red_x_points": [
      [0.00013, 1],
      [-0.00011, 2],
      [-0.00026, 2],
      [-0.00018, 2],
      [-0.00532, 0],
      [-0.00011, 2],
      [-0.00052, 2],
      [-0.00091, 2],
      [2e-5, 1],
      [0.00048, 1],
      [-0.00022, 2],
      [-0.00015, 2],
      [7e-5, 1],
      [4e-5, 1],
      [0.0002, 1],
      [-6e-5, 2],
      [-0.0006, 2],
      [-0.00018, 2],
      [2e-5, 1],
      [9e-5, 1],
      [0.00025, 1]
    ],
    "red_o_points": [],
    "y_categories": ["GREATER THAN OR EQUALS TO 180", "LESS THAN 180", "nan"],
    "blue_o_points": [],
    "blue_x_points": [
      [0.00013, 1],
      [0.00448, 1],
      [-0.00055, 2],
      [-7e-5, 2],
      [0.0, 2],
      [0.00292, 1],
      [0.0, 2],
      [0.00024, 1],
      [0.00021, 1]
    ]
  },
  "QS_mulGraftNerve[MCA]": {
    "red_x_points": [
      [-0.00015, 0],
      [1e-5, 0],
      [1e-5, 2],
      [1e-5, 0],
      [-3e-5, 2],
      [-7e-5, 0],
      [4e-5, 2],
      [-0.00015, 0],
      [-0.00022, 0],
      [-3e-5, 2],
      [-3e-5, 2],
      [-7e-5, 0],
      [2e-5, 2],
      [1e-5, 2],
      [-7e-5, 0],
      [-7e-5, 0],
      [-3e-5, 2],
      [0.00018, 1],
      [1e-5, 2],
      [4e-5, 2]
    ],
    "red_o_points": [],
    "y_categories": ["N", "NOT APPLICABLE", "nan"],
    "blue_o_points": [],
    "blue_x_points": [
      [0.00011, 1],
      [1e-5, 2],
      [1e-5, 0],
      [4e-5, 2],
      [0.00018, 1],
      [0.00011, 1],
      [1e-5, 0],
      [1e-5, 2],
      [4e-5, 2],
      [1e-5, 0],
      [-3e-5, 2],
      [7e-5, 1],
      [-3e-5, 2]
    ]
  },
  "QA_lstPexInspectio[Swelling]": {
    "red_x_points": [
      [0.00066, 1],
      [-0.00255, 1],
      [0.00112, 0],
      [-0.00178, 1],
      [0.00015, 2],
      [0.00109, 0],
      [-0.00256, 1],
      [0.00107, 1],
      [-0.00548, 1],
      [-0.00601, 1],
      [-0.00505, 2],
      [-0.00456, 1],
      [-0.00342, 0],
      [-0.00461, 1],
      [-0.00153, 1],
      [-0.0032, 0],
      [-0.00584, 2],
      [0.00122, 1],
      [-0.00231, 1],
      [0.00153, 1],
      [-0.00405, 0],
      [0.00153, 1],
      [-0.00425, 1],
      [0.00373, 0],
      [0.00141, 1],
      [-0.00272, 0],
      [-0.00669, 2],
      [5e-5, 0],
      [0.00143, 1]
    ],
    "red_o_points": [],
    "y_categories": ["ABS", "NAIA", "PT", "nan"],
    "blue_o_points": [],
    "blue_x_points": [
      [0.00107, 1],
      [0.00288, 1],
      [0.00823, 0],
      [0.01072, 0],
      [0.0036, 1],
      [0.00121, 1],
      [-6e-5, 0],
      [-0.00219, 1],
      [0.00272, 0],
      [0.00339, 1],
      [0.01386, 2],
      [0.00091, 1],
      [0.00261, 1],
      [-8e-5, 0],
      [0.00275, 1]
    ]
  },
  "QS_mulGraftTrunk[UpperTrunk]": {
    "red_x_points": [
      [-0.00029, 3],
      [-0.00246, 0],
      [-0.00233, 0],
      [-0.00226, 0],
      [-0.00251, 0],
      [-0.00218, 0],
      [-0.00252, 0],
      [-0.00062, 3],
      [-0.0023, 0],
      [-0.00229, 0],
      [-0.0004, 3],
      [-0.00253, 0],
      [-0.00046, 3],
      [-0.00913, 2],
      [-0.00228, 0],
      [-0.00052, 3],
      [-0.00014, 3],
      [-0.00044, 3],
      [-0.00218, 0],
      [-0.0004, 3],
      [-0.00041, 3],
      [-0.00045, 3],
      [-0.0025, 0],
      [-0.00232, 0],
      [-0.00054, 3],
      [0.00697, 1],
      [-0.0006, 3],
      [-0.00195, 0],
      [-0.00049, 3]
    ],
    "red_o_points": [],
    "y_categories": ["N", "NOT APPLICABLE", "Y", "nan"],
    "blue_o_points": [],
    "blue_x_points": [
      [0.01238, 1],
      [-0.00037, 3],
      [-0.00095, 0],
      [-0.00114, 0],
      [-0.00015, 3],
      [0.00923, 1],
      [0.00735, 1],
      [-0.00174, 0],
      [-0.00027, 3],
      [-0.00021, 3],
      [-0.00105, 0],
      [0.00944, 1],
      [-0.00034, 3],
      [0.00855, 1],
      [-0.00022, 3]
    ]
  },
  "QS_mulLysisCord[Posterior]": {
    "red_x_points": [
      [-2e-5, 0],
      [-2e-5, 0],
      [-2e-5, 0],
      [-2e-5, 2],
      [-2e-5, 0],
      [-2e-5, 0],
      [-2e-5, 2],
      [-2e-5, 0],
      [-2e-5, 2],
      [-2e-5, 0],
      [-2e-5, 2],
      [-2e-5, 2],
      [-2e-5, 2],
      [-2e-5, 0],
      [-2e-5, 2],
      [-2e-5, 2],
      [-2e-5, 2],
      [-2e-5, 0],
      [-2e-5, 2],
      [0.0001, 1],
      [-2e-5, 2],
      [-2e-5, 0],
      [-2e-5, 2]
    ],
    "red_o_points": [],
    "y_categories": ["N", "NOT APPLICABLE", "nan"],
    "blue_o_points": [],
    "blue_x_points": [
      [0.0001, 1],
      [-2e-5, 2],
      [-2e-5, 0],
      [-2e-5, 0],
      [-2e-5, 2],
      [0.0001, 1],
      [0.0001, 1],
      [-2e-5, 0],
      [-2e-5, 2],
      [-2e-5, 2],
      [0.0001, 1],
      [0.0001, 1]
    ]
  },
  "QA_lstPexInspectio[ShoulderSubdisloc]": {
    "red_x_points": [
      [-0.00161, 1],
      [-0.00326, 1],
      [0.00277, 0],
      [-0.00259, 1],
      [-0.00385, 1],
      [-0.00193, 2],
      [-0.00336, 1],
      [-0.002, 1],
      [-0.00554, 1],
      [-0.00582, 1],
      [-0.00091, 2],
      [-0.00483, 1],
      [-0.00135, 1],
      [-0.00578, 1],
      [-0.00218, 1],
      [-0.00185, 2],
      [-0.00016, 2],
      [-0.00051, 1],
      [-0.00293, 1],
      [-0.00054, 1],
      [-0.00708, 0],
      [0.00143, 2],
      [-0.00134, 2],
      [-0.00085, 2],
      [-0.00085, 1],
      [-0.01137, 2],
      [-0.00126, 1],
      [-0.00101, 2],
      [-0.0012, 1]
    ],
    "red_o_points": [],
    "y_categories": ["ABS", "NAIA", "PT", "nan"],
    "blue_o_points": [],
    "blue_x_points": [
      [0.00357, 1],
      [0.005, 2],
      [0.02454, 0],
      [0.00319, 2],
      [0.00049, 1],
      [0.0039, 1],
      [0.00398, 0],
      [-0.00205, 1],
      [0.00705, 2],
      [0.00052, 1],
      [0.01895, 0],
      [0.00271, 1],
      [0.00048, 1],
      [-0.00145, 2],
      [0.00089, 1]
    ]
  },
  "QA_yonPreTbi": {
    "red_x_points": [
      [-0.00079, 2],
      [-3e-5, 2],
      [-9e-5, 2],
      [-7e-5, 2],
      [-7e-5, 2],
      [-8e-5, 2],
      [-8e-5, 2],
      [-0.00068, 2],
      [-8e-5, 2],
      [-9e-5, 2],
      [-0.00082, 2],
      [-8e-5, 2],
      [-0.00072, 2],
      [-3e-5, 2],
      [-0.0, 2],
      [-0.01198, 1],
      [-0.00086, 2],
      [-0.00066, 2],
      [-4e-5, 2],
      [-0.00072, 2],
      [-0.00073, 2],
      [-0.00085, 2],
      [-9e-5, 2],
      [-9e-5, 2],
      [-0.00068, 2],
      [-0.0, 2],
      [-0.00061, 2],
      [-7e-5, 2],
      [-0.00081, 2]
    ],
    "red_o_points": [],
    "y_categories": ["N", "Y", "nan"],
    "blue_o_points": [],
    "blue_x_points": [
      [-0.0, 2],
      [0.02482, 0],
      [-3e-5, 2],
      [-7e-5, 2],
      [-0.0005, 2],
      [-0.0, 2],
      [1e-5, 2],
      [-4e-5, 2],
      [-0.00072, 2],
      [-0.00046, 2],
      [-4e-5, 2],
      [1e-5, 2],
      [-0.00049, 2],
      [-0.0, 2],
      [-0.00059, 2]
    ]
  },
  "QS_mulTransfSite[MeMc]": {
    "red_x_points": [
      [1e-5, 2],
      [-3e-5, 0],
      [-4e-5, 0],
      [-4e-5, 0],
      [-3e-5, 0],
      [-3e-5, 0],
      [-1e-5, 0],
      [-0.0, 2],
      [-1e-5, 0],
      [-3e-5, 0],
      [1e-5, 2],
      [-0.0, 2],
      [-4e-5, 0],
      [1e-5, 2],
      [-0.0, 2],
      [-0.0, 2],
      [-3e-5, 0],
      [-3e-5, 0],
      [-0.0, 2]
    ],
    "red_o_points": [],
    "y_categories": ["N", "NOT APPLICABLE", "nan"],
    "blue_o_points": [],
    "blue_x_points": [[0.00031, 1], [-0.0, 2], [-4e-5, 0], [1e-5, 2], [1e-5, 2]]
  },
  "QS_mulGraftNerve[Sc]": {
    "red_x_points": [
      [1e-5, 2],
      [-0.00012, 0],
      [-0.0001, 0],
      [-7e-5, 0],
      [-5e-5, 0],
      [-0.00012, 0],
      [-0.0001, 0],
      [-5e-5, 2],
      [-2e-5, 0],
      [-7e-5, 0],
      [1e-5, 2],
      [-3e-5, 0],
      [-5e-5, 2],
      [-8e-5, 0],
      [-0.00012, 0],
      [-1e-5, 2],
      [-1e-5, 2],
      [1e-5, 2],
      [-0.00012, 0],
      [3e-5, 2],
      [-5e-5, 2],
      [-5e-5, 2],
      [-7e-5, 0],
      [-9e-5, 0],
      [-1e-5, 2],
      [0.00028, 1],
      [-3e-5, 2],
      [-0.00012, 0],
      [-5e-5, 2]
    ],
    "red_o_points": [],
    "y_categories": ["N", "NOT APPLICABLE", "nan"],
    "blue_o_points": [],
    "blue_x_points": [
      [0.00028, 1],
      [0.0, 2],
      [-8e-5, 0],
      [-5e-5, 0],
      [1e-5, 2],
      [0.00036, 1],
      [0.0002, 1],
      [-3e-5, 2],
      [-1e-5, 2],
      [-3e-5, 0],
      [0.00028, 1],
      [1e-5, 2],
      [0.00028, 1],
      [-1e-5, 2]
    ]
  },
  "QA_lstPexPain[C7]": {
    "red_x_points": [
      [-0.00149, 1],
      [-0.00425, 2],
      [-0.00271, 2],
      [-0.00127, 1],
      [-0.00442, 2],
      [-0.00277, 1],
      [-0.00157, 1],
      [-0.00519, 0],
      [-0.0033, 1],
      [0.00747, 0],
      [-0.00092, 1],
      [-0.00605, 2],
      [0.00154, 2],
      [-0.00578, 2],
      [-0.0025, 2],
      [-0.00446, 0],
      [-0.0013, 1],
      [-0.00486, 0],
      [-0.00327, 2],
      [-0.00459, 0],
      [0.00154, 2],
      [0.00153, 2],
      [-0.00673, 2],
      [-0.00586, 2],
      [-0.00361, 0],
      [-0.00228, 1],
      [-0.00115, 1],
      [-0.00201, 1],
      [-0.00103, 1]
    ],
    "red_o_points": [],
    "y_categories": ["NORM", "NPV", "nan"],
    "blue_o_points": [],
    "blue_x_points": [
      [5e-5, 1],
      [0.00406, 1],
      [0.01488, 0],
      [0.01648, 0],
      [0.00482, 2],
      [0.0003, 2],
      [5e-5, 1],
      [0.00119, 1],
      [0.00417, 2],
      [0.00487, 2],
      [0.01294, 0],
      [-1e-5, 1],
      [-0.00143, 0],
      [0.00207, 0],
      [0.00685, 1]
    ]
  },
  "QS_mulGraftNerve[MP]": {
    "red_x_points": [
      [-5e-5, 2],
      [-0.00015, 0],
      [-0.00018, 0],
      [-9e-5, 0],
      [-0.00015, 0],
      [-7e-5, 0],
      [-0.00016, 0],
      [-1e-5, 2],
      [-0.00015, 0],
      [-3e-5, 0],
      [-2e-5, 2],
      [-0.00018, 0],
      [3e-5, 2],
      [-0.00015, 0],
      [-0.00017, 0],
      [-4e-5, 2],
      [-1e-5, 2],
      [-4e-5, 2],
      [-9e-5, 0],
      [1e-5, 2],
      [0.0, 2],
      [1e-5, 2],
      [-0.00015, 0],
      [-0.0001, 0],
      [2e-5, 2],
      [0.00023, 1],
      [-3e-5, 2],
      [-0.00011, 0],
      [-1e-5, 2]
    ],
    "red_o_points": [],
    "y_categories": ["N", "NOT APPLICABLE", "nan"],
    "blue_o_points": [],
    "blue_x_points": [
      [0.00045, 1],
      [-3e-5, 2],
      [-6e-5, 0],
      [-7e-5, 0],
      [3e-5, 2],
      [0.00058, 1],
      [0.00032, 1],
      [-0.00011, 0],
      [1e-5, 2],
      [3e-5, 2],
      [-6e-5, 0],
      [0.0005, 1],
      [-4e-5, 2],
      [0.00028, 1],
      [1e-5, 2]
    ]
  },
  "QS_mulGraftNerve[Ax]": {
    "red_x_points": [
      [-0.0001, 2],
      [-0.00032, 0],
      [-0.00033, 0],
      [-0.0003, 0],
      [-0.00035, 0],
      [-0.00026, 0],
      [-0.00041, 0],
      [-9e-5, 2],
      [-0.00042, 0],
      [-0.00023, 0],
      [-8e-5, 2],
      [-0.00033, 0],
      [-0.00014, 2],
      [-0.00041, 0],
      [-0.00036, 0],
      [-0.00011, 2],
      [-7e-5, 2],
      [-0.00013, 2],
      [-0.00025, 0],
      [-0.00017, 2],
      [-0.00016, 2],
      [-0.0001, 2],
      [-0.00045, 0],
      [-0.00042, 0],
      [-9e-5, 2],
      [0.00069, 1],
      [-8e-5, 2],
      [-0.0003, 0],
      [-0.00013, 2]
    ],
    "red_o_points": [],
    "y_categories": ["N", "NOT APPLICABLE", "nan"],
    "blue_o_points": [],
    "blue_x_points": [
      [0.00215, 1],
      [-3e-5, 2],
      [-6e-5, 0],
      [-0.0002, 0],
      [-3e-5, 2],
      [0.00126, 1],
      [0.00096, 1],
      [-0.00038, 0],
      [-6e-5, 2],
      [-6e-5, 2],
      [-0.00018, 0],
      [0.00152, 1],
      [-0.0001, 2],
      [0.00121, 1],
      [-9e-5, 2]
    ]
  },
  "QA_intPexForearmSupin": {
    "red_x_points": [
      [-0.00051, 2],
      [-0.00432, 0],
      [-0.00083, 2],
      [-0.00066, 2],
      [-0.00101, 2],
      [0.00352, 1],
      [-0.00087, 2],
      [0.00157, 1],
      [-0.00146, 2],
      [-0.00132, 2],
      [-0.00581, 0],
      [-0.00694, 0],
      [-0.00053, 2],
      [-0.00115, 2],
      [-0.00036, 2],
      [0.00365, 1],
      [-0.00594, 0],
      [0.00115, 1],
      [0.00193, 1],
      [-0.0005, 2],
      [-0.00051, 2],
      [-0.0006, 2],
      [-0.00145, 2],
      [-0.00127, 2],
      [7e-5, 2],
      [-0.0202, 1],
      [-3e-5, 2],
      [-0.00351, 0],
      [-0.00036, 2]
    ],
    "red_o_points": [],
    "y_categories": ["GREATER THAN OR EQUALS TO 80", "LESS THAN 80", "nan"],
    "blue_o_points": [],
    "blue_x_points": [
      [0.00362, 2],
      [0.00558, 1],
      [0.00972, 1],
      [-0.00082, 2],
      [0.00013, 2],
      [0.00399, 2],
      [0.00517, 0],
      [-0.00077, 2],
      [-0.00032, 2],
      [0.00016, 2],
      [0.009, 1],
      [0.00367, 2],
      [0.00016, 2],
      [0.00386, 2],
      [0.00509, 1]
    ]
  },
  "QS_mulGraftNerve[MCF]": {
    "red_x_points": [
      [-1e-5, 2],
      [-2e-5, 0],
      [-4e-5, 0],
      [-5e-5, 0],
      [-5e-5, 0],
      [-4e-5, 0],
      [-4e-5, 0],
      [-4e-5, 2],
      [-7e-5, 0],
      [-4e-5, 0],
      [-1e-5, 2],
      [-3e-5, 0],
      [-1e-5, 2],
      [-0.00017, 0],
      [-4e-5, 0],
      [-1e-5, 2],
      [-1e-5, 2],
      [-1e-5, 2],
      [-4e-5, 0],
      [-1e-5, 2],
      [-1e-5, 2],
      [-1e-5, 2],
      [-2e-5, 0],
      [-2e-5, 0],
      [-1e-5, 2],
      [0.0001, 1],
      [-1e-5, 2],
      [-4e-5, 0],
      [-4e-5, 2]
    ],
    "red_o_points": [],
    "y_categories": ["N", "NOT APPLICABLE", "nan"],
    "blue_o_points": [],
    "blue_x_points": [
      [0.00041, 1],
      [-1e-5, 2],
      [-4e-5, 0],
      [-4e-5, 0],
      [1e-5, 2],
      [0.00023, 1],
      [0.00013, 1],
      [-4e-5, 0],
      [-1e-5, 2],
      [1e-5, 2],
      [-2e-5, 0],
      [0.00021, 1],
      [-1e-5, 2],
      [-1e-5, 2]
    ]
  },
  "QS_mulLysisSite[Nerve]": {
    "red_x_points": [
      [-0.00071, 3],
      [-0.00296, 0],
      [-0.00808, 2],
      [-0.00842, 2],
      [-0.00268, 0],
      [-0.00244, 0],
      [-0.00251, 0],
      [-0.00069, 3],
      [-0.00253, 0],
      [-0.00251, 0],
      [-0.00064, 3],
      [-0.00298, 0],
      [-0.00066, 3],
      [-0.00285, 0],
      [-0.00305, 0],
      [-0.0008, 3],
      [-0.00039, 3],
      [-0.00083, 3],
      [-0.00231, 0],
      [-0.00054, 3],
      [-0.00081, 3],
      [-0.00066, 3],
      [-0.00292, 0],
      [-0.00272, 0],
      [-0.00079, 3],
      [0.00897, 1],
      [-0.00071, 3],
      [-0.00232, 0],
      [-0.00069, 3]
    ],
    "red_o_points": [],
    "y_categories": ["N", "NOT APPLICABLE", "Y", "nan"],
    "blue_o_points": [],
    "blue_x_points": [
      [0.01507, 1],
      [-0.00046, 3],
      [-0.00155, 0],
      [-0.00163, 0],
      [-0.00022, 3],
      [0.01253, 1],
      [0.00962, 1],
      [-0.00198, 0],
      [-0.00046, 3],
      [-0.00035, 3],
      [-0.00119, 0],
      [0.01088, 1],
      [-0.00042, 3],
      [0.01179, 1],
      [-0.0004, 3]
    ]
  },
  "QS_mulTransfSite[IMc]": {
    "red_x_points": [
      [-0.00124, 3],
      [-0.0153, 2],
      [-0.00242, 0],
      [-0.0136, 2],
      [-0.0024, 0],
      [-0.00209, 0],
      [-0.00245, 0],
      [-0.00131, 3],
      [-0.00242, 0],
      [-0.00225, 0],
      [-0.00111, 3],
      [-0.00237, 0],
      [-0.00117, 3],
      [-0.00278, 0],
      [-0.01394, 2],
      [-0.0013, 3],
      [-0.00111, 3],
      [-0.00123, 3],
      [-0.00193, 0],
      [-0.00119, 3],
      [-0.00123, 3],
      [-0.00118, 3],
      [-0.00239, 0],
      [-0.01501, 2],
      [-0.00128, 3],
      [0.01626, 1],
      [-0.00133, 3],
      [-0.01334, 2],
      [-0.00127, 3]
    ],
    "red_o_points": [],
    "y_categories": ["N", "NOT APPLICABLE", "Y", "nan"],
    "blue_o_points": [],
    "blue_x_points": [
      [0.02405, 1],
      [-0.00082, 3],
      [-0.00081, 0],
      [-0.00093, 0],
      [-0.00028, 3],
      [0.02109, 1],
      [0.0188, 1],
      [-0.00137, 0],
      [-0.00065, 3],
      [-0.00057, 3],
      [-0.00101, 0],
      [0.01918, 1],
      [-0.00096, 3],
      [0.01946, 1],
      [-0.0008, 3]
    ]
  },
  "QS_mulGraftLevel[other]": {
    "red_x_points": [
      [0.0, 2],
      [-2e-5, 0],
      [-2e-5, 0],
      [-2e-5, 0],
      [-2e-5, 0],
      [0.0, 2],
      [-2e-5, 0],
      [-2e-5, 0],
      [0.0, 2],
      [-2e-5, 0],
      [-2e-5, 0],
      [0.0, 2],
      [0.0, 2],
      [0.0, 2],
      [0.0, 2],
      [-2e-5, 0],
      [-2e-5, 0],
      [0.0, 2]
    ],
    "red_o_points": [],
    "y_categories": ["N", "NOT APPLICABLE", "nan"],
    "blue_o_points": [],
    "blue_x_points": [[0.00016, 1], [0.0, 2], [-2e-5, 0], [0.0, 2]]
  },
  "QS_lstBpsurgSide": {
    "red_x_points": [
      [-0.00075, 3],
      [-0.0088, 0],
      [-0.00963, 0],
      [-0.00817, 0],
      [-0.00858, 0],
      [-0.00926, 0],
      [-0.00911, 0],
      [-0.00099, 3],
      [-0.0099, 0],
      [0.00042, 2],
      [-0.00104, 3],
      [-0.00074, 2],
      [-0.00094, 3],
      [-0.00052, 2],
      [-0.0014, 2],
      [-0.00121, 3],
      [-0.0008, 3],
      [-0.00093, 3],
      [-0.00713, 0],
      [-0.00072, 3],
      [-0.00109, 3],
      [-0.00084, 3],
      [-0.0002, 2],
      [0.00044, 2],
      [-0.00099, 3],
      [0.01189, 1],
      [-0.00084, 3],
      [-0.00836, 0],
      [-0.00071, 3]
    ],
    "red_o_points": [],
    "y_categories": ["L", "NOT APPLICABLE", "R", "nan"],
    "blue_o_points": [],
    "blue_x_points": [
      [0.02004, 1],
      [-0.00047, 3],
      [0.00329, 2],
      [0.0035, 2],
      [-0.00033, 3],
      [0.01461, 1],
      [0.01354, 1],
      [-0.00317, 0],
      [-0.0006, 3],
      [-0.00031, 3],
      [0.00275, 2],
      [0.01472, 1],
      [-0.00078, 3],
      [0.01469, 1],
      [-0.00058, 3]
    ]
  },
  "QS_mulTransfSite[AcMc]": {
    "red_x_points": [
      [-0.00032, 3],
      [-0.0022, 0],
      [-0.00181, 0],
      [-0.00174, 0],
      [-0.00161, 0],
      [-0.00174, 0],
      [-0.00164, 0],
      [-0.00032, 3],
      [-0.00178, 0],
      [-0.00908, 2],
      [-0.00041, 3],
      [-0.0019, 0],
      [-0.00044, 3],
      [-0.00238, 0],
      [-0.002, 0],
      [-0.00035, 3],
      [-0.00036, 3],
      [-0.00027, 3],
      [-0.00162, 0],
      [-0.00045, 3],
      [-0.00042, 3],
      [-0.00049, 3],
      [-0.00176, 0],
      [-0.0019, 0],
      [-0.00043, 3],
      [0.00498, 1],
      [-0.00041, 3],
      [-0.00156, 0],
      [-0.00045, 3]
    ],
    "red_o_points": [],
    "y_categories": ["N", "NOT APPLICABLE", "Y", "nan"],
    "blue_o_points": [],
    "blue_x_points": [
      [0.01003, 1],
      [-0.00017, 3],
      [-4e-5, 0],
      [-0.00014, 0],
      [-0.00018, 3],
      [0.00775, 1],
      [0.00623, 1],
      [-0.00138, 0],
      [-0.00025, 3],
      [-0.00017, 3],
      [0.00015, 0],
      [0.00686, 1],
      [-0.00019, 3],
      [0.00651, 1],
      [-0.00015, 3]
    ]
  },
  "QS_mulTransfSite[Other]": {
    "red_x_points": [
      [-0.00127, 3],
      [-0.00828, 0],
      [-0.0068, 0],
      [-0.00729, 0],
      [-0.00753, 0],
      [-0.00717, 0],
      [-0.00742, 0],
      [-0.00115, 3],
      [-0.00749, 0],
      [-0.00765, 0],
      [-0.00114, 3],
      [-0.0073, 0],
      [-0.00127, 3],
      [-0.00799, 0],
      [-0.00788, 0],
      [-0.00137, 3],
      [-0.00089, 3],
      [-0.00131, 3],
      [-0.00675, 0],
      [-0.00103, 3],
      [-0.00118, 3],
      [-0.00134, 3],
      [-0.00759, 0],
      [-0.0076, 0],
      [-0.00116, 3],
      [0.01649, 1],
      [-0.00126, 3],
      [-0.00689, 0],
      [-0.00131, 3]
    ],
    "red_o_points": [],
    "y_categories": ["N", "NOT APPLICABLE", "Y", "nan"],
    "blue_o_points": [],
    "blue_x_points": [
      [0.025, 1],
      [-0.00114, 3],
      [-0.00688, 0],
      [-0.00586, 0],
      [-0.00035, 3],
      [0.02077, 1],
      [0.01798, 1],
      [-0.00624, 0],
      [-0.00082, 3],
      [-0.00071, 3],
      [0.03304, 2],
      [0.01934, 1],
      [-0.00059, 3],
      [0.0182, 1],
      [-0.0009, 3]
    ]
  },
  "QA_lstPexTouch[C8]": {
    "red_x_points": [
      [-0.00178, 1],
      [-0.00587, 2],
      [-0.00249, 1],
      [-0.00239, 1],
      [-0.00667, 2],
      [-0.00439, 1],
      [-0.00323, 1],
      [-0.00326, 0],
      [-0.00589, 1],
      [0.01176, 0],
      [-0.00091, 1],
      [-0.00882, 2],
      [-0.00117, 2],
      [-0.00754, 2],
      [-0.0038, 2],
      [-0.00185, 0],
      [-0.00139, 1],
      [-0.00241, 0],
      [-0.005, 2],
      [-0.00145, 0],
      [-0.00108, 2],
      [-0.00501, 0],
      [-0.00531, 1],
      [-0.00916, 2],
      [-0.00293, 0],
      [-0.00646, 1],
      [-0.00153, 2],
      [-0.00309, 1],
      [-0.0012, 1]
    ],
    "red_o_points": [],
    "y_categories": ["NORM", "NPV", "nan"],
    "blue_o_points": [],
    "blue_x_points": [
      [0.00326, 0],
      [0.00629, 1],
      [0.02112, 0],
      [0.02359, 0],
      [0.00357, 2],
      [0.00135, 2],
      [-0.00023, 1],
      [-0.00192, 1],
      [0.00708, 1],
      [0.00394, 2],
      [0.01793, 0],
      [-0.00034, 1],
      [0.00076, 0],
      [0.00412, 0],
      [0.0038, 0]
    ]
  },
  "QS_mulLysisNerve[Ssr]": {
    "red_x_points": [
      [-0.00052, 3],
      [-0.00381, 0],
      [-0.00838, 2],
      [-0.00955, 2],
      [-0.00281, 0],
      [-0.00246, 0],
      [-0.00294, 0],
      [-0.0007, 3],
      [-0.00282, 0],
      [-0.00248, 0],
      [-0.00058, 3],
      [-0.00262, 0],
      [-0.00075, 3],
      [-0.00372, 0],
      [-0.00343, 0],
      [-0.00072, 3],
      [-0.00055, 3],
      [-0.0005, 3],
      [-0.00253, 0],
      [-0.00057, 3],
      [-0.00056, 3],
      [-0.00067, 3],
      [-0.00286, 0],
      [-0.00277, 0],
      [-0.00071, 3],
      [0.00976, 1],
      [-0.00064, 3],
      [-0.00239, 0],
      [-0.00077, 3]
    ],
    "red_o_points": [],
    "y_categories": ["N", "NOT APPLICABLE", "Y", "nan"],
    "blue_o_points": [],
    "blue_x_points": [
      [0.01783, 1],
      [-0.00027, 3],
      [-0.00176, 0],
      [-0.00179, 0],
      [-0.00021, 3],
      [0.01244, 1],
      [0.01046, 1],
      [-0.00233, 0],
      [-8e-5, 3],
      [-0.00029, 3],
      [-0.0017, 0],
      [0.01032, 1],
      [-0.00046, 3],
      [0.01219, 1],
      [-0.00031, 3]
    ]
  },
  "QS_mulTransfSite[AcSsAA]": {
    "red_x_points": [
      [-0.00035, 3],
      [-0.00178, 2],
      [-0.00464, 0],
      [-0.00402, 0],
      [-0.00156, 2],
      [-0.00557, 0],
      [-0.00451, 0],
      [-0.00065, 3],
      [-0.00534, 0],
      [-0.00535, 0],
      [-0.00056, 3],
      [-0.0049, 0],
      [-0.00061, 3],
      [-0.00121, 2],
      [-0.00381, 0],
      [-0.00073, 3],
      [-0.00039, 3],
      [-0.00051, 3],
      [-0.00119, 2],
      [-0.00052, 3],
      [-0.00065, 3],
      [-0.0006, 3],
      [-0.00487, 0],
      [-0.00075, 2],
      [-0.00055, 3],
      [0.00813, 1],
      [-0.0006, 3],
      [-0.00376, 0],
      [-0.00062, 3]
    ],
    "red_o_points": [],
    "y_categories": ["N", "NOT APPLICABLE", "Y", "nan"],
    "blue_o_points": [],
    "blue_x_points": [
      [0.0135, 1],
      [-0.00037, 3],
      [0.00448, 2],
      [0.00469, 2],
      [-0.00017, 3],
      [0.01013, 1],
      [0.00832, 1],
      [-0.00319, 0],
      [-0.00037, 3],
      [-0.00023, 3],
      [-0.00239, 0],
      [0.0101, 1],
      [-0.00049, 3],
      [0.00877, 1],
      [-0.00034, 3]
    ]
  },
  "QS_mulLysisRoot[C5]": {
    "red_x_points": [
      [-0.00038, 3],
      [-0.00313, 0],
      [-0.00798, 2],
      [-0.00235, 0],
      [-0.00238, 0],
      [-0.00248, 0],
      [-0.00259, 0],
      [-0.00037, 3],
      [-0.00222, 0],
      [-0.002, 0],
      [-0.00037, 3],
      [-0.00257, 0],
      [-0.00062, 3],
      [-0.00305, 0],
      [-0.00289, 0],
      [-0.0004, 3],
      [-0.00037, 3],
      [-0.0004, 3],
      [-0.00211, 0],
      [-0.00035, 3],
      [-0.00047, 3],
      [-0.00056, 3],
      [-0.00249, 0],
      [-0.00229, 0],
      [-0.00046, 3],
      [0.00816, 1],
      [-0.00046, 3],
      [-0.0073, 2],
      [-0.00046, 3]
    ],
    "red_o_points": [],
    "y_categories": ["N", "NOT APPLICABLE", "Y", "nan"],
    "blue_o_points": [],
    "blue_x_points": [
      [0.01223, 1],
      [-0.00036, 3],
      [-0.00161, 0],
      [-0.00156, 0],
      [-0.0002, 3],
      [0.01187, 1],
      [0.00925, 1],
      [-0.00199, 0],
      [-0.00019, 3],
      [-0.00012, 3],
      [-0.00131, 0],
      [0.01006, 1],
      [-0.00026, 3],
      [0.00979, 1],
      [-0.00026, 3]
    ]
  },
  "QS_mulNeuromadSite[C6]": {
    "red_x_points": [
      [-4e-5, 2],
      [-0.00091, 0],
      [-0.0008, 0],
      [-0.0005, 0],
      [-0.00075, 0],
      [-0.00067, 0],
      [-0.00089, 0],
      [-0.0001, 2],
      [-0.00082, 0],
      [-0.00067, 0],
      [-2e-5, 2],
      [-0.00081, 0],
      [-0.00016, 2],
      [-0.00074, 0],
      [-0.0009, 0],
      [-6e-5, 2],
      [-6e-5, 2],
      [-5e-5, 2],
      [-0.00075, 0],
      [-5e-5, 2],
      [-0.00013, 2],
      [-0.0001, 2],
      [-0.00077, 0],
      [-0.00059, 0],
      [-0.00012, 2],
      [0.00208, 1],
      [-0.0001, 2],
      [-0.00079, 0],
      [-0.00015, 2]
    ],
    "red_o_points": [],
    "y_categories": ["N", "NOT APPLICABLE", "nan"],
    "blue_o_points": [],
    "blue_x_points": [
      [0.0036, 1],
      [-5e-5, 2],
      [-0.00068, 0],
      [-0.00062, 0],
      [-4e-5, 2],
      [0.00261, 1],
      [0.00216, 1],
      [-0.00041, 0],
      [-2e-5, 2],
      [-7e-5, 2],
      [-0.00055, 0],
      [0.00196, 1],
      [-4e-5, 2],
      [0.00263, 1],
      [-4e-5, 2]
    ]
  },
  "QS_mulBpsurgeryType[Lysis]": {
    "red_x_points": [
      [-0.0009, 3],
      [-0.00386, 0],
      [-0.01403, 2],
      [-0.01355, 2],
      [-0.0026, 0],
      [-0.01473, 2],
      [-0.00259, 0],
      [-0.0009, 3],
      [-0.00233, 0],
      [-0.00188, 0],
      [-0.00113, 3],
      [-0.00252, 0],
      [-0.00108, 3],
      [-0.0034, 0],
      [-0.01356, 2],
      [-0.00106, 3],
      [-0.00092, 3],
      [-0.00093, 3],
      [-0.00254, 0],
      [-0.00101, 3],
      [-0.00099, 3],
      [-0.00104, 3],
      [-0.00252, 0],
      [-0.00247, 0],
      [-0.001, 3],
      [0.01613, 1],
      [-0.00106, 3],
      [-0.01291, 2],
      [-0.00094, 3]
    ],
    "red_o_points": [],
    "y_categories": ["N", "NOT APPLICABLE", "Y", "nan"],
    "blue_o_points": [],
    "blue_x_points": [
      [0.025, 1],
      [-0.00056, 3],
      [-0.00102, 0],
      [-0.00118, 0],
      [-0.00057, 3],
      [0.02111, 1],
      [0.01728, 1],
      [-0.00191, 0],
      [-0.00087, 3],
      [-0.00061, 3],
      [-0.0014, 0],
      [0.0196, 1],
      [-0.00057, 3],
      [0.01851, 1],
      [-0.00051, 3]
    ]
  },
  "QS_mulGraftNerve[FI]": {
    "red_x_points": [
      [-2e-5, 2],
      [-0.00078, 0],
      [-0.0006, 0],
      [-0.00072, 0],
      [-0.00058, 0],
      [-0.00061, 0],
      [-0.00064, 0],
      [-0.0001, 2],
      [-0.00074, 0],
      [-0.00051, 0],
      [-2e-5, 2],
      [-0.00061, 0],
      [-0.00011, 2],
      [-0.00074, 0],
      [-0.00061, 0],
      [-0.00015, 2],
      [-2e-5, 2],
      [-7e-5, 2],
      [-0.00049, 0],
      [-9e-5, 2],
      [-7e-5, 2],
      [-4e-5, 2],
      [-0.00058, 0],
      [-0.0006, 0],
      [-0.00011, 2],
      [0.00162, 1],
      [-0.00012, 2],
      [-0.00057, 0],
      [5e-5, 2]
    ],
    "red_o_points": [],
    "y_categories": ["N", "NOT APPLICABLE", "nan"],
    "blue_o_points": [],
    "blue_x_points": [
      [0.00331, 1],
      [9e-5, 2],
      [-0.00048, 0],
      [-0.0006, 0],
      [-4e-5, 2],
      [0.00204, 1],
      [0.00142, 1],
      [-0.0004, 0],
      [5e-5, 2],
      [-4e-5, 2],
      [-0.00045, 0],
      [0.0018, 1],
      [-1e-5, 2],
      [0.00197, 1],
      [-3e-5, 2]
    ]
  },
  "QA_lstPexMuscstrength[ShoulderAbduc]": {
    "red_x_points": [
      [-0.00051, 1],
      [-0.00032, 1],
      [-0.00027, 1],
      [-0.00034, 1],
      [-0.0004, 1],
      [-0.00036, 1],
      [-0.00046, 1],
      [-0.00038, 1],
      [-0.00058, 1],
      [-0.00043, 1],
      [-0.00025, 1],
      [-0.00037, 1],
      [0.00025, 2],
      [0.0004, 2],
      [0.00024, 2],
      [-0.00038, 1],
      [-0.00035, 1],
      [-0.0005, 1],
      [-0.00031, 1],
      [0.00023, 2],
      [0.00031, 2],
      [-0.00035, 1],
      [-0.00042, 1],
      [-0.00039, 1],
      [-0.00042, 1],
      [0.0004, 2],
      [-0.00049, 1],
      [-0.00032, 1],
      [0.0004, 2]
    ],
    "red_o_points": [],
    "y_categories": ["GREATER THAN OR EQUALS TO 3", "LESS THAN 3", "nan"],
    "blue_o_points": [],
    "blue_x_points": [
      [0.00034, 2],
      [-0.00036, 1],
      [-0.00036, 1],
      [-0.00043, 1],
      [0.00044, 2],
      [0.00036, 2],
      [0.00256, 0],
      [0.00059, 2],
      [0.00054, 2],
      [0.00035, 2],
      [-0.00036, 1],
      [0.00336, 0],
      [-0.0003, 1],
      [-5e-5, 1],
      [-0.00031, 1]
    ]
  },
  "QS_mulNeuromadSite[T2]": {
    "red_x_points": [
      [-0.00016, 2],
      [-0.00181, 0],
      [-0.00162, 0],
      [-0.00147, 0],
      [-0.00162, 0],
      [-0.00148, 0],
      [-0.00169, 0],
      [-0.00015, 2],
      [-0.00173, 0],
      [-0.00149, 0],
      [-0.00022, 2],
      [-0.00184, 0],
      [-0.00018, 2],
      [-0.00174, 0],
      [-0.00197, 0],
      [-0.00029, 2],
      [-0.00015, 2],
      [-0.00026, 2],
      [-0.00143, 0],
      [-0.00026, 2],
      [-0.00022, 2],
      [-0.00019, 2],
      [-0.0019, 0],
      [-0.00152, 0],
      [-0.00022, 2],
      [0.0037, 1],
      [-0.00026, 2],
      [-0.00139, 0],
      [-0.0002, 2]
    ],
    "red_o_points": [],
    "y_categories": ["N", "NOT APPLICABLE", "nan"],
    "blue_o_points": [],
    "blue_x_points": [
      [0.00724, 1],
      [-7e-5, 2],
      [-0.00089, 0],
      [-0.00096, 0],
      [-0.00014, 2],
      [0.00597, 1],
      [0.00411, 1],
      [-0.00134, 0],
      [-5e-5, 2],
      [-8e-5, 2],
      [-0.00099, 0],
      [0.00542, 1],
      [-0.00027, 2],
      [0.00594, 1],
      [-0.00012, 2]
    ]
  },
  "QS_mulNeuromadSite[C4]": {
    "red_x_points": [
      [4e-5, 2],
      [-0.00086, 0],
      [-0.00042, 0],
      [-0.00038, 0],
      [-0.00038, 0],
      [-0.00044, 0],
      [-0.00045, 0],
      [-0.00013, 2],
      [-0.0006, 0],
      [-0.00048, 0],
      [-9e-5, 2],
      [-0.00037, 0],
      [-1e-5, 2],
      [-0.00074, 0],
      [-0.00065, 0],
      [-4e-5, 2],
      [1e-5, 2],
      [-2e-5, 2],
      [-0.00047, 0],
      [0.0, 2],
      [1e-5, 2],
      [-0.00012, 2],
      [-0.00061, 0],
      [-0.0005, 0],
      [-5e-5, 2],
      [0.00122, 1],
      [-4e-5, 2],
      [-0.00039, 0],
      [6e-5, 2]
    ],
    "red_o_points": [],
    "y_categories": ["N", "NOT APPLICABLE", "nan"],
    "blue_o_points": [],
    "blue_x_points": [
      [0.00209, 1],
      [-3e-5, 2],
      [-0.00024, 0],
      [-0.0004, 0],
      [0.00023, 2],
      [0.00239, 1],
      [0.00096, 1],
      [-0.00034, 0],
      [-3e-5, 2],
      [4e-5, 2],
      [-0.00022, 0],
      [0.00112, 1],
      [2e-5, 2],
      [0.00128, 1],
      [1e-5, 2]
    ]
  },
  "QS_mulGraftNerve[Ra]": {
    "red_x_points": [
      [3e-5, 2],
      [-0.00029, 0],
      [-0.00018, 0],
      [-0.00022, 0],
      [-0.00025, 0],
      [-0.00021, 0],
      [-0.00022, 0],
      [-4e-5, 2],
      [-0.00015, 0],
      [-0.00019, 0],
      [3e-5, 2],
      [-0.00022, 0],
      [-4e-5, 2],
      [-0.00029, 0],
      [-0.00028, 0],
      [2e-5, 2],
      [2e-5, 2],
      [3e-5, 2],
      [-0.00021, 0],
      [3e-5, 2],
      [-5e-5, 2],
      [-1e-5, 2],
      [-0.00016, 0],
      [-0.00016, 0],
      [-4e-5, 2],
      [0.00049, 1],
      [-5e-5, 2],
      [-0.00012, 0],
      [-3e-5, 2]
    ],
    "red_o_points": [],
    "y_categories": ["N", "NOT APPLICABLE", "nan"],
    "blue_o_points": [],
    "blue_x_points": [
      [0.001, 1],
      [-3e-5, 2],
      [-0.00011, 0],
      [-0.00017, 0],
      [3e-5, 2],
      [0.00074, 1],
      [0.00018, 1],
      [-7e-5, 0],
      [-5e-5, 2],
      [0.0, 2],
      [-8e-5, 0],
      [0.00071, 1],
      [3e-5, 2],
      [0.00057, 1],
      [-1e-5, 2]
    ]
  },
  "QS_mulTransfSite[Oberlin]": {
    "red_x_points": [
      [-0.0014, 3],
      [-0.01829, 0],
      [-0.018, 0],
      [-0.01702, 0],
      [-0.01862, 0],
      [0.00249, 2],
      [-0.01978, 0],
      [-0.00142, 3],
      [0.00286, 2],
      [0.00301, 2],
      [-0.0013, 3],
      [0.00251, 2],
      [-0.00172, 3],
      [0.00191, 2],
      [-0.01732, 0],
      [-0.0013, 3],
      [-0.00132, 3],
      [-0.00126, 3],
      [-0.01589, 0],
      [-0.00134, 3],
      [-0.00162, 3],
      [-0.00146, 3],
      [0.00283, 2],
      [-0.01878, 0],
      [-0.0014, 3],
      [0.02167, 1],
      [-0.00139, 3],
      [-0.01862, 0],
      [-0.00152, 3]
    ],
    "red_o_points": [],
    "y_categories": ["N", "NOT APPLICABLE", "Y", "nan"],
    "blue_o_points": [],
    "blue_x_points": [
      [0.03137, 1],
      [-0.00097, 3],
      [0.0043, 2],
      [0.00497, 2],
      [-0.00053, 3],
      [0.026, 1],
      [0.02454, 1],
      [0.00326, 2],
      [-0.00065, 3],
      [-0.00062, 3],
      [0.0041, 2],
      [0.02474, 1],
      [-0.00089, 3],
      [0.02476, 1],
      [-0.00089, 3]
    ]
  },
  "QA_intPexForearmProna": {
    "red_x_points": [
      [0.00016, 2],
      [-0.00064, 0],
      [-0.00028, 2],
      [-0.0001, 2],
      [-0.00023, 2],
      [-0.00149, 0],
      [-0.00031, 2],
      [-0.01532, 0],
      [-0.0002, 2],
      [-0.00033, 2],
      [-0.014, 0],
      [-0.00138, 0],
      [0.00018, 2],
      [-0.00014, 2],
      [3e-5, 2],
      [-0.01385, 0],
      [-0.01407, 0],
      [-0.01376, 0],
      [-0.001, 0],
      [1e-5, 2],
      [0.00012, 2],
      [0.0002, 2],
      [-0.00024, 2],
      [-0.00019, 2],
      [0.00045, 2],
      [0.00072, 1],
      [0.00044, 2],
      [-0.00138, 0],
      [-1e-5, 2]
    ],
    "red_o_points": [],
    "y_categories": ["GREATER THAN OR EQUALS TO 80", "LESS THAN 80", "nan"],
    "blue_o_points": [],
    "blue_x_points": [
      [-0.00016, 2],
      [0.03794, 1],
      [-0.00043, 0],
      [-0.00011, 2],
      [0.0009, 2],
      [3e-5, 2],
      [0.00127, 1],
      [7e-5, 2],
      [0.0005, 2],
      [0.00093, 2],
      [-0.00022, 0],
      [5e-5, 2],
      [0.00102, 2],
      [3e-5, 2],
      [0.03479, 1]
    ]
  },
  "QA_yonInjChesttube": {
    "red_x_points": [
      [-0.00195, 2],
      [-0.00162, 2],
      [0.00186, 0],
      [-0.0016, 2],
      [-0.00225, 2],
      [0.0011, 0],
      [-0.00362, 1],
      [-0.0013, 2],
      [-0.00277, 2],
      [-0.0024, 2],
      [0.0011, 0],
      [0.0023, 0],
      [-0.00289, 2],
      [-0.00193, 2],
      [0.00069, 0],
      [0.00111, 0],
      [0.00094, 0],
      [0.00116, 0],
      [-0.00263, 1],
      [-0.00137, 2],
      [-0.0126, 1],
      [-0.00244, 2],
      [-0.00209, 2],
      [0.00161, 0],
      [-0.00205, 2],
      [-0.00025, 2],
      [-0.00202, 2],
      [0.00039, 0],
      [-0.00231, 2]
    ],
    "red_o_points": [],
    "y_categories": ["N", "Y", "nan"],
    "blue_o_points": [],
    "blue_x_points": [
      [1e-5, 1],
      [-0.00093, 2],
      [0.00247, 0],
      [0.00463, 0],
      [-0.00202, 2],
      [-4e-5, 2],
      [0.0001, 0],
      [0.00457, 0],
      [0.01361, 0],
      [0.00961, 0],
      [0.00236, 0],
      [-0.00011, 2],
      [0.00385, 0],
      [-5e-5, 2],
      [-0.00024, 2]
    ]
  },
  "QA_yonPexPain": {
    "red_x_points": [
      [-0.00582, 1],
      [-0.00052, 1],
      [-0.00042, 1],
      [-0.00028, 1],
      [-0.00038, 1],
      [-0.0009, 0],
      [-0.0003, 1],
      [-0.00462, 1],
      [-0.00182, 0],
      [-0.00054, 1],
      [-0.00408, 1],
      [-0.00113, 0],
      [-0.00677, 1],
      [-0.0005, 1],
      [-0.00024, 1],
      [0.00641, 0],
      [-0.00407, 1],
      [0.00521, 0],
      [-0.00042, 1],
      [0.007, 0],
      [-0.01361, 2],
      [-0.00618, 1],
      [-0.00018, 1],
      [-0.00061, 1],
      [-0.01081, 2],
      [-0.00074, 1],
      [-0.0055, 1],
      [-0.00033, 1],
      [-0.00665, 1]
    ],
    "red_o_points": [],
    "y_categories": ["N", "Y", "nan"],
    "blue_o_points": [],
    "blue_x_points": [
      [-2e-5, 1],
      [0.01603, 0],
      [0.00283, 0],
      [0.00084, 1],
      [-0.00388, 1],
      [0.00043, 2],
      [3e-5, 1],
      [0.00225, 1],
      [0.01779, 0],
      [0.01382, 0],
      [0.00062, 1],
      [0.00075, 0],
      [0.00884, 0],
      [-5e-5, 1],
      [-0.00147, 1]
    ]
  },
  "QS_mulTransfSite[IAx]": {
    "red_x_points": [
      [-8e-5, 0],
      [-8e-5, 0],
      [-8e-5, 0],
      [2e-5, 2],
      [5e-5, 1],
      [2e-5, 2]
    ],
    "red_o_points": [],
    "y_categories": ["N", "NOT APPLICABLE", "nan"],
    "blue_o_points": [],
    "blue_x_points": [[5e-5, 1], [2e-5, 2], [5e-5, 1], [2e-5, 2]]
  },
  "QA_lstPexPalle[Ulna]": {
    "red_x_points": [
      [-0.00075, 4],
      [-0.00277, 4],
      [-0.00203, 4],
      [-0.00763, 2],
      [-0.00296, 4],
      [-0.00976, 1],
      [-0.00296, 4],
      [-0.00048, 4],
      [-0.00334, 4],
      [0.01028, 3],
      [-0.00927, 1],
      [-0.00307, 4],
      [-0.00062, 4],
      [-0.00328, 4],
      [-0.00137, 4],
      [0.00406, 3],
      [-0.00923, 0],
      [0.00335, 3],
      [-0.00743, 0],
      [0.00471, 3],
      [-0.00058, 4],
      [-0.00069, 4],
      [-0.00309, 4],
      [-0.00272, 4],
      [-0.00034, 4],
      [0.00287, 3],
      [-0.00045, 4],
      [-0.00761, 0],
      [-0.00063, 4]
    ],
    "red_o_points": [],
    "y_categories": ["ABS", "HYPO", "NAIA", "PT", "nan"],
    "blue_o_points": [],
    "blue_x_points": [
      [-0.00041, 4],
      [-0.0003, 4],
      [0.01569, 3],
      [0.01544, 3],
      [-0.0002, 4],
      [-0.00012, 4],
      [0.0025, 3],
      [-0.00245, 4],
      [-0.0002, 4],
      [0.00015, 4],
      [0.0147, 3],
      [-0.00017, 4],
      [0.00455, 3],
      [-0.0001, 4],
      [0.00871, 3]
    ]
  }
}
