{
  "QA_lstPexMuscstrength[ElbowFlex]": {
    "red_x_points": [
      [-0.00434, 1],
      [-0.00314, 2],
      [-0.00586, 1],
      [-0.00466, 1],
      [-0.00393, 1],
      [0.00985, 0],
      [-0.00541, 1],
      [-0.00618, 1],
      [-0.00425, 1],
      [-0.00634, 1],
      [-0.00595, 1],
      [-0.00685, 1],
      [-0.00433, 1],
      [-0.00333, 2],
      [-0.00513, 2],
      [-0.00518, 2],
      [-0.00409, 1],
      [-0.00365, 2],
      [-0.00751, 2],
      [-0.00506, 1],
      [-0.00361, 1],
      [-0.00322, 1],
      [-0.00366, 1],
      [-0.00545, 2],
      [0.0016, 0],
      [-0.00422, 1],
      [-0.00601, 1],
      [-0.00427, 1],
      [-0.00414, 2],
      [-0.0044, 1],
      [-0.00527, 1],
      [-0.00536, 2]
    ],
    "red_o_points": [],
    "y_categories": ["GREATER THAN OR EQUALS TO 3", "LESS THAN 3", "nan"],
    "blue_o_points": [],
    "blue_x_points": [
      [-0.00042, 2],
      [-0.00059, 2],
      [0.01258, 0],
      [0.00099, 1],
      [0.03449, 0],
      [0.01582, 0],
      [-0.00122, 1],
      [0.01609, 0],
      [-0.0009, 1],
      [-0.00177, 1]
    ]
  },
  "QS_mulTransfSite[AcSsAA]": {
    "red_x_points": [
      [-0.00216, 3],
      [-0.01976, 2],
      [-0.00522, 0],
      [-0.01987, 2],
      [-0.00259, 3],
      [-0.03306, 2],
      [-0.00419, 0],
      [-0.00544, 0],
      [-0.0026, 3],
      [-0.00504, 0],
      [-0.02192, 2],
      [-0.00404, 0],
      [-0.00221, 3],
      [0.0211, 1],
      [-0.0027, 3],
      [-0.02289, 2],
      [-0.00252, 3],
      [-0.00487, 0],
      [-0.00337, 3],
      [-0.00241, 3],
      [-0.00232, 3],
      [-0.00177, 3],
      [-0.01911, 2],
      [-0.0025, 3],
      [-0.00399, 3],
      [-0.00247, 3],
      [-0.00445, 0],
      [-0.01873, 2],
      [0.02443, 1],
      [-0.00223, 3],
      [-0.00443, 0],
      [-0.00268, 3]
    ],
    "red_o_points": [],
    "y_categories": ["N", "NOT APPLICABLE", "Y", "nan"],
    "blue_o_points": [],
    "blue_x_points": [
      [0.03362, 1],
      [-0.00029, 3],
      [0.02408, 1],
      [0.00401, 0],
      [0.0042, 0],
      [0.02626, 1],
      [-0.00087, 3],
      [0.02468, 1],
      [-0.00081, 3],
      [-0.00079, 3]
    ]
  },
  "QS_mulLysisTrunk[Upper]": {
    "red_x_points": [
      [-0.00097, 3],
      [-0.00437, 0],
      [-0.00377, 0],
      [-0.00509, 0],
      [-0.00098, 3],
      [-0.0049, 0],
      [-0.00822, 2],
      [-0.00413, 0],
      [-0.00169, 3],
      [-0.00433, 0],
      [-0.00439, 0],
      [-0.00313, 0],
      [-0.001, 3],
      [0.00754, 1],
      [-0.00132, 3],
      [-0.00497, 0],
      [-0.00068, 3],
      [-0.00683, 2],
      [-0.00196, 3],
      [-0.00134, 3],
      [-0.00087, 3],
      [-0.00087, 3],
      [-0.00328, 0],
      [-0.00163, 3],
      [-0.00231, 3],
      [-0.00091, 3],
      [-0.0039, 0],
      [-0.00366, 0],
      [0.01001, 1],
      [-0.00091, 3],
      [-0.00865, 2],
      [-0.00119, 3]
    ],
    "red_o_points": [],
    "y_categories": ["N", "NOT APPLICABLE", "Y", "nan"],
    "blue_o_points": [],
    "blue_x_points": [
      [0.01532, 1],
      [-4e-5, 3],
      [0.01113, 1],
      [0.00189, 0],
      [-0.00021, 0],
      [0.00972, 1],
      [-0.00027, 3],
      [0.00937, 1],
      [-0.00058, 3],
      [-4e-5, 3]
    ]
  },
  "QS_lstBpsurgSide": {
    "red_x_points": [
      [-0.00141, 3],
      [-0.00817, 0],
      [-0.00835, 0],
      [-0.00877, 0],
      [-0.00171, 3],
      [-0.00974, 2],
      [-0.00808, 0],
      [-0.00834, 0],
      [-0.00211, 3],
      [-0.00875, 0],
      [-0.00779, 2],
      [-0.00854, 2],
      [-0.00182, 3],
      [0.01309, 1],
      [-0.00233, 3],
      [-0.00801, 2],
      [-0.00129, 3],
      [-0.00718, 2],
      [-0.00281, 3],
      [-0.0021, 3],
      [-0.00155, 3],
      [-0.00128, 3],
      [-0.00714, 0],
      [-0.0018, 3],
      [-0.00258, 3],
      [-0.00178, 3],
      [-0.00784, 2],
      [-0.00664, 2],
      [0.01471, 1],
      [-0.00133, 3],
      [-0.00852, 0],
      [-0.00151, 3]
    ],
    "red_o_points": [],
    "y_categories": ["L", "NOT APPLICABLE", "R", "nan"],
    "blue_o_points": [],
    "blue_x_points": [
      [0.02487, 1],
      [-0.00039, 3],
      [0.01552, 1],
      [0.00204, 0],
      [-0.00036, 2],
      [0.01648, 1],
      [-0.00057, 3],
      [0.01515, 1],
      [-0.00066, 3],
      [-0.00044, 3]
    ]
  },
  "QA_equInjTbpiTime": {
    "red_x_points": [
      [-0.00151, 0],
      [-0.00351, 0],
      [0.00801, 3],
      [-0.00435, 0],
      [-0.00386, 1],
      [-0.01511, 0],
      [-0.00573, 1],
      [-0.00686, 0],
      [0.00234, 3],
      [-0.00877, 0],
      [-0.00809, 0],
      [0.01189, 3],
      [-0.00215, 0],
      [-0.06896, 2],
      [0.00017, 3],
      [-0.00737, 0],
      [-0.00114, 0],
      [-0.00228, 0],
      [-0.02984, 1],
      [0.00165, 3],
      [-0.00241, 0],
      [-0.00431, 1],
      [-0.01026, 2],
      [-0.00044, 3],
      [-0.02459, 1],
      [-0.01458, 2],
      [-0.00843, 0],
      [-0.00935, 2],
      [0.002, 0],
      [-0.00047, 0],
      [0.00559, 3],
      [-0.00425, 1]
    ],
    "red_o_points": [],
    "y_categories": [
      "0 TO 6 MONTHS",
      "13 TO 24 MONTHS",
      "25 MONTHS OR MORE",
      "7 TO 12 MONTHS",
      "nan"
    ],
    "blue_o_points": [],
    "blue_x_points": [
      [0.0055, 0],
      [0.01506, 0],
      [0.0102, 0],
      [0.02713, 3],
      [0.02496, 3],
      [0.0107, 0],
      [0.0045, 1],
      [0.02024, 3],
      [0.00948, 3],
      [0.00362, 0]
    ]
  },
  "QA_yonInjUnconscio": {
    "red_x_points": [
      [-0.01012, 1],
      [-0.00961, 1],
      [-0.00827, 2],
      [-0.00585, 2],
      [-0.01297, 2],
      [0.03116, 0],
      [-0.01575, 1],
      [-0.00885, 2],
      [-0.01114, 2],
      [-0.011, 2],
      [-0.0092, 2],
      [-0.01797, 1],
      [-0.01056, 1],
      [-0.03469, 1],
      [-0.01238, 2],
      [-0.00688, 2],
      [-0.01071, 2],
      [-0.01078, 1],
      [0.01234, 0],
      [-0.01077, 1],
      [-0.00979, 1],
      [-0.00858, 1],
      [-0.00988, 1],
      [-0.01206, 2],
      [-0.01208, 1],
      [-0.01021, 2],
      [-0.01437, 1],
      [-0.00966, 1],
      [-0.0029, 2],
      [-0.00905, 2],
      [-0.0133, 1],
      [-0.01239, 2]
    ],
    "red_o_points": [],
    "y_categories": ["N", "Y", "nan"],
    "blue_o_points": [],
    "blue_x_points": [
      [0.00048, 2],
      [0.00502, 1],
      [0.02918, 0],
      [0.04701, 0],
      [0.04756, 0],
      [0.00199, 2],
      [-0.00196, 1],
      [0.00227, 2],
      [0.06107, 0],
      [-0.00383, 2]
    ]
  },
  "participant_code": {
    "red_x_points": [
      [-0.05046, 1],
      [-0.04946, 2],
      [-0.05011, 3],
      [-0.04952, 4],
      [-0.0494, 5],
      [-0.05023, 6],
      [-0.04834, 7],
      [-0.04893, 8],
      [-0.04975, 9],
      [-0.04852, 10],
      [-0.04846, 11],
      [-0.04852, 12],
      [-0.04946, 13],
      [-0.04705, 15],
      [-0.0494, 17],
      [-0.05058, 18],
      [-0.0504, 20],
      [-0.0487, 21],
      [-0.04805, 22],
      [-0.04717, 24],
      [-0.04905, 26],
      [-0.04964, 27],
      [-0.05064, 28],
      [-0.04811, 30],
      [-0.04875, 31],
      [-0.04899, 32],
      [-0.04834, 34],
      [-0.04811, 36],
      [-0.04893, 38],
      [-0.04975, 39],
      [-0.05028, 40],
      [-0.04928, 41]
    ],
    "red_o_points": [],
    "y_categories": [
      "P16554",
      "P18297",
      "P19283",
      "P19287",
      "P23391",
      "P30595",
      "P31645",
      "P31691",
      "P34778",
      "P35046",
      "P36328",
      "P43633",
      "P4544",
      "P46417",
      "P48965",
      "P53068",
      "P5497",
      "P59529",
      "P62483",
      "P64658",
      "P65202",
      "P66816",
      "P6751",
      "P7408",
      "P75566",
      "P76226",
      "P79971",
      "P82621",
      "P82990",
      "P84549",
      "P84932",
      "P85825",
      "P86989",
      "P8770",
      "P87791",
      "P90550",
      "P93159",
      "P94969",
      "P96710",
      "P97130",
      "P9744",
      "P98500",
      "nan"
    ],
    "blue_o_points": [],
    "blue_x_points": [
      [0.09937, 0],
      [0.10389, 14],
      [0.10205, 16],
      [0.10304, 19],
      [0.10261, 23],
      [0.10233, 25],
      [0.10346, 29],
      [0.10261, 33],
      [0.10318, 35],
      [0.10233, 37]
    ]
  },
  "QA_lstPexPain[C5]": {
    "red_x_points": [
      [-0.00424, 1],
      [-0.00744, 2],
      [-0.00886, 2],
      [-0.00827, 2],
      [-0.00487, 1],
      [-0.00148, 1],
      [-0.00129, 1],
      [-0.00251, 1],
      [-0.0043, 1],
      [-0.00226, 1],
      [-0.00234, 1],
      [-0.00131, 1],
      [-0.00468, 1],
      [-0.02562, 2],
      [-0.01277, 2],
      [-0.00865, 2],
      [-0.01265, 2],
      [-0.00708, 2],
      [-0.01244, 2],
      [-0.00385, 1],
      [-0.00441, 1],
      [-0.00357, 1],
      [-0.00963, 2],
      [-0.01306, 2],
      [-0.00348, 1],
      [-0.0125, 2],
      [-0.00742, 2],
      [-0.00686, 2],
      [-0.00925, 1],
      [-0.00998, 1],
      [-0.00115, 1],
      [-0.00504, 1]
    ],
    "red_o_points": [],
    "y_categories": ["NORM", "NPV", "nan"],
    "blue_o_points": [],
    "blue_x_points": [
      [0.03611, 0],
      [-0.00543, 2],
      [-0.00021, 1],
      [-0.00079, 1],
      [-0.00078, 1],
      [-0.00079, 1],
      [-0.00234, 1],
      [0.03077, 0],
      [-0.00218, 1],
      [0.08489, 0]
    ]
  },
  "QA_mulInjOrthesisType[ShoulderSupport]": {
    "red_x_points": [
      [-0.01092, 0],
      [-0.01001, 0],
      [-0.0105, 0],
      [-0.01067, 0],
      [-0.01009, 0],
      [-0.01143, 0],
      [-0.01073, 0],
      [-0.01087, 0],
      [-0.02684, 2],
      [-0.01137, 0],
      [-0.01084, 0],
      [-0.01098, 0],
      [-0.011, 0],
      [0.02477, 1],
      [-0.01137, 0],
      [-0.01105, 0],
      [-0.01188, 0],
      [-0.01847, 2],
      [0.01854, 1],
      [-0.00963, 0],
      [-0.01161, 0],
      [-0.02398, 2],
      [-0.00494, 3],
      [-0.01019, 0],
      [0.02225, 1],
      [-0.01019, 0],
      [-0.01084, 0],
      [-0.00965, 0],
      [-0.02011, 3],
      [-0.00087, 3],
      [-0.01019, 0],
      [-0.00985, 0]
    ],
    "red_o_points": [],
    "y_categories": ["N", "NOT APPLICABLE", "Y", "nan"],
    "blue_o_points": [],
    "blue_x_points": [
      [0.00163, 0],
      [0.03545, 1],
      [0.02674, 1],
      [0.05392, 1],
      [-0.00655, 0],
      [0.02703, 1],
      [-0.00587, 0],
      [0.02548, 1],
      [-0.00551, 0],
      [0.01574, 3]
    ]
  },
  "QA_mulInjOrthesisType[ArmSling]": {
    "red_x_points": [
      [-0.01182, 2],
      [-0.00959, 2],
      [-0.01047, 2],
      [-0.01048, 2],
      [-0.00996, 2],
      [-0.01064, 2],
      [-0.01076, 2],
      [-0.01125, 2],
      [-0.00962, 2],
      [-0.01163, 2],
      [-0.01081, 2],
      [-0.01119, 2],
      [-0.01137, 2],
      [0.01923, 1],
      [-0.01063, 2],
      [-0.01061, 2],
      [-0.01212, 2],
      [-0.01636, 0],
      [0.01728, 1],
      [-0.00979, 2],
      [-0.01143, 2],
      [-0.02431, 0],
      [-0.0052, 3],
      [-0.01098, 2],
      [0.01658, 1],
      [-0.00981, 2],
      [-0.01099, 2],
      [-0.00888, 2],
      [-0.02504, 3],
      [0.00103, 3],
      [-0.0093, 2],
      [-0.01011, 2]
    ],
    "red_o_points": [],
    "y_categories": ["N", "NOT APPLICABLE", "Y", "nan"],
    "blue_o_points": [],
    "blue_x_points": [
      [0.00512, 2],
      [0.0339, 1],
      [0.02272, 1],
      [0.05731, 1],
      [-0.00649, 2],
      [0.02534, 1],
      [-0.00568, 2],
      [0.02205, 1],
      [-0.00549, 2],
      [0.01781, 3]
    ]
  },
  "QS_mulLysisSite[Trunk]": {
    "red_x_points": [
      [-0.00025, 3],
      [-0.00185, 0],
      [-0.00169, 0],
      [-0.00242, 0],
      [-0.00052, 3],
      [-0.00216, 0],
      [-0.00503, 2],
      [-0.002, 0],
      [-0.00055, 3],
      [-0.0021, 0],
      [-0.00191, 0],
      [-0.00166, 0],
      [-0.00055, 3],
      [0.00352, 1],
      [-0.00054, 3],
      [-0.00232, 0],
      [-0.00048, 3],
      [-0.00352, 2],
      [-0.00046, 3],
      [-0.00058, 3],
      [-0.00035, 3],
      [-0.0005, 3],
      [-0.00158, 0],
      [-0.00059, 3],
      [-0.00044, 3],
      [-0.00041, 3],
      [-0.00185, 0],
      [-0.00177, 0],
      [0.00406, 1],
      [-0.00043, 3],
      [-0.00465, 2],
      [-0.00049, 3]
    ],
    "red_o_points": [],
    "y_categories": ["N", "NOT APPLICABLE", "Y", "nan"],
    "blue_o_points": [],
    "blue_x_points": [
      [0.00779, 1],
      [-2e-5, 3],
      [0.00495, 1],
      [0.00066, 0],
      [-0.00045, 0],
      [0.00433, 1],
      [-0.00023, 3],
      [0.00452, 1],
      [-0.00032, 3],
      [-0.00021, 3]
    ]
  },
  "QS_mulTransfSite[IMc]": {
    "red_x_points": [
      [-0.00066, 3],
      [-0.00768, 2],
      [-0.00333, 0],
      [-0.00385, 0],
      [-0.00083, 3],
      [-0.00356, 0],
      [-0.00286, 0],
      [-0.00351, 0],
      [-0.00105, 3],
      [-0.00347, 0],
      [-0.00361, 0],
      [-0.0031, 0],
      [-0.00082, 3],
      [0.00869, 1],
      [-0.00122, 3],
      [-0.0037, 0],
      [-0.00088, 3],
      [-0.00717, 2],
      [-0.00085, 3],
      [-0.00091, 3],
      [-0.00065, 3],
      [-0.00058, 3],
      [-0.00296, 0],
      [-0.00131, 3],
      [-0.00074, 3],
      [-0.00084, 3],
      [-0.00334, 0],
      [-0.00801, 2],
      [0.00918, 1],
      [-0.00083, 3],
      [-0.00826, 2],
      [-0.00104, 3]
    ],
    "red_o_points": [],
    "y_categories": ["N", "NOT APPLICABLE", "Y", "nan"],
    "blue_o_points": [],
    "blue_x_points": [
      [0.01482, 1],
      [-0.00036, 3],
      [0.00895, 1],
      [-0.00108, 0],
      [-0.00083, 0],
      [0.01073, 1],
      [-0.00015, 3],
      [0.00856, 1],
      [-0.0004, 3],
      [-0.00034, 3]
    ]
  },
  "QS_mulTransfSite[Oberlin]": {
    "red_x_points": [
      [-0.00289, 3],
      [-0.02448, 0],
      [-0.02724, 0],
      [-0.02436, 0],
      [-0.00348, 3],
      [-0.00522, 2],
      [-0.0037, 2],
      [-0.02466, 0],
      [-0.00336, 3],
      [-0.00501, 2],
      [-0.0051, 2],
      [-0.00333, 2],
      [-0.00317, 3],
      [0.02859, 1],
      [-0.00356, 3],
      [-0.00602, 2],
      [-0.00314, 3],
      [-0.02428, 0],
      [-0.00454, 3],
      [-0.00338, 3],
      [-0.00274, 3],
      [-0.00291, 3],
      [-0.02468, 0],
      [-0.00354, 3],
      [-0.0056, 3],
      [-0.00322, 3],
      [-0.00537, 2],
      [-0.0239, 0],
      [0.03069, 1],
      [-0.00308, 3],
      [-0.02504, 0],
      [-0.00322, 3]
    ],
    "red_o_points": [],
    "y_categories": ["N", "NOT APPLICABLE", "Y", "nan"],
    "blue_o_points": [],
    "blue_x_points": [
      [0.04205, 1],
      [-0.00121, 3],
      [0.02984, 1],
      [0.0043, 2],
      [0.00211, 2],
      [0.03202, 1],
      [-0.00138, 3],
      [0.0313, 1],
      [-0.00158, 3],
      [-9e-5, 3]
    ]
  },
  "QS_mulNeuromadSite[C8]": {
    "red_x_points": [
      [0.00011, 2],
      [-0.00218, 0],
      [-0.00212, 0],
      [-0.00226, 0],
      [-0.00017, 2],
      [-0.00256, 0],
      [-0.0016, 0],
      [-0.00261, 0],
      [-0.00022, 2],
      [-0.00224, 0],
      [-0.00279, 0],
      [-0.00188, 0],
      [-3e-5, 2],
      [0.00147, 1],
      [-0.00026, 2],
      [-0.00306, 0],
      [-0.00026, 2],
      [-0.00216, 0],
      [-0.00147, 2],
      [-0.0001, 2],
      [0.00012, 2],
      [-0.0001, 2],
      [-0.00207, 0],
      [-0.00023, 2],
      [-0.00136, 2],
      [-0.00023, 2],
      [-0.00195, 0],
      [-0.00161, 0],
      [0.003, 1],
      [-0.00011, 2],
      [-0.00164, 0],
      [-0.00017, 2]
    ],
    "red_o_points": [],
    "y_categories": ["N", "NOT APPLICABLE", "nan"],
    "blue_o_points": [],
    "blue_x_points": [
      [0.00722, 1],
      [0.00023, 2],
      [0.00361, 1],
      [0.0014, 0],
      [-0.0005, 0],
      [0.00384, 1],
      [0.00012, 2],
      [0.00363, 1],
      [9e-5, 2],
      [0.00054, 2]
    ]
  },
  "QA_mulInjTbpiCause[Motorcycle]": {
    "red_x_points": [
      [-0.00624, 0],
      [-0.00088, 1],
      [-0.00131, 1],
      [-0.00126, 1],
      [4e-5, 1],
      [-0.00167, 1],
      [-0.00041, 1],
      [-0.00134, 1],
      [5e-5, 1],
      [-0.00139, 1],
      [-0.00123, 1],
      [-0.00035, 1],
      [-0.00545, 0],
      [-0.0652, 1],
      [-0.00052, 1],
      [-0.00177, 1],
      [0.00019, 1],
      [-0.00062, 1],
      [-0.00186, 1],
      [-0.00605, 0],
      [0.00101, 1],
      [0.00064, 1],
      [-0.00031, 1],
      [-0.00059, 1],
      [-0.0018, 1],
      [-0.00346, 0],
      [-0.00055, 1],
      [-0.00033, 1],
      [-0.06468, 1],
      [-0.00024, 1],
      [-0.00031, 1],
      [-0.00073, 1]
    ],
    "red_o_points": [],
    "y_categories": ["N", "Y", "nan"],
    "blue_o_points": [],
    "blue_x_points": [
      [0.02899, 0],
      [-0.00053, 1],
      [0.02801, 0],
      [-0.00301, 1],
      [-0.00047, 1],
      [0.03039, 0],
      [0.00104, 1],
      [0.02508, 0],
      [0.00127, 1],
      [0.00134, 1]
    ]
  },
  "QS_mulTransfSite[Other]": {
    "red_x_points": [
      [-0.00368, 3],
      [-0.02345, 0],
      [-0.02342, 0],
      [-0.0241, 0],
      [-0.00366, 3],
      [-0.02558, 0],
      [-0.02429, 0],
      [-0.02365, 0],
      [-0.00423, 3],
      [-0.02498, 0],
      [-0.02454, 0],
      [-0.0239, 0],
      [-0.00316, 3],
      [0.03292, 1],
      [-0.0039, 3],
      [-0.02417, 0],
      [-0.00343, 3],
      [-0.02225, 0],
      [-0.0054, 3],
      [-0.00355, 3],
      [-0.00356, 3],
      [-0.00383, 3],
      [-0.02336, 0],
      [-0.00407, 3],
      [-0.00627, 3],
      [-0.00377, 3],
      [-0.02347, 0],
      [-0.02333, 0],
      [0.03577, 1],
      [-0.00335, 3],
      [-0.02324, 0],
      [-0.00354, 3]
    ],
    "red_o_points": [],
    "y_categories": ["N", "NOT APPLICABLE", "Y", "nan"],
    "blue_o_points": [],
    "blue_x_points": [
      [0.04509, 1],
      [-0.00167, 3],
      [0.035, 1],
      [-0.00988, 0],
      [0.07932, 2],
      [0.03687, 1],
      [-0.00134, 3],
      [0.03564, 1],
      [-0.00164, 3],
      [-0.00062, 3]
    ]
  },
  "QA_yonInjBpsurg": {
    "red_x_points": [
      [-0.00313, 1],
      [-0.00168, 1],
      [-0.00224, 1],
      [-0.00238, 1],
      [-0.00262, 1],
      [-0.00306, 1],
      [-0.00176, 1],
      [-0.00242, 1],
      [-0.00251, 1],
      [-0.00231, 1],
      [-0.00204, 1],
      [-0.00207, 1],
      [-0.00231, 1],
      [0.00492, 0],
      [-0.00258, 1],
      [-0.0025, 1],
      [-0.00258, 1],
      [-0.0017, 1],
      [-0.00254, 1],
      [-0.00241, 1],
      [-0.00223, 1],
      [-0.00213, 1],
      [-0.0015, 1],
      [-0.00246, 1],
      [-0.00278, 1],
      [-0.00273, 1],
      [-0.00198, 1],
      [-0.00167, 1],
      [0.00314, 0],
      [-0.00184, 1],
      [-0.00188, 1],
      [-0.00225, 1]
    ],
    "red_o_points": [],
    "y_categories": ["N", "Y", "nan"],
    "blue_o_points": [],
    "blue_x_points": [
      [0.01223, 0],
      [-0.00054, 1],
      [0.00911, 0],
      [-0.00207, 1],
      [-0.00177, 1],
      [0.00872, 0],
      [-0.00113, 1],
      [0.00934, 0],
      [-0.00126, 1],
      [-0.0, 1]
    ]
  },
  "QS_mulBpsurgeryType[Lysis]": {
    "red_x_points": [
      [-0.0012, 3],
      [-0.00694, 0],
      [-0.0163, 2],
      [-0.0076, 0],
      [-0.00155, 3],
      [-0.00723, 0],
      [-0.0155, 2],
      [-0.00702, 0],
      [-0.00214, 3],
      [-0.00662, 0],
      [-0.00736, 0],
      [-0.00534, 0],
      [-0.0012, 3],
      [0.01295, 1],
      [-0.00181, 3],
      [-0.00765, 0],
      [-0.0011, 3],
      [-0.01245, 2],
      [-0.00225, 3],
      [-0.00191, 3],
      [-0.00124, 3],
      [-0.001, 3],
      [-0.006, 0],
      [-0.00205, 3],
      [-0.00379, 3],
      [-0.00122, 3],
      [-0.00689, 0],
      [-0.00649, 0],
      [0.01476, 1],
      [-0.00102, 3],
      [-0.01559, 2],
      [-0.00144, 3]
    ],
    "red_o_points": [],
    "y_categories": ["N", "NOT APPLICABLE", "Y", "nan"],
    "blue_o_points": [],
    "blue_x_points": [
      [0.02737, 1],
      [-0.00047, 3],
      [0.01864, 1],
      [0.00169, 0],
      [0.00027, 0],
      [0.01737, 1],
      [-0.00029, 3],
      [0.01698, 1],
      [-0.0006, 3],
      [0.00017, 3]
    ]
  }
}
