{
  "QA_lstPexPain[C8]": {
    "red_x_points": [
      [0.0073, 0],
      [-0.005, 2],
      [-0.00542, 2],
      [0.00452, 0],
      [-0.00484, 2],
      [-0.00676, 1],
      [-0.00854, 1],
      [-0.00835, 1],
      [-0.00722, 2],
      [-0.00676, 2],
      [-0.00754, 2],
      [-0.00513, 2],
      [-0.00957, 1],
      [0.00562, 0],
      [-0.00832, 1],
      [-0.00749, 1],
      [-0.00524, 2],
      [-0.00645, 2],
      [-0.00828, 2],
      [-0.00517, 2],
      [-0.01064, 1],
      [-0.00514, 1],
      [-0.01163, 1]
    ],
    "red_o_points": [],
    "y_categories": ["NORM", "NPV", "nan"],
    "blue_o_points": [],
    "blue_x_points": [
      [-0.00701, 1],
      [-0.00501, 1],
      [0.00939, 0],
      [-0.00134, 1],
      [0.01484, 0],
      [0.01432, 0],
      [0.0127, 0],
      [0.01183, 0],
      [-0.00473, 2],
      [-0.00065, 2],
      [-0.00411, 2],
      [6e-5, 1],
      [-0.00344, 2],
      [0.01123, 0],
      [0.0113, 0],
      [0.01213, 0],
      [-0.0037, 2],
      [0.01143, 0],
      [0.01241, 0],
      [0.01727, 0],
      [0.01712, 0]
    ]
  },
  "QA_lstPexPain[C7]": {
    "red_x_points": [
      [-0.00897, 1],
      [-0.00843, 2],
      [-0.00799, 2],
      [-0.00771, 1],
      [-0.00761, 2],
      [-0.00611, 1],
      [-0.00769, 1],
      [-0.00934, 1],
      [-0.00903, 2],
      [-0.00945, 2],
      [-0.01024, 2],
      [-0.00791, 2],
      [-0.00914, 1],
      [0.01279, 0],
      [-0.00863, 1],
      [-0.0074, 1],
      [-0.0071, 2],
      [-0.00981, 2],
      [-0.01146, 2],
      [-0.00777, 2],
      [-0.01047, 1],
      [-0.00596, 1],
      [-0.00903, 1]
    ],
    "red_o_points": [],
    "y_categories": ["NORM", "NPV", "nan"],
    "blue_o_points": [],
    "blue_x_points": [
      [-0.0064, 1],
      [-0.00631, 1],
      [0.02006, 0],
      [-0.00292, 1],
      [0.02625, 0],
      [-0.00446, 1],
      [0.02309, 0],
      [0.02377, 0],
      [-0.00766, 2],
      [-0.00436, 2],
      [-0.00724, 2],
      [-0.00453, 1],
      [-0.00685, 2],
      [0.02237, 0],
      [0.02197, 0],
      [0.02179, 0],
      [-0.00747, 2],
      [0.02332, 0],
      [0.02842, 0],
      [-0.00706, 1],
      [0.02868, 0]
    ]
  },
  "QA_lstPexKine[Index]": {
    "red_x_points": [
      [-0.00016, 1],
      [-0.00076, 2],
      [-0.00273, 2],
      [0.00173, 1],
      [-0.00147, 2],
      [-0.01052, 0],
      [0.00053, 1],
      [0.00051, 1],
      [-0.00107, 2],
      [0.00115, 1],
      [-0.00148, 2],
      [-0.00092, 2],
      [-0.00196, 2],
      [0.00104, 1],
      [0.00019, 1],
      [-0.00326, 0],
      [-0.00102, 2],
      [-0.00175, 2],
      [-0.00368, 2],
      [-0.00073, 2],
      [-0.00049, 2],
      [-0.00781, 0],
      [-0.00195, 2]
    ],
    "red_o_points": [],
    "y_categories": ["NPV", "PV", "nan"],
    "blue_o_points": [],
    "blue_x_points": [
      [0.0042, 0],
      [-0.00067, 2],
      [0.00099, 1],
      [0.00546, 1],
      [-0.00059, 2],
      [0.00523, 1],
      [0.0028, 1],
      [0.00338, 1],
      [-0.00051, 2],
      [-0.00018, 2],
      [-0.00048, 2],
      [0.00739, 1],
      [-0.00032, 2],
      [0.00126, 1],
      [0.00073, 1],
      [0.00286, 0],
      [-0.00038, 2],
      [0.00043, 1],
      [-0.00014, 2],
      [0.00331, 1],
      [0.00181, 1]
    ]
  },
  "QA_yonInjDisloc": {
    "red_x_points": [
      [0.0, 2],
      [-1e-5, 2],
      [-1e-5, 2],
      [1e-5, 2],
      [-0.0, 2],
      [1e-5, 2],
      [-0.00011, 2],
      [-7e-5, 2],
      [0.0, 2],
      [-1e-5, 2],
      [6e-5, 2],
      [-1e-5, 2],
      [2e-5, 2],
      [-0.00014, 2],
      [-0.00983, 1],
      [-0.00015, 2],
      [-0.0, 2],
      [0.0, 2],
      [3e-5, 2],
      [1e-5, 2],
      [-0.0, 2],
      [-0.00473, 1],
      [0.0, 2]
    ],
    "red_o_points": [],
    "y_categories": ["N", "Y", "nan"],
    "blue_o_points": [],
    "blue_x_points": [
      [7e-5, 2],
      [2e-5, 2],
      [5e-5, 2],
      [6e-5, 2],
      [8e-5, 2],
      [8e-5, 2],
      [4e-5, 2],
      [8e-5, 2],
      [0.00017, 2],
      [0.00019, 2],
      [3e-5, 2],
      [0.00022, 2],
      [0.00645, 0],
      [0.00689, 0],
      [8e-5, 2],
      [8e-5, 2],
      [-0.0, 2],
      [4e-5, 2],
      [0.0003, 2],
      [0.0, 2],
      [0.0, 2]
    ]
  },
  "QA_lstPexTouch[C7]": {
    "red_x_points": [
      [-0.01312, 1],
      [-0.0032, 2],
      [-0.00895, 1],
      [-0.01114, 1],
      [-0.00315, 2],
      [-0.0084, 1],
      [-0.01166, 1],
      [-0.01196, 1],
      [-0.00353, 2],
      [-0.00491, 2],
      [-0.01406, 1],
      [-0.00346, 2],
      [-0.01319, 1],
      [0.01051, 0],
      [-0.01242, 1],
      [-0.01108, 1],
      [-0.00377, 2],
      [0.01212, 0],
      [-0.0097, 1],
      [-0.00382, 2],
      [-0.01421, 1],
      [-0.00822, 1],
      [-0.01496, 1]
    ],
    "red_o_points": [],
    "y_categories": ["NORM", "NPV", "nan"],
    "blue_o_points": [],
    "blue_x_points": [
      [-0.01032, 1],
      [-0.00982, 1],
      [0.01933, 0],
      [-0.0074, 1],
      [0.02351, 0],
      [-0.00694, 1],
      [0.02154, 0],
      [-0.00748, 1],
      [0.00075, 2],
      [0.00125, 2],
      [-0.00152, 2],
      [-0.00711, 1],
      [0.00134, 2],
      [0.01799, 0],
      [0.01874, 0],
      [0.01902, 0],
      [0.00138, 2],
      [0.01856, 0],
      [0.02482, 0],
      [0.0247, 0],
      [0.02393, 0]
    ]
  },
  "QA_lstPexTouch[C6]": {
    "red_x_points": [
      [-0.00518, 1],
      [-0.00239, 2],
      [-0.00349, 1],
      [-0.00261, 1],
      [-0.0023, 2],
      [-0.00235, 1],
      [-0.00225, 1],
      [-0.00487, 1],
      [-0.0024, 2],
      [-0.00297, 2],
      [-0.00359, 1],
      [-0.00195, 2],
      [-0.00394, 1],
      [-0.00369, 1],
      [-0.00527, 1],
      [-0.00241, 1],
      [-0.00172, 2],
      [-0.00516, 1],
      [-0.00304, 1],
      [-0.00319, 2],
      [-0.0042, 1],
      [-0.00194, 1],
      [-0.00417, 1]
    ],
    "red_o_points": [],
    "y_categories": ["NORM", "NPV", "nan"],
    "blue_o_points": [],
    "blue_x_points": [
      [-0.00321, 1],
      [-0.0034, 1],
      [0.01565, 0],
      [-0.00227, 1],
      [0.0235, 0],
      [-0.00243, 1],
      [-0.00191, 1],
      [-0.00246, 1],
      [-0.00044, 2],
      [0.00217, 2],
      [-0.00073, 2],
      [-0.00253, 1],
      [0.00034, 2],
      [-0.00257, 1],
      [-0.00227, 1],
      [0.01806, 0],
      [-0.00024, 2],
      [0.01775, 0],
      [0.0275, 0],
      [-0.00256, 1],
      [-0.00285, 1]
    ]
  },
  "QS_equBpsurgTime": {
    "red_x_points": [
      [0.00166, 3],
      [-0.01306, 0],
      [-0.00026, 2],
      [-0.01543, 0],
      [-0.00855, 0],
      [-0.00316, 1],
      [-0.00025, 3],
      [-0.00083, 3],
      [0.00211, 3],
      [-0.01091, 1],
      [0.00051, 3],
      [0.00156, 2],
      [0.00091, 3],
      [-0.01243, 2],
      [0.00037, 3],
      [0.0001, 3],
      [-0.00561, 0],
      [0.00206, 3],
      [-0.01408, 0],
      [-0.00888, 0],
      [0.00034, 3],
      [-0.00209, 2],
      [0.00085, 3]
    ],
    "red_o_points": [],
    "y_categories": [
      "0 TO 6 MONTHS",
      "13 TO 24 MONTHS",
      "7 TO 12 MONTHS",
      "nan"
    ],
    "blue_o_points": [],
    "blue_x_points": [
      [0.00222, 3],
      [0.0017, 3],
      [9e-5, 0],
      [0.0136, 1],
      [0.00268, 3],
      [0.00799, 1],
      [0.0038, 0],
      [0.00745, 2],
      [0.00333, 3],
      [0.00262, 3],
      [0.01246, 2],
      [0.00836, 2],
      [0.00311, 3],
      [0.00137, 3],
      [0.00184, 3],
      [0.00126, 3],
      [0.00348, 3],
      [0.00157, 3],
      [0.00211, 3],
      [0.00181, 3],
      [0.00219, 3]
    ]
  },
  "QA_lstPexPain[T1]": {
    "red_x_points": [
      [-0.00772, 1],
      [-0.00381, 2],
      [-0.00423, 2],
      [0.00177, 0],
      [-0.00364, 2],
      [-0.00166, 1],
      [0.00122, 0],
      [0.00116, 0],
      [-0.00556, 2],
      [-0.00439, 2],
      [-0.00682, 2],
      [-0.00334, 2],
      [-0.00611, 1],
      [-0.01126, 1],
      [-0.00288, 1],
      [-0.00196, 1],
      [-0.00285, 2],
      [-0.0101, 2],
      [-0.00937, 2],
      [-0.00457, 2],
      [-0.0072, 1],
      [-0.00173, 1],
      [-0.00672, 1]
    ],
    "red_o_points": [],
    "y_categories": ["NORM", "NPV", "nan"],
    "blue_o_points": [],
    "blue_x_points": [
      [0.00064, 1],
      [-0.00048, 1],
      [0.00608, 0],
      [0.00232, 1],
      [0.01431, 0],
      [0.00149, 1],
      [0.01218, 0],
      [0.01125, 0],
      [-0.00203, 2],
      [0.00137, 2],
      [-0.00259, 2],
      [0.00056, 1],
      [-0.00185, 2],
      [0.00769, 0],
      [0.0068, 0],
      [0.00762, 0],
      [-0.00248, 2],
      [-0.00472, 1],
      [0.01146, 0],
      [0.01661, 0],
      [0.01556, 0]
    ]
  },
  "QA_lstPexInspectio[ScapulaAlata]": {
    "red_x_points": [
      [-0.00124, 1],
      [-9e-5, 1],
      [-0.00012, 1],
      [-0.00021, 1],
      [-0.0001, 1],
      [-6e-5, 1],
      [-0.00078, 1],
      [-0.00285, 1],
      [-0.00021, 1],
      [-5e-5, 1],
      [-0.00056, 1],
      [-5e-5, 1],
      [-0.00021, 1],
      [-0.00068, 1],
      [-0.00202, 1],
      [-0.0005, 1],
      [-6e-5, 1],
      [-0.00031, 1],
      [-0.0002, 1],
      [-0.00026, 1],
      [-0.00091, 1],
      [-0.00029, 1],
      [-0.00012, 1]
    ],
    "red_o_points": [],
    "y_categories": ["ABS", "NAIA", "PT", "nan"],
    "blue_o_points": [],
    "blue_x_points": [
      [-0.00018, 1],
      [-0.00019, 1],
      [-0.0002, 1],
      [-0.00021, 1],
      [-0.00024, 1],
      [-0.00017, 1],
      [-0.00014, 1],
      [-0.00019, 1],
      [-7e-5, 1],
      [-0.00072, 1],
      [-8e-5, 1],
      [-0.00015, 1],
      [-8e-5, 1],
      [0.00568, 0],
      [-0.00015, 1],
      [-0.00012, 1],
      [-0.00018, 1],
      [-5e-5, 1],
      [0.00966, 2],
      [-0.00023, 1],
      [-0.00011, 1]
    ]
  },
  "QA_yonInjFracture": {
    "red_x_points": [
      [0.00497, 0],
      [-0.0036, 2],
      [0.00323, 0],
      [-0.00573, 2],
      [-0.00893, 1],
      [-0.01182, 1],
      [0.00118, 0],
      [0.00235, 0],
      [-0.01545, 1],
      [-0.01242, 1],
      [0.00345, 0],
      [-0.01034, 1],
      [-0.01385, 1],
      [-0.00231, 0],
      [-0.01307, 1],
      [-0.01081, 1],
      [-0.00777, 1],
      [0.00311, 0],
      [0.00244, 0],
      [0.00455, 0],
      [-0.01046, 1],
      [-0.00773, 1],
      [-0.01953, 1]
    ],
    "red_o_points": [],
    "y_categories": ["N", "Y", "nan"],
    "blue_o_points": [],
    "blue_x_points": [
      [0.01044, 0],
      [0.01103, 0],
      [0.00263, 0],
      [0.00707, 0],
      [0.00896, 2],
      [0.00791, 0],
      [0.00469, 1],
      [0.00146, 1],
      [-0.00711, 1],
      [0.00909, 0],
      [0.01088, 0],
      [0.01168, 0],
      [0.00941, 0],
      [0.00324, 0],
      [0.00413, 0],
      [0.00662, 2],
      [0.01082, 0],
      [0.00516, 0],
      [0.0045, 0],
      [-0.00364, 1],
      [0.00956, 2]
    ]
  },
  "QS_mulGraftTrunk[MiddleTrunk]": {
    "red_x_points": [
      [-0.0003, 1],
      [-0.00016, 0],
      [-0.0, 0],
      [4e-5, 0],
      [-0.00015, 0],
      [6e-5, 0],
      [-4e-5, 2],
      [-0.00064, 1],
      [0.00025, 2],
      [-0.00027, 0],
      [2e-5, 2],
      [-0.00027, 0],
      [1e-5, 2],
      [-0.0006, 1],
      [-2e-5, 2],
      [-4e-5, 0],
      [5e-5, 2],
      [4e-5, 0],
      [-0.00017, 0],
      [-0.00032, 1],
      [3e-5, 0],
      [-2e-5, 2]
    ],
    "red_o_points": [],
    "y_categories": ["N", "NOT APPLICABLE", "nan"],
    "blue_o_points": [],
    "blue_x_points": [
      [5e-5, 2],
      [0.00015, 2],
      [9e-5, 0],
      [0.0002, 0],
      [4e-5, 2],
      [0.00011, 0],
      [0.00022, 0],
      [0.00025, 2],
      [0.00057, 1],
      [-0.00014, 0],
      [0.00021, 0],
      [0.00027, 2],
      [7e-5, 2],
      [3e-5, 2],
      [6e-5, 2],
      [0.00017, 2],
      [0.00017, 2],
      [-7e-5, 1],
      [4e-5, 2]
    ]
  },
  "QS_mulGraftNerve[Ac]": {
    "red_x_points": [
      [-0.00052, 1],
      [-0.00025, 0],
      [-3e-5, 0],
      [6e-5, 0],
      [-0.00016, 0],
      [6e-5, 0],
      [-5e-5, 2],
      [-0.00035, 1],
      [4e-5, 2],
      [-0.00018, 0],
      [7e-5, 2],
      [-0.00019, 0],
      [0.00012, 2],
      [-0.00012, 0],
      [-0.00039, 1],
      [3e-5, 2],
      [9e-5, 2],
      [-0.00011, 0],
      [-6e-5, 0],
      [-0.00062, 1],
      [4e-5, 0],
      [0.00011, 2]
    ],
    "red_o_points": [],
    "y_categories": ["N", "NOT APPLICABLE", "nan"],
    "blue_o_points": [],
    "blue_x_points": [
      [0.0001, 2],
      [9e-5, 2],
      [1e-5, 0],
      [0.00011, 0],
      [0.00014, 2],
      [0.00018, 0],
      [6e-5, 0],
      [0.0001, 0],
      [0.00016, 2],
      [0.0004, 1],
      [-9e-5, 0],
      [7e-5, 0],
      [0.00012, 2],
      [0.00011, 2],
      [0.0001, 2],
      [7e-5, 2],
      [0.00016, 2],
      [6e-5, 2],
      [0.00019, 1],
      [0.00017, 2],
      [8e-5, 2]
    ]
  },
  "QA_lstPexArthre[Shoulder]": {
    "red_x_points": [
      [0.00478, 2],
      [-0.00176, 3],
      [-0.00383, 3],
      [0.00585, 2],
      [-0.01555, 0],
      [-0.02017, 1],
      [0.00579, 2],
      [0.0063, 2],
      [-0.00254, 3],
      [0.00515, 2],
      [-0.00369, 3],
      [-0.00193, 3],
      [-0.00375, 3],
      [-0.02928, 1],
      [0.00644, 2],
      [-0.01658, 1],
      [-0.00245, 3],
      [-0.00406, 3],
      [-0.00508, 3],
      [-0.00214, 3],
      [-0.00326, 3],
      [-0.01426, 1],
      [-0.0037, 3]
    ],
    "red_o_points": [],
    "y_categories": ["NAIA", "NPV", "PV", "nan"],
    "blue_o_points": [],
    "blue_x_points": [
      [0.01187, 2],
      [-0.00258, 3],
      [0.00724, 2],
      [0.0105, 2],
      [-0.00141, 3],
      [0.01197, 2],
      [0.01085, 2],
      [0.01015, 2],
      [-0.0019, 3],
      [-0.00113, 3],
      [-0.00195, 3],
      [0.01307, 2],
      [-0.00165, 3],
      [0.00821, 2],
      [0.00659, 2],
      [0.0003, 1],
      [-0.00145, 3],
      [0.00715, 2],
      [-0.00102, 3],
      [0.0081, 2],
      [0.0068, 2]
    ]
  },
  "QS_mulNeuromadSite[C8]": {
    "red_x_points": [
      [-0.0029, 1],
      [-0.00278, 0],
      [-0.00054, 0],
      [0.00053, 0],
      [-0.00151, 0],
      [0.00028, 0],
      [-0.00034, 2],
      [-0.00425, 1],
      [0.00114, 2],
      [-0.0018, 0],
      [0.00024, 2],
      [-0.00241, 0],
      [1e-5, 2],
      [5e-5, 0],
      [-0.00641, 1],
      [-4e-5, 2],
      [-0.00174, 0],
      [0.00046, 2],
      [-0.0012, 0],
      [-0.00268, 0],
      [-0.00375, 1],
      [0.00034, 0],
      [3e-5, 2]
    ],
    "red_o_points": [],
    "y_categories": ["N", "NOT APPLICABLE", "nan"],
    "blue_o_points": [],
    "blue_x_points": [
      [0.00117, 2],
      [0.00052, 2],
      [0.0006, 0],
      [0.00162, 0],
      [0.00054, 2],
      [0.00195, 0],
      [0.00114, 0],
      [0.00101, 0],
      [0.00224, 2],
      [0.00632, 1],
      [-0.00097, 0],
      [0.00206, 0],
      [0.00176, 2],
      [0.0008, 2],
      [0.00147, 2],
      [0.00055, 2],
      [0.00222, 2],
      [0.001, 2],
      [0.00156, 1],
      [0.00105, 2],
      [0.00067, 2]
    ]
  },
  "QS_mulGraftNerve[Ph]": {
    "red_x_points": [
      [-0.00142, 1],
      [-0.00047, 0],
      [8e-5, 0],
      [3e-5, 0],
      [-0.00023, 0],
      [0.00023, 0],
      [6e-5, 2],
      [-0.00149, 1],
      [0.00031, 2],
      [-0.00042, 0],
      [-3e-5, 2],
      [-0.00024, 0],
      [4e-5, 2],
      [-0.0002, 0],
      [-0.0021, 1],
      [7e-5, 2],
      [-0.00049, 0],
      [1e-5, 2],
      [-2e-5, 0],
      [-0.00043, 0],
      [-0.00113, 1],
      [8e-5, 0],
      [-4e-5, 2]
    ],
    "red_o_points": [],
    "y_categories": ["N", "NOT APPLICABLE", "nan"],
    "blue_o_points": [],
    "blue_x_points": [
      [0.00051, 2],
      [0.00042, 2],
      [0.00011, 0],
      [0.0003, 0],
      [0.00011, 2],
      [0.00066, 0],
      [0.00023, 0],
      [0.00018, 0],
      [0.0004, 2],
      [0.00147, 1],
      [-0.00031, 0],
      [0.00104, 0],
      [0.00043, 2],
      [0.00046, 2],
      [0.00018, 2],
      [0.00018, 2],
      [0.0003, 2],
      [0.00037, 2],
      [0.00017, 1],
      [0.00033, 2],
      [0.00024, 2]
    ]
  },
  "QA_lstPexMuscstrength[FingersFlex]": {
    "red_x_points": [
      [0.00202, 2],
      [0.00219, 2],
      [-0.02863, 1],
      [0.00966, 0],
      [-0.03014, 1],
      [-0.02967, 1],
      [-0.0316, 1],
      [0.00854, 0],
      [0.00218, 2],
      [0.00229, 2],
      [0.00933, 0],
      [0.00239, 2],
      [-0.03137, 1],
      [0.00907, 0],
      [0.00893, 0],
      [-0.02919, 1],
      [-0.02874, 1],
      [0.00235, 2],
      [0.00962, 0],
      [0.00838, 0],
      [0.00208, 2],
      [-0.02818, 1],
      [0.00182, 2]
    ],
    "red_o_points": [],
    "y_categories": ["GREATER THAN OR EQUALS TO 3", "LESS THAN 3", "nan"],
    "blue_o_points": [],
    "blue_x_points": [
      [0.0121, 0],
      [0.01174, 0],
      [0.00986, 0],
      [0.01023, 0],
      [0.01127, 0],
      [0.00991, 0],
      [0.01033, 0],
      [0.01076, 0],
      [0.00297, 2],
      [0.0034, 2],
      [0.00351, 2],
      [0.00364, 2],
      [0.00321, 2],
      [0.0103, 0],
      [0.00996, 0],
      [0.01055, 0],
      [0.00379, 2],
      [0.00304, 2],
      [0.01, 0],
      [0.00298, 2],
      [0.00312, 2]
    ]
  },
  "QA_lstPexPalle[Elbow]": {
    "red_x_points": [
      [-0.00158, 4],
      [-0.00157, 4],
      [-0.00157, 4],
      [0.01178, 3],
      [-0.00147, 4],
      [-0.0014, 4],
      [-0.01917, 1],
      [-0.01473, 1],
      [-0.00161, 4],
      [-0.0017, 4],
      [-0.00193, 4],
      [-0.00133, 4],
      [-0.00162, 4],
      [-0.01834, 1],
      [-0.00161, 4],
      [-0.0255, 0],
      [-0.02214, 2],
      [-0.00183, 4],
      [-0.00196, 4],
      [-0.00183, 4],
      [0.01156, 3],
      [-0.02166, 0],
      [-0.00161, 4]
    ],
    "red_o_points": [],
    "y_categories": ["ABS", "HYPO", "NAIA", "PT", "nan"],
    "blue_o_points": [],
    "blue_x_points": [
      [-0.00123, 4],
      [-0.00138, 4],
      [0.01665, 3],
      [0.02022, 3],
      [-0.00125, 4],
      [-0.00136, 4],
      [-0.00727, 1],
      [0.01752, 3],
      [-0.00154, 4],
      [-0.00122, 4],
      [-0.00141, 4],
      [-0.00098, 4],
      [-0.00128, 4],
      [0.01934, 3],
      [0.01827, 3],
      [0.01787, 3],
      [-0.0015, 4],
      [0.0161, 3],
      [-0.00094, 4],
      [0.01934, 3],
      [-0.00111, 4]
    ]
  },
  "QS_mulGraftRoot[C5]": {
    "red_x_points": [
      [-0.00069, 1],
      [-0.00049, 0],
      [3e-5, 0],
      [0.0001, 0],
      [-0.00025, 0],
      [9e-5, 0],
      [-3e-5, 2],
      [-0.00055, 1],
      [0.00028, 2],
      [-0.00041, 0],
      [5e-5, 2],
      [-0.00036, 0],
      [7e-5, 2],
      [7e-5, 0],
      [-0.00096, 1],
      [4e-5, 2],
      [-0.00013, 0],
      [-4e-5, 2],
      [-7e-5, 0],
      [-0.00028, 0],
      [-0.00091, 1],
      [9e-5, 0],
      [-5e-5, 2]
    ],
    "red_o_points": [],
    "y_categories": ["N", "NOT APPLICABLE", "nan"],
    "blue_o_points": [],
    "blue_x_points": [
      [0.00014, 2],
      [0.00011, 2],
      [6e-5, 0],
      [0.00023, 0],
      [0.00038, 0],
      [0.0004, 0],
      [0.00028, 0],
      [0.00041, 2],
      [0.00102, 1],
      [-0.00029, 0],
      [0.00039, 0],
      [0.00018, 2],
      [0.00016, 2],
      [0.00018, 2],
      [4e-5, 2],
      [0.00027, 2],
      [4e-5, 2],
      [0.00012, 1],
      [0.00022, 2],
      [7e-5, 2]
    ]
  },
  "QA_lstPexPalle[Ulna]": {
    "red_x_points": [
      [-0.00107, 4],
      [-0.00103, 4],
      [-0.00109, 4],
      [-0.02355, 2],
      [-0.00117, 4],
      [-0.00111, 4],
      [-0.01066, 1],
      [0.00542, 3],
      [-0.00132, 4],
      [-0.00117, 4],
      [-0.0014, 4],
      [-0.0011, 4],
      [-0.00111, 4],
      [0.00529, 3],
      [-0.00098, 4],
      [-0.0206, 0],
      [-0.01506, 0],
      [-0.00126, 4],
      [-0.00152, 4],
      [-0.00113, 4],
      [0.00584, 3],
      [-0.01654, 0],
      [-0.00126, 4]
    ],
    "red_o_points": [],
    "y_categories": ["ABS", "HYPO", "NAIA", "PT", "nan"],
    "blue_o_points": [],
    "blue_x_points": [
      [-0.00053, 4],
      [-0.00097, 4],
      [0.00813, 3],
      [0.01121, 1],
      [-0.00059, 4],
      [-0.00017, 4],
      [0.00938, 3],
      [0.01063, 3],
      [-0.0011, 4],
      [-0.00081, 4],
      [-0.00091, 4],
      [-0.00038, 4],
      [-0.001, 4],
      [0.01061, 3],
      [0.01074, 3],
      [0.01135, 3],
      [-0.00091, 4],
      [0.00996, 3],
      [-0.00032, 4],
      [0.01391, 3],
      [-0.00068, 4]
    ]
  },
  "QA_lstPexMuscstrength[ScapulaAbducSuprot]": {
    "red_x_points": [
      [-0.00138, 2],
      [-0.00068, 2],
      [-0.005, 1],
      [-0.00261, 2],
      [-0.00503, 1],
      [-0.00868, 1],
      [-0.00905, 1],
      [0.00299, 0],
      [-0.00091, 2],
      [-0.00095, 2],
      [-0.00459, 2],
      [-0.00043, 2],
      [-0.01034, 1],
      [-0.00372, 0],
      [0.00424, 0],
      [-0.00994, 1],
      [-0.00271, 1],
      [-0.00165, 2],
      [-0.0085, 1],
      [0.00109, 0],
      [-0.0014, 2],
      [-0.00338, 1],
      [-0.00639, 2]
    ],
    "red_o_points": [],
    "y_categories": ["GREATER THAN OR EQUALS TO 3", "LESS THAN 3", "nan"],
    "blue_o_points": [],
    "blue_x_points": [
      [0.0205, 0],
      [0.01972, 0],
      [0.00428, 0],
      [-0.00065, 1],
      [-0.0005, 1],
      [0.01136, 0],
      [0.00597, 0],
      [0.00168, 1],
      [-0.0003, 2],
      [0.00041, 2],
      [0.00082, 2],
      [0.00255, 2],
      [0.00024, 2],
      [0.00551, 0],
      [0.00491, 0],
      [-0.00072, 2],
      [0.0005, 2],
      [0.00492, 0],
      [0.00069, 2],
      [-0.00238, 1],
      [-0.00048, 2]
    ]
  },
  "participant_code": {
    "red_x_points": [
      [-0.03953, 0],
      [-0.03953, 2],
      [-0.03963, 3],
      [-0.03953, 4],
      [-0.03739, 5],
      [-0.03963, 9],
      [-0.03836, 14],
      [-0.0405, 17],
      [-0.04099, 19],
      [-0.03885, 20],
      [-0.03963, 22],
      [-0.0406, 23],
      [-0.0405, 24],
      [-0.03972, 26],
      [-0.03982, 28],
      [-0.04157, 29],
      [-0.03992, 31],
      [-0.0406, 35],
      [-0.04001, 37],
      [-0.03982, 39],
      [-0.03885, 41],
      [-0.03963, 42],
      [-0.03972, 43]
    ],
    "red_o_points": [],
    "y_categories": [
      "P16554",
      "P18297",
      "P19283",
      "P19287",
      "P23172",
      "P23391",
      "P30595",
      "P31645",
      "P31691",
      "P34778",
      "P35046",
      "P36328",
      "P43633",
      "P4544",
      "P46417",
      "P48965",
      "P53068",
      "P5497",
      "P58556",
      "P59529",
      "P62483",
      "P64658",
      "P65202",
      "P66816",
      "P67052",
      "P6751",
      "P7408",
      "P75566",
      "P76226",
      "P79971",
      "P82621",
      "P82990",
      "P84549",
      "P84932",
      "P85825",
      "P86989",
      "P8770",
      "P87791",
      "P90550",
      "P93159",
      "P94969",
      "P96710",
      "P9744",
      "P98500",
      "nan"
    ],
    "blue_o_points": [],
    "blue_x_points": [
      [0.04278, 1],
      [0.04432, 6],
      [0.0434, 7],
      [0.04371, 8],
      [0.04504, 10],
      [0.04288, 11],
      [0.04432, 12],
      [0.04319, 13],
      [0.04484, 15],
      [0.04443, 16],
      [0.04288, 18],
      [0.04371, 21],
      [0.04288, 25],
      [0.04278, 27],
      [0.04268, 30],
      [0.04278, 32],
      [0.04216, 33],
      [0.04412, 34],
      [0.0434, 36],
      [0.04401, 38],
      [0.04401, 40]
    ]
  },
  "QS_mulGraftNerve[IS]": {
    "red_x_points": [
      [-8e-5, 1],
      [-3e-5, 0],
      [0.0, 2],
      [-3e-5, 0],
      [0.0, 2],
      [-8e-5, 1],
      [2e-5, 2]
    ],
    "red_o_points": [],
    "y_categories": ["N", "NOT APPLICABLE", "nan"],
    "blue_o_points": [],
    "blue_x_points": [
      [0.0, 2],
      [0.0001, 1],
      [-3e-5, 0],
      [0.00012, 0],
      [0.0, 2],
      [2e-5, 2]
    ]
  },
  "QS_mulTransfSite[MeMc]": {
    "red_x_points": [[-0.00013, 0]],
    "red_o_points": [],
    "y_categories": ["N", "NOT APPLICABLE", "nan"],
    "blue_o_points": [],
    "blue_x_points": [[7e-5, 2], [7e-5, 1]]
  },
  "QA_mulInjOrthesisType[ArmSling]": {
    "red_x_points": [
      [-0.00691, 2],
      [-0.00864, 2],
      [-0.00392, 2],
      [-0.00266, 2],
      [-0.00514, 2],
      [-0.00286, 2],
      [-0.00147, 2],
      [-0.00174, 1],
      [-0.0093, 2],
      [-0.00793, 2],
      [-0.00488, 2],
      [-0.02342, 0],
      [-0.00786, 3],
      [-0.00176, 2],
      [-0.00076, 1],
      [-0.00159, 2],
      [-0.01441, 3],
      [-0.00799, 2],
      [-0.00466, 2],
      [-0.00582, 2],
      [-0.00715, 3],
      [-0.00109, 2],
      [-0.0059, 2]
    ],
    "red_o_points": [],
    "y_categories": ["N", "NOT APPLICABLE", "Y", "nan"],
    "blue_o_points": [],
    "blue_x_points": [
      [-0.00153, 2],
      [-0.00147, 2],
      [-1e-5, 2],
      [-0.00032, 2],
      [-0.00169, 2],
      [-0.0007, 2],
      [-0.00051, 2],
      [-0.00088, 2],
      [0.0426, 1],
      [0.03277, 1],
      [-0.00625, 2],
      [0.02264, 1],
      [0.03123, 1],
      [-0.0001, 2],
      [0.00696, 0],
      [-0.00083, 2],
      [-0.00734, 2],
      [0.01193, 1],
      [0.01143, 1],
      [-0.00371, 2],
      [0.00362, 3]
    ]
  },
  "QS_mulGraftNerve[Ul]": {
    "red_x_points": [
      [-9e-5, 0],
      [-2e-5, 0],
      [-0.00017, 1],
      [1e-5, 2],
      [-0.00011, 0],
      [-2e-5, 2],
      [-0.00013, 1],
      [-2e-5, 2],
      [-2e-5, 0],
      [-2e-5, 0],
      [-0.00017, 1],
      [3e-5, 2]
    ],
    "red_o_points": [],
    "y_categories": ["N", "NOT APPLICABLE", "nan"],
    "blue_o_points": [],
    "blue_x_points": [
      [9e-5, 2],
      [5e-5, 0],
      [5e-5, 0],
      [9e-5, 0],
      [5e-5, 0],
      [3e-5, 2],
      [1e-5, 1],
      [3e-5, 2],
      [5e-5, 2],
      [5e-5, 2],
      [2e-5, 2],
      [3e-5, 2],
      [2e-5, 2],
      [0.00017, 1],
      [2e-5, 2]
    ]
  },
  "QS_mulGraftNerve[Ssr]": {
    "red_x_points": [
      [-0.00032, 1],
      [-0.00033, 0],
      [-5e-5, 0],
      [2e-5, 0],
      [-0.00026, 0],
      [5e-5, 0],
      [-3e-5, 2],
      [-0.00099, 1],
      [0.00029, 2],
      [-0.00026, 0],
      [6e-5, 2],
      [-0.00019, 0],
      [-3e-5, 2],
      [2e-5, 0],
      [-0.00098, 1],
      [-2e-5, 2],
      [-0.00026, 0],
      [-7e-5, 2],
      [2e-5, 0],
      [-0.00033, 0],
      [-0.00064, 1],
      [5e-5, 0],
      [-7e-5, 2]
    ],
    "red_o_points": [],
    "y_categories": ["N", "NOT APPLICABLE", "nan"],
    "blue_o_points": [],
    "blue_x_points": [
      [0.0002, 2],
      [0.00014, 2],
      [0.00016, 0],
      [0.00047, 0],
      [0.00011, 2],
      [0.00013, 0],
      [0.00027, 0],
      [6e-5, 0],
      [0.00031, 2],
      [0.0009, 1],
      [-0.00026, 0],
      [0.0005, 0],
      [0.00025, 2],
      [0.00018, 2],
      [0.00018, 2],
      [0.00013, 2],
      [0.00023, 2],
      [0.00014, 2],
      [0.0001, 1],
      [0.00011, 2],
      [4e-5, 2]
    ]
  },
  "QA_lstPexKine[Shoulder]": {
    "red_x_points": [
      [0.0008, 1],
      [-0.00092, 2],
      [-0.00268, 2],
      [0.00174, 1],
      [-0.00212, 2],
      [-0.01423, 0],
      [0.00112, 1],
      [0.00109, 1],
      [-0.0009, 2],
      [0.00214, 1],
      [-0.00167, 2],
      [-0.00103, 2],
      [-0.00163, 2],
      [-0.02706, 0],
      [0.00154, 1],
      [0.00143, 1],
      [-0.00191, 2],
      [-0.00216, 2],
      [-0.00603, 2],
      [-0.00169, 2],
      [-0.0005, 2],
      [0.00192, 1],
      [-0.0017, 2]
    ],
    "red_o_points": [],
    "y_categories": ["NPV", "PV", "nan"],
    "blue_o_points": [],
    "blue_x_points": [
      [0.00402, 1],
      [-0.00073, 2],
      [0.00451, 1],
      [0.00725, 1],
      [-0.00038, 2],
      [0.00745, 1],
      [0.00773, 1],
      [0.00662, 1],
      [-0.00049, 2],
      [-0.00043, 2],
      [-0.00193, 2],
      [0.0084, 1],
      [-0.00047, 2],
      [0.00327, 1],
      [0.0023, 1],
      [0.00126, 0],
      [-0.00077, 2],
      [0.00208, 1],
      [-0.00014, 2],
      [0.00236, 1],
      [0.00253, 1]
    ]
  },
  "QS_mulGraftNerve[MCA]": {
    "red_x_points": [
      [-0.00012, 1],
      [-0.0002, 0],
      [3e-5, 0],
      [5e-5, 0],
      [-6e-5, 0],
      [0.0001, 0],
      [-4e-5, 2],
      [-0.00027, 1],
      [0.0, 2],
      [-0.0002, 0],
      [-2e-5, 2],
      [-0.0002, 0],
      [-4e-5, 2],
      [0.0, 0],
      [-0.00036, 1],
      [1e-5, 2],
      [-6e-5, 0],
      [-0.00013, 0],
      [-0.00029, 1],
      [0.0001, 0],
      [-2e-5, 2]
    ],
    "red_o_points": [],
    "y_categories": ["N", "NOT APPLICABLE", "nan"],
    "blue_o_points": [],
    "blue_x_points": [
      [8e-5, 2],
      [3e-5, 0],
      [0.00013, 0],
      [0.0002, 0],
      [8e-5, 0],
      [0.0002, 2],
      [0.00029, 1],
      [-6e-5, 0],
      [5e-5, 0],
      [0.00029, 2],
      [3e-5, 2],
      [3e-5, 2],
      [3e-5, 2],
      [0.00019, 2],
      [8e-5, 2],
      [0.0001, 2]
    ]
  },
  "QA_lstPexInspectio[Swelling]": {
    "red_x_points": [
      [0.00153, 1],
      [0.00181, 1],
      [-0.00308, 0],
      [0.00192, 1],
      [-0.0147, 2],
      [0.00253, 1],
      [-0.02345, 2],
      [-0.0009, 0],
      [-0.00865, 0],
      [0.00136, 1],
      [-0.00782, 0],
      [0.00153, 1],
      [0.00335, 1],
      [-0.03733, 2],
      [0.00177, 1],
      [-0.0168, 2],
      [0.00145, 1],
      [0.00279, 1],
      [0.00216, 1],
      [-0.00219, 0],
      [-0.00459, 0],
      [-0.00244, 0],
      [0.00403, 1]
    ],
    "red_o_points": [],
    "y_categories": ["ABS", "NAIA", "PT", "nan"],
    "blue_o_points": [],
    "blue_x_points": [
      [0.00752, 1],
      [0.00637, 1],
      [0.00484, 0],
      [0.00523, 0],
      [0.00565, 1],
      [0.00379, 1],
      [0.00749, 0],
      [0.00453, 1],
      [0.00477, 1],
      [0.00315, 1],
      [0.00318, 1],
      [0.00449, 1],
      [0.00446, 1],
      [0.00316, 0],
      [0.0046, 1],
      [0.00437, 1],
      [0.00048, 0],
      [0.00348, 1],
      [0.00443, 0],
      [0.00512, 1],
      [0.00463, 1]
    ]
  },
  "QA_mulInjOrthesisType[ShoulderSupport]": {
    "red_x_points": [
      [-0.00619, 0],
      [-0.00771, 0],
      [-0.00351, 0],
      [-0.01406, 2],
      [-0.00485, 0],
      [-0.00296, 0],
      [-0.00146, 0],
      [-0.00207, 1],
      [-0.0083, 0],
      [-0.00663, 0],
      [-0.00455, 0],
      [-0.014, 2],
      [-0.0103, 3],
      [-0.002, 0],
      [-0.00037, 1],
      [-0.00148, 0],
      [-0.0106, 3],
      [-0.0077, 0],
      [-0.00387, 0],
      [-0.00508, 0],
      [-0.00896, 3],
      [-0.00105, 0],
      [-0.006, 0]
    ],
    "red_o_points": [],
    "y_categories": ["N", "NOT APPLICABLE", "Y", "nan"],
    "blue_o_points": [],
    "blue_x_points": [
      [-0.00177, 0],
      [-0.00205, 0],
      [0.0008, 0],
      [0.0009, 0],
      [0.0112, 2],
      [0.0, 0],
      [9e-5, 0],
      [0.00148, 0],
      [0.03401, 1],
      [0.02678, 1],
      [-0.00534, 0],
      [0.02094, 1],
      [0.02606, 1],
      [-6e-5, 0],
      [0.00423, 2],
      [-0.00039, 0],
      [-0.00688, 0],
      [0.0125, 1],
      [0.01146, 1],
      [-0.00188, 0],
      [0.00158, 3]
    ]
  },
  "QA_lstPexPain[C6]": {
    "red_x_points": [
      [-0.00065, 1],
      [-0.00414, 2],
      [-0.00333, 2],
      [-0.00058, 1],
      [-0.0032, 2],
      [-0.00029, 1],
      [-0.00117, 1],
      [-0.00084, 1],
      [-0.00427, 2],
      [-0.00325, 2],
      [-0.00676, 2],
      [-0.00298, 2],
      [-0.00139, 1],
      [-0.00192, 1],
      [-0.00033, 1],
      [-0.00117, 1],
      [-0.0029, 2],
      [-0.00567, 2],
      [-0.00527, 2],
      [-0.00405, 2],
      [-0.00093, 1],
      [-0.00068, 1],
      [-0.00145, 1]
    ],
    "red_o_points": [],
    "y_categories": ["NORM", "NPV", "nan"],
    "blue_o_points": [],
    "blue_x_points": [
      [-0.00014, 1],
      [-0.00027, 1],
      [0.01125, 0],
      [-0.00018, 1],
      [0.01903, 0],
      [0.00014, 1],
      [9e-5, 1],
      [-0.00045, 1],
      [-0.00278, 2],
      [-0.00249, 2],
      [-0.00261, 2],
      [-0.0, 1],
      [-0.00232, 2],
      [0.01544, 0],
      [-0.00038, 1],
      [0.01397, 0],
      [-0.00304, 2],
      [0.01291, 0],
      [-0.00014, 1],
      [-0.00052, 1],
      [-0.00028, 1]
    ]
  },
  "QS_mulGraftTrunk[LowerTrunk]": {
    "red_x_points": [
      [-0.00053, 1],
      [-0.00017, 0],
      [-6e-5, 0],
      [0.00012, 0],
      [-0.00013, 0],
      [1e-5, 0],
      [6e-5, 2],
      [-0.0005, 1],
      [0.0002, 2],
      [-0.00016, 0],
      [9e-5, 2],
      [-0.0003, 0],
      [-0.00061, 1],
      [3e-5, 2],
      [-0.00018, 0],
      [-0.0, 2],
      [-0.00021, 0],
      [-0.00016, 0],
      [-0.00023, 1],
      [7e-5, 0],
      [4e-5, 2]
    ],
    "red_o_points": [],
    "y_categories": ["N", "NOT APPLICABLE", "nan"],
    "blue_o_points": [],
    "blue_x_points": [
      [0.00024, 2],
      [9e-5, 2],
      [3e-5, 0],
      [0.00019, 0],
      [7e-5, 2],
      [8e-5, 0],
      [0.00012, 0],
      [3e-5, 0],
      [0.0002, 2],
      [0.00071, 1],
      [-0.00013, 0],
      [0.00038, 0],
      [0.0001, 2],
      [1e-5, 2],
      [1e-5, 2],
      [1e-5, 2],
      [0.0002, 2],
      [4e-5, 2],
      [0.00011, 1],
      [3e-5, 2],
      [0.00012, 2]
    ]
  },
  "QS_mulGraftRoot[T2]": {
    "red_x_points": [
      [-0.00027, 1],
      [-0.0002, 0],
      [4e-5, 0],
      [0.0001, 0],
      [-5e-5, 0],
      [-7e-5, 2],
      [-0.00013, 1],
      [7e-5, 2],
      [-6e-5, 0],
      [-5e-5, 0],
      [1e-5, 2],
      [-0.00025, 1],
      [1e-5, 2],
      [-0.00012, 0],
      [4e-5, 0],
      [-0.00012, 0],
      [-0.00023, 1]
    ],
    "red_o_points": [],
    "y_categories": ["N", "NOT APPLICABLE", "nan"],
    "blue_o_points": [],
    "blue_x_points": [
      [6e-5, 2],
      [1e-5, 2],
      [3e-5, 0],
      [3e-5, 0],
      [5e-5, 2],
      [8e-5, 0],
      [-1e-5, 0],
      [0.00012, 0],
      [0.00012, 2],
      [0.0003, 1],
      [-5e-5, 0],
      [0.0001, 0],
      [7e-5, 2],
      [9e-5, 2],
      [9e-5, 2],
      [0.00012, 2],
      [9e-5, 2],
      [-5e-5, 1],
      [6e-5, 2],
      [6e-5, 2]
    ]
  },
  "QS_mulGraftTrunk[UpperTrunk]": {
    "red_x_points": [
      [-0.00639, 1],
      [-0.00344, 0],
      [-0.00211, 0],
      [0.00018, 0],
      [-0.00257, 0],
      [0.00027, 0],
      [6e-5, 3],
      [-0.00513, 1],
      [0.00238, 3],
      [-0.02014, 2],
      [0.00147, 3],
      [-0.00303, 0],
      [0.00083, 3],
      [-3e-5, 0],
      [-0.0093, 1],
      [0.00033, 3],
      [-0.00255, 0],
      [0.00164, 3],
      [-0.00153, 0],
      [-0.00423, 0],
      [-0.00606, 1],
      [0.00029, 0],
      [0.00081, 3]
    ],
    "red_o_points": [],
    "y_categories": ["N", "NOT APPLICABLE", "Y", "nan"],
    "blue_o_points": [],
    "blue_x_points": [
      [0.0025, 3],
      [0.00147, 3],
      [0.00207, 0],
      [0.00293, 0],
      [0.00086, 3],
      [0.00458, 0],
      [0.00313, 0],
      [0.00183, 0],
      [0.00431, 3],
      [0.01036, 1],
      [-0.00065, 0],
      [0.00476, 0],
      [0.00377, 3],
      [0.00151, 3],
      [0.00131, 3],
      [0.00073, 3],
      [0.00436, 3],
      [0.002, 3],
      [0.00227, 1],
      [0.00212, 3],
      [0.00207, 3]
    ]
  },
  "QS_mulTransfSite[PhMc]": {
    "red_x_points": [
      [-0.00771, 1],
      [-0.00397, 0],
      [-0.00057, 0],
      [0.00141, 0],
      [-0.00236, 0],
      [-0.01392, 2],
      [0.00064, 3],
      [-0.00727, 1],
      [0.00277, 3],
      [-0.00276, 0],
      [0.00208, 3],
      [-0.00299, 0],
      [0.00095, 3],
      [0.00042, 0],
      [-0.01128, 1],
      [0.00129, 3],
      [-0.00937, 2],
      [0.0018, 3],
      [-0.0007, 0],
      [-0.00423, 0],
      [-0.00765, 1],
      [0.0016, 0],
      [0.00126, 3]
    ],
    "red_o_points": [],
    "y_categories": ["N", "NOT APPLICABLE", "Y", "nan"],
    "blue_o_points": [],
    "blue_x_points": [
      [0.00322, 3],
      [0.00238, 3],
      [0.00101, 0],
      [0.00392, 0],
      [0.00137, 3],
      [0.00514, 0],
      [0.00203, 0],
      [0.00149, 0],
      [0.00438, 3],
      [0.00971, 1],
      [-0.00151, 0],
      [0.00653, 0],
      [0.00415, 3],
      [0.00164, 3],
      [0.00225, 3],
      [0.0015, 3],
      [0.00443, 3],
      [0.00205, 3],
      [0.00059, 1],
      [0.00242, 3],
      [0.00187, 3]
    ]
  },
  "QA_yonPexPain": {
    "red_x_points": [
      [-0.01254, 1],
      [-0.01322, 1],
      [-0.01269, 1],
      [-0.01299, 1],
      [-0.01309, 1],
      [-0.01313, 1],
      [-0.01215, 1],
      [-0.01209, 1],
      [-0.01475, 1],
      [-0.01403, 1],
      [0.01696, 0],
      [-0.0142, 1],
      [-0.01247, 1],
      [-0.01319, 1],
      [0.01524, 0],
      [-0.0131, 1],
      [-0.01278, 1],
      [-0.01415, 1],
      [-0.01385, 1],
      [-0.01322, 1],
      [-0.01259, 1],
      [-0.0116, 1],
      [-0.01494, 1]
    ],
    "red_o_points": [],
    "y_categories": ["N", "Y", "nan"],
    "blue_o_points": [],
    "blue_x_points": [
      [-0.01245, 1],
      [0.02622, 0],
      [0.02189, 0],
      [0.0251, 0],
      [-0.01165, 1],
      [0.02477, 0],
      [-0.01171, 1],
      [-0.01163, 1],
      [-0.01256, 1],
      [0.03414, 2],
      [0.02841, 0],
      [-0.01243, 1],
      [0.02499, 0],
      [0.02231, 0],
      [0.02069, 0],
      [0.0222, 0],
      [0.03715, 2],
      [0.02257, 0],
      [-0.01086, 1],
      [-0.01304, 1],
      [0.03049, 2]
    ]
  },
  "QA_equInjTbpiTime": {
    "red_x_points": [
      [-0.01125, 0],
      [-0.01017, 0],
      [0.00199, 3],
      [0.00178, 3],
      [-0.00894, 0],
      [-0.0084, 0],
      [-0.0087, 0],
      [-0.01019, 0],
      [0.00194, 3],
      [-0.0104, 0],
      [-0.01139, 0],
      [-0.00998, 0],
      [0.00012, 3],
      [-0.00023, 3],
      [-0.01113, 0],
      [-0.00822, 0],
      [-0.01316, 2],
      [-0.02446, 2],
      [-0.01051, 0],
      [-0.01658, 2],
      [-0.01159, 0],
      [0.00157, 3],
      [0.01199, 1]
    ],
    "red_o_points": [],
    "y_categories": [
      "0 TO 6 MONTHS",
      "13 TO 24 MONTHS",
      "25 MONTHS OR MORE",
      "7 TO 12 MONTHS",
      "nan"
    ],
    "blue_o_points": [],
    "blue_x_points": [
      [-0.00589, 0],
      [0.02269, 1],
      [-0.0065, 0],
      [0.02584, 1],
      [0.00431, 3],
      [-0.0075, 0],
      [-0.00507, 0],
      [0.00421, 3],
      [-0.00748, 0],
      [-0.00106, 2],
      [0.02775, 1],
      [0.006, 3],
      [0.02509, 1],
      [0.00471, 3],
      [0.02044, 1],
      [0.02137, 1],
      [0.00636, 3],
      [0.01951, 1],
      [0.00936, 3],
      [0.00617, 3],
      [-0.00441, 0]
    ]
  },
  "QS_mulGraftLevel[Trunk]": {
    "red_x_points": [
      [-0.00622, 1],
      [-0.00296, 0],
      [-0.00089, 0],
      [0.00032, 0],
      [-0.0024, 0],
      [0.00047, 0],
      [0.00035, 3],
      [-0.00659, 1],
      [0.00279, 3],
      [-0.0176, 2],
      [0.0009, 3],
      [-0.00264, 0],
      [0.00052, 3],
      [0.0003, 0],
      [-0.00764, 1],
      [0.00044, 3],
      [-0.00225, 0],
      [0.00161, 3],
      [-0.00093, 0],
      [-0.00304, 0],
      [-0.00489, 1],
      [0.00043, 0],
      [0.00098, 3]
    ],
    "red_o_points": [],
    "y_categories": ["N", "NOT APPLICABLE", "Y", "nan"],
    "blue_o_points": [],
    "blue_x_points": [
      [0.00243, 3],
      [0.00137, 3],
      [0.00188, 0],
      [0.00268, 0],
      [0.00104, 3],
      [0.00363, 0],
      [0.00241, 0],
      [0.00187, 0],
      [0.00331, 3],
      [0.00833, 1],
      [-0.00106, 0],
      [0.00298, 0],
      [0.00352, 3],
      [0.00096, 3],
      [0.00158, 3],
      [0.00095, 3],
      [0.00377, 3],
      [0.00173, 3],
      [0.00111, 1],
      [0.00219, 3],
      [0.00223, 3]
    ]
  },
  "QS_mulGraftNerve[other]": {
    "red_x_points": [
      [-0.00343, 1],
      [-0.00222, 0],
      [-0.0006, 0],
      [0.00035, 0],
      [-0.00134, 0],
      [0.00038, 0],
      [2e-5, 2],
      [-0.00368, 1],
      [0.00144, 2],
      [-0.00199, 0],
      [0.00043, 2],
      [-0.00203, 0],
      [0.00031, 2],
      [-4e-5, 0],
      [-0.00578, 1],
      [4e-5, 2],
      [-0.00121, 0],
      [6e-5, 2],
      [-0.00073, 0],
      [-0.00205, 0],
      [-0.00326, 1],
      [0.00014, 0],
      [0.00035, 2]
    ],
    "red_o_points": [],
    "y_categories": ["N", "NOT APPLICABLE", "nan"],
    "blue_o_points": [],
    "blue_x_points": [
      [0.00089, 2],
      [0.00067, 2],
      [0.00076, 0],
      [0.00119, 0],
      [0.00039, 2],
      [0.00138, 0],
      [0.00083, 0],
      [0.0007, 0],
      [0.00162, 2],
      [0.00602, 1],
      [-0.00039, 0],
      [0.00138, 0],
      [0.00174, 2],
      [0.00096, 2],
      [0.00091, 2],
      [0.00046, 2],
      [0.00179, 2],
      [0.00094, 2],
      [0.00106, 1],
      [0.00083, 2],
      [0.00073, 2]
    ]
  },
  "QS_mulTransfSite[AcSsAA]": {
    "red_x_points": [
      [-0.00816, 1],
      [-0.0167, 2],
      [-0.00157, 0],
      [-0.00089, 0],
      [-0.01404, 2],
      [0.00016, 0],
      [-0.00029, 3],
      [-0.01236, 1],
      [0.00691, 3],
      [-0.01901, 2],
      [0.00287, 3],
      [-0.00257, 0],
      [0.00209, 3],
      [-0.0081, 0],
      [-0.01315, 1],
      [0.00072, 3],
      [-0.01102, 2],
      [0.00339, 3],
      [-0.00295, 0],
      [-0.01641, 2],
      [-0.01106, 1],
      [0.00028, 0],
      [0.00268, 3]
    ],
    "red_o_points": [],
    "y_categories": ["N", "NOT APPLICABLE", "Y", "nan"],
    "blue_o_points": [],
    "blue_x_points": [
      [0.00475, 3],
      [0.00415, 3],
      [0.00499, 2],
      [0.0041, 0],
      [0.00365, 3],
      [0.0036, 0],
      [0.01063, 2],
      [0.00093, 0],
      [0.00947, 3],
      [0.01648, 1],
      [0.00842, 0],
      [0.00486, 0],
      [0.00857, 3],
      [0.00327, 3],
      [0.00388, 3],
      [0.00281, 3],
      [0.00981, 3],
      [0.00395, 3],
      [0.00261, 1],
      [0.00427, 3],
      [0.00399, 3]
    ]
  },
  "QA_txtInjMedicatioListNer": {
    "red_x_points": [
      [-0.00767, 1],
      [-0.007, 1],
      [-0.00652, 1],
      [-0.005, 1],
      [-0.00741, 1],
      [-0.00051, 2],
      [-0.00686, 1],
      [0.00383, 0],
      [-0.00702, 2],
      [-0.00305, 2],
      [-0.00277, 2],
      [-0.00283, 2],
      [-0.00904, 1],
      [-0.00562, 1],
      [-0.0011, 2],
      [-0.00672, 1],
      [-0.00203, 2],
      [-0.00872, 1],
      [-0.00932, 1],
      [-0.00783, 1],
      [-0.00404, 1],
      [-0.00024, 2],
      [-0.00218, 2]
    ],
    "red_o_points": [],
    "y_categories": ["N", "Y", "nan"],
    "blue_o_points": [],
    "blue_x_points": [
      [0.03195, 0],
      [0.00142, 2],
      [0.01274, 0],
      [-0.00317, 1],
      [0.00104, 2],
      [0.00127, 2],
      [0.00185, 2],
      [-0.00459, 1],
      [-0.00388, 1],
      [-0.00491, 1],
      [0.02983, 0],
      [-0.00025, 2],
      [0.02352, 0],
      [-0.00333, 1],
      [0.00121, 2],
      [0.00056, 2],
      [-0.00414, 1],
      [0.01373, 0],
      [0.01898, 0],
      [-0.00459, 1],
      [0.00041, 2]
    ]
  },
  "QS_mulGraftNerve[Ax]": {
    "red_x_points": [
      [-0.00192, 1],
      [-0.00089, 0],
      [-0.00034, 0],
      [4e-5, 0],
      [-0.00035, 0],
      [0.0002, 0],
      [0.00015, 2],
      [-0.00185, 1],
      [0.00047, 2],
      [-0.00055, 0],
      [0.00032, 2],
      [-0.00078, 0],
      [0.0001, 2],
      [-0.0, 0],
      [-0.00194, 1],
      [0.00015, 2],
      [-0.0009, 0],
      [0.00026, 2],
      [-0.00086, 0],
      [-0.00107, 0],
      [-0.00117, 1],
      [0.00019, 0],
      [0.00014, 2]
    ],
    "red_o_points": [],
    "y_categories": ["N", "NOT APPLICABLE", "nan"],
    "blue_o_points": [],
    "blue_x_points": [
      [0.00063, 2],
      [0.00037, 2],
      [0.0003, 0],
      [0.00075, 0],
      [0.00029, 2],
      [0.0008, 0],
      [0.00032, 0],
      [0.00037, 0],
      [0.00066, 2],
      [0.00272, 1],
      [-0.00041, 0],
      [0.00063, 0],
      [0.00065, 2],
      [0.00017, 2],
      [0.00031, 2],
      [0.00012, 2],
      [0.00072, 2],
      [0.00014, 2],
      [0.00051, 1],
      [0.00024, 2],
      [0.00033, 2]
    ]
  },
  "QA_lstPexMuscstrength[WristFlex]": {
    "red_x_points": [
      [-0.00132, 0],
      [-0.00227, 2],
      [-0.00846, 1],
      [0.00104, 0],
      [-0.00566, 1],
      [-0.01215, 1],
      [-0.00249, 0],
      [-0.00019, 0],
      [-0.00235, 2],
      [-0.004, 2],
      [-0.00094, 0],
      [-0.0028, 2],
      [-0.00697, 1],
      [0.00093, 0],
      [0.0009, 0],
      [-0.00182, 1],
      [-0.00661, 1],
      [-0.00437, 0],
      [0.00223, 0],
      [0.00063, 0],
      [-0.00107, 2],
      [-0.0075, 1],
      [-0.00493, 2]
    ],
    "red_o_points": [],
    "y_categories": ["GREATER THAN OR EQUALS TO 3", "LESS THAN 3", "nan"],
    "blue_o_points": [],
    "blue_x_points": [
      [0.00498, 1],
      [0.00608, 0],
      [0.00167, 0],
      [0.00432, 0],
      [0.00381, 0],
      [0.00621, 0],
      [0.0039, 0],
      [0.00363, 0],
      [0.00096, 2],
      [0.00088, 2],
      [0.00602, 0],
      [0.00775, 0],
      [0.00133, 2],
      [0.00064, 0],
      [0.00104, 0],
      [0.00209, 0],
      [0.00187, 2],
      [0.00331, 1],
      [0.00117, 0],
      [0.00809, 1],
      [0.00041, 2]
    ]
  },
  "QS_mulNeuromadSite[C5]": {
    "red_x_points": [
      [-0.00087, 1],
      [-0.00105, 0],
      [-0.0005, 0],
      [7e-5, 0],
      [-0.00096, 0],
      [0.00029, 0],
      [-0.00019, 2],
      [-0.00175, 1],
      [0.00099, 2],
      [-0.00112, 0],
      [9e-5, 2],
      [-0.00144, 0],
      [0.00011, 2],
      [-1e-5, 0],
      [-0.0028, 1],
      [-0.0, 2],
      [-0.00097, 0],
      [0.00041, 2],
      [-0.00043, 0],
      [-0.00133, 0],
      [-0.00284, 1],
      [7e-5, 0],
      [0.00019, 2]
    ],
    "red_o_points": [],
    "y_categories": ["N", "NOT APPLICABLE", "nan"],
    "blue_o_points": [],
    "blue_x_points": [
      [0.00066, 2],
      [0.00047, 2],
      [0.00056, 0],
      [0.00088, 0],
      [0.00029, 2],
      [0.00065, 0],
      [0.0006, 0],
      [0.00031, 0],
      [0.00109, 2],
      [0.00325, 1],
      [-0.00089, 0],
      [0.00086, 0],
      [0.0012, 2],
      [0.00049, 2],
      [0.00055, 2],
      [0.00032, 2],
      [0.00103, 2],
      [0.00053, 2],
      [0.00046, 1],
      [0.00051, 2],
      [0.00022, 2]
    ]
  },
  "QS_mulNeuromadSite[C7]": {
    "red_x_points": [
      [-0.00661, 1],
      [-0.00421, 0],
      [-0.00111, 0],
      [-7e-5, 0],
      [-0.00276, 0],
      [0.00079, 0],
      [0.00023, 2],
      [-0.01002, 1],
      [0.0022, 2],
      [-0.00325, 0],
      [0.00089, 2],
      [-0.00414, 0],
      [0.00074, 2],
      [-0.00017, 0],
      [-0.01178, 1],
      [0.00042, 2],
      [-0.00331, 0],
      [0.00015, 2],
      [-0.00126, 0],
      [-0.00453, 0],
      [-0.00754, 1],
      [0.0007, 0],
      [0.00091, 2]
    ],
    "red_o_points": [],
    "y_categories": ["N", "NOT APPLICABLE", "nan"],
    "blue_o_points": [],
    "blue_x_points": [
      [0.00315, 2],
      [0.00172, 2],
      [0.00181, 0],
      [0.00363, 0],
      [0.00112, 2],
      [0.00292, 0],
      [0.0027, 0],
      [0.00105, 0],
      [0.00335, 2],
      [0.01249, 1],
      [-0.00199, 0],
      [0.00326, 0],
      [0.00357, 2],
      [0.00189, 2],
      [0.00177, 2],
      [0.00142, 2],
      [0.00337, 2],
      [0.00151, 2],
      [0.00147, 1],
      [0.00227, 2],
      [0.00125, 2]
    ]
  },
  "QS_mulGraftNerve[TD]": {
    "red_x_points": [
      [-0.00092, 1],
      [-0.00044, 0],
      [-0.00012, 0],
      [-1e-5, 0],
      [-0.00056, 0],
      [0.0001, 0],
      [-1e-5, 2],
      [-0.00086, 1],
      [0.00041, 2],
      [-0.00043, 0],
      [-8e-5, 2],
      [-0.00057, 0],
      [4e-5, 2],
      [4e-5, 0],
      [-0.00108, 1],
      [-2e-5, 2],
      [-0.00053, 0],
      [0.00013, 2],
      [-0.00016, 0],
      [-0.00036, 0],
      [-0.00111, 1],
      [5e-5, 0],
      [1e-5, 2]
    ],
    "red_o_points": [],
    "y_categories": ["N", "NOT APPLICABLE", "nan"],
    "blue_o_points": [],
    "blue_x_points": [
      [0.00015, 2],
      [0.00018, 2],
      [8e-5, 0],
      [0.00045, 0],
      [0.0001, 2],
      [0.00059, 0],
      [0.00022, 0],
      [0.00017, 0],
      [0.00043, 2],
      [0.00147, 1],
      [-0.00026, 0],
      [0.00098, 0],
      [0.00042, 2],
      [0.00015, 2],
      [0.00011, 2],
      [0.00011, 2],
      [0.00042, 2],
      [0.00013, 2],
      [0.00024, 1],
      [0.00016, 2],
      [0.00017, 2]
    ]
  },
  "QA_intPexForearmSupin": {
    "red_x_points": [
      [-0.00059, 2],
      [-0.00647, 0],
      [-0.00061, 2],
      [-0.00054, 2],
      [-0.00099, 2],
      [-0.00057, 2],
      [-0.01837, 0],
      [-0.01223, 0],
      [-0.00076, 2],
      [-0.00069, 2],
      [-0.00118, 2],
      [-0.00053, 2],
      [-0.00127, 2],
      [0.00339, 1],
      [-0.00052, 2],
      [-0.0147, 0],
      [0.0001, 1],
      [-0.00075, 2],
      [-0.00076, 2],
      [-0.00074, 2],
      [0.00442, 1],
      [-0.00858, 0],
      [-0.00143, 2]
    ],
    "red_o_points": [],
    "y_categories": ["GREATER THAN OR EQUALS TO 80", "LESS THAN 80", "nan"],
    "blue_o_points": [],
    "blue_x_points": [
      [-0.00034, 2],
      [0.01604, 1],
      [0.00553, 1],
      [0.00994, 1],
      [0.00924, 1],
      [-0.00017, 2],
      [0.00031, 2],
      [0.00019, 2],
      [-0.00038, 2],
      [-0.00016, 2],
      [0.00243, 0],
      [-0.00013, 2],
      [-0.00037, 2],
      [0.00726, 1],
      [0.00627, 1],
      [-0.00037, 2],
      [-0.00061, 2],
      [-0.0001, 2],
      [0.00022, 2],
      [0.00984, 1],
      [-0.00028, 2]
    ]
  },
  "QS_mulGraftNerve[SS]": {
    "red_x_points": [
      [-0.00018, 1],
      [-5e-5, 0],
      [-8e-5, 0],
      [6e-5, 0],
      [-0.00011, 0],
      [9e-5, 0],
      [-0.0, 2],
      [-0.00041, 1],
      [8e-5, 2],
      [-2e-5, 0],
      [-3e-5, 0],
      [-0.0, 2],
      [-0.00064, 1],
      [-1e-5, 2],
      [-3e-5, 0],
      [-5e-5, 2],
      [-0.0001, 0],
      [-0.00032, 1],
      [3e-5, 0],
      [1e-5, 2]
    ],
    "red_o_points": [],
    "y_categories": ["N", "NOT APPLICABLE", "nan"],
    "blue_o_points": [],
    "blue_x_points": [
      [0.0001, 2],
      [5e-5, 0],
      [9e-5, 0],
      [0.00022, 0],
      [9e-5, 0],
      [0.0, 0],
      [0.00039, 1],
      [-5e-5, 0],
      [0.00025, 0],
      [5e-5, 2],
      [4e-5, 2],
      [9e-5, 2],
      [0.0001, 2],
      [0.00014, 2],
      [0.00014, 2],
      [5e-5, 2]
    ]
  },
  "QS_mulGraftNerve[MCF]": {
    "red_x_points": [[-0.0001, 1]],
    "red_o_points": [],
    "y_categories": ["N", "NOT APPLICABLE", "nan"],
    "blue_o_points": [],
    "blue_x_points": [[0.0001, 0]]
  },
  "QA_lstPexTouch[C5]": {
    "red_x_points": [
      [-0.00255, 0],
      [-0.00031, 2],
      [-0.00101, 1],
      [-0.00137, 1],
      [-0.00073, 2],
      [-0.00024, 1],
      [-0.00098, 1],
      [-0.00393, 1],
      [-0.00114, 2],
      [-0.00067, 2],
      [-0.00187, 1],
      [-0.00046, 2],
      [-0.00196, 1],
      [-0.00114, 1],
      [-0.00334, 1],
      [-0.0009, 1],
      [-0.00054, 2],
      [-0.00393, 1],
      [-0.00105, 1],
      [-0.00114, 2],
      [-0.00208, 1],
      [-0.00043, 1],
      [-0.00235, 1]
    ],
    "red_o_points": [],
    "y_categories": ["NORM", "NPV", "nan"],
    "blue_o_points": [],
    "blue_x_points": [
      [-0.00093, 1],
      [-0.0014, 1],
      [-0.0004, 1],
      [-0.00034, 1],
      [0.0114, 0],
      [-0.00018, 1],
      [-0.00041, 1],
      [-0.00038, 1],
      [0.00181, 2],
      [0.00368, 2],
      [0.00052, 2],
      [-0.00048, 1],
      [0.00166, 2],
      [-0.00077, 1],
      [0.00523, 0],
      [-0.00082, 1],
      [0.0019, 2],
      [0.00517, 0],
      [0.01021, 0],
      [-0.00079, 1],
      [-0.00056, 1]
    ]
  },
  "QS_mulLysisSite[Nerve]": {
    "red_x_points": [
      [-0.00632, 1],
      [-0.00133, 0],
      [-0.01149, 2],
      [-0.02061, 2],
      [-0.00088, 0],
      [0.00254, 0],
      [0.00073, 3],
      [-0.00646, 1],
      [0.00144, 3],
      [-0.00069, 0],
      [0.00134, 3],
      [-0.00112, 0],
      [0.0011, 3],
      [0.00062, 0],
      [-0.00687, 1],
      [0.00072, 3],
      [-0.00104, 0],
      [0.0012, 3],
      [0.00118, 0],
      [-0.00127, 0],
      [-0.00915, 1],
      [0.00256, 0],
      [0.00106, 3]
    ],
    "red_o_points": [],
    "y_categories": ["N", "NOT APPLICABLE", "Y", "nan"],
    "blue_o_points": [],
    "blue_x_points": [
      [0.00212, 3],
      [0.00144, 3],
      [0.00199, 0],
      [0.00529, 0],
      [0.0018, 3],
      [0.00477, 0],
      [0.00239, 0],
      [0.00495, 0],
      [0.00178, 3],
      [0.00376, 1],
      [-0.00027, 0],
      [0.00531, 0],
      [0.00131, 3],
      [0.00244, 3],
      [0.0022, 3],
      [0.0018, 3],
      [0.00196, 3],
      [0.00179, 3],
      [0.00121, 1],
      [0.00335, 3],
      [0.00139, 3]
    ]
  },
  "QA_lstPexMuscstrength[ElbowExte]": {
    "red_x_points": [
      [-0.00575, 2],
      [-0.00415, 2],
      [-0.00357, 1],
      [-0.00275, 1],
      [-0.00632, 1],
      [-0.00331, 1],
      [-0.00348, 1],
      [0.00173, 0],
      [-0.00339, 2],
      [-0.00692, 2],
      [-0.0043, 1],
      [-0.00453, 2],
      [-0.00032, 1],
      [-0.00701, 1],
      [4e-5, 0],
      [-0.00229, 1],
      [-0.00532, 1],
      [-0.0058, 0],
      [-0.00695, 1],
      [-0.00452, 2],
      [-0.00236, 2],
      [-0.00168, 1],
      [-0.00582, 2]
    ],
    "red_o_points": [],
    "y_categories": ["GREATER THAN OR EQUALS TO 3", "LESS THAN 3", "nan"],
    "blue_o_points": [],
    "blue_x_points": [
      [0.00014, 1],
      [7e-5, 1],
      [0.00881, 0],
      [-0.00241, 1],
      [0.00021, 1],
      [0.01343, 0],
      [0.01499, 0],
      [-0.00208, 1],
      [-8e-5, 2],
      [-0.00073, 2],
      [0.02093, 0],
      [0.00102, 1],
      [0.00031, 2],
      [0.00675, 0],
      [0.00611, 0],
      [0.00652, 0],
      [-3e-5, 2],
      [0.00447, 0],
      [0.00542, 0],
      [0.00278, 1],
      [0.00214, 1]
    ]
  },
  "QA_lstPexMuscstrength[FingersAddu]": {
    "red_x_points": [
      [-4e-5, 2],
      [-0.00026, 2],
      [-0.01971, 1],
      [-0.00048, 2],
      [-0.01757, 1],
      [-0.01961, 1],
      [0.00671, 0],
      [0.00622, 0],
      [-0.00019, 2],
      [0.00027, 2],
      [0.0041, 0],
      [0.00034, 2],
      [-0.01801, 1],
      [0.00866, 0],
      [0.00622, 0],
      [-0.01696, 1],
      [-0.01578, 1],
      [0.00027, 2],
      [-0.0012, 2],
      [-0.01709, 1],
      [-0.00012, 2],
      [-0.01605, 1],
      [-0.0021, 2]
    ],
    "red_o_points": [],
    "y_categories": ["GREATER THAN OR EQUALS TO 3", "LESS THAN 3", "nan"],
    "blue_o_points": [],
    "blue_x_points": [
      [0.01344, 0],
      [-0.00466, 1],
      [0.00783, 0],
      [0.01035, 0],
      [0.01178, 0],
      [0.0119, 0],
      [0.00211, 2],
      [0.01224, 0],
      [0.0009, 2],
      [0.00159, 2],
      [0.00166, 2],
      [0.00272, 2],
      [0.00193, 2],
      [0.0084, 0],
      [0.00709, 0],
      [0.0081, 0],
      [0.00216, 2],
      [0.00195, 2],
      [0.00953, 0],
      [0.00085, 2],
      [0.00051, 2]
    ]
  },
  "QS_mulTransfSite[IMc]": {
    "red_x_points": [
      [-0.0114, 1],
      [-0.02204, 2],
      [0.00091, 0],
      [-0.03019, 2],
      [-0.00207, 0],
      [0.00433, 0],
      [0.0031, 3],
      [-0.01431, 1],
      [0.00711, 3],
      [-0.00112, 0],
      [0.00441, 3],
      [-0.01955, 2],
      [0.00395, 3],
      [0.00163, 0],
      [-0.02013, 1],
      [0.00325, 3],
      [-0.00249, 0],
      [0.0048, 3],
      [0.00123, 0],
      [-0.02274, 2],
      [-0.01539, 1],
      [-0.01536, 2],
      [0.00513, 3]
    ],
    "red_o_points": [],
    "y_categories": ["N", "NOT APPLICABLE", "Y", "nan"],
    "blue_o_points": [],
    "blue_x_points": [
      [0.00751, 3],
      [0.00598, 3],
      [0.0048, 0],
      [0.00936, 0],
      [0.00548, 3],
      [0.0083, 0],
      [0.00579, 0],
      [0.00742, 0],
      [0.00908, 3],
      [0.00945, 1],
      [0.00246, 0],
      [0.00962, 0],
      [0.00812, 3],
      [0.00573, 3],
      [0.0061, 3],
      [0.00504, 3],
      [0.0085, 3],
      [0.00576, 3],
      [-0.00022, 1],
      [0.00716, 3],
      [0.0055, 3]
    ]
  },
  "QA_lstPexTouch[T1]": {
    "red_x_points": [
      [-0.01061, 1],
      [-0.0028, 2],
      [-0.00598, 1],
      [0.00472, 0],
      [-0.00266, 2],
      [-0.0074, 1],
      [0.00545, 0],
      [-0.00955, 1],
      [-0.00207, 2],
      [-0.00419, 2],
      [-0.01076, 1],
      [-0.00225, 2],
      [-0.00803, 1],
      [-0.0131, 1],
      [-0.00999, 1],
      [-0.00653, 1],
      [-0.00272, 2],
      [-0.00054, 0],
      [-0.00841, 1],
      [-0.00363, 2],
      [-0.0113, 1],
      [-0.00517, 1],
      [-0.00886, 1]
    ],
    "red_o_points": [],
    "y_categories": ["NORM", "NPV", "nan"],
    "blue_o_points": [],
    "blue_x_points": [
      [-0.006, 1],
      [-0.00519, 1],
      [0.01391, 0],
      [-0.00465, 1],
      [-0.00409, 1],
      [0.01758, 0],
      [0.01682, 0],
      [0.01519, 0],
      [0.00137, 2],
      [0.00373, 2],
      [-0.00048, 2],
      [-0.00536, 1],
      [0.00253, 2],
      [0.01169, 0],
      [0.01091, 0],
      [0.01154, 0],
      [0.00302, 2],
      [-0.00503, 1],
      [0.01827, 0],
      [0.01542, 0],
      [0.0152, 0]
    ]
  },
  "QA_lstPexArthre[Elbow]": {
    "red_x_points": [
      [0.00011, 2],
      [-0.00088, 3],
      [-0.00136, 3],
      [0.00028, 2],
      [-0.00497, 0],
      [-0.00613, 1],
      [-0.00264, 2],
      [0.0, 2],
      [-0.00051, 3],
      [0.00088, 2],
      [-0.00187, 3],
      [-0.00062, 3],
      [-0.00176, 3],
      [0.00023, 2],
      [0.00018, 2],
      [-0.00382, 2],
      [-0.0006, 3],
      [-0.00128, 3],
      [-0.00292, 3],
      [-0.00042, 3],
      [-0.00037, 3],
      [0.0004, 2],
      [-0.00204, 3]
    ],
    "red_o_points": [],
    "y_categories": ["NAIA", "NPV", "PV", "nan"],
    "blue_o_points": [],
    "blue_x_points": [
      [0.01577, 1],
      [-0.00118, 3],
      [0.00055, 2],
      [0.00152, 2],
      [-0.00036, 3],
      [0.00341, 2],
      [0.00108, 2],
      [0.00176, 2],
      [-0.00022, 3],
      [-0.00017, 3],
      [-0.00042, 3],
      [0.00358, 2],
      [-0.00024, 3],
      [0.00026, 2],
      [0.00042, 2],
      [0.00329, 1],
      [-0.0003, 3],
      [0.00032, 2],
      [-2e-5, 3],
      [8e-5, 2],
      [0.00099, 2]
    ]
  },
  "QS_mulTransfSite[AcMc]": {
    "red_x_points": [
      [-0.00902, 1],
      [-0.00717, 0],
      [-0.003, 0],
      [-0.00587, 0],
      [-0.00354, 0],
      [-0.00074, 0],
      [0.00087, 3],
      [-0.01062, 1],
      [0.00333, 3],
      [-0.00445, 0],
      [0.00134, 3],
      [-0.00447, 0],
      [0.00158, 3],
      [-0.00353, 0],
      [-0.01306, 1],
      [0.00114, 3],
      [-0.00402, 0],
      [0.00142, 3],
      [-0.00346, 0],
      [-0.00534, 0],
      [-0.01084, 1],
      [-0.00067, 0],
      [0.00194, 3]
    ],
    "red_o_points": [],
    "y_categories": ["N", "NOT APPLICABLE", "Y", "nan"],
    "blue_o_points": [],
    "blue_x_points": [
      [0.00407, 3],
      [0.00322, 3],
      [0.00035, 0],
      [0.00147, 0],
      [0.0029, 3],
      [0.00179, 0],
      [0.00116, 0],
      [0.01956, 2],
      [0.00497, 3],
      [0.01073, 1],
      [-0.00198, 0],
      [0.00227, 0],
      [0.00381, 3],
      [0.003, 3],
      [0.00277, 3],
      [0.00273, 3],
      [0.00411, 3],
      [0.00292, 3],
      [0.00203, 1],
      [0.0043, 3],
      [0.00204, 3]
    ]
  },
  "QS_mulTransfSite[Other]": {
    "red_x_points": [
      [-0.00498, 1],
      [-0.00174, 0],
      [-0.00032, 0],
      [-1e-5, 0],
      [-0.00088, 0],
      [0.00049, 0],
      [7e-5, 3],
      [-0.00688, 1],
      [0.00127, 3],
      [-0.00111, 0],
      [0.00047, 3],
      [-0.00168, 0],
      [0.00039, 3],
      [-0.03184, 2],
      [-0.00675, 1],
      [0.00036, 3],
      [-0.00132, 0],
      [0.00074, 3],
      [6e-5, 0],
      [-0.00159, 0],
      [-0.00516, 1],
      [0.00022, 0],
      [0.0004, 3]
    ],
    "red_o_points": [],
    "y_categories": ["N", "NOT APPLICABLE", "Y", "nan"],
    "blue_o_points": [],
    "blue_x_points": [
      [0.0022, 3],
      [0.00156, 3],
      [0.00474, 0],
      [0.00477, 0],
      [0.00247, 3],
      [0.00431, 0],
      [0.00583, 0],
      [0.0042, 0],
      [0.00181, 3],
      [0.00473, 1],
      [-0.00035, 0],
      [0.00407, 0],
      [0.00181, 3],
      [0.00308, 3],
      [0.00334, 3],
      [0.00224, 3],
      [0.00186, 3],
      [0.00229, 3],
      [0.00069, 1],
      [0.00254, 3],
      [0.00161, 3]
    ]
  },
  "QA_yonInjBpsurg": {
    "red_x_points": [
      [-0.00748, 0],
      [0.00021, 1],
      [0.0001, 1],
      [0.00093, 1],
      [0.0001, 1],
      [0.00064, 1],
      [0.00051, 1],
      [-0.0075, 0],
      [4e-5, 1],
      [0.00052, 1],
      [0.00041, 1],
      [0.00031, 1],
      [0.00034, 1],
      [0.00093, 1],
      [-0.00988, 0],
      [0.00041, 1],
      [-0.00091, 1],
      [-0.00116, 1],
      [0.00052, 1],
      [-0.00099, 1],
      [-0.01023, 0],
      [0.00032, 1],
      [0.00069, 1]
    ],
    "red_o_points": [],
    "y_categories": ["N", "Y", "nan"],
    "blue_o_points": [],
    "blue_x_points": [
      [0.00211, 1],
      [0.0011, 1],
      [0.00201, 1],
      [0.00163, 1],
      [0.00098, 1],
      [0.0021, 1],
      [0.0021, 1],
      [0.00175, 1],
      [0.00046, 1],
      [0.00355, 0],
      [0.00016, 1],
      [0.00184, 1],
      [0.00037, 1],
      [0.00153, 1],
      [0.00154, 1],
      [0.00141, 1],
      [0.00019, 1],
      [0.00181, 1],
      [3e-5, 0],
      [0.00232, 1],
      [0.00217, 1]
    ]
  },
  "QA_lstPexTouch[C8]": {
    "red_x_points": [
      [0.00811, 0],
      [-0.00448, 2],
      [-0.00823, 1],
      [-0.01373, 1],
      [-0.00303, 2],
      [-0.00763, 1],
      [-0.0115, 1],
      [-0.01089, 1],
      [-0.00357, 2],
      [-0.00349, 2],
      [-0.01388, 1],
      [-0.00335, 2],
      [-0.01245, 1],
      [0.00833, 0],
      [-0.01006, 1],
      [-0.00962, 1],
      [-0.00277, 2],
      [0.00659, 0],
      [-0.009, 1],
      [-0.0041, 2],
      [-0.01474, 1],
      [-0.00822, 1],
      [-0.01422, 1]
    ],
    "red_o_points": [],
    "y_categories": ["NORM", "NPV", "nan"],
    "blue_o_points": [],
    "blue_x_points": [
      [-0.00924, 1],
      [-0.01003, 1],
      [0.01271, 0],
      [-0.00677, 1],
      [0.01802, 0],
      [-0.00671, 1],
      [0.01616, 0],
      [0.0173, 0],
      [0.00067, 2],
      [0.00277, 2],
      [-0.00099, 2],
      [-0.00615, 1],
      [0.00117, 2],
      [0.01509, 0],
      [0.01544, 0],
      [0.01625, 0],
      [0.00197, 2],
      [0.01267, 0],
      [0.01606, 0],
      [0.01982, 0],
      [0.0197, 0]
    ]
  },
  "QS_mulLysisNerve[Ssr]": {
    "red_x_points": [
      [-0.00564, 1],
      [-0.00164, 0],
      [-0.00935, 2],
      [-0.02108, 2],
      [-0.00069, 0],
      [0.0021, 0],
      [0.00078, 3],
      [-0.00728, 1],
      [0.0013, 3],
      [-0.00068, 0],
      [0.00128, 3],
      [-0.00112, 0],
      [0.00103, 3],
      [0.00046, 0],
      [-0.00735, 1],
      [0.0005, 3],
      [-0.00074, 0],
      [0.0017, 3],
      [0.00117, 0],
      [-0.00075, 0],
      [-0.00592, 1],
      [0.00187, 0],
      [0.00141, 3]
    ],
    "red_o_points": [],
    "y_categories": ["N", "NOT APPLICABLE", "Y", "nan"],
    "blue_o_points": [],
    "blue_x_points": [
      [0.00268, 3],
      [0.00184, 3],
      [0.00136, 0],
      [0.00464, 0],
      [0.00214, 3],
      [0.00505, 0],
      [0.00189, 0],
      [0.0039, 0],
      [0.0017, 3],
      [0.0022, 1],
      [-0.00039, 0],
      [0.00517, 0],
      [0.00146, 3],
      [0.00202, 3],
      [0.00202, 3],
      [0.00163, 3],
      [0.00203, 3],
      [0.00128, 3],
      [0.00124, 1],
      [0.00288, 3],
      [0.00191, 3]
    ]
  },
  "QS_mulBpsurgeryType[Graft]": {
    "red_x_points": [
      [-0.00326, 1],
      [-0.00198, 0],
      [-0.00084, 0],
      [0.00028, 0],
      [-0.00128, 0],
      [-7e-5, 0],
      [0.00037, 3],
      [-0.00339, 1],
      [0.00151, 3],
      [-0.01604, 2],
      [0.00084, 3],
      [-0.00166, 0],
      [0.00025, 3],
      [0.00013, 0],
      [-0.004, 1],
      [0.00026, 3],
      [-0.00131, 0],
      [0.00077, 3],
      [-0.00036, 0],
      [-0.0017, 0],
      [-0.00242, 1],
      [0.00016, 0],
      [0.0006, 3]
    ],
    "red_o_points": [],
    "y_categories": ["N", "NOT APPLICABLE", "Y", "nan"],
    "blue_o_points": [],
    "blue_x_points": [
      [0.00185, 3],
      [0.00092, 3],
      [0.00108, 0],
      [0.00147, 0],
      [0.0005, 3],
      [0.0022, 0],
      [0.00193, 0],
      [0.00124, 0],
      [0.0028, 3],
      [0.00588, 1],
      [-0.00032, 0],
      [0.00254, 0],
      [0.00213, 3],
      [0.00097, 3],
      [0.00082, 3],
      [0.00044, 3],
      [0.00255, 3],
      [0.00095, 3],
      [0.00026, 1],
      [0.00125, 3],
      [0.00168, 3]
    ]
  },
  "QA_lstPexTinel[TinelSign]": {
    "red_x_points": [
      [0.00109, 1],
      [-0.00054, 1],
      [-0.0089, 2],
      [0.00112, 1],
      [0.00034, 1],
      [0.00099, 1],
      [-0.01368, 2],
      [-0.01114, 2],
      [-0.00584, 1],
      [0.00049, 1],
      [-0.01706, 2],
      [-0.00775, 2],
      [-0.00063, 1],
      [-0.01531, 2],
      [0.0021, 1],
      [-0.01061, 2],
      [0.00036, 1],
      [-0.00213, 1],
      [-0.01315, 2],
      [-0.00926, 2],
      [-1e-5, 1],
      [-0.007, 2],
      [-0.00195, 1]
    ],
    "red_o_points": [],
    "y_categories": ["ABS", "NAIA", "PT", "nan"],
    "blue_o_points": [],
    "blue_x_points": [
      [0.00621, 1],
      [0.03519, 0],
      [0.01612, 0],
      [-0.00803, 2],
      [0.00417, 1],
      [0.00529, 1],
      [-0.00661, 2],
      [0.00481, 1],
      [0.00627, 2],
      [0.00178, 1],
      [0.00567, 1],
      [0.00538, 1],
      [0.00052, 1],
      [0.01968, 0],
      [0.00459, 1],
      [0.00377, 1],
      [0.00275, 2],
      [0.00248, 1],
      [0.00492, 1],
      [0.00189, 1],
      [0.00162, 1]
    ]
  },
  "QS_mulLysisRoot[C5]": {
    "red_x_points": [
      [-0.00401, 1],
      [-0.00128, 0],
      [-0.01131, 2],
      [0.00176, 0],
      [-0.00105, 0],
      [0.00252, 0],
      [0.00039, 3],
      [-0.0042, 1],
      [0.0012, 3],
      [-0.00122, 0],
      [0.00107, 3],
      [-0.00128, 0],
      [0.00117, 3],
      [0.00032, 0],
      [-0.00492, 1],
      [0.00038, 3],
      [-0.00119, 0],
      [0.00123, 3],
      [0.00092, 0],
      [-0.00144, 0],
      [-0.00453, 1],
      [-0.00881, 2],
      [0.00068, 3]
    ],
    "red_o_points": [],
    "y_categories": ["N", "NOT APPLICABLE", "Y", "nan"],
    "blue_o_points": [],
    "blue_x_points": [
      [0.00135, 3],
      [0.00113, 3],
      [0.00037, 0],
      [0.00383, 0],
      [0.00096, 3],
      [0.00262, 0],
      [0.00097, 0],
      [0.00179, 0],
      [0.00167, 3],
      [0.00445, 1],
      [-0.00069, 0],
      [0.00417, 0],
      [0.00158, 3],
      [0.00111, 3],
      [0.00052, 3],
      [0.00036, 3],
      [0.00268, 3],
      [0.00064, 3],
      [0.00219, 1],
      [0.00136, 3],
      [0.00055, 3]
    ]
  },
  "QS_mulNeuromadSite[C6]": {
    "red_x_points": [
      [-0.00328, 1],
      [-0.00228, 0],
      [-0.00055, 0],
      [0.00012, 0],
      [-0.00146, 0],
      [0.00052, 0],
      [0.00015, 2],
      [-0.00445, 1],
      [0.00121, 2],
      [-0.00141, 0],
      [0.00058, 2],
      [-0.00173, 0],
      [0.0003, 2],
      [0.0, 0],
      [-0.0072, 1],
      [0.00023, 2],
      [-0.00126, 0],
      [0.0003, 2],
      [-0.00111, 0],
      [-0.00203, 0],
      [-0.00444, 1],
      [0.00045, 0],
      [0.00046, 2]
    ],
    "red_o_points": [],
    "y_categories": ["N", "NOT APPLICABLE", "nan"],
    "blue_o_points": [],
    "blue_x_points": [
      [0.00169, 2],
      [0.00076, 2],
      [0.00119, 0],
      [0.00164, 0],
      [0.0006, 2],
      [0.00185, 0],
      [0.0011, 0],
      [0.00117, 0],
      [0.00193, 2],
      [0.00595, 1],
      [-0.00105, 0],
      [0.00176, 0],
      [0.00161, 2],
      [0.00087, 2],
      [0.00108, 2],
      [0.00047, 2],
      [0.00133, 2],
      [0.00088, 2],
      [0.0002, 1],
      [0.00092, 2],
      [0.00094, 2]
    ]
  },
  "QS_mulNeuromadSite[T1]": {
    "red_x_points": [
      [-0.00214, 1],
      [-0.00143, 0],
      [-0.00061, 0],
      [5e-5, 0],
      [-0.00089, 0],
      [-1e-5, 0],
      [1e-5, 2],
      [-0.00225, 1],
      [0.00069, 2],
      [-0.00086, 0],
      [-0.0, 2],
      [-0.00106, 0],
      [0.00023, 2],
      [2e-5, 0],
      [-0.00322, 1],
      [0.00013, 2],
      [-0.00075, 0],
      [0.00017, 2],
      [-0.00058, 0],
      [-0.0014, 0],
      [-0.00196, 1],
      [0.00023, 0],
      [0.00027, 2]
    ],
    "red_o_points": [],
    "y_categories": ["N", "NOT APPLICABLE", "nan"],
    "blue_o_points": [],
    "blue_x_points": [
      [0.00115, 2],
      [0.00049, 2],
      [0.00057, 0],
      [0.00099, 0],
      [0.00016, 2],
      [0.00104, 0],
      [0.00082, 0],
      [0.00021, 0],
      [0.00102, 2],
      [0.00302, 1],
      [-0.00035, 0],
      [0.00112, 0],
      [0.00094, 2],
      [0.0003, 2],
      [0.00034, 2],
      [0.00023, 2],
      [0.00131, 2],
      [0.00049, 2],
      [0.00062, 1],
      [0.00065, 2],
      [0.00025, 2]
    ]
  },
  "QS_mulGraftNerve[LT]": {
    "red_x_points": [
      [-0.00019, 1],
      [-0.00015, 0],
      [-8e-5, 0],
      [0.00011, 0],
      [-0.00022, 0],
      [8e-5, 0],
      [-0.0, 2],
      [-0.00022, 1],
      [0.00016, 2],
      [-0.00032, 0],
      [-2e-5, 2],
      [-0.00032, 0],
      [2e-5, 2],
      [-0.00047, 1],
      [-2e-5, 2],
      [-0.00015, 0],
      [0.0, 2],
      [4e-5, 0],
      [-7e-5, 0],
      [-0.00032, 1],
      [0.00011, 0],
      [-0.0, 2]
    ],
    "red_o_points": [],
    "y_categories": ["N", "NOT APPLICABLE", "nan"],
    "blue_o_points": [],
    "blue_x_points": [
      [0.00012, 2],
      [7e-5, 2],
      [2e-5, 0],
      [0.00022, 0],
      [0.00015, 0],
      [2e-5, 0],
      [4e-5, 0],
      [0.00017, 2],
      [0.00044, 1],
      [-7e-5, 0],
      [0.00013, 0],
      [0.00026, 2],
      [2e-5, 2],
      [2e-5, 2],
      [0.00026, 2],
      [2e-5, 2],
      [0.0001, 1],
      [2e-5, 2]
    ]
  },
  "QA_lstPexMuscstrength[ShoulderAbduc]": {
    "red_x_points": [
      [-0.00136, 2],
      [0.00017, 1],
      [6e-5, 1],
      [0.0008, 1],
      [5e-5, 1],
      [0.00035, 1],
      [0.00069, 1],
      [-0.01589, 0],
      [-0.00045, 2],
      [-0.00073, 2],
      [-0.00365, 2],
      [-0.00021, 2],
      [0.00059, 1],
      [0.00119, 1],
      [-0.02312, 0],
      [0.00018, 1],
      [0.00015, 1],
      [0.0003, 1],
      [0.00073, 1],
      [0.00029, 1],
      [-0.00117, 2],
      [0.00032, 1],
      [-0.00083, 2]
    ],
    "red_o_points": [],
    "y_categories": ["GREATER THAN OR EQUALS TO 3", "LESS THAN 3", "nan"],
    "blue_o_points": [],
    "blue_x_points": [
      [0.00331, 1],
      [0.00226, 1],
      [0.00282, 1],
      [0.00252, 1],
      [0.00163, 1],
      [0.00367, 1],
      [0.00202, 1],
      [0.00163, 1],
      [0.00025, 2],
      [0.00121, 2],
      [0.00129, 1],
      [0.00096, 2],
      [0.00068, 2],
      [0.00297, 1],
      [0.00293, 1],
      [-0.00093, 2],
      [0.00044, 2],
      [0.0019, 1],
      [0.00785, 1],
      [0.00084, 1],
      [0.00129, 1]
    ]
  },
  "QA_lstPexMuscstrength[ThumbOppo]": {
    "red_x_points": [
      [0.0004, 2],
      [6e-5, 2],
      [-0.01194, 1],
      [-0.02141, 1],
      [-0.00826, 1],
      [-0.0126, 1],
      [0.00017, 0],
      [0.00207, 0],
      [0.00015, 2],
      [-9e-5, 2],
      [-0.00271, 0],
      [0.00038, 2],
      [-0.00894, 1],
      [0.00318, 0],
      [0.00242, 0],
      [-0.00593, 1],
      [-0.00788, 1],
      [0.00062, 2],
      [0.00355, 0],
      [-0.00876, 1],
      [-4e-5, 2],
      [-0.00982, 1],
      [-0.00134, 2]
    ],
    "red_o_points": [],
    "y_categories": ["GREATER THAN OR EQUALS TO 3", "LESS THAN 3", "nan"],
    "blue_o_points": [],
    "blue_x_points": [
      [-0.00099, 1],
      [0.00183, 1],
      [0.00484, 0],
      [0.00687, 0],
      [0.00776, 0],
      [0.0082, 0],
      [0.00708, 0],
      [0.00961, 0],
      [0.0014, 2],
      [0.0016, 2],
      [0.00221, 2],
      [0.00672, 2],
      [0.00162, 2],
      [0.00475, 0],
      [0.00378, 0],
      [0.00674, 0],
      [0.00273, 2],
      [0.00146, 2],
      [0.00523, 0],
      [0.00202, 2],
      [0.00124, 2]
    ]
  },
  "QA_lstPexMuscstrength[ShoulderExrot]": {
    "red_x_points": [
      [-0.00036, 2],
      [-0.00026, 2],
      [-0.01578, 0],
      [-0.00047, 2],
      [0.00373, 1],
      [-0.00021, 2],
      [0.00247, 1],
      [-0.01777, 0],
      [-0.00046, 2],
      [-0.00025, 2],
      [-0.0008, 2],
      [-0.00022, 2],
      [-0.0003, 2],
      [0.00381, 1],
      [-0.02624, 0],
      [0.00243, 1],
      [-5e-5, 2],
      [4e-5, 2],
      [0.00408, 1],
      [-0.01625, 0],
      [-0.00065, 2],
      [0.00226, 1],
      [-0.00038, 2]
    ],
    "red_o_points": [],
    "y_categories": ["GREATER THAN OR EQUALS TO 3", "LESS THAN 3", "nan"],
    "blue_o_points": [],
    "blue_x_points": [
      [0.00839, 1],
      [0.00033, 2],
      [0.00508, 1],
      [0.00583, 1],
      [0.00594, 1],
      [0.00897, 1],
      [0.0049, 1],
      [0.00025, 2],
      [7e-5, 2],
      [0.00044, 2],
      [0.00053, 2],
      [0.00076, 2],
      [0.00061, 2],
      [0.00454, 1],
      [0.00466, 1],
      [0.00022, 2],
      [0.00033, 2],
      [0.00068, 2],
      [0.00927, 1],
      [-9e-5, 2],
      [-5e-5, 2]
    ]
  },
  "QS_mulNeuromadSite[T2]": {
    "red_x_points": [
      [-0.00232, 1],
      [-0.00125, 0],
      [-0.00029, 0],
      [9e-5, 0],
      [-0.00076, 0],
      [0.00044, 0],
      [-0.00028, 2],
      [-0.00285, 1],
      [0.00072, 2],
      [-0.00095, 0],
      [0.00015, 2],
      [-0.00072, 0],
      [0.00021, 2],
      [7e-5, 0],
      [-0.00359, 1],
      [2e-5, 2],
      [-0.00053, 0],
      [8e-5, 2],
      [-0.00024, 0],
      [-0.00166, 0],
      [-0.00171, 1],
      [0.00023, 0],
      [3e-5, 2]
    ],
    "red_o_points": [],
    "y_categories": ["N", "NOT APPLICABLE", "nan"],
    "blue_o_points": [],
    "blue_x_points": [
      [0.00039, 2],
      [0.00052, 2],
      [0.00041, 0],
      [0.00106, 0],
      [0.00017, 2],
      [0.00111, 0],
      [0.00059, 0],
      [0.00065, 0],
      [0.0012, 2],
      [0.003, 1],
      [-9e-5, 0],
      [0.00129, 0],
      [0.00092, 2],
      [0.00061, 2],
      [0.00054, 2],
      [0.00024, 2],
      [0.00124, 2],
      [0.00049, 2],
      [0.00018, 1],
      [0.00032, 2],
      [0.00029, 2]
    ]
  },
  "QS_mulGraftNerve[MC]": {
    "red_x_points": [
      [-9e-5, 1],
      [-4e-5, 0],
      [6e-5, 0],
      [-0.00011, 0],
      [-9e-5, 1],
      [2e-5, 2],
      [-4e-5, 0],
      [2e-5, 2],
      [-4e-5, 0],
      [-2e-5, 2],
      [-0.00027, 1],
      [-9e-5, 2],
      [-7e-5, 0],
      [2e-5, 2],
      [-4e-5, 0],
      [-2e-5, 2]
    ],
    "red_o_points": [],
    "y_categories": ["N", "NOT APPLICABLE", "nan"],
    "blue_o_points": [],
    "blue_x_points": [
      [-2e-5, 2],
      [6e-5, 0],
      [0.00028, 0],
      [2e-5, 2],
      [0.00019, 1],
      [-0.00011, 0],
      [0.00018, 0],
      [9e-5, 2],
      [9e-5, 2]
    ]
  },
  "QA_lstPexKine[Elbow]": {
    "red_x_points": [
      [-0.00021, 1],
      [-0.00068, 2],
      [-0.00182, 2],
      [0.00127, 1],
      [-0.00126, 2],
      [-0.00827, 0],
      [-0.00073, 1],
      [-9e-5, 1],
      [-0.00043, 2],
      [0.00103, 1],
      [-0.00135, 2],
      [-0.00081, 2],
      [-0.00161, 2],
      [0.00139, 1],
      [-0.00011, 1],
      [-0.00235, 0],
      [-0.0007, 2],
      [-0.00101, 2],
      [-0.00385, 2],
      [-0.00051, 2],
      [-0.00055, 2],
      [-0.00482, 0],
      [-0.00113, 2]
    ],
    "red_o_points": [],
    "y_categories": ["NPV", "PV", "nan"],
    "blue_o_points": [],
    "blue_x_points": [
      [0.00475, 0],
      [-0.00044, 2],
      [0.00073, 1],
      [0.00293, 1],
      [-0.00037, 2],
      [0.0047, 1],
      [0.00147, 1],
      [0.00251, 1],
      [-0.00021, 2],
      [-9e-5, 2],
      [-0.00059, 2],
      [0.00609, 1],
      [-0.00011, 2],
      [0.00041, 1],
      [0.00054, 1],
      [0.00221, 0],
      [-0.0002, 2],
      [0.00064, 1],
      [8e-5, 2],
      [0.00229, 1],
      [0.00123, 1]
    ]
  },
  "QS_mulNeuromadSite[C4]": {
    "red_x_points": [
      [-0.00714, 1],
      [-0.00398, 0],
      [-0.00145, 0],
      [0.00042, 0],
      [-0.00243, 0],
      [0.00047, 0],
      [0.00019, 2],
      [-0.00765, 1],
      [0.00174, 2],
      [-0.00241, 0],
      [0.00093, 2],
      [-0.00341, 0],
      [0.00043, 2],
      [0.00037, 0],
      [-0.01267, 1],
      [-1e-5, 2],
      [-0.00262, 0],
      [0.00064, 2],
      [-0.00198, 0],
      [-0.004, 0],
      [-0.00631, 1],
      [0.00054, 0],
      [0.00061, 2]
    ],
    "red_o_points": [],
    "y_categories": ["N", "NOT APPLICABLE", "nan"],
    "blue_o_points": [],
    "blue_x_points": [
      [0.00238, 2],
      [0.00176, 2],
      [0.00199, 0],
      [0.00298, 0],
      [0.00092, 2],
      [0.00329, 0],
      [0.00199, 0],
      [0.00119, 0],
      [0.003, 2],
      [0.00999, 1],
      [-0.00096, 0],
      [0.00389, 0],
      [0.00295, 2],
      [0.00158, 2],
      [0.00207, 2],
      [0.00092, 2],
      [0.00331, 2],
      [0.00206, 2],
      [0.00151, 1],
      [0.00187, 2],
      [0.00102, 2]
    ]
  },
  "QS_mulGraftNerve[Ra]": {
    "red_x_points": [
      [-0.00022, 1],
      [1e-5, 0],
      [-0.00022, 1],
      [-7e-5, 0],
      [-7e-5, 0]
    ],
    "red_o_points": [],
    "y_categories": ["N", "NOT APPLICABLE", "nan"],
    "blue_o_points": [],
    "blue_x_points": [
      [5e-5, 2],
      [1e-5, 0],
      [0.00015, 0],
      [1e-5, 0],
      [1e-5, 0],
      [0.00013, 1],
      [1e-5, 0],
      [5e-5, 2],
      [5e-5, 2],
      [5e-5, 2],
      [5e-5, 2]
    ]
  },
  "QS_mulTransfSite[Oberlin]": {
    "red_x_points": [
      [-0.0113, 1],
      [-0.03519, 0],
      [-0.03365, 0],
      [-0.03662, 0],
      [-0.03524, 0],
      [-0.03453, 0],
      [0.00951, 3],
      [-0.01171, 1],
      [0.01042, 3],
      [0.01336, 2],
      [0.00963, 3],
      [-0.03378, 0],
      [0.01035, 3],
      [0.01456, 2],
      [-0.01264, 1],
      [0.00979, 3],
      [-0.03453, 0],
      [0.01033, 3],
      [0.01545, 2],
      [-0.0381, 0],
      [-0.01311, 1],
      [-0.03226, 0],
      [0.01068, 3]
    ],
    "red_o_points": [],
    "y_categories": ["N", "NOT APPLICABLE", "Y", "nan"],
    "blue_o_points": [],
    "blue_x_points": [
      [0.01207, 3],
      [0.01151, 3],
      [0.01667, 2],
      [0.01731, 2],
      [0.01199, 3],
      [0.01864, 2],
      [0.01687, 2],
      [0.01684, 2],
      [0.01254, 3],
      [-0.00388, 1],
      [0.01637, 2],
      [0.01799, 2],
      [0.01224, 3],
      [0.01129, 3],
      [0.01087, 3],
      [0.01084, 3],
      [0.01214, 3],
      [0.01046, 3],
      [-0.00667, 1],
      [0.01169, 3],
      [0.01082, 3]
    ]
  },
  "QA_lstPexArthre[Index]": {
    "red_x_points": [
      [-0.00924, 0],
      [-0.00221, 2],
      [-0.00339, 2],
      [-0.01055, 0],
      [-0.00349, 0],
      [-0.01205, 0],
      [-0.00048, 1],
      [0.00074, 1],
      [-0.00189, 2],
      [0.00364, 1],
      [-0.00206, 2],
      [-0.00194, 2],
      [-0.00298, 2],
      [1e-5, 1],
      [0.00136, 1],
      [-0.00496, 0],
      [-0.00095, 2],
      [-0.00302, 2],
      [-0.00702, 2],
      [-0.00131, 2],
      [-0.00277, 2],
      [-0.00666, 0],
      [-0.00326, 2]
    ],
    "red_o_points": [],
    "y_categories": ["NPV", "PV", "nan"],
    "blue_o_points": [],
    "blue_x_points": [
      [0.00405, 0],
      [-0.00102, 2],
      [0.00285, 1],
      [0.00994, 1],
      [-5e-5, 2],
      [0.01106, 1],
      [0.0067, 1],
      [0.00116, 0],
      [-0.00133, 2],
      [-0.0007, 2],
      [-0.001, 2],
      [0.01568, 1],
      [-0.00075, 2],
      [0.00273, 1],
      [0.00272, 1],
      [0.00022, 0],
      [-0.00113, 2],
      [0.00485, 1],
      [0.00049, 2],
      [0.01086, 1],
      [0.00715, 1]
    ]
  },
  "QA_yonPreFracture": {
    "red_x_points": [
      [-0.02968, 1],
      [0.00143, 2],
      [0.00539, 0],
      [0.00149, 2],
      [0.00513, 0],
      [0.00552, 0],
      [-0.02775, 1],
      [0.0053, 0],
      [0.00053, 2],
      [-0.03193, 1],
      [-0.03322, 1],
      [-0.02716, 1],
      [0.00199, 2],
      [0.00589, 0],
      [0.00618, 0],
      [0.00494, 0],
      [0.0046, 0],
      [0.00807, 0],
      [-0.03299, 1],
      [0.00554, 0],
      [0.00113, 2],
      [-0.02255, 1],
      [0.0014, 2]
    ],
    "red_o_points": [],
    "y_categories": ["N", "Y", "nan"],
    "blue_o_points": [],
    "blue_x_points": [
      [0.00812, 0],
      [0.00475, 2],
      [0.00666, 0],
      [0.00754, 0],
      [0.00439, 2],
      [0.00791, 0],
      [0.00794, 0],
      [0.00543, 2],
      [0.00372, 2],
      [0.00872, 0],
      [0.00951, 0],
      [0.00973, 0],
      [0.00973, 0],
      [0.00632, 0],
      [0.00566, 0],
      [0.004, 2],
      [0.00998, 0],
      [0.00805, 0],
      [0.00649, 0],
      [0.00275, 2],
      [0.00334, 2]
    ]
  },
  "QS_mulGraftNerve[FI]": {
    "red_x_points": [
      [-0.00053, 1],
      [-0.00075, 0],
      [-6e-5, 0],
      [9e-5, 0],
      [-0.00042, 0],
      [0.00022, 0],
      [-1e-5, 2],
      [-0.00078, 1],
      [0.00035, 2],
      [-0.00036, 0],
      [0.00022, 2],
      [-0.00053, 0],
      [-2e-5, 2],
      [-8e-5, 0],
      [-0.0013, 1],
      [3e-5, 2],
      [-0.0005, 0],
      [-5e-5, 2],
      [-0.00016, 0],
      [-0.00061, 0],
      [-0.00051, 1],
      [9e-5, 0],
      [1e-5, 2]
    ],
    "red_o_points": [],
    "y_categories": ["N", "NOT APPLICABLE", "nan"],
    "blue_o_points": [],
    "blue_x_points": [
      [8e-5, 2],
      [1e-5, 2],
      [0.00013, 0],
      [0.00033, 0],
      [7e-5, 2],
      [0.00057, 0],
      [0.00015, 0],
      [0.0001, 0],
      [0.00063, 2],
      [0.00178, 1],
      [-0.00011, 0],
      [0.00059, 0],
      [0.00028, 2],
      [0.00014, 2],
      [0.00012, 2],
      [3e-5, 2],
      [0.00041, 2],
      [3e-5, 2],
      [6e-5, 1],
      [4e-5, 2],
      [0.00022, 2]
    ]
  },
  "QA_lstPexPalle[Clavicle]": {
    "red_x_points": [
      [-0.00083, 3],
      [-0.00071, 3],
      [-0.00116, 3],
      [0.00557, 2],
      [-0.00095, 3],
      [-0.00088, 3],
      [-0.01515, 0],
      [-0.01419, 0],
      [-0.0009, 3],
      [-0.00146, 3],
      [-0.00145, 3],
      [-0.00069, 3],
      [-0.00076, 3],
      [-0.02348, 0],
      [-0.00095, 3],
      [-0.01227, 0],
      [-0.00586, 1],
      [-0.0011, 3],
      [-0.00197, 3],
      [-0.00095, 3],
      [0.00637, 2],
      [-0.01105, 0],
      [-0.0007, 3]
    ],
    "red_o_points": [],
    "y_categories": ["HYPO", "NAIA", "PT", "nan"],
    "blue_o_points": [],
    "blue_x_points": [
      [-0.00015, 3],
      [-0.00062, 3],
      [0.01175, 2],
      [0.0173, 2],
      [-0.0006, 3],
      [-0.00064, 3],
      [0.01735, 2],
      [0.0135, 2],
      [-0.00063, 3],
      [-0.00056, 3],
      [-0.00074, 3],
      [-0.00047, 3],
      [-0.0005, 3],
      [-0.0091, 0],
      [0.01128, 2],
      [0.00742, 1],
      [-0.00064, 3],
      [0.00982, 2],
      [-0.00044, 3],
      [0.01268, 2],
      [-0.00049, 3]
    ]
  }
}
