{
  "QS_mulNeuromadSite[T2]": {
    "red_x_points": [
      [-0.00797, 2],
      [-0.01888, 0],
      [-0.01829, 0],
      [-0.01821, 0],
      [-0.01814, 0],
      [-0.01781, 0],
      [-0.0187, 0],
      [-0.00564, 2],
      [-0.01877, 0],
      [-0.01878, 0],
      [-0.01857, 0],
      [-0.00805, 2],
      [0.03431, 1],
      [-0.00783, 2],
      [-0.01882, 0],
      [-0.00811, 2],
      [-0.01486, 0],
      [-0.01845, 0],
      [-0.00787, 2],
      [-0.00764, 2],
      [-0.00424, 2],
      [-0.01555, 0],
      [-0.00784, 2],
      [-0.00706, 2],
      [-0.00836, 2],
      [-0.01834, 0],
      [-0.00796, 2],
      [-0.0186, 0],
      [-0.00494, 2],
      [0.03683, 1],
      [-0.01767, 0]
    ],
    "red_o_points": [],
    "y_categories": ["N", "NOT APPLICABLE", "nan"],
    "blue_o_points": [],
    "blue_x_points": [
      [0.10227, 1],
      [-0.00215, 2],
      [0.0375, 1],
      [-0.00597, 0],
      [-0.00262, 2],
      [0.03729, 1],
      [0.03996, 1]
    ]
  },
  "participant_code": {
    "red_x_points": [
      [-0.05916, 1],
      [-0.05772, 2],
      [-0.05893, 3],
      [-0.06033, 4],
      [-0.05921, 5],
      [-0.05935, 6],
      [-0.05967, 7],
      [-0.05888, 8],
      [-0.0593, 9],
      [-0.06019, 10],
      [-0.05902, 11],
      [-0.05837, 12],
      [-0.06033, 14],
      [-0.05897, 16],
      [-0.05869, 17],
      [-0.05781, 19],
      [-0.058, 20],
      [-0.06019, 22],
      [-0.05837, 23],
      [-0.05958, 25],
      [-0.05893, 26],
      [-0.05902, 27],
      [-0.05888, 28],
      [-0.05916, 29],
      [-0.05855, 30],
      [-0.05949, 32],
      [-0.05921, 33],
      [-0.05841, 34],
      [-0.05935, 35],
      [-0.05851, 36],
      [-0.06023, 37]
    ],
    "red_o_points": [],
    "y_categories": [
      "P16554",
      "P18297",
      "P19283",
      "P19287",
      "P23391",
      "P31645",
      "P31691",
      "P34778",
      "P35046",
      "P36328",
      "P43633",
      "P4544",
      "P46417",
      "P48965",
      "P53068",
      "P5497",
      "P59529",
      "P62483",
      "P64658",
      "P65202",
      "P66816",
      "P6751",
      "P7408",
      "P75566",
      "P76226",
      "P79971",
      "P82621",
      "P82990",
      "P84932",
      "P85825",
      "P86989",
      "P8770",
      "P87791",
      "P90550",
      "P93159",
      "P94969",
      "P96710",
      "P9744",
      "nan"
    ],
    "blue_o_points": [],
    "blue_x_points": [
      [0.174, 0],
      [0.17507, 13],
      [0.17047, 15],
      [0.17339, 18],
      [0.17185, 21],
      [0.16848, 24],
      [0.17323, 31]
    ]
  },
  "QA_mulInjOrthesisType[ArmSling]": {
    "red_x_points": [
      [-0.02741, 2],
      [-0.02552, 2],
      [-0.02564, 2],
      [-0.02474, 2],
      [-0.024, 2],
      [-0.02552, 2],
      [-0.02523, 2],
      [-0.02562, 2],
      [-0.0255, 2],
      [-0.02536, 2],
      [-0.02557, 2],
      [-0.02723, 2],
      [0.06798, 1],
      [-0.02581, 2],
      [-0.02465, 2],
      [-0.02602, 2],
      [-0.03025, 0],
      [-0.02475, 2],
      [-0.02639, 2],
      [-0.02609, 2],
      [-0.03066, 0],
      [-0.03002, 3],
      [-0.02479, 2],
      [0.07271, 1],
      [-0.02592, 2],
      [-0.02624, 2],
      [-0.02486, 2],
      [-0.02483, 2],
      [-0.03164, 3],
      [-0.04198, 3],
      [-0.02553, 2]
    ],
    "red_o_points": [],
    "y_categories": ["N", "NOT APPLICABLE", "Y", "nan"],
    "blue_o_points": [],
    "blue_x_points": [
      [-0.01375, 2],
      [0.07478, 1],
      [0.06848, 1],
      [0.07509, 1],
      [0.07501, 1],
      [0.06877, 1],
      [0.06636, 1]
    ]
  },
  "QA_mulInjOrthesisType[ShoulderSupport]": {
    "red_x_points": [
      [-0.03408, 0],
      [-0.03295, 0],
      [-0.0327, 0],
      [-0.03262, 0],
      [-0.03248, 0],
      [-0.03301, 0],
      [-0.03439, 0],
      [-0.04199, 2],
      [-0.03191, 0],
      [-0.03261, 0],
      [-0.03357, 0],
      [-0.03448, 0],
      [0.0962, 1],
      [-0.03437, 0],
      [-0.03265, 0],
      [-0.03379, 0],
      [-0.04089, 2],
      [-0.03216, 0],
      [-0.0341, 0],
      [-0.03287, 0],
      [-0.04164, 2],
      [-0.04143, 3],
      [-0.03406, 0],
      [0.09693, 1],
      [-0.03502, 0],
      [-0.0326, 0],
      [-0.03414, 0],
      [-0.03309, 0],
      [-0.041, 3],
      [-0.05318, 3],
      [-0.03288, 0]
    ],
    "red_o_points": [],
    "y_categories": ["N", "NOT APPLICABLE", "Y", "nan"],
    "blue_o_points": [],
    "blue_x_points": [
      [-0.02074, 0],
      [0.1004, 1],
      [0.08902, 1],
      [0.09865, 1],
      [0.09918, 1],
      [0.08971, 1],
      [0.08978, 1]
    ]
  },
  "QA_mulInjTbpiCause[Motorcycle]": {
    "red_x_points": [
      [0.00865, 0],
      [-0.0042, 1],
      [-0.00398, 1],
      [-0.00424, 1],
      [-0.00419, 1],
      [-0.00402, 1],
      [-0.00423, 1],
      [-0.00367, 1],
      [-0.00439, 1],
      [-0.004, 1],
      [-0.00418, 1],
      [0.00938, 0],
      [-0.055, 1],
      [-0.00408, 1],
      [-0.0042, 1],
      [-0.00424, 1],
      [-0.00373, 1],
      [-0.00442, 1],
      [0.00816, 0],
      [-0.00408, 1],
      [-0.00396, 1],
      [-0.00395, 1],
      [-0.0044, 1],
      [-0.00568, 1],
      [0.00925, 0],
      [-0.00385, 1],
      [-0.00402, 1],
      [-0.00405, 1],
      [-0.00391, 1],
      [-0.05882, 1],
      [-0.00423, 1]
    ],
    "red_o_points": [],
    "y_categories": ["N", "Y", "nan"],
    "blue_o_points": [],
    "blue_x_points": [
      [0.03206, 0],
      [-0.00191, 1],
      [0.02923, 0],
      [-0.00295, 1],
      [-0.00248, 1],
      [0.02885, 0],
      [0.03145, 0]
    ]
  },
  "QA_yonInjBpsurg": {
    "red_x_points": [
      [-0.01815, 1],
      [-0.01385, 1],
      [-0.01357, 1],
      [-0.01318, 1],
      [-0.01279, 1],
      [-0.01395, 1],
      [-0.01344, 1],
      [-0.01166, 1],
      [-0.01325, 1],
      [-0.01277, 1],
      [-0.01304, 1],
      [-0.01784, 1],
      [0.03408, 0],
      [-0.0132, 1],
      [-0.01304, 1],
      [-0.01356, 1],
      [-0.00997, 1],
      [-0.0132, 1],
      [-0.01704, 1],
      [-0.01373, 1],
      [-0.01047, 1],
      [-0.01011, 1],
      [-0.01304, 1],
      [-0.01043, 1],
      [-0.01769, 1],
      [-0.01329, 1],
      [-0.01322, 1],
      [-0.01369, 1],
      [-0.01018, 1],
      [0.03541, 0],
      [-0.01384, 1]
    ],
    "red_o_points": [],
    "y_categories": ["N", "Y", "nan"],
    "blue_o_points": [],
    "blue_x_points": [
      [0.10278, 0],
      [-0.00707, 1],
      [0.04027, 0],
      [-0.00734, 1],
      [-0.00652, 1],
      [0.04109, 0],
      [0.04066, 0]
    ]
  }
}
