{
  "QA_lstPexMuscstrength[ElbowFlex]": {
    "red_x_points": [
      [-0.00395, 1],
      [0.00063, 2],
      [-0.00187, 1],
      [-0.00162, 1],
      [0.00158, 0],
      [-0.00166, 1],
      [-0.00202, 1],
      [-0.00348, 1],
      [-0.00183, 1],
      [-0.00131, 1],
      [-0.00134, 1],
      [-0.00394, 1],
      [0.00061, 2],
      [0.00317, 2],
      [0.00012, 2],
      [-0.0036, 1],
      [0.0004, 2],
      [0.00144, 0],
      [-0.00344, 1],
      [-0.00353, 1],
      [-0.0037, 1],
      [-0.00155, 1],
      [0.0026, 2],
      [4e-5, 0],
      [-0.00344, 1],
      [-0.00165, 1],
      [-0.00416, 1],
      [-0.00145, 1],
      [-0.00371, 1],
      [0.00065, 2],
      [-0.00174, 1]
    ],
    "red_o_points": [],
    "y_categories": ["GREATER THAN OR EQUALS TO 3", "LESS THAN 3", "nan"],
    "blue_o_points": [],
    "blue_x_points": [
      [0.00045, 2],
      [0.0066, 2],
      [0.00428, 0],
      [0.00029, 1],
      [0.00568, 2],
      [0.00448, 0],
      [0.00459, 0]
    ]
  },
  "QS_mulGraftRoot[C6]": {
    "red_x_points": [
      [0.0, 2],
      [-5e-5, 0],
      [-0.00013, 0],
      [-5e-5, 0],
      [-5e-5, 0],
      [0.0, 2],
      [-0.00013, 0],
      [-5e-5, 0],
      [-5e-5, 0],
      [9e-5, 1],
      [-5e-5, 0],
      [0.0, 2],
      [-5e-5, 0],
      [-5e-5, 0],
      [-8e-5, 2],
      [0.0, 2],
      [-8e-5, 2],
      [0.0, 2],
      [0.0, 2],
      [-5e-5, 0],
      [0.0, 2],
      [9e-5, 1],
      [-5e-5, 0]
    ],
    "red_o_points": [],
    "y_categories": ["N", "NOT APPLICABLE", "nan"],
    "blue_o_points": [],
    "blue_x_points": [
      [9e-5, 1],
      [0.0, 2],
      [0.0002, 1],
      [0.0, 2],
      [0.0002, 1],
      [0.0002, 1]
    ]
  },
  "QS_mulNeuromadSite[T1]": {
    "red_x_points": [
      [-0.00131, 2],
      [-0.00399, 0],
      [-0.00364, 0],
      [-0.00354, 0],
      [-0.00376, 0],
      [-0.00392, 0],
      [-0.00346, 0],
      [-0.00143, 2],
      [-0.00306, 0],
      [-0.00316, 0],
      [-0.00388, 0],
      [-0.00161, 2],
      [0.00664, 1],
      [-0.00115, 2],
      [-0.0036, 0],
      [-0.00148, 2],
      [-0.00361, 0],
      [-0.00382, 0],
      [-0.00127, 2],
      [-0.00108, 2],
      [-0.00092, 2],
      [-0.00297, 0],
      [-0.0012, 2],
      [-0.00158, 2],
      [-0.0012, 2],
      [-0.00336, 0],
      [-0.00118, 2],
      [-0.00372, 0],
      [-0.0009, 2],
      [0.00674, 1],
      [-0.0034, 0]
    ],
    "red_o_points": [],
    "y_categories": ["N", "NOT APPLICABLE", "nan"],
    "blue_o_points": [],
    "blue_x_points": [
      [0.01294, 1],
      [-6e-5, 2],
      [0.00796, 1],
      [-0.00032, 0],
      [0.00029, 2],
      [0.00728, 1],
      [0.00993, 1]
    ]
  },
  "QS_mulBpsurgeryType[Transf]": {
    "red_x_points": [
      [-0.00031, 3],
      [-0.00035, 2],
      [-0.00094, 0],
      [-0.00027, 2],
      [-0.00045, 2],
      [-0.00029, 2],
      [-0.00033, 2],
      [-0.00027, 3],
      [-0.00031, 2],
      [-0.00027, 2],
      [-0.00038, 2],
      [-0.00021, 3],
      [0.0013, 1],
      [-0.0002, 3],
      [-0.00031, 2],
      [-0.00028, 3],
      [-0.00043, 2],
      [-0.00023, 2],
      [-0.00025, 3],
      [-0.00031, 3],
      [-0.0002, 3],
      [-0.00037, 2],
      [-0.00025, 3],
      [-0.00031, 3],
      [-0.00023, 3],
      [-0.00023, 2],
      [-0.00026, 3],
      [-0.00032, 2],
      [-0.00029, 3],
      [0.00128, 1],
      [-0.00039, 2]
    ],
    "red_o_points": [],
    "y_categories": ["N", "NOT APPLICABLE", "Y", "nan"],
    "blue_o_points": [],
    "blue_x_points": [
      [0.00132, 1],
      [-0.00019, 3],
      [0.00101, 1],
      [-0.00037, 2],
      [-0.00013, 3],
      [0.00119, 1],
      [0.00094, 1]
    ]
  },
  "QS_mulTransfSite[MPAx]": {
    "red_x_points": [
      [-2e-5, 2],
      [-2e-5, 0],
      [-2e-5, 0],
      [-2e-5, 0],
      [-2e-5, 0],
      [-2e-5, 0],
      [-2e-5, 0],
      [-2e-5, 0],
      [-2e-5, 2],
      [-2e-5, 2],
      [-2e-5, 0],
      [-2e-5, 0],
      [-2e-5, 2],
      [-2e-5, 2],
      [-2e-5, 0],
      [-2e-5, 2],
      [-2e-5, 0],
      [-2e-5, 0]
    ],
    "red_o_points": [],
    "y_categories": ["N", "NOT APPLICABLE", "nan"],
    "blue_o_points": [],
    "blue_x_points": [[0.00018, 1]]
  },
  "QS_mulNeuromadSite[T2]": {
    "red_x_points": [
      [-0.00134, 2],
      [-0.00568, 0],
      [-0.00568, 0],
      [-0.00533, 0],
      [-0.00575, 0],
      [-0.00507, 0],
      [-0.00524, 0],
      [-0.00155, 2],
      [-0.00519, 0],
      [-0.00552, 0],
      [-0.00521, 0],
      [-0.0019, 2],
      [0.00923, 1],
      [-0.00125, 2],
      [-0.00551, 0],
      [-0.00197, 2],
      [-0.00556, 0],
      [-0.00595, 0],
      [-0.0019, 2],
      [-0.00149, 2],
      [-0.00173, 2],
      [-0.00531, 0],
      [-0.00143, 2],
      [-0.00171, 2],
      [-0.00218, 2],
      [-0.00523, 0],
      [-0.00135, 2],
      [-0.00538, 0],
      [-0.00133, 2],
      [0.01096, 1],
      [-0.00514, 0]
    ],
    "red_o_points": [],
    "y_categories": ["N", "NOT APPLICABLE", "nan"],
    "blue_o_points": [],
    "blue_x_points": [
      [0.0167, 1],
      [-0.00011, 2],
      [0.01291, 1],
      [-0.00034, 0],
      [-0.00028, 2],
      [0.01133, 1],
      [0.01435, 1]
    ]
  },
  "QA_mulInjOrthesisType[ShoulderSupport]": {
    "red_x_points": [
      [-0.0101, 0],
      [-0.00978, 0],
      [-0.0095, 0],
      [-0.00973, 0],
      [-0.00965, 0],
      [-0.00953, 0],
      [-0.00985, 0],
      [-0.01165, 2],
      [-0.0097, 0],
      [-0.00923, 0],
      [-0.00973, 0],
      [-0.01022, 0],
      [0.02469, 1],
      [-0.01085, 0],
      [-0.00986, 0],
      [-0.01082, 0],
      [-0.01145, 2],
      [-0.00918, 0],
      [-0.00984, 0],
      [-0.01028, 0],
      [-0.01269, 2],
      [-0.01139, 3],
      [-0.01028, 0],
      [0.028, 1],
      [-0.01048, 0],
      [-0.00994, 0],
      [-0.00971, 0],
      [-0.00888, 0],
      [-0.01178, 3],
      [-0.01515, 3],
      [-0.00932, 0]
    ],
    "red_o_points": [],
    "y_categories": ["N", "NOT APPLICABLE", "Y", "nan"],
    "blue_o_points": [],
    "blue_x_points": [
      [-0.00481, 0],
      [0.03187, 1],
      [0.02466, 1],
      [0.03032, 1],
      [0.02819, 1],
      [0.02557, 1],
      [0.02418, 1]
    ]
  },
  "QS_mulGraftRoot[T1]": {
    "red_x_points": [
      [-1e-5, 2],
      [-3e-5, 0],
      [-3e-5, 0],
      [-3e-5, 0],
      [-3e-5, 0],
      [-3e-5, 0],
      [-1e-5, 2],
      [-3e-5, 0],
      [-3e-5, 0],
      [-3e-5, 0],
      [-1e-5, 2],
      [9e-5, 1],
      [-1e-5, 2],
      [-3e-5, 0],
      [-1e-5, 2],
      [-3e-5, 0],
      [-1e-5, 2],
      [-1e-5, 2],
      [-1e-5, 2],
      [-3e-5, 0],
      [-1e-5, 2],
      [-1e-5, 2],
      [9e-5, 1]
    ],
    "red_o_points": [],
    "y_categories": ["N", "NOT APPLICABLE", "nan"],
    "blue_o_points": [],
    "blue_x_points": [[9e-5, 1], [9e-5, 1], [-3e-5, 0], [-1e-5, 2], [9e-5, 1]]
  },
  "QS_mulGraftNerve[IS]": {
    "red_x_points": [
      [-0.00015, 2],
      [-0.00054, 0],
      [-0.00063, 0],
      [-0.00044, 0],
      [-0.00041, 0],
      [-0.00056, 0],
      [-0.00042, 0],
      [-0.00013, 2],
      [-0.00039, 0],
      [-0.00047, 0],
      [-0.00052, 0],
      [-0.0003, 2],
      [0.00077, 1],
      [-8e-5, 2],
      [-0.00051, 0],
      [-0.00026, 2],
      [-0.0006, 0],
      [-0.00048, 0],
      [-0.00016, 2],
      [-0.00011, 2],
      [-0.00021, 2],
      [-0.00035, 0],
      [-0.00011, 2],
      [-8e-5, 2],
      [-0.00011, 2],
      [-0.00056, 0],
      [-0.00013, 2],
      [-0.00039, 0],
      [-4e-5, 2],
      [0.00071, 1],
      [-0.00049, 0]
    ],
    "red_o_points": [],
    "y_categories": ["N", "NOT APPLICABLE", "nan"],
    "blue_o_points": [],
    "blue_x_points": [
      [0.00142, 1],
      [-4e-5, 2],
      [0.00101, 1],
      [8e-5, 0],
      [0.00017, 2],
      [0.00091, 1],
      [0.00123, 1]
    ]
  },
  "QS_mulGraftTrunk[MiddleTrunk]": {
    "red_x_points": [
      [-3e-5, 2],
      [-0.0001, 0],
      [-0.00011, 0],
      [-0.00015, 0],
      [-0.00011, 0],
      [-0.0001, 0],
      [-0.0001, 0],
      [-1e-5, 2],
      [-7e-5, 0],
      [-0.00011, 0],
      [-0.00015, 0],
      [-3e-5, 2],
      [7e-5, 1],
      [-7e-5, 2],
      [-0.00011, 0],
      [-8e-5, 2],
      [-0.00012, 0],
      [-0.00016, 0],
      [-8e-5, 2],
      [-9e-5, 2],
      [-6e-5, 2],
      [-3e-5, 0],
      [-6e-5, 2],
      [-6e-5, 2],
      [-8e-5, 2],
      [-0.00012, 0],
      [-8e-5, 2],
      [-0.00016, 0],
      [-6e-5, 2],
      [0.0002, 1],
      [-7e-5, 0]
    ],
    "red_o_points": [],
    "y_categories": ["N", "NOT APPLICABLE", "nan"],
    "blue_o_points": [],
    "blue_x_points": [
      [0.00087, 1],
      [1e-5, 2],
      [0.00013, 1],
      [7e-5, 0],
      [2e-5, 2],
      [0.00017, 1],
      [0.0003, 1]
    ]
  },
  "QS_mulLysisTrunk[Upper]": {
    "red_x_points": [
      [-0.00179, 3],
      [-0.00298, 0],
      [-0.00298, 0],
      [-0.00285, 0],
      [-0.00317, 0],
      [-0.00545, 2],
      [-0.00288, 0],
      [-0.00183, 3],
      [-0.00296, 0],
      [-0.00313, 0],
      [-0.00304, 0],
      [-0.00198, 3],
      [0.00803, 1],
      [-0.00177, 3],
      [-0.00324, 0],
      [-0.00187, 3],
      [-0.00512, 2],
      [-0.00301, 0],
      [-0.00191, 3],
      [-0.00163, 3],
      [-0.00188, 3],
      [-0.00256, 0],
      [-0.00152, 3],
      [-0.00233, 3],
      [-0.00215, 3],
      [-0.00281, 0],
      [-0.00181, 3],
      [-0.00281, 0],
      [-0.0016, 3],
      [0.00876, 1],
      [-0.00473, 2]
    ],
    "red_o_points": [],
    "y_categories": ["N", "NOT APPLICABLE", "Y", "nan"],
    "blue_o_points": [],
    "blue_x_points": [
      [0.01251, 1],
      [-0.00067, 3],
      [0.00917, 1],
      [-0.00125, 0],
      [-9e-5, 3],
      [0.00983, 1],
      [0.00988, 1]
    ]
  },
  "QS_mulGraftNerve[Ac]": {
    "red_x_points": [
      [-0.00053, 2],
      [-0.00128, 0],
      [-0.00144, 0],
      [-0.0011, 0],
      [-0.00144, 0],
      [-0.00123, 0],
      [-0.00139, 0],
      [-0.00029, 2],
      [-0.0016, 0],
      [-0.00129, 0],
      [-0.00134, 0],
      [-0.00066, 2],
      [0.00269, 1],
      [-0.00055, 2],
      [-0.00109, 0],
      [-0.00074, 2],
      [-0.00143, 0],
      [-0.0013, 0],
      [-0.00058, 2],
      [-0.00036, 2],
      [-0.00043, 2],
      [-0.0013, 0],
      [-0.0006, 2],
      [-0.00042, 2],
      [-0.00055, 2],
      [-0.00126, 0],
      [-0.00045, 2],
      [-0.00158, 0],
      [-0.00046, 2],
      [0.00233, 1],
      [-0.0013, 0]
    ],
    "red_o_points": [],
    "y_categories": ["N", "NOT APPLICABLE", "nan"],
    "blue_o_points": [],
    "blue_x_points": [
      [0.0043, 1],
      [-0.00013, 2],
      [0.0035, 1],
      [-0.0002, 0],
      [0.00016, 2],
      [0.00312, 1],
      [0.00361, 1]
    ]
  },
  "QS_mulGraftNerve[Me]": {
    "red_x_points": [
      [-0.00026, 2],
      [-0.00072, 0],
      [-0.00074, 0],
      [-0.00081, 0],
      [-0.0008, 0],
      [-0.00067, 0],
      [-0.00076, 0],
      [-0.00025, 2],
      [-0.00077, 0],
      [-0.00078, 0],
      [-0.00056, 0],
      [-0.00041, 2],
      [0.00123, 1],
      [-0.00024, 2],
      [-0.00072, 0],
      [-0.00034, 2],
      [-0.00053, 0],
      [-0.00076, 0],
      [-0.00031, 2],
      [-0.00027, 2],
      [-0.00028, 2],
      [-0.00069, 0],
      [-0.00034, 2],
      [-0.00021, 2],
      [-0.0003, 2],
      [-0.00077, 0],
      [-0.00021, 2],
      [-0.0007, 0],
      [-0.00024, 2],
      [0.00139, 1],
      [-0.00079, 0]
    ],
    "red_o_points": [],
    "y_categories": ["N", "NOT APPLICABLE", "nan"],
    "blue_o_points": [],
    "blue_x_points": [
      [0.00333, 1],
      [-9e-5, 2],
      [0.00203, 1],
      [-0.00016, 0],
      [-0.0001, 2],
      [0.00174, 1],
      [0.00209, 1]
    ]
  },
  "QA_lstPexMuscstrength[FingersAbdu]": {
    "red_x_points": [
      [0.00011, 2],
      [5e-5, 2],
      [-9e-5, 1],
      [-0.00022, 1],
      [-6e-5, 0],
      [-3e-5, 0],
      [-0.0002, 1],
      [-2e-5, 0],
      [-5e-5, 0],
      [0.0001, 2],
      [-0.00023, 1],
      [3e-5, 0],
      [7e-5, 2],
      [1e-5, 2],
      [0.0001, 2],
      [-2e-5, 0],
      [3e-5, 2],
      [2e-5, 0],
      [3e-5, 0],
      [-0.00014, 1],
      [-0.0, 0],
      [-0.00017, 1],
      [2e-5, 2],
      [6e-5, 2],
      [3e-5, 2],
      [-0.00026, 1],
      [3e-5, 2],
      [-5e-5, 1],
      [3e-5, 2],
      [9e-5, 2],
      [-4e-5, 1]
    ],
    "red_o_points": [],
    "y_categories": ["GREATER THAN OR EQUALS TO 3", "LESS THAN 3", "nan"],
    "blue_o_points": [],
    "blue_x_points": [
      [4e-5, 2],
      [6e-5, 2],
      [2e-5, 0],
      [0.00026, 2],
      [1e-5, 2],
      [1e-5, 0]
    ]
  },
  "QS_mulNeuromadSite[C8]": {
    "red_x_points": [
      [-0.00122, 2],
      [-0.0036, 0],
      [-0.00401, 0],
      [-0.00339, 0],
      [-0.0042, 0],
      [-0.00373, 0],
      [-0.00404, 0],
      [-0.00118, 2],
      [-0.00354, 0],
      [-0.00395, 0],
      [-0.00324, 0],
      [-0.00144, 2],
      [0.00538, 1],
      [-0.00099, 2],
      [-0.00418, 0],
      [-0.00116, 2],
      [-0.0036, 0],
      [-0.00464, 0],
      [-0.00135, 2],
      [-0.0011, 2],
      [-0.00101, 2],
      [-0.00317, 0],
      [-0.00107, 2],
      [-0.00115, 2],
      [-0.00131, 2],
      [-0.00344, 0],
      [-0.00118, 2],
      [-0.00368, 0],
      [-0.00097, 2],
      [0.00761, 1],
      [-0.00353, 0]
    ],
    "red_o_points": [],
    "y_categories": ["N", "NOT APPLICABLE", "nan"],
    "blue_o_points": [],
    "blue_x_points": [
      [0.01281, 1],
      [-3e-5, 2],
      [0.00916, 1],
      [-0.00014, 0],
      [-5e-5, 2],
      [0.00828, 1],
      [0.01047, 1]
    ]
  },
  "QS_mulGraftNerve[Ph]": {
    "red_x_points": [
      [5e-5, 2],
      [-0.00101, 0],
      [-0.0012, 0],
      [-0.00122, 0],
      [-0.00127, 0],
      [-0.00087, 0],
      [-0.00109, 0],
      [-0.00019, 2],
      [-0.00107, 0],
      [-0.00103, 0],
      [-0.00104, 0],
      [-9e-5, 2],
      [0.00134, 1],
      [-0.0, 2],
      [-0.00129, 0],
      [-0.00014, 2],
      [-0.00093, 0],
      [-0.00097, 0],
      [-0.0001, 2],
      [-0.00011, 2],
      [-0.00012, 2],
      [-0.00104, 0],
      [-1e-5, 2],
      [-3e-5, 2],
      [-0.00026, 2],
      [-0.00099, 0],
      [-5e-5, 2],
      [-0.00101, 0],
      [-7e-5, 2],
      [0.00131, 1],
      [-0.00104, 0]
    ],
    "red_o_points": [],
    "y_categories": ["N", "NOT APPLICABLE", "nan"],
    "blue_o_points": [],
    "blue_x_points": [
      [0.00346, 1],
      [0.00022, 2],
      [0.0027, 1],
      [-0.00013, 0],
      [0.00025, 2],
      [0.00187, 1],
      [0.0018, 1]
    ]
  },
  "QS_mulTransfSite[AcSsPA]": {
    "red_x_points": [
      [-0.00065, 3],
      [-0.00109, 0],
      [-0.0014, 0],
      [-0.00137, 0],
      [-0.00143, 0],
      [-0.00122, 0],
      [-0.00123, 0],
      [-0.00065, 3],
      [-0.00139, 0],
      [-0.00126, 0],
      [-0.0012, 0],
      [-0.00092, 3],
      [0.00305, 1],
      [-0.00064, 3],
      [-0.00131, 0],
      [-0.00081, 3],
      [-0.00284, 2],
      [-0.00119, 0],
      [-0.0008, 3],
      [-0.00063, 3],
      [-0.00076, 3],
      [-0.00128, 0],
      [-0.00078, 3],
      [-0.00061, 3],
      [-0.00069, 3],
      [-0.00098, 0],
      [-0.00066, 3],
      [-0.00117, 0],
      [-0.00062, 3],
      [0.00284, 1],
      [-0.00088, 0]
    ],
    "red_o_points": [],
    "y_categories": ["N", "NOT APPLICABLE", "Y", "nan"],
    "blue_o_points": [],
    "blue_x_points": [
      [0.00419, 1],
      [-0.00014, 3],
      [0.00345, 1],
      [-0.00066, 0],
      [-2e-5, 3],
      [0.00418, 1],
      [0.00398, 1]
    ]
  },
  "QA_lstPexPalle[Elbow]": {
    "red_x_points": [
      [0.00012, 4],
      [3e-5, 4],
      [3e-5, 4],
      [4e-5, 4],
      [-0.00036, 3],
      [-0.00023, 3],
      [2e-5, 4],
      [4e-5, 4],
      [3e-5, 4],
      [0.00027, 1],
      [-0.00019, 3],
      [0.00012, 1],
      [0.00076, 4],
      [4e-5, 4],
      [3e-5, 4],
      [3e-5, 4],
      [3e-5, 4],
      [3e-5, 1],
      [-0.00029, 3],
      [-0.00029, 0],
      [-0.00023, 3],
      [-0.00023, 2],
      [3e-5, 4],
      [-0.00239, 3],
      [3e-5, 4],
      [1e-5, 4],
      [-0.00031, 3],
      [3e-5, 4],
      [4e-5, 4],
      [-0.01305, 3],
      [-0.00019, 0]
    ],
    "red_o_points": [],
    "y_categories": ["ABS", "HYPO", "NAIA", "PT", "nan"],
    "blue_o_points": [],
    "blue_x_points": [
      [0.0011, 4],
      [0.00029, 4],
      [0.00618, 1],
      [0.00029, 4],
      [0.00028, 4],
      [0.00112, 4],
      [0.0011, 4]
    ]
  },
  "QS_mulGraftRoot[C5]": {
    "red_x_points": [
      [-0.0, 2],
      [-3e-5, 0],
      [-3e-5, 0],
      [-3e-5, 0],
      [-0.0, 2],
      [-3e-5, 0],
      [-3e-5, 0],
      [-0.0, 2],
      [-2e-5, 1],
      [1e-5, 2],
      [-0.0, 0],
      [1e-5, 2],
      [3e-5, 0],
      [-3e-5, 0],
      [-0.0, 2],
      [-0.0, 2],
      [-3e-5, 0],
      [1e-5, 2],
      [-0.0, 2],
      [-0.0, 2],
      [-3e-5, 0],
      [-0.0, 2],
      [-3e-5, 0],
      [-0.0, 2],
      [-2e-5, 1],
      [-3e-5, 0]
    ],
    "red_o_points": [],
    "y_categories": ["N", "NOT APPLICABLE", "nan"],
    "blue_o_points": [],
    "blue_x_points": [[7e-5, 1], [1e-5, 2], [-0.0, 0], [1e-5, 2], [7e-5, 1]]
  },
  "QA_lstPexMuscstrength[ScapulaAbducSuprot]": {
    "red_x_points": [
      [-0.00068, 0],
      [0.00012, 2],
      [-0.00018, 1],
      [-0.00034, 1],
      [-4e-5, 0],
      [-9e-5, 1],
      [-0.00039, 1],
      [-0.00071, 1],
      [-0.00018, 0],
      [-9e-5, 0],
      [-0.00035, 1],
      [-0.00065, 1],
      [0.0002, 2],
      [0.00045, 2],
      [0.00017, 2],
      [0.00043, 2],
      [0.00011, 2],
      [-0.00017, 0],
      [-0.00054, 0],
      [-0.00052, 1],
      [-0.00068, 0],
      [-0.00022, 1],
      [0.00054, 2],
      [-0.00066, 0],
      [0.00039, 2],
      [-0.00038, 1],
      [-0.00091, 1],
      [-7e-5, 0],
      [0.00029, 2],
      [0.00018, 2],
      [-0.00015, 1]
    ],
    "red_o_points": [],
    "y_categories": ["GREATER THAN OR EQUALS TO 3", "LESS THAN 3", "nan"],
    "blue_o_points": [],
    "blue_x_points": [
      [8e-5, 2],
      [0.001, 2],
      [3e-5, 0],
      [0.00062, 2],
      [0.00059, 2],
      [5e-5, 0],
      [3e-5, 2]
    ]
  },
  "participant_code": {
    "red_x_points": [
      [-0.01404, 1],
      [-0.01353, 2],
      [-0.01302, 3],
      [-0.01367, 4],
      [-0.01367, 5],
      [-0.01446, 6],
      [-0.01325, 7],
      [-0.0132, 8],
      [-0.01386, 9],
      [-0.01362, 10],
      [-0.01302, 11],
      [-0.01353, 12],
      [-0.01376, 14],
      [-0.01409, 16],
      [-0.01306, 17],
      [-0.01362, 19],
      [-0.014, 20],
      [-0.01316, 22],
      [-0.01367, 23],
      [-0.01344, 25],
      [-0.01325, 26],
      [-0.01376, 27],
      [-0.01404, 28],
      [-0.01372, 29],
      [-0.01404, 30],
      [-0.0133, 32],
      [-0.01367, 33],
      [-0.01395, 34],
      [-0.01432, 35],
      [-0.01376, 36],
      [-0.0133, 37]
    ],
    "red_o_points": [],
    "y_categories": [
      "P16554",
      "P18297",
      "P19283",
      "P19287",
      "P23391",
      "P31645",
      "P31691",
      "P34778",
      "P35046",
      "P36328",
      "P43633",
      "P4544",
      "P46417",
      "P48965",
      "P53068",
      "P5497",
      "P59529",
      "P62483",
      "P64658",
      "P65202",
      "P66816",
      "P6751",
      "P7408",
      "P75566",
      "P76226",
      "P79971",
      "P82621",
      "P82990",
      "P84932",
      "P85825",
      "P86989",
      "P8770",
      "P87791",
      "P90550",
      "P93159",
      "P94969",
      "P96710",
      "P9744",
      "nan"
    ],
    "blue_o_points": [],
    "blue_x_points": [
      [0.03955, 0],
      [0.04078, 13],
      [0.03817, 15],
      [0.04032, 18],
      [0.04231, 21],
      [0.03771, 24],
      [0.04323, 31]
    ]
  },
  "QA_lstPexTouch[T1]": {
    "red_x_points": [
      [-0.00165, 1],
      [-0.00015, 2],
      [0.00036, 1],
      [-0.00025, 2],
      [-0.00184, 0],
      [0.00065, 1],
      [0.00068, 1],
      [-0.00179, 1],
      [-0.00185, 0],
      [-0.00115, 0],
      [-0.00171, 0],
      [-0.00282, 0],
      [-0.00865, 2],
      [0.00283, 2],
      [-0.00039, 2],
      [-0.00101, 1],
      [-4e-5, 2],
      [0.00075, 1],
      [-0.00221, 0],
      [-0.00177, 1],
      [-0.0025, 0],
      [-0.00028, 2],
      [0.00307, 2],
      [-0.00151, 1],
      [-0.00295, 0],
      [0.00075, 1],
      [-0.00315, 0],
      [-0.00042, 2],
      [-0.00309, 0],
      [0.00078, 1],
      [0.00024, 1]
    ],
    "red_o_points": [],
    "y_categories": ["NORM", "NPV", "nan"],
    "blue_o_points": [],
    "blue_x_points": [
      [0.00087, 1],
      [0.00446, 2],
      [0.00078, 1],
      [0.00246, 1],
      [0.00455, 2],
      [0.00095, 1],
      [0.00426, 0]
    ]
  },
  "QA_mulInjOrthesisType[ArmSling]": {
    "red_x_points": [
      [-0.00984, 2],
      [-0.00935, 2],
      [-0.0091, 2],
      [-0.00914, 2],
      [-0.00857, 2],
      [-0.00919, 2],
      [-0.00949, 2],
      [-0.00961, 2],
      [-0.00856, 2],
      [-0.00924, 2],
      [-0.0086, 2],
      [-0.00942, 2],
      [0.02487, 1],
      [-0.00943, 2],
      [-0.00882, 2],
      [-0.00995, 2],
      [-0.01035, 0],
      [-0.00926, 2],
      [-0.0095, 2],
      [-0.0092, 2],
      [-0.01112, 0],
      [-0.01011, 3],
      [-0.00952, 2],
      [0.02621, 1],
      [-0.00963, 2],
      [-0.00902, 2],
      [-0.00965, 2],
      [-0.00957, 2],
      [-0.01122, 3],
      [-0.01495, 3],
      [-0.00898, 2]
    ],
    "red_o_points": [],
    "y_categories": ["N", "NOT APPLICABLE", "Y", "nan"],
    "blue_o_points": [],
    "blue_x_points": [
      [-0.0044, 2],
      [0.02756, 1],
      [0.02303, 1],
      [0.02855, 1],
      [0.02828, 1],
      [0.02406, 1],
      [0.02304, 1]
    ]
  },
  "QS_mulGraftNerve[Ul]": {
    "red_x_points": [
      [-0.00019, 2],
      [-0.00051, 0],
      [-0.00035, 0],
      [-0.00057, 0],
      [-0.00071, 0],
      [-0.00056, 0],
      [-0.00055, 0],
      [-0.00024, 2],
      [-0.0006, 0],
      [-0.0005, 0],
      [-0.00047, 0],
      [-0.00026, 2],
      [0.00118, 1],
      [-0.00017, 2],
      [-0.00071, 0],
      [-0.0001, 2],
      [-0.00047, 0],
      [-0.00056, 0],
      [-0.00017, 2],
      [-0.00015, 2],
      [-0.00021, 2],
      [-0.00059, 0],
      [-0.00023, 2],
      [-0.00012, 2],
      [-0.0002, 2],
      [-0.00056, 0],
      [-0.00018, 2],
      [-0.00069, 0],
      [-0.00018, 2],
      [0.00114, 1],
      [-0.00069, 0]
    ],
    "red_o_points": [],
    "y_categories": ["N", "NOT APPLICABLE", "nan"],
    "blue_o_points": [],
    "blue_x_points": [
      [0.00171, 1],
      [-1e-5, 2],
      [0.00123, 1],
      [-1e-5, 0],
      [-3e-5, 2],
      [0.00122, 1],
      [0.00166, 1]
    ]
  },
  "QA_lstPexPain[C6]": {
    "red_x_points": [
      [-0.00023, 1],
      [-6e-5, 2],
      [-8e-5, 2],
      [-6e-5, 2],
      [-0.00102, 0],
      [0.0001, 1],
      [0.00015, 1],
      [-0.00074, 0],
      [0.00031, 1],
      [0.00016, 1],
      [0.00015, 1],
      [-0.00033, 1],
      [-0.0008, 2],
      [0.00027, 2],
      [-0.0001, 2],
      [9e-5, 2],
      [-7e-5, 2],
      [0.00014, 1],
      [-0.00081, 0],
      [-0.00042, 1],
      [-0.00028, 1],
      [-0.0001, 2],
      [0.00011, 2],
      [-0.00599, 0],
      [0.00024, 2],
      [-0.00016, 2],
      [-0.0003, 1],
      [-0.00027, 2],
      [-0.00043, 1],
      [9e-5, 1],
      [6e-5, 1]
    ],
    "red_o_points": [],
    "y_categories": ["NORM", "NPV", "nan"],
    "blue_o_points": [],
    "blue_x_points": [
      [0.00013, 1],
      [0.00034, 2],
      [0.00087, 1],
      [0.00179, 1],
      [0.00046, 2],
      [0.00116, 1],
      [0.0012, 1]
    ]
  },
  "QA_yonInjUnconscio": {
    "red_x_points": [
      [-0.00233, 1],
      [-0.00297, 1],
      [-0.00144, 2],
      [-0.00172, 2],
      [0.00547, 0],
      [-0.00332, 1],
      [-0.0018, 2],
      [-0.00368, 2],
      [-0.0019, 2],
      [-0.0013, 2],
      [-0.00322, 1],
      [-0.00326, 1],
      [-0.01756, 1],
      [-0.00481, 2],
      [-0.00154, 2],
      [-0.00431, 2],
      [-0.00269, 1],
      [0.00679, 0],
      [-0.002, 1],
      [-0.00253, 1],
      [-0.00212, 1],
      [-0.00323, 1],
      [-0.00402, 2],
      [-0.00511, 1],
      [-0.00387, 2],
      [-0.00312, 1],
      [0.00569, 0],
      [-0.00246, 1],
      [-0.00471, 2],
      [-0.00031, 2],
      [-0.00272, 1]
    ],
    "red_o_points": [],
    "y_categories": ["N", "Y", "nan"],
    "blue_o_points": [],
    "blue_x_points": [
      [0.00084, 2],
      [-0.00037, 1],
      [0.01067, 0],
      [0.01376, 0],
      [0.01931, 0],
      [0.00165, 2],
      [0.00155, 2]
    ]
  },
  "QA_lstPexMuscstrength[ShoulderAbduc]": {
    "red_x_points": [
      [-0.00572, 1],
      [-0.00553, 1],
      [-0.0053, 1],
      [-0.00558, 1],
      [-0.00587, 1],
      [-0.00549, 1],
      [-0.00482, 1],
      [-0.00555, 1],
      [-0.0055, 1],
      [-0.00546, 1],
      [-0.00617, 1],
      [-0.00477, 1],
      [0.00393, 2],
      [0.00465, 2],
      [0.00465, 2],
      [0.00452, 2],
      [0.00466, 2],
      [-0.00558, 1],
      [-0.00541, 1],
      [-0.00544, 1],
      [-0.00523, 1],
      [-0.00525, 1],
      [0.00466, 2],
      [-0.00684, 1],
      [-0.00528, 1],
      [-0.00537, 1],
      [-0.00578, 1],
      [-0.00457, 1],
      [-0.00536, 1],
      [0.00349, 2],
      [-0.00513, 1]
    ],
    "red_o_points": [],
    "y_categories": ["GREATER THAN OR EQUALS TO 3", "LESS THAN 3", "nan"],
    "blue_o_points": [],
    "blue_x_points": [
      [0.00376, 2],
      [0.00503, 2],
      [0.02075, 0],
      [0.00578, 2],
      [0.00516, 2],
      [0.02321, 0],
      [-0.00123, 1]
    ]
  },
  "QS_mulGraftNerve[MCA]": {
    "red_x_points": [
      [-0.00011, 2],
      [-0.00023, 0],
      [-0.00023, 0],
      [-0.00021, 0],
      [-0.00029, 0],
      [-0.00021, 0],
      [-0.00027, 0],
      [-0.00011, 2],
      [-0.00014, 0],
      [-0.00021, 0],
      [-0.00022, 0],
      [-0.00013, 2],
      [0.00055, 1],
      [-4e-5, 2],
      [-0.00031, 0],
      [-9e-5, 2],
      [-0.00018, 0],
      [-0.00011, 0],
      [-9e-5, 2],
      [-0.00011, 2],
      [-9e-5, 2],
      [-0.00023, 0],
      [-0.00012, 2],
      [-0.00012, 2],
      [-0.00012, 2],
      [-0.00022, 0],
      [-0.00011, 2],
      [-0.0002, 0],
      [-0.00013, 2],
      [0.00059, 1],
      [-0.00024, 0]
    ],
    "red_o_points": [],
    "y_categories": ["N", "NOT APPLICABLE", "nan"],
    "blue_o_points": [],
    "blue_x_points": [
      [0.00086, 1],
      [-3e-5, 2],
      [0.00061, 1],
      [-0.00011, 0],
      [-8e-5, 2],
      [0.00075, 1],
      [0.00065, 1]
    ]
  },
  "QA_lstPexInspectio[SurgicalScar]": {
    "red_x_points": [
      [0.00168, 1],
      [0.00086, 1],
      [6e-5, 0],
      [0.0008, 1],
      [-0.0031, 2],
      [0.00011, 0],
      [0.00079, 1],
      [0.00165, 1],
      [0.00068, 1],
      [-0.002, 2],
      [0.00103, 1],
      [-0.00233, 0],
      [-0.00156, 1],
      [-0.00442, 2],
      [0.00117, 1],
      [0.00183, 1],
      [-0.00064, 0],
      [-0.00341, 2],
      [-0.00423, 2],
      [-0.00403, 2],
      [0.00155, 1],
      [0.00099, 1],
      [-0.00491, 2],
      [-0.00914, 2],
      [0.00182, 1],
      [0.00079, 1],
      [-0.00432, 2],
      [-0.00222, 2],
      [0.0017, 1],
      [-0.00122, 1],
      [-0.00223, 2]
    ],
    "red_o_points": [],
    "y_categories": ["ABS", "NAIA", "PT", "nan"],
    "blue_o_points": [],
    "blue_x_points": [
      [0.00039, 1],
      [0.00305, 1],
      [0.00437, 0],
      [0.00261, 1],
      [0.00444, 1],
      [0.00021, 1],
      [0.00432, 0]
    ]
  },
  "QA_intPexWristFlex": {
    "red_x_points": [[0.00074, 2], [-0.01721, 1]],
    "red_o_points": [],
    "y_categories": ["GREATER THAN OR EQUALS TO 60", "LESS THAN 60", "nan"],
    "blue_o_points": [],
    "blue_x_points": [[0.00135, 2], [0.00738, 0], [0.00096, 2], [0.00147, 2]]
  },
  "QS_mulGraftTrunk[LowerTrunk]": {
    "red_x_points": [
      [-3e-5, 2],
      [-0.0001, 0],
      [-2e-5, 0],
      [-1e-5, 0],
      [-3e-5, 0],
      [-1e-5, 0],
      [-3e-5, 0],
      [-1e-5, 0],
      [-3e-5, 0],
      [-3e-5, 0],
      [-3e-5, 2],
      [-0.00011, 1],
      [2e-5, 2],
      [-3e-5, 0],
      [-8e-5, 0],
      [-0.00015, 0],
      [-3e-5, 2],
      [-3e-5, 2],
      [4e-5, 2],
      [-0.0001, 2],
      [-3e-5, 2],
      [-3e-5, 0],
      [-2e-5, 2],
      [-2e-5, 0],
      [-1e-5, 1],
      [-3e-5, 0]
    ],
    "red_o_points": [],
    "y_categories": ["N", "NOT APPLICABLE", "nan"],
    "blue_o_points": [],
    "blue_x_points": [
      [0.00035, 1],
      [4e-5, 2],
      [0.0001, 0],
      [4e-5, 2],
      [7e-5, 1],
      [7e-5, 1]
    ]
  },
  "QS_mulGraftRoot[T2]": {
    "red_x_points": [
      [-4e-5, 2],
      [-6e-5, 0],
      [-7e-5, 0],
      [-7e-5, 0],
      [-7e-5, 0],
      [-7e-5, 0],
      [-7e-5, 0],
      [-4e-5, 2],
      [-1e-5, 0],
      [-6e-5, 0],
      [-6e-5, 0],
      [-2e-5, 2],
      [0.00012, 1],
      [-1e-5, 2],
      [-7e-5, 0],
      [-5e-5, 2],
      [-7e-5, 0],
      [-1e-5, 2],
      [-5e-5, 2],
      [-3e-5, 2],
      [-5e-5, 0],
      [-5e-5, 2],
      [-3e-5, 2],
      [-5e-5, 2],
      [-1e-5, 2],
      [-6e-5, 0],
      [-3e-5, 2],
      [-7e-5, 0]
    ],
    "red_o_points": [],
    "y_categories": ["N", "NOT APPLICABLE", "nan"],
    "blue_o_points": [],
    "blue_x_points": [
      [0.0005, 1],
      [0.00012, 1],
      [-3e-5, 2],
      [0.00012, 1],
      [0.00012, 1]
    ]
  },
  "QS_mulGraftNerve[LP]": {
    "red_x_points": [
      [-3e-5, 0],
      [-3e-5, 0],
      [-3e-5, 0],
      [-3e-5, 0],
      [0.0, 2],
      [-3e-5, 0],
      [-3e-5, 0],
      [7e-5, 1],
      [-3e-5, 0],
      [0.0, 2],
      [-3e-5, 0],
      [-3e-5, 0],
      [0.0, 2],
      [0.0, 2],
      [-3e-5, 0],
      [0.0, 2],
      [0.0, 2],
      [0.0, 2],
      [-3e-5, 0],
      [0.0, 2],
      [0.0, 2],
      [7e-5, 1],
      [-3e-5, 0]
    ],
    "red_o_points": [],
    "y_categories": ["N", "NOT APPLICABLE", "nan"],
    "blue_o_points": [],
    "blue_x_points": [[0.0, 2], [-3e-5, 0], [7e-5, 1], [7e-5, 1]]
  },
  "QS_mulBpsurgeryType[Lysis]": {
    "red_x_points": [
      [-0.00242, 3],
      [-0.00522, 0],
      [-0.00809, 2],
      [-0.00548, 0],
      [-0.00501, 0],
      [-0.00809, 2],
      [-0.00514, 0],
      [-0.00248, 3],
      [-0.00535, 0],
      [-0.00488, 0],
      [-0.00499, 0],
      [-0.00224, 3],
      [0.01344, 1],
      [-0.00262, 3],
      [-0.00509, 0],
      [-0.00241, 3],
      [-0.00775, 2],
      [-0.00507, 0],
      [-0.00254, 3],
      [-0.00233, 3],
      [-0.00261, 3],
      [-0.00508, 0],
      [-0.00268, 3],
      [-0.00236, 3],
      [-0.00276, 3],
      [-0.0053, 0],
      [-0.00225, 3],
      [-0.00494, 0],
      [-0.00245, 3],
      [0.01511, 1],
      [-0.008, 2]
    ],
    "red_o_points": [],
    "y_categories": ["N", "NOT APPLICABLE", "Y", "nan"],
    "blue_o_points": [],
    "blue_x_points": [
      [0.01784, 1],
      [-0.00033, 3],
      [0.01456, 1],
      [-0.00223, 0],
      [-0.0008, 3],
      [0.01534, 1],
      [0.01656, 1]
    ]
  },
  "QS_mulLysisSite[Trunk]": {
    "red_x_points": [
      [-0.00186, 3],
      [-0.00253, 0],
      [-0.00244, 0],
      [-0.00242, 0],
      [-0.00311, 0],
      [-0.00525, 2],
      [-0.00255, 0],
      [-0.00182, 3],
      [-0.0025, 0],
      [-0.00237, 0],
      [-0.00254, 0],
      [-0.00164, 3],
      [0.00773, 1],
      [-0.00165, 3],
      [-0.00288, 0],
      [-0.0019, 3],
      [-0.00527, 2],
      [-0.00272, 0],
      [-0.00178, 3],
      [-0.0018, 3],
      [-0.00162, 3],
      [-0.0028, 0],
      [-0.00185, 3],
      [-0.00225, 3],
      [-0.00172, 3],
      [-0.00272, 0],
      [-0.0017, 3],
      [-0.00235, 0],
      [-0.00167, 3],
      [0.00836, 1],
      [-0.00501, 2]
    ],
    "red_o_points": [],
    "y_categories": ["N", "NOT APPLICABLE", "Y", "nan"],
    "blue_o_points": [],
    "blue_x_points": [
      [0.01057, 1],
      [-0.0007, 3],
      [0.00927, 1],
      [-0.00143, 0],
      [-0.00059, 3],
      [0.00923, 1],
      [0.00924, 1]
    ]
  },
  "QS_mulGraftTrunk[UpperTrunk]": {
    "red_x_points": [
      [-0.00068, 3],
      [-0.00136, 0],
      [-0.00157, 0],
      [-0.00144, 0],
      [-0.00154, 0],
      [-0.00116, 0],
      [-0.00117, 0],
      [-0.00079, 3],
      [-0.00133, 0],
      [-0.00148, 0],
      [-0.00142, 0],
      [-0.00081, 3],
      [0.00335, 1],
      [-0.00051, 3],
      [-0.00357, 2],
      [-0.00059, 3],
      [-0.00162, 0],
      [-0.00158, 0],
      [-0.0009, 3],
      [-0.00075, 3],
      [-0.00098, 3],
      [-0.00155, 0],
      [-0.00074, 3],
      [-0.00075, 3],
      [-0.00078, 3],
      [-0.0015, 0],
      [-0.00083, 3],
      [-0.00147, 0],
      [-0.00069, 3],
      [0.00359, 1],
      [-0.00154, 0]
    ],
    "red_o_points": [],
    "y_categories": ["N", "NOT APPLICABLE", "Y", "nan"],
    "blue_o_points": [],
    "blue_x_points": [
      [0.0051, 1],
      [-0.00031, 3],
      [0.00427, 1],
      [-0.00062, 0],
      [-0.00025, 3],
      [0.0052, 1],
      [0.00458, 1]
    ]
  },
  "QS_mulTransfSite[PhMc]": {
    "red_x_points": [
      [-0.00171, 3],
      [-0.00246, 0],
      [-0.00275, 0],
      [-0.00274, 0],
      [-0.00265, 0],
      [-0.00236, 0],
      [-0.00473, 2],
      [-0.00155, 3],
      [-0.00262, 0],
      [-0.00246, 0],
      [-0.00253, 0],
      [-0.00183, 3],
      [0.00659, 1],
      [-0.00117, 3],
      [-0.0024, 0],
      [-0.00168, 3],
      [-0.00242, 0],
      [-0.00275, 0],
      [-0.00161, 3],
      [-0.00166, 3],
      [-0.00166, 3],
      [-0.00448, 2],
      [-0.00147, 3],
      [-0.00161, 3],
      [-0.00143, 3],
      [-0.00219, 0],
      [-0.00149, 3],
      [-0.00279, 0],
      [-0.00145, 3],
      [0.008, 1],
      [-0.00251, 0]
    ],
    "red_o_points": [],
    "y_categories": ["N", "NOT APPLICABLE", "Y", "nan"],
    "blue_o_points": [],
    "blue_x_points": [
      [0.01025, 1],
      [-0.00075, 3],
      [0.00781, 1],
      [-0.00132, 0],
      [-0.00049, 3],
      [0.00783, 1],
      [0.00807, 1]
    ]
  },
  "QA_mulInjTbpiCause[Motorcycle]": {
    "red_x_points": [
      [0.0006, 0],
      [-0.00074, 1],
      [-0.0013, 1],
      [-0.00091, 1],
      [-0.00082, 1],
      [-0.0009, 1],
      [-0.00089, 1],
      [-0.00077, 1],
      [-0.00094, 1],
      [-0.00075, 1],
      [-0.0007, 1],
      [-0.00117, 0],
      [-0.03124, 1],
      [-0.001, 1],
      [-0.00093, 1],
      [-0.00105, 1],
      [-0.00092, 1],
      [-0.00078, 1],
      [0.00063, 0],
      [-0.00052, 1],
      [-0.00049, 1],
      [-0.00077, 1],
      [-0.00092, 1],
      [-0.00133, 1],
      [0.00059, 0],
      [-0.00063, 1],
      [-0.00062, 1],
      [-0.00086, 1],
      [-0.00077, 1],
      [-0.0291, 1],
      [-0.00065, 1]
    ],
    "red_o_points": [],
    "y_categories": ["N", "Y", "nan"],
    "blue_o_points": [],
    "blue_x_points": [
      [0.01484, 0],
      [-0.00047, 1],
      [0.01265, 0],
      [-0.00128, 1],
      [0.00118, 1],
      [0.01379, 0],
      [0.0133, 0]
    ]
  },
  "QS_mulLysisSite[Root]": {
    "red_x_points": [
      [-0.00091, 3],
      [-0.0011, 0],
      [-0.00215, 2],
      [-0.00083, 0],
      [-0.00103, 0],
      [-0.00106, 0],
      [-0.00101, 0],
      [-0.00077, 3],
      [-0.00101, 0],
      [-0.001, 0],
      [-0.00098, 0],
      [-0.00085, 3],
      [0.00374, 1],
      [-0.00091, 3],
      [-0.00124, 0],
      [-0.00088, 3],
      [-0.001, 0],
      [-0.00114, 0],
      [-0.00076, 3],
      [-0.0008, 3],
      [-0.00081, 3],
      [-0.00103, 0],
      [-0.00091, 3],
      [-0.00077, 3],
      [-0.00074, 3],
      [-0.00096, 0],
      [-0.0008, 3],
      [-0.00077, 0],
      [-0.00086, 3],
      [0.0036, 1],
      [-0.00258, 2]
    ],
    "red_o_points": [],
    "y_categories": ["N", "NOT APPLICABLE", "Y", "nan"],
    "blue_o_points": [],
    "blue_x_points": [
      [0.00464, 1],
      [-0.00022, 3],
      [0.00502, 1],
      [-0.0011, 0],
      [-0.00036, 3],
      [0.00356, 1],
      [0.00387, 1]
    ]
  },
  "QA_yonInjOrtsurg": {
    "red_x_points": [
      [-0.0036, 2],
      [-9e-5, 2],
      [-0.0, 2],
      [-2e-5, 2],
      [2e-5, 2],
      [4e-5, 2],
      [-0.00018, 1],
      [-0.00382, 2],
      [0.0, 0],
      [-0.00014, 1],
      [-0.00021, 1],
      [-0.00406, 2],
      [-0.00314, 0],
      [-0.00011, 1],
      [-0.0, 2],
      [-0.00364, 2],
      [5e-5, 0],
      [2e-5, 2],
      [0.0042, 0],
      [0.00038, 1],
      [-0.00363, 2],
      [-0.00015, 1],
      [-0.00435, 2],
      [-0.00439, 2],
      [-0.00339, 2],
      [-4e-5, 0],
      [-0.00051, 1],
      [-5e-5, 0],
      [-0.00403, 2],
      [-0.00153, 1],
      [-4e-5, 1]
    ],
    "red_o_points": [],
    "y_categories": ["N", "Y", "nan"],
    "blue_o_points": [],
    "blue_x_points": [
      [0.00048, 2],
      [0.00411, 1],
      [0.00066, 2],
      [0.00033, 2],
      [0.01357, 0],
      [0.00049, 2],
      [0.00074, 2]
    ]
  },
  "QS_mulGraftLevel[Trunk]": {
    "red_x_points": [
      [-0.00043, 3],
      [-0.00093, 0],
      [-0.00079, 0],
      [-0.00079, 0],
      [-0.00085, 0],
      [-0.00088, 0],
      [-0.00076, 0],
      [-0.00058, 3],
      [-0.00083, 0],
      [-0.00083, 0],
      [-0.00075, 0],
      [-0.00062, 3],
      [0.00222, 1],
      [-0.00038, 3],
      [-0.00222, 2],
      [-0.00071, 3],
      [-0.00072, 0],
      [-0.00078, 0],
      [-0.00068, 3],
      [-0.00057, 3],
      [-0.00067, 3],
      [-0.00078, 0],
      [-0.00054, 3],
      [-0.00036, 3],
      [-0.00054, 3],
      [-0.00079, 0],
      [-0.00047, 3],
      [-0.00066, 0],
      [-0.0004, 3],
      [0.00242, 1],
      [-0.0009, 0]
    ],
    "red_o_points": [],
    "y_categories": ["N", "NOT APPLICABLE", "Y", "nan"],
    "blue_o_points": [],
    "blue_x_points": [
      [0.00291, 1],
      [-0.00028, 3],
      [0.00247, 1],
      [-0.00041, 0],
      [-0.00014, 3],
      [0.0025, 1],
      [0.00288, 1]
    ]
  },
  "QS_mulGraftNerve[Sc]": {
    "red_x_points": [
      [-4e-5, 0],
      [-4e-5, 0],
      [-4e-5, 0],
      [-1e-5, 0],
      [-3e-5, 0],
      [-1e-5, 0],
      [-1e-5, 2],
      [-1e-5, 0],
      [-4e-5, 0],
      [-4e-5, 0],
      [-4e-5, 2],
      [0.00012, 1],
      [-5e-5, 2],
      [-3e-5, 0],
      [-5e-5, 2],
      [2e-5, 0],
      [-3e-5, 0],
      [-4e-5, 2],
      [-3e-5, 2],
      [-4e-5, 2],
      [-4e-5, 0],
      [-5e-5, 2],
      [-4e-5, 2],
      [-3e-5, 2],
      [-1e-5, 0],
      [-3e-5, 2],
      [-1e-5, 0],
      [-4e-5, 2],
      [-0.0001, 1],
      [-4e-5, 0]
    ],
    "red_o_points": [],
    "y_categories": ["N", "NOT APPLICABLE", "nan"],
    "blue_o_points": [],
    "blue_x_points": [
      [0.00012, 1],
      [-2e-5, 2],
      [0.00012, 1],
      [2e-5, 0],
      [-3e-5, 2],
      [0.00012, 1],
      [0.00019, 1]
    ]
  },
  "QS_mulGraftNerve[other]": {
    "red_x_points": [
      [-0.00098, 2],
      [-0.00231, 0],
      [-0.00231, 0],
      [-0.00212, 0],
      [-0.00215, 0],
      [-0.00222, 0],
      [-0.00196, 0],
      [-0.00078, 2],
      [-0.00185, 0],
      [-0.00224, 0],
      [-0.00176, 0],
      [-0.00105, 2],
      [0.00432, 1],
      [-0.00073, 2],
      [-0.00217, 0],
      [-0.00069, 2],
      [-0.00191, 0],
      [-0.00197, 0],
      [-0.0009, 2],
      [-0.00082, 2],
      [-0.00092, 2],
      [-0.00211, 0],
      [-0.00073, 2],
      [-0.00072, 2],
      [-0.00069, 2],
      [-0.00214, 0],
      [-0.0008, 2],
      [-0.00218, 0],
      [-0.00058, 2],
      [0.00416, 1],
      [-0.00221, 0]
    ],
    "red_o_points": [],
    "y_categories": ["N", "NOT APPLICABLE", "nan"],
    "blue_o_points": [],
    "blue_x_points": [
      [0.00657, 1],
      [-0.00012, 2],
      [0.00559, 1],
      [-0.00028, 0],
      [-3e-5, 2],
      [0.00551, 1],
      [0.0061, 1]
    ]
  },
  "QS_mulTransfSite[AcSsAA]": {
    "red_x_points": [
      [-0.00234, 3],
      [-0.00824, 2],
      [-0.00396, 0],
      [-0.00794, 2],
      [-0.00901, 2],
      [-0.00368, 0],
      [-0.00357, 0],
      [-0.0024, 3],
      [-0.0038, 0],
      [-0.00777, 2],
      [-0.00365, 0],
      [-0.00257, 3],
      [0.01451, 1],
      [-0.00234, 3],
      [-0.00869, 2],
      [-0.00239, 3],
      [-0.00379, 0],
      [-0.00383, 0],
      [-0.00257, 3],
      [-0.00247, 3],
      [-0.00239, 3],
      [-0.00838, 2],
      [-0.00236, 3],
      [-0.0026, 3],
      [-0.00236, 3],
      [-0.00383, 0],
      [-0.00236, 3],
      [-0.00758, 2],
      [-0.00217, 3],
      [0.01405, 1],
      [-0.00359, 0]
    ],
    "red_o_points": [],
    "y_categories": ["N", "NOT APPLICABLE", "Y", "nan"],
    "blue_o_points": [],
    "blue_x_points": [
      [0.01656, 1],
      [-0.00076, 3],
      [0.01585, 1],
      [-0.001, 0],
      [-0.0008, 3],
      [0.01416, 1],
      [0.01616, 1]
    ]
  },
  "QS_mulGraftNerve[DS]": {
    "red_x_points": [
      [-9e-5, 2],
      [-0.00017, 0],
      [-0.00011, 0],
      [-0.00015, 0],
      [-0.00011, 0],
      [-0.00013, 0],
      [-0.00014, 0],
      [-0.00018, 2],
      [-0.00014, 0],
      [-0.00014, 0],
      [-0.0001, 0],
      [-5e-5, 2],
      [0.0002, 1],
      [3e-5, 2],
      [-0.00016, 0],
      [-0.00017, 2],
      [-0.00017, 0],
      [-0.00022, 0],
      [-2e-5, 2],
      [-7e-5, 2],
      [-9e-5, 2],
      [-0.00015, 0],
      [1e-5, 2],
      [-8e-5, 2],
      [-4e-5, 2],
      [-0.00014, 0],
      [-4e-5, 2],
      [-0.00026, 0],
      [-1e-5, 2],
      [0.00046, 1],
      [-0.00012, 0]
    ],
    "red_o_points": [],
    "y_categories": ["N", "NOT APPLICABLE", "nan"],
    "blue_o_points": [],
    "blue_x_points": [
      [0.00067, 1],
      [5e-5, 2],
      [0.00032, 1],
      [-0.0001, 0],
      [4e-5, 2],
      [0.00026, 1],
      [0.00038, 1]
    ]
  },
  "QS_mulGraftNerve[MP]": {
    "red_x_points": [
      [-0.0, 2],
      [-8e-5, 0],
      [-8e-5, 0],
      [-8e-5, 0],
      [-8e-5, 0],
      [-8e-5, 0],
      [-3e-5, 0],
      [2e-5, 2],
      [-8e-5, 0],
      [-5e-5, 0],
      [-3e-5, 0],
      [0.00014, 1],
      [2e-5, 2],
      [-8e-5, 0],
      [2e-5, 2],
      [-8e-5, 0],
      [-8e-5, 0],
      [2e-5, 2],
      [2e-5, 2],
      [2e-5, 2],
      [2e-5, 2],
      [2e-5, 2],
      [-8e-5, 0],
      [2e-5, 2],
      [-8e-5, 0],
      [-0.0, 2],
      [0.00014, 1],
      [-3e-5, 0]
    ],
    "red_o_points": [],
    "y_categories": ["N", "NOT APPLICABLE", "nan"],
    "blue_o_points": [],
    "blue_x_points": [
      [9e-5, 1],
      [2e-5, 2],
      [9e-5, 1],
      [-3e-5, 0],
      [2e-5, 2],
      [9e-5, 1],
      [5e-5, 1]
    ]
  },
  "QS_mulGraftNerve[Ax]": {
    "red_x_points": [
      [-0.00024, 2],
      [-0.00042, 0],
      [-0.00066, 0],
      [-0.00051, 0],
      [-0.00044, 0],
      [-0.00053, 0],
      [-0.00053, 0],
      [-0.00017, 2],
      [-0.0005, 0],
      [-0.00044, 0],
      [-0.00029, 0],
      [-0.00027, 2],
      [0.0008, 1],
      [-0.00013, 2],
      [-0.00032, 0],
      [-0.00011, 2],
      [-0.00065, 0],
      [-0.00053, 0],
      [-0.00025, 2],
      [-0.0002, 2],
      [-0.00026, 2],
      [-0.00043, 0],
      [-0.00018, 2],
      [-0.0003, 2],
      [-0.00017, 2],
      [-0.00038, 0],
      [-0.00025, 2],
      [-0.00039, 0],
      [-0.00011, 2],
      [0.00081, 1],
      [-0.00044, 0]
    ],
    "red_o_points": [],
    "y_categories": ["N", "NOT APPLICABLE", "nan"],
    "blue_o_points": [],
    "blue_x_points": [
      [0.00108, 1],
      [-0.00011, 2],
      [0.00173, 1],
      [-3e-5, 0],
      [-3e-5, 2],
      [0.00106, 1],
      [0.00124, 1]
    ]
  },
  "QA_lstPexMuscstrength[WristFlex]": {
    "red_x_points": [
      [-0.00278, 1],
      [-0.00037, 2],
      [-0.00158, 1],
      [-0.00151, 1],
      [0.00052, 0],
      [0.00074, 0],
      [-0.00171, 1],
      [-0.00121, 0],
      [0.00068, 0],
      [0.00038, 0],
      [0.00067, 0],
      [-0.0009, 0],
      [-0.00075, 2],
      [0.00106, 2],
      [-0.00016, 2],
      [-0.00086, 0],
      [-9e-5, 2],
      [0.00039, 0],
      [-0.00089, 0],
      [-0.00292, 1],
      [-0.00111, 0],
      [-0.00128, 1],
      [0.00116, 2],
      [-0.0075, 1],
      [-0.00106, 0],
      [0.00051, 0],
      [-0.00281, 1],
      [0.00043, 0],
      [0.00144, 2],
      [-0.00023, 2],
      [-0.00111, 1]
    ],
    "red_o_points": [],
    "y_categories": ["GREATER THAN OR EQUALS TO 3", "LESS THAN 3", "nan"],
    "blue_o_points": [],
    "blue_x_points": [
      [0.00053, 0],
      [0.00242, 2],
      [0.00132, 0],
      [0.00246, 0],
      [0.00359, 2],
      [0.00138, 0],
      [0.00119, 0]
    ]
  },
  "QA_lstPexMuscstrength[FingersAddu]": {
    "red_x_points": [
      [-6e-5, 0],
      [-6e-5, 1],
      [-6e-5, 0],
      [-6e-5, 1],
      [-6e-5, 0],
      [-6e-5, 0],
      [5e-5, 2],
      [-6e-5, 0],
      [-6e-5, 0],
      [-6e-5, 1],
      [-6e-5, 0],
      [5e-5, 2],
      [8e-5, 2],
      [5e-5, 2]
    ],
    "red_o_points": [],
    "y_categories": ["GREATER THAN OR EQUALS TO 3", "LESS THAN 3", "nan"],
    "blue_o_points": [],
    "blue_x_points": [[5e-5, 2], [8e-5, 2], [5e-5, 2]]
  },
  "QS_mulNeuromadSite[C5]": {
    "red_x_points": [
      [-0.00149, 2],
      [-0.0039, 0],
      [-0.00407, 0],
      [-0.00357, 0],
      [-0.00378, 0],
      [-0.00338, 0],
      [-0.0035, 0],
      [-0.00135, 2],
      [-0.00389, 0],
      [-0.0038, 0],
      [-0.00345, 0],
      [-0.00156, 2],
      [0.0057, 1],
      [-0.00131, 2],
      [-0.00361, 0],
      [-0.00146, 2],
      [-0.00364, 0],
      [-0.00386, 0],
      [-0.00156, 2],
      [-0.00151, 2],
      [-0.0011, 2],
      [-0.00378, 0],
      [-0.00157, 2],
      [-0.00171, 2],
      [-0.00154, 2],
      [-0.00388, 0],
      [-0.0014, 2],
      [-0.00368, 0],
      [-0.00104, 2],
      [0.00779, 1],
      [-0.00343, 0]
    ],
    "red_o_points": [],
    "y_categories": ["N", "NOT APPLICABLE", "nan"],
    "blue_o_points": [],
    "blue_x_points": [
      [0.01387, 1],
      [-0.00022, 2],
      [0.00943, 1],
      [-0.00014, 0],
      [-0.00024, 2],
      [0.00829, 1],
      [0.00932, 1]
    ]
  },
  "QS_mulNeuromadSite[C7]": {
    "red_x_points": [
      [-0.001, 2],
      [-0.003, 0],
      [-0.0032, 0],
      [-0.00262, 0],
      [-0.00287, 0],
      [-0.00254, 0],
      [-0.0027, 0],
      [-0.00122, 2],
      [-0.0027, 0],
      [-0.00274, 0],
      [-0.00221, 0],
      [-0.00137, 2],
      [0.00497, 1],
      [-0.00068, 2],
      [-0.00262, 0],
      [-0.00093, 2],
      [-0.0028, 0],
      [-0.0028, 0],
      [-0.00103, 2],
      [-0.00096, 2],
      [-0.00087, 2],
      [-0.00225, 0],
      [-0.00102, 2],
      [-0.00101, 2],
      [-0.00096, 2],
      [-0.00288, 0],
      [-0.00092, 2],
      [-0.00266, 0],
      [-0.00102, 2],
      [0.00502, 1],
      [-0.00262, 0]
    ],
    "red_o_points": [],
    "y_categories": ["N", "NOT APPLICABLE", "nan"],
    "blue_o_points": [],
    "blue_x_points": [
      [0.00892, 1],
      [-0.00016, 2],
      [0.0069, 1],
      [-0.00012, 0],
      [-0.0, 2],
      [0.00626, 1],
      [0.007, 1]
    ]
  },
  "QA_lstPexMuscstrength[ShoulderInrot]": {
    "red_x_points": [
      [-0.00093, 1],
      [9e-5, 2],
      [0.00027, 0],
      [-0.00047, 1],
      [0.00012, 0],
      [-0.0006, 1],
      [9e-5, 2],
      [-0.00056, 1],
      [0.00026, 0],
      [0.0002, 2],
      [0.0001, 2],
      [-0.00071, 1],
      [0.00014, 2],
      [8e-5, 2],
      [7e-5, 2],
      [0.00013, 2],
      [0.0001, 2],
      [-0.0006, 1],
      [0.00035, 0],
      [-0.00056, 1],
      [0.00013, 0],
      [0.0001, 2],
      [0.00013, 2],
      [0.00011, 2],
      [-3e-5, 2],
      [-0.0008, 1],
      [0.00012, 2],
      [-0.00052, 1],
      [0.00012, 2],
      [0.00012, 2],
      [0.00016, 0]
    ],
    "red_o_points": [],
    "y_categories": ["GREATER THAN OR EQUALS TO 3", "LESS THAN 3", "nan"],
    "blue_o_points": [],
    "blue_x_points": [
      [7e-5, 2],
      [0.00013, 2],
      [0.00038, 0],
      [0.00023, 2],
      [0.00011, 2],
      [0.00039, 0],
      [0.0004, 0]
    ]
  },
  "QA_lstPexMuscstrength[ElbowExte]": {
    "red_x_points": [
      [-0.00245, 1],
      [-0.0002, 2],
      [0.0001, 1],
      [-0.00124, 0],
      [3e-5, 1],
      [-1e-5, 1],
      [-0.00295, 1],
      [-0.00075, 0],
      [-0.00059, 0],
      [9e-5, 1],
      [-0.00255, 1],
      [0.00011, 2],
      [0.00346, 2],
      [-0.00027, 2],
      [-0.00285, 1],
      [8e-5, 1],
      [-0.00211, 0],
      [-0.00249, 1],
      [-0.00254, 0],
      [-1e-5, 1],
      [0.00316, 2],
      [-0.00252, 0],
      [-0.0033, 0],
      [0.0, 1],
      [-0.0023, 1],
      [-0.0002, 2],
      [-0.00235, 1],
      [-1e-5, 2],
      [3e-5, 1]
    ],
    "red_o_points": [],
    "y_categories": ["GREATER THAN OR EQUALS TO 3", "LESS THAN 3", "nan"],
    "blue_o_points": [],
    "blue_x_points": [
      [0.00015, 2],
      [0.00598, 2],
      [0.00025, 0],
      [0.00119, 1],
      [0.00721, 2],
      [0.00031, 0],
      [0.00012, 0]
    ]
  },
  "QA_intPexForearmSupin": {
    "red_x_points": [
      [4e-5, 2],
      [0.00014, 0],
      [1e-5, 2],
      [7e-5, 2],
      [-0.00044, 1],
      [-0.00033, 1],
      [7e-5, 2],
      [-0.00047, 1],
      [7e-5, 2],
      [4e-5, 2],
      [5e-5, 2],
      [0.00017, 0],
      [0.00062, 2],
      [6e-5, 2],
      [7e-5, 2],
      [9e-5, 2],
      [5e-5, 2],
      [-0.00076, 1],
      [-0.00039, 1],
      [9e-5, 0],
      [-0.00029, 1],
      [-0.00033, 1],
      [8e-5, 2],
      [9e-5, 2],
      [0.0001, 2],
      [7e-5, 2],
      [-0.00067, 1],
      [6e-5, 2],
      [6e-5, 2],
      [-0.01455, 1],
      [0.0002, 0]
    ],
    "red_o_points": [],
    "y_categories": ["GREATER THAN OR EQUALS TO 80", "LESS THAN 80", "nan"],
    "blue_o_points": [],
    "blue_x_points": [
      [0.00131, 2],
      [4e-5, 2],
      [0.00583, 0],
      [0.00028, 2],
      [0.00027, 2],
      [0.00129, 2],
      [0.00136, 2]
    ]
  },
  "QS_mulGraftNerve[SS]": {
    "red_x_points": [
      [-0.00025, 2],
      [-0.00025, 0],
      [-0.0003, 0],
      [-0.00032, 0],
      [-0.00036, 0],
      [-0.00035, 0],
      [-0.00035, 0],
      [-0.00012, 2],
      [-0.00027, 0],
      [-0.00019, 0],
      [-0.00031, 0],
      [-0.00025, 2],
      [0.0008, 1],
      [-0.00023, 2],
      [-0.00027, 0],
      [-0.00011, 2],
      [-0.00029, 0],
      [-0.00021, 0],
      [-0.00017, 2],
      [-0.00016, 2],
      [-0.00018, 2],
      [-0.00026, 0],
      [-0.00023, 2],
      [-0.00026, 2],
      [-0.00012, 2],
      [-0.00033, 0],
      [-0.00024, 2],
      [-0.0003, 0],
      [-0.00021, 2],
      [0.00079, 1],
      [-0.0003, 0]
    ],
    "red_o_points": [],
    "y_categories": ["N", "NOT APPLICABLE", "nan"],
    "blue_o_points": [],
    "blue_x_points": [
      [0.0011, 1],
      [-7e-5, 2],
      [0.00071, 1],
      [-3e-5, 0],
      [-0.0001, 2],
      [0.00072, 1],
      [0.00111, 1]
    ]
  },
  "QS_mulGraftNerve[MCF]": {
    "red_x_points": [
      [-3e-5, 2],
      [-0.00015, 0],
      [-0.00029, 0],
      [-0.00015, 0],
      [-0.00023, 0],
      [-0.00023, 0],
      [-0.00019, 0],
      [-9e-5, 2],
      [-0.0002, 0],
      [-0.00016, 0],
      [-0.00017, 0],
      [-0.00025, 2],
      [-4e-5, 1],
      [-4e-5, 2],
      [-0.00015, 0],
      [-0.0001, 2],
      [-0.00017, 0],
      [-0.00024, 0],
      [-3e-5, 2],
      [-5e-5, 2],
      [-9e-5, 2],
      [-8e-5, 0],
      [-6e-5, 2],
      [-2e-5, 2],
      [-3e-5, 2],
      [-0.00016, 0],
      [-5e-5, 2],
      [-0.00017, 0],
      [-3e-5, 2],
      [0.00022, 1],
      [-0.00014, 0]
    ],
    "red_o_points": [],
    "y_categories": ["N", "NOT APPLICABLE", "nan"],
    "blue_o_points": [],
    "blue_x_points": [
      [0.00074, 1],
      [2e-5, 2],
      [0.00059, 1],
      [9e-5, 0],
      [-2e-5, 2],
      [0.0005, 1],
      [0.00053, 1]
    ]
  },
  "QS_mulNeuromadSite[C6]": {
    "red_x_points": [
      [-0.0007, 2],
      [-0.00187, 0],
      [-0.00226, 0],
      [-0.00207, 0],
      [-0.00229, 0],
      [-0.00196, 0],
      [-0.00203, 0],
      [-0.00063, 2],
      [-0.00213, 0],
      [-0.00198, 0],
      [-0.00191, 0],
      [-0.00063, 2],
      [0.00373, 1],
      [-0.00069, 2],
      [-0.00207, 0],
      [-0.00087, 2],
      [-0.00202, 0],
      [-0.00219, 0],
      [-0.00091, 2],
      [-0.00074, 2],
      [-0.00078, 2],
      [-0.00172, 0],
      [-0.00072, 2],
      [-0.00089, 2],
      [-0.0007, 2],
      [-0.00204, 0],
      [-0.00079, 2],
      [-0.00235, 0],
      [-0.00066, 2],
      [0.00412, 1],
      [-0.00186, 0]
    ],
    "red_o_points": [],
    "y_categories": ["N", "NOT APPLICABLE", "nan"],
    "blue_o_points": [],
    "blue_x_points": [
      [0.00692, 1],
      [3e-5, 2],
      [0.00501, 1],
      [-0.00013, 0],
      [-0.00018, 2],
      [0.00473, 1],
      [0.00561, 1]
    ]
  },
  "QS_mulLysisSite[Nerve]": {
    "red_x_points": [
      [-0.00052, 3],
      [-0.00071, 0],
      [-0.00175, 2],
      [-0.00079, 0],
      [-0.00079, 0],
      [-0.00074, 0],
      [-0.00068, 0],
      [-0.00051, 3],
      [-0.00074, 0],
      [-0.00089, 0],
      [-0.00083, 0],
      [-0.00052, 3],
      [0.00242, 1],
      [-0.00043, 3],
      [-0.00074, 0],
      [-0.00055, 3],
      [-0.00065, 0],
      [-0.00063, 0],
      [-0.00046, 3],
      [-0.00038, 3],
      [-0.00044, 3],
      [-0.00079, 0],
      [-0.0005, 3],
      [-0.00056, 3],
      [-0.00048, 3],
      [-0.00078, 0],
      [-0.00049, 3],
      [-0.0008, 0],
      [-0.00055, 3],
      [0.0023, 1],
      [-0.00077, 0]
    ],
    "red_o_points": [],
    "y_categories": ["N", "NOT APPLICABLE", "Y", "nan"],
    "blue_o_points": [],
    "blue_x_points": [
      [0.00295, 1],
      [-0.00021, 3],
      [0.00265, 1],
      [-0.0009, 0],
      [-0.00024, 3],
      [0.00301, 1],
      [0.00262, 1]
    ]
  },
  "QS_mulGraftNerve[TD]": {
    "red_x_points": [
      [-0.00012, 2],
      [-0.00012, 0],
      [-0.00012, 0],
      [-0.00018, 0],
      [-0.00015, 0],
      [-0.00012, 0],
      [-0.00015, 0],
      [-9e-5, 2],
      [-0.00013, 0],
      [-6e-5, 0],
      [-9e-5, 0],
      [-0.0001, 2],
      [0.0004, 1],
      [-6e-5, 2],
      [-0.00015, 0],
      [-0.0001, 2],
      [-0.00017, 0],
      [-0.00017, 0],
      [-0.00012, 2],
      [-0.00012, 2],
      [-9e-5, 2],
      [-0.00015, 0],
      [-0.00012, 2],
      [-4e-5, 2],
      [-0.00012, 2],
      [-7e-5, 0],
      [-6e-5, 2],
      [-0.00014, 0],
      [-6e-5, 2],
      [0.00029, 1],
      [-8e-5, 0]
    ],
    "red_o_points": [],
    "y_categories": ["N", "NOT APPLICABLE", "nan"],
    "blue_o_points": [],
    "blue_x_points": [
      [0.00062, 1],
      [-7e-5, 2],
      [0.00029, 1],
      [1e-5, 0],
      [-4e-5, 2],
      [0.00042, 1],
      [0.00034, 1]
    ]
  },
  "QS_mulLysisRoot[C7]": {
    "red_x_points": [
      [-0.00077, 3],
      [-0.00098, 0],
      [-0.00191, 2],
      [-0.00092, 0],
      [-0.00097, 0],
      [-0.00098, 0],
      [-0.0009, 0],
      [-0.00091, 3],
      [-0.00121, 0],
      [-0.00096, 0],
      [-0.00098, 0],
      [-0.00083, 3],
      [0.00253, 1],
      [-0.00083, 3],
      [-0.00099, 0],
      [-0.00073, 3],
      [-0.00109, 0],
      [-0.00104, 0],
      [-0.00076, 3],
      [-0.00067, 3],
      [-0.00094, 3],
      [-0.00095, 0],
      [-0.00072, 3],
      [-0.00078, 3],
      [-0.00056, 3],
      [-0.00108, 0],
      [-0.00056, 3],
      [-0.00122, 0],
      [-0.00067, 3],
      [0.003, 1],
      [-0.00094, 0]
    ],
    "red_o_points": [],
    "y_categories": ["N", "NOT APPLICABLE", "Y", "nan"],
    "blue_o_points": [],
    "blue_x_points": [
      [0.00398, 1],
      [-7e-5, 3],
      [0.00339, 1],
      [-0.0009, 0],
      [-0.00021, 3],
      [0.0036, 1],
      [0.00359, 1]
    ]
  },
  "QS_mulTransfSite[IMc]": {
    "red_x_points": [
      [-0.00206, 3],
      [-0.00774, 2],
      [-0.0047, 0],
      [-0.0044, 0],
      [-0.00484, 0],
      [-0.00474, 0],
      [-0.00453, 0],
      [-0.00208, 3],
      [-0.00489, 0],
      [-0.00453, 0],
      [-0.00482, 0],
      [-0.0023, 3],
      [0.01149, 1],
      [-0.00207, 3],
      [-0.00493, 0],
      [-0.00229, 3],
      [-0.00785, 2],
      [-0.00506, 0],
      [-0.00235, 3],
      [-0.00209, 3],
      [-0.00213, 3],
      [-0.00465, 0],
      [-0.00214, 3],
      [-0.00214, 3],
      [-0.00225, 3],
      [-0.00433, 0],
      [-0.00228, 3],
      [-0.00749, 2],
      [-0.00201, 3],
      [0.01333, 1],
      [-0.00732, 2]
    ],
    "red_o_points": [],
    "y_categories": ["N", "NOT APPLICABLE", "Y", "nan"],
    "blue_o_points": [],
    "blue_x_points": [
      [0.01834, 1],
      [-0.00061, 3],
      [0.01327, 1],
      [-0.00212, 0],
      [-0.0008, 3],
      [0.01316, 1],
      [0.01693, 1]
    ]
  },
  "QS_lstBpsurgSide": {
    "red_x_points": [
      [-0.00382, 3],
      [-0.00543, 0],
      [-0.00547, 0],
      [-0.00556, 0],
      [-0.01106, 2],
      [-0.00575, 0],
      [-0.00562, 0],
      [-0.00344, 3],
      [-0.00562, 0],
      [-0.01055, 2],
      [-0.01101, 2],
      [-0.00353, 3],
      [0.01789, 1],
      [-0.00369, 3],
      [-0.01167, 2],
      [-0.00345, 3],
      [-0.01118, 2],
      [-0.01228, 2],
      [-0.00347, 3],
      [-0.00396, 3],
      [-0.00334, 3],
      [-0.00505, 0],
      [-0.00391, 3],
      [-0.00355, 3],
      [-0.0041, 3],
      [-0.01091, 2],
      [-0.00388, 3],
      [-0.0113, 2],
      [-0.00328, 3],
      [0.02096, 1],
      [-0.00517, 0]
    ],
    "red_o_points": [],
    "y_categories": ["L", "NOT APPLICABLE", "R", "nan"],
    "blue_o_points": [],
    "blue_x_points": [
      [0.02849, 1],
      [-0.00128, 3],
      [0.02026, 1],
      [0.0012, 0],
      [-0.00146, 3],
      [0.02085, 1],
      [0.02318, 1]
    ]
  },
  "QS_mulTransfSite[AcMc]": {
    "red_x_points": [
      [-0.0006, 3],
      [-0.00085, 0],
      [-0.00087, 0],
      [-0.001, 0],
      [-0.00101, 0],
      [-0.00086, 0],
      [-0.00087, 0],
      [-0.00066, 3],
      [-0.00095, 0],
      [-0.00092, 0],
      [-0.00224, 2],
      [-0.00054, 3],
      [0.00268, 1],
      [-0.00049, 3],
      [-0.00091, 0],
      [-0.00059, 3],
      [-0.0009, 0],
      [-0.00106, 0],
      [-0.00057, 3],
      [-0.00057, 3],
      [-0.00057, 3],
      [-0.00082, 0],
      [-0.00046, 3],
      [-0.00061, 3],
      [-0.00067, 3],
      [-0.00082, 0],
      [-0.00053, 3],
      [-0.00109, 0],
      [-0.00056, 3],
      [0.00314, 1],
      [-0.00112, 0]
    ],
    "red_o_points": [],
    "y_categories": ["N", "NOT APPLICABLE", "Y", "nan"],
    "blue_o_points": [],
    "blue_x_points": [
      [0.00378, 1],
      [-0.00022, 3],
      [0.00325, 1],
      [-0.00068, 0],
      [-0.00022, 3],
      [0.0027, 1],
      [0.00295, 1]
    ]
  },
  "QS_mulTransfSite[Other]": {
    "red_x_points": [
      [-0.0007, 3],
      [-0.00124, 0],
      [-0.00134, 0],
      [-0.00113, 0],
      [-0.00118, 0],
      [-0.0014, 0],
      [-0.00132, 0],
      [-0.0009, 3],
      [-0.00134, 0],
      [-0.00114, 0],
      [-0.00127, 0],
      [-0.00079, 3],
      [0.00332, 1],
      [-0.00074, 3],
      [-0.00141, 0],
      [-0.00067, 3],
      [-0.0013, 0],
      [-0.00334, 2],
      [-0.00072, 3],
      [-0.00074, 3],
      [-0.00093, 3],
      [-0.00105, 0],
      [-0.00073, 3],
      [-0.00093, 3],
      [-0.00078, 3],
      [-0.00126, 0],
      [-0.00056, 3],
      [-0.0012, 0],
      [-0.00064, 3],
      [0.00385, 1],
      [-0.00126, 0]
    ],
    "red_o_points": [],
    "y_categories": ["N", "NOT APPLICABLE", "Y", "nan"],
    "blue_o_points": [],
    "blue_x_points": [
      [0.00413, 1],
      [-0.00012, 3],
      [0.00397, 1],
      [-0.00064, 0],
      [-0.0003, 3],
      [0.0045, 1],
      [0.00428, 1]
    ]
  },
  "QA_yonInjBpsurg": {
    "red_x_points": [
      [-0.00348, 1],
      [-0.00301, 1],
      [-0.00333, 1],
      [-0.00328, 1],
      [-0.00349, 1],
      [-0.00296, 1],
      [-0.00302, 1],
      [-0.00345, 1],
      [-0.0033, 1],
      [-0.00368, 1],
      [-0.00301, 1],
      [-0.00335, 1],
      [0.00659, 0],
      [-0.00308, 1],
      [-0.00304, 1],
      [-0.00331, 1],
      [-0.00282, 1],
      [-0.00352, 1],
      [-0.00373, 1],
      [-0.00321, 1],
      [-0.0031, 1],
      [-0.00255, 1],
      [-0.00339, 1],
      [-0.00348, 1],
      [-0.00365, 1],
      [-0.00353, 1],
      [-0.00346, 1],
      [-0.00318, 1],
      [-0.00307, 1],
      [0.00938, 0],
      [-0.00322, 1]
    ],
    "red_o_points": [],
    "y_categories": ["N", "Y", "nan"],
    "blue_o_points": [],
    "blue_x_points": [
      [0.01856, 0],
      [-0.00089, 1],
      [0.01082, 0],
      [-0.00273, 1],
      [-0.00092, 1],
      [0.01224, 0],
      [0.01298, 0]
    ]
  },
  "QA_equInjTbpiAge": {
    "red_x_points": [
      [-0.00067, 1],
      [-0.0002, 1],
      [-5e-5, 1],
      [-2e-5, 0],
      [-0.001, 0],
      [6e-5, 1],
      [-0.00013, 1],
      [0.00033, 0],
      [-0.00043, 0],
      [-0.00028, 0],
      [-9e-5, 1],
      [0.00039, 0],
      [-0.01342, 1],
      [-0.00073, 1],
      [-0.00033, 1],
      [-0.00069, 1],
      [0.00012, 0],
      [-0.0015, 0],
      [-0.00085, 1],
      [0.00043, 0],
      [-0.00068, 1],
      [-0.0002, 1],
      [-0.00086, 1],
      [-0.00166, 1],
      [0.00049, 0],
      [4e-5, 1],
      [-0.00121, 1],
      [-0.00017, 1],
      [-0.00075, 1],
      [-0.01125, 1],
      [0.00011, 0]
    ],
    "red_o_points": [],
    "y_categories": ["GREATER THAN OR EQUALS TO 30", "LESS THAN 30", "nan"],
    "blue_o_points": [],
    "blue_x_points": [
      [-0.00393, 1],
      [-0.00097, 1],
      [0.00592, 0],
      [0.00051, 1],
      [0.00417, 0],
      [0.00691, 0],
      [0.00737, 0]
    ]
  },
  "QS_mulLysisNerve[Ssr]": {
    "red_x_points": [
      [-0.00053, 3],
      [-0.00069, 0],
      [-0.00146, 2],
      [-0.00071, 0],
      [-0.00065, 0],
      [-0.00062, 0],
      [-0.00063, 0],
      [-0.00057, 3],
      [-0.00072, 0],
      [-0.00068, 0],
      [-0.00067, 0],
      [-0.00048, 3],
      [0.00201, 1],
      [-0.0006, 3],
      [-0.0007, 0],
      [-0.00036, 3],
      [-0.00067, 0],
      [-0.0006, 0],
      [-0.00052, 3],
      [-0.00046, 3],
      [-0.00051, 3],
      [-0.00065, 0],
      [-0.00055, 3],
      [-0.00056, 3],
      [-0.00058, 3],
      [-0.00065, 0],
      [-0.00049, 3],
      [-0.00073, 0],
      [-0.00055, 3],
      [0.00198, 1],
      [-0.00062, 0]
    ],
    "red_o_points": [],
    "y_categories": ["N", "NOT APPLICABLE", "Y", "nan"],
    "blue_o_points": [],
    "blue_x_points": [
      [0.00316, 1],
      [-0.00025, 3],
      [0.00311, 1],
      [-0.00072, 0],
      [-0.00025, 3],
      [0.00253, 1],
      [0.00211, 1]
    ]
  },
  "QS_mulBpsurgeryType[Graft]": {
    "red_x_points": [
      [-0.00051, 3],
      [-0.00079, 0],
      [-0.00076, 0],
      [-0.00076, 0],
      [-0.00053, 0],
      [-0.00082, 0],
      [-0.00079, 0],
      [-0.00047, 3],
      [-0.00067, 0],
      [-0.00068, 0],
      [-0.00083, 0],
      [-0.00047, 3],
      [0.00167, 1],
      [-0.00057, 3],
      [-0.0021, 2],
      [-0.00026, 3],
      [-0.00062, 0],
      [-0.0007, 0],
      [-0.00041, 3],
      [-0.00057, 3],
      [-0.00044, 3],
      [-0.0007, 0],
      [-0.00045, 3],
      [-0.00033, 3],
      [-0.00033, 3],
      [-0.00069, 0],
      [-0.00045, 3],
      [-0.00074, 0],
      [-0.00044, 3],
      [0.00167, 1],
      [-0.00073, 0]
    ],
    "red_o_points": [],
    "y_categories": ["N", "NOT APPLICABLE", "Y", "nan"],
    "blue_o_points": [],
    "blue_x_points": [
      [0.00257, 1],
      [-0.0001, 3],
      [0.00211, 1],
      [-0.00048, 0],
      [-7e-5, 3],
      [0.00255, 1],
      [0.0028, 1]
    ]
  },
  "QA_lstPexMuscstrength[WristExte]": {
    "red_x_points": [
      [-0.00328, 1],
      [-0.00058, 2],
      [-0.00142, 1],
      [-0.00144, 1],
      [0.00073, 0],
      [-0.0018, 1],
      [-0.00193, 1],
      [-0.00205, 0],
      [0.00126, 0],
      [0.00054, 0],
      [-0.00166, 1],
      [-0.00151, 0],
      [-0.00279, 2],
      [0.00182, 2],
      [-0.00033, 2],
      [-0.00162, 0],
      [-0.00017, 2],
      [0.00075, 0],
      [-0.00143, 0],
      [-0.0032, 1],
      [-0.00169, 0],
      [-0.00165, 1],
      [0.00192, 2],
      [-0.00172, 0],
      [-0.00386, 1],
      [0.00074, 0],
      [-0.00269, 1],
      [0.00066, 0],
      [0.00278, 2],
      [-0.0029, 2],
      [-0.00125, 1]
    ],
    "red_o_points": [],
    "y_categories": ["GREATER THAN OR EQUALS TO 3", "LESS THAN 3", "nan"],
    "blue_o_points": [],
    "blue_x_points": [
      [0.00157, 0],
      [0.00453, 2],
      [0.00122, 0],
      [0.00254, 0],
      [0.00464, 2],
      [0.00117, 1],
      [0.00131, 0]
    ]
  },
  "QS_mulLysisRoot[C6]": {
    "red_x_points": [
      [-0.00165, 3],
      [-0.00252, 0],
      [-0.00429, 2],
      [-0.00246, 0],
      [-0.00234, 0],
      [-0.0024, 0],
      [-0.00221, 0],
      [-0.00133, 3],
      [-0.00245, 0],
      [-0.0024, 0],
      [-0.00241, 0],
      [-0.00169, 3],
      [0.00616, 1],
      [-0.00124, 3],
      [-0.00218, 0],
      [-0.00182, 3],
      [-0.0023, 0],
      [-0.00248, 0],
      [-0.00167, 3],
      [-0.00146, 3],
      [-0.00149, 3],
      [-0.00221, 0],
      [-0.00145, 3],
      [-0.00148, 3],
      [-0.00154, 3],
      [-0.00233, 0],
      [-0.00148, 3],
      [-0.00222, 0],
      [-0.00136, 3],
      [0.00655, 1],
      [-0.00372, 2]
    ],
    "red_o_points": [],
    "y_categories": ["N", "NOT APPLICABLE", "Y", "nan"],
    "blue_o_points": [],
    "blue_x_points": [
      [0.00782, 1],
      [-0.00061, 3],
      [0.00801, 1],
      [-0.00197, 0],
      [-0.00037, 3],
      [0.00824, 1],
      [0.00826, 1]
    ]
  },
  "QA_lstPexPalle[Clavicle]": {
    "red_x_points": [
      [9e-5, 3],
      [2e-5, 3],
      [2e-5, 3],
      [2e-5, 3],
      [-0.00018, 2],
      [-5e-5, 2],
      [2e-5, 3],
      [2e-5, 3],
      [-5e-5, 2],
      [-5e-5, 2],
      [-6e-5, 0],
      [0.0008, 3],
      [2e-5, 3],
      [2e-5, 3],
      [2e-5, 3],
      [-1e-5, 0],
      [-6e-5, 0],
      [-6e-5, 0],
      [-0.0001, 2],
      [2e-5, 3],
      [-0.00283, 2],
      [2e-5, 3],
      [-0.00013, 2],
      [2e-5, 3],
      [-0.01604, 2],
      [-1e-5, 0]
    ],
    "red_o_points": [],
    "y_categories": ["HYPO", "NAIA", "PT", "nan"],
    "blue_o_points": [],
    "blue_x_points": [
      [0.00124, 3],
      [0.00028, 3],
      [0.00703, 0],
      [0.00029, 3],
      [0.00025, 3],
      [0.00189, 3],
      [0.00153, 3]
    ]
  },
  "QS_mulGraftNerve[FI]": {
    "red_x_points": [
      [-0.00053, 2],
      [-0.00135, 0],
      [-0.00129, 0],
      [-0.00131, 0],
      [-0.00134, 0],
      [-0.00133, 0],
      [-0.00125, 0],
      [-0.00053, 2],
      [-0.00143, 0],
      [-0.00126, 0],
      [-0.00134, 0],
      [-0.00075, 2],
      [0.00234, 1],
      [-0.00059, 2],
      [-0.0018, 0],
      [-0.00049, 2],
      [-0.00107, 0],
      [-0.00158, 0],
      [-0.00051, 2],
      [-0.0006, 2],
      [-0.00062, 2],
      [-0.00124, 0],
      [-0.00052, 2],
      [-0.00087, 2],
      [-0.00049, 2],
      [-0.00129, 0],
      [-0.00062, 2],
      [-0.00136, 0],
      [-0.00045, 2],
      [0.0027, 1],
      [-0.00136, 0]
    ],
    "red_o_points": [],
    "y_categories": ["N", "NOT APPLICABLE", "nan"],
    "blue_o_points": [],
    "blue_x_points": [
      [0.00458, 1],
      [-0.00012, 2],
      [0.00367, 1],
      [-6e-5, 0],
      [-0.00013, 2],
      [0.00376, 1],
      [0.00417, 1]
    ]
  },
  "QS_mulGraftNerve[LT]": {
    "red_x_points": [
      [-6e-5, 2],
      [-0.00013, 0],
      [-0.0001, 0],
      [-7e-5, 0],
      [-0.00016, 0],
      [-0.00013, 0],
      [-0.00023, 0],
      [-0.00012, 2],
      [-0.00023, 0],
      [-0.00013, 0],
      [-0.00016, 0],
      [-8e-5, 2],
      [0.00024, 1],
      [-3e-5, 2],
      [-0.00019, 0],
      [-0.00012, 2],
      [-0.00012, 0],
      [-0.0001, 0],
      [-2e-5, 2],
      [-5e-5, 2],
      [-5e-5, 2],
      [-0.00013, 0],
      [-6e-5, 2],
      [-5e-5, 2],
      [-8e-5, 2],
      [-0.00014, 0],
      [-6e-5, 2],
      [-0.00018, 0],
      [-4e-5, 2],
      [0.00044, 1],
      [-0.00013, 0]
    ],
    "red_o_points": [],
    "y_categories": ["N", "NOT APPLICABLE", "nan"],
    "blue_o_points": [],
    "blue_x_points": [
      [0.00039, 1],
      [-2e-5, 2],
      [0.00035, 1],
      [-8e-5, 0],
      [6e-5, 2],
      [0.00054, 1],
      [0.0005, 1]
    ]
  },
  "QS_mulLysisRoot[C5]": {
    "red_x_points": [
      [-0.00119, 3],
      [-0.00168, 0],
      [-0.00371, 2],
      [-0.00188, 0],
      [-0.00223, 0],
      [-0.00178, 0],
      [-0.00188, 0],
      [-0.0014, 3],
      [-0.0021, 0],
      [-0.00195, 0],
      [-0.00213, 0],
      [-0.00149, 3],
      [0.00629, 1],
      [-0.00127, 3],
      [-0.00186, 0],
      [-0.00146, 3],
      [-0.00171, 0],
      [-0.0022, 0],
      [-0.00154, 3],
      [-0.00101, 3],
      [-0.0014, 3],
      [-0.00182, 0],
      [-0.00146, 3],
      [-0.00152, 3],
      [-0.00136, 3],
      [-0.00204, 0],
      [-0.00146, 3],
      [-0.00194, 0],
      [-0.00123, 3],
      [0.00627, 1],
      [-0.00373, 2]
    ],
    "red_o_points": [],
    "y_categories": ["N", "NOT APPLICABLE", "Y", "nan"],
    "blue_o_points": [],
    "blue_x_points": [
      [0.0087, 1],
      [-0.00076, 3],
      [0.00618, 1],
      [-0.00158, 0],
      [-0.00034, 3],
      [0.00773, 1],
      [0.00682, 1]
    ]
  },
  "QS_mulNeuromadSite[C4]": {
    "red_x_points": [
      [-0.00062, 2],
      [-0.00202, 0],
      [-0.002, 0],
      [-0.00188, 0],
      [-0.00224, 0],
      [-0.00221, 0],
      [-0.00203, 0],
      [-0.00069, 2],
      [-0.00208, 0],
      [-0.00225, 0],
      [-0.00178, 0],
      [-0.00086, 2],
      [0.00359, 1],
      [-0.00061, 2],
      [-0.00205, 0],
      [-0.00088, 2],
      [-0.00209, 0],
      [-0.00204, 0],
      [-0.00093, 2],
      [-0.00054, 2],
      [-0.00068, 2],
      [-0.0017, 0],
      [-0.00062, 2],
      [-0.0007, 2],
      [-0.00071, 2],
      [-0.00182, 0],
      [-0.00054, 2],
      [-0.0021, 0],
      [-0.00063, 2],
      [0.00372, 1],
      [-0.00184, 0]
    ],
    "red_o_points": [],
    "y_categories": ["N", "NOT APPLICABLE", "nan"],
    "blue_o_points": [],
    "blue_x_points": [
      [0.00597, 1],
      [6e-5, 2],
      [0.00446, 1],
      [-0.00019, 0],
      [-0.00018, 2],
      [0.00441, 1],
      [0.00614, 1]
    ]
  },
  "QA_lstPexMuscstrength[ShoulderExrot]": {
    "red_x_points": [
      [-0.00195, 1],
      [0.0002, 2],
      [0.0017, 0],
      [-0.00165, 1],
      [-0.00179, 1],
      [-0.00148, 1],
      [0.00017, 2],
      [-0.00164, 1],
      [-0.00118, 1],
      [-0.00129, 1],
      [0.00024, 2],
      [-0.00132, 1],
      [7e-5, 2],
      [0.00021, 2],
      [0.00021, 2],
      [0.00032, 2],
      [0.00027, 2],
      [-0.00171, 1],
      [-0.00133, 1],
      [-0.00143, 1],
      [-0.00166, 1],
      [0.00023, 2],
      [0.00018, 2],
      [0.00023, 2],
      [0.00025, 2],
      [-0.00164, 1],
      [0.00022, 2],
      [0.00182, 0],
      [0.00017, 2],
      [-2e-5, 2],
      [-0.00145, 1]
    ],
    "red_o_points": [],
    "y_categories": ["GREATER THAN OR EQUALS TO 3", "LESS THAN 3", "nan"],
    "blue_o_points": [],
    "blue_x_points": [
      [-8e-5, 2],
      [0.00028, 2],
      [0.00394, 0],
      [0.00044, 2],
      [0.00028, 2],
      [0.00357, 0],
      [-1e-5, 1]
    ]
  },
  "QS_mulGraftNerve[MC]": {
    "red_x_points": [
      [-0.0001, 2],
      [-0.00031, 0],
      [-0.00044, 0],
      [-0.00033, 0],
      [-0.00023, 0],
      [-0.0002, 0],
      [-0.00043, 0],
      [-0.00023, 2],
      [-0.00026, 0],
      [-0.00048, 0],
      [-0.00018, 0],
      [-0.00015, 2],
      [0.00049, 1],
      [-0.00019, 2],
      [-0.00041, 0],
      [-0.00023, 2],
      [-0.00028, 0],
      [-0.00035, 0],
      [-0.0001, 2],
      [-0.0001, 2],
      [-8e-5, 2],
      [-0.00022, 0],
      [-0.00025, 2],
      [-6e-5, 2],
      [-0.00025, 2],
      [-0.00026, 0],
      [-0.00013, 2],
      [-0.00032, 0],
      [-0.00018, 2],
      [0.0008, 1],
      [-0.0002, 0]
    ],
    "red_o_points": [],
    "y_categories": ["N", "NOT APPLICABLE", "nan"],
    "blue_o_points": [],
    "blue_x_points": [
      [0.00142, 1],
      [-5e-5, 2],
      [0.0008, 1],
      [-1e-5, 0],
      [-4e-5, 2],
      [0.00092, 1],
      [0.00098, 1]
    ]
  },
  "QS_mulGraftRoot[C8]": {
    "red_x_points": [
      [-3e-5, 0],
      [-3e-5, 0],
      [-3e-5, 0],
      [-3e-5, 0],
      [-3e-5, 0],
      [-3e-5, 0],
      [-3e-5, 0],
      [-3e-5, 0],
      [-1e-5, 2],
      [9e-5, 1],
      [-1e-5, 2],
      [-1e-5, 2],
      [-3e-5, 0],
      [-1e-5, 2],
      [-1e-5, 2],
      [-1e-5, 2],
      [-3e-5, 0],
      [-1e-5, 2],
      [-1e-5, 2],
      [-1e-5, 2],
      [-3e-5, 0],
      [-3e-5, 0],
      [9e-5, 1]
    ],
    "red_o_points": [],
    "y_categories": ["N", "NOT APPLICABLE", "nan"],
    "blue_o_points": [],
    "blue_x_points": [[9e-5, 1], [-3e-5, 0], [-1e-5, 2], [9e-5, 1], [9e-5, 1]]
  },
  "QA_yonPreOrtsurg": {
    "red_x_points": [
      [-0.00401, 0],
      [-6e-5, 2],
      [-4e-5, 0],
      [-0.00011, 0],
      [-0.0001, 0],
      [-1e-5, 0],
      [-5e-5, 0],
      [-0.00035, 2],
      [-6e-5, 0],
      [-3e-5, 0],
      [-0.00029, 2],
      [0.00641, 1],
      [-0.00069, 0],
      [-0.00033, 2],
      [-0.00017, 0],
      [-0.00502, 0],
      [-0.00019, 1],
      [-0.00013, 0],
      [-0.00399, 0],
      [-0.00472, 0],
      [-0.0043, 0],
      [-0.00014, 0],
      [-0.00383, 0],
      [-0.00564, 0],
      [-0.00436, 0],
      [-0.00011, 2],
      [-0.0009, 2],
      [-4e-5, 0],
      [-0.00056, 2],
      [-3e-5, 2],
      [0.00011, 1]
    ],
    "red_o_points": [],
    "y_categories": ["N", "Y", "nan"],
    "blue_o_points": [],
    "blue_x_points": [
      [-2e-5, 0],
      [0.00264, 2],
      [-0.00013, 0],
      [-8e-5, 0],
      [0.01825, 1],
      [-0.00016, 0],
      [-0.00014, 0]
    ]
  },
  "QS_mulGraftNerve[Ra]": {
    "red_x_points": [
      [-0.00043, 2],
      [-0.00077, 0],
      [-0.00071, 0],
      [-0.00058, 0],
      [-0.00072, 0],
      [-0.00075, 0],
      [-0.0005, 0],
      [-0.00021, 2],
      [-0.00074, 0],
      [-0.0007, 0],
      [-0.00071, 0],
      [-0.00031, 2],
      [0.0005, 1],
      [-0.00042, 2],
      [-0.00056, 0],
      [-0.00027, 2],
      [-0.00054, 0],
      [-0.00081, 0],
      [-0.00041, 2],
      [-0.00032, 2],
      [-0.0003, 2],
      [-0.00045, 0],
      [-0.00043, 2],
      [-0.00046, 2],
      [-0.00037, 2],
      [-0.00064, 0],
      [-0.00041, 2],
      [-0.00082, 0],
      [-0.00024, 2],
      [0.00167, 1],
      [-0.00054, 0]
    ],
    "red_o_points": [],
    "y_categories": ["N", "NOT APPLICABLE", "nan"],
    "blue_o_points": [],
    "blue_x_points": [
      [0.00297, 1],
      [-0.00013, 2],
      [0.00128, 1],
      [0.00031, 0],
      [-0.00012, 2],
      [0.00172, 1],
      [0.00147, 1]
    ]
  },
  "QS_mulTransfSite[Oberlin]": {
    "red_x_points": [
      [-0.00343, 3],
      [-0.00931, 0],
      [-0.01013, 0],
      [-0.0091, 0],
      [-0.00448, 2],
      [-0.00409, 2],
      [-0.01032, 0],
      [-0.00341, 3],
      [-0.00476, 2],
      [-0.00454, 2],
      [-0.00405, 2],
      [-0.00292, 3],
      [0.017, 1],
      [-0.00357, 3],
      [-0.00428, 2],
      [-0.00376, 3],
      [-0.00946, 0],
      [-0.00462, 2],
      [-0.00331, 3],
      [-0.00333, 3],
      [-0.00308, 3],
      [-0.00999, 0],
      [-0.00359, 3],
      [-0.0036, 3],
      [-0.00343, 3],
      [-0.00449, 2],
      [-0.00318, 3],
      [-0.00981, 0],
      [-0.00331, 3],
      [0.01838, 1],
      [-0.00923, 0]
    ],
    "red_o_points": [],
    "y_categories": ["N", "NOT APPLICABLE", "Y", "nan"],
    "blue_o_points": [],
    "blue_x_points": [
      [0.02356, 1],
      [-0.00142, 3],
      [0.01869, 1],
      [0.00032, 2],
      [-0.00132, 3],
      [0.0176, 1],
      [0.01852, 1]
    ]
  },
  "QA_lstPexKine[Index]": {
    "red_x_points": [
      [-0.00075, 0],
      [-0.00011, 2],
      [-0.0002, 2],
      [-0.0002, 2],
      [6e-5, 1],
      [0.00025, 1],
      [-0.00099, 0],
      [0.00013, 2],
      [0.00025, 1],
      [6e-5, 1],
      [0.00019, 1],
      [-0.00022, 1],
      [-5e-5, 2],
      [0.00038, 2],
      [0.0002, 1],
      [0.00013, 2],
      [-0.00014, 2],
      [6e-5, 1],
      [-0.00016, 1],
      [-0.00068, 0],
      [-0.00023, 1],
      [-0.00033, 2],
      [0.00026, 2],
      [-0.00031, 1],
      [-1e-5, 2],
      [-0.00037, 2],
      [-0.00026, 1],
      [-6e-5, 2],
      [-0.00035, 1],
      [-0.00013, 2],
      [-0.00036, 0]
    ],
    "red_o_points": [],
    "y_categories": ["NPV", "PV", "nan"],
    "blue_o_points": [],
    "blue_x_points": [
      [0.0002, 1],
      [0.00056, 2],
      [3e-5, 1],
      [0.00092, 1],
      [0.00045, 2],
      [7e-5, 1],
      [-1e-5, 2]
    ]
  },
  "QA_lstPexPalle[Ulna]": {
    "red_x_points": [
      [4e-5, 3],
      [-9e-5, 2],
      [-0.00018, 1],
      [4e-5, 3],
      [-9e-5, 2],
      [-9e-5, 2],
      [-9e-5, 2],
      [7e-5, 3],
      [-9e-5, 0]
    ],
    "red_o_points": [],
    "y_categories": ["ABS", "HYPO", "PT", "nan"],
    "blue_o_points": [],
    "blue_x_points": [[0.00012, 3]]
  }
}
