{
  "QA_lstPexMuscstrength[ElbowFlex]": {
    "red_x_points": [
      [-0.01184, 1],
      [-0.00048, 2],
      [-0.01091, 1],
      [-0.01046, 1],
      [-0.01105, 1],
      [-0.01166, 1],
      [-0.01126, 1],
      [-0.01093, 1],
      [-0.01108, 1],
      [-0.01227, 1],
      [-0.01144, 1],
      [-0.01222, 1],
      [-0.00058, 2],
      [-0.00224, 2],
      [0.00121, 2],
      [-0.01209, 1],
      [-0.0113, 1],
      [-0.01076, 1],
      [-0.01074, 1],
      [-0.01181, 1],
      [-0.00065, 2],
      [-0.01119, 1],
      [-0.01184, 1],
      [-0.01177, 1],
      [-0.01049, 1],
      [0.00081, 2],
      [-0.01003, 1],
      [-0.01157, 1],
      [-0.00052, 2]
    ],
    "red_o_points": [],
    "y_categories": ["GREATER THAN OR EQUALS TO 3", "LESS THAN 3", "nan"],
    "blue_o_points": [],
    "blue_x_points": [
      [0.00177, 2],
      [-0.01048, 1],
      [0.05748, 0],
      [-0.01103, 1],
      [0.003, 2],
      [0.00279, 2],
      [0.04073, 0],
      [-0.00981, 1],
      [-0.01059, 1],
      [0.00224, 2],
      [0.05596, 0],
      [0.04349, 0],
      [0.05148, 0],
      [0.04446, 0],
      [-0.01034, 1]
    ]
  },
  "QS_mulGraftNerve[other]": {
    "red_x_points": [
      [-1e-5, 2],
      [-0.00011, 0],
      [-0.00013, 0],
      [-2e-5, 0],
      [-0.0001, 0],
      [-1e-5, 0],
      [-0.00018, 0],
      [-4e-5, 2],
      [-0.00011, 0],
      [-5e-5, 0],
      [-1e-5, 2],
      [-0.00016, 0],
      [-3e-5, 2],
      [-0.00012, 0],
      [-0.0002, 0],
      [1e-5, 2],
      [1e-5, 2],
      [1e-5, 2],
      [-4e-5, 0],
      [1e-5, 2],
      [-3e-5, 2],
      [-6e-5, 2],
      [-0.00016, 0],
      [-0.00021, 0],
      [-4e-5, 2],
      [-4e-5, 2],
      [-5e-5, 0],
      [-4e-5, 2]
    ],
    "red_o_points": [],
    "y_categories": ["N", "NOT APPLICABLE", "nan"],
    "blue_o_points": [],
    "blue_x_points": [
      [0.00069, 1],
      [-2e-5, 2],
      [-1e-5, 0],
      [-2e-5, 0],
      [-0.0, 2],
      [0.00056, 1],
      [-0.0001, 0],
      [0.0, 2],
      [-2e-5, 2],
      [-1e-5, 0],
      [0.00055, 1],
      [1e-5, 2],
      [0.00027, 1],
      [-1e-5, 2]
    ]
  },
  "QS_mulLysisTrunk[Upper]": {
    "red_x_points": [
      [-0.00063, 3],
      [-0.00623, 0],
      [-0.00372, 0],
      [-0.00318, 0],
      [-0.00369, 0],
      [-0.01521, 2],
      [-0.00395, 0],
      [-0.00084, 3],
      [-0.00409, 0],
      [-0.00346, 0],
      [-0.00103, 3],
      [-0.00407, 0],
      [-0.00113, 3],
      [-0.00579, 0],
      [-0.01313, 2],
      [-0.00132, 3],
      [-0.00084, 3],
      [-0.00083, 3],
      [-0.00376, 0],
      [-0.00091, 3],
      [-0.00089, 3],
      [-0.00093, 3],
      [-0.00414, 0],
      [-0.0042, 0],
      [-0.00125, 3],
      [0.01462, 1],
      [-0.00094, 3],
      [-0.01343, 2],
      [-0.00108, 3]
    ],
    "red_o_points": [],
    "y_categories": ["N", "NOT APPLICABLE", "Y", "nan"],
    "blue_o_points": [],
    "blue_x_points": [
      [0.02662, 1],
      [-0.00027, 3],
      [-0.00173, 0],
      [-0.00166, 0],
      [7e-5, 3],
      [0.02226, 1],
      [0.01559, 1],
      [-0.00219, 0],
      [-0.00031, 3],
      [-9e-5, 3],
      [-0.00157, 0],
      [0.01816, 1],
      [-0.00035, 3],
      [0.01654, 1],
      [-0.00099, 3]
    ]
  },
  "QS_mulBpsurgeryType[Transf]": {
    "red_x_points": [
      [-0.0, 3],
      [-0.00052, 2],
      [-0.00287, 0],
      [-0.00034, 2],
      [-0.0004, 2],
      [-0.00035, 2],
      [-0.00052, 2],
      [-0.00015, 3],
      [-0.0005, 2],
      [-0.00031, 2],
      [-4e-5, 3],
      [-0.00041, 2],
      [-6e-5, 3],
      [-0.00045, 2],
      [-0.00026, 2],
      [-4e-5, 3],
      [-2e-5, 3],
      [-3e-5, 3],
      [-0.00028, 2],
      [-4e-5, 3],
      [-0.00012, 3],
      [-9e-5, 3],
      [-0.0004, 2],
      [-0.00032, 2],
      [-0.00017, 3],
      [0.00133, 1],
      [-0.00011, 3],
      [-0.00032, 2],
      [-0.00017, 3]
    ],
    "red_o_points": [],
    "y_categories": ["N", "NOT APPLICABLE", "Y", "nan"],
    "blue_o_points": [],
    "blue_x_points": [
      [0.00308, 1],
      [-5e-5, 3],
      [-4e-5, 2],
      [-0.00012, 2],
      [1e-5, 3],
      [0.00083, 1],
      [0.00113, 1],
      [-0.00015, 2],
      [0.00022, 3],
      [-4e-5, 3],
      [-5e-5, 2],
      [0.00161, 1],
      [0.0, 3],
      [0.00155, 1],
      [-1e-5, 3]
    ]
  },
  "QS_mulGraftNerve[Ac]": {
    "red_x_points": [
      [-3e-5, 2],
      [-1e-5, 0],
      [1e-5, 0],
      [-2e-5, 0],
      [1e-5, 0],
      [-2e-5, 0],
      [-2e-5, 2],
      [-2e-5, 0],
      [-3e-5, 2],
      [-1e-5, 0],
      [-3e-5, 2],
      [-3e-5, 2],
      [-5e-5, 2],
      [-2e-5, 0],
      [1e-5, 0],
      [-2e-5, 2]
    ],
    "red_o_points": [],
    "y_categories": ["N", "NOT APPLICABLE", "nan"],
    "blue_o_points": [],
    "blue_x_points": [[0.00031, 1], [1e-5, 0], [1e-5, 0], [-3e-5, 2], [1e-5, 0]]
  },
  "QS_mulNeuromadSite[C8]": {
    "red_x_points": [
      [-4e-5, 2],
      [-0.00059, 0],
      [-0.00028, 0],
      [-0.00038, 0],
      [-0.00039, 0],
      [-0.00015, 0],
      [-0.00048, 0],
      [-0.00015, 2],
      [-0.00053, 0],
      [-0.00031, 0],
      [-2e-5, 2],
      [-0.00038, 0],
      [-8e-5, 2],
      [-0.00066, 0],
      [-0.00053, 0],
      [-6e-5, 2],
      [-2e-5, 2],
      [-6e-5, 2],
      [-0.00017, 0],
      [-4e-5, 2],
      [-0.00011, 2],
      [-0.00014, 2],
      [-0.00035, 0],
      [-0.00036, 0],
      [-8e-5, 2],
      [0.00083, 1],
      [-9e-5, 2],
      [-0.00022, 0],
      [-0.00011, 2]
    ],
    "red_o_points": [],
    "y_categories": ["N", "NOT APPLICABLE", "nan"],
    "blue_o_points": [],
    "blue_x_points": [
      [0.00245, 1],
      [-0.00011, 2],
      [-0.00018, 0],
      [-0.0002, 0],
      [0.00011, 2],
      [0.00142, 1],
      [0.00086, 1],
      [-0.00023, 0],
      [-7e-5, 2],
      [5e-5, 2],
      [-0.0001, 0],
      [0.00103, 1],
      [-4e-5, 2],
      [0.00099, 1],
      [-4e-5, 2]
    ]
  },
  "QS_mulGraftNerve[Ph]": {
    "red_x_points": [
      [1e-5, 2],
      [-0.00018, 0],
      [-9e-5, 0],
      [-3e-5, 0],
      [-3e-5, 0],
      [1e-5, 2],
      [-3e-5, 0],
      [-9e-5, 0],
      [1e-5, 2],
      [-0.00028, 0],
      [-0.00021, 0],
      [-6e-5, 0],
      [4e-5, 2],
      [1e-5, 2],
      [-6e-5, 0],
      [-3e-5, 0],
      [0.0, 2],
      [0.00013, 1],
      [1e-5, 2],
      [1e-5, 2]
    ],
    "red_o_points": [],
    "y_categories": ["N", "NOT APPLICABLE", "nan"],
    "blue_o_points": [],
    "blue_x_points": [
      [0.00035, 1],
      [1e-5, 2],
      [0.0, 2],
      [0.00025, 1],
      [1e-5, 2],
      [3e-5, 2],
      [0.0001, 1],
      [0.0, 2],
      [7e-5, 1]
    ]
  },
  "QS_mulTransfSite[AcSsPA]": {
    "red_x_points": [
      [-8e-5, 3],
      [-0.00063, 0],
      [-0.00064, 0],
      [-0.00049, 0],
      [-0.00044, 0],
      [-0.00047, 0],
      [-0.00051, 0],
      [-4e-5, 3],
      [-0.00064, 0],
      [-0.00054, 0],
      [-4e-5, 3],
      [-0.00044, 0],
      [-0.00012, 3],
      [-0.00068, 0],
      [-0.00204, 2],
      [-4e-5, 3],
      [-7e-5, 3],
      [-3e-5, 3],
      [-0.00054, 0],
      [-9e-5, 3],
      [-8e-5, 3],
      [-6e-5, 3],
      [-0.00058, 0],
      [-0.00053, 0],
      [-3e-5, 3],
      [0.00172, 1],
      [-5e-5, 3],
      [-0.00049, 0],
      [-0.00012, 3]
    ],
    "red_o_points": [],
    "y_categories": ["N", "NOT APPLICABLE", "Y", "nan"],
    "blue_o_points": [],
    "blue_x_points": [
      [0.00265, 1],
      [-1e-5, 3],
      [-0.00037, 0],
      [-0.00039, 0],
      [-4e-5, 3],
      [0.00192, 1],
      [0.002, 1],
      [-0.00036, 0],
      [-5e-5, 3],
      [-1e-5, 3],
      [-0.00033, 0],
      [0.00173, 1],
      [-4e-5, 3],
      [0.00213, 1],
      [-4e-5, 3]
    ]
  },
  "QA_lstPexPalle[Elbow]": {
    "red_x_points": [
      [-0.00076, 4],
      [-0.00321, 4],
      [-0.00205, 4],
      [-0.00169, 3],
      [-0.00371, 4],
      [-0.00154, 3],
      [-0.00355, 4],
      [-0.00059, 4],
      [-0.00462, 4],
      [-0.00188, 3],
      [-0.00467, 1],
      [-0.00537, 4],
      [-0.00095, 4],
      [-0.00479, 4],
      [-0.00159, 4],
      [0.00062, 3],
      [-0.01036, 0],
      [0.00047, 3],
      [-0.00729, 2],
      [0.00066, 3],
      [-0.00075, 4],
      [-0.00051, 4],
      [-0.00552, 4],
      [-0.00472, 4],
      [-0.00027, 4],
      [-0.02987, 3],
      [-0.0004, 4],
      [-0.00641, 0],
      [-0.00071, 4]
    ],
    "red_o_points": [],
    "y_categories": ["ABS", "HYPO", "NAIA", "PT", "nan"],
    "blue_o_points": [],
    "blue_x_points": [
      [0.00513, 4],
      [-8e-5, 4],
      [0.00324, 3],
      [0.03767, 1],
      [0.00011, 4],
      [0.00539, 4],
      [0.01159, 1],
      [-0.00315, 4],
      [0.00041, 4],
      [0.0004, 4],
      [0.02758, 1],
      [0.00513, 4],
      [0.00221, 3],
      [0.00541, 4],
      [0.005, 3]
    ]
  },
  "participant_code": {
    "red_x_points": [
      [-0.03613, 1],
      [-0.03524, 2],
      [-0.03544, 3],
      [-0.03496, 4],
      [-0.0351, 5],
      [-0.03483, 8],
      [-0.03565, 9],
      [-0.03421, 10],
      [-0.03325, 11],
      [-0.03551, 13],
      [-0.03531, 14],
      [-0.03394, 18],
      [-0.03517, 19],
      [-0.0362, 20],
      [-0.03359, 23],
      [-0.03407, 26],
      [-0.0349, 28],
      [-0.03524, 29],
      [-0.03496, 30],
      [-0.03517, 31],
      [-0.03476, 32],
      [-0.03517, 34],
      [-0.03544, 36],
      [-0.03373, 38],
      [-0.0349, 39],
      [-0.03448, 40],
      [-0.03544, 41],
      [-0.03442, 42],
      [-0.0351, 43]
    ],
    "red_o_points": [],
    "y_categories": [
      "P16554",
      "P18297",
      "P19283",
      "P19287",
      "P23172",
      "P23391",
      "P30595",
      "P31645",
      "P31691",
      "P34778",
      "P35046",
      "P36328",
      "P43633",
      "P4544",
      "P46417",
      "P48965",
      "P53068",
      "P5497",
      "P58556",
      "P59529",
      "P62483",
      "P64658",
      "P65202",
      "P66816",
      "P6751",
      "P7408",
      "P75566",
      "P76226",
      "P79971",
      "P82621",
      "P82990",
      "P84549",
      "P84932",
      "P85825",
      "P86989",
      "P8770",
      "P87791",
      "P90550",
      "P93159",
      "P94969",
      "P96710",
      "P97130",
      "P9744",
      "P98500",
      "nan"
    ],
    "blue_o_points": [],
    "blue_x_points": [
      [0.06688, 0],
      [0.06518, 6],
      [0.06767, 7],
      [0.0661, 12],
      [0.06833, 15],
      [0.06899, 16],
      [0.06307, 17],
      [0.06675, 21],
      [0.0678, 22],
      [0.06964, 24],
      [0.07083, 25],
      [0.06715, 27],
      [0.06741, 33],
      [0.06728, 35],
      [0.06925, 37]
    ]
  },
  "QA_yonInjChesttube": {
    "red_x_points": [
      [-0.00289, 2],
      [-0.00288, 2],
      [0.0028, 0],
      [-0.00248, 2],
      [-0.00361, 2],
      [0.00137, 0],
      [-0.00585, 1],
      [-0.00213, 2],
      [-0.00452, 2],
      [-0.00354, 2],
      [0.00131, 0],
      [0.00365, 0],
      [-0.00437, 2],
      [-0.00327, 2],
      [0.00075, 0],
      [0.001, 0],
      [0.00106, 0],
      [0.00138, 0],
      [-0.00367, 1],
      [-0.00199, 2],
      [-0.01937, 1],
      [-0.00392, 2],
      [-0.00436, 2],
      [0.00373, 0],
      [-0.0029, 2],
      [-0.00012, 2],
      [-0.00322, 2],
      [0.00079, 0],
      [-0.00385, 2]
    ],
    "red_o_points": [],
    "y_categories": ["N", "Y", "nan"],
    "blue_o_points": [],
    "blue_x_points": [
      [2e-5, 1],
      [-0.00072, 2],
      [0.00434, 0],
      [0.00629, 0],
      [-0.0024, 2],
      [-3e-5, 2],
      [0.00749, 0],
      [0.0201, 0],
      [0.01543, 0],
      [0.00395, 0],
      [-0.00011, 2],
      [0.00632, 0],
      [-5e-5, 2],
      [0.00045, 2]
    ]
  },
  "QS_lstBpsurgSide": {
    "red_x_points": [
      [-0.00074, 3],
      [-0.01248, 0],
      [-0.01442, 0],
      [-0.01052, 0],
      [-0.01337, 0],
      [-0.01236, 0],
      [-0.01301, 0],
      [-0.00121, 3],
      [-0.0132, 0],
      [0.00101, 2],
      [-0.00095, 3],
      [0.00085, 2],
      [-0.00159, 3],
      [0.00025, 2],
      [-0.00251, 2],
      [-0.0008, 3],
      [-0.0007, 3],
      [-0.0004, 3],
      [-0.00812, 0],
      [-0.00067, 3],
      [-0.00143, 3],
      [-0.00138, 3],
      [0.00046, 2],
      [0.00057, 2],
      [-0.00114, 3],
      [0.01475, 1],
      [-0.00115, 3],
      [-0.01057, 0],
      [-0.00152, 3]
    ],
    "red_o_points": [],
    "y_categories": ["L", "NOT APPLICABLE", "R", "nan"],
    "blue_o_points": [],
    "blue_x_points": [
      [0.03199, 1],
      [-0.00046, 3],
      [0.00436, 2],
      [0.00724, 2],
      [0.0002, 3],
      [0.01717, 1],
      [0.01363, 1],
      [-0.00312, 0],
      [-0.00072, 3],
      [3e-5, 3],
      [0.00363, 2],
      [0.01722, 1],
      [-0.0001, 3],
      [0.01596, 1],
      [-0.00069, 3]
    ]
  },
  "QA_mulInjOrthesisType[ShoulderSupport]": {
    "red_x_points": [
      [-0.00903, 0],
      [-0.00886, 0],
      [-0.00919, 0],
      [-0.0336, 2],
      [-0.00873, 0],
      [-0.00914, 0],
      [-0.00901, 0],
      [-0.03393, 2],
      [-0.00927, 0],
      [-0.00886, 0],
      [-0.00887, 0],
      [-0.00912, 0],
      [-0.00884, 0],
      [-0.00886, 0],
      [-0.0338, 2],
      [-0.00927, 0],
      [-0.009, 0],
      [-0.03307, 2],
      [-0.0331, 3],
      [-0.00892, 0],
      [-0.00878, 0],
      [-0.009, 0],
      [-0.00904, 0],
      [-0.00894, 0],
      [-0.03462, 3],
      [-0.03442, 3],
      [-0.0327, 3],
      [-0.00927, 0],
      [-0.00885, 0]
    ],
    "red_o_points": [],
    "y_categories": ["N", "NOT APPLICABLE", "Y", "nan"],
    "blue_o_points": [],
    "blue_x_points": [
      [-0.00865, 0],
      [-0.00846, 0],
      [-0.00894, 0],
      [-0.00863, 0],
      [0.06659, 1],
      [0.06469, 1],
      [0.06478, 1],
      [0.06465, 1],
      [-0.00826, 0],
      [0.06479, 1],
      [-0.00849, 0],
      [0.06346, 1],
      [0.06587, 1],
      [0.06366, 1],
      [-0.00899, 0]
    ]
  },
  "QA_yonInjUnconscio": {
    "red_x_points": [
      [-0.0161, 1],
      [-0.0154, 1],
      [-0.00204, 2],
      [-0.00235, 2],
      [-0.0022, 2],
      [-0.01731, 1],
      [-0.0018, 2],
      [-0.00273, 2],
      [-0.00221, 2],
      [-0.01673, 1],
      [-0.01585, 1],
      [-0.01742, 1],
      [-0.00402, 2],
      [-0.00261, 2],
      [-0.0111, 1],
      [-0.01603, 1],
      [-0.01627, 1],
      [-0.01204, 1],
      [-0.01195, 1],
      [-0.01564, 1],
      [-0.00424, 2],
      [-0.00283, 2],
      [-0.01798, 1],
      [-0.01665, 1],
      [-0.00309, 2],
      [-0.00269, 2],
      [-0.00321, 2],
      [-0.01598, 1],
      [-0.00387, 2]
    ],
    "red_o_points": [],
    "y_categories": ["N", "Y", "nan"],
    "blue_o_points": [],
    "blue_x_points": [
      [-0.00147, 2],
      [-0.00192, 2],
      [0.05738, 0],
      [-0.00073, 2],
      [-0.00811, 1],
      [-0.00882, 1],
      [0.03837, 0],
      [0.04885, 0],
      [-0.00159, 2],
      [0.04592, 0],
      [0.05724, 0],
      [-0.00224, 2],
      [-0.01031, 1],
      [-0.00204, 2],
      [0.06184, 0]
    ]
  },
  "QA_lstPexInspectio[SurgicalScar]": {
    "red_x_points": [
      [-0.00422, 1],
      [-0.00538, 1],
      [-0.00765, 0],
      [-0.00444, 1],
      [-0.00761, 1],
      [-0.01351, 0],
      [-0.00733, 1],
      [-0.003, 1],
      [-0.0108, 1],
      [-0.01267, 1],
      [-0.01074, 0],
      [-0.01089, 1],
      [0.00085, 2],
      [-0.01275, 1],
      [-0.00593, 0],
      [0.00855, 2],
      [0.00481, 2],
      [-0.00589, 1],
      [-0.00445, 1],
      [-0.00746, 1],
      [0.0007, 2],
      [-0.00401, 1],
      [-0.01106, 1],
      [0.0147, 2],
      [-0.00394, 1],
      [-0.00702, 1],
      [-0.00256, 1],
      [0.00622, 2],
      [-0.0044, 1]
    ],
    "red_o_points": [],
    "y_categories": ["ABS", "NAIA", "PT", "nan"],
    "blue_o_points": [],
    "blue_x_points": [
      [-0.0012, 1],
      [0.01215, 2],
      [0.0303, 2],
      [0.03762, 2],
      [0.00061, 1],
      [0.00045, 1],
      [0.00108, 0],
      [-0.00553, 1],
      [-0.00082, 1],
      [0.00185, 1],
      [0.02603, 2],
      [-0.00042, 1],
      [0.00945, 2],
      [0.00644, 0],
      [0.01388, 2]
    ]
  },
  "QS_mulBpsurgeryType[Lysis]": {
    "red_x_points": [
      [-0.00068, 3],
      [-0.00574, 0],
      [-0.01857, 2],
      [-0.01606, 2],
      [-0.0035, 0],
      [-0.01809, 2],
      [-0.00331, 0],
      [-0.00141, 3],
      [-0.00326, 0],
      [-0.00301, 0],
      [-0.00081, 3],
      [-0.00363, 0],
      [-0.00152, 3],
      [-0.00576, 0],
      [-0.01606, 2],
      [-0.00097, 3],
      [-0.00084, 3],
      [-0.00085, 3],
      [-0.00301, 0],
      [-0.00082, 3],
      [-0.00155, 3],
      [-0.00118, 3],
      [-0.00378, 0],
      [-0.00318, 0],
      [-0.00138, 3],
      [0.02003, 1],
      [-0.00143, 3],
      [-0.0175, 2],
      [-0.00138, 3]
    ],
    "red_o_points": [],
    "y_categories": ["N", "NOT APPLICABLE", "Y", "nan"],
    "blue_o_points": [],
    "blue_x_points": [
      [0.03524, 1],
      [-0.00061, 3],
      [-0.00059, 0],
      [-0.00088, 0],
      [0.00036, 3],
      [0.02665, 1],
      [0.01846, 1],
      [-0.00144, 0],
      [-0.00053, 3],
      [-6e-5, 3],
      [-0.00108, 0],
      [0.02156, 1],
      [-0.00041, 3],
      [0.02326, 1],
      [-0.00067, 3]
    ]
  },
  "QS_mulLysisSite[Trunk]": {
    "red_x_points": [
      [-0.00044, 3],
      [-0.00486, 0],
      [-0.00311, 0],
      [-0.0026, 0],
      [-0.00309, 0],
      [-0.01254, 2],
      [-0.00328, 0],
      [-0.00066, 3],
      [-0.00295, 0],
      [-0.00281, 0],
      [-0.00054, 3],
      [-0.00305, 0],
      [-0.0007, 3],
      [-0.00433, 0],
      [-0.01078, 2],
      [-0.00045, 3],
      [-0.0004, 3],
      [-0.00042, 3],
      [-0.00286, 0],
      [-0.00038, 3],
      [-0.00082, 3],
      [-0.00053, 3],
      [-0.00327, 0],
      [-0.00289, 0],
      [-0.0006, 3],
      [0.0109, 1],
      [-0.00068, 3],
      [-0.01114, 2],
      [-0.00069, 3]
    ],
    "red_o_points": [],
    "y_categories": ["N", "NOT APPLICABLE", "Y", "nan"],
    "blue_o_points": [],
    "blue_x_points": [
      [0.02027, 1],
      [-0.0001, 3],
      [-0.00134, 0],
      [-0.00117, 0],
      [0.00023, 3],
      [0.01701, 1],
      [0.012, 1],
      [-0.00209, 0],
      [-0.00031, 3],
      [-2e-5, 3],
      [-0.00166, 0],
      [0.01329, 1],
      [-0.00018, 3],
      [0.01429, 1],
      [-0.00025, 3]
    ]
  },
  "QS_mulGraftTrunk[UpperTrunk]": {
    "red_x_points": [
      [-7e-5, 3],
      [-0.00187, 0],
      [-0.00151, 0],
      [-0.00146, 0],
      [-0.00177, 0],
      [-0.0013, 0],
      [-0.00198, 0],
      [-0.00044, 3],
      [-0.0017, 0],
      [-0.00137, 0],
      [-4e-5, 3],
      [-0.0016, 0],
      [-0.00036, 3],
      [-0.00889, 2],
      [-0.00158, 0],
      [-0.00012, 3],
      [-5e-5, 3],
      [-0.00014, 3],
      [-0.00138, 0],
      [-4e-5, 3],
      [-0.00024, 3],
      [-0.00027, 3],
      [-0.00151, 0],
      [-0.00159, 0],
      [-0.00031, 3],
      [0.00453, 1],
      [-0.00034, 3],
      [-0.00128, 0],
      [-0.00031, 3]
    ],
    "red_o_points": [],
    "y_categories": ["N", "NOT APPLICABLE", "Y", "nan"],
    "blue_o_points": [],
    "blue_x_points": [
      [0.00983, 1],
      [-6e-5, 3],
      [-0.00026, 0],
      [-0.00037, 0],
      [8e-5, 3],
      [0.00583, 1],
      [0.00393, 1],
      [-0.00035, 0],
      [-1e-5, 3],
      [5e-5, 3],
      [-0.00048, 0],
      [0.00546, 1],
      [8e-5, 3],
      [0.0054, 1],
      [-0.00014, 3]
    ]
  },
  "QS_mulTransfSite[PhMc]": {
    "red_x_points": [
      [-0.00014, 3],
      [-0.00308, 0],
      [-0.00211, 0],
      [-0.00182, 0],
      [-0.00213, 0],
      [-0.00183, 0],
      [-0.00767, 2],
      [-0.00038, 3],
      [-0.00237, 0],
      [-0.00203, 0],
      [-0.00031, 3],
      [-0.0026, 0],
      [-0.00049, 3],
      [-0.00277, 0],
      [-0.00292, 0],
      [-0.0003, 3],
      [-0.00015, 3],
      [-0.00031, 3],
      [-0.00555, 2],
      [-0.00021, 3],
      [-0.00046, 3],
      [-0.00042, 3],
      [-0.00255, 0],
      [-0.00228, 0],
      [-0.00048, 3],
      [0.0067, 1],
      [-0.00032, 3],
      [-0.00182, 0],
      [-0.00037, 3]
    ],
    "red_o_points": [],
    "y_categories": ["N", "NOT APPLICABLE", "Y", "nan"],
    "blue_o_points": [],
    "blue_x_points": [
      [0.0138, 1],
      [-0.00014, 3],
      [-0.00093, 0],
      [-0.00123, 0],
      [9e-5, 3],
      [0.00981, 1],
      [0.00691, 1],
      [-0.00145, 0],
      [-8e-5, 3],
      [-0.0, 3],
      [-0.00092, 0],
      [0.00736, 1],
      [-0.00012, 3],
      [0.00846, 1],
      [-0.00037, 3]
    ]
  },
  "QS_mulLysisRoot[C6]": {
    "red_x_points": [
      [-0.00011, 3],
      [-0.00457, 0],
      [-0.0123, 2],
      [-0.0025, 0],
      [-0.00307, 0],
      [-0.00253, 0],
      [-0.00312, 0],
      [-0.00051, 3],
      [-0.00312, 0],
      [-0.00266, 0],
      [-0.00048, 3],
      [-0.00289, 0],
      [-0.00052, 3],
      [-0.00486, 0],
      [-0.00395, 0],
      [-0.00049, 3],
      [-0.0002, 3],
      [-0.00042, 3],
      [-0.00249, 0],
      [-0.00028, 3],
      [-0.00044, 3],
      [-0.00045, 3],
      [-0.00318, 0],
      [-0.0031, 0],
      [-0.0007, 3],
      [0.00912, 1],
      [-0.00049, 3],
      [-0.00923, 2],
      [-0.00055, 3]
    ],
    "red_o_points": [],
    "y_categories": ["N", "NOT APPLICABLE", "Y", "nan"],
    "blue_o_points": [],
    "blue_x_points": [
      [0.02003, 1],
      [-0.00012, 3],
      [-0.00123, 0],
      [-0.00184, 0],
      [0.00038, 3],
      [0.0135, 1],
      [0.00908, 1],
      [-0.00171, 0],
      [-2e-5, 3],
      [0.00013, 3],
      [-0.00096, 0],
      [0.01189, 1],
      [-0.00029, 3],
      [0.01165, 1],
      [-0.00042, 3]
    ]
  },
  "QA_lstPexInspectio[ShoulderSubdisloc]": {
    "red_x_points": [
      [-0.00314, 1],
      [-0.0063, 1],
      [0.00303, 0],
      [-0.00416, 1],
      [-0.00804, 1],
      [-0.00265, 2],
      [-0.00688, 1],
      [-0.00348, 1],
      [-0.00959, 1],
      [-0.01054, 1],
      [-0.00176, 2],
      [-0.01038, 1],
      [-0.00268, 1],
      [-0.01062, 1],
      [-0.00284, 1],
      [-0.0052, 2],
      [-0.00092, 2],
      [0.00078, 1],
      [-0.00466, 1],
      [-0.00169, 1],
      [-0.01504, 0],
      [0.00513, 2],
      [-0.00085, 2],
      [-0.00062, 2],
      [-0.0021, 1],
      [-0.01991, 2],
      [-0.00254, 1],
      [-0.00111, 2],
      [-0.005, 1]
    ],
    "red_o_points": [],
    "y_categories": ["ABS", "NAIA", "PT", "nan"],
    "blue_o_points": [],
    "blue_x_points": [
      [0.00664, 1],
      [0.01113, 2],
      [0.03848, 0],
      [0.00944, 2],
      [0.002, 1],
      [0.00778, 1],
      [0.00698, 0],
      [-0.00442, 1],
      [0.01355, 2],
      [0.00149, 1],
      [0.03371, 0],
      [0.00495, 1],
      [0.00309, 1],
      [-0.00406, 2],
      [0.00302, 1]
    ]
  },
  "QS_mulGraftLevel[Trunk]": {
    "red_x_points": [
      [-5e-5, 3],
      [-0.00178, 0],
      [-0.0014, 0],
      [-0.00136, 0],
      [-0.00168, 0],
      [-0.00091, 0],
      [-0.00173, 0],
      [-0.00028, 3],
      [-0.0012, 0],
      [-0.00115, 0],
      [-0.00027, 3],
      [-0.00153, 0],
      [-0.00032, 3],
      [-0.008, 2],
      [-0.00137, 0],
      [-0.0002, 3],
      [-9e-5, 3],
      [-0.00014, 3],
      [-0.00129, 0],
      [-0.00011, 3],
      [-0.00026, 3],
      [-0.00028, 3],
      [-0.00136, 0],
      [-0.00135, 0],
      [-0.00054, 3],
      [0.00417, 1],
      [-0.00034, 3],
      [-0.00123, 0],
      [-0.00031, 3]
    ],
    "red_o_points": [],
    "y_categories": ["N", "NOT APPLICABLE", "Y", "nan"],
    "blue_o_points": [],
    "blue_x_points": [
      [0.00801, 1],
      [-0.00023, 3],
      [-0.00016, 0],
      [6e-5, 0],
      [-4e-5, 3],
      [0.00588, 1],
      [0.00392, 1],
      [-0.00051, 0],
      [-3e-5, 3],
      [-5e-5, 3],
      [-0.00033, 0],
      [0.00553, 1],
      [-5e-5, 3],
      [0.00444, 1],
      [-0.0001, 3]
    ]
  },
  "QA_lstPexPain[C7]": {
    "red_x_points": [
      [-0.00111, 1],
      [-0.0046, 2],
      [-0.00281, 2],
      [-0.00098, 1],
      [-0.00478, 2],
      [-0.00311, 1],
      [-0.0017, 1],
      [-0.00612, 0],
      [-0.00338, 1],
      [0.00667, 0],
      [-0.00084, 1],
      [-0.00724, 2],
      [0.00224, 2],
      [-0.00639, 2],
      [-0.00173, 2],
      [-0.00807, 0],
      [-0.00035, 1],
      [-0.00583, 0],
      [-0.00444, 2],
      [-0.00691, 0],
      [0.0017, 2],
      [0.0019, 2],
      [-0.00791, 2],
      [-0.00517, 2],
      [-0.00424, 0],
      [-0.00406, 1],
      [-0.00096, 1],
      [-0.00215, 1],
      [-0.00017, 1]
    ],
    "red_o_points": [],
    "y_categories": ["NORM", "NPV", "nan"],
    "blue_o_points": [],
    "blue_x_points": [
      [0.00019, 1],
      [0.00399, 1],
      [0.01525, 0],
      [0.02062, 0],
      [0.00551, 2],
      [7e-5, 2],
      [1e-5, 1],
      [0.00057, 1],
      [0.00653, 2],
      [0.00555, 2],
      [0.01319, 0],
      [-1e-5, 1],
      [-0.00273, 0],
      [0.00418, 0],
      [0.00959, 1]
    ]
  },
  "QS_mulBpsurgeryType[Graft]": {
    "red_x_points": [
      [-9e-5, 3],
      [-0.00057, 0],
      [-0.00038, 0],
      [-0.00036, 0],
      [-0.00046, 0],
      [-0.00013, 0],
      [-0.00045, 0],
      [-0.00022, 3],
      [-0.00011, 0],
      [-0.0003, 0],
      [-0.00015, 3],
      [-0.00027, 0],
      [-0.00028, 3],
      [-0.00441, 2],
      [-0.00023, 0],
      [-0.00022, 3],
      [-9e-5, 3],
      [-0.00019, 3],
      [-0.00027, 0],
      [-8e-5, 3],
      [-0.00028, 3],
      [-0.00021, 3],
      [-0.00028, 0],
      [-0.00036, 0],
      [-0.00029, 3],
      [0.00128, 1],
      [-0.00023, 3],
      [-0.00035, 0],
      [-0.00018, 3]
    ],
    "red_o_points": [],
    "y_categories": ["N", "NOT APPLICABLE", "Y", "nan"],
    "blue_o_points": [],
    "blue_x_points": [
      [0.00343, 1],
      [-0.00021, 3],
      [0.00033, 0],
      [0.00055, 0],
      [-0.00011, 3],
      [0.00167, 1],
      [0.00129, 1],
      [9e-5, 0],
      [-0.00011, 3],
      [-0.0001, 3],
      [0.00022, 0],
      [0.00178, 1],
      [-0.00014, 3],
      [0.00161, 1],
      [-0.00013, 3]
    ]
  },
  "QS_mulNeuromadSite[C5]": {
    "red_x_points": [
      [-6e-5, 2],
      [-0.0005, 0],
      [-0.00013, 0],
      [-9e-5, 0],
      [-0.00018, 0],
      [-0.00011, 0],
      [-0.0003, 0],
      [-1e-5, 2],
      [-0.00035, 0],
      [-6e-5, 0],
      [-1e-5, 2],
      [-0.00029, 0],
      [-0.00014, 2],
      [-0.00057, 0],
      [-0.00024, 0],
      [-5e-5, 2],
      [-0.0, 2],
      [-5e-5, 2],
      [-8e-5, 0],
      [-8e-5, 2],
      [-0.00012, 2],
      [-2e-5, 2],
      [-0.00028, 0],
      [-0.00031, 0],
      [-0.0001, 2],
      [9e-5, 1],
      [-7e-5, 2],
      [-8e-5, 0],
      [-0.00014, 2]
    ],
    "red_o_points": [],
    "y_categories": ["N", "NOT APPLICABLE", "nan"],
    "blue_o_points": [],
    "blue_x_points": [
      [0.00179, 1],
      [-0.0, 2],
      [3e-5, 0],
      [-1e-5, 0],
      [3e-5, 2],
      [0.00102, 1],
      [0.00021, 1],
      [-0.0002, 0],
      [-2e-5, 2],
      [4e-5, 2],
      [4e-5, 0],
      [0.00066, 1],
      [-8e-5, 2],
      [0.00091, 1],
      [-6e-5, 2]
    ]
  },
  "QS_mulNeuromadSite[C7]": {
    "red_x_points": [
      [-2e-5, 2],
      [-6e-5, 0],
      [-8e-5, 0],
      [-6e-5, 0],
      [-0.00019, 0],
      [-0.00019, 0],
      [-0.0, 2],
      [-0.00014, 0],
      [-5e-5, 0],
      [-2e-5, 2],
      [-0.0001, 0],
      [-1e-5, 2],
      [-0.00015, 0],
      [-6e-5, 0],
      [-2e-5, 2],
      [-4e-5, 2],
      [-3e-5, 2],
      [-1e-5, 2],
      [1e-5, 2],
      [-0.0001, 0],
      [-6e-5, 0],
      [-1e-5, 2],
      [7e-5, 1],
      [0.0, 2],
      [1e-5, 2]
    ],
    "red_o_points": [],
    "y_categories": ["N", "NOT APPLICABLE", "nan"],
    "blue_o_points": [],
    "blue_x_points": [
      [0.00074, 1],
      [1e-5, 2],
      [-2e-5, 0],
      [2e-5, 0],
      [-1e-5, 2],
      [9e-5, 1],
      [7e-5, 1],
      [-6e-5, 0],
      [1e-5, 2],
      [-2e-5, 2],
      [6e-5, 0],
      [0.00023, 1],
      [-4e-5, 2],
      [0.00023, 1],
      [-2e-5, 2]
    ]
  },
  "QS_mulTransfSite[IMc]": {
    "red_x_points": [
      [-0.0007, 3],
      [-0.01615, 2],
      [-0.0029, 0],
      [-0.01302, 2],
      [-0.00296, 0],
      [-0.00233, 0],
      [-0.003, 0],
      [-0.00113, 3],
      [-0.00302, 0],
      [-0.0026, 0],
      [-0.00086, 3],
      [-0.00299, 0],
      [-0.00138, 3],
      [-0.0046, 0],
      [-0.01456, 2],
      [-0.00098, 3],
      [-0.00087, 3],
      [-0.00062, 3],
      [-0.00274, 0],
      [-0.00074, 3],
      [-0.00107, 3],
      [-0.00102, 3],
      [-0.00298, 0],
      [-0.01676, 2],
      [-0.00114, 3],
      [0.01718, 1],
      [-0.00108, 3],
      [-0.01445, 2],
      [-0.00106, 3]
    ],
    "red_o_points": [],
    "y_categories": ["N", "NOT APPLICABLE", "Y", "nan"],
    "blue_o_points": [],
    "blue_x_points": [
      [0.03011, 1],
      [-0.0007, 3],
      [-0.00051, 0],
      [-0.0007, 0],
      [0.00017, 3],
      [0.02325, 1],
      [0.01716, 1],
      [-0.0016, 0],
      [-0.00072, 3],
      [-0.00019, 3],
      [-0.00029, 0],
      [0.01791, 1],
      [-0.00048, 3],
      [0.01783, 1],
      [-0.00073, 3]
    ]
  },
  "QA_mulInjOrthesisType[ArmSling]": {
    "red_x_points": [
      [-0.00874, 2],
      [-0.00875, 2],
      [-0.00808, 2],
      [-0.0084, 2],
      [-0.00829, 2],
      [-0.00861, 2],
      [-0.00823, 2],
      [-0.0087, 2],
      [-0.00847, 2],
      [-0.00845, 2],
      [-0.00865, 2],
      [-0.00862, 2],
      [-0.00836, 2],
      [-0.00828, 2],
      [-0.02698, 0],
      [-0.00879, 2],
      [-0.00892, 2],
      [-0.02605, 0],
      [-0.02681, 3],
      [-0.00874, 2],
      [-0.00884, 2],
      [-0.00827, 2],
      [-0.00878, 2],
      [-0.00836, 2],
      [-0.02641, 3],
      [-0.02673, 3],
      [-0.02696, 3],
      [-0.00853, 2],
      [-0.00879, 2]
    ],
    "red_o_points": [],
    "y_categories": ["N", "NOT APPLICABLE", "Y", "nan"],
    "blue_o_points": [],
    "blue_x_points": [
      [-0.00808, 2],
      [-0.0081, 2],
      [-0.008, 2],
      [-0.00799, 2],
      [0.05345, 1],
      [0.05368, 1],
      [0.04914, 1],
      [0.05123, 1],
      [-0.00811, 2],
      [0.05215, 1],
      [-0.00816, 2],
      [0.05007, 1],
      [0.05122, 1],
      [0.05251, 1],
      [-0.00842, 2]
    ]
  },
  "QA_lstPexArthre[Index]": {
    "red_x_points": [
      [-0.01105, 0],
      [-0.00562, 2],
      [-0.00398, 2],
      [-0.00691, 0],
      [-0.00942, 0],
      [0.00867, 1],
      [-0.01019, 0],
      [0.00066, 2],
      [0.00986, 1],
      [-0.01333, 0],
      [0.00333, 1],
      [-0.00748, 2],
      [0.00027, 2],
      [0.01015, 1],
      [-0.00261, 2],
      [0.00362, 1],
      [-0.01143, 0],
      [0.00194, 1],
      [-0.00501, 2],
      [-0.0124, 0],
      [0.00067, 2],
      [0.00083, 2],
      [-0.00793, 2],
      [-0.00643, 2],
      [0.00257, 1],
      [-0.00079, 2],
      [0.00066, 2],
      [-0.00641, 0],
      [0.00066, 2]
    ],
    "red_o_points": [],
    "y_categories": ["NPV", "PV", "nan"],
    "blue_o_points": [],
    "blue_x_points": [
      [0.00026, 0],
      [0.00194, 2],
      [0.01384, 1],
      [0.01584, 1],
      [0.00314, 2],
      [-0.0002, 2],
      [0.00184, 1],
      [0.01262, 1],
      [0.0021, 2],
      [0.00193, 2],
      [0.01273, 1],
      [0.00142, 1],
      [0.00353, 1],
      [-0.00023, 2],
      [0.00633, 1]
    ]
  },
  "QS_mulLysisRoot[C7]": {
    "red_x_points": [
      [-6e-5, 3],
      [-0.00076, 0],
      [-0.00325, 2],
      [-0.00045, 0],
      [-0.00073, 0],
      [-0.0005, 0],
      [-0.00068, 0],
      [-7e-5, 3],
      [-0.00044, 0],
      [-0.00048, 0],
      [-1e-5, 3],
      [-0.00067, 0],
      [-0.0001, 3],
      [-0.00064, 0],
      [-0.00072, 0],
      [-3e-5, 3],
      [-9e-5, 3],
      [4e-5, 3],
      [-0.00055, 0],
      [-6e-5, 3],
      [-5e-5, 3],
      [-8e-5, 3],
      [-0.00053, 0],
      [-0.00068, 0],
      [-7e-5, 3],
      [0.00135, 1],
      [-6e-5, 3],
      [-0.00055, 0],
      [-3e-5, 3]
    ],
    "red_o_points": [],
    "y_categories": ["N", "NOT APPLICABLE", "Y", "nan"],
    "blue_o_points": [],
    "blue_x_points": [
      [0.00357, 1],
      [0.0, 3],
      [2e-5, 0],
      [-7e-5, 0],
      [9e-5, 3],
      [0.00265, 1],
      [0.00129, 1],
      [-0.00045, 0],
      [-8e-5, 3],
      [-3e-5, 3],
      [6e-5, 0],
      [0.00162, 1],
      [7e-5, 3],
      [0.00226, 1],
      [-5e-5, 3]
    ]
  },
  "QS_mulTransfSite[AcMc]": {
    "red_x_points": [
      [-9e-5, 3],
      [-0.00178, 0],
      [-0.00097, 0],
      [-0.00071, 0],
      [-0.0009, 0],
      [-0.00067, 0],
      [-0.0011, 0],
      [-2e-5, 3],
      [-0.0008, 0],
      [-0.00993, 2],
      [-8e-5, 3],
      [-0.00089, 0],
      [-0.00013, 3],
      [-0.00171, 0],
      [-0.00175, 0],
      [-0.00043, 3],
      [-0.00011, 3],
      [-0.00027, 3],
      [-0.00081, 0],
      [-0.00056, 3],
      [-9e-5, 3],
      [-7e-5, 3],
      [-0.00087, 0],
      [-0.00101, 0],
      [-0.0001, 3],
      [0.00189, 1],
      [-4e-5, 3],
      [-0.00064, 0],
      [-8e-5, 3]
    ],
    "red_o_points": [],
    "y_categories": ["N", "NOT APPLICABLE", "Y", "nan"],
    "blue_o_points": [],
    "blue_x_points": [
      [0.00635, 1],
      [0.00013, 3],
      [0.00272, 0],
      [0.00231, 0],
      [0.00012, 3],
      [0.00379, 1],
      [0.00177, 1],
      [-0.00059, 0],
      [8e-5, 3],
      [0.00019, 3],
      [0.00196, 0],
      [0.00302, 1],
      [-6e-5, 3],
      [0.0033, 1],
      [-0.00038, 3]
    ]
  },
  "QS_mulTransfSite[Other]": {
    "red_x_points": [
      [-0.00098, 3],
      [-0.01084, 0],
      [-0.00899, 0],
      [-0.00799, 0],
      [-0.0091, 0],
      [-0.00955, 0],
      [-0.00893, 0],
      [-0.00123, 3],
      [-0.00915, 0],
      [-0.00915, 0],
      [-0.00108, 3],
      [-0.00905, 0],
      [-0.00115, 3],
      [-0.01072, 0],
      [-0.00913, 0],
      [-0.00124, 3],
      [-0.00092, 3],
      [-0.00096, 3],
      [-0.00767, 0],
      [-0.00098, 3],
      [-0.00129, 3],
      [-0.00142, 3],
      [-0.00943, 0],
      [-0.0089, 0],
      [-0.00121, 3],
      [0.01725, 1],
      [-0.00123, 3],
      [-0.00933, 0],
      [-0.00159, 3]
    ],
    "red_o_points": [],
    "y_categories": ["N", "NOT APPLICABLE", "Y", "nan"],
    "blue_o_points": [],
    "blue_x_points": [
      [0.03315, 1],
      [-0.00065, 3],
      [-0.00767, 0],
      [-0.00759, 0],
      [-0.00037, 3],
      [0.02415, 1],
      [0.01849, 1],
      [-0.00623, 0],
      [-0.0004, 3],
      [-0.00075, 3],
      [0.04477, 2],
      [0.02022, 1],
      [-0.00042, 3],
      [0.01983, 1],
      [-0.00057, 3]
    ]
  },
  "QA_yonInjBpsurg": {
    "red_x_points": [
      [-0.00042, 1],
      [-0.00068, 1],
      [-0.0004, 1],
      [-0.00052, 1],
      [-0.00062, 1],
      [-0.0004, 1],
      [-0.00061, 1],
      [-0.00065, 1],
      [-0.0007, 1],
      [-0.00037, 1],
      [-0.00046, 1],
      [-0.0004, 1],
      [-0.00101, 1],
      [-0.00084, 1],
      [-0.00037, 1],
      [-0.0004, 1],
      [-0.00041, 1],
      [-0.00038, 1],
      [-0.00034, 1],
      [-0.0004, 1],
      [-0.00111, 1],
      [-0.00065, 1],
      [-0.0005, 1],
      [-0.00042, 1],
      [-0.00075, 1],
      [0.0019, 0],
      [-0.00066, 1],
      [-0.00026, 1],
      [-0.00087, 1]
    ],
    "red_o_points": [],
    "y_categories": ["N", "Y", "nan"],
    "blue_o_points": [],
    "blue_x_points": [
      [0.00583, 0],
      [-0.00033, 1],
      [-0.00036, 1],
      [-0.00061, 1],
      [-0.00032, 1],
      [0.00282, 0],
      [0.00224, 0],
      [-0.00045, 1],
      [-0.00039, 1],
      [-0.0003, 1],
      [-0.00036, 1],
      [0.00331, 0],
      [-0.00025, 1],
      [0.00316, 0],
      [-0.00028, 1]
    ]
  },
  "QA_lstPexTouch[C8]": {
    "red_x_points": [
      [-0.00116, 1],
      [-0.00567, 2],
      [-0.00296, 1],
      [-0.00225, 1],
      [-0.00733, 2],
      [-0.0049, 1],
      [-0.00357, 1],
      [-0.00378, 0],
      [-0.00637, 1],
      [0.01267, 0],
      [-0.00179, 1],
      [-0.01011, 2],
      [-0.00304, 2],
      [-0.00962, 2],
      [-0.00303, 2],
      [-0.00114, 0],
      [-0.00176, 1],
      [-0.0034, 0],
      [-0.00542, 2],
      [-0.00234, 0],
      [-0.00349, 2],
      [-0.00717, 0],
      [-0.00699, 1],
      [-0.00833, 2],
      [-0.003, 0],
      [-0.01095, 1],
      [-0.00114, 2],
      [-0.00234, 1],
      [-0.00079, 1]
    ],
    "red_o_points": [],
    "y_categories": ["NORM", "NPV", "nan"],
    "blue_o_points": [],
    "blue_x_points": [
      [0.00764, 0],
      [0.00937, 1],
      [0.01973, 0],
      [0.02817, 0],
      [0.00444, 2],
      [0.00171, 2],
      [-0.00017, 1],
      [-0.00132, 1],
      [0.0106, 1],
      [0.00525, 2],
      [0.01745, 0],
      [-0.00092, 1],
      [-0.00073, 0],
      [0.00585, 0],
      [0.00408, 0]
    ]
  },
  "QS_mulLysisNerve[Ssr]": {
    "red_x_points": [
      [-0.00038, 3],
      [-0.00414, 0],
      [-0.00981, 2],
      [-0.00734, 2],
      [-0.00271, 0],
      [-0.00217, 0],
      [-0.0028, 0],
      [-0.0007, 3],
      [-0.0029, 0],
      [-0.00225, 0],
      [-0.00027, 3],
      [-0.003, 0],
      [-0.00064, 3],
      [-0.00378, 0],
      [-0.00353, 0],
      [-0.00058, 3],
      [-0.00037, 3],
      [-0.00046, 3],
      [-0.00217, 0],
      [-0.00044, 3],
      [-0.00056, 3],
      [-0.00063, 3],
      [-0.00292, 0],
      [-0.00259, 0],
      [-0.0007, 3],
      [0.00896, 1],
      [-0.00064, 3],
      [-0.00231, 0],
      [-0.00067, 3]
    ],
    "red_o_points": [],
    "y_categories": ["N", "NOT APPLICABLE", "Y", "nan"],
    "blue_o_points": [],
    "blue_x_points": [
      [0.01657, 1],
      [-0.0002, 3],
      [-0.00133, 0],
      [-0.00152, 0],
      [0.0001, 3],
      [0.01275, 1],
      [0.00889, 1],
      [-0.00162, 0],
      [-0.00023, 3],
      [-7e-5, 3],
      [-0.00116, 0],
      [0.01029, 1],
      [-0.00013, 3],
      [0.01067, 1],
      [-0.00049, 3]
    ]
  },
  "QS_mulTransfSite[AcSsAA]": {
    "red_x_points": [
      [-0.00012, 3],
      [-0.00114, 2],
      [-0.00599, 0],
      [-0.00532, 0],
      [-0.0004, 2],
      [-0.00619, 0],
      [-0.00584, 0],
      [-0.00052, 3],
      [-0.00683, 0],
      [-0.00767, 0],
      [-0.00038, 3],
      [-0.00606, 0],
      [-0.00047, 3],
      [-0.00021, 2],
      [-0.0031, 0],
      [-0.00023, 3],
      [-0.00015, 3],
      [-0.00021, 3],
      [-0.00032, 2],
      [-0.00013, 3],
      [-0.00061, 3],
      [-0.00061, 3],
      [-0.00655, 0],
      [-0.00035, 2],
      [-0.00062, 3],
      [0.00532, 1],
      [-0.00045, 3],
      [-0.00465, 0],
      [-0.00074, 3]
    ],
    "red_o_points": [],
    "y_categories": ["N", "NOT APPLICABLE", "Y", "nan"],
    "blue_o_points": [],
    "blue_x_points": [
      [0.01661, 1],
      [-4e-5, 3],
      [0.00851, 2],
      [0.00788, 2],
      [3e-5, 3],
      [0.00843, 1],
      [0.00632, 1],
      [-0.00215, 0],
      [5e-5, 3],
      [8e-5, 3],
      [-0.00238, 0],
      [0.00879, 1],
      [0.00011, 3],
      [0.00824, 1],
      [6e-5, 3]
    ]
  },
  "QS_mulLysisRoot[C5]": {
    "red_x_points": [
      [-0.00011, 3],
      [-0.00288, 0],
      [-0.00741, 2],
      [-0.00172, 0],
      [-0.00221, 0],
      [-0.0019, 0],
      [-0.00195, 0],
      [-0.00042, 3],
      [-0.00239, 0],
      [-0.00179, 0],
      [-0.0002, 3],
      [-0.00205, 0],
      [-0.00049, 3],
      [-0.00321, 0],
      [-0.00275, 0],
      [-0.00044, 3],
      [-0.00027, 3],
      [-0.00014, 3],
      [-0.00189, 0],
      [-0.00017, 3],
      [-0.00047, 3],
      [-0.00054, 3],
      [-0.0022, 0],
      [-0.00199, 0],
      [-0.00061, 3],
      [0.00721, 1],
      [-0.00053, 3],
      [-0.0063, 2],
      [-0.00025, 3]
    ],
    "red_o_points": [],
    "y_categories": ["N", "NOT APPLICABLE", "Y", "nan"],
    "blue_o_points": [],
    "blue_x_points": [
      [0.01378, 1],
      [-0.00012, 3],
      [-0.00057, 0],
      [-0.00087, 0],
      [0.00033, 3],
      [0.00929, 1],
      [0.00546, 1],
      [-0.00119, 0],
      [-0.00018, 3],
      [5e-5, 3],
      [-0.00051, 0],
      [0.00817, 1],
      [0.0, 3],
      [0.0066, 1],
      [-0.00015, 3]
    ]
  },
  "QS_mulNeuromadSite[C6]": {
    "red_x_points": [
      [-2e-5, 2],
      [-2e-5, 0],
      [-3e-5, 0],
      [-3e-5, 0],
      [-5e-5, 0],
      [-3e-5, 0],
      [-5e-5, 0],
      [-0.0, 2],
      [-0.00013, 0],
      [-5e-5, 0],
      [-0.0, 2],
      [-5e-5, 0],
      [-1e-5, 2],
      [-0.00012, 0],
      [-0.00012, 0],
      [-0.0, 2],
      [-0.0, 2],
      [-3e-5, 0],
      [-1e-5, 2],
      [-2e-5, 2],
      [-5e-5, 0],
      [-3e-5, 0],
      [0.0001, 1],
      [-0.0, 2],
      [-3e-5, 0],
      [-3e-5, 2]
    ],
    "red_o_points": [],
    "y_categories": ["N", "NOT APPLICABLE", "nan"],
    "blue_o_points": [],
    "blue_x_points": [
      [0.00039, 1],
      [-0.0, 2],
      [-3e-5, 0],
      [-1e-5, 2],
      [0.00021, 1],
      [0.0001, 1],
      [-3e-5, 0],
      [-0.0, 2],
      [-1e-5, 2],
      [-3e-5, 0],
      [0.0002, 1],
      [-0.0, 2],
      [0.0001, 1],
      [-0.0, 2]
    ]
  },
  "QS_mulNeuromadSite[T1]": {
    "red_x_points": [
      [4e-5, 2],
      [-0.00031, 0],
      [-0.00018, 0],
      [-0.0002, 0],
      [-0.00024, 0],
      [-0.00018, 0],
      [-0.00025, 0],
      [-2e-5, 2],
      [-0.00022, 0],
      [-0.00021, 0],
      [5e-5, 2],
      [-0.00028, 0],
      [-7e-5, 2],
      [-0.00033, 0],
      [-0.00025, 0],
      [1e-5, 2],
      [4e-5, 2],
      [0.0001, 2],
      [-0.00019, 0],
      [9e-5, 2],
      [-0.00011, 2],
      [-7e-5, 2],
      [-0.00037, 0],
      [-0.00035, 0],
      [-4e-5, 2],
      [0.00046, 1],
      [-5e-5, 2],
      [-0.00022, 0],
      [-9e-5, 2]
    ],
    "red_o_points": [],
    "y_categories": ["N", "NOT APPLICABLE", "nan"],
    "blue_o_points": [],
    "blue_x_points": [
      [0.00142, 1],
      [-2e-5, 2],
      [-6e-5, 0],
      [-0.00012, 0],
      [0.0001, 2],
      [0.00067, 1],
      [0.00027, 1],
      [-0.00012, 0],
      [0.00012, 2],
      [0.0, 2],
      [-3e-5, 0],
      [0.00076, 1],
      [0.0001, 2],
      [0.00039, 1],
      [-0.0, 2]
    ]
  },
  "QA_lstPexTouch[C7]": {
    "red_x_points": [
      [-0.00111, 1],
      [-0.0094, 2],
      [-0.00461, 1],
      [-0.0035, 1],
      [-0.01161, 2],
      [-0.00552, 1],
      [-0.00556, 1],
      [-0.0044, 0],
      [-0.00839, 1],
      [-0.01061, 1],
      [-0.00278, 1],
      [-0.01592, 2],
      [-0.00366, 2],
      [-0.01491, 2],
      [-0.00573, 2],
      [-0.0013, 0],
      [-0.00208, 1],
      [-0.00271, 0],
      [-0.00836, 2],
      [-0.00228, 0],
      [-0.00321, 2],
      [-0.00901, 0],
      [-0.00976, 1],
      [-0.0124, 2],
      [-0.00394, 0],
      [-0.00681, 1],
      [-0.00104, 2],
      [-0.00267, 1],
      [0.0006, 1]
    ],
    "red_o_points": [],
    "y_categories": ["NORM", "NPV", "nan"],
    "blue_o_points": [],
    "blue_x_points": [
      [-0.0, 1],
      [0.00929, 1],
      [0.04463, 0],
      [0.04969, 0],
      [0.00743, 2],
      [0.00027, 2],
      [-0.0001, 1],
      [-0.00368, 1],
      [0.01121, 1],
      [0.00582, 2],
      [0.03744, 0],
      [5e-5, 1],
      [-0.0002, 0],
      [0.00618, 0],
      [0.00468, 0]
    ]
  },
  "QA_yonInjPhysio": {
    "red_x_points": [
      [-0.00822, 0],
      [0.00069, 0],
      [0.00045, 0],
      [0.00039, 0],
      [-0.00269, 2],
      [0.00102, 0],
      [0.0007, 0],
      [-0.00719, 0],
      [0.00109, 0],
      [-0.00842, 1],
      [-0.00659, 0],
      [0.00184, 0],
      [-0.00972, 0],
      [-0.00683, 1],
      [-0.00147, 1],
      [0.00393, 1],
      [-0.00777, 0],
      [0.00554, 1],
      [0.0007, 0],
      [-0.00781, 0],
      [0.00477, 1],
      [0.00369, 1],
      [0.00157, 0],
      [-0.00759, 1],
      [-0.01091, 2],
      [-0.01745, 1],
      [-0.01171, 2],
      [0.00019, 0],
      [0.00627, 1]
    ],
    "red_o_points": [],
    "y_categories": ["N", "Y", "nan"],
    "blue_o_points": [],
    "blue_x_points": [
      [0.00656, 0],
      [0.01003, 1],
      [0.0063, 0],
      [0.0073, 0],
      [0.01022, 1],
      [0.00623, 0],
      [0.00386, 0],
      [0.00194, 0],
      [-0.00146, 0],
      [0.00847, 1],
      [0.00399, 0],
      [0.00589, 0],
      [0.00775, 1],
      [-0.00492, 1],
      [0.00938, 1]
    ]
  },
  "QS_mulLysisSite[Root]": {
    "red_x_points": [
      [-0.00032, 3],
      [-0.00121, 0],
      [-0.00493, 2],
      [-0.00078, 0],
      [-0.00103, 0],
      [-0.00084, 0],
      [-0.00135, 0],
      [-0.00054, 3],
      [-0.00112, 0],
      [-0.00098, 0],
      [-0.00028, 3],
      [-0.001, 0],
      [-0.00056, 3],
      [-0.00147, 0],
      [-0.00116, 0],
      [-0.00027, 3],
      [-0.00039, 3],
      [-0.00031, 3],
      [-0.00064, 0],
      [-0.00038, 3],
      [-0.00066, 3],
      [-0.00054, 3],
      [-0.00112, 0],
      [-0.00085, 0],
      [-0.00057, 3],
      [0.00402, 1],
      [-0.00058, 3],
      [-0.00403, 2],
      [-0.00053, 3]
    ],
    "red_o_points": [],
    "y_categories": ["N", "NOT APPLICABLE", "Y", "nan"],
    "blue_o_points": [],
    "blue_x_points": [
      [0.00878, 1],
      [-0.00038, 3],
      [-0.00029, 0],
      [-0.00061, 0],
      [-0.00015, 3],
      [0.00521, 1],
      [0.00382, 1],
      [-0.00074, 0],
      [-0.0004, 3],
      [-0.0002, 3],
      [-0.00013, 0],
      [0.00494, 1],
      [-0.00021, 3],
      [0.00499, 1],
      [-0.00021, 3]
    ]
  },
  "QS_mulNeuromadSite[T2]": {
    "red_x_points": [
      [0.0, 2],
      [-0.00089, 0],
      [-0.00045, 0],
      [-0.00024, 0],
      [-0.00063, 0],
      [-0.00024, 0],
      [-0.00056, 0],
      [-8e-5, 2],
      [-0.00063, 0],
      [-0.00023, 0],
      [0.0, 2],
      [-0.00046, 0],
      [2e-5, 2],
      [-0.0009, 0],
      [-0.00054, 0],
      [1e-5, 2],
      [-2e-5, 2],
      [-4e-5, 2],
      [-0.00022, 0],
      [-0.0, 2],
      [1e-5, 2],
      [-6e-5, 2],
      [-0.00034, 0],
      [-0.00039, 0],
      [-9e-5, 2],
      [0.00093, 1],
      [-5e-5, 2],
      [-0.00035, 0],
      [-5e-5, 2]
    ],
    "red_o_points": [],
    "y_categories": ["N", "NOT APPLICABLE", "nan"],
    "blue_o_points": [],
    "blue_x_points": [
      [0.0029, 1],
      [1e-5, 2],
      [-0.0001, 0],
      [-9e-5, 0],
      [8e-5, 2],
      [0.00134, 1],
      [0.00064, 1],
      [-0.00023, 0],
      [5e-5, 2],
      [4e-5, 2],
      [-0.00015, 0],
      [0.00104, 1],
      [1e-5, 2],
      [0.00099, 1],
      [-2e-5, 2]
    ]
  },
  "QS_mulNeuromadSite[C4]": {
    "red_x_points": [
      [2e-5, 2],
      [-0.00017, 0],
      [-9e-5, 0],
      [-3e-5, 0],
      [-0.00017, 0],
      [-0.00011, 0],
      [-2e-5, 2],
      [-0.00017, 0],
      [-3e-5, 0],
      [-1e-5, 2],
      [-9e-5, 0],
      [3e-5, 2],
      [-0.00025, 0],
      [-0.00011, 0],
      [-1e-5, 2],
      [-1e-5, 2],
      [-1e-5, 2],
      [-3e-5, 0],
      [-1e-5, 2],
      [0.0, 2],
      [4e-5, 2],
      [-9e-5, 0],
      [-6e-5, 0],
      [-2e-5, 2],
      [0.00014, 1],
      [-1e-5, 2],
      [2e-5, 2]
    ],
    "red_o_points": [],
    "y_categories": ["N", "NOT APPLICABLE", "nan"],
    "blue_o_points": [],
    "blue_x_points": [
      [0.00067, 1],
      [3e-5, 2],
      [-6e-5, 0],
      [1e-5, 2],
      [0.00014, 1],
      [9e-5, 1],
      [-3e-5, 0],
      [1e-5, 2],
      [1e-5, 2],
      [-3e-5, 0],
      [0.00025, 1],
      [9e-5, 1],
      [-1e-5, 2]
    ]
  },
  "QS_mulTransfSite[Oberlin]": {
    "red_x_points": [
      [-0.00201, 3],
      [-0.02641, 0],
      [-0.02577, 0],
      [-0.0237, 0],
      [-0.02662, 0],
      [0.00424, 2],
      [-0.02609, 0],
      [-0.00228, 3],
      [0.00465, 2],
      [0.00362, 2],
      [-0.00198, 3],
      [0.00404, 2],
      [-0.00233, 3],
      [0.00262, 2],
      [-0.02205, 0],
      [-0.00194, 3],
      [-0.00197, 3],
      [-0.00164, 3],
      [-0.02252, 0],
      [-0.00181, 3],
      [-0.00258, 3],
      [-0.00232, 3],
      [0.00451, 2],
      [-0.02663, 0],
      [-0.00237, 3],
      [0.02846, 1],
      [-0.00218, 3],
      [-0.02438, 0],
      [-0.0025, 3]
    ],
    "red_o_points": [],
    "y_categories": ["N", "NOT APPLICABLE", "Y", "nan"],
    "blue_o_points": [],
    "blue_x_points": [
      [0.04669, 1],
      [-0.00115, 3],
      [0.00658, 2],
      [0.00787, 2],
      [-0.00072, 3],
      [0.03688, 1],
      [0.03116, 1],
      [0.00538, 2],
      [-0.00148, 3],
      [-0.00094, 3],
      [0.00644, 2],
      [0.03338, 1],
      [-0.00122, 3],
      [0.03243, 1],
      [-0.00138, 3]
    ]
  },
  "QA_intPexForearmProna": {
    "red_x_points": [
      [-0.00034, 2],
      [-0.00095, 0],
      [-0.00053, 2],
      [-0.00026, 2],
      [-0.00056, 2],
      [-0.00279, 0],
      [-0.00065, 2],
      [-0.02088, 0],
      [-0.00076, 2],
      [-0.00082, 2],
      [-0.01987, 0],
      [-0.00254, 0],
      [-0.00075, 2],
      [-0.00069, 2],
      [4e-5, 2],
      [-0.02145, 0],
      [-0.01976, 0],
      [-0.01826, 0],
      [-0.00165, 0],
      [-0.00042, 2],
      [-0.0009, 2],
      [-0.00098, 2],
      [-0.00063, 2],
      [-0.00088, 2],
      [0.00047, 2],
      [0.00076, 1],
      [0.00061, 2],
      [-0.00276, 0],
      [-0.00086, 2]
    ],
    "red_o_points": [],
    "y_categories": ["GREATER THAN OR EQUALS TO 80", "LESS THAN 80", "nan"],
    "blue_o_points": [],
    "blue_x_points": [
      [-0.00052, 2],
      [0.06069, 1],
      [-0.0006, 0],
      [-0.00043, 2],
      [0.00117, 2],
      [4e-5, 2],
      [0.00097, 1],
      [0.00013, 2],
      [0.00013, 2],
      [0.00117, 2],
      [-0.00059, 0],
      [5e-5, 2],
      [0.00144, 2],
      [7e-5, 2],
      [0.05531, 1]
    ]
  },
  "QS_mulLysisSite[Nerve]": {
    "red_x_points": [
      [-0.00026, 3],
      [-0.0033, 0],
      [-0.00856, 2],
      [-0.00714, 2],
      [-0.00253, 0],
      [-0.00205, 0],
      [-0.00243, 0],
      [-0.00051, 3],
      [-0.00261, 0],
      [-0.00192, 0],
      [-0.00025, 3],
      [-0.00213, 0],
      [-0.00078, 3],
      [-0.00337, 0],
      [-0.0028, 0],
      [-0.00034, 3],
      [-0.00025, 3],
      [-0.00019, 3],
      [-0.00204, 0],
      [-0.00029, 3],
      [-0.00066, 3],
      [-0.0005, 3],
      [-0.00262, 0],
      [-0.00243, 0],
      [-0.0004, 3],
      [0.00705, 1],
      [-0.0005, 3],
      [-0.002, 0],
      [-0.00063, 3]
    ],
    "red_o_points": [],
    "y_categories": ["N", "NOT APPLICABLE", "Y", "nan"],
    "blue_o_points": [],
    "blue_x_points": [
      [0.01536, 1],
      [-0.00031, 3],
      [-0.0008, 0],
      [-0.00126, 0],
      [0.00014, 3],
      [0.01045, 1],
      [0.0067, 1],
      [-0.00142, 0],
      [-0.0003, 3],
      [7e-5, 3],
      [-0.00114, 0],
      [0.00958, 1],
      [-0.00016, 3],
      [0.00977, 1],
      [-0.00023, 3]
    ]
  },
  "QA_yonPexPain": {
    "red_x_points": [
      [-0.00802, 1],
      [-0.00093, 1],
      [-0.00109, 1],
      [-0.00042, 1],
      [-0.00076, 1],
      [-0.00224, 0],
      [-0.00059, 1],
      [-0.00696, 1],
      [-0.00226, 0],
      [-0.00076, 1],
      [-0.00513, 1],
      [-0.00099, 0],
      [-0.0094, 1],
      [-0.0005, 1],
      [-0.0004, 1],
      [0.00629, 0],
      [-0.00572, 1],
      [0.00617, 0],
      [-0.00057, 1],
      [0.00967, 0],
      [-0.0189, 2],
      [-0.00972, 1],
      [-0.00024, 1],
      [-0.00111, 1],
      [-0.01465, 2],
      [-0.00206, 1],
      [-0.00785, 1],
      [-0.0004, 1],
      [-0.00954, 1]
    ],
    "red_o_points": [],
    "y_categories": ["N", "Y", "nan"],
    "blue_o_points": [],
    "blue_x_points": [
      [-0.00045, 1],
      [0.02372, 0],
      [0.00441, 0],
      [0.00126, 1],
      [-0.00532, 1],
      [0.00066, 2],
      [4e-5, 1],
      [0.00383, 1],
      [0.02596, 0],
      [0.01931, 0],
      [0.00126, 1],
      [0.00268, 0],
      [0.01111, 0],
      [-0.00037, 1],
      [0.00096, 1]
    ]
  },
  "QA_lstPexPalle[Ulna]": {
    "red_x_points": [
      [-0.00065, 4],
      [-0.00288, 4],
      [-0.00255, 4],
      [-0.00747, 2],
      [-0.00377, 4],
      [-0.01196, 1],
      [-0.00329, 4],
      [-0.00055, 4],
      [-0.00456, 4],
      [0.01368, 3],
      [-0.01283, 1],
      [-0.00388, 4],
      [-0.0009, 4],
      [-0.0036, 4],
      [-0.00146, 4],
      [0.00529, 3],
      [-0.01193, 0],
      [0.00283, 3],
      [-0.00724, 0],
      [0.00545, 3],
      [-0.00067, 4],
      [-0.00062, 4],
      [-0.00435, 4],
      [-0.00317, 4],
      [-0.00038, 4],
      [0.00238, 3],
      [-0.0002, 4],
      [-0.00847, 0],
      [-0.00086, 4]
    ],
    "red_o_points": [],
    "y_categories": ["ABS", "HYPO", "NAIA", "PT", "nan"],
    "blue_o_points": [],
    "blue_x_points": [
      [-0.00058, 4],
      [0.00027, 4],
      [0.0168, 3],
      [0.02157, 3],
      [0.00051, 4],
      [-0.0001, 4],
      [0.00222, 3],
      [-0.00298, 4],
      [0.00037, 4],
      [0.00063, 4],
      [0.01465, 3],
      [-0.0002, 4],
      [0.00399, 3],
      [-0.00014, 4],
      [0.01161, 3]
    ]
  }
}
