{
  "QA_lstPexMuscstrength[ElbowFlex]": {
    "red_x_points": [
      [-0.00316, 1],
      [-0.00357, 2],
      [-0.00396, 1],
      [-0.00371, 1],
      [-0.00327, 1],
      [0.0091, 0],
      [-0.0039, 1],
      [-0.00441, 1],
      [-0.00289, 1],
      [-0.00477, 1],
      [-0.00374, 1],
      [-0.00471, 1],
      [-0.0035, 1],
      [-0.0033, 2],
      [-0.0036, 2],
      [-0.00426, 2],
      [-0.0034, 1],
      [-0.00333, 2],
      [-0.00345, 2],
      [-0.00354, 1],
      [-0.00311, 1],
      [-0.00283, 1],
      [-0.003, 1],
      [-0.00397, 2],
      [0.00441, 0],
      [-0.00315, 1],
      [-0.00429, 1],
      [-0.00335, 1],
      [-0.00326, 2],
      [-0.00305, 1],
      [-0.00397, 1],
      [-0.00348, 2]
    ],
    "red_o_points": [],
    "y_categories": ["GREATER THAN OR EQUALS TO 3", "LESS THAN 3", "nan"],
    "blue_o_points": [],
    "blue_x_points": [
      [-0.00058, 2],
      [-0.00094, 2],
      [0.01122, 0],
      [-0.00153, 1],
      [0.02601, 0],
      [0.01172, 0],
      [-0.0011, 1],
      [0.01248, 0],
      [-0.00108, 1],
      [-0.00054, 1]
    ]
  },
  "QS_mulLysisRoot[C6]": {
    "red_x_points": [
      [-0.00047, 3],
      [-0.00195, 0],
      [-0.00612, 2],
      [-0.00183, 0],
      [-0.00048, 3],
      [-0.00261, 0],
      [-0.00185, 0],
      [-0.00144, 0],
      [-0.00054, 3],
      [-0.00177, 0],
      [-0.00186, 0],
      [-0.00143, 0],
      [-0.00054, 3],
      [0.00407, 1],
      [-0.00068, 3],
      [-0.00188, 0],
      [-0.00047, 3],
      [-0.00177, 0],
      [-0.00054, 3],
      [-0.00073, 3],
      [-0.0005, 3],
      [-0.00032, 3],
      [-0.00174, 0],
      [-0.00071, 3],
      [-0.00041, 3],
      [-0.00054, 3],
      [-0.00196, 0],
      [-0.00186, 0],
      [0.0045, 1],
      [-0.00037, 3],
      [-0.0053, 2],
      [-0.00063, 3]
    ],
    "red_o_points": [],
    "y_categories": ["N", "NOT APPLICABLE", "Y", "nan"],
    "blue_o_points": [],
    "blue_x_points": [
      [0.00768, 1],
      [-0.00025, 3],
      [0.00519, 1],
      [0.00012, 0],
      [-0.00056, 0],
      [0.00507, 1],
      [-0.00013, 3],
      [0.00576, 1],
      [-8e-5, 3],
      [-2e-5, 3]
    ]
  },
  "QS_mulLysisTrunk[Upper]": {
    "red_x_points": [
      [-0.00126, 3],
      [-0.00491, 0],
      [-0.0047, 0],
      [-0.00588, 0],
      [-0.00159, 3],
      [-0.00559, 0],
      [-0.01044, 2],
      [-0.00484, 0],
      [-0.00179, 3],
      [-0.00575, 0],
      [-0.0067, 0],
      [-0.00472, 0],
      [-0.00134, 3],
      [0.0098, 1],
      [-0.00187, 3],
      [-0.00622, 0],
      [-0.00126, 3],
      [-0.01049, 2],
      [-0.00137, 3],
      [-0.00131, 3],
      [-0.00145, 3],
      [-0.00133, 3],
      [-0.00499, 0],
      [-0.00138, 3],
      [-0.00304, 3],
      [-0.0014, 3],
      [-0.00522, 0],
      [-0.00408, 0],
      [0.01178, 1],
      [-0.00085, 3],
      [-0.01063, 2],
      [-0.00163, 3]
    ],
    "red_o_points": [],
    "y_categories": ["N", "NOT APPLICABLE", "Y", "nan"],
    "blue_o_points": [],
    "blue_x_points": [
      [0.01748, 1],
      [-9e-5, 3],
      [0.01421, 1],
      [6e-5, 0],
      [-0.00105, 0],
      [0.0153, 1],
      [-0.00071, 3],
      [0.0144, 1],
      [-0.00057, 3],
      [0.00037, 3]
    ]
  },
  "QA_lstPexPain[C5]": {
    "red_x_points": [
      [-0.00256, 1],
      [-0.00493, 2],
      [-0.00519, 2],
      [-0.00578, 2],
      [-0.00249, 1],
      [-0.00101, 1],
      [-0.00081, 1],
      [-0.00119, 1],
      [-0.00248, 1],
      [-0.00114, 1],
      [-0.00113, 1],
      [-0.00069, 1],
      [-0.00287, 1],
      [-0.01983, 2],
      [-0.00772, 2],
      [-0.00552, 2],
      [-0.00743, 2],
      [-0.00472, 2],
      [-0.00685, 2],
      [-0.00238, 1],
      [-0.00252, 1],
      [-0.00237, 1],
      [-0.00583, 2],
      [-0.00741, 2],
      [-0.00218, 1],
      [-0.00853, 2],
      [-0.00486, 2],
      [-0.00494, 2],
      [-0.00444, 1],
      [-0.00438, 1],
      [-0.00066, 1],
      [-0.00278, 1]
    ],
    "red_o_points": [],
    "y_categories": ["NORM", "NPV", "nan"],
    "blue_o_points": [],
    "blue_x_points": [
      [0.02431, 0],
      [-0.00357, 2],
      [0.00029, 1],
      [-0.00017, 1],
      [-0.0005, 1],
      [0.00035, 1],
      [-0.00104, 1],
      [0.02178, 0],
      [-0.00107, 1],
      [0.04699, 0]
    ]
  },
  "QS_mulGraftNerve[Ac]": {
    "red_x_points": [
      [-1e-5, 2],
      [-0.00017, 0],
      [-0.00026, 0],
      [-0.00031, 0],
      [-7e-5, 2],
      [-0.00035, 0],
      [-0.00028, 0],
      [-0.00028, 0],
      [-8e-5, 2],
      [-0.00034, 0],
      [-0.00029, 0],
      [-0.00028, 0],
      [-5e-5, 2],
      [0.0004, 1],
      [-9e-5, 2],
      [-0.00032, 0],
      [-4e-5, 2],
      [-0.00024, 0],
      [-1e-5, 2],
      [-3e-5, 2],
      [-4e-5, 2],
      [0.0, 2],
      [-0.00023, 0],
      [-9e-5, 2],
      [-2e-5, 2],
      [-4e-5, 2],
      [-0.00029, 0],
      [-0.00018, 0],
      [0.00058, 1],
      [-5e-5, 2],
      [-0.00023, 0],
      [-9e-5, 2]
    ],
    "red_o_points": [],
    "y_categories": ["N", "NOT APPLICABLE", "nan"],
    "blue_o_points": [],
    "blue_x_points": [
      [0.0007, 1],
      [0.0, 2],
      [0.00062, 1],
      [-5e-5, 0],
      [0.00044, 1],
      [-1e-5, 2],
      [0.00043, 1],
      [-3e-5, 2],
      [1e-5, 2]
    ]
  },
  "QS_mulNeuromadSite[C8]": {
    "red_x_points": [
      [-9e-5, 2],
      [-0.00317, 0],
      [-0.00209, 0],
      [-0.00243, 0],
      [-0.00032, 2],
      [-0.00249, 0],
      [-0.00246, 0],
      [-0.00232, 0],
      [-0.00062, 2],
      [-0.0031, 0],
      [-0.00283, 0],
      [-0.00207, 0],
      [-0.0002, 2],
      [0.00233, 1],
      [-0.00014, 2],
      [-0.00308, 0],
      [-0.00047, 2],
      [-0.00252, 0],
      [-0.00075, 2],
      [-0.0004, 2],
      [-2e-5, 2],
      [-0.00034, 2],
      [-0.00191, 0],
      [-8e-5, 2],
      [-0.00122, 2],
      [-0.00022, 2],
      [-0.00218, 0],
      [-0.0021, 0],
      [0.00401, 1],
      [-0.00011, 2],
      [-0.0016, 0],
      [-0.00053, 2]
    ],
    "red_o_points": [],
    "y_categories": ["N", "NOT APPLICABLE", "nan"],
    "blue_o_points": [],
    "blue_x_points": [
      [0.00617, 1],
      [0.00036, 2],
      [0.00504, 1],
      [0.00117, 0],
      [-0.00056, 0],
      [0.00548, 1],
      [-4e-5, 2],
      [0.00451, 1],
      [0.00022, 2],
      [0.00073, 2]
    ]
  },
  "QS_mulGraftNerve[Ph]": {
    "red_x_points": [
      [-3e-5, 2],
      [-0.00011, 0],
      [-0.00024, 0],
      [-0.00025, 0],
      [-0.00013, 2],
      [-0.00017, 0],
      [-0.00013, 0],
      [-0.00024, 0],
      [-3e-5, 2],
      [-0.00015, 0],
      [-0.0002, 0],
      [-8e-5, 0],
      [-3e-5, 2],
      [0.00021, 1],
      [-0.00013, 2],
      [-0.0002, 0],
      [-9e-5, 2],
      [-8e-5, 0],
      [-0.00011, 2],
      [-3e-5, 2],
      [-1e-5, 2],
      [-3e-5, 2],
      [-8e-5, 0],
      [-8e-5, 2],
      [-0.00026, 2],
      [-0.00011, 2],
      [-0.00015, 0],
      [-0.00016, 0],
      [0.00019, 1],
      [-5e-5, 2],
      [-0.00016, 0],
      [-0.00013, 2]
    ],
    "red_o_points": [],
    "y_categories": ["N", "NOT APPLICABLE", "nan"],
    "blue_o_points": [],
    "blue_x_points": [
      [0.00117, 1],
      [-3e-5, 2],
      [0.0003, 1],
      [2e-5, 0],
      [-0.00011, 0],
      [0.00049, 1],
      [-1e-5, 2],
      [0.00018, 1],
      [-0.0, 2],
      [-5e-5, 2]
    ]
  },
  "QS_mulTransfSite[AcSsPA]": {
    "red_x_points": [
      [-0.00036, 3],
      [-0.00076, 0],
      [-0.00099, 0],
      [-0.00107, 0],
      [-0.00032, 3],
      [-0.00119, 0],
      [-0.00114, 0],
      [-0.00089, 0],
      [-0.00026, 3],
      [-0.00103, 0],
      [-0.00106, 0],
      [-0.00094, 0],
      [-0.00038, 3],
      [0.00178, 1],
      [-0.00038, 3],
      [-0.00092, 0],
      [-0.00035, 3],
      [-0.00344, 2],
      [-0.00063, 3],
      [-0.00031, 3],
      [-0.00028, 3],
      [-0.00027, 3],
      [-0.00095, 0],
      [-0.00048, 3],
      [-0.00057, 3],
      [-0.00036, 3],
      [-0.0011, 0],
      [-0.00088, 0],
      [0.00212, 1],
      [-0.00025, 3],
      [-0.00083, 0],
      [-0.00037, 3]
    ],
    "red_o_points": [],
    "y_categories": ["N", "NOT APPLICABLE", "Y", "nan"],
    "blue_o_points": [],
    "blue_x_points": [
      [0.00315, 1],
      [-0.00016, 3],
      [0.00262, 1],
      [0.00041, 0],
      [-0.00075, 0],
      [0.00365, 1],
      [-0.00027, 3],
      [0.00265, 1],
      [-0.00013, 3],
      [-0.00017, 3]
    ]
  },
  "participant_code": {
    "red_x_points": [
      [-0.02811, 1],
      [-0.02805, 2],
      [-0.02917, 3],
      [-0.02794, 4],
      [-0.02929, 5],
      [-0.02858, 6],
      [-0.02841, 7],
      [-0.02794, 8],
      [-0.02994, 9],
      [-0.02782, 10],
      [-0.02852, 11],
      [-0.02929, 12],
      [-0.02817, 13],
      [-0.02876, 15],
      [-0.02864, 17],
      [-0.02782, 18],
      [-0.02929, 20],
      [-0.02799, 21],
      [-0.02741, 22],
      [-0.02699, 24],
      [-0.02805, 26],
      [-0.02829, 27],
      [-0.02876, 28],
      [-0.02794, 30],
      [-0.02988, 31],
      [-0.02864, 32],
      [-0.02864, 34],
      [-0.02941, 36],
      [-0.02823, 38],
      [-0.02876, 39],
      [-0.02905, 40],
      [-0.02805, 41]
    ],
    "red_o_points": [],
    "y_categories": [
      "P16554",
      "P18297",
      "P19283",
      "P19287",
      "P23391",
      "P30595",
      "P31645",
      "P31691",
      "P34778",
      "P35046",
      "P36328",
      "P43633",
      "P4544",
      "P46417",
      "P48965",
      "P53068",
      "P5497",
      "P59529",
      "P62483",
      "P64658",
      "P65202",
      "P66816",
      "P6751",
      "P7408",
      "P75566",
      "P76226",
      "P79971",
      "P82621",
      "P82990",
      "P84549",
      "P84932",
      "P85825",
      "P86989",
      "P8770",
      "P87791",
      "P90550",
      "P93159",
      "P94969",
      "P96710",
      "P97130",
      "P9744",
      "P98500",
      "nan"
    ],
    "blue_o_points": [],
    "blue_x_points": [
      [0.05886, 0],
      [0.05731, 14],
      [0.05801, 16],
      [0.05731, 19],
      [0.05731, 23],
      [0.05872, 25],
      [0.06069, 29],
      [0.05872, 33],
      [0.06338, 35],
      [0.06168, 37]
    ]
  },
  "QA_lstPexTouch[T1]": {
    "red_x_points": [
      [-0.01093, 1],
      [-0.00223, 2],
      [0.00148, 1],
      [-0.00228, 2],
      [-0.01153, 1],
      [-0.00874, 0],
      [0.00104, 1],
      [0.00184, 1],
      [-0.01092, 1],
      [-0.00409, 0],
      [-0.00401, 0],
      [-0.00729, 0],
      [0.00903, 0],
      [-0.01268, 2],
      [-0.00383, 2],
      [-0.0042, 2],
      [-0.01225, 1],
      [-0.00152, 2],
      [-0.00539, 2],
      [0.00818, 0],
      [-0.01194, 1],
      [0.00827, 0],
      [-0.00349, 2],
      [-0.00481, 2],
      [-0.01118, 1],
      [0.00818, 0],
      [0.00399, 1],
      [-0.00249, 2],
      [-0.00188, 1],
      [-0.00448, 2],
      [0.00043, 1],
      [-0.01094, 1]
    ],
    "red_o_points": [],
    "y_categories": ["NORM", "NPV", "nan"],
    "blue_o_points": [],
    "blue_x_points": [
      [0.00073, 1],
      [0.00139, 2],
      [0.00103, 1],
      [0.00747, 1],
      [0.00979, 1],
      [0.00092, 1],
      [0.01303, 0],
      [0.00676, 0],
      [0.01117, 0],
      [0.01481, 0]
    ]
  },
  "QA_mulInjOrthesisType[ArmSling]": {
    "red_x_points": [
      [-0.00744, 2],
      [-0.00656, 2],
      [-0.00662, 2],
      [-0.00641, 2],
      [-0.00671, 2],
      [-0.00696, 2],
      [-0.00686, 2],
      [-0.00737, 2],
      [-0.00629, 2],
      [-0.00716, 2],
      [-0.00688, 2],
      [-0.0074, 2],
      [-0.00744, 2],
      [0.01132, 1],
      [-0.00785, 2],
      [-0.00715, 2],
      [-0.00859, 2],
      [-0.01224, 0],
      [0.01461, 1],
      [-0.00708, 2],
      [-0.00728, 2],
      [-0.02003, 0],
      [-0.00306, 3],
      [-0.00826, 2],
      [0.01185, 1],
      [-0.00663, 2],
      [-0.00717, 2],
      [-0.00576, 2],
      [-0.01532, 3],
      [0.00042, 3],
      [-0.00597, 2],
      [-0.00692, 2]
    ],
    "red_o_points": [],
    "y_categories": ["N", "NOT APPLICABLE", "Y", "nan"],
    "blue_o_points": [],
    "blue_x_points": [
      [0.00468, 2],
      [0.02312, 1],
      [0.01669, 1],
      [0.03522, 1],
      [-0.00473, 2],
      [0.01627, 1],
      [-0.00331, 2],
      [0.01508, 1],
      [-0.00475, 2],
      [0.01415, 3]
    ]
  },
  "QS_lstBpsurgSide": {
    "red_x_points": [
      [-0.00109, 3],
      [-0.00738, 0],
      [-0.00723, 0],
      [-0.00832, 0],
      [-0.00113, 3],
      [-0.00794, 2],
      [-0.00874, 0],
      [-0.00839, 0],
      [-0.00153, 3],
      [-0.00895, 0],
      [-0.0066, 2],
      [-0.00774, 2],
      [-0.0012, 3],
      [0.01235, 1],
      [-0.00102, 3],
      [-0.00799, 2],
      [-0.00118, 3],
      [-0.0071, 2],
      [-0.00156, 3],
      [-0.00127, 3],
      [-0.00104, 3],
      [-0.00119, 3],
      [-0.00716, 0],
      [-0.0017, 3],
      [-0.00177, 3],
      [-0.00112, 3],
      [-0.00707, 2],
      [-0.00603, 2],
      [0.01338, 1],
      [-0.00109, 3],
      [-0.00665, 0],
      [-0.00114, 3]
    ],
    "red_o_points": [],
    "y_categories": ["L", "NOT APPLICABLE", "R", "nan"],
    "blue_o_points": [],
    "blue_x_points": [
      [0.01869, 1],
      [-0.00038, 3],
      [0.01452, 1],
      [0.00213, 0],
      [9e-5, 2],
      [0.01477, 1],
      [-0.00051, 3],
      [0.01564, 1],
      [-0.00027, 3],
      [-0.00014, 3]
    ]
  },
  "QA_mulInjOrthesisType[ShoulderSupport]": {
    "red_x_points": [
      [-0.00624, 0],
      [-0.00595, 0],
      [-0.00651, 0],
      [-0.00639, 0],
      [-0.00641, 0],
      [-0.00636, 0],
      [-0.0062, 0],
      [-0.00591, 0],
      [-0.01757, 2],
      [-0.00643, 0],
      [-0.00589, 0],
      [-0.00575, 0],
      [-0.00662, 0],
      [0.01368, 1],
      [-0.00733, 0],
      [-0.00652, 0],
      [-0.0078, 0],
      [-0.01204, 2],
      [0.0132, 1],
      [-0.00555, 0],
      [-0.0064, 0],
      [-0.01879, 2],
      [-0.00404, 3],
      [-0.00724, 0],
      [0.01304, 1],
      [-0.00682, 0],
      [-0.00621, 0],
      [-0.0059, 0],
      [-0.01349, 3],
      [-0.00162, 3],
      [-0.00553, 0],
      [-0.00596, 0]
    ],
    "red_o_points": [],
    "y_categories": ["N", "NOT APPLICABLE", "Y", "nan"],
    "blue_o_points": [],
    "blue_x_points": [
      [0.00244, 0],
      [0.02461, 1],
      [0.01592, 1],
      [0.03076, 1],
      [-0.00427, 0],
      [0.01681, 1],
      [-0.00264, 0],
      [0.01679, 1],
      [-0.00322, 0],
      [0.01235, 3]
    ]
  },
  "QA_yonInjUnconscio": {
    "red_x_points": [
      [-0.00594, 1],
      [-0.00706, 1],
      [-0.00511, 2],
      [-0.00446, 2],
      [-0.00566, 2],
      [0.02052, 0],
      [-0.00845, 1],
      [-0.00559, 2],
      [-0.00635, 2],
      [-0.00644, 2],
      [-0.00519, 2],
      [-0.01102, 1],
      [-0.0071, 1],
      [-0.01925, 1],
      [-0.00747, 2],
      [-0.00465, 2],
      [-0.00591, 2],
      [-0.00701, 1],
      [0.00678, 0],
      [-0.00894, 1],
      [-0.00674, 1],
      [-0.00751, 1],
      [-0.00682, 1],
      [-0.00771, 2],
      [-0.0078, 1],
      [-0.00661, 2],
      [-0.00875, 1],
      [-0.00696, 1],
      [-0.00211, 2],
      [-0.00555, 2],
      [-0.00781, 1],
      [-0.00555, 2]
    ],
    "red_o_points": [],
    "y_categories": ["N", "Y", "nan"],
    "blue_o_points": [],
    "blue_x_points": [
      [-0.0001, 2],
      [0.00617, 1],
      [0.01777, 0],
      [0.0303, 0],
      [0.02761, 0],
      [0.0008, 2],
      [-0.00268, 1],
      [0.00134, 2],
      [0.03387, 0],
      [-0.00066, 2]
    ]
  },
  "QS_mulTransfSite[Other]": {
    "red_x_points": [
      [-0.00217, 3],
      [-0.01524, 0],
      [-0.01547, 0],
      [-0.01562, 0],
      [-0.0024, 3],
      [-0.01609, 0],
      [-0.01592, 0],
      [-0.01501, 0],
      [-0.00234, 3],
      [-0.01524, 0],
      [-0.01527, 0],
      [-0.01507, 0],
      [-0.00267, 3],
      [0.02043, 1],
      [-0.00252, 3],
      [-0.01554, 0],
      [-0.00219, 3],
      [-0.01409, 0],
      [-0.00423, 3],
      [-0.00268, 3],
      [-0.00241, 3],
      [-0.00242, 3],
      [-0.01487, 0],
      [-0.00281, 3],
      [-0.00375, 3],
      [-0.00213, 3],
      [-0.01536, 0],
      [-0.01514, 0],
      [0.0237, 1],
      [-0.00203, 3],
      [-0.01484, 0],
      [-0.0029, 3]
    ],
    "red_o_points": [],
    "y_categories": ["N", "NOT APPLICABLE", "Y", "nan"],
    "blue_o_points": [],
    "blue_x_points": [
      [0.02736, 1],
      [-0.00079, 3],
      [0.02353, 1],
      [-0.00588, 0],
      [0.05236, 2],
      [0.0235, 1],
      [-0.00101, 3],
      [0.0241, 1],
      [-0.00081, 3],
      [-0.00061, 3]
    ]
  },
  "QA_lstInjTpbiSide": {
    "red_x_points": [
      [-0.00271, 1],
      [0.0003, 0],
      [-7e-5, 0],
      [0.00016, 0],
      [0.00051, 0],
      [-0.00098, 1],
      [-0.00116, 0],
      [-0.00169, 0],
      [-0.00347, 1],
      [-0.0007, 0],
      [-0.00039, 1],
      [-0.00049, 1],
      [-0.00459, 1],
      [-0.01928, 0],
      [-0.00489, 1],
      [-0.00181, 1],
      [0.00034, 0],
      [-0.00126, 1],
      [-0.00862, 1],
      [0.00016, 0],
      [0.00106, 0],
      [-0.00204, 0],
      [0.00015, 0],
      [0.00238, 0],
      [-0.0048, 1],
      [-0.00484, 1],
      [-0.00113, 1],
      [-0.00044, 1],
      [-0.01752, 0],
      [-0.00541, 1],
      [-0.00045, 0],
      [0.00089, 0]
    ],
    "red_o_points": [],
    "y_categories": ["L", "R", "nan"],
    "blue_o_points": [],
    "blue_x_points": [
      [-0.00546, 0],
      [0.00709, 0],
      [0.01056, 1],
      [0.00255, 0],
      [0.00213, 1],
      [0.00973, 1],
      [0.00228, 1],
      [0.00958, 1],
      [0.00512, 0],
      [0.00527, 0]
    ]
  },
  "QS_mulLysisSite[Trunk]": {
    "red_x_points": [
      [-0.00123, 3],
      [-0.00367, 0],
      [-0.00407, 0],
      [-0.00431, 0],
      [-0.00142, 3],
      [-0.005, 0],
      [-0.00944, 2],
      [-0.00401, 0],
      [-0.00155, 3],
      [-0.0039, 0],
      [-0.0036, 0],
      [-0.00398, 0],
      [-0.00123, 3],
      [0.00851, 1],
      [-0.00115, 3],
      [-0.00418, 0],
      [-0.00114, 3],
      [-0.00862, 2],
      [-0.00133, 3],
      [-0.00141, 3],
      [-0.00113, 3],
      [-0.00134, 3],
      [-0.0035, 0],
      [-0.00107, 3],
      [-0.0019, 3],
      [-0.00104, 3],
      [-0.00385, 0],
      [-0.00365, 0],
      [0.01153, 1],
      [-0.00124, 3],
      [-0.0087, 2],
      [-0.00118, 3]
    ],
    "red_o_points": [],
    "y_categories": ["N", "NOT APPLICABLE", "Y", "nan"],
    "blue_o_points": [],
    "blue_x_points": [
      [0.01316, 1],
      [5e-5, 3],
      [0.01036, 1],
      [-0.0008, 0],
      [-0.00124, 0],
      [0.0129, 1],
      [-0.00044, 3],
      [0.01223, 1],
      [-0.00051, 3],
      [-0.00047, 3]
    ]
  },
  "QS_mulGraftTrunk[UpperTrunk]": {
    "red_x_points": [
      [-0.00034, 3],
      [-0.00125, 0],
      [-0.00141, 0],
      [-0.00162, 0],
      [-0.00031, 3],
      [-0.00163, 0],
      [-0.00142, 0],
      [-0.0017, 0],
      [-0.00024, 3],
      [-0.00163, 0],
      [-0.00177, 0],
      [-0.00143, 0],
      [-0.00032, 3],
      [0.00331, 1],
      [-0.00036, 3],
      [-0.00512, 2],
      [-0.0005, 3],
      [-0.00122, 0],
      [-0.00044, 3],
      [-0.00035, 3],
      [-0.00018, 3],
      [-0.00027, 3],
      [-0.00146, 0],
      [-0.00041, 3],
      [-0.00053, 3],
      [-0.00043, 3],
      [-0.00132, 0],
      [-0.00156, 0],
      [0.0037, 1],
      [-0.00029, 3],
      [-0.00122, 0],
      [-0.00045, 3]
    ],
    "red_o_points": [],
    "y_categories": ["N", "NOT APPLICABLE", "Y", "nan"],
    "blue_o_points": [],
    "blue_x_points": [
      [0.0049, 1],
      [-0.00015, 3],
      [0.00446, 1],
      [0.00024, 0],
      [-0.00125, 0],
      [0.00382, 1],
      [-0.00019, 3],
      [0.00432, 1],
      [-0.00017, 3],
      [-0.00015, 3]
    ]
  },
  "QS_mulTransfSite[PhMc]": {
    "red_x_points": [
      [-0.00079, 3],
      [-0.00321, 0],
      [-0.00355, 0],
      [-0.00368, 0],
      [-0.00093, 3],
      [-0.00334, 0],
      [-0.00299, 0],
      [-0.00868, 2],
      [-0.00099, 3],
      [-0.00312, 0],
      [-0.00355, 0],
      [-0.00322, 0],
      [-0.00087, 3],
      [0.00706, 1],
      [-0.00084, 3],
      [-0.00338, 0],
      [-0.00075, 3],
      [-0.00321, 0],
      [-0.00141, 3],
      [-0.00087, 3],
      [-0.00084, 3],
      [-0.00073, 3],
      [-0.00655, 2],
      [-0.00079, 3],
      [-0.00142, 3],
      [-0.00084, 3],
      [-0.00284, 0],
      [-0.00295, 0],
      [0.00754, 1],
      [-0.00084, 3],
      [-0.00286, 0],
      [-0.0012, 3]
    ],
    "red_o_points": [],
    "y_categories": ["N", "NOT APPLICABLE", "Y", "nan"],
    "blue_o_points": [],
    "blue_x_points": [
      [0.01054, 1],
      [-0.00047, 3],
      [0.00842, 1],
      [-0.00044, 0],
      [-0.00085, 0],
      [0.00949, 1],
      [-0.00045, 3],
      [0.00951, 1],
      [-0.00021, 3],
      [-0.00028, 3]
    ]
  },
  "QA_mulInjTbpiCause[Motorcycle]": {
    "red_x_points": [
      [-0.00241, 0],
      [-0.00044, 1],
      [-0.0006, 1],
      [-0.00072, 1],
      [-0.00039, 1],
      [-0.00033, 1],
      [-0.00034, 1],
      [-0.00056, 1],
      [0.0007, 1],
      [-0.00085, 1],
      [-0.00053, 1],
      [-0.00021, 1],
      [-0.00801, 0],
      [-0.04386, 1],
      [-0.00028, 1],
      [-0.00085, 1],
      [-0.00054, 1],
      [-0.00077, 1],
      [-0.00114, 1],
      [-0.01161, 0],
      [0.00028, 1],
      [0.00272, 1],
      [-0.00036, 1],
      [-0.00037, 1],
      [-0.00109, 1],
      [-0.00626, 0],
      [-0.00052, 1],
      [-0.00027, 1],
      [-0.04502, 1],
      [-0.00025, 1],
      [-0.00023, 1],
      [-0.00051, 1]
    ],
    "red_o_points": [],
    "y_categories": ["N", "Y", "nan"],
    "blue_o_points": [],
    "blue_x_points": [
      [0.02109, 0],
      [-0.00069, 1],
      [0.01717, 0],
      [-0.00151, 1],
      [-0.00015, 1],
      [0.01813, 0],
      [0.00425, 1],
      [0.01823, 0],
      [0.00444, 1],
      [0.00359, 1]
    ]
  },
  "QS_mulLysisSite[Root]": {
    "red_x_points": [
      [-0.00042, 3],
      [-0.00124, 0],
      [-0.00432, 2],
      [-0.00123, 0],
      [-0.00033, 3],
      [-0.00138, 0],
      [-0.00125, 0],
      [-0.00102, 0],
      [-0.00073, 3],
      [-0.00111, 0],
      [-0.00133, 0],
      [-0.00064, 0],
      [-0.00017, 3],
      [0.00259, 1],
      [-0.0007, 3],
      [-0.00117, 0],
      [-0.00016, 3],
      [-0.00116, 0],
      [-0.00023, 3],
      [-0.00054, 3],
      [-0.00044, 3],
      [-0.00021, 3],
      [-0.00119, 0],
      [-0.00032, 3],
      [-0.00024, 3],
      [-0.00014, 3],
      [-0.00138, 0],
      [-0.00138, 0],
      [0.00302, 1],
      [-8e-5, 3],
      [-0.00439, 2],
      [-0.00018, 3]
    ],
    "red_o_points": [],
    "y_categories": ["N", "NOT APPLICABLE", "Y", "nan"],
    "blue_o_points": [],
    "blue_x_points": [
      [0.00364, 1],
      [-7e-5, 3],
      [0.0036, 1],
      [0.00024, 0],
      [-7e-5, 0],
      [0.00313, 1],
      [-0.00012, 3],
      [0.0045, 1],
      [-0.00023, 3],
      [5e-5, 3]
    ]
  },
  "QS_mulGraftLevel[Trunk]": {
    "red_x_points": [
      [-0.00015, 3],
      [-0.0006, 0],
      [-0.00059, 0],
      [-0.00059, 0],
      [-0.00017, 3],
      [-0.00052, 0],
      [-0.00054, 0],
      [-0.00068, 0],
      [-0.00015, 3],
      [-0.00057, 0],
      [-0.00063, 0],
      [-0.00059, 0],
      [-0.00012, 3],
      [0.00112, 1],
      [-0.0002, 3],
      [-0.00291, 2],
      [-0.00016, 3],
      [-0.00045, 0],
      [-0.00012, 3],
      [-0.00018, 3],
      [-0.00022, 3],
      [-0.0001, 3],
      [-0.00063, 0],
      [-0.00027, 3],
      [-0.00022, 3],
      [-0.00021, 3],
      [-0.00047, 0],
      [-0.00058, 0],
      [0.00142, 1],
      [-0.00019, 3],
      [-0.00061, 0],
      [-0.00019, 3]
    ],
    "red_o_points": [],
    "y_categories": ["N", "NOT APPLICABLE", "Y", "nan"],
    "blue_o_points": [],
    "blue_x_points": [
      [0.00216, 1],
      [-3e-5, 3],
      [0.00163, 1],
      [0.0004, 0],
      [-0.00057, 0],
      [0.00163, 1],
      [-9e-5, 3],
      [0.00117, 1],
      [-0.0001, 3],
      [-1e-5, 3]
    ]
  },
  "QS_mulGraftNerve[other]": {
    "red_x_points": [
      [8e-5, 2],
      [-0.00013, 0],
      [-6e-5, 0],
      [-7e-5, 0],
      [-1e-5, 2],
      [-0.00014, 0],
      [-7e-5, 0],
      [-9e-5, 0],
      [1e-5, 2],
      [-6e-5, 0],
      [-9e-5, 0],
      [-7e-5, 0],
      [0.0, 2],
      [7e-5, 1],
      [1e-5, 2],
      [-0.00023, 0],
      [1e-5, 2],
      [-6e-5, 0],
      [0.0, 2],
      [0.0, 2],
      [0.0, 2],
      [-6e-5, 0],
      [1e-5, 2],
      [0.0, 2],
      [-0.00013, 0],
      [0.00014, 1],
      [1e-5, 2],
      [0.0, 2]
    ],
    "red_o_points": [],
    "y_categories": ["N", "NOT APPLICABLE", "nan"],
    "blue_o_points": [],
    "blue_x_points": [
      [7e-5, 1],
      [0.00019, 2],
      [0.00029, 1],
      [-1e-5, 0],
      [0.00014, 1],
      [0.0, 2],
      [7e-5, 1],
      [0.0, 2],
      [1e-5, 2]
    ]
  },
  "QS_mulNeuromadSite[C5]": {
    "red_x_points": [
      [-8e-5, 2],
      [-0.00061, 0],
      [-0.00064, 0],
      [-0.00048, 0],
      [-0.00017, 2],
      [-0.00088, 0],
      [-0.00065, 0],
      [-0.00055, 0],
      [-0.00017, 2],
      [-0.00062, 0],
      [-0.00075, 0],
      [-0.00064, 0],
      [-6e-5, 2],
      [0.00094, 1],
      [-0.0002, 2],
      [-0.00049, 0],
      [-0.00018, 2],
      [-0.00062, 0],
      [-0.00013, 2],
      [-0.00016, 2],
      [-0.00011, 2],
      [-6e-5, 2],
      [-0.00064, 0],
      [-0.00011, 2],
      [-0.00042, 2],
      [-9e-5, 2],
      [-0.00048, 0],
      [-0.00062, 0],
      [0.00123, 1],
      [-7e-5, 2],
      [-0.00052, 0],
      [-0.00015, 2]
    ],
    "red_o_points": [],
    "y_categories": ["N", "NOT APPLICABLE", "nan"],
    "blue_o_points": [],
    "blue_x_points": [
      [0.00174, 1],
      [2e-5, 2],
      [0.00115, 1],
      [-0.00017, 0],
      [-0.00017, 0],
      [0.00146, 1],
      [-1e-5, 2],
      [0.00133, 1],
      [-8e-5, 2],
      [-3e-5, 2]
    ]
  },
  "QS_mulNeuromadSite[C7]": {
    "red_x_points": [
      [-5e-5, 2],
      [-0.00079, 0],
      [-0.00059, 0],
      [-0.00079, 0],
      [-7e-5, 2],
      [-0.00079, 0],
      [-0.00068, 0],
      [-0.0008, 0],
      [-0.0, 2],
      [-0.00078, 0],
      [-0.00098, 0],
      [-0.00063, 0],
      [2e-5, 2],
      [0.00073, 1],
      [-2e-5, 2],
      [-0.00062, 0],
      [-4e-5, 2],
      [-0.00064, 0],
      [-0.00032, 2],
      [-5e-5, 2],
      [-4e-5, 2],
      [-3e-5, 2],
      [-0.00063, 0],
      [-2e-5, 2],
      [-0.00017, 2],
      [-6e-5, 2],
      [-0.00073, 0],
      [-0.00061, 0],
      [0.00125, 1],
      [-2e-5, 2],
      [-0.00069, 0],
      [-0.0001, 2]
    ],
    "red_o_points": [],
    "y_categories": ["N", "NOT APPLICABLE", "nan"],
    "blue_o_points": [],
    "blue_x_points": [
      [0.00187, 1],
      [-0.00011, 2],
      [0.00157, 1],
      [0.00027, 0],
      [-0.00013, 0],
      [0.00134, 1],
      [0.00012, 2],
      [0.00121, 1],
      [5e-5, 2],
      [2e-5, 2]
    ]
  },
  "QS_mulTransfSite[IMc]": {
    "red_x_points": [
      [-0.0014, 3],
      [-0.00987, 2],
      [-0.00433, 0],
      [-0.00512, 0],
      [-0.00149, 3],
      [-0.00506, 0],
      [-0.00413, 0],
      [-0.00468, 0],
      [-0.0019, 3],
      [-0.00488, 0],
      [-0.00506, 0],
      [-0.00432, 0],
      [-0.00154, 3],
      [0.00987, 1],
      [-0.00161, 3],
      [-0.00501, 0],
      [-0.00119, 3],
      [-0.0103, 2],
      [-0.00128, 3],
      [-0.00207, 3],
      [-0.0015, 3],
      [-0.00128, 3],
      [-0.00422, 0],
      [-0.00155, 3],
      [-0.00197, 3],
      [-0.00136, 3],
      [-0.00496, 0],
      [-0.00878, 2],
      [0.01227, 1],
      [-0.00135, 3],
      [-0.0119, 2],
      [-0.00136, 3]
    ],
    "red_o_points": [],
    "y_categories": ["N", "NOT APPLICABLE", "Y", "nan"],
    "blue_o_points": [],
    "blue_x_points": [
      [0.01644, 1],
      [5e-5, 3],
      [0.01317, 1],
      [-0.00019, 0],
      [-0.00145, 0],
      [0.01389, 1],
      [-0.00048, 3],
      [0.01487, 1],
      [-0.00091, 3],
      [-0.00046, 3]
    ]
  },
  "QS_mulNeuromadSite[T1]": {
    "red_x_points": [
      [-0.00022, 2],
      [-0.00076, 0],
      [-0.00062, 0],
      [-0.00082, 0],
      [-0.00019, 2],
      [-0.00125, 0],
      [-0.00052, 0],
      [-0.0007, 0],
      [-0.00024, 2],
      [-0.00075, 0],
      [-0.00098, 0],
      [-0.00093, 0],
      [-4e-5, 2],
      [0.00073, 1],
      [-0.00023, 2],
      [-0.00076, 0],
      [-0.00016, 2],
      [-0.00057, 0],
      [-0.00021, 2],
      [-0.0002, 2],
      [-5e-5, 2],
      [-0.00016, 2],
      [-0.00023, 0],
      [-0.00014, 2],
      [-0.00063, 2],
      [-0.00012, 2],
      [-0.00085, 0],
      [-0.00054, 0],
      [0.0014, 1],
      [-0.00017, 2],
      [-0.0005, 0],
      [-0.0002, 2]
    ],
    "red_o_points": [],
    "y_categories": ["N", "NOT APPLICABLE", "nan"],
    "blue_o_points": [],
    "blue_x_points": [
      [0.00244, 1],
      [-4e-5, 2],
      [0.00205, 1],
      [0.0001, 0],
      [-0.00021, 0],
      [0.0014, 1],
      [-9e-5, 2],
      [0.00112, 1],
      [-7e-5, 2],
      [3e-5, 2]
    ]
  },
  "QS_mulLysisRoot[C7]": {
    "red_x_points": [
      [-0.00025, 3],
      [-0.00066, 0],
      [-0.00356, 2],
      [-0.00086, 0],
      [-0.00026, 3],
      [-0.00066, 0],
      [-0.0009, 0],
      [-0.00051, 0],
      [-0.0002, 3],
      [-0.00069, 0],
      [-0.00063, 0],
      [-0.00075, 0],
      [-0.00025, 3],
      [0.00224, 1],
      [-0.00024, 3],
      [-0.00087, 0],
      [-0.00027, 3],
      [-0.00085, 0],
      [-0.00025, 3],
      [-0.00025, 3],
      [-0.0003, 3],
      [-0.00024, 3],
      [-0.00069, 0],
      [-0.00027, 3],
      [-0.00024, 3],
      [-0.00028, 3],
      [-0.00073, 0],
      [-0.00089, 0],
      [0.00231, 1],
      [-0.00021, 3],
      [-0.0008, 0],
      [-0.00019, 3]
    ],
    "red_o_points": [],
    "y_categories": ["N", "NOT APPLICABLE", "Y", "nan"],
    "blue_o_points": [],
    "blue_x_points": [
      [0.00284, 1],
      [-0.0001, 3],
      [0.00194, 1],
      [-0.00031, 0],
      [-0.00037, 0],
      [0.00248, 1],
      [-0.00017, 3],
      [0.00242, 1],
      [-0.0001, 3],
      [-0.0001, 3]
    ]
  },
  "QA_lstPexPain[T1]": {
    "red_x_points": [
      [-0.01166, 1],
      [-0.00309, 2],
      [-0.0036, 2],
      [-0.00275, 2],
      [-0.01262, 1],
      [-0.00911, 0],
      [0.00222, 1],
      [0.00221, 1],
      [0.0092, 0],
      [0.00375, 1],
      [-0.00503, 0],
      [-0.00852, 0],
      [0.00879, 0],
      [-0.01567, 2],
      [-0.00634, 2],
      [-0.00576, 2],
      [-0.00645, 2],
      [-0.0026, 2],
      [-0.00686, 2],
      [0.00903, 0],
      [-0.01152, 1],
      [0.00926, 0],
      [-0.00407, 2],
      [-0.00683, 2],
      [-0.01039, 1],
      [-0.00662, 2],
      [-0.00644, 2],
      [-0.00313, 2],
      [-0.00443, 1],
      [-0.01401, 1],
      [0.00061, 1],
      [-0.01198, 1]
    ],
    "red_o_points": [],
    "y_categories": ["NORM", "NPV", "nan"],
    "blue_o_points": [],
    "blue_x_points": [
      [0.00017, 1],
      [-0.00046, 2],
      [0.00675, 0],
      [0.00952, 1],
      [0.0158, 1],
      [-7e-5, 1],
      [0.01423, 0],
      [0.00646, 0],
      [0.01191, 0],
      [0.01659, 0]
    ]
  },
  "QS_mulTransfSite[AcMc]": {
    "red_x_points": [
      [-0.00019, 3],
      [-0.00043, 0],
      [-0.00013, 0],
      [-0.0004, 0],
      [-7e-5, 3],
      [-0.00035, 0],
      [-0.00045, 0],
      [-0.00034, 0],
      [-0.00047, 3],
      [-0.00034, 0],
      [-0.00047, 0],
      [-0.00594, 2],
      [-0.0002, 3],
      [0.00116, 1],
      [-0.00027, 3],
      [-0.0003, 0],
      [-0.00028, 3],
      [-0.00033, 0],
      [-7e-5, 3],
      [-0.00063, 3],
      [-9e-5, 3],
      [-0.00025, 3],
      [-0.00039, 0],
      [-0.00025, 3],
      [-0.00016, 3],
      [-8e-5, 3],
      [-0.00035, 0],
      [-0.00043, 0],
      [0.00037, 1],
      [-0.0001, 3],
      [-0.00029, 0],
      [-0.00012, 3]
    ],
    "red_o_points": [],
    "y_categories": ["N", "NOT APPLICABLE", "Y", "nan"],
    "blue_o_points": [],
    "blue_x_points": [
      [0.00198, 1],
      [-5e-5, 3],
      [0.00149, 1],
      [0.0006, 0],
      [0.00144, 0],
      [0.00189, 1],
      [-0.00017, 3],
      [0.00136, 1],
      [-0.00027, 3],
      [-4e-5, 3]
    ]
  },
  "QA_lstPexKine[Shoulder]": {
    "red_x_points": [
      [-0.00158, 1],
      [-0.00252, 2],
      [-0.0036, 2],
      [-0.00288, 2],
      [-0.00725, 2],
      [-0.00378, 1],
      [-0.0021, 1],
      [0.00452, 0],
      [-0.0097, 2],
      [-0.00151, 1],
      [-0.00249, 1],
      [-0.00347, 1],
      [-0.00206, 1],
      [-0.00105, 2],
      [-0.00624, 2],
      [-0.00182, 1],
      [-0.00591, 2],
      [-0.00257, 2],
      [-0.00546, 2],
      [-0.0025, 1],
      [-0.00109, 1],
      [-0.00242, 1],
      [-0.00243, 2],
      [-0.00625, 2],
      [-0.00164, 1],
      [-0.00913, 2],
      [-0.00535, 2],
      [-0.0032, 2],
      [-0.00147, 2],
      [-0.00584, 2],
      [-0.00137, 1],
      [-0.00652, 2]
    ],
    "red_o_points": [],
    "y_categories": ["NPV", "PV", "nan"],
    "blue_o_points": [],
    "blue_x_points": [
      [4e-5, 1],
      [-0.00289, 2],
      [-0.00018, 1],
      [0.00167, 1],
      [0.02452, 0],
      [-0.00027, 1],
      [0.04747, 0],
      [-0.00042, 2],
      [0.0008, 1],
      [0.00097, 1]
    ]
  },
  "QA_yonInjBpsurg": {
    "red_x_points": [
      [-0.00215, 1],
      [-0.00206, 1],
      [-0.00189, 1],
      [-0.00185, 1],
      [-0.00199, 1],
      [-0.0025, 1],
      [-0.0019, 1],
      [-0.00207, 1],
      [-0.00216, 1],
      [-0.0026, 1],
      [-0.00212, 1],
      [-0.00193, 1],
      [-0.00217, 1],
      [0.00446, 0],
      [-0.00238, 1],
      [-0.00193, 1],
      [-0.00254, 1],
      [-0.00187, 1],
      [-0.00218, 1],
      [-0.00224, 1],
      [-0.00211, 1],
      [-0.00213, 1],
      [-0.00167, 1],
      [-0.00233, 1],
      [-0.00231, 1],
      [-0.00241, 1],
      [-0.00212, 1],
      [-0.00176, 1],
      [0.00566, 0],
      [-0.00196, 1],
      [-0.00188, 1],
      [-0.00226, 1]
    ],
    "red_o_points": [],
    "y_categories": ["N", "Y", "nan"],
    "blue_o_points": [],
    "blue_x_points": [
      [0.01082, 0],
      [-0.00089, 1],
      [0.00927, 0],
      [-0.00188, 1],
      [-0.00182, 1],
      [0.00787, 0],
      [-0.00103, 1],
      [0.00808, 0],
      [-0.00108, 1],
      [-0.00061, 1]
    ]
  },
  "QS_mulLysisNerve[Ssr]": {
    "red_x_points": [
      [-5e-5, 3],
      [-0.00039, 0],
      [-0.00235, 2],
      [-0.00046, 0],
      [-4e-5, 3],
      [-0.00043, 0],
      [-0.00035, 0],
      [-0.00031, 0],
      [-6e-5, 3],
      [-0.0004, 0],
      [-0.00041, 0],
      [-0.00036, 0],
      [-4e-5, 3],
      [0.00072, 1],
      [-0.0001, 3],
      [-0.00037, 0],
      [-5e-5, 3],
      [-0.00039, 0],
      [-6e-5, 3],
      [-6e-5, 3],
      [-3e-5, 3],
      [-2e-5, 3],
      [-0.0004, 0],
      [-8e-5, 3],
      [-3e-5, 3],
      [-5e-5, 3],
      [-0.00035, 0],
      [-0.00031, 0],
      [0.00095, 1],
      [-1e-5, 3],
      [-0.0003, 0],
      [-5e-5, 3]
    ],
    "red_o_points": [],
    "y_categories": ["N", "NOT APPLICABLE", "Y", "nan"],
    "blue_o_points": [],
    "blue_x_points": [
      [0.00171, 1],
      [-1e-5, 3],
      [0.0009, 1],
      [0.00031, 0],
      [-3e-5, 0],
      [0.00061, 1],
      [-6e-5, 3],
      [0.00086, 1],
      [-9e-5, 3],
      [1e-5, 3]
    ]
  },
  "QS_mulTransfSite[AcSsAA]": {
    "red_x_points": [
      [-0.00179, 3],
      [-0.01527, 2],
      [-0.00397, 0],
      [-0.01562, 2],
      [-0.00219, 3],
      [-0.01965, 2],
      [-0.00346, 0],
      [-0.00352, 0],
      [-0.00268, 3],
      [-0.00345, 0],
      [-0.01844, 2],
      [-0.00276, 0],
      [-0.00185, 3],
      [0.01617, 1],
      [-0.00236, 3],
      [-0.01729, 2],
      [-0.00244, 3],
      [-0.00402, 0],
      [-0.00263, 3],
      [-0.00219, 3],
      [-0.00183, 3],
      [-0.00201, 3],
      [-0.01516, 2],
      [-0.00229, 3],
      [-0.0036, 3],
      [-0.00228, 3],
      [-0.00359, 0],
      [-0.01446, 2],
      [0.01915, 1],
      [-0.0023, 3],
      [-0.00309, 0],
      [-0.00209, 3]
    ],
    "red_o_points": [],
    "y_categories": ["N", "NOT APPLICABLE", "Y", "nan"],
    "blue_o_points": [],
    "blue_x_points": [
      [0.02442, 1],
      [-0.00067, 3],
      [0.02236, 1],
      [0.00237, 0],
      [0.00125, 0],
      [0.02149, 1],
      [-0.00118, 3],
      [0.02041, 1],
      [-0.00071, 3],
      [-0.00045, 3]
    ]
  },
  "QS_mulLysisRoot[C5]": {
    "red_x_points": [
      [-0.00081, 3],
      [-0.00207, 0],
      [-0.00685, 2],
      [-0.0022, 0],
      [-0.00086, 3],
      [-0.00222, 0],
      [-0.00181, 0],
      [-0.00183, 0],
      [-0.00142, 3],
      [-0.00225, 0],
      [-0.00225, 0],
      [-0.00122, 0],
      [-0.00088, 3],
      [0.00445, 1],
      [-0.00088, 3],
      [-0.00254, 0],
      [-0.00083, 3],
      [-0.0021, 0],
      [-0.00096, 3],
      [-0.00114, 3],
      [-0.00079, 3],
      [-0.00096, 3],
      [-0.00164, 0],
      [-0.00103, 3],
      [-0.00111, 3],
      [-0.00079, 3],
      [-0.00191, 0],
      [-0.00178, 0],
      [0.00498, 1],
      [-0.00094, 3],
      [-0.0067, 2],
      [-0.00093, 3]
    ],
    "red_o_points": [],
    "y_categories": ["N", "NOT APPLICABLE", "Y", "nan"],
    "blue_o_points": [],
    "blue_x_points": [
      [0.0083, 1],
      [-0.00024, 3],
      [0.00551, 1],
      [0.00099, 0],
      [-0.00014, 0],
      [0.00743, 1],
      [-0.00021, 3],
      [0.00607, 1],
      [-0.00049, 3],
      [-0.00019, 3]
    ]
  },
  "QS_mulNeuromadSite[C6]": {
    "red_x_points": [
      [-0.00011, 2],
      [-0.00038, 0],
      [-0.00044, 0],
      [-0.0005, 0],
      [-4e-5, 2],
      [-0.00049, 0],
      [-0.00037, 0],
      [-0.00049, 0],
      [-0.00013, 2],
      [-0.00047, 0],
      [-0.00067, 0],
      [-0.00046, 0],
      [-2e-5, 2],
      [0.00038, 1],
      [-4e-5, 2],
      [-0.00042, 0],
      [-5e-5, 2],
      [-0.00038, 0],
      [-0.00065, 2],
      [-5e-5, 2],
      [-7e-5, 2],
      [-7e-5, 2],
      [-0.00034, 0],
      [-0.00016, 2],
      [-0.0005, 2],
      [-1e-5, 2],
      [-0.00045, 0],
      [-0.0004, 0],
      [0.00057, 1],
      [-0.00011, 2],
      [-0.00031, 0],
      [-9e-5, 2]
    ],
    "red_o_points": [],
    "y_categories": ["N", "NOT APPLICABLE", "nan"],
    "blue_o_points": [],
    "blue_x_points": [
      [0.00126, 1],
      [-5e-5, 2],
      [0.00084, 1],
      [0.00071, 0],
      [-0.00012, 0],
      [0.00091, 1],
      [0.00011, 2],
      [0.00137, 1],
      [4e-5, 2],
      [-0.0, 2]
    ]
  },
  "QS_mulBpsurgeryType[Lysis]": {
    "red_x_points": [
      [-0.00172, 3],
      [-0.00557, 0],
      [-0.01409, 2],
      [-0.00566, 0],
      [-0.0017, 3],
      [-0.00595, 0],
      [-0.01387, 2],
      [-0.00571, 0],
      [-0.00228, 3],
      [-0.00549, 0],
      [-0.00576, 0],
      [-0.00424, 0],
      [-0.0017, 3],
      [0.01267, 1],
      [-0.00194, 3],
      [-0.00608, 0],
      [-0.00176, 3],
      [-0.01298, 2],
      [-0.0023, 3],
      [-0.00198, 3],
      [-0.00169, 3],
      [-0.0017, 3],
      [-0.00564, 0],
      [-0.00219, 3],
      [-0.00297, 3],
      [-0.00144, 3],
      [-0.00524, 0],
      [-0.00484, 0],
      [0.01316, 1],
      [-0.00144, 3],
      [-0.01402, 2],
      [-0.00193, 3]
    ],
    "red_o_points": [],
    "y_categories": ["N", "NOT APPLICABLE", "Y", "nan"],
    "blue_o_points": [],
    "blue_x_points": [
      [0.01991, 1],
      [-0.00052, 3],
      [0.01812, 1],
      [0.00126, 0],
      [-0.00111, 0],
      [0.01786, 1],
      [-0.0008, 3],
      [0.01794, 1],
      [-0.00099, 3],
      [-3e-5, 3]
    ]
  },
  "QA_lstPexTouch[C7]": {
    "red_x_points": [
      [-0.0085, 1],
      [-0.00235, 2],
      [-0.00293, 1],
      [-0.0028, 2],
      [-0.00811, 1],
      [0.00354, 0],
      [-0.00295, 1],
      [-0.00317, 1],
      [0.00574, 0],
      [-0.00326, 1],
      [0.00401, 0],
      [-0.00379, 1],
      [-0.01109, 1],
      [-0.01131, 2],
      [-0.0045, 2],
      [-0.00287, 2],
      [-0.00841, 1],
      [-0.0024, 2],
      [-0.00526, 2],
      [0.00741, 0],
      [-0.00854, 1],
      [0.00619, 0],
      [-0.00338, 2],
      [-0.00403, 2],
      [0.00338, 0],
      [0.00665, 0],
      [-0.00396, 1],
      [-0.00261, 2],
      [-0.0028, 1],
      [-0.00411, 2],
      [-0.00311, 1],
      [-0.00849, 1]
    ],
    "red_o_points": [],
    "y_categories": ["NORM", "NPV", "nan"],
    "blue_o_points": [],
    "blue_x_points": [
      [0.00013, 1],
      [-8e-5, 2],
      [0.00126, 1],
      [0.00083, 1],
      [0.01267, 0],
      [0.00132, 1],
      [0.01003, 0],
      [0.0047, 0],
      [0.009, 0],
      [0.01229, 0]
    ]
  },
  "QA_lstPexMuscstrength[ShoulderAbduc]": {
    "red_x_points": [
      [-0.00335, 1],
      [-0.00322, 1],
      [-0.00313, 1],
      [-0.00335, 1],
      [-0.0033, 1],
      [-0.00341, 1],
      [-0.00306, 1],
      [-0.00329, 1],
      [-0.00347, 1],
      [-0.00356, 1],
      [-0.0034, 1],
      [-0.00342, 1],
      [-0.00357, 1],
      [0.00092, 2],
      [0.00096, 2],
      [0.00157, 2],
      [0.00124, 2],
      [0.00152, 2],
      [0.00118, 2],
      [-0.00341, 1],
      [-0.00353, 1],
      [-0.00336, 1],
      [-0.00299, 1],
      [0.00124, 2],
      [-0.00487, 1],
      [-0.00275, 1],
      [-0.00333, 1],
      [-0.00279, 1],
      [0.00082, 2],
      [-0.00326, 1],
      [-0.00327, 1],
      [0.00148, 2]
    ],
    "red_o_points": [],
    "y_categories": ["GREATER THAN OR EQUALS TO 3", "LESS THAN 3", "nan"],
    "blue_o_points": [],
    "blue_x_points": [
      [0.00116, 2],
      [0.00189, 2],
      [0.01797, 0],
      [0.00222, 2],
      [-0.00279, 1],
      [0.0193, 0],
      [0.00206, 2],
      [-0.00091, 1],
      [-0.00194, 1],
      [-0.00192, 1]
    ]
  },
  "QA_lstPexMuscstrength[ThumbOppo]": {
    "red_x_points": [
      [-0.00784, 1],
      [0.00098, 2],
      [-0.00607, 1],
      [-0.00549, 1],
      [-0.00867, 1],
      [0.00185, 0],
      [0.00119, 0],
      [-0.00785, 1],
      [0.00152, 0],
      [0.00141, 0],
      [0.00163, 0],
      [0.00111, 0],
      [0.00113, 0],
      [0.00071, 2],
      [0.00117, 2],
      [0.00076, 2],
      [0.00104, 0],
      [0.00079, 2],
      [0.00125, 2],
      [0.0006, 0],
      [-0.00885, 1],
      [0.001, 0],
      [-0.00481, 1],
      [0.00151, 2],
      [0.00195, 2],
      [0.00123, 2],
      [0.00147, 0],
      [-0.00497, 1],
      [0.00108, 2],
      [-0.00801, 1],
      [-0.00566, 1],
      [0.00153, 2]
    ],
    "red_o_points": [],
    "y_categories": ["GREATER THAN OR EQUALS TO 3", "LESS THAN 3", "nan"],
    "blue_o_points": [],
    "blue_x_points": [
      [0.00071, 2],
      [0.00263, 2],
      [0.00184, 0],
      [0.00438, 2],
      [0.00344, 0],
      [0.00179, 0],
      [0.00312, 0],
      [0.00147, 0],
      [0.00308, 2],
      [0.0028, 2]
    ]
  },
  "QS_mulNeuromadSite[T2]": {
    "red_x_points": [
      [-3e-5, 2],
      [-0.00139, 0],
      [-0.00158, 0],
      [-0.00206, 0],
      [-0.00034, 2],
      [-0.0018, 0],
      [-0.00151, 0],
      [-0.00212, 0],
      [-0.00028, 2],
      [-0.00158, 0],
      [-0.0018, 0],
      [-0.00124, 0],
      [-0.0001, 2],
      [0.00219, 1],
      [-0.00023, 2],
      [-0.00179, 0],
      [-0.00034, 2],
      [-0.00138, 0],
      [-0.00059, 2],
      [-0.00021, 2],
      [-4e-5, 2],
      [-0.00015, 2],
      [-0.00168, 0],
      [-0.00031, 2],
      [-0.00039, 2],
      [-0.00029, 2],
      [-0.00146, 0],
      [-0.00142, 0],
      [0.00275, 1],
      [-0.00024, 2],
      [-0.00134, 0],
      [-0.00049, 2]
    ],
    "red_o_points": [],
    "y_categories": ["N", "NOT APPLICABLE", "nan"],
    "blue_o_points": [],
    "blue_x_points": [
      [0.00421, 1],
      [4e-5, 2],
      [0.00271, 1],
      [0.00023, 0],
      [-0.00033, 0],
      [0.003, 1],
      [-0.00014, 2],
      [0.00354, 1],
      [-7e-5, 2],
      [0.00034, 2]
    ]
  },
  "QA_equInjTbpiTime": {
    "red_x_points": [
      [-0.00148, 0],
      [-0.00408, 0],
      [0.00773, 3],
      [-0.00418, 0],
      [-0.00622, 1],
      [-0.00789, 0],
      [-0.00728, 1],
      [-0.0059, 0],
      [0.00236, 3],
      [-0.00653, 0],
      [-0.00637, 0],
      [0.01409, 3],
      [-0.0027, 0],
      [-0.03981, 2],
      [0.00179, 3],
      [-0.00579, 0],
      [-0.00041, 0],
      [-0.00307, 0],
      [-0.01459, 1],
      [0.00241, 3],
      [-0.00113, 0],
      [-0.00652, 1],
      [-0.01028, 2],
      [0.00202, 3],
      [-0.01343, 1],
      [-0.01509, 2],
      [-0.0066, 0],
      [-0.01025, 2],
      [0.00076, 0],
      [0.00011, 0],
      [0.00676, 3],
      [-0.00704, 1]
    ],
    "red_o_points": [],
    "y_categories": [
      "0 TO 6 MONTHS",
      "13 TO 24 MONTHS",
      "25 MONTHS OR MORE",
      "7 TO 12 MONTHS",
      "nan"
    ],
    "blue_o_points": [],
    "blue_x_points": [
      [0.00311, 0],
      [0.00828, 0],
      [0.00441, 0],
      [0.01923, 3],
      [0.0191, 3],
      [0.00489, 0],
      [0.0044, 1],
      [0.01242, 3],
      [0.00939, 3],
      [0.00497, 0]
    ]
  },
  "QS_mulNeuromadSite[C4]": {
    "red_x_points": [
      [-0.00014, 2],
      [-0.00107, 0],
      [-0.00112, 0],
      [-0.00111, 0],
      [-0.00019, 2],
      [-0.0014, 0],
      [-0.00108, 0],
      [-0.00108, 0],
      [-0.00024, 2],
      [-0.00119, 0],
      [-0.00151, 0],
      [-0.00085, 0],
      [-0.00019, 2],
      [0.00081, 1],
      [-0.00017, 2],
      [-0.0009, 0],
      [-9e-5, 2],
      [-0.00064, 0],
      [-0.00034, 2],
      [-7e-5, 2],
      [-0.00012, 2],
      [-0.0001, 2],
      [-0.00074, 0],
      [-0.00012, 2],
      [-0.00044, 2],
      [-0.00011, 2],
      [-0.00088, 0],
      [-0.00096, 0],
      [0.00177, 1],
      [-0.00018, 2],
      [-0.0009, 0],
      [-0.00021, 2]
    ],
    "red_o_points": [],
    "y_categories": ["N", "NOT APPLICABLE", "nan"],
    "blue_o_points": [],
    "blue_x_points": [
      [0.00221, 1],
      [-6e-5, 2],
      [0.0019, 1],
      [0.00047, 0],
      [-0.00028, 0],
      [0.0019, 1],
      [-4e-5, 2],
      [0.00277, 1],
      [-5e-5, 2],
      [-8e-5, 2]
    ]
  },
  "QS_mulTransfSite[Oberlin]": {
    "red_x_points": [
      [-0.00247, 3],
      [-0.0198, 0],
      [-0.01975, 0],
      [-0.01959, 0],
      [-0.00305, 3],
      [-0.00409, 2],
      [-0.00386, 2],
      [-0.01992, 0],
      [-0.00318, 3],
      [-0.00473, 2],
      [-0.00499, 2],
      [-0.00366, 2],
      [-0.00282, 3],
      [0.02412, 1],
      [-0.00349, 3],
      [-0.00498, 2],
      [-0.00292, 3],
      [-0.0193, 0],
      [-0.00342, 3],
      [-0.00334, 3],
      [-0.0026, 3],
      [-0.00284, 3],
      [-0.01975, 0],
      [-0.0032, 3],
      [-0.00464, 3],
      [-0.0029, 3],
      [-0.00402, 2],
      [-0.01852, 0],
      [0.02437, 1],
      [-0.00256, 3],
      [-0.02023, 0],
      [-0.00275, 3]
    ],
    "red_o_points": [],
    "y_categories": ["N", "NOT APPLICABLE", "Y", "nan"],
    "blue_o_points": [],
    "blue_x_points": [
      [0.03115, 1],
      [-0.00078, 3],
      [0.02467, 1],
      [0.00269, 2],
      [0.00161, 2],
      [0.02747, 1],
      [-0.0015, 3],
      [0.0269, 1],
      [-0.00169, 3],
      [6e-5, 3]
    ]
  },
  "QS_mulGraftNerve[FI]": {
    "red_x_points": [
      [-1e-5, 2],
      [-0.0003, 0],
      [-0.00033, 0],
      [-0.00034, 0],
      [-6e-5, 2],
      [-0.0003, 0],
      [-0.00036, 0],
      [-0.00039, 0],
      [-4e-5, 2],
      [-0.00039, 0],
      [-0.00038, 0],
      [-0.00024, 0],
      [4e-5, 2],
      [0.00032, 1],
      [-0.00013, 2],
      [-0.00051, 0],
      [-6e-5, 2],
      [-0.00034, 0],
      [-0.00024, 2],
      [-7e-5, 2],
      [1e-5, 2],
      [0.0, 2],
      [-0.00036, 0],
      [-0.00014, 2],
      [-0.00022, 2],
      [-0.0001, 2],
      [-0.00034, 0],
      [-0.00024, 0],
      [0.00067, 1],
      [-8e-5, 2],
      [-0.00035, 0],
      [-1e-5, 2]
    ],
    "red_o_points": [],
    "y_categories": ["N", "NOT APPLICABLE", "nan"],
    "blue_o_points": [],
    "blue_x_points": [
      [0.00101, 1],
      [-4e-5, 2],
      [0.00057, 1],
      [0.00032, 0],
      [-2e-5, 0],
      [0.00068, 1],
      [-4e-5, 2],
      [0.00089, 1],
      [-7e-5, 2],
      [4e-5, 2]
    ]
  }
}
