{
  "QA_lstPexMuscstrength[ElbowFlex]": {
    "red_x_points": [
      [-0.01347, 1],
      [-0.00024, 2],
      [-0.01253, 1],
      [-0.01196, 1],
      [-0.0129, 1],
      [-0.01341, 1],
      [-0.01299, 1],
      [-0.01245, 1],
      [-0.01276, 1],
      [-0.01389, 1],
      [-0.01371, 1],
      [-0.01411, 1],
      [-0.00033, 2],
      [-0.00199, 2],
      [0.00159, 2],
      [-0.01378, 1],
      [-0.01324, 1],
      [-0.01284, 1],
      [-0.01235, 1],
      [-0.01312, 1],
      [0.0001, 2],
      [-0.01272, 1],
      [-0.01396, 1],
      [-0.01359, 1],
      [-0.01156, 1],
      [0.0011, 2],
      [-0.01227, 1],
      [-0.01356, 1],
      [-8e-5, 2]
    ],
    "red_o_points": [],
    "y_categories": ["GREATER THAN OR EQUALS TO 3", "LESS THAN 3", "nan"],
    "blue_o_points": [],
    "blue_x_points": [
      [0.002, 2],
      [-0.0118, 1],
      [0.06592, 0],
      [-0.01213, 1],
      [0.00389, 2],
      [0.00322, 2],
      [0.04967, 0],
      [-0.0112, 1],
      [-0.01278, 1],
      [0.00263, 2],
      [0.06287, 0],
      [0.05054, 0],
      [0.05615, 0],
      [0.05014, 0],
      [-0.01212, 1]
    ]
  },
  "QS_mulGraftNerve[other]": {
    "red_x_points": [
      [-0.0, 2],
      [-3e-5, 0],
      [-3e-5, 0],
      [-6e-5, 0],
      [-3e-5, 0],
      [-3e-5, 0],
      [-6e-5, 0],
      [-1e-5, 2],
      [-3e-5, 0],
      [-6e-5, 0],
      [-1e-5, 2],
      [-3e-5, 0],
      [-0.0, 2],
      [-6e-5, 0],
      [-3e-5, 0],
      [-1e-5, 2],
      [-3e-5, 0],
      [-1e-5, 2],
      [0.0, 2],
      [0.0, 2],
      [-3e-5, 0],
      [-6e-5, 0],
      [-1e-5, 2],
      [0.0001, 1],
      [-1e-5, 2],
      [-3e-5, 0],
      [-0.0, 2]
    ],
    "red_o_points": [],
    "y_categories": ["N", "NOT APPLICABLE", "nan"],
    "blue_o_points": [],
    "blue_x_points": [
      [0.00027, 1],
      [-1e-5, 2],
      [-3e-5, 0],
      [-1e-5, 2],
      [0.0001, 1],
      [0.0001, 1],
      [-3e-5, 0],
      [-0.0, 2],
      [-3e-5, 0],
      [0.0001, 1],
      [0.0001, 1],
      [-1e-5, 2]
    ]
  },
  "QS_mulLysisTrunk[Upper]": {
    "red_x_points": [
      [-0.00048, 3],
      [-0.00616, 0],
      [-0.00377, 0],
      [-0.00301, 0],
      [-0.00365, 0],
      [-0.01406, 2],
      [-0.00369, 0],
      [-0.00091, 3],
      [-0.00357, 0],
      [-0.00315, 0],
      [-0.00089, 3],
      [-0.00359, 0],
      [-0.00096, 3],
      [-0.00578, 0],
      [-0.01208, 2],
      [-0.00097, 3],
      [-0.00058, 3],
      [-0.0008, 3],
      [-0.00319, 0],
      [-0.00077, 3],
      [-0.0008, 3],
      [-0.00073, 3],
      [-0.00369, 0],
      [-0.00348, 0],
      [-0.00115, 3],
      [0.01208, 1],
      [-0.00091, 3],
      [-0.01196, 2],
      [-0.00098, 3]
    ],
    "red_o_points": [],
    "y_categories": ["N", "NOT APPLICABLE", "Y", "nan"],
    "blue_o_points": [],
    "blue_x_points": [
      [0.0264, 1],
      [-6e-5, 3],
      [-0.00128, 0],
      [-0.00135, 0],
      [0.0004, 3],
      [0.01951, 1],
      [0.01308, 1],
      [-0.00183, 0],
      [-4e-5, 3],
      [0.0001, 3],
      [-0.00134, 0],
      [0.01634, 1],
      [-0.00049, 3],
      [0.01494, 1],
      [-0.00074, 3]
    ]
  },
  "QS_mulBpsurgeryType[Transf]": {
    "red_x_points": [
      [-0.0, 3],
      [-0.00033, 2],
      [-0.00229, 0],
      [-0.00024, 2],
      [-0.00024, 2],
      [-0.0002, 2],
      [-0.00026, 2],
      [-6e-5, 3],
      [-0.00037, 2],
      [-0.0002, 2],
      [1e-5, 3],
      [-0.0003, 2],
      [-0.00017, 3],
      [-0.00028, 2],
      [-0.00026, 2],
      [1e-5, 3],
      [2e-5, 3],
      [1e-5, 3],
      [-0.00023, 2],
      [-2e-5, 3],
      [-0.00021, 3],
      [-0.00015, 3],
      [-0.00027, 2],
      [-0.00029, 2],
      [-0.0001, 3],
      [0.00072, 1],
      [-8e-5, 3],
      [-0.00014, 2],
      [-0.0001, 3]
    ],
    "red_o_points": [],
    "y_categories": ["N", "NOT APPLICABLE", "Y", "nan"],
    "blue_o_points": [],
    "blue_x_points": [
      [0.00187, 1],
      [0.0, 3],
      [0.00016, 2],
      [-2e-5, 2],
      [4e-5, 3],
      [0.00114, 1],
      [0.00053, 1],
      [0.00015, 2],
      [-2e-5, 3],
      [-2e-5, 3],
      [0.00026, 2],
      [0.00092, 1],
      [4e-5, 3],
      [0.00099, 1],
      [-2e-5, 3]
    ]
  },
  "QS_mulNeuromadSite[C8]": {
    "red_x_points": [
      [4e-5, 2],
      [-0.00052, 0],
      [-0.00049, 0],
      [-0.00025, 0],
      [-0.00062, 0],
      [-0.0002, 0],
      [-0.00056, 0],
      [-7e-5, 2],
      [-0.0005, 0],
      [-0.00026, 0],
      [-1e-5, 2],
      [-0.00039, 0],
      [-0.00015, 2],
      [-0.00063, 0],
      [-0.0004, 0],
      [-2e-5, 2],
      [1e-5, 2],
      [-0.0, 2],
      [-0.00019, 0],
      [-1e-5, 2],
      [-1e-5, 2],
      [0.0, 2],
      [-0.0004, 0],
      [-0.00038, 0],
      [-2e-5, 2],
      [0.00061, 1],
      [-8e-5, 2],
      [-0.00021, 0],
      [-0.00012, 2]
    ],
    "red_o_points": [],
    "y_categories": ["N", "NOT APPLICABLE", "nan"],
    "blue_o_points": [],
    "blue_x_points": [
      [0.00282, 1],
      [8e-5, 2],
      [-0.00013, 0],
      [-0.00014, 0],
      [4e-5, 2],
      [0.00139, 1],
      [0.00038, 1],
      [-0.00013, 0],
      [5e-5, 2],
      [-2e-5, 2],
      [-9e-5, 0],
      [0.00074, 1],
      [2e-5, 2],
      [0.00082, 1],
      [1e-5, 2]
    ]
  },
  "QS_mulGraftNerve[Ph]": {
    "red_x_points": [[-0.0001, 0], [-2e-5, 2], [-2e-5, 2], [-2e-5, 2]],
    "red_o_points": [],
    "y_categories": ["N", "NOT APPLICABLE", "nan"],
    "blue_o_points": [],
    "blue_x_points": [[0.0001, 1], [-2e-5, 2], [0.0001, 1], [-2e-5, 2]]
  },
  "QS_mulTransfSite[AcSsPA]": {
    "red_x_points": [
      [-2e-5, 3],
      [-0.00041, 0],
      [-0.00038, 0],
      [-0.00026, 0],
      [-0.00045, 0],
      [-0.00024, 0],
      [-0.00038, 0],
      [-9e-5, 3],
      [-0.00045, 0],
      [-0.00032, 0],
      [-6e-5, 3],
      [-0.00032, 0],
      [-4e-5, 3],
      [-0.00033, 0],
      [-0.00113, 2],
      [-0.00011, 3],
      [-7e-5, 3],
      [-0.00012, 3],
      [-0.0003, 0],
      [-8e-5, 3],
      [-8e-5, 3],
      [-3e-5, 3],
      [-0.00039, 0],
      [-0.00039, 0],
      [-8e-5, 3],
      [0.00051, 1],
      [-7e-5, 3],
      [-0.00027, 0],
      [-8e-5, 3]
    ],
    "red_o_points": [],
    "y_categories": ["N", "NOT APPLICABLE", "Y", "nan"],
    "blue_o_points": [],
    "blue_x_points": [
      [0.00206, 1],
      [-2e-5, 3],
      [8e-5, 0],
      [-8e-5, 0],
      [-7e-5, 3],
      [0.00149, 1],
      [0.00094, 1],
      [-0.00022, 0],
      [-2e-5, 3],
      [-4e-5, 3],
      [-3e-5, 0],
      [0.00134, 1],
      [-4e-5, 3],
      [0.0012, 1],
      [-0.00013, 3]
    ]
  },
  "QA_lstPexPalle[Elbow]": {
    "red_x_points": [
      [-0.0008, 4],
      [-0.0035, 4],
      [-0.00256, 4],
      [-0.0024, 3],
      [-0.00438, 4],
      [-0.00178, 3],
      [-0.00385, 4],
      [-0.00073, 4],
      [-0.0055, 4],
      [-0.00181, 3],
      [-0.00473, 1],
      [-0.00575, 4],
      [-0.00099, 4],
      [-0.00667, 4],
      [-0.00154, 4],
      [0.00042, 3],
      [-0.00977, 0],
      [0.00065, 3],
      [-0.00711, 2],
      [0.00042, 3],
      [-0.00061, 4],
      [-0.00081, 4],
      [-0.00639, 4],
      [-0.00426, 4],
      [-0.00034, 4],
      [-0.03161, 3],
      [-0.00039, 4],
      [-0.00586, 0],
      [-0.00082, 4]
    ],
    "red_o_points": [],
    "y_categories": ["ABS", "HYPO", "NAIA", "PT", "nan"],
    "blue_o_points": [],
    "blue_x_points": [
      [0.00529, 4],
      [0.00029, 4],
      [0.00445, 3],
      [0.04163, 1],
      [-9e-5, 4],
      [0.00559, 4],
      [0.01032, 1],
      [-0.00339, 4],
      [0.00025, 4],
      [0.00045, 4],
      [0.0287, 1],
      [0.00517, 4],
      [0.00207, 3],
      [0.00589, 4],
      [0.00688, 3]
    ]
  },
  "participant_code": {
    "red_x_points": [
      [-0.03812, 1],
      [-0.03922, 2],
      [-0.03846, 3],
      [-0.03887, 4],
      [-0.03675, 5],
      [-0.03832, 8],
      [-0.03784, 9],
      [-0.03668, 10],
      [-0.03675, 11],
      [-0.0386, 13],
      [-0.0375, 14],
      [-0.0375, 18],
      [-0.03976, 19],
      [-0.03805, 20],
      [-0.03675, 23],
      [-0.03805, 26],
      [-0.03819, 28],
      [-0.03819, 29],
      [-0.03798, 30],
      [-0.03592, 31],
      [-0.03846, 32],
      [-0.03778, 34],
      [-0.03819, 36],
      [-0.0364, 38],
      [-0.0373, 39],
      [-0.03723, 40],
      [-0.0362, 41],
      [-0.03778, 42],
      [-0.0375, 43]
    ],
    "red_o_points": [],
    "y_categories": [
      "P16554",
      "P18297",
      "P19283",
      "P19287",
      "P23172",
      "P23391",
      "P30595",
      "P31645",
      "P31691",
      "P34778",
      "P35046",
      "P36328",
      "P43633",
      "P4544",
      "P46417",
      "P48965",
      "P53068",
      "P5497",
      "P58556",
      "P59529",
      "P62483",
      "P64658",
      "P65202",
      "P66816",
      "P6751",
      "P7408",
      "P75566",
      "P76226",
      "P79971",
      "P82621",
      "P82990",
      "P84549",
      "P84932",
      "P85825",
      "P86989",
      "P8770",
      "P87791",
      "P90550",
      "P93159",
      "P94969",
      "P96710",
      "P97130",
      "P9744",
      "P98500",
      "nan"
    ],
    "blue_o_points": [],
    "blue_x_points": [
      [0.07306, 0],
      [0.07161, 6],
      [0.07385, 7],
      [0.07267, 12],
      [0.07345, 15],
      [0.07372, 16],
      [0.07069, 17],
      [0.07214, 21],
      [0.0724, 22],
      [0.07332, 24],
      [0.07398, 25],
      [0.07319, 27],
      [0.07372, 33],
      [0.07398, 35],
      [0.07253, 37]
    ]
  },
  "QA_yonInjChesttube": {
    "red_x_points": [
      [-0.00271, 2],
      [-0.00274, 2],
      [0.00328, 0],
      [-0.00272, 2],
      [-0.00443, 2],
      [0.00214, 0],
      [-0.00673, 1],
      [-0.00195, 2],
      [-0.00505, 2],
      [-0.00397, 2],
      [0.00126, 0],
      [0.0042, 0],
      [-0.00386, 2],
      [-0.00362, 2],
      [0.0006, 0],
      [0.00153, 0],
      [0.00105, 0],
      [0.00172, 0],
      [-0.00496, 1],
      [-0.00212, 2],
      [-0.02059, 1],
      [-0.0035, 2],
      [-0.00478, 2],
      [0.00325, 0],
      [-0.00251, 2],
      [-9e-5, 2],
      [-0.00316, 2],
      [0.00086, 0],
      [-0.00336, 2]
    ],
    "red_o_points": [],
    "y_categories": ["N", "Y", "nan"],
    "blue_o_points": [],
    "blue_x_points": [
      [0.00022, 1],
      [-0.00067, 2],
      [0.00474, 0],
      [0.00723, 0],
      [-0.00237, 2],
      [-3e-5, 2],
      [4e-5, 0],
      [0.00928, 0],
      [0.01934, 0],
      [0.01539, 0],
      [0.00464, 0],
      [-2e-5, 2],
      [0.00461, 0],
      [0.00057, 2]
    ]
  },
  "QS_lstBpsurgSide": {
    "red_x_points": [
      [-0.00048, 3],
      [-0.01406, 0],
      [-0.01386, 0],
      [-0.01, 0],
      [-0.01394, 0],
      [-0.01189, 0],
      [-0.01357, 0],
      [-0.00093, 3],
      [-0.01459, 0],
      [0.00123, 2],
      [-0.00074, 3],
      [0.00145, 2],
      [-0.00123, 3],
      [0.00064, 2],
      [-0.00273, 2],
      [-0.00067, 3],
      [-0.00065, 3],
      [-0.00049, 3],
      [-0.00701, 0],
      [-0.00076, 3],
      [-0.00111, 3],
      [-0.00115, 3],
      [0.00164, 2],
      [0.00193, 2],
      [-0.00111, 3],
      [0.01294, 1],
      [-0.00093, 3],
      [-0.01198, 0],
      [-0.00122, 3]
    ],
    "red_o_points": [],
    "y_categories": ["L", "NOT APPLICABLE", "R", "nan"],
    "blue_o_points": [],
    "blue_x_points": [
      [0.03416, 1],
      [-0.00023, 3],
      [0.00523, 2],
      [0.00899, 2],
      [0.00023, 3],
      [0.01645, 1],
      [0.01156, 1],
      [-0.00236, 0],
      [-0.00032, 3],
      [-0.00021, 3],
      [0.00435, 2],
      [0.01375, 1],
      [-0.0, 3],
      [0.0139, 1],
      [-0.00022, 3]
    ]
  },
  "QA_mulInjOrthesisType[ShoulderSupport]": {
    "red_x_points": [
      [-0.00948, 0],
      [-0.0093, 0],
      [-0.00962, 0],
      [-0.03479, 2],
      [-0.00924, 0],
      [-0.00952, 0],
      [-0.00928, 0],
      [-0.03561, 2],
      [-0.00937, 0],
      [-0.00924, 0],
      [-0.00957, 0],
      [-0.00947, 0],
      [-0.00905, 0],
      [-0.00899, 0],
      [-0.03467, 2],
      [-0.00959, 0],
      [-0.00932, 0],
      [-0.03551, 2],
      [-0.03509, 3],
      [-0.00939, 0],
      [-0.00899, 0],
      [-0.00905, 0],
      [-0.00955, 0],
      [-0.00941, 0],
      [-0.03628, 3],
      [-0.03607, 3],
      [-0.03503, 3],
      [-0.00959, 0],
      [-0.00908, 0]
    ],
    "red_o_points": [],
    "y_categories": ["N", "NOT APPLICABLE", "Y", "nan"],
    "blue_o_points": [],
    "blue_x_points": [
      [-0.00923, 0],
      [-0.00858, 0],
      [-0.00928, 0],
      [-0.00891, 0],
      [0.07001, 1],
      [0.06793, 1],
      [0.06583, 1],
      [0.06705, 1],
      [-0.0084, 0],
      [0.06729, 1],
      [-0.00888, 0],
      [0.06573, 1],
      [0.06984, 1],
      [0.06809, 1],
      [-0.00935, 0]
    ]
  },
  "QA_yonInjUnconscio": {
    "red_x_points": [
      [-0.0177, 1],
      [-0.01747, 1],
      [-0.00187, 2],
      [-0.00236, 2],
      [-0.00186, 2],
      [-0.01995, 1],
      [-0.00179, 2],
      [-0.00298, 2],
      [-0.00236, 2],
      [-0.01951, 1],
      [-0.01767, 1],
      [-0.02026, 1],
      [-0.00377, 2],
      [-0.00223, 2],
      [-0.01314, 1],
      [-0.01875, 1],
      [-0.01743, 1],
      [-0.01315, 1],
      [-0.0144, 1],
      [-0.0178, 1],
      [-0.00388, 2],
      [-0.00288, 2],
      [-0.02144, 1],
      [-0.01894, 1],
      [-0.00374, 2],
      [-0.00308, 2],
      [-0.00346, 2],
      [-0.01813, 1],
      [-0.00404, 2]
    ],
    "red_o_points": [],
    "y_categories": ["N", "Y", "nan"],
    "blue_o_points": [],
    "blue_x_points": [
      [-0.00109, 2],
      [-0.00166, 2],
      [0.06351, 0],
      [-0.0006, 2],
      [-0.00903, 1],
      [-0.00965, 1],
      [0.04349, 0],
      [0.05626, 0],
      [-0.0018, 2],
      [0.04856, 0],
      [0.06274, 0],
      [-0.00239, 2],
      [-0.01111, 1],
      [-0.0023, 2],
      [0.07111, 0]
    ]
  },
  "QA_lstPexInspectio[SurgicalScar]": {
    "red_x_points": [
      [-0.0037, 1],
      [-0.00541, 1],
      [-0.00902, 0],
      [-0.00391, 1],
      [-0.00882, 1],
      [-0.01298, 0],
      [-0.00771, 1],
      [-0.00285, 1],
      [-0.01036, 1],
      [-0.012, 1],
      [-0.01224, 0],
      [-0.01019, 1],
      [-0.00187, 2],
      [-0.01174, 1],
      [-0.00483, 0],
      [0.00784, 2],
      [0.00503, 2],
      [-0.00552, 1],
      [-0.00494, 1],
      [-0.00585, 1],
      [-0.00207, 2],
      [-0.00432, 1],
      [-0.01052, 1],
      [0.01455, 2],
      [-0.00416, 1],
      [-0.00489, 1],
      [-0.00237, 1],
      [0.0065, 2],
      [-0.00317, 1]
    ],
    "red_o_points": [],
    "y_categories": ["ABS", "NAIA", "PT", "nan"],
    "blue_o_points": [],
    "blue_x_points": [
      [-0.00053, 1],
      [0.01176, 2],
      [0.02807, 2],
      [0.03734, 2],
      [0.00224, 1],
      [0.00066, 1],
      [0.00113, 0],
      [-0.00573, 1],
      [-0.00027, 1],
      [0.00316, 1],
      [0.02576, 2],
      [-0.00044, 1],
      [0.00948, 2],
      [0.00455, 0],
      [0.01434, 2]
    ]
  },
  "QS_mulBpsurgeryType[Lysis]": {
    "red_x_points": [
      [-0.00078, 3],
      [-0.00652, 0],
      [-0.02067, 2],
      [-0.01712, 2],
      [-0.00387, 0],
      [-0.02104, 2],
      [-0.0039, 0],
      [-0.00163, 3],
      [-0.0035, 0],
      [-0.00332, 0],
      [-0.00144, 3],
      [-0.00382, 0],
      [-0.00174, 3],
      [-0.00581, 0],
      [-0.01784, 2],
      [-0.00122, 3],
      [-0.00079, 3],
      [-0.00089, 3],
      [-0.00357, 0],
      [-0.00081, 3],
      [-0.00188, 3],
      [-0.00164, 3],
      [-0.00406, 0],
      [-0.00398, 0],
      [-0.00168, 3],
      [0.02136, 1],
      [-0.00152, 3],
      [-0.01958, 2],
      [-0.00175, 3]
    ],
    "red_o_points": [],
    "y_categories": ["N", "NOT APPLICABLE", "Y", "nan"],
    "blue_o_points": [],
    "blue_x_points": [
      [0.04045, 1],
      [-0.00081, 3],
      [-0.00044, 0],
      [-0.00102, 0],
      [6e-5, 3],
      [0.03048, 1],
      [0.02213, 1],
      [-0.00164, 0],
      [-0.00043, 3],
      [-0.00044, 3],
      [-0.00125, 0],
      [0.02506, 1],
      [-0.00046, 3],
      [0.02405, 1],
      [-0.00072, 3]
    ]
  },
  "QS_mulLysisSite[Trunk]": {
    "red_x_points": [
      [-0.00029, 3],
      [-0.00533, 0],
      [-0.00272, 0],
      [-0.00247, 0],
      [-0.00333, 0],
      [-0.01156, 2],
      [-0.00315, 0],
      [-0.00051, 3],
      [-0.00319, 0],
      [-0.00271, 0],
      [-0.0005, 3],
      [-0.00291, 0],
      [-0.00077, 3],
      [-0.00449, 0],
      [-0.01072, 2],
      [-0.00062, 3],
      [-0.00051, 3],
      [-0.00033, 3],
      [-0.00326, 0],
      [-0.00044, 3],
      [-0.00049, 3],
      [-0.00052, 3],
      [-0.00363, 0],
      [-0.00346, 0],
      [-0.00075, 3],
      [0.01056, 1],
      [-0.00064, 3],
      [-0.0102, 2],
      [-0.00071, 3]
    ],
    "red_o_points": [],
    "y_categories": ["N", "NOT APPLICABLE", "Y", "nan"],
    "blue_o_points": [],
    "blue_x_points": [
      [0.02145, 1],
      [-0.0002, 3],
      [-0.00111, 0],
      [-0.00096, 0],
      [0.00048, 3],
      [0.0178, 1],
      [0.01024, 1],
      [-0.0015, 0],
      [-0.00025, 3],
      [8e-5, 3],
      [-0.00116, 0],
      [0.01353, 1],
      [-9e-5, 3],
      [0.01181, 1],
      [-0.00045, 3]
    ]
  },
  "QS_mulGraftTrunk[UpperTrunk]": {
    "red_x_points": [
      [-2e-5, 3],
      [-0.00185, 0],
      [-0.00104, 0],
      [-0.00092, 0],
      [-0.001, 0],
      [-0.00064, 0],
      [-0.00121, 0],
      [-0.0002, 3],
      [-0.0011, 0],
      [-0.00083, 0],
      [-0.00029, 3],
      [-0.00123, 0],
      [-0.0002, 3],
      [-0.00714, 2],
      [-0.00144, 0],
      [-0.00023, 3],
      [-0.00012, 3],
      [-0.00023, 3],
      [-0.00085, 0],
      [-0.00012, 3],
      [-9e-5, 3],
      [-0.00025, 3],
      [-0.00104, 0],
      [-0.00105, 0],
      [-0.00036, 3],
      [0.00294, 1],
      [-0.00013, 3],
      [-0.00087, 0],
      [-0.0, 3]
    ],
    "red_o_points": [],
    "y_categories": ["N", "NOT APPLICABLE", "Y", "nan"],
    "blue_o_points": [],
    "blue_x_points": [
      [0.00712, 1],
      [-5e-5, 3],
      [0.00015, 0],
      [0.00018, 0],
      [0.00028, 3],
      [0.00393, 1],
      [0.00242, 1],
      [-0.00014, 0],
      [-9e-5, 3],
      [0.00025, 3],
      [0.00012, 0],
      [0.00409, 1],
      [-0.00011, 3],
      [0.00363, 1],
      [-0.00027, 3]
    ]
  },
  "QS_mulTransfSite[PhMc]": {
    "red_x_points": [
      [-0.00014, 3],
      [-0.00278, 0],
      [-0.0017, 0],
      [-0.00142, 0],
      [-0.00207, 0],
      [-0.00164, 0],
      [-0.00699, 2],
      [-0.00065, 3],
      [-0.00216, 0],
      [-0.00161, 0],
      [-0.0002, 3],
      [-0.0018, 0],
      [-0.0005, 3],
      [-0.00297, 0],
      [-0.00225, 0],
      [-0.00033, 3],
      [-0.00031, 3],
      [-0.00034, 3],
      [-0.00587, 2],
      [-0.00045, 3],
      [-0.00034, 3],
      [-0.00074, 3],
      [-0.00207, 0],
      [-0.00196, 0],
      [-0.00054, 3],
      [0.00564, 1],
      [-0.00055, 3],
      [-0.00154, 0],
      [-0.0006, 3]
    ],
    "red_o_points": [],
    "y_categories": ["N", "NOT APPLICABLE", "Y", "nan"],
    "blue_o_points": [],
    "blue_x_points": [
      [0.01273, 1],
      [-0.00012, 3],
      [-0.00084, 0],
      [-0.00085, 0],
      [0.0, 3],
      [0.00927, 1],
      [0.00607, 1],
      [-0.00131, 0],
      [-0.00014, 3],
      [-0.00011, 3],
      [-0.00104, 0],
      [0.00804, 1],
      [-0.00013, 3],
      [0.00758, 1],
      [-0.0003, 3]
    ]
  },
  "QS_mulLysisRoot[C6]": {
    "red_x_points": [
      [-0.00023, 3],
      [-0.0042, 0],
      [-0.01027, 2],
      [-0.00244, 0],
      [-0.00291, 0],
      [-0.00236, 0],
      [-0.00314, 0],
      [-0.00042, 3],
      [-0.00288, 0],
      [-0.00244, 0],
      [-0.00056, 3],
      [-0.00297, 0],
      [-0.00055, 3],
      [-0.00494, 0],
      [-0.00394, 0],
      [-0.00025, 3],
      [-0.00032, 3],
      [-0.00017, 3],
      [-0.0022, 0],
      [-0.00029, 3],
      [-0.00047, 3],
      [-0.00041, 3],
      [-0.00295, 0],
      [-0.00241, 0],
      [-0.00056, 3],
      [0.00839, 1],
      [-0.00049, 3],
      [-0.00845, 2],
      [-0.00047, 3]
    ],
    "red_o_points": [],
    "y_categories": ["N", "NOT APPLICABLE", "Y", "nan"],
    "blue_o_points": [],
    "blue_x_points": [
      [0.02013, 1],
      [-7e-5, 3],
      [-0.0009, 0],
      [-0.00113, 0],
      [0.00046, 3],
      [0.01286, 1],
      [0.00731, 1],
      [-0.00141, 0],
      [-5e-5, 3],
      [0.00012, 3],
      [-0.00068, 0],
      [0.00921, 1],
      [0.00014, 3],
      [0.00951, 1],
      [-0.00019, 3]
    ]
  },
  "QA_lstPexInspectio[ShoulderSubdisloc]": {
    "red_x_points": [
      [-0.00324, 1],
      [-0.00581, 1],
      [0.00186, 0],
      [-0.00368, 1],
      [-0.00771, 1],
      [-0.00257, 2],
      [-0.00681, 1],
      [-0.00337, 1],
      [-0.00868, 1],
      [-0.00915, 1],
      [-0.00161, 2],
      [-0.00864, 1],
      [-0.00329, 1],
      [-0.01001, 1],
      [-0.00249, 1],
      [-0.00489, 2],
      [-0.00077, 2],
      [0.00043, 1],
      [-0.00379, 1],
      [-0.00166, 1],
      [-0.01336, 0],
      [0.00466, 2],
      [-0.00065, 2],
      [-0.00028, 2],
      [-0.00233, 1],
      [-0.0177, 2],
      [-0.00278, 1],
      [-0.00117, 2],
      [-0.00457, 1]
    ],
    "red_o_points": [],
    "y_categories": ["ABS", "NAIA", "PT", "nan"],
    "blue_o_points": [],
    "blue_x_points": [
      [0.00649, 1],
      [0.01074, 2],
      [0.03214, 0],
      [0.0101, 2],
      [0.00222, 1],
      [0.00756, 1],
      [0.00474, 0],
      [-0.00374, 1],
      [0.01382, 2],
      [0.00169, 1],
      [0.03053, 0],
      [0.00358, 1],
      [0.00257, 1],
      [-0.00163, 2],
      [0.00326, 1]
    ]
  },
  "QS_mulGraftLevel[Trunk]": {
    "red_x_points": [
      [-8e-5, 3],
      [-0.0013, 0],
      [-0.00098, 0],
      [-0.00065, 0],
      [-0.00091, 0],
      [-0.00052, 0],
      [-0.00092, 0],
      [-0.00015, 3],
      [-0.00065, 0],
      [-0.00071, 0],
      [-0.00022, 3],
      [-0.00102, 0],
      [-0.00012, 3],
      [-0.00798, 2],
      [-0.00131, 0],
      [-0.00031, 3],
      [2e-5, 3],
      [-0.0002, 3],
      [-0.00081, 0],
      [-0.00011, 3],
      [-0.0001, 3],
      [-0.00013, 3],
      [-0.0011, 0],
      [-0.00102, 0],
      [-0.00038, 3],
      [0.00201, 1],
      [-0.00016, 3],
      [-0.00075, 0],
      [-0.00014, 3]
    ],
    "red_o_points": [],
    "y_categories": ["N", "NOT APPLICABLE", "Y", "nan"],
    "blue_o_points": [],
    "blue_x_points": [
      [0.00534, 1],
      [-1e-5, 3],
      [0.00085, 0],
      [0.0013, 0],
      [0.00013, 3],
      [0.00425, 1],
      [0.00235, 1],
      [-0.00024, 0],
      [-5e-5, 3],
      [2e-5, 3],
      [0.0004, 0],
      [0.00335, 1],
      [2e-5, 3],
      [0.00329, 1],
      [-0.00029, 3]
    ]
  },
  "QA_lstPexPain[C7]": {
    "red_x_points": [
      [-0.00157, 1],
      [-0.00399, 2],
      [-0.00292, 2],
      [-0.00084, 1],
      [-0.00485, 2],
      [-0.0029, 1],
      [-0.00266, 1],
      [-0.00558, 0],
      [-0.00425, 1],
      [0.00484, 0],
      [-0.00146, 1],
      [-0.00495, 2],
      [0.00186, 2],
      [-0.0062, 2],
      [-0.00106, 2],
      [-0.00756, 0],
      [-0.00103, 1],
      [-0.00554, 0],
      [-0.00274, 2],
      [-0.00601, 0],
      [0.00131, 2],
      [0.00033, 2],
      [-0.00623, 2],
      [-0.0047, 2],
      [-0.00441, 0],
      [-0.00414, 1],
      [-0.00088, 1],
      [-0.00203, 1],
      [-0.00026, 1]
    ],
    "red_o_points": [],
    "y_categories": ["NORM", "NPV", "nan"],
    "blue_o_points": [],
    "blue_x_points": [
      [0.00017, 1],
      [0.00419, 1],
      [0.01322, 0],
      [0.02132, 0],
      [0.00581, 2],
      [7e-5, 2],
      [0.00113, 1],
      [0.00575, 2],
      [0.00463, 2],
      [0.01095, 0],
      [-2e-5, 1],
      [-0.0022, 0],
      [0.00446, 0],
      [0.01098, 1]
    ]
  },
  "QS_mulBpsurgeryType[Graft]": {
    "red_x_points": [
      [-2e-5, 3],
      [-0.00028, 0],
      [-0.00041, 0],
      [-0.0003, 0],
      [-0.0004, 0],
      [5e-5, 0],
      [-0.00034, 0],
      [-7e-5, 3],
      [0.00019, 0],
      [-0.00016, 0],
      [-0.00025, 3],
      [-5e-5, 0],
      [-0.0001, 3],
      [-0.00678, 2],
      [-0.0002, 0],
      [-0.00025, 3],
      [-1e-5, 3],
      [-0.00022, 3],
      [-0.00017, 0],
      [-3e-5, 3],
      [-5e-5, 3],
      [-8e-5, 3],
      [-0.0002, 0],
      [-0.00023, 0],
      [-0.0001, 3],
      [0.00096, 1],
      [-0.00012, 3],
      [-0.00022, 0],
      [-7e-5, 3]
    ],
    "red_o_points": [],
    "y_categories": ["N", "NOT APPLICABLE", "Y", "nan"],
    "blue_o_points": [],
    "blue_x_points": [
      [0.00214, 1],
      [-1e-5, 3],
      [0.001, 0],
      [0.00142, 0],
      [2e-5, 3],
      [0.00108, 1],
      [0.00086, 1],
      [0.00049, 0],
      [1e-5, 3],
      [4e-5, 3],
      [0.00058, 0],
      [0.00147, 1],
      [-0.00015, 3],
      [0.00116, 1],
      [-0.00018, 3]
    ]
  },
  "QS_mulNeuromadSite[C5]": {
    "red_x_points": [
      [3e-5, 2],
      [-0.00015, 0],
      [-0.00014, 0],
      [-3e-5, 0],
      [-0.00013, 0],
      [-7e-5, 0],
      [-0.00017, 0],
      [1e-5, 2],
      [-6e-5, 0],
      [-0.0001, 0],
      [1e-5, 2],
      [-0.00016, 0],
      [-2e-5, 2],
      [-0.0001, 0],
      [-6e-5, 0],
      [1e-5, 2],
      [1e-5, 2],
      [1e-5, 2],
      [-6e-5, 0],
      [1e-5, 2],
      [-3e-5, 2],
      [3e-5, 2],
      [-0.00016, 0],
      [-6e-5, 0],
      [0.0, 2],
      [9e-5, 1],
      [0.0, 2],
      [-2e-5, 0],
      [-0.0, 2]
    ],
    "red_o_points": [],
    "y_categories": ["N", "NOT APPLICABLE", "nan"],
    "blue_o_points": [],
    "blue_x_points": [
      [0.00082, 1],
      [1e-5, 2],
      [-3e-5, 0],
      [0.00027, 1],
      [9e-5, 1],
      [-3e-5, 0],
      [3e-5, 2],
      [0.0, 2],
      [-3e-5, 0],
      [9e-5, 1],
      [1e-5, 2],
      [9e-5, 1],
      [0.0, 2]
    ]
  },
  "QS_mulNeuromadSite[C7]": {
    "red_x_points": [
      [-0.0, 2],
      [-0.00016, 0],
      [-0.00019, 0],
      [-4e-5, 0],
      [-0.00019, 0],
      [-3e-5, 0],
      [-0.00019, 0],
      [-1e-5, 2],
      [-0.00019, 0],
      [-4e-5, 0],
      [-1e-5, 2],
      [-0.0001, 0],
      [-6e-5, 2],
      [-9e-5, 0],
      [-0.00012, 0],
      [-0.0, 2],
      [-0.0, 2],
      [-0.0, 2],
      [-7e-5, 0],
      [-0.0, 2],
      [-6e-5, 2],
      [-2e-5, 2],
      [-3e-5, 0],
      [-7e-5, 0],
      [-2e-5, 2],
      [0.00016, 1],
      [-2e-5, 2],
      [-4e-5, 0],
      [-6e-5, 2]
    ],
    "red_o_points": [],
    "y_categories": ["N", "NOT APPLICABLE", "nan"],
    "blue_o_points": [],
    "blue_x_points": [
      [0.00072, 1],
      [-2e-5, 2],
      [-1e-5, 2],
      [0.00038, 1],
      [0.0001, 1],
      [-4e-5, 0],
      [-2e-5, 2],
      [-1e-5, 2],
      [-4e-5, 0],
      [0.00037, 1],
      [-1e-5, 2],
      [0.00023, 1],
      [-1e-5, 2]
    ]
  },
  "QS_mulTransfSite[IMc]": {
    "red_x_points": [
      [-0.00057, 3],
      [-0.0189, 2],
      [-0.00348, 0],
      [-0.01376, 2],
      [-0.0037, 0],
      [-0.00299, 0],
      [-0.00347, 0],
      [-0.001, 3],
      [-0.0034, 0],
      [-0.00323, 0],
      [-0.00081, 3],
      [-0.00333, 0],
      [-0.00145, 3],
      [-0.00647, 0],
      [-0.01563, 2],
      [-0.00095, 3],
      [-0.00088, 3],
      [-0.00078, 3],
      [-0.00308, 0],
      [-0.00055, 3],
      [-0.00088, 3],
      [-0.00092, 3],
      [-0.00359, 0],
      [-0.01792, 2],
      [-0.00103, 3],
      [0.01817, 1],
      [-0.00108, 3],
      [-0.0159, 2],
      [-0.00126, 3]
    ],
    "red_o_points": [],
    "y_categories": ["N", "NOT APPLICABLE", "Y", "nan"],
    "blue_o_points": [],
    "blue_x_points": [
      [0.03273, 1],
      [-0.00034, 3],
      [-7e-5, 0],
      [0.00042, 0],
      [0.00021, 3],
      [0.02698, 1],
      [0.01761, 1],
      [-0.00179, 0],
      [-0.00048, 3],
      [-0.00015, 3],
      [-0.00066, 0],
      [0.01907, 1],
      [-0.00034, 3],
      [0.02036, 1],
      [-0.00069, 3]
    ]
  },
  "QA_mulInjOrthesisType[ArmSling]": {
    "red_x_points": [
      [-0.00972, 2],
      [-0.00966, 2],
      [-0.00889, 2],
      [-0.00905, 2],
      [-0.00918, 2],
      [-0.00924, 2],
      [-0.00927, 2],
      [-0.0093, 2],
      [-0.00917, 2],
      [-0.00915, 2],
      [-0.00947, 2],
      [-0.0091, 2],
      [-0.00935, 2],
      [-0.00942, 2],
      [-0.02962, 0],
      [-0.00966, 2],
      [-0.00953, 2],
      [-0.02876, 0],
      [-0.02872, 3],
      [-0.00958, 2],
      [-0.00951, 2],
      [-0.00923, 2],
      [-0.00967, 2],
      [-0.0096, 2],
      [-0.02775, 3],
      [-0.02915, 3],
      [-0.02829, 3],
      [-0.00932, 2],
      [-0.00955, 2]
    ],
    "red_o_points": [],
    "y_categories": ["N", "NOT APPLICABLE", "Y", "nan"],
    "blue_o_points": [],
    "blue_x_points": [
      [-0.00917, 2],
      [-0.00887, 2],
      [-0.00872, 2],
      [-0.00867, 2],
      [0.05731, 1],
      [0.05656, 1],
      [0.05427, 1],
      [0.05731, 1],
      [-0.00871, 2],
      [0.05588, 1],
      [-0.0089, 2],
      [0.05427, 1],
      [0.05689, 1],
      [0.05749, 1],
      [-0.00904, 2]
    ]
  },
  "QA_lstPexArthre[Index]": {
    "red_x_points": [
      [-0.01217, 0],
      [-0.0057, 2],
      [-0.00332, 2],
      [-0.00724, 0],
      [-0.01063, 0],
      [0.00753, 1],
      [-0.00986, 0],
      [0.00065, 2],
      [0.01064, 1],
      [-0.0162, 0],
      [0.00399, 1],
      [-0.00714, 2],
      [0.00053, 2],
      [0.01026, 1],
      [-0.00306, 2],
      [0.00443, 1],
      [-0.012, 0],
      [0.00304, 1],
      [-0.00426, 2],
      [-0.0143, 0],
      [0.00049, 2],
      [0.00079, 2],
      [-0.00832, 2],
      [-0.00725, 2],
      [0.00261, 1],
      [-0.00113, 2],
      [0.00088, 2],
      [-0.00687, 0],
      [0.00059, 2]
    ],
    "red_o_points": [],
    "y_categories": ["NPV", "PV", "nan"],
    "blue_o_points": [],
    "blue_x_points": [
      [0.00077, 0],
      [0.00188, 2],
      [0.01549, 1],
      [0.01775, 1],
      [0.00278, 2],
      [-0.00023, 2],
      [0.00159, 1],
      [0.01209, 1],
      [0.00197, 2],
      [0.00137, 2],
      [0.0141, 1],
      [0.00153, 1],
      [0.00395, 1],
      [-0.00012, 2],
      [0.00811, 1]
    ]
  },
  "QS_mulLysisRoot[C7]": {
    "red_x_points": [
      [-1e-5, 3],
      [-0.00043, 0],
      [-0.00239, 2],
      [-0.00034, 0],
      [-0.00046, 0],
      [-0.00021, 0],
      [-0.00044, 0],
      [-8e-5, 3],
      [-0.00046, 0],
      [-0.00033, 0],
      [-2e-5, 3],
      [-0.00027, 0],
      [-0.00014, 3],
      [-0.00047, 0],
      [-0.00032, 0],
      [-4e-5, 3],
      [0.0, 3],
      [-1e-5, 3],
      [-0.00023, 0],
      [-0.0, 3],
      [-0.00015, 3],
      [-3e-5, 3],
      [-0.0003, 0],
      [-0.00031, 0],
      [-0.00011, 3],
      [0.00105, 1],
      [-0.00012, 3],
      [-0.00027, 0],
      [-9e-5, 3]
    ],
    "red_o_points": [],
    "y_categories": ["N", "NOT APPLICABLE", "Y", "nan"],
    "blue_o_points": [],
    "blue_x_points": [
      [0.00261, 1],
      [-9e-5, 3],
      [8e-5, 0],
      [-0.00023, 0],
      [7e-5, 3],
      [0.00114, 1],
      [0.00072, 1],
      [-0.00019, 0],
      [-6e-5, 3],
      [5e-5, 3],
      [0.00027, 0],
      [0.00129, 1],
      [-0.0, 3],
      [0.00129, 1],
      [2e-5, 3]
    ]
  },
  "QS_mulTransfSite[AcMc]": {
    "red_x_points": [
      [-0.0001, 3],
      [-0.00096, 0],
      [-0.00083, 0],
      [-0.00065, 0],
      [-0.00077, 0],
      [-0.00063, 0],
      [-0.00094, 0],
      [-0.0003, 3],
      [-0.00092, 0],
      [-0.01121, 2],
      [-0.00021, 3],
      [-0.00068, 0],
      [-0.00024, 3],
      [-0.00097, 0],
      [-0.00101, 0],
      [-0.0007, 3],
      [-0.00014, 3],
      [-0.00015, 3],
      [-0.00067, 0],
      [-0.00082, 3],
      [-0.00022, 3],
      [-0.0005, 3],
      [-0.00087, 0],
      [-0.00071, 0],
      [-0.00018, 3],
      [0.00232, 1],
      [-0.00013, 3],
      [-0.00051, 0],
      [-0.00014, 3]
    ],
    "red_o_points": [],
    "y_categories": ["N", "NOT APPLICABLE", "Y", "nan"],
    "blue_o_points": [],
    "blue_x_points": [
      [0.00602, 1],
      [-0.00018, 3],
      [0.00317, 0],
      [0.00314, 0],
      [-0.0, 3],
      [0.00336, 1],
      [0.00165, 1],
      [-0.00033, 0],
      [-5e-5, 3],
      [-2e-5, 3],
      [0.00273, 0],
      [0.00222, 1],
      [-0.00021, 3],
      [0.00274, 1],
      [-0.00036, 3]
    ]
  },
  "QS_mulTransfSite[Other]": {
    "red_x_points": [
      [-0.00103, 3],
      [-0.01202, 0],
      [-0.00958, 0],
      [-0.00849, 0],
      [-0.00966, 0],
      [-0.00973, 0],
      [-0.00985, 0],
      [-0.00118, 3],
      [-0.01093, 0],
      [-0.00954, 0],
      [-0.001, 3],
      [-0.01019, 0],
      [-0.00167, 3],
      [-0.0133, 0],
      [-0.01019, 0],
      [-0.00134, 3],
      [-0.00116, 3],
      [-0.00095, 3],
      [-0.00817, 0],
      [-0.00108, 3],
      [-0.00138, 3],
      [-0.00116, 3],
      [-0.01041, 0],
      [-0.01022, 0],
      [-0.00123, 3],
      [0.01907, 1],
      [-0.00121, 3],
      [-0.00976, 0],
      [-0.00142, 3]
    ],
    "red_o_points": [],
    "y_categories": ["N", "NOT APPLICABLE", "Y", "nan"],
    "blue_o_points": [],
    "blue_x_points": [
      [0.03769, 1],
      [-0.00069, 3],
      [-0.00785, 0],
      [-0.00844, 0],
      [-0.00016, 3],
      [0.0262, 1],
      [0.02057, 1],
      [-0.00698, 0],
      [-0.00056, 3],
      [-0.00041, 3],
      [0.05, 2],
      [0.02007, 1],
      [-0.00069, 3],
      [0.0208, 1],
      [-0.00078, 3]
    ]
  },
  "QA_yonInjBpsurg": {
    "red_x_points": [
      [-0.00054, 1],
      [-0.00065, 1],
      [-0.00063, 1],
      [-0.00059, 1],
      [-0.00087, 1],
      [-0.00044, 1],
      [-0.00073, 1],
      [-0.00083, 1],
      [-0.00083, 1],
      [-0.00043, 1],
      [-0.00053, 1],
      [-0.00036, 1],
      [-0.00112, 1],
      [-0.00099, 1],
      [-0.00046, 1],
      [-0.00043, 1],
      [-0.00045, 1],
      [-0.0004, 1],
      [-0.00027, 1],
      [-0.00045, 1],
      [-0.00098, 1],
      [-0.00078, 1],
      [-0.00041, 1],
      [-0.0004, 1],
      [-0.00077, 1],
      [0.00214, 0],
      [-0.00072, 1],
      [-0.00037, 1],
      [-0.00111, 1]
    ],
    "red_o_points": [],
    "y_categories": ["N", "Y", "nan"],
    "blue_o_points": [],
    "blue_x_points": [
      [0.00687, 0],
      [-0.00049, 1],
      [-0.00036, 1],
      [-0.00071, 1],
      [-0.00033, 1],
      [0.00322, 0],
      [0.00201, 0],
      [-0.00038, 1],
      [-0.00045, 1],
      [-0.00015, 1],
      [-0.00037, 1],
      [0.0037, 0],
      [-0.00021, 1],
      [0.00318, 0],
      [-0.00014, 1]
    ]
  },
  "QA_lstPexTouch[C8]": {
    "red_x_points": [
      [-0.00206, 1],
      [-0.00589, 2],
      [-0.00271, 1],
      [-0.002, 1],
      [-0.00735, 2],
      [-0.00478, 1],
      [-0.00369, 1],
      [-0.00349, 0],
      [-0.00552, 1],
      [0.0118, 0],
      [-0.00285, 1],
      [-0.01075, 2],
      [-0.00437, 2],
      [-0.00985, 2],
      [-0.00251, 2],
      [-0.00032, 0],
      [-0.00198, 1],
      [-0.00252, 0],
      [-0.00424, 2],
      [-0.0008, 0],
      [-0.00392, 2],
      [-0.0064, 0],
      [-0.0063, 1],
      [-0.00944, 2],
      [-0.00254, 0],
      [-0.00927, 1],
      [-0.00058, 2],
      [-0.00308, 1],
      [-0.00039, 1]
    ],
    "red_o_points": [],
    "y_categories": ["NORM", "NPV", "nan"],
    "blue_o_points": [],
    "blue_x_points": [
      [0.00717, 0],
      [0.0085, 1],
      [0.02, 0],
      [0.02653, 0],
      [0.00379, 2],
      [0.00172, 2],
      [-0.00041, 1],
      [-0.00131, 1],
      [0.00977, 1],
      [0.00522, 2],
      [0.01737, 0],
      [-0.00019, 1],
      [-0.00047, 0],
      [0.00409, 0],
      [0.00599, 0]
    ]
  },
  "QS_mulLysisNerve[Ssr]": {
    "red_x_points": [
      [-0.00035, 3],
      [-0.00329, 0],
      [-0.00897, 2],
      [-0.00746, 2],
      [-0.0025, 0],
      [-0.00172, 0],
      [-0.0024, 0],
      [-0.00085, 3],
      [-0.00256, 0],
      [-0.00197, 0],
      [-0.00048, 3],
      [-0.00206, 0],
      [-0.00076, 3],
      [-0.0036, 0],
      [-0.00309, 0],
      [-0.00032, 3],
      [-0.00027, 3],
      [-0.00041, 3],
      [-0.00182, 0],
      [-0.00045, 3],
      [-0.00067, 3],
      [-0.00074, 3],
      [-0.0022, 0],
      [-0.00235, 0],
      [-0.00082, 3],
      [0.00834, 1],
      [-0.00088, 3],
      [-0.00167, 0],
      [-0.00074, 3]
    ],
    "red_o_points": [],
    "y_categories": ["N", "NOT APPLICABLE", "Y", "nan"],
    "blue_o_points": [],
    "blue_x_points": [
      [0.01673, 1],
      [-0.00046, 3],
      [-0.00062, 0],
      [-0.00141, 0],
      [0.00033, 3],
      [0.01052, 1],
      [0.00687, 1],
      [-0.00134, 0],
      [-0.00049, 3],
      [-0.00013, 3],
      [-0.00102, 0],
      [0.00958, 1],
      [-0.00013, 3],
      [0.00891, 1],
      [-0.00027, 3]
    ]
  },
  "QS_mulTransfSite[AcSsAA]": {
    "red_x_points": [
      [-0.00018, 3],
      [-0.00058, 2],
      [-0.00695, 0],
      [-0.00598, 0],
      [0.00018, 2],
      [-0.00684, 0],
      [-0.00713, 0],
      [-0.00053, 3],
      [-0.00795, 0],
      [-0.00802, 0],
      [-0.00045, 3],
      [-0.00682, 0],
      [-0.00078, 3],
      [-1e-5, 2],
      [-0.00339, 0],
      [-0.00066, 3],
      [-0.00029, 3],
      [-0.00043, 3],
      [-0.00053, 2],
      [-0.00049, 3],
      [-0.0006, 3],
      [-0.00061, 3],
      [-0.00679, 0],
      [0.00014, 2],
      [-0.00078, 3],
      [0.00652, 1],
      [-0.0006, 3],
      [-0.00459, 0],
      [-0.00064, 3]
    ],
    "red_o_points": [],
    "y_categories": ["N", "NOT APPLICABLE", "Y", "nan"],
    "blue_o_points": [],
    "blue_x_points": [
      [0.01865, 1],
      [-0.00025, 3],
      [0.00976, 2],
      [0.01009, 2],
      [0.0, 3],
      [0.0077, 1],
      [0.00616, 1],
      [-0.00281, 0],
      [-2e-5, 3],
      [-2e-5, 3],
      [-0.00272, 0],
      [0.01027, 1],
      [-0.00022, 3],
      [0.00935, 1],
      [-0.00017, 3]
    ]
  },
  "QS_mulLysisRoot[C5]": {
    "red_x_points": [
      [-0.00023, 3],
      [-0.00248, 0],
      [-0.00714, 2],
      [-0.00122, 0],
      [-0.00157, 0],
      [-0.00113, 0],
      [-0.0016, 0],
      [-0.00042, 3],
      [-0.00131, 0],
      [-0.00114, 0],
      [-0.00021, 3],
      [-0.00148, 0],
      [-0.00046, 3],
      [-0.00265, 0],
      [-0.00192, 0],
      [-0.00013, 3],
      [-0.00025, 3],
      [-0.00021, 3],
      [-0.00135, 0],
      [-0.00022, 3],
      [-0.00045, 3],
      [-0.00034, 3],
      [-0.00145, 0],
      [-0.00142, 0],
      [-0.00043, 3],
      [0.0048, 1],
      [-0.00036, 3],
      [-0.00423, 2],
      [-0.00034, 3]
    ],
    "red_o_points": [],
    "y_categories": ["N", "NOT APPLICABLE", "Y", "nan"],
    "blue_o_points": [],
    "blue_x_points": [
      [0.01074, 1],
      [-0.00017, 3],
      [-0.00019, 0],
      [-0.00092, 0],
      [-1e-5, 3],
      [0.00645, 1],
      [0.00542, 1],
      [-0.00082, 0],
      [-0.00022, 3],
      [0.0001, 3],
      [-0.00037, 0],
      [0.0058, 1],
      [-9e-5, 3],
      [0.00577, 1],
      [-0.00016, 3]
    ]
  },
  "QS_mulNeuromadSite[C6]": {
    "red_x_points": [
      [-2e-5, 2],
      [-0.0002, 0],
      [-0.00013, 0],
      [-4e-5, 0],
      [-0.00018, 0],
      [-4e-5, 0],
      [-0.00023, 0],
      [-0.0, 2],
      [-0.00018, 0],
      [-2e-5, 2],
      [-0.00013, 0],
      [-1e-5, 2],
      [-0.00023, 0],
      [-0.00011, 0],
      [-2e-5, 2],
      [-2e-5, 2],
      [0.0, 2],
      [-2e-5, 2],
      [-1e-5, 2],
      [3e-5, 2],
      [-0.0001, 0],
      [-0.00011, 0],
      [-1e-5, 2],
      [9e-5, 1],
      [1e-5, 2],
      [-4e-5, 0],
      [-1e-5, 2]
    ],
    "red_o_points": [],
    "y_categories": ["N", "NOT APPLICABLE", "nan"],
    "blue_o_points": [],
    "blue_x_points": [
      [0.00081, 1],
      [-1e-5, 2],
      [-4e-5, 0],
      [0.0, 0],
      [2e-5, 2],
      [0.00049, 1],
      [-3e-5, 0],
      [2e-5, 2],
      [2e-5, 2],
      [-4e-5, 0],
      [0.00023, 1],
      [0.0, 2],
      [0.00023, 1],
      [0.0, 2]
    ]
  },
  "QS_mulNeuromadSite[T1]": {
    "red_x_points": [
      [-1e-5, 2],
      [-0.00039, 0],
      [-0.00021, 0],
      [-0.00012, 0],
      [-0.00017, 0],
      [-0.00017, 0],
      [-0.00029, 0],
      [-1e-5, 2],
      [-0.00023, 0],
      [-0.00011, 0],
      [3e-5, 2],
      [-0.00021, 0],
      [-7e-5, 2],
      [-0.00041, 0],
      [-0.00016, 0],
      [-3e-5, 2],
      [2e-5, 2],
      [-1e-5, 2],
      [-0.00011, 0],
      [-2e-5, 2],
      [-7e-5, 2],
      [-6e-5, 2],
      [-0.00023, 0],
      [-0.00017, 0],
      [-4e-5, 2],
      [0.00034, 1],
      [-4e-5, 2],
      [-0.00012, 0],
      [-0.00011, 2]
    ],
    "red_o_points": [],
    "y_categories": ["N", "NOT APPLICABLE", "nan"],
    "blue_o_points": [],
    "blue_x_points": [
      [0.00181, 1],
      [2e-5, 2],
      [-2e-5, 0],
      [-0.00011, 0],
      [5e-5, 2],
      [0.00067, 1],
      [8e-5, 1],
      [-9e-5, 0],
      [0.0, 2],
      [2e-5, 2],
      [0.0, 0],
      [0.0005, 1],
      [-1e-5, 2],
      [0.0003, 1],
      [-3e-5, 2]
    ]
  },
  "QA_lstPexTouch[C7]": {
    "red_x_points": [
      [-0.0014, 1],
      [-0.00849, 2],
      [-0.0039, 1],
      [-0.00331, 1],
      [-0.01097, 2],
      [-0.00519, 1],
      [-0.00613, 1],
      [-0.00446, 0],
      [-0.00887, 1],
      [-0.00984, 1],
      [-0.0018, 1],
      [-0.01516, 2],
      [-0.00342, 2],
      [-0.01445, 2],
      [-0.00404, 2],
      [-0.00243, 0],
      [-0.00185, 1],
      [-0.00367, 0],
      [-0.00792, 2],
      [-0.00252, 0],
      [-0.00306, 2],
      [-0.00778, 0],
      [-0.00979, 1],
      [-0.01284, 2],
      [-0.00451, 0],
      [-0.00505, 1],
      [-0.0009, 2],
      [-0.00258, 1],
      [0.00129, 1]
    ],
    "red_o_points": [],
    "y_categories": ["NORM", "NPV", "nan"],
    "blue_o_points": [],
    "blue_x_points": [
      [-0.00012, 1],
      [0.01065, 1],
      [0.03848, 0],
      [0.05312, 0],
      [0.00638, 2],
      [0.00024, 2],
      [-0.00017, 1],
      [-0.00327, 1],
      [0.01152, 1],
      [0.00595, 2],
      [0.03286, 0],
      [-0.00016, 1],
      [-0.0013, 0],
      [0.00495, 0],
      [0.00591, 0]
    ]
  },
  "QA_yonInjPhysio": {
    "red_x_points": [
      [-0.00739, 0],
      [0.0008, 0],
      [0.00035, 0],
      [0.00026, 0],
      [-0.00231, 2],
      [0.00044, 0],
      [0.00052, 0],
      [-0.00491, 0],
      [0.00073, 0],
      [-0.00767, 1],
      [-0.0063, 0],
      [0.00191, 0],
      [-0.00818, 0],
      [-0.00644, 1],
      [-0.00121, 1],
      [0.00285, 1],
      [-0.00724, 0],
      [0.00342, 1],
      [0.0005, 0],
      [-0.00579, 0],
      [0.00483, 1],
      [0.00362, 1],
      [0.00152, 0],
      [-0.00724, 1],
      [-0.00942, 2],
      [-0.01707, 1],
      [-0.00994, 2],
      [0.00022, 0],
      [0.00458, 1]
    ],
    "red_o_points": [],
    "y_categories": ["N", "Y", "nan"],
    "blue_o_points": [],
    "blue_x_points": [
      [0.00697, 0],
      [0.00853, 1],
      [0.0059, 0],
      [0.0078, 0],
      [0.00835, 1],
      [0.00618, 0],
      [0.00374, 0],
      [0.00141, 0],
      [-0.00086, 0],
      [0.0071, 1],
      [0.00444, 0],
      [0.00511, 0],
      [0.00692, 1],
      [-0.00461, 1],
      [0.00756, 1]
    ]
  },
  "QS_mulLysisSite[Root]": {
    "red_x_points": [
      [-0.0001, 3],
      [-0.00131, 0],
      [-0.00486, 2],
      [-0.00103, 0],
      [-0.00118, 0],
      [-0.00098, 0],
      [-0.00116, 0],
      [-0.00023, 3],
      [-0.00117, 0],
      [-0.00101, 0],
      [-7e-5, 3],
      [-0.00101, 0],
      [-0.00034, 3],
      [-0.00142, 0],
      [-0.00121, 0],
      [-0.0001, 3],
      [-0.00011, 3],
      [-0.0001, 3],
      [-0.00093, 0],
      [-0.00013, 3],
      [-0.00036, 3],
      [-0.00026, 3],
      [-0.00112, 0],
      [-0.00091, 0],
      [-0.00026, 3],
      [0.00355, 1],
      [-0.00027, 3],
      [-0.00439, 2],
      [-0.00021, 3]
    ],
    "red_o_points": [],
    "y_categories": ["N", "NOT APPLICABLE", "Y", "nan"],
    "blue_o_points": [],
    "blue_x_points": [
      [0.00617, 1],
      [-0.00011, 3],
      [-0.00036, 0],
      [-0.00032, 0],
      [-5e-5, 3],
      [0.00512, 1],
      [0.00416, 1],
      [-0.00082, 0],
      [5e-5, 3],
      [-4e-5, 3],
      [-0.00013, 0],
      [0.00485, 1],
      [-3e-5, 3],
      [0.00426, 1],
      [-5e-5, 3]
    ]
  },
  "QS_mulNeuromadSite[T2]": {
    "red_x_points": [
      [0.00011, 2],
      [-0.00077, 0],
      [-0.00043, 0],
      [-0.00026, 0],
      [-0.00037, 0],
      [-0.00035, 0],
      [-0.00044, 0],
      [-2e-5, 2],
      [-0.00048, 0],
      [-0.00025, 0],
      [5e-5, 2],
      [-0.00058, 0],
      [-1e-5, 2],
      [-0.00051, 0],
      [-0.00035, 0],
      [3e-5, 2],
      [4e-5, 2],
      [2e-5, 2],
      [-0.00031, 0],
      [-1e-5, 2],
      [8e-5, 2],
      [2e-5, 2],
      [-0.00047, 0],
      [-0.0005, 0],
      [-3e-5, 2],
      [0.00073, 1],
      [-2e-5, 2],
      [-0.00032, 0],
      [7e-5, 2]
    ],
    "red_o_points": [],
    "y_categories": ["N", "NOT APPLICABLE", "nan"],
    "blue_o_points": [],
    "blue_x_points": [
      [0.00223, 1],
      [0.0001, 2],
      [-0.00012, 0],
      [-0.00014, 0],
      [6e-5, 2],
      [0.00136, 1],
      [0.00057, 1],
      [-0.0002, 0],
      [9e-5, 2],
      [1e-5, 2],
      [-0.00015, 0],
      [0.00085, 1],
      [5e-5, 2],
      [0.00062, 1],
      [-3e-5, 2]
    ]
  },
  "QS_mulNeuromadSite[C4]": {
    "red_x_points": [
      [1e-5, 2],
      [-8e-5, 0],
      [-0.0, 0],
      [-0.0, 0],
      [-8e-5, 0],
      [-9e-5, 0],
      [0.0, 2],
      [-8e-5, 0],
      [-0.0, 0],
      [-4e-5, 0],
      [-1e-5, 2],
      [-8e-5, 0],
      [-5e-5, 0],
      [-3e-5, 2],
      [-3e-5, 2],
      [-3e-5, 2],
      [-5e-5, 0],
      [-5e-5, 0],
      [0.0, 2],
      [2e-5, 2]
    ],
    "red_o_points": [],
    "y_categories": ["N", "NOT APPLICABLE", "nan"],
    "blue_o_points": [],
    "blue_x_points": [
      [0.00046, 1],
      [-0.0, 0],
      [0.0, 2],
      [-5e-5, 0],
      [0.0, 2],
      [0.0, 2],
      [0.00013, 1],
      [0.00013, 1],
      [1e-5, 2]
    ]
  },
  "QS_mulTransfSite[Oberlin]": {
    "red_x_points": [
      [-0.00153, 3],
      [-0.02355, 0],
      [-0.02361, 0],
      [-0.02189, 0],
      [-0.02327, 0],
      [0.00305, 2],
      [-0.02415, 0],
      [-0.00191, 3],
      [0.00317, 2],
      [0.00319, 2],
      [-0.00143, 3],
      [0.00317, 2],
      [-0.00217, 3],
      [0.00136, 2],
      [-0.02073, 0],
      [-0.00173, 3],
      [-0.00173, 3],
      [-0.00117, 3],
      [-0.01993, 0],
      [-0.00144, 3],
      [-0.00198, 3],
      [-0.002, 3],
      [0.00317, 2],
      [-0.02451, 0],
      [-0.00184, 3],
      [0.0271, 1],
      [-0.00172, 3],
      [-0.02442, 0],
      [-0.00184, 3]
    ],
    "red_o_points": [],
    "y_categories": ["N", "NOT APPLICABLE", "Y", "nan"],
    "blue_o_points": [],
    "blue_x_points": [
      [0.04527, 1],
      [-0.00128, 3],
      [0.00575, 2],
      [0.00747, 2],
      [-0.00049, 3],
      [0.03406, 1],
      [0.02742, 1],
      [0.00441, 2],
      [-0.00116, 3],
      [-0.00073, 3],
      [0.00584, 2],
      [0.02913, 1],
      [-0.00074, 3],
      [0.03049, 1],
      [-0.00108, 3]
    ]
  },
  "QA_intPexForearmProna": {
    "red_x_points": [
      [-0.00082, 2],
      [-0.00107, 0],
      [-0.00071, 2],
      [-0.00037, 2],
      [-0.0007, 2],
      [-0.00287, 0],
      [-0.00075, 2],
      [-0.02226, 0],
      [-0.0008, 2],
      [-0.00072, 2],
      [-0.02111, 0],
      [-0.0028, 0],
      [-0.00164, 2],
      [-0.00069, 2],
      [2e-5, 2],
      [-0.02151, 0],
      [-0.0215, 0],
      [-0.01985, 0],
      [-0.00177, 0],
      [-0.00072, 2],
      [-0.00127, 2],
      [-0.00099, 2],
      [-0.00066, 2],
      [-0.00086, 2],
      [0.0004, 2],
      [0.00069, 1],
      [0.00027, 2],
      [-0.00291, 0],
      [-0.0012, 2]
    ],
    "red_o_points": [],
    "y_categories": ["GREATER THAN OR EQUALS TO 80", "LESS THAN 80", "nan"],
    "blue_o_points": [],
    "blue_x_points": [
      [-0.00058, 2],
      [0.06547, 1],
      [-0.00074, 0],
      [-0.00074, 2],
      [0.00107, 2],
      [3e-5, 2],
      [0.00122, 1],
      [0.00014, 2],
      [-0.00032, 2],
      [0.00129, 2],
      [-0.00046, 0],
      [7e-5, 2],
      [0.00148, 2],
      [2e-5, 2],
      [0.06122, 1]
    ]
  },
  "QS_mulLysisSite[Nerve]": {
    "red_x_points": [
      [-0.00035, 3],
      [-0.0038, 0],
      [-0.00826, 2],
      [-0.00635, 2],
      [-0.00226, 0],
      [-0.00157, 0],
      [-0.00222, 0],
      [-0.00085, 3],
      [-0.00233, 0],
      [-0.00145, 0],
      [-0.00028, 3],
      [-0.00208, 0],
      [-0.00063, 3],
      [-0.00368, 0],
      [-0.00312, 0],
      [-0.00026, 3],
      [-0.00035, 3],
      [-0.00033, 3],
      [-0.00172, 0],
      [-0.00037, 3],
      [-0.00057, 3],
      [-0.00075, 3],
      [-0.00199, 0],
      [-0.00193, 0],
      [-0.0007, 3],
      [0.00748, 1],
      [-0.0006, 3],
      [-0.00146, 0],
      [-0.00073, 3]
    ],
    "red_o_points": [],
    "y_categories": ["N", "NOT APPLICABLE", "Y", "nan"],
    "blue_o_points": [],
    "blue_x_points": [
      [0.01565, 1],
      [-0.00016, 3],
      [-0.00019, 0],
      [-0.00114, 0],
      [0.0003, 3],
      [0.00928, 1],
      [0.00494, 1],
      [-0.00076, 0],
      [-0.0002, 3],
      [0.00023, 3],
      [-0.00074, 0],
      [0.00792, 1],
      [-0.0002, 3],
      [0.00883, 1],
      [-0.00025, 3]
    ]
  },
  "QA_yonPexPain": {
    "red_x_points": [
      [-0.00866, 1],
      [-0.001, 1],
      [-0.00087, 1],
      [-0.00048, 1],
      [-0.00116, 1],
      [-0.00221, 0],
      [-0.00061, 1],
      [-0.00887, 1],
      [-0.00251, 0],
      [-0.00038, 1],
      [-0.00546, 1],
      [-0.00053, 0],
      [-0.01156, 1],
      [-0.00071, 1],
      [-0.0005, 1],
      [0.00666, 0],
      [-0.00643, 1],
      [0.00734, 0],
      [-0.00043, 1],
      [0.00923, 0],
      [-0.02216, 2],
      [-0.01181, 1],
      [-0.00046, 1],
      [-0.00178, 1],
      [-0.01637, 2],
      [-0.00182, 1],
      [-0.00819, 1],
      [-0.00025, 1],
      [-0.01122, 1]
    ],
    "red_o_points": [],
    "y_categories": ["N", "Y", "nan"],
    "blue_o_points": [],
    "blue_x_points": [
      [-0.00038, 1],
      [0.02762, 0],
      [0.00359, 0],
      [0.0022, 1],
      [-0.00584, 1],
      [0.00082, 2],
      [2e-5, 1],
      [0.00423, 1],
      [0.03309, 0],
      [0.02112, 0],
      [0.00153, 1],
      [0.00291, 0],
      [0.01249, 0],
      [-0.00049, 1],
      [0.00027, 1]
    ]
  },
  "QS_mulGraftNerve[FI]": {
    "red_x_points": [
      [-0.0, 2],
      [-2e-5, 0],
      [-2e-5, 0],
      [-2e-5, 0],
      [-2e-5, 0],
      [-2e-5, 0],
      [-0.0, 2],
      [-2e-5, 0],
      [-0.0, 2],
      [-0.0, 2],
      [-2e-5, 0],
      [-2e-5, 0],
      [-0.0, 2]
    ],
    "red_o_points": [],
    "y_categories": ["N", "NOT APPLICABLE", "nan"],
    "blue_o_points": [],
    "blue_x_points": [[0.00016, 1], [-2e-5, 0], [-0.0, 2]]
  },
  "QA_lstPexPalle[Ulna]": {
    "red_x_points": [
      [-0.00108, 4],
      [-0.00315, 4],
      [-0.00246, 4],
      [-0.00755, 2],
      [-0.00355, 4],
      [-0.01232, 1],
      [-0.00299, 4],
      [-0.00078, 4],
      [-0.0042, 4],
      [0.01258, 3],
      [-0.01263, 1],
      [-0.00424, 4],
      [-0.0011, 4],
      [-0.0044, 4],
      [-0.00113, 4],
      [0.00579, 3],
      [-0.0119, 0],
      [0.0031, 3],
      [-0.00807, 0],
      [0.00564, 3],
      [-0.00079, 4],
      [-0.00099, 4],
      [-0.00454, 4],
      [-0.00318, 4],
      [-0.00027, 4],
      [0.00251, 3],
      [-0.0004, 4],
      [-0.00821, 0],
      [-0.00108, 4]
    ],
    "red_o_points": [],
    "y_categories": ["ABS", "HYPO", "NAIA", "PT", "nan"],
    "blue_o_points": [],
    "blue_x_points": [
      [-0.00081, 4],
      [-0.00019, 4],
      [0.01866, 3],
      [0.02193, 3],
      [0.00059, 4],
      [-0.0001, 4],
      [0.00188, 3],
      [-0.00269, 4],
      [0.00015, 4],
      [0.00056, 4],
      [0.01614, 3],
      [-0.00015, 4],
      [0.00382, 3],
      [-0.00012, 4],
      [0.01173, 3]
    ]
  }
}
