{
  "QA_lstPexPain[C7]": {
    "red_x_points": [
      [-0.02427, 1],
      [-0.02192, 2],
      [-0.02645, 2],
      [-0.01654, 1],
      [-0.02264, 2],
      [-0.01543, 1],
      [-0.02017, 1],
      [-0.02354, 1],
      [-0.02636, 2],
      [-0.02944, 2],
      [-0.02459, 2],
      [-0.02285, 2],
      [-0.0211, 1],
      [0.04935, 0],
      [-0.02375, 1],
      [-0.02026, 1],
      [-0.01938, 2],
      [-0.03773, 2],
      [-0.0349, 2],
      [-0.01932, 2],
      [-0.02381, 1],
      [-0.0168, 1],
      [-0.01934, 1]
    ],
    "red_o_points": [],
    "y_categories": ["NORM", "NPV", "nan"],
    "blue_o_points": [],
    "blue_x_points": [
      [-0.01791, 1],
      [-0.01692, 1],
      [0.0568, 0],
      [-0.00643, 1],
      [0.06773, 0],
      [-0.00742, 1],
      [0.06679, 0],
      [0.07164, 0],
      [-0.0237, 2],
      [-0.00135, 2],
      [-0.01938, 2],
      [-0.00883, 1],
      [-0.01579, 2],
      [0.05638, 0],
      [0.05042, 0],
      [0.05013, 0],
      [-0.01891, 2],
      [0.0504, 0],
      [0.08057, 0],
      [-0.01618, 1],
      [0.0632, 0]
    ]
  },
  "participant_code": {
    "red_x_points": [
      [-0.10499, 0],
      [-0.10616, 2],
      [-0.10606, 3],
      [-0.10713, 4],
      [-0.10868, 5],
      [-0.10586, 9],
      [-0.10499, 14],
      [-0.10567, 17],
      [-0.10732, 19],
      [-0.10509, 20],
      [-0.10499, 22],
      [-0.10635, 23],
      [-0.10946, 24],
      [-0.10684, 26],
      [-0.10645, 28],
      [-0.10616, 29],
      [-0.10431, 31],
      [-0.10489, 35],
      [-0.10761, 37],
      [-0.108, 39],
      [-0.10771, 41],
      [-0.10674, 42],
      [-0.10781, 43]
    ],
    "red_o_points": [],
    "y_categories": [
      "P16554",
      "P18297",
      "P19283",
      "P19287",
      "P23172",
      "P23391",
      "P30595",
      "P31645",
      "P31691",
      "P34778",
      "P35046",
      "P36328",
      "P43633",
      "P4544",
      "P46417",
      "P48965",
      "P53068",
      "P5497",
      "P58556",
      "P59529",
      "P62483",
      "P64658",
      "P65202",
      "P66816",
      "P67052",
      "P6751",
      "P7408",
      "P75566",
      "P76226",
      "P79971",
      "P82621",
      "P82990",
      "P84549",
      "P84932",
      "P85825",
      "P86989",
      "P8770",
      "P87791",
      "P90550",
      "P93159",
      "P94969",
      "P96710",
      "P9744",
      "P98500",
      "nan"
    ],
    "blue_o_points": [],
    "blue_x_points": [
      [0.11734, 1],
      [0.11744, 6],
      [0.11908, 7],
      [0.11867, 8],
      [0.116, 10],
      [0.1159, 11],
      [0.11734, 12],
      [0.11518, 13],
      [0.11651, 15],
      [0.11672, 16],
      [0.11549, 18],
      [0.11703, 21],
      [0.11703, 25],
      [0.11847, 27],
      [0.1161, 30],
      [0.11754, 32],
      [0.11569, 33],
      [0.11641, 34],
      [0.11456, 36],
      [0.11579, 38],
      [0.11497, 40]
    ]
  },
  "QA_equInjTbpiTime": {
    "red_x_points": [
      [-0.02939, 0],
      [-0.0255, 0],
      [0.00359, 3],
      [0.00386, 3],
      [-0.02519, 0],
      [-0.01764, 0],
      [-0.02212, 0],
      [-0.0269, 0],
      [0.00478, 3],
      [-0.02471, 0],
      [-0.02509, 0],
      [-0.0244, 0],
      [0.00456, 3],
      [0.00514, 3],
      [-0.03011, 0],
      [-0.02088, 0],
      [-0.0288, 2],
      [-0.06764, 2],
      [-0.02008, 0],
      [-0.02891, 2],
      [-0.0275, 0],
      [0.00406, 3],
      [0.03797, 1]
    ],
    "red_o_points": [],
    "y_categories": [
      "0 TO 6 MONTHS",
      "13 TO 24 MONTHS",
      "25 MONTHS OR MORE",
      "7 TO 12 MONTHS",
      "nan"
    ],
    "blue_o_points": [],
    "blue_x_points": [
      [-0.01878, 0],
      [0.05626, 1],
      [-0.01208, 0],
      [0.05182, 1],
      [0.00963, 3],
      [-0.01792, 0],
      [-0.01038, 0],
      [0.00835, 3],
      [-0.02573, 0],
      [0.00544, 2],
      [0.06701, 1],
      [0.00804, 3],
      [0.07257, 1],
      [0.01, 3],
      [0.04581, 1],
      [0.04641, 1],
      [0.01486, 3],
      [0.04515, 1],
      [0.02772, 3],
      [0.01035, 3],
      [-0.01363, 0]
    ]
  },
  "QS_mulTransfSite[Oberlin]": {
    "red_x_points": [
      [-0.03034, 1],
      [-0.08192, 0],
      [-0.08137, 0],
      [-0.07909, 0],
      [-0.082, 0],
      [-0.07814, 0],
      [0.02267, 3],
      [-0.02995, 1],
      [0.02611, 3],
      [0.03056, 2],
      [0.02384, 3],
      [-0.08037, 0],
      [0.02291, 3],
      [0.03134, 2],
      [-0.03783, 1],
      [0.02295, 3],
      [-0.08333, 0],
      [0.02258, 3],
      [0.03578, 2],
      [-0.08122, 0],
      [-0.0303, 1],
      [-0.08165, 0],
      [0.02283, 3]
    ],
    "red_o_points": [],
    "y_categories": ["N", "NOT APPLICABLE", "Y", "nan"],
    "blue_o_points": [],
    "blue_x_points": [
      [0.02597, 3],
      [0.02563, 3],
      [0.03995, 2],
      [0.04701, 2],
      [0.02452, 3],
      [0.04755, 2],
      [0.03826, 2],
      [0.0397, 2],
      [0.03005, 3],
      [-0.00011, 1],
      [0.03922, 2],
      [0.04726, 2],
      [0.02976, 3],
      [0.02431, 3],
      [0.02384, 3],
      [0.02286, 3],
      [0.03045, 3],
      [0.02345, 3],
      [-0.01319, 1],
      [0.02576, 3],
      [0.02367, 3]
    ]
  },
  "QA_yonPexPain": {
    "red_x_points": [
      [-0.02822, 1],
      [-0.03307, 1],
      [-0.02696, 1],
      [-0.02602, 1],
      [-0.03276, 1],
      [-0.02729, 1],
      [-0.03132, 1],
      [-0.02808, 1],
      [-0.03718, 1],
      [-0.0341, 1],
      [0.04703, 0],
      [-0.03211, 1],
      [-0.03062, 1],
      [-0.0276, 1],
      [0.03483, 0],
      [-0.03172, 1],
      [-0.03124, 1],
      [-0.03189, 1],
      [-0.02958, 1],
      [-0.03271, 1],
      [-0.02839, 1],
      [-0.02588, 1],
      [-0.03749, 1]
    ],
    "red_o_points": [],
    "y_categories": ["N", "Y", "nan"],
    "blue_o_points": [],
    "blue_x_points": [
      [-0.03142, 1],
      [0.05615, 0],
      [0.0469, 0],
      [0.05491, 0],
      [-0.02732, 1],
      [0.05474, 0],
      [-0.02436, 1],
      [-0.02531, 1],
      [-0.03766, 1],
      [0.09473, 2],
      [0.06085, 0],
      [-0.02682, 1],
      [0.06355, 0],
      [0.0505, 0],
      [0.04832, 0],
      [0.04614, 0],
      [0.08916, 2],
      [0.04839, 0],
      [-0.02525, 1],
      [-0.0292, 1],
      [0.07539, 2]
    ]
  },
  "QA_lstPexTouch[C7]": {
    "red_x_points": [
      [-0.03223, 1],
      [-0.01041, 2],
      [-0.0219, 1],
      [-0.02138, 1],
      [-0.0107, 2],
      [-0.0204, 1],
      [-0.03287, 1],
      [-0.03019, 1],
      [-0.00756, 2],
      [-0.01342, 2],
      [-0.03145, 1],
      [-0.01015, 2],
      [-0.0323, 1],
      [0.03853, 0],
      [-0.03063, 1],
      [-0.03181, 1],
      [-0.008, 2],
      [0.03674, 0],
      [-0.02059, 1],
      [-0.00821, 2],
      [-0.03056, 1],
      [-0.02202, 1],
      [-0.02978, 1]
    ],
    "red_o_points": [],
    "y_categories": ["NORM", "NPV", "nan"],
    "blue_o_points": [],
    "blue_x_points": [
      [-0.03055, 1],
      [-0.02719, 1],
      [0.04485, 0],
      [-0.01516, 1],
      [0.05313, 0],
      [-0.01791, 1],
      [0.0522, 0],
      [-0.01732, 1],
      [-0.00225, 2],
      [0.01327, 2],
      [-0.00342, 2],
      [-0.01925, 1],
      [0.00186, 2],
      [0.04141, 0],
      [0.03981, 0],
      [0.04069, 0],
      [0.00304, 2],
      [0.0402, 0],
      [0.0664, 0],
      [0.06457, 0],
      [0.05291, 0]
    ]
  },
  "QA_lstPexTouch[C8]": {
    "red_x_points": [
      [0.02858, 0],
      [-0.0096, 2],
      [-0.02237, 1],
      [-0.02179, 1],
      [-0.01012, 2],
      [-0.01663, 1],
      [-0.0262, 1],
      [-0.02354, 1],
      [-0.00811, 2],
      [-0.01227, 2],
      [-0.02464, 1],
      [-0.0092, 2],
      [-0.03142, 1],
      [0.02934, 0],
      [-0.02066, 1],
      [-0.02703, 1],
      [-0.00633, 2],
      [0.02746, 0],
      [-0.01781, 1],
      [-0.00694, 2],
      [-0.02385, 1],
      [-0.02172, 1],
      [-0.02488, 1]
    ],
    "red_o_points": [],
    "y_categories": ["NORM", "NPV", "nan"],
    "blue_o_points": [],
    "blue_x_points": [
      [-0.02516, 1],
      [-0.01879, 1],
      [0.02818, 0],
      [-0.0097, 1],
      [0.04005, 0],
      [-0.01203, 1],
      [0.03526, 0],
      [0.03304, 0],
      [-0.0035, 2],
      [0.0112, 2],
      [-0.00168, 2],
      [-0.02038, 1],
      [0.00261, 2],
      [0.03098, 0],
      [0.02418, 0],
      [0.02415, 0],
      [0.00303, 2],
      [0.02512, 0],
      [0.03746, 0],
      [0.04172, 0],
      [0.03397, 0]
    ]
  }
}
