{
  "QA_lstPexMuscstrength[ElbowFlex]": {
    "red_x_points": [
      [-0.00388, 1],
      [0.00053, 2],
      [-0.00159, 1],
      [-0.0018, 1],
      [9e-5, 0],
      [-0.00181, 1],
      [-0.00178, 1],
      [-0.00348, 1],
      [-0.00165, 1],
      [-0.00158, 1],
      [-0.00149, 1],
      [-0.00325, 1],
      [0.00066, 2],
      [0.00318, 2],
      [0.00041, 2],
      [-0.0038, 1],
      [0.00037, 2],
      [-0.00019, 0],
      [-0.00324, 1],
      [-0.00342, 1],
      [-0.00325, 1],
      [-0.00153, 1],
      [0.0035, 2],
      [-0.00028, 0],
      [-0.00382, 1],
      [-0.00152, 1],
      [-0.00358, 1],
      [-0.0015, 1],
      [-0.00361, 1],
      [0.00063, 2],
      [-0.00136, 1]
    ],
    "red_o_points": [],
    "y_categories": ["GREATER THAN OR EQUALS TO 3", "LESS THAN 3", "nan"],
    "blue_o_points": [],
    "blue_x_points": [
      [0.00063, 2],
      [0.00465, 2],
      [0.0043, 0],
      [0.0016, 1],
      [0.00526, 2],
      [0.00564, 0],
      [0.00469, 0]
    ]
  },
  "QS_mulLysisTrunk[Upper]": {
    "red_x_points": [
      [-0.00184, 3],
      [-0.0033, 0],
      [-0.00351, 0],
      [-0.00328, 0],
      [-0.00307, 0],
      [-0.00599, 2],
      [-0.0032, 0],
      [-0.00186, 3],
      [-0.00305, 0],
      [-0.00378, 0],
      [-0.00326, 0],
      [-0.0018, 3],
      [0.00879, 1],
      [-0.00206, 3],
      [-0.0031, 0],
      [-0.00213, 3],
      [-0.00539, 2],
      [-0.00383, 0],
      [-0.0019, 3],
      [-0.00173, 3],
      [-0.00153, 3],
      [-0.00326, 0],
      [-0.00188, 3],
      [-0.00176, 3],
      [-0.0018, 3],
      [-0.00334, 0],
      [-0.00168, 3],
      [-0.00339, 0],
      [-0.00152, 3],
      [0.00894, 1],
      [-0.00576, 2]
    ],
    "red_o_points": [],
    "y_categories": ["N", "NOT APPLICABLE", "Y", "nan"],
    "blue_o_points": [],
    "blue_x_points": [
      [0.01259, 1],
      [-0.00082, 3],
      [0.0103, 1],
      [-0.00118, 0],
      [-0.00064, 3],
      [0.01, 1],
      [0.01089, 1]
    ]
  },
  "QS_mulBpsurgeryType[Transf]": {
    "red_x_points": [
      [-0.00016, 3],
      [-0.00027, 2],
      [-0.00073, 0],
      [-0.0002, 2],
      [-0.00022, 2],
      [-0.00026, 2],
      [-0.00031, 2],
      [-3e-5, 3],
      [-0.00047, 2],
      [-0.00027, 2],
      [-0.00025, 2],
      [-0.0002, 3],
      [0.00074, 1],
      [-0.00017, 3],
      [-0.00023, 2],
      [-0.00012, 3],
      [-0.00028, 2],
      [-0.00029, 2],
      [-0.00015, 3],
      [-0.00012, 3],
      [-0.0001, 3],
      [-0.00024, 2],
      [-0.00014, 3],
      [-0.00017, 3],
      [-0.00019, 3],
      [-0.00034, 2],
      [-0.00018, 3],
      [-0.00026, 2],
      [-6e-5, 3],
      [0.00096, 1],
      [-0.00033, 2]
    ],
    "red_o_points": [],
    "y_categories": ["N", "NOT APPLICABLE", "Y", "nan"],
    "blue_o_points": [],
    "blue_x_points": [
      [0.00117, 1],
      [-0.00013, 3],
      [0.00074, 1],
      [-0.00034, 2],
      [0.0, 3],
      [0.00109, 1],
      [0.00079, 1]
    ]
  },
  "QS_mulNeuromadSite[T1]": {
    "red_x_points": [
      [-0.00107, 2],
      [-0.00401, 0],
      [-0.00472, 0],
      [-0.00427, 0],
      [-0.00518, 0],
      [-0.00457, 0],
      [-0.004, 0],
      [-0.0014, 2],
      [-0.00451, 0],
      [-0.00392, 0],
      [-0.0042, 0],
      [-0.00141, 2],
      [0.00854, 1],
      [-0.00127, 2],
      [-0.00464, 0],
      [-0.00179, 2],
      [-0.00383, 0],
      [-0.00504, 0],
      [-0.00124, 2],
      [-0.0011, 2],
      [-0.00134, 2],
      [-0.00377, 0],
      [-0.00133, 2],
      [-0.00169, 2],
      [-0.00136, 2],
      [-0.00464, 0],
      [-0.00116, 2],
      [-0.00493, 0],
      [-0.00101, 2],
      [0.00745, 1],
      [-0.00386, 0]
    ],
    "red_o_points": [],
    "y_categories": ["N", "NOT APPLICABLE", "nan"],
    "blue_o_points": [],
    "blue_x_points": [
      [0.01434, 1],
      [-0.00013, 2],
      [0.01014, 1],
      [0.00023, 0],
      [-2e-5, 2],
      [0.00988, 1],
      [0.01144, 1]
    ]
  },
  "QS_mulNeuromadSite[T2]": {
    "red_x_points": [
      [-0.00208, 2],
      [-0.00672, 0],
      [-0.00714, 0],
      [-0.00627, 0],
      [-0.00663, 0],
      [-0.00656, 0],
      [-0.00648, 0],
      [-0.00222, 2],
      [-0.00674, 0],
      [-0.0062, 0],
      [-0.00634, 0],
      [-0.00219, 2],
      [0.0111, 1],
      [-0.00206, 2],
      [-0.00644, 0],
      [-0.00273, 2],
      [-0.00623, 0],
      [-0.00745, 0],
      [-0.0021, 2],
      [-0.00215, 2],
      [-0.00189, 2],
      [-0.00629, 0],
      [-0.00183, 2],
      [-0.00203, 2],
      [-0.00252, 2],
      [-0.0062, 0],
      [-0.00183, 2],
      [-0.00655, 0],
      [-0.00173, 2],
      [0.01258, 1],
      [-0.00659, 0]
    ],
    "red_o_points": [],
    "y_categories": ["N", "NOT APPLICABLE", "nan"],
    "blue_o_points": [],
    "blue_x_points": [
      [0.02184, 1],
      [-4e-5, 2],
      [0.01452, 1],
      [0.00056, 0],
      [7e-5, 2],
      [0.01365, 1],
      [0.0179, 1]
    ]
  },
  "QA_mulInjOrthesisType[ShoulderSupport]": {
    "red_x_points": [
      [-0.01287, 0],
      [-0.01162, 0],
      [-0.01284, 0],
      [-0.0117, 0],
      [-0.01186, 0],
      [-0.01116, 0],
      [-0.01137, 0],
      [-0.01429, 2],
      [-0.01221, 0],
      [-0.01196, 0],
      [-0.01152, 0],
      [-0.01254, 0],
      [0.03313, 1],
      [-0.01273, 0],
      [-0.01223, 0],
      [-0.01234, 0],
      [-0.01493, 2],
      [-0.01203, 0],
      [-0.01216, 0],
      [-0.0125, 0],
      [-0.01496, 2],
      [-0.01358, 3],
      [-0.01318, 0],
      [0.03586, 1],
      [-0.01272, 0],
      [-0.01188, 0],
      [-0.01227, 0],
      [-0.01126, 0],
      [-0.01393, 3],
      [-0.0202, 3],
      [-0.01186, 0]
    ],
    "red_o_points": [],
    "y_categories": ["N", "NOT APPLICABLE", "Y", "nan"],
    "blue_o_points": [],
    "blue_x_points": [
      [-0.0056, 0],
      [0.0363, 1],
      [0.03152, 1],
      [0.03698, 1],
      [0.03623, 1],
      [0.02936, 1],
      [0.02885, 1]
    ]
  },
  "QS_mulGraftTrunk[MiddleTrunk]": {
    "red_x_points": [
      [-5e-5, 2],
      [-3e-5, 0],
      [-3e-5, 0],
      [-3e-5, 0],
      [-5e-5, 2],
      [-3e-5, 0],
      [-3e-5, 0],
      [-5e-5, 2],
      [0.00012, 1],
      [-3e-5, 0],
      [-5e-5, 2],
      [-3e-5, 0],
      [-3e-5, 0],
      [-5e-5, 2],
      [-5e-5, 2],
      [-3e-5, 0],
      [-5e-5, 2],
      [-5e-5, 2],
      [-5e-5, 2],
      [-3e-5, 0],
      [-5e-5, 2],
      [-5e-5, 2],
      [-3e-5, 0]
    ],
    "red_o_points": [],
    "y_categories": ["N", "NOT APPLICABLE", "nan"],
    "blue_o_points": [],
    "blue_x_points": [
      [0.00012, 1],
      [0.00012, 1],
      [-3e-5, 0],
      [0.00012, 1],
      [0.00012, 1]
    ]
  },
  "QS_mulGraftNerve[Ac]": {
    "red_x_points": [
      [-0.0003, 2],
      [-0.00116, 0],
      [-0.00145, 0],
      [-0.00099, 0],
      [-0.00114, 0],
      [-0.00141, 0],
      [-0.00126, 0],
      [-0.00034, 2],
      [-0.00119, 0],
      [-0.00104, 0],
      [-0.00106, 0],
      [-0.0004, 2],
      [0.00167, 1],
      [-0.00044, 2],
      [-0.00123, 0],
      [-0.00032, 2],
      [-0.0009, 0],
      [-0.00118, 0],
      [-0.00045, 2],
      [-0.00034, 2],
      [-0.00028, 2],
      [-0.00114, 0],
      [-0.00048, 2],
      [-0.00047, 2],
      [-0.00061, 2],
      [-0.00103, 0],
      [-0.00035, 2],
      [-0.00132, 0],
      [-0.00021, 2],
      [0.00157, 1],
      [-0.00101, 0]
    ],
    "red_o_points": [],
    "y_categories": ["N", "NOT APPLICABLE", "nan"],
    "blue_o_points": [],
    "blue_x_points": [
      [0.00465, 1],
      [-4e-5, 2],
      [0.00278, 1],
      [0.00014, 0],
      [-5e-5, 2],
      [0.00263, 1],
      [0.00362, 1]
    ]
  },
  "QS_mulNeuromadSite[C8]": {
    "red_x_points": [
      [-0.00109, 2],
      [-0.00332, 0],
      [-0.00311, 0],
      [-0.00302, 0],
      [-0.00372, 0],
      [-0.00307, 0],
      [-0.00304, 0],
      [-0.00101, 2],
      [-0.00285, 0],
      [-0.00306, 0],
      [-0.00293, 0],
      [-0.00125, 2],
      [0.00542, 1],
      [-0.00114, 2],
      [-0.00298, 0],
      [-0.00126, 2],
      [-0.00329, 0],
      [-0.00322, 0],
      [-0.00122, 2],
      [-0.00109, 2],
      [-0.00095, 2],
      [-0.00263, 0],
      [-0.00128, 2],
      [-0.00113, 2],
      [-0.00119, 2],
      [-0.00294, 0],
      [-0.00121, 2],
      [-0.00378, 0],
      [-0.00103, 2],
      [0.00602, 1],
      [-0.0032, 0]
    ],
    "red_o_points": [],
    "y_categories": ["N", "NOT APPLICABLE", "nan"],
    "blue_o_points": [],
    "blue_x_points": [
      [0.01197, 1],
      [-3e-5, 2],
      [0.00708, 1],
      [-0.00017, 0],
      [-0.0001, 2],
      [0.00684, 1],
      [0.00777, 1]
    ]
  },
  "QS_mulGraftNerve[Ph]": {
    "red_x_points": [
      [-0.00025, 2],
      [-0.00075, 0],
      [-0.00083, 0],
      [-0.00078, 0],
      [-0.00065, 0],
      [-0.00064, 0],
      [-0.00059, 0],
      [-0.0002, 2],
      [-0.00091, 0],
      [-0.00078, 0],
      [-0.00076, 0],
      [-0.00032, 2],
      [0.00092, 1],
      [-0.00036, 2],
      [-0.00065, 0],
      [-0.00034, 2],
      [-0.00087, 0],
      [-0.00075, 0],
      [-0.00027, 2],
      [-0.00024, 2],
      [-0.00022, 2],
      [-0.00071, 0],
      [-0.00029, 2],
      [-0.00014, 2],
      [-0.00029, 2],
      [-0.00077, 0],
      [-0.00033, 2],
      [-0.00078, 0],
      [-0.00031, 2],
      [0.0019, 1],
      [-0.00063, 0]
    ],
    "red_o_points": [],
    "y_categories": ["N", "NOT APPLICABLE", "nan"],
    "blue_o_points": [],
    "blue_x_points": [
      [0.00325, 1],
      [-3e-5, 2],
      [0.00194, 1],
      [-1e-5, 0],
      [-4e-5, 2],
      [0.00202, 1],
      [0.0017, 1]
    ]
  },
  "QS_mulTransfSite[AcSsPA]": {
    "red_x_points": [
      [-0.00064, 3],
      [-0.00095, 0],
      [-0.00108, 0],
      [-0.00105, 0],
      [-0.00101, 0],
      [-0.00103, 0],
      [-0.00103, 0],
      [-0.00085, 3],
      [-0.00109, 0],
      [-0.00096, 0],
      [-0.00098, 0],
      [-0.00069, 3],
      [0.00301, 1],
      [-0.00066, 3],
      [-0.00083, 0],
      [-0.00079, 3],
      [-0.00248, 2],
      [-0.00127, 0],
      [-0.00082, 3],
      [-0.00059, 3],
      [-0.00065, 3],
      [-0.00114, 0],
      [-0.00074, 3],
      [-0.00079, 3],
      [-0.00071, 3],
      [-0.001, 0],
      [-0.00077, 3],
      [-0.00102, 0],
      [-0.00055, 3],
      [0.00233, 1],
      [-0.00101, 0]
    ],
    "red_o_points": [],
    "y_categories": ["N", "NOT APPLICABLE", "Y", "nan"],
    "blue_o_points": [],
    "blue_x_points": [
      [0.00456, 1],
      [-0.00021, 3],
      [0.00358, 1],
      [-0.001, 0],
      [-0.00028, 3],
      [0.00372, 1],
      [0.00415, 1]
    ]
  },
  "QA_lstPexMuscstrength[ScapulaAbducSuprot]": {
    "red_x_points": [
      [-0.00033, 0],
      [8e-5, 2],
      [-0.0002, 1],
      [-0.00034, 1],
      [-0.00017, 0],
      [-0.00029, 1],
      [-0.00026, 1],
      [-0.0007, 1],
      [-0.00012, 0],
      [-9e-5, 0],
      [-0.00045, 1],
      [-0.00061, 1],
      [0.00015, 2],
      [0.00047, 2],
      [0.00013, 2],
      [0.00023, 2],
      [9e-5, 2],
      [-6e-5, 0],
      [-0.00015, 0],
      [-0.00043, 1],
      [-0.00033, 0],
      [-0.0003, 1],
      [0.00023, 2],
      [-0.00019, 0],
      [0.00017, 2],
      [-0.00055, 1],
      [-0.00078, 1],
      [2e-5, 0],
      [0.00034, 2],
      [0.0002, 2],
      [-0.00015, 1]
    ],
    "red_o_points": [],
    "y_categories": ["GREATER THAN OR EQUALS TO 3", "LESS THAN 3", "nan"],
    "blue_o_points": [],
    "blue_x_points": [
      [9e-5, 2],
      [0.00056, 2],
      [2e-5, 0],
      [0.00082, 2],
      [0.00058, 2],
      [0.00018, 0],
      [2e-5, 2]
    ]
  },
  "participant_code": {
    "red_x_points": [
      [-0.01801, 1],
      [-0.01927, 2],
      [-0.01913, 3],
      [-0.01843, 4],
      [-0.01801, 5],
      [-0.0181, 6],
      [-0.01806, 7],
      [-0.01759, 8],
      [-0.01824, 9],
      [-0.01759, 10],
      [-0.01838, 11],
      [-0.0188, 12],
      [-0.01801, 14],
      [-0.0181, 16],
      [-0.01899, 17],
      [-0.01796, 19],
      [-0.0188, 20],
      [-0.01764, 22],
      [-0.01852, 23],
      [-0.0174, 25],
      [-0.01792, 26],
      [-0.01834, 27],
      [-0.01759, 28],
      [-0.01782, 29],
      [-0.01918, 30],
      [-0.01782, 32],
      [-0.0181, 33],
      [-0.01843, 34],
      [-0.01894, 35],
      [-0.01806, 36],
      [-0.01829, 37]
    ],
    "red_o_points": [],
    "y_categories": [
      "P16554",
      "P18297",
      "P19283",
      "P19287",
      "P23391",
      "P31645",
      "P31691",
      "P34778",
      "P35046",
      "P36328",
      "P43633",
      "P4544",
      "P46417",
      "P48965",
      "P53068",
      "P5497",
      "P59529",
      "P62483",
      "P64658",
      "P65202",
      "P66816",
      "P6751",
      "P7408",
      "P75566",
      "P76226",
      "P79971",
      "P82621",
      "P82990",
      "P84932",
      "P85825",
      "P86989",
      "P8770",
      "P87791",
      "P90550",
      "P93159",
      "P94969",
      "P96710",
      "P9744",
      "nan"
    ],
    "blue_o_points": [],
    "blue_x_points": [
      [0.05412, 0],
      [0.05289, 13],
      [0.05335, 15],
      [0.05059, 18],
      [0.05212, 21],
      [0.05534, 24],
      [0.05442, 31]
    ]
  },
  "QA_lstPexMuscstrength[ShoulderExrot]": {
    "red_x_points": [
      [-0.00168, 1],
      [0.00021, 2],
      [0.00246, 0],
      [-0.00173, 1],
      [-0.00161, 1],
      [-0.00193, 1],
      [0.00039, 2],
      [-0.0019, 1],
      [-0.00197, 1],
      [-0.00165, 1],
      [0.0004, 2],
      [-0.00167, 1],
      [-0.00023, 2],
      [0.00028, 2],
      [0.00034, 2],
      [0.00036, 2],
      [0.00037, 2],
      [-0.00294, 1],
      [-0.0016, 1],
      [-0.00196, 1],
      [-0.00192, 1],
      [0.00024, 2],
      [0.00037, 2],
      [0.00042, 2],
      [0.0003, 2],
      [-0.00178, 1],
      [0.00039, 2],
      [0.0018, 0],
      [0.0003, 2],
      [-0.00016, 2],
      [-0.00172, 1]
    ],
    "red_o_points": [],
    "y_categories": ["GREATER THAN OR EQUALS TO 3", "LESS THAN 3", "nan"],
    "blue_o_points": [],
    "blue_x_points": [
      [0.0002, 2],
      [0.00042, 2],
      [0.00439, 0],
      [0.00114, 2],
      [0.00046, 2],
      [0.00424, 0],
      [0.0002, 1]
    ]
  },
  "QA_mulInjOrthesisType[ArmSling]": {
    "red_x_points": [
      [-0.01151, 2],
      [-0.0106, 2],
      [-0.01062, 2],
      [-0.01104, 2],
      [-0.01046, 2],
      [-0.011, 2],
      [-0.01048, 2],
      [-0.01133, 2],
      [-0.01058, 2],
      [-0.00966, 2],
      [-0.01075, 2],
      [-0.01119, 2],
      [0.02696, 1],
      [-0.01104, 2],
      [-0.0105, 2],
      [-0.01193, 2],
      [-0.01208, 0],
      [-0.01031, 2],
      [-0.01139, 2],
      [-0.01114, 2],
      [-0.01308, 0],
      [-0.01204, 3],
      [-0.01176, 2],
      [0.0323, 1],
      [-0.01186, 2],
      [-0.0106, 2],
      [-0.01145, 2],
      [-0.01027, 2],
      [-0.01361, 3],
      [-0.02081, 3],
      [-0.01074, 2]
    ],
    "red_o_points": [],
    "y_categories": ["N", "NOT APPLICABLE", "Y", "nan"],
    "blue_o_points": [],
    "blue_x_points": [
      [-0.0039, 2],
      [0.03203, 1],
      [0.02696, 1],
      [0.03446, 1],
      [0.03322, 1],
      [0.02837, 1],
      [0.0295, 1]
    ]
  },
  "QS_mulGraftNerve[Ul]": {
    "red_x_points": [
      [-2e-5, 2],
      [-0.0004, 0],
      [-0.00036, 0],
      [-0.00033, 0],
      [-0.00023, 0],
      [-0.00039, 0],
      [-0.00027, 0],
      [-0.0001, 2],
      [-0.00034, 0],
      [-0.00031, 0],
      [-0.00028, 0],
      [-0.00017, 2],
      [0.0003, 1],
      [-7e-5, 2],
      [-0.00031, 0],
      [-0.0001, 2],
      [-0.00025, 0],
      [-0.00027, 0],
      [-0.00016, 2],
      [-5e-5, 2],
      [-6e-5, 2],
      [-0.00029, 0],
      [-9e-5, 2],
      [-0.0001, 2],
      [-0.00012, 2],
      [-0.00031, 0],
      [-0.00012, 2],
      [-0.00027, 0],
      [-9e-5, 2],
      [0.0006, 1],
      [-0.00019, 0]
    ],
    "red_o_points": [],
    "y_categories": ["N", "NOT APPLICABLE", "nan"],
    "blue_o_points": [],
    "blue_x_points": [
      [0.00111, 1],
      [8e-5, 2],
      [0.00095, 1],
      [2e-5, 0],
      [4e-5, 2],
      [0.00056, 1],
      [0.00105, 1]
    ]
  },
  "QS_mulGraftNerve[Ssr]": {
    "red_x_points": [
      [-3e-5, 2],
      [-3e-5, 0],
      [-3e-5, 0],
      [-3e-5, 0],
      [-3e-5, 0],
      [-3e-5, 0],
      [-3e-5, 2],
      [-3e-5, 0],
      [-3e-5, 0],
      [-3e-5, 2],
      [-3e-5, 0],
      [-3e-5, 2],
      [-3e-5, 0],
      [-3e-5, 0],
      [-3e-5, 2],
      [-3e-5, 2],
      [-3e-5, 2],
      [-3e-5, 2],
      [-3e-5, 2],
      [-3e-5, 2],
      [-3e-5, 0],
      [-3e-5, 2],
      [0.00012, 1]
    ],
    "red_o_points": [],
    "y_categories": ["N", "NOT APPLICABLE", "nan"],
    "blue_o_points": [],
    "blue_x_points": [[0.00012, 1], [0.00012, 1], [-3e-5, 0], [-3e-5, 2]]
  },
  "QA_yonInjUnconscio": {
    "red_x_points": [
      [-0.00379, 1],
      [-0.00396, 1],
      [-0.00192, 2],
      [-0.00247, 2],
      [0.00917, 0],
      [-0.00463, 1],
      [-0.00298, 2],
      [-0.00492, 2],
      [-0.00274, 2],
      [-0.00218, 2],
      [-0.00435, 1],
      [-0.00527, 1],
      [-0.02421, 1],
      [-0.00448, 2],
      [-0.0027, 2],
      [-0.00418, 2],
      [-0.0037, 1],
      [0.00849, 0],
      [-0.0033, 1],
      [-0.00328, 1],
      [-0.00327, 1],
      [-0.00463, 1],
      [-0.00346, 2],
      [-0.00801, 1],
      [-0.00357, 2],
      [-0.00412, 1],
      [0.00709, 0],
      [-0.00383, 1],
      [-0.00466, 2],
      [-0.00107, 2],
      [-0.00372, 1]
    ],
    "red_o_points": [],
    "y_categories": ["N", "Y", "nan"],
    "blue_o_points": [],
    "blue_x_points": [
      [0.00123, 2],
      [0.00053, 1],
      [0.01301, 0],
      [0.02126, 0],
      [0.02109, 0],
      [0.00239, 2],
      [0.00293, 2]
    ]
  },
  "QS_mulGraftNerve[MCA]": {
    "red_x_points": [
      [-0.0, 2],
      [-6e-5, 0],
      [-5e-5, 0],
      [-1e-5, 0],
      [-6e-5, 0],
      [-6e-5, 0],
      [-6e-5, 0],
      [-1e-5, 2],
      [-6e-5, 0],
      [-6e-5, 0],
      [1e-5, 2],
      [1e-5, 1],
      [-0.0, 2],
      [-5e-5, 0],
      [-1e-5, 2],
      [-6e-5, 0],
      [-0.0, 2],
      [-0.0, 2],
      [1e-5, 2],
      [1e-5, 2],
      [1e-5, 2],
      [-1e-5, 2],
      [-5e-5, 0],
      [-0.0, 2],
      [1e-5, 2],
      [1e-5, 1],
      [-6e-5, 0]
    ],
    "red_o_points": [],
    "y_categories": ["N", "NOT APPLICABLE", "nan"],
    "blue_o_points": [],
    "blue_x_points": [
      [0.00012, 1],
      [8e-5, 2],
      [7e-5, 0],
      [1e-5, 2],
      [7e-5, 1],
      [7e-5, 1]
    ]
  },
  "QA_lstPexInspectio[SurgicalScar]": {
    "red_x_points": [
      [0.00236, 1],
      [0.00081, 1],
      [0.00057, 0],
      [0.00072, 1],
      [-0.00427, 2],
      [0.0008, 0],
      [0.00084, 1],
      [0.00167, 1],
      [0.00083, 1],
      [-0.00259, 2],
      [0.00079, 1],
      [-0.00196, 0],
      [-0.0008, 1],
      [-0.00615, 2],
      [0.00106, 1],
      [0.00211, 1],
      [-0.00116, 0],
      [-0.00485, 2],
      [-0.00501, 2],
      [-0.00457, 2],
      [0.00196, 1],
      [0.00082, 1],
      [-0.00636, 2],
      [-0.01618, 2],
      [0.0022, 1],
      [0.00069, 1],
      [-0.00601, 2],
      [-0.00264, 2],
      [0.00191, 1],
      [-0.00142, 1],
      [-0.00252, 2]
    ],
    "red_o_points": [],
    "y_categories": ["ABS", "NAIA", "PT", "nan"],
    "blue_o_points": [],
    "blue_x_points": [
      [0.00027, 1],
      [0.0046, 1],
      [0.0068, 0],
      [0.0042, 1],
      [0.00595, 1],
      [0.00057, 1],
      [0.0059, 0]
    ]
  },
  "QS_mulGraftNerve[Me]": {
    "red_x_points": [
      [-0.00014, 2],
      [-0.00034, 0],
      [-0.00043, 0],
      [-0.0003, 0],
      [-0.00041, 0],
      [-0.00039, 0],
      [-0.00044, 0],
      [-0.00012, 2],
      [-0.00044, 0],
      [-0.0004, 0],
      [-0.00026, 0],
      [-0.00011, 2],
      [0.00044, 1],
      [-0.00019, 2],
      [-0.00027, 0],
      [-0.00012, 2],
      [-0.00034, 0],
      [-0.00034, 0],
      [-0.00019, 2],
      [-0.00013, 2],
      [-0.0001, 2],
      [-0.00029, 0],
      [-0.00016, 2],
      [-6e-5, 2],
      [-0.00015, 2],
      [-0.00017, 0],
      [-0.00018, 2],
      [-0.00035, 0],
      [-0.00011, 2],
      [0.00084, 1],
      [-0.00037, 0]
    ],
    "red_o_points": [],
    "y_categories": ["N", "NOT APPLICABLE", "nan"],
    "blue_o_points": [],
    "blue_x_points": [
      [0.00163, 1],
      [-2e-5, 2],
      [0.00066, 1],
      [-0.0, 0],
      [-5e-5, 2],
      [0.00075, 1],
      [0.00087, 1]
    ]
  },
  "QS_mulGraftNerve[Ax]": {
    "red_x_points": [
      [-1e-5, 2],
      [-0.00021, 0],
      [-0.00017, 0],
      [-0.00017, 0],
      [-0.0002, 0],
      [-0.00027, 0],
      [-0.00016, 0],
      [-0.00015, 2],
      [-0.00021, 0],
      [-0.00018, 0],
      [-0.00018, 0],
      [-0.00011, 2],
      [0.00027, 1],
      [-0.0001, 2],
      [-0.00022, 0],
      [-3e-5, 2],
      [-0.00016, 0],
      [-0.00025, 0],
      [-0.00016, 2],
      [-9e-5, 2],
      [-4e-5, 2],
      [-0.00021, 0],
      [-8e-5, 2],
      [-6e-5, 2],
      [-8e-5, 2],
      [-0.00024, 0],
      [-4e-5, 2],
      [-0.00025, 0],
      [-7e-5, 2],
      [0.00042, 1],
      [-0.00027, 0]
    ],
    "red_o_points": [],
    "y_categories": ["N", "NOT APPLICABLE", "nan"],
    "blue_o_points": [],
    "blue_x_points": [
      [0.00095, 1],
      [-0.0, 2],
      [0.00049, 1],
      [-4e-5, 0],
      [-2e-5, 2],
      [0.00034, 1],
      [0.00046, 1]
    ]
  },
  "QS_mulLysisSite[Trunk]": {
    "red_x_points": [
      [-0.0016, 3],
      [-0.00298, 0],
      [-0.00286, 0],
      [-0.00236, 0],
      [-0.00272, 0],
      [-0.0053, 2],
      [-0.0024, 0],
      [-0.00161, 3],
      [-0.00268, 0],
      [-0.00244, 0],
      [-0.00284, 0],
      [-0.00147, 3],
      [0.00649, 1],
      [-0.00116, 3],
      [-0.00291, 0],
      [-0.0016, 3],
      [-0.00483, 2],
      [-0.00273, 0],
      [-0.00168, 3],
      [-0.00132, 3],
      [-0.00137, 3],
      [-0.00251, 0],
      [-0.00124, 3],
      [-0.00134, 3],
      [-0.00134, 3],
      [-0.00258, 0],
      [-0.00145, 3],
      [-0.00325, 0],
      [-0.00127, 3],
      [0.00781, 1],
      [-0.00392, 2]
    ],
    "red_o_points": [],
    "y_categories": ["N", "NOT APPLICABLE", "Y", "nan"],
    "blue_o_points": [],
    "blue_x_points": [
      [0.01042, 1],
      [-0.00023, 3],
      [0.00869, 1],
      [-0.00128, 0],
      [-8e-5, 3],
      [0.00773, 1],
      [0.00826, 1]
    ]
  },
  "QS_mulGraftTrunk[UpperTrunk]": {
    "red_x_points": [
      [-0.00115, 3],
      [-0.00149, 0],
      [-0.00136, 0],
      [-0.00155, 0],
      [-0.00177, 0],
      [-0.00157, 0],
      [-0.0016, 0],
      [-0.00082, 3],
      [-0.00161, 0],
      [-0.00153, 0],
      [-0.00152, 0],
      [-0.0011, 3],
      [0.00403, 1],
      [-0.00105, 3],
      [-0.00362, 2],
      [-0.00121, 3],
      [-0.00145, 0],
      [-0.00157, 0],
      [-0.00096, 3],
      [-0.00085, 3],
      [-0.00082, 3],
      [-0.00158, 0],
      [-0.00095, 3],
      [-0.00101, 3],
      [-0.001, 3],
      [-0.0016, 0],
      [-0.00089, 3],
      [-0.00158, 0],
      [-0.00085, 3],
      [0.00446, 1],
      [-0.00148, 0]
    ],
    "red_o_points": [],
    "y_categories": ["N", "NOT APPLICABLE", "Y", "nan"],
    "blue_o_points": [],
    "blue_x_points": [
      [0.0072, 1],
      [-0.00037, 3],
      [0.0049, 1],
      [-0.00088, 0],
      [-0.0004, 3],
      [0.00501, 1],
      [0.00557, 1]
    ]
  },
  "QS_mulTransfSite[PhMc]": {
    "red_x_points": [
      [-0.00162, 3],
      [-0.00275, 0],
      [-0.00268, 0],
      [-0.00265, 0],
      [-0.00256, 0],
      [-0.00254, 0],
      [-0.00501, 2],
      [-0.00159, 3],
      [-0.00262, 0],
      [-0.00267, 0],
      [-0.00243, 0],
      [-0.00163, 3],
      [0.00731, 1],
      [-0.00151, 3],
      [-0.00285, 0],
      [-0.00161, 3],
      [-0.00263, 0],
      [-0.00236, 0],
      [-0.00165, 3],
      [-0.00154, 3],
      [-0.00157, 3],
      [-0.00474, 2],
      [-0.00148, 3],
      [-0.00165, 3],
      [-0.00138, 3],
      [-0.00257, 0],
      [-0.0017, 3],
      [-0.00237, 0],
      [-0.00144, 3],
      [0.00757, 1],
      [-0.00257, 0]
    ],
    "red_o_points": [],
    "y_categories": ["N", "NOT APPLICABLE", "Y", "nan"],
    "blue_o_points": [],
    "blue_x_points": [
      [0.00989, 1],
      [-0.00064, 3],
      [0.00759, 1],
      [-0.00211, 0],
      [-0.00057, 3],
      [0.00858, 1],
      [0.00926, 1]
    ]
  },
  "QA_mulInjTbpiCause[Motorcycle]": {
    "red_x_points": [
      [0.00043, 0],
      [-0.00088, 1],
      [-0.00134, 1],
      [-0.00098, 1],
      [-0.00157, 1],
      [-0.00102, 1],
      [-0.00091, 1],
      [-0.00076, 1],
      [-0.0009, 1],
      [-0.001, 1],
      [-0.00096, 1],
      [-0.00036, 0],
      [-0.03616, 1],
      [-0.00095, 1],
      [-0.00142, 1],
      [-0.00087, 1],
      [-0.00106, 1],
      [-0.0015, 1],
      [0.00044, 0],
      [-0.00087, 1],
      [-0.00061, 1],
      [-0.00083, 1],
      [-0.0011, 1],
      [-0.00236, 1],
      [0.00022, 0],
      [-0.00086, 1],
      [-0.00045, 1],
      [-0.00106, 1],
      [-0.0006, 1],
      [-0.03445, 1],
      [-0.00075, 1]
    ],
    "red_o_points": [],
    "y_categories": ["N", "Y", "nan"],
    "blue_o_points": [],
    "blue_x_points": [
      [0.018, 0],
      [-0.00027, 1],
      [0.0143, 0],
      [-0.00181, 1],
      [0.00128, 1],
      [0.01539, 0],
      [0.01599, 0]
    ]
  },
  "QS_mulLysisRoot[C6]": {
    "red_x_points": [
      [-0.00152, 3],
      [-0.00248, 0],
      [-0.00412, 2],
      [-0.0023, 0],
      [-0.00234, 0],
      [-0.00223, 0],
      [-0.00202, 0],
      [-0.00166, 3],
      [-0.00222, 0],
      [-0.00222, 0],
      [-0.00218, 0],
      [-0.00126, 3],
      [0.00588, 1],
      [-0.00141, 3],
      [-0.00242, 0],
      [-0.00171, 3],
      [-0.00216, 0],
      [-0.00214, 0],
      [-0.0013, 3],
      [-0.00146, 3],
      [-0.00142, 3],
      [-0.00196, 0],
      [-0.00133, 3],
      [-0.00139, 3],
      [-0.00164, 3],
      [-0.00215, 0],
      [-0.0013, 3],
      [-0.00239, 0],
      [-0.00151, 3],
      [0.00737, 1],
      [-0.00416, 2]
    ],
    "red_o_points": [],
    "y_categories": ["N", "NOT APPLICABLE", "Y", "nan"],
    "blue_o_points": [],
    "blue_x_points": [
      [0.00922, 1],
      [-0.00079, 3],
      [0.00663, 1],
      [-0.00148, 0],
      [-0.00062, 3],
      [0.00719, 1],
      [0.00817, 1]
    ]
  },
  "QA_yonInjOrtsurg": {
    "red_x_points": [
      [-0.00332, 2],
      [-0.00037, 2],
      [-1e-5, 2],
      [-9e-5, 2],
      [-5e-5, 2],
      [-5e-5, 2],
      [-0.00034, 1],
      [-0.00363, 2],
      [8e-5, 0],
      [-0.00015, 1],
      [-0.0003, 1],
      [-0.00359, 2],
      [-0.00384, 0],
      [4e-5, 1],
      [-0.00031, 2],
      [-0.00379, 2],
      [-0.0002, 0],
      [6e-5, 2],
      [0.0039, 0],
      [-9e-5, 1],
      [-0.00381, 2],
      [-0.00022, 1],
      [-0.00463, 2],
      [-0.0036, 2],
      [-0.0035, 2],
      [7e-5, 0],
      [-0.00113, 1],
      [0.00014, 0],
      [-0.00344, 2],
      [-0.00111, 1],
      [-5e-5, 1]
    ],
    "red_o_points": [],
    "y_categories": ["N", "Y", "nan"],
    "blue_o_points": [],
    "blue_x_points": [
      [0.00042, 2],
      [0.00532, 1],
      [0.00036, 2],
      [0.00023, 2],
      [0.01457, 0],
      [0.00041, 2],
      [0.00049, 2]
    ]
  },
  "QS_mulGraftLevel[Trunk]": {
    "red_x_points": [
      [-0.00035, 3],
      [-0.00051, 0],
      [-0.00048, 0],
      [-0.00049, 0],
      [-0.00052, 0],
      [-0.00044, 0],
      [-0.00058, 0],
      [-0.00034, 3],
      [-0.00048, 0],
      [-0.00041, 0],
      [-0.00046, 0],
      [-0.00045, 3],
      [0.0014, 1],
      [-0.00042, 3],
      [-0.00233, 2],
      [-0.00016, 3],
      [-0.00028, 0],
      [-0.00051, 0],
      [-0.00037, 3],
      [-0.00022, 3],
      [-0.00024, 3],
      [-0.00047, 0],
      [-0.00035, 3],
      [-0.00037, 3],
      [-0.00042, 3],
      [-0.00051, 0],
      [-0.00037, 3],
      [-0.00046, 0],
      [-0.00031, 3],
      [0.00124, 1],
      [-0.00042, 0]
    ],
    "red_o_points": [],
    "y_categories": ["N", "NOT APPLICABLE", "Y", "nan"],
    "blue_o_points": [],
    "blue_x_points": [
      [0.00141, 1],
      [1e-5, 3],
      [0.0017, 1],
      [7e-5, 0],
      [2e-5, 3],
      [0.00187, 1],
      [0.00198, 1]
    ]
  },
  "QS_mulGraftNerve[FI]": {
    "red_x_points": [
      [-0.00014, 2],
      [-0.00087, 0],
      [-0.00131, 0],
      [-0.00123, 0],
      [-0.0009, 0],
      [-0.00085, 0],
      [-0.00102, 0],
      [-0.00027, 2],
      [-0.00115, 0],
      [-0.00124, 0],
      [-0.0008, 0],
      [-0.00019, 2],
      [0.00179, 1],
      [-0.00013, 2],
      [-0.00115, 0],
      [-0.00036, 2],
      [-0.00114, 0],
      [-0.00087, 0],
      [-0.00015, 2],
      [-7e-5, 2],
      [-0.00015, 2],
      [-0.0011, 0],
      [-0.00026, 2],
      [-0.00032, 2],
      [-0.00039, 2],
      [-0.00072, 0],
      [-0.00016, 2],
      [-0.00097, 0],
      [-0.00017, 2],
      [0.00169, 1],
      [-0.00086, 0]
    ],
    "red_o_points": [],
    "y_categories": ["N", "NOT APPLICABLE", "nan"],
    "blue_o_points": [],
    "blue_x_points": [
      [0.00325, 1],
      [0.00014, 2],
      [0.00207, 1],
      [5e-5, 0],
      [0.00013, 2],
      [0.00189, 1],
      [0.00287, 1]
    ]
  },
  "QS_mulGraftNerve[other]": {
    "red_x_points": [
      [-0.00076, 2],
      [-0.00155, 0],
      [-0.00172, 0],
      [-0.00187, 0],
      [-0.00157, 0],
      [-0.00177, 0],
      [-0.00167, 0],
      [-0.0007, 2],
      [-0.00181, 0],
      [-0.00163, 0],
      [-0.00129, 0],
      [-0.00062, 2],
      [0.00119, 1],
      [-0.00049, 2],
      [-0.00205, 0],
      [-0.00079, 2],
      [-0.00132, 0],
      [-0.00165, 0],
      [-0.00056, 2],
      [-0.00041, 2],
      [-0.00054, 2],
      [-0.00129, 0],
      [-0.00054, 2],
      [-0.0009, 2],
      [-0.00062, 2],
      [-0.00185, 0],
      [-0.00052, 2],
      [-0.00153, 0],
      [-0.00053, 2],
      [0.00276, 1],
      [-0.00175, 0]
    ],
    "red_o_points": [],
    "y_categories": ["N", "NOT APPLICABLE", "nan"],
    "blue_o_points": [],
    "blue_x_points": [
      [0.00669, 1],
      [8e-5, 2],
      [0.00378, 1],
      [0.00051, 0],
      [-2e-5, 2],
      [0.00389, 1],
      [0.00426, 1]
    ]
  },
  "QS_mulTransfSite[AcSsAA]": {
    "red_x_points": [
      [-0.00282, 3],
      [-0.00904, 2],
      [-0.00416, 0],
      [-0.0088, 2],
      [-0.00975, 2],
      [-0.00336, 0],
      [-0.00371, 0],
      [-0.00307, 3],
      [-0.0039, 0],
      [-0.00869, 2],
      [-0.00357, 0],
      [-0.0029, 3],
      [0.01518, 1],
      [-0.00327, 3],
      [-0.01021, 2],
      [-0.00337, 3],
      [-0.00356, 0],
      [-0.00356, 0],
      [-0.003, 3],
      [-0.00273, 3],
      [-0.00269, 3],
      [-0.00855, 2],
      [-0.00318, 3],
      [-0.00291, 3],
      [-0.00341, 3],
      [-0.00367, 0],
      [-0.00282, 3],
      [-0.00834, 2],
      [-0.00284, 3],
      [0.01462, 1],
      [-0.00352, 0]
    ],
    "red_o_points": [],
    "y_categories": ["N", "NOT APPLICABLE", "Y", "nan"],
    "blue_o_points": [],
    "blue_x_points": [
      [0.02061, 1],
      [-0.00123, 3],
      [0.01634, 1],
      [0.0001, 0],
      [-0.00115, 3],
      [0.01521, 1],
      [0.01745, 1]
    ]
  },
  "QS_mulGraftNerve[LP]": {
    "red_x_points": [
      [-3e-5, 2],
      [-3e-5, 0],
      [-2e-5, 0],
      [-3e-5, 0],
      [-3e-5, 0],
      [-3e-5, 0],
      [-3e-5, 0],
      [-1e-5, 2],
      [-3e-5, 0],
      [-2e-5, 0],
      [-1e-5, 0],
      [-2e-5, 2],
      [-3e-5, 2],
      [-3e-5, 0],
      [-2e-5, 2],
      [-3e-5, 2],
      [-3e-5, 2],
      [-1e-5, 2],
      [-3e-5, 0],
      [-1e-5, 2],
      [-3e-5, 0],
      [-1e-5, 0]
    ],
    "red_o_points": [],
    "y_categories": ["N", "NOT APPLICABLE", "nan"],
    "blue_o_points": [],
    "blue_x_points": [[0.00037, 1]]
  },
  "QA_lstPexMuscstrength[WristFlex]": {
    "red_x_points": [
      [-0.00369, 1],
      [-0.00047, 2],
      [-0.00108, 1],
      [-0.00166, 1],
      [0.00031, 0],
      [0.00068, 0],
      [-0.00194, 1],
      [-0.00246, 0],
      [0.00079, 0],
      [0.0003, 0],
      [0.00052, 0],
      [-0.00174, 0],
      [-0.00145, 2],
      [0.00207, 2],
      [-0.00019, 2],
      [-0.00207, 0],
      [-0.00024, 2],
      [0.0004, 0],
      [-0.00155, 0],
      [-0.00362, 1],
      [-0.0021, 0],
      [-0.00147, 1],
      [0.00177, 2],
      [-0.01101, 1],
      [-0.00194, 0],
      [0.00051, 0],
      [-0.00276, 1],
      [0.00038, 0],
      [0.00199, 2],
      [-0.00016, 2],
      [-0.0011, 1]
    ],
    "red_o_points": [],
    "y_categories": ["GREATER THAN OR EQUALS TO 3", "LESS THAN 3", "nan"],
    "blue_o_points": [],
    "blue_x_points": [
      [0.00064, 0],
      [0.004, 2],
      [0.00176, 0],
      [0.00351, 0],
      [0.00575, 2],
      [0.00185, 0],
      [0.00208, 0]
    ]
  },
  "QS_mulNeuromadSite[C5]": {
    "red_x_points": [
      [-0.0013, 2],
      [-0.00316, 0],
      [-0.00368, 0],
      [-0.00304, 0],
      [-0.00298, 0],
      [-0.00298, 0],
      [-0.00307, 0],
      [-0.00148, 2],
      [-0.0031, 0],
      [-0.0029, 0],
      [-0.00237, 0],
      [-0.00166, 2],
      [0.00372, 1],
      [-0.00128, 2],
      [-0.00368, 0],
      [-0.00156, 2],
      [-0.00266, 0],
      [-0.00289, 0],
      [-0.00106, 2],
      [-0.00112, 2],
      [-0.00105, 2],
      [-0.00293, 0],
      [-0.00143, 2],
      [-0.00177, 2],
      [-0.0016, 2],
      [-0.00311, 0],
      [-0.0011, 2],
      [-0.00272, 0],
      [-0.00112, 2],
      [0.00559, 1],
      [-0.00288, 0]
    ],
    "red_o_points": [],
    "y_categories": ["N", "NOT APPLICABLE", "nan"],
    "blue_o_points": [],
    "blue_x_points": [
      [0.01229, 1],
      [0.00025, 2],
      [0.00717, 1],
      [0.00068, 0],
      [-6e-5, 2],
      [0.00721, 1],
      [0.00881, 1]
    ]
  },
  "QS_mulNeuromadSite[C7]": {
    "red_x_points": [
      [-0.00085, 2],
      [-0.00227, 0],
      [-0.00294, 0],
      [-0.0022, 0],
      [-0.00236, 0],
      [-0.00243, 0],
      [-0.00224, 0],
      [-0.00098, 2],
      [-0.00244, 0],
      [-0.0024, 0],
      [-0.00222, 0],
      [-0.00098, 2],
      [0.00294, 1],
      [-0.00105, 2],
      [-0.00272, 0],
      [-0.00088, 2],
      [-0.00228, 0],
      [-0.00214, 0],
      [-0.00083, 2],
      [-0.00075, 2],
      [-0.00065, 2],
      [-0.00209, 0],
      [-0.00095, 2],
      [-0.00069, 2],
      [-0.00108, 2],
      [-0.00214, 0],
      [-0.00087, 2],
      [-0.00256, 0],
      [-0.00057, 2],
      [0.00413, 1],
      [-0.00247, 0]
    ],
    "red_o_points": [],
    "y_categories": ["N", "NOT APPLICABLE", "nan"],
    "blue_o_points": [],
    "blue_x_points": [
      [0.01073, 1],
      [0.00014, 2],
      [0.00469, 1],
      [-3e-5, 0],
      [0.00018, 2],
      [0.00535, 1],
      [0.00581, 1]
    ]
  },
  "QA_lstPexMuscstrength[WristExte]": {
    "red_x_points": [
      [-0.00344, 1],
      [-0.00072, 2],
      [-0.0016, 1],
      [-0.00138, 1],
      [0.00065, 0],
      [-0.00161, 1],
      [-0.00209, 1],
      [-0.00193, 0],
      [0.00132, 0],
      [0.0006, 0],
      [-0.00154, 1],
      [-0.00162, 0],
      [-0.00294, 2],
      [0.00219, 2],
      [-0.00034, 2],
      [-0.00121, 0],
      [-0.00023, 2],
      [0.00083, 0],
      [-0.00139, 0],
      [-0.00297, 1],
      [-0.00187, 0],
      [-0.00178, 1],
      [0.0015, 2],
      [-0.00178, 0],
      [-0.00387, 1],
      [0.00069, 0],
      [-0.00324, 1],
      [0.0006, 0],
      [0.00199, 2],
      [-0.00272, 2],
      [-0.00148, 1]
    ],
    "red_o_points": [],
    "y_categories": ["GREATER THAN OR EQUALS TO 3", "LESS THAN 3", "nan"],
    "blue_o_points": [],
    "blue_x_points": [
      [0.00162, 0],
      [0.00509, 2],
      [0.00136, 0],
      [0.00336, 0],
      [0.00473, 2],
      [0.00136, 1],
      [0.00131, 0]
    ]
  },
  "QA_lstPexMuscstrength[ElbowExte]": {
    "red_x_points": [
      [-0.00233, 1],
      [-9e-5, 2],
      [5e-5, 1],
      [0.00012, 1],
      [-0.00167, 0],
      [2e-5, 1],
      [7e-5, 1],
      [-0.00264, 1],
      [-0.00119, 0],
      [-0.0005, 0],
      [0.00012, 1],
      [-0.00299, 1],
      [3e-5, 2],
      [0.00325, 2],
      [-0.00022, 2],
      [-0.00235, 1],
      [-4e-5, 2],
      [0.0005, 1],
      [-0.0022, 0],
      [-0.002, 1],
      [-0.00276, 0],
      [4e-5, 1],
      [0.00309, 2],
      [-0.00314, 0],
      [-0.00315, 0],
      [0.00014, 1],
      [-0.00229, 1],
      [-0.00034, 2],
      [-0.00252, 1],
      [3e-5, 2],
      [3e-5, 1]
    ],
    "red_o_points": [],
    "y_categories": ["GREATER THAN OR EQUALS TO 3", "LESS THAN 3", "nan"],
    "blue_o_points": [],
    "blue_x_points": [
      [0.00019, 2],
      [0.00682, 2],
      [0.00015, 0],
      [0.00181, 1],
      [0.00602, 2],
      [8e-5, 0],
      [0.0001, 0]
    ]
  },
  "QS_mulGraftNerve[SS]": {
    "red_x_points": [
      [-6e-5, 2],
      [-0.00014, 0],
      [-0.00014, 0],
      [-0.00014, 0],
      [-0.00019, 0],
      [-0.00014, 0],
      [-0.00014, 0],
      [-6e-5, 2],
      [-0.00014, 0],
      [-5e-5, 0],
      [-9e-5, 0],
      [-4e-5, 2],
      [0.0002, 1],
      [-4e-5, 2],
      [-0.00021, 0],
      [-1e-5, 2],
      [-0.00012, 0],
      [-0.00014, 0],
      [-5e-5, 2],
      [-1e-5, 2],
      [-6e-5, 2],
      [-0.00019, 0],
      [3e-5, 2],
      [-5e-5, 2],
      [-5e-5, 2],
      [-9e-5, 0],
      [-6e-5, 2],
      [-0.00019, 0],
      [-4e-5, 2],
      [0.00032, 1],
      [-9e-5, 0]
    ],
    "red_o_points": [],
    "y_categories": ["N", "NOT APPLICABLE", "nan"],
    "blue_o_points": [],
    "blue_x_points": [
      [0.00031, 1],
      [4e-5, 2],
      [0.00041, 1],
      [-2e-5, 0],
      [3e-5, 2],
      [0.00041, 1]
    ]
  },
  "QS_mulGraftNerve[MCF]": {
    "red_x_points": [
      [-4e-5, 2],
      [-9e-5, 0],
      [-5e-5, 0],
      [-9e-5, 0],
      [-9e-5, 0],
      [-5e-5, 0],
      [-5e-5, 0],
      [-1e-5, 2],
      [-5e-5, 0],
      [-9e-5, 0],
      [-5e-5, 0],
      [-4e-5, 2],
      [0.0001, 1],
      [-1e-5, 2],
      [-9e-5, 0],
      [-5e-5, 0],
      [-9e-5, 0],
      [-4e-5, 2],
      [-4e-5, 2],
      [-9e-5, 0],
      [-4e-5, 2],
      [-2e-5, 2],
      [-1e-5, 2],
      [-9e-5, 0],
      [-4e-5, 2],
      [-9e-5, 0],
      [-4e-5, 2],
      [0.0001, 1],
      [-9e-5, 0]
    ],
    "red_o_points": [],
    "y_categories": ["N", "NOT APPLICABLE", "nan"],
    "blue_o_points": [],
    "blue_x_points": [
      [0.00026, 1],
      [-1e-5, 2],
      [0.0001, 1],
      [-4e-5, 2],
      [0.00015, 1],
      [0.00026, 1]
    ]
  },
  "QS_mulNeuromadSite[C6]": {
    "red_x_points": [
      [-0.00057, 2],
      [-0.00153, 0],
      [-0.00181, 0],
      [-0.00152, 0],
      [-0.0015, 0],
      [-0.00202, 0],
      [-0.00148, 0],
      [-0.00058, 2],
      [-0.00163, 0],
      [-0.00177, 0],
      [-0.00139, 0],
      [-0.00071, 2],
      [0.00214, 1],
      [-0.00047, 2],
      [-0.00151, 0],
      [-0.00069, 2],
      [-0.00154, 0],
      [-0.00162, 0],
      [-0.00049, 2],
      [-0.00038, 2],
      [-0.00059, 2],
      [-0.00139, 0],
      [-0.00044, 2],
      [-0.00072, 2],
      [-0.00068, 2],
      [-0.0014, 0],
      [-0.0005, 2],
      [-0.00173, 0],
      [-0.00049, 2],
      [0.00253, 1],
      [-0.00136, 0]
    ],
    "red_o_points": [],
    "y_categories": ["N", "NOT APPLICABLE", "nan"],
    "blue_o_points": [],
    "blue_x_points": [
      [0.00666, 1],
      [0.00016, 2],
      [0.00377, 1],
      [0.00041, 0],
      [-0.00012, 2],
      [0.00341, 1],
      [0.00382, 1]
    ]
  },
  "QS_mulLysisSite[Nerve]": {
    "red_x_points": [
      [-0.00019, 3],
      [-0.00031, 0],
      [-0.0008, 2],
      [-0.00033, 0],
      [-0.0003, 0],
      [-0.00036, 0],
      [-0.00034, 0],
      [-9e-5, 3],
      [-0.00032, 0],
      [-0.00039, 0],
      [-0.00041, 0],
      [-0.00019, 3],
      [0.00125, 1],
      [-0.00019, 3],
      [-0.00035, 0],
      [-0.00019, 3],
      [-0.0004, 0],
      [-0.00039, 0],
      [-0.00014, 3],
      [-0.0001, 3],
      [-0.00015, 3],
      [-0.00041, 0],
      [-9e-5, 3],
      [-0.0002, 3],
      [-0.0002, 3],
      [-0.00042, 0],
      [-0.0001, 3],
      [-0.0003, 0],
      [-0.0002, 3],
      [0.00127, 1],
      [-0.00034, 0]
    ],
    "red_o_points": [],
    "y_categories": ["N", "NOT APPLICABLE", "Y", "nan"],
    "blue_o_points": [],
    "blue_x_points": [
      [0.00128, 1],
      [-6e-5, 3],
      [0.00087, 1],
      [-0.00047, 0],
      [-7e-5, 3],
      [0.00082, 1],
      [0.00104, 1]
    ]
  },
  "QS_mulGraftNerve[TD]": {
    "red_x_points": [
      [-0.0, 2],
      [-8e-5, 0],
      [-5e-5, 0],
      [-7e-5, 0],
      [-5e-5, 0],
      [-5e-5, 0],
      [-7e-5, 2],
      [-1e-5, 0],
      [-7e-5, 0],
      [-0.0, 2],
      [7e-5, 1],
      [-0.0, 2],
      [-3e-5, 0],
      [-0.0, 2],
      [-3e-5, 0],
      [-7e-5, 0],
      [-9e-5, 2],
      [-2e-5, 2],
      [-9e-5, 2],
      [-6e-5, 0],
      [-2e-5, 2],
      [-9e-5, 2],
      [-5e-5, 0],
      [-2e-5, 2],
      [-7e-5, 0],
      [4e-5, 2],
      [7e-5, 1],
      [-3e-5, 0]
    ],
    "red_o_points": [],
    "y_categories": ["N", "NOT APPLICABLE", "nan"],
    "blue_o_points": [],
    "blue_x_points": [
      [0.0002, 1],
      [6e-5, 2],
      [0.00013, 1],
      [-8e-5, 0],
      [-0.0, 2],
      [0.0002, 1],
      [0.00025, 1]
    ]
  },
  "QS_mulLysisRoot[C7]": {
    "red_x_points": [
      [-0.00048, 3],
      [-0.00063, 0],
      [-0.00156, 2],
      [-0.00068, 0],
      [-0.0007, 0],
      [-0.00044, 0],
      [-0.00058, 0],
      [-0.0004, 3],
      [-0.00072, 0],
      [-0.00058, 0],
      [-0.00056, 0],
      [-0.00036, 3],
      [0.00189, 1],
      [-0.0003, 3],
      [-0.00059, 0],
      [-0.00059, 3],
      [-0.00056, 0],
      [-0.00057, 0],
      [-0.0006, 3],
      [-0.00059, 3],
      [-0.00032, 3],
      [-0.00055, 0],
      [-0.00038, 3],
      [-0.00052, 3],
      [-0.00033, 3],
      [-0.00059, 0],
      [-0.00038, 3],
      [-0.00068, 0],
      [-0.00033, 3],
      [0.00184, 1],
      [-0.00053, 0]
    ],
    "red_o_points": [],
    "y_categories": ["N", "NOT APPLICABLE", "Y", "nan"],
    "blue_o_points": [],
    "blue_x_points": [
      [0.0021, 1],
      [-0.00031, 3],
      [0.00229, 1],
      [-0.0006, 0],
      [-0.00014, 3],
      [0.00198, 1],
      [0.00218, 1]
    ]
  },
  "QS_mulTransfSite[IMc]": {
    "red_x_points": [
      [-0.00282, 3],
      [-0.00749, 2],
      [-0.00515, 0],
      [-0.00462, 0],
      [-0.00481, 0],
      [-0.00472, 0],
      [-0.0047, 0],
      [-0.00284, 3],
      [-0.00473, 0],
      [-0.00462, 0],
      [-0.0044, 0],
      [-0.00295, 3],
      [0.0115, 1],
      [-0.00274, 3],
      [-0.00492, 0],
      [-0.00304, 3],
      [-0.00832, 2],
      [-0.00471, 0],
      [-0.00263, 3],
      [-0.00278, 3],
      [-0.00256, 3],
      [-0.00457, 0],
      [-0.00282, 3],
      [-0.0031, 3],
      [-0.00278, 3],
      [-0.0039, 0],
      [-0.00302, 3],
      [-0.0078, 2],
      [-0.00276, 3],
      [0.01389, 1],
      [-0.00695, 2]
    ],
    "red_o_points": [],
    "y_categories": ["N", "NOT APPLICABLE", "Y", "nan"],
    "blue_o_points": [],
    "blue_x_points": [
      [0.01887, 1],
      [-0.0007, 3],
      [0.0143, 1],
      [-0.00159, 0],
      [-0.00093, 3],
      [0.01502, 1],
      [0.0175, 1]
    ]
  },
  "QA_lstPexTouch[T1]": {
    "red_x_points": [
      [-0.00135, 1],
      [-0.00022, 2],
      [0.00035, 1],
      [-0.00043, 2],
      [-0.00191, 0],
      [0.00088, 1],
      [0.00056, 1],
      [-0.00142, 1],
      [-0.00236, 0],
      [-0.00126, 0],
      [-0.00196, 0],
      [-0.00253, 0],
      [-0.01038, 2],
      [0.00227, 2],
      [-0.00053, 2],
      [-0.00159, 1],
      [-0.00018, 2],
      [0.00086, 1],
      [-0.00281, 0],
      [-0.00177, 1],
      [-0.00307, 0],
      [-0.00017, 2],
      [0.0019, 2],
      [-0.00168, 1],
      [-0.0034, 0],
      [0.00094, 1],
      [-0.00285, 0],
      [-0.0005, 2],
      [-0.00305, 0],
      [0.0008, 1],
      [0.0004, 1]
    ],
    "red_o_points": [],
    "y_categories": ["NORM", "NPV", "nan"],
    "blue_o_points": [],
    "blue_x_points": [
      [0.00097, 1],
      [0.00473, 2],
      [0.00092, 1],
      [0.00262, 1],
      [0.00564, 2],
      [0.00099, 1],
      [0.00565, 0]
    ]
  },
  "QS_mulTransfSite[AcMc]": {
    "red_x_points": [
      [-0.00053, 3],
      [-0.00071, 0],
      [-0.00041, 0],
      [-0.00062, 0],
      [-0.00059, 0],
      [-0.00063, 0],
      [-0.00064, 0],
      [-0.00046, 3],
      [-0.00065, 0],
      [-0.00062, 0],
      [-0.00209, 2],
      [-0.00049, 3],
      [0.00211, 1],
      [-0.00042, 3],
      [-0.00062, 0],
      [-0.00064, 3],
      [-0.00066, 0],
      [-0.00056, 0],
      [-0.00056, 3],
      [-0.00052, 3],
      [-0.00043, 3],
      [-0.00064, 0],
      [-0.00049, 3],
      [-0.00063, 3],
      [-0.0005, 3],
      [-0.00059, 0],
      [-0.0005, 3],
      [-0.00079, 0],
      [-0.00066, 3],
      [0.00182, 1],
      [-0.00058, 0]
    ],
    "red_o_points": [],
    "y_categories": ["N", "NOT APPLICABLE", "Y", "nan"],
    "blue_o_points": [],
    "blue_x_points": [
      [0.00286, 1],
      [-0.00027, 3],
      [0.00299, 1],
      [-0.00023, 0],
      [-0.00017, 3],
      [0.00179, 1],
      [0.00233, 1]
    ]
  },
  "QS_mulTransfSite[Other]": {
    "red_x_points": [
      [-0.00085, 3],
      [-0.00093, 0],
      [-0.00086, 0],
      [-0.00098, 0],
      [-0.00079, 0],
      [-0.00094, 0],
      [-0.0008, 0],
      [-0.00091, 3],
      [-0.00077, 0],
      [-0.00078, 0],
      [-0.00081, 0],
      [-0.00098, 3],
      [0.00263, 1],
      [-0.00058, 3],
      [-0.0008, 0],
      [-0.00073, 3],
      [-0.00068, 0],
      [-0.00434, 2],
      [-0.00076, 3],
      [-0.00084, 3],
      [-0.00094, 3],
      [-0.00084, 0],
      [-0.00079, 3],
      [-0.00103, 3],
      [-0.00071, 3],
      [-0.00086, 0],
      [-0.00085, 3],
      [-0.00096, 0],
      [-0.00076, 3],
      [0.0025, 1],
      [-0.00066, 0]
    ],
    "red_o_points": [],
    "y_categories": ["N", "NOT APPLICABLE", "Y", "nan"],
    "blue_o_points": [],
    "blue_x_points": [
      [0.00392, 1],
      [-0.00034, 3],
      [0.0042, 1],
      [0.00016, 0],
      [-0.0001, 3],
      [0.00353, 1],
      [0.00422, 1]
    ]
  },
  "QA_yonInjBpsurg": {
    "red_x_points": [
      [-0.00358, 1],
      [-0.00263, 1],
      [-0.00435, 1],
      [-0.00338, 1],
      [-0.0031, 1],
      [-0.00374, 1],
      [-0.00313, 1],
      [-0.00328, 1],
      [-0.00358, 1],
      [-0.00351, 1],
      [-0.00348, 1],
      [-0.00385, 1],
      [0.00611, 0],
      [-0.00306, 1],
      [-0.00317, 1],
      [-0.00354, 1],
      [-0.00324, 1],
      [-0.00355, 1],
      [-0.00341, 1],
      [-0.00317, 1],
      [-0.00296, 1],
      [-0.00273, 1],
      [-0.00337, 1],
      [-0.00368, 1],
      [-0.00368, 1],
      [-0.00329, 1],
      [-0.00297, 1],
      [-0.00377, 1],
      [-0.00272, 1],
      [0.00881, 0],
      [-0.00307, 1]
    ],
    "red_o_points": [],
    "y_categories": ["N", "Y", "nan"],
    "blue_o_points": [],
    "blue_x_points": [
      [0.01945, 0],
      [0.0001, 1],
      [0.01202, 0],
      [-0.00265, 1],
      [-0.00087, 1],
      [0.01213, 0],
      [0.01138, 0]
    ]
  },
  "QA_equInjTbpiAge": {
    "red_x_points": [
      [-0.00077, 1],
      [-0.00026, 1],
      [7e-5, 1],
      [-0.00013, 0],
      [-0.00131, 0],
      [3e-5, 1],
      [0.0, 1],
      [0.00072, 0],
      [-0.00094, 0],
      [-6e-5, 0],
      [-1e-5, 1],
      [0.00068, 0],
      [-0.01609, 1],
      [-0.00114, 1],
      [-0.00025, 1],
      [-0.0009, 1],
      [-0.00037, 0],
      [-0.00165, 0],
      [-0.00122, 1],
      [0.0002, 0],
      [-0.00081, 1],
      [-0.0001, 1],
      [-0.00138, 1],
      [-0.0027, 1],
      [0.00085, 0],
      [5e-5, 1],
      [-0.00162, 1],
      [-7e-5, 1],
      [-0.00102, 1],
      [-0.0157, 1],
      [0.0, 0]
    ],
    "red_o_points": [],
    "y_categories": ["GREATER THAN OR EQUALS TO 30", "LESS THAN 30", "nan"],
    "blue_o_points": [],
    "blue_x_points": [
      [-0.00457, 1],
      [-0.00142, 1],
      [0.00804, 0],
      [0.00139, 1],
      [0.00681, 0],
      [0.00849, 0],
      [0.00899, 0]
    ]
  },
  "QS_mulLysisNerve[Ssr]": {
    "red_x_points": [
      [-0.00012, 3],
      [-0.00026, 0],
      [-0.0009, 2],
      [-0.0003, 0],
      [-0.00037, 0],
      [-0.00036, 0],
      [-0.00031, 0],
      [-0.00011, 3],
      [-0.00032, 0],
      [-0.00033, 0],
      [-0.0003, 0],
      [-0.00014, 3],
      [0.00086, 1],
      [-0.00014, 3],
      [-0.00038, 0],
      [-8e-5, 3],
      [-0.00032, 0],
      [-0.00029, 0],
      [-9e-5, 3],
      [-0.00014, 3],
      [-0.00014, 3],
      [-0.00018, 0],
      [-0.00012, 3],
      [-0.0001, 3],
      [-0.00016, 3],
      [-0.00035, 0],
      [-0.00016, 3],
      [-0.00028, 0],
      [-0.00019, 3],
      [0.00053, 1],
      [-0.00029, 0]
    ],
    "red_o_points": [],
    "y_categories": ["N", "NOT APPLICABLE", "Y", "nan"],
    "blue_o_points": [],
    "blue_x_points": [
      [0.00083, 1],
      [-8e-5, 3],
      [0.00131, 1],
      [-0.00035, 0],
      [-6e-5, 3],
      [0.00076, 1],
      [0.00132, 1]
    ]
  },
  "QS_mulBpsurgeryType[Graft]": {
    "red_x_points": [
      [-0.00026, 3],
      [-0.00031, 0],
      [-0.0002, 0],
      [-0.00032, 0],
      [-0.00027, 0],
      [-0.00027, 0],
      [-0.00033, 0],
      [-0.00023, 3],
      [-0.00015, 0],
      [-0.00026, 0],
      [-0.00033, 0],
      [-0.00024, 3],
      [0.00047, 1],
      [-0.00031, 3],
      [-0.00156, 2],
      [-0.00037, 3],
      [-0.00016, 0],
      [-0.00034, 0],
      [-0.00019, 3],
      [-0.00022, 3],
      [-0.00017, 3],
      [-0.00024, 0],
      [-0.00027, 3],
      [-0.00024, 3],
      [-0.0002, 3],
      [-0.00029, 0],
      [-0.00016, 3],
      [-0.00029, 0],
      [-0.00028, 3],
      [0.00146, 1],
      [-0.00027, 0]
    ],
    "red_o_points": [],
    "y_categories": ["N", "NOT APPLICABLE", "Y", "nan"],
    "blue_o_points": [],
    "blue_x_points": [
      [0.00105, 1],
      [-0.00013, 3],
      [0.00111, 1],
      [0.00029, 0],
      [-0.00022, 3],
      [0.00128, 1],
      [0.00086, 1]
    ]
  },
  "QS_mulLysisRoot[C5]": {
    "red_x_points": [
      [-0.00088, 3],
      [-0.00155, 0],
      [-0.00317, 2],
      [-0.00145, 0],
      [-0.0016, 0],
      [-0.0017, 0],
      [-0.00164, 0],
      [-0.00084, 3],
      [-0.00145, 0],
      [-0.00155, 0],
      [-0.0015, 0],
      [-0.00091, 3],
      [0.00373, 1],
      [-0.00083, 3],
      [-0.00167, 0],
      [-0.00097, 3],
      [-0.00144, 0],
      [-0.00124, 0],
      [-0.00086, 3],
      [-0.00079, 3],
      [-0.001, 3],
      [-0.00144, 0],
      [-0.0008, 3],
      [-0.00085, 3],
      [-0.00083, 3],
      [-0.00163, 0],
      [-0.00094, 3],
      [-0.00143, 0],
      [-0.0007, 3],
      [0.00424, 1],
      [-0.00272, 2]
    ],
    "red_o_points": [],
    "y_categories": ["N", "NOT APPLICABLE", "Y", "nan"],
    "blue_o_points": [],
    "blue_x_points": [
      [0.00657, 1],
      [-0.00028, 3],
      [0.00481, 1],
      [-0.00139, 0],
      [-0.00012, 3],
      [0.00484, 1],
      [0.005, 1]
    ]
  },
  "QS_mulLysisSite[Root]": {
    "red_x_points": [
      [-0.00057, 3],
      [-0.0008, 0],
      [-0.00212, 2],
      [-0.00099, 0],
      [-0.00074, 0],
      [-0.00095, 0],
      [-0.001, 0],
      [-0.00079, 3],
      [-0.00112, 0],
      [-0.00088, 0],
      [-0.00085, 0],
      [-0.00073, 3],
      [0.00289, 1],
      [-0.0008, 3],
      [-0.00093, 0],
      [-0.00051, 3],
      [-0.00086, 0],
      [-0.00096, 0],
      [-0.00074, 3],
      [-0.00079, 3],
      [-0.00063, 3],
      [-0.00104, 0],
      [-0.00068, 3],
      [-0.00051, 3],
      [-0.0007, 3],
      [-0.00091, 0],
      [-0.0007, 3],
      [-0.001, 0],
      [-0.00075, 3],
      [0.00301, 1],
      [-0.00198, 2]
    ],
    "red_o_points": [],
    "y_categories": ["N", "NOT APPLICABLE", "Y", "nan"],
    "blue_o_points": [],
    "blue_x_points": [
      [0.00396, 1],
      [-0.0004, 3],
      [0.00351, 1],
      [-0.00104, 0],
      [-0.00028, 3],
      [0.0032, 1],
      [0.00397, 1]
    ]
  },
  "QS_mulBpsurgeryType[Lysis]": {
    "red_x_points": [
      [-0.00253, 3],
      [-0.00441, 0],
      [-0.00771, 2],
      [-0.00432, 0],
      [-0.00441, 0],
      [-0.00885, 2],
      [-0.00427, 0],
      [-0.0026, 3],
      [-0.00402, 0],
      [-0.00442, 0],
      [-0.00433, 0],
      [-0.00243, 3],
      [0.01069, 1],
      [-0.00253, 3],
      [-0.00455, 0],
      [-0.00273, 3],
      [-0.0084, 2],
      [-0.00452, 0],
      [-0.00273, 3],
      [-0.00267, 3],
      [-0.00242, 3],
      [-0.00436, 0],
      [-0.00217, 3],
      [-0.00271, 3],
      [-0.00269, 3],
      [-0.00416, 0],
      [-0.00255, 3],
      [-0.00441, 0],
      [-0.00222, 3],
      [0.01403, 1],
      [-0.00727, 2]
    ],
    "red_o_points": [],
    "y_categories": ["N", "NOT APPLICABLE", "Y", "nan"],
    "blue_o_points": [],
    "blue_x_points": [
      [0.01969, 1],
      [-0.00075, 3],
      [0.01366, 1],
      [-0.00098, 0],
      [-0.00061, 3],
      [0.01453, 1],
      [0.01513, 1]
    ]
  },
  "QS_mulGraftNerve[LT]": {
    "red_x_points": [
      [0.0, 2],
      [-6e-5, 0],
      [-6e-5, 0],
      [-1e-5, 0],
      [-5e-5, 0],
      [-5e-5, 0],
      [-6e-5, 0],
      [1e-5, 2],
      [-5e-5, 0],
      [-6e-5, 0],
      [-5e-5, 0],
      [1e-5, 2],
      [0.0001, 1],
      [-1e-5, 2],
      [-6e-5, 0],
      [-1e-5, 2],
      [-5e-5, 0],
      [-1e-5, 0],
      [-1e-5, 2],
      [0.0, 2],
      [-5e-5, 0],
      [0.0, 2],
      [1e-5, 2],
      [0.0, 2],
      [-5e-5, 0],
      [1e-5, 2],
      [-6e-5, 0],
      [1e-5, 2],
      [-1e-5, 0]
    ],
    "red_o_points": [],
    "y_categories": ["N", "NOT APPLICABLE", "nan"],
    "blue_o_points": [],
    "blue_x_points": [
      [0.00019, 1],
      [1e-5, 2],
      [0.0001, 1],
      [1e-5, 2],
      [0.0001, 1]
    ]
  },
  "QA_lstPexMuscstrength[ShoulderAbduc]": {
    "red_x_points": [
      [-0.00647, 1],
      [-0.00671, 1],
      [-0.00624, 1],
      [-0.00675, 1],
      [-0.00683, 1],
      [-0.00674, 1],
      [-0.00709, 1],
      [-0.00642, 1],
      [-0.0066, 1],
      [-0.00648, 1],
      [-0.00674, 1],
      [-0.00679, 1],
      [0.00477, 2],
      [0.00564, 2],
      [0.00613, 2],
      [0.00557, 2],
      [0.00553, 2],
      [-0.00698, 1],
      [-0.00673, 1],
      [-0.0072, 1],
      [-0.00683, 1],
      [-0.00727, 1],
      [0.00567, 2],
      [-0.00871, 1],
      [-0.0071, 1],
      [-0.00646, 1],
      [-0.00715, 1],
      [-0.00627, 1],
      [-0.00663, 1],
      [0.00342, 2],
      [-0.00654, 1]
    ],
    "red_o_points": [],
    "y_categories": ["GREATER THAN OR EQUALS TO 3", "LESS THAN 3", "nan"],
    "blue_o_points": [],
    "blue_x_points": [
      [0.00476, 2],
      [0.00639, 2],
      [0.02859, 0],
      [0.00783, 2],
      [0.00627, 2],
      [0.02572, 0],
      [-0.00107, 1]
    ]
  },
  "QS_mulNeuromadSite[C4]": {
    "red_x_points": [
      [-0.00048, 2],
      [-0.00183, 0],
      [-0.0019, 0],
      [-0.00173, 0],
      [-0.00191, 0],
      [-0.00185, 0],
      [-0.00215, 0],
      [-0.00038, 2],
      [-0.00155, 0],
      [-0.00159, 0],
      [-0.00165, 0],
      [-0.00044, 2],
      [0.00301, 1],
      [-0.00048, 2],
      [-0.00206, 0],
      [-0.00056, 2],
      [-0.00172, 0],
      [-0.00171, 0],
      [-0.00067, 2],
      [-0.00059, 2],
      [-0.00068, 2],
      [-0.00171, 0],
      [-0.00061, 2],
      [-0.00059, 2],
      [-0.00049, 2],
      [-0.00192, 0],
      [-0.00056, 2],
      [-0.00193, 0],
      [-0.00046, 2],
      [0.00405, 1],
      [-0.00172, 0]
    ],
    "red_o_points": [],
    "y_categories": ["N", "NOT APPLICABLE", "nan"],
    "blue_o_points": [],
    "blue_x_points": [
      [0.00618, 1],
      [2e-5, 2],
      [0.00434, 1],
      [-0.0, 0],
      [-0.00026, 2],
      [0.00384, 1],
      [0.00419, 1]
    ]
  },
  "QS_lstBpsurgSide": {
    "red_x_points": [
      [-0.00386, 3],
      [-0.00489, 0],
      [-0.00543, 0],
      [-0.00565, 0],
      [-0.01292, 2],
      [-0.00486, 0],
      [-0.00539, 0],
      [-0.00422, 3],
      [-0.0052, 0],
      [-0.01196, 2],
      [-0.01296, 2],
      [-0.00453, 3],
      [0.02017, 1],
      [-0.00386, 3],
      [-0.01351, 2],
      [-0.00429, 3],
      [-0.01318, 2],
      [-0.01212, 2],
      [-0.00411, 3],
      [-0.0036, 3],
      [-0.00382, 3],
      [-0.00486, 0],
      [-0.00412, 3],
      [-0.00433, 3],
      [-0.00413, 3],
      [-0.0125, 2],
      [-0.00376, 3],
      [-0.01224, 2],
      [-0.00361, 3],
      [0.02101, 1],
      [-0.00534, 0]
    ],
    "red_o_points": [],
    "y_categories": ["L", "NOT APPLICABLE", "R", "nan"],
    "blue_o_points": [],
    "blue_x_points": [
      [0.02856, 1],
      [-0.00116, 3],
      [0.02136, 1],
      [0.00306, 0],
      [-0.00138, 3],
      [0.02255, 1],
      [0.02586, 1]
    ]
  },
  "QS_mulGraftNerve[IS]": {
    "red_x_points": [
      [-4e-5, 2],
      [-0.00017, 0],
      [-7e-5, 0],
      [-0.00015, 0],
      [-0.00012, 0],
      [-0.00012, 0],
      [-0.0001, 0],
      [-3e-5, 2],
      [-0.00011, 0],
      [-8e-5, 0],
      [-0.00011, 0],
      [-4e-5, 2],
      [4e-5, 1],
      [-3e-5, 2],
      [-0.00017, 0],
      [-6e-5, 2],
      [-0.00014, 0],
      [-0.00012, 0],
      [-2e-5, 2],
      [-0.0, 2],
      [1e-5, 2],
      [-5e-5, 0],
      [-2e-5, 2],
      [-1e-5, 2],
      [-2e-5, 2],
      [-0.00017, 0],
      [-2e-5, 2],
      [-0.00016, 0],
      [-1e-5, 2],
      [0.00029, 1],
      [-0.00017, 0]
    ],
    "red_o_points": [],
    "y_categories": ["N", "NOT APPLICABLE", "nan"],
    "blue_o_points": [],
    "blue_x_points": [
      [0.00058, 1],
      [4e-5, 2],
      [0.00029, 1],
      [5e-5, 0],
      [1e-5, 2],
      [0.00019, 1],
      [0.00019, 1]
    ]
  },
  "QS_mulGraftNerve[MC]": {
    "red_x_points": [
      [-1e-5, 2],
      [-0.00014, 0],
      [-0.00015, 0],
      [-0.00015, 0],
      [-0.00015, 0],
      [-0.0001, 0],
      [-9e-5, 0],
      [-1e-5, 2],
      [-0.0001, 0],
      [-0.00014, 0],
      [-0.00011, 0],
      [-4e-5, 2],
      [0.00026, 1],
      [-8e-5, 0],
      [-4e-5, 2],
      [-0.00013, 0],
      [-0.00012, 0],
      [-3e-5, 2],
      [-3e-5, 2],
      [-1e-5, 2],
      [-0.00013, 0],
      [2e-5, 2],
      [0.0, 2],
      [0.0, 2],
      [-4e-5, 0],
      [-1e-5, 2],
      [-0.00015, 0],
      [-1e-5, 2],
      [0.00026, 1],
      [-9e-5, 0]
    ],
    "red_o_points": [],
    "y_categories": ["N", "NOT APPLICABLE", "nan"],
    "blue_o_points": [],
    "blue_x_points": [
      [0.00047, 1],
      [0.0, 2],
      [0.00026, 1],
      [-4e-5, 0],
      [-1e-5, 2],
      [0.00018, 1],
      [9e-5, 1]
    ]
  },
  "QA_yonPreOrtsurg": {
    "red_x_points": [
      [-0.0049, 0],
      [-1e-5, 2],
      [4e-5, 0],
      [-9e-5, 0],
      [-0.00012, 0],
      [4e-5, 0],
      [-7e-5, 0],
      [-0.00073, 2],
      [-0.00016, 0],
      [-4e-5, 0],
      [-0.00024, 2],
      [0.00656, 1],
      [-0.00139, 0],
      [-0.00085, 2],
      [-0.0003, 0],
      [-0.00494, 0],
      [-0.00013, 1],
      [-0.00021, 0],
      [-0.0042, 0],
      [-0.00414, 0],
      [-0.00427, 0],
      [-0.00015, 0],
      [-0.00463, 0],
      [-0.00568, 0],
      [-0.00461, 0],
      [-0.00018, 2],
      [-0.00027, 2],
      [-0.00014, 0],
      [-0.00051, 2],
      [-0.00053, 2],
      [-0.00016, 1]
    ],
    "red_o_points": [],
    "y_categories": ["N", "Y", "nan"],
    "blue_o_points": [],
    "blue_x_points": [
      [-6e-5, 0],
      [0.00252, 2],
      [-0.00011, 0],
      [-0.00022, 0],
      [0.01956, 1],
      [-7e-5, 0],
      [-0.00016, 0]
    ]
  },
  "QS_mulGraftNerve[Ra]": {
    "red_x_points": [
      [-6e-5, 2],
      [-0.00029, 0],
      [-0.00029, 0],
      [-0.00023, 0],
      [-0.00029, 0],
      [-0.00025, 0],
      [-0.00032, 0],
      [-0.00018, 2],
      [-0.00026, 0],
      [-0.00026, 0],
      [-0.00029, 0],
      [-0.00026, 2],
      [0.00053, 1],
      [-5e-5, 2],
      [-0.00021, 0],
      [-0.00018, 2],
      [-0.00026, 0],
      [-0.00031, 0],
      [-0.00014, 2],
      [-9e-5, 2],
      [-0.00014, 2],
      [-0.00021, 0],
      [-7e-5, 2],
      [-2e-5, 2],
      [-0.00019, 2],
      [-0.00025, 0],
      [-8e-5, 2],
      [-0.0003, 0],
      [-4e-5, 2],
      [0.00031, 1],
      [-0.0002, 0]
    ],
    "red_o_points": [],
    "y_categories": ["N", "NOT APPLICABLE", "nan"],
    "blue_o_points": [],
    "blue_x_points": [
      [0.00112, 1],
      [-5e-5, 2],
      [0.00064, 1],
      [0.00011, 0],
      [3e-5, 2],
      [0.00032, 1],
      [0.00102, 1]
    ]
  },
  "QS_mulTransfSite[Oberlin]": {
    "red_x_points": [
      [-0.00386, 3],
      [-0.01099, 0],
      [-0.01154, 0],
      [-0.01072, 0],
      [-0.00544, 2],
      [-0.00441, 2],
      [-0.01184, 0],
      [-0.00344, 3],
      [-0.0051, 2],
      [-0.005, 2],
      [-0.00495, 2],
      [-0.00351, 3],
      [0.01766, 1],
      [-0.00363, 3],
      [-0.00467, 2],
      [-0.00403, 3],
      [-0.01046, 0],
      [-0.00487, 2],
      [-0.00373, 3],
      [-0.00356, 3],
      [-0.0033, 3],
      [-0.01033, 0],
      [-0.0035, 3],
      [-0.00396, 3],
      [-0.00367, 3],
      [-0.00522, 2],
      [-0.00368, 3],
      [-0.01093, 0],
      [-0.0033, 3],
      [0.02096, 1],
      [-0.01017, 0]
    ],
    "red_o_points": [],
    "y_categories": ["N", "NOT APPLICABLE", "Y", "nan"],
    "blue_o_points": [],
    "blue_x_points": [
      [0.02678, 1],
      [-0.00144, 3],
      [0.02041, 1],
      [0.00041, 2],
      [-0.00147, 3],
      [0.0207, 1],
      [0.02119, 1]
    ]
  },
  "QA_lstPexKine[Index]": {
    "red_x_points": [
      [-0.00073, 0],
      [-0.00061, 2],
      [-0.00063, 2],
      [-0.00052, 2],
      [5e-5, 1],
      [0.00048, 1],
      [-0.00151, 0],
      [-0.00014, 2],
      [0.00042, 1],
      [0.00011, 1],
      [0.00021, 1],
      [-0.00012, 1],
      [-1e-5, 2],
      [0.00011, 2],
      [4e-5, 1],
      [-0.0001, 2],
      [-7e-5, 2],
      [0.00029, 1],
      [-0.00017, 1],
      [-0.00045, 0],
      [1e-5, 1],
      [-0.00078, 2],
      [6e-5, 2],
      [1e-5, 1],
      [2e-5, 2],
      [-0.00034, 2],
      [-0.00012, 1],
      [-0.00011, 2],
      [8e-5, 1],
      [-0.0002, 2],
      [-0.00045, 0]
    ],
    "red_o_points": [],
    "y_categories": ["NPV", "PV", "nan"],
    "blue_o_points": [],
    "blue_x_points": [
      [0.00019, 1],
      [0.00032, 2],
      [5e-5, 1],
      [0.00178, 1],
      [4e-5, 2],
      [0.00028, 1]
    ]
  }
}
