{
  "QA_lstPexMuscstrength[ElbowFlex]": {
    "red_x_points": [
      [-0.00795, 1],
      [-0.00014, 2],
      [-0.00839, 1],
      [-0.00739, 1],
      [-0.00814, 1],
      [-0.00816, 1],
      [-0.00808, 1],
      [-0.008, 1],
      [-0.00826, 1],
      [-0.00825, 1],
      [-0.00825, 1],
      [-0.00831, 1],
      [2e-5, 2],
      [-0.00064, 2],
      [0.00054, 2],
      [-0.00859, 1],
      [-0.00841, 1],
      [-0.00794, 1],
      [-0.00783, 1],
      [-0.00833, 1],
      [6e-5, 2],
      [-0.0083, 1],
      [-0.00833, 1],
      [-0.00832, 1],
      [-0.0076, 1],
      [0.00047, 2],
      [-0.00824, 1],
      [-0.0081, 1],
      [-1e-5, 2]
    ],
    "red_o_points": [],
    "y_categories": ["GREATER THAN OR EQUALS TO 3", "LESS THAN 3", "nan"],
    "blue_o_points": [],
    "blue_x_points": [
      [0.00121, 2],
      [-0.00785, 1],
      [0.03954, 0],
      [-0.00803, 1],
      [0.00192, 2],
      [0.00175, 2],
      [0.03238, 0],
      [-0.0072, 1],
      [-0.00755, 1],
      [0.00152, 2],
      [0.03869, 0],
      [0.03293, 0],
      [0.03458, 0],
      [0.03269, 0],
      [-0.00769, 1]
    ]
  },
  "QS_mulGraftNerve[other]": {
    "red_x_points": [
      [-0.00012, 2],
      [-0.00103, 0],
      [-0.00054, 0],
      [-0.00065, 0],
      [-0.00046, 0],
      [-0.00045, 0],
      [-0.00059, 0],
      [-0.0001, 2],
      [-0.00062, 0],
      [-0.00047, 0],
      [-0.0001, 2],
      [-0.00059, 0],
      [-0.00015, 2],
      [-0.0011, 0],
      [-0.00087, 0],
      [-0.00011, 2],
      [-0.00013, 2],
      [-0.0001, 2],
      [-0.00038, 0],
      [-9e-5, 2],
      [-0.00012, 2],
      [-8e-5, 2],
      [-0.00057, 0],
      [-0.00049, 0],
      [-9e-5, 2],
      [0.00187, 1],
      [-0.00014, 2],
      [-0.0004, 0],
      [-9e-5, 2]
    ],
    "red_o_points": [],
    "y_categories": ["N", "NOT APPLICABLE", "nan"],
    "blue_o_points": [],
    "blue_x_points": [
      [0.0029, 1],
      [-7e-5, 2],
      [-0.00039, 0],
      [-0.00046, 0],
      [0.0, 2],
      [0.00213, 1],
      [0.00145, 1],
      [-0.00036, 0],
      [1e-5, 2],
      [-0.0, 2],
      [-0.00025, 0],
      [0.00218, 1],
      [-6e-5, 2],
      [0.00175, 1],
      [-7e-5, 2]
    ]
  },
  "QS_mulGraftRoot[C6]": {
    "red_x_points": [
      [-0.0, 2],
      [-3e-5, 0],
      [-3e-5, 0],
      [-3e-5, 0],
      [-3e-5, 0],
      [-0.0, 2],
      [-3e-5, 0],
      [-3e-5, 0],
      [-0.0, 2],
      [-3e-5, 0],
      [-0.0, 2],
      [-3e-5, 0],
      [-3e-5, 0],
      [-0.0, 2],
      [-0.0, 2],
      [-3e-5, 0],
      [-0.0, 2],
      [-0.0, 2],
      [-3e-5, 0],
      [-3e-5, 0],
      [-0.0, 2],
      [-3e-5, 0],
      [-0.0, 2]
    ],
    "red_o_points": [],
    "y_categories": ["N", "NOT APPLICABLE", "nan"],
    "blue_o_points": [],
    "blue_x_points": [
      [0.00013, 1],
      [-0.0, 2],
      [-3e-5, 0],
      [-3e-5, 0],
      [-0.0, 2],
      [0.00013, 1],
      [0.00013, 1],
      [-0.0, 2],
      [-0.0, 2],
      [-3e-5, 0],
      [0.00013, 1],
      [-0.0, 2]
    ]
  },
  "QA_intPexShoulderFlex": {
    "red_x_points": [
      [3e-5, 1],
      [-4e-5, 2],
      [-0.00024, 2],
      [-7e-5, 2],
      [-0.00439, 0],
      [-3e-5, 2],
      [1e-5, 1],
      [-0.00029, 2],
      [-0.00066, 2],
      [-0.0, 1],
      [0.00028, 1],
      [-0.00023, 2],
      [-5e-5, 2],
      [0.00018, 1],
      [2e-5, 1],
      [7e-5, 1],
      [-0.0001, 2],
      [-0.0003, 2],
      [-0.00012, 2],
      [-1e-5, 1],
      [0.0001, 1],
      [3e-5, 1]
    ],
    "red_o_points": [],
    "y_categories": ["GREATER THAN OR EQUALS TO 180", "LESS THAN 180", "nan"],
    "blue_o_points": [],
    "blue_x_points": [
      [7e-5, 1],
      [0.0035, 1],
      [-9e-5, 2],
      [-7e-5, 2],
      [0.00206, 1],
      [7e-5, 2],
      [-0.0, 1],
      [0.00025, 1]
    ]
  },
  "QS_mulBpsurgeryType[Transf]": {
    "red_x_points": [
      [-0.00018, 3],
      [-0.00139, 2],
      [-0.0049, 0],
      [-0.00093, 2],
      [-0.00127, 2],
      [-0.00088, 2],
      [-0.00121, 2],
      [-0.0002, 3],
      [-0.00111, 2],
      [-0.00086, 2],
      [-0.00018, 3],
      [-0.001, 2],
      [-0.0002, 3],
      [-0.00116, 2],
      [-0.00117, 2],
      [-0.00022, 3],
      [-0.0002, 3],
      [-0.00019, 3],
      [-0.00092, 2],
      [-0.00022, 3],
      [-0.00025, 3],
      [-0.0002, 3],
      [-0.00119, 2],
      [-0.00124, 2],
      [-0.00017, 3],
      [0.00372, 1],
      [-0.00021, 3],
      [-0.00105, 2],
      [-0.0002, 3]
    ],
    "red_o_points": [],
    "y_categories": ["N", "NOT APPLICABLE", "Y", "nan"],
    "blue_o_points": [],
    "blue_x_points": [
      [0.0064, 1],
      [-7e-5, 3],
      [-0.00063, 2],
      [-0.00075, 2],
      [0.0, 3],
      [0.00433, 1],
      [0.00329, 1],
      [-0.00105, 2],
      [-0.00021, 3],
      [2e-5, 3],
      [-0.00034, 2],
      [0.00425, 1],
      [-0.00016, 3],
      [0.00425, 1],
      [-0.00015, 3]
    ]
  },
  "QS_mulGraftNerve[DS]": {
    "red_x_points": [
      [-3e-5, 0],
      [-3e-5, 0],
      [-3e-5, 0],
      [-3e-5, 0],
      [-3e-5, 0],
      [4e-5, 2],
      [-6e-5, 0],
      [-3e-5, 0],
      [-1e-5, 2],
      [-8e-5, 0],
      [-1e-5, 2],
      [-3e-5, 0],
      [-3e-5, 0],
      [-1e-5, 2],
      [-1e-5, 2],
      [-1e-5, 2],
      [-3e-5, 0],
      [-1e-5, 2],
      [-1e-5, 2],
      [-6e-5, 0],
      [-8e-5, 0],
      [-1e-5, 2],
      [9e-5, 1],
      [-1e-5, 2],
      [-1e-5, 2]
    ],
    "red_o_points": [],
    "y_categories": ["N", "NOT APPLICABLE", "nan"],
    "blue_o_points": [],
    "blue_x_points": [
      [0.00014, 1],
      [-1e-5, 2],
      [-3e-5, 0],
      [-1e-5, 2],
      [9e-5, 1],
      [9e-5, 1],
      [-3e-5, 0],
      [4e-5, 2],
      [-3e-5, 0],
      [9e-5, 1],
      [-1e-5, 2],
      [9e-5, 1],
      [-1e-5, 2]
    ]
  },
  "QA_mulInjOrthesisType[ShoulderSupport]": {
    "red_x_points": [
      [-0.00545, 0],
      [-0.00516, 0],
      [-0.00493, 0],
      [-0.02125, 2],
      [-0.00538, 0],
      [-0.00473, 0],
      [-0.00514, 0],
      [-0.02147, 2],
      [-0.00519, 0],
      [-0.00526, 0],
      [-0.00501, 0],
      [-0.00519, 0],
      [-0.00533, 0],
      [-0.00497, 0],
      [-0.0197, 2],
      [-0.00515, 0],
      [-0.00519, 0],
      [-0.02074, 2],
      [-0.02053, 3],
      [-0.00522, 0],
      [-0.0051, 0],
      [-0.00495, 0],
      [-0.00509, 0],
      [-0.00535, 0],
      [-0.02078, 3],
      [-0.02072, 3],
      [-0.0194, 3],
      [-0.00512, 0],
      [-0.00539, 0]
    ],
    "red_o_points": [],
    "y_categories": ["N", "NOT APPLICABLE", "Y", "nan"],
    "blue_o_points": [],
    "blue_x_points": [
      [-0.00547, 0],
      [-0.00501, 0],
      [-0.00514, 0],
      [-0.00482, 0],
      [0.03789, 1],
      [0.03942, 1],
      [0.03692, 1],
      [0.03876, 1],
      [-0.00472, 0],
      [0.0377, 1],
      [-0.0051, 0],
      [0.0381, 1],
      [0.03934, 1],
      [0.03981, 1],
      [-0.00481, 0]
    ]
  },
  "QS_mulLysisTrunk[Upper]": {
    "red_x_points": [
      [-0.00089, 3],
      [-0.00449, 0],
      [-0.00325, 0],
      [-0.00294, 0],
      [-0.00335, 0],
      [-0.01405, 2],
      [-0.00304, 0],
      [-0.0011, 3],
      [-0.00333, 0],
      [-0.0031, 0],
      [-0.00106, 3],
      [-0.00365, 0],
      [-0.00089, 3],
      [-0.00408, 0],
      [-0.01287, 2],
      [-0.00115, 3],
      [-0.00091, 3],
      [-0.00115, 3],
      [-0.00312, 0],
      [-0.0008, 3],
      [-0.00082, 3],
      [-0.00105, 3],
      [-0.00367, 0],
      [-0.00346, 0],
      [-0.00104, 3],
      [0.01415, 1],
      [-0.00112, 3],
      [-0.012, 2],
      [-0.00082, 3]
    ],
    "red_o_points": [],
    "y_categories": ["N", "NOT APPLICABLE", "Y", "nan"],
    "blue_o_points": [],
    "blue_x_points": [
      [0.02387, 1],
      [-0.00074, 3],
      [-0.0023, 0],
      [-0.0023, 0],
      [-0.00053, 3],
      [0.01847, 1],
      [0.01547, 1],
      [-0.0024, 0],
      [-0.00049, 3],
      [-0.00059, 3],
      [-0.00218, 0],
      [0.01724, 1],
      [-0.00059, 3],
      [0.01682, 1],
      [-0.0007, 3]
    ]
  },
  "QS_mulGraftNerve[Ac]": {
    "red_x_points": [
      [-2e-5, 2],
      [-0.00056, 0],
      [-0.00036, 0],
      [-0.00021, 0],
      [-0.00039, 0],
      [-0.00016, 0],
      [-0.00043, 0],
      [-2e-5, 2],
      [-0.00036, 0],
      [-0.00023, 0],
      [-2e-5, 2],
      [-0.00045, 0],
      [4e-5, 2],
      [-0.00048, 0],
      [-0.0004, 0],
      [-0.00016, 2],
      [-1e-5, 2],
      [-4e-5, 2],
      [-0.00018, 0],
      [-5e-5, 2],
      [5e-5, 2],
      [-3e-5, 2],
      [-0.00022, 0],
      [-0.00036, 0],
      [-3e-5, 2],
      [0.00035, 1],
      [-4e-5, 2],
      [-0.00024, 0],
      [-0.00013, 2]
    ],
    "red_o_points": [],
    "y_categories": ["N", "NOT APPLICABLE", "nan"],
    "blue_o_points": [],
    "blue_x_points": [
      [0.002, 1],
      [-0.0, 2],
      [-0.00011, 0],
      [1e-5, 0],
      [5e-5, 2],
      [0.00109, 1],
      [0.00084, 1],
      [-0.00014, 0],
      [0.0, 2],
      [2e-5, 2],
      [-0.00011, 0],
      [0.00066, 1],
      [0.0, 2],
      [0.00089, 1],
      [-3e-5, 2]
    ]
  },
  "QS_mulNeuromadSite[C8]": {
    "red_x_points": [
      [-0.00018, 2],
      [-0.00165, 0],
      [-0.00097, 0],
      [-0.00059, 0],
      [-0.00089, 0],
      [-0.00065, 0],
      [-0.0008, 0],
      [-9e-5, 2],
      [-0.00087, 0],
      [-0.00062, 0],
      [-0.00019, 2],
      [-0.00089, 0],
      [-0.00018, 2],
      [-0.00122, 0],
      [-0.00139, 0],
      [-0.00023, 2],
      [-0.00015, 2],
      [-0.00018, 2],
      [-0.00087, 0],
      [-0.00019, 2],
      [-0.00022, 2],
      [-6e-5, 2],
      [-0.00097, 0],
      [-0.00089, 0],
      [-0.0002, 2],
      [0.00239, 1],
      [-0.00013, 2],
      [-0.00064, 0],
      [-0.00013, 2]
    ],
    "red_o_points": [],
    "y_categories": ["N", "NOT APPLICABLE", "nan"],
    "blue_o_points": [],
    "blue_x_points": [
      [0.00407, 1],
      [-9e-5, 2],
      [-0.0004, 0],
      [-0.0005, 0],
      [-1e-5, 2],
      [0.00378, 1],
      [0.00233, 1],
      [-0.00062, 0],
      [-5e-5, 2],
      [-1e-5, 2],
      [-0.0005, 0],
      [0.00316, 1],
      [-0.00012, 2],
      [0.00277, 1],
      [-0.00017, 2]
    ]
  },
  "QS_mulGraftNerve[Ph]": {
    "red_x_points": [
      [-2e-5, 2],
      [-0.00036, 0],
      [-0.00042, 0],
      [-0.00033, 0],
      [-0.0003, 0],
      [-0.00034, 0],
      [-0.00026, 0],
      [-6e-5, 2],
      [-0.00044, 0],
      [-0.00033, 0],
      [-3e-5, 2],
      [-0.0004, 0],
      [-9e-5, 2],
      [-0.00037, 0],
      [-0.00033, 0],
      [-9e-5, 2],
      [-5e-5, 2],
      [-2e-5, 2],
      [-0.00032, 0],
      [-0.0001, 2],
      [-0.0001, 2],
      [-0.00013, 2],
      [-0.00027, 0],
      [-0.00036, 0],
      [-0.00013, 2],
      [0.00073, 1],
      [-6e-5, 2],
      [-0.0003, 0],
      [-0.00011, 2]
    ],
    "red_o_points": [],
    "y_categories": ["N", "NOT APPLICABLE", "nan"],
    "blue_o_points": [],
    "blue_x_points": [
      [0.0016, 1],
      [-4e-5, 2],
      [-0.00012, 0],
      [-0.00014, 0],
      [0.0, 2],
      [0.0013, 1],
      [0.001, 1],
      [-0.00032, 0],
      [-0.0001, 2],
      [-5e-5, 2],
      [-5e-5, 0],
      [0.00119, 1],
      [-0.0, 2],
      [0.00119, 1],
      [-8e-5, 2]
    ]
  },
  "QS_mulTransfSite[AcSsPA]": {
    "red_x_points": [
      [-0.00027, 3],
      [-0.00197, 0],
      [-0.00129, 0],
      [-0.00149, 0],
      [-0.00155, 0],
      [-0.0016, 0],
      [-0.00164, 0],
      [-0.00053, 3],
      [-0.00151, 0],
      [-0.00146, 0],
      [-0.00025, 3],
      [-0.00167, 0],
      [-0.00055, 3],
      [-0.00182, 0],
      [-0.00421, 2],
      [-0.00027, 3],
      [-0.00024, 3],
      [-0.00027, 3],
      [-0.00153, 0],
      [-0.00031, 3],
      [-0.00045, 3],
      [-0.00042, 3],
      [-0.00152, 0],
      [-0.00165, 0],
      [-0.00049, 3],
      [0.00392, 1],
      [-0.00059, 3],
      [-0.00124, 0],
      [-0.00058, 3]
    ],
    "red_o_points": [],
    "y_categories": ["N", "NOT APPLICABLE", "Y", "nan"],
    "blue_o_points": [],
    "blue_x_points": [
      [0.00846, 1],
      [-0.00032, 3],
      [-0.00104, 0],
      [-0.00117, 0],
      [-0.00023, 3],
      [0.00764, 1],
      [0.00498, 1],
      [-0.00112, 0],
      [-0.0003, 3],
      [-0.00024, 3],
      [-0.00092, 0],
      [0.00596, 1],
      [-0.00015, 3],
      [0.00617, 1],
      [-0.00027, 3]
    ]
  },
  "QA_lstPexMuscstrength[ScapulaElev]": {
    "red_x_points": [
      [-0.0002, 0],
      [-0.00025, 2],
      [-0.00053, 2],
      [-0.00046, 2],
      [-0.00183, 1],
      [0.00032, 0],
      [-0.00039, 2],
      [-0.00379, 1],
      [0.00078, 0],
      [-0.00013, 2],
      [-0.00031, 0],
      [-0.00017, 2],
      [-0.00035, 2],
      [-0.00072, 2],
      [0.00014, 0],
      [-0.0003, 0],
      [-0.00031, 0],
      [-0.00046, 0],
      [-0.00023, 2],
      [0.00024, 2],
      [-0.00029, 2],
      [-0.00034, 2],
      [0.00036, 0],
      [0.00028, 0],
      [-0.00027, 2],
      [-0.00034, 2],
      [-0.00037, 2],
      [-0.00151, 1],
      [-0.00011, 2]
    ],
    "red_o_points": [],
    "y_categories": ["GREATER THAN OR EQUALS TO 3", "LESS THAN 3", "nan"],
    "blue_o_points": [],
    "blue_x_points": [
      [-0.00029, 2],
      [0.00027, 2],
      [0.00076, 0],
      [0.00255, 0],
      [0.00026, 2],
      [-0.00013, 2],
      [0.00424, 0],
      [0.00022, 2],
      [0.00103, 0],
      [0.00092, 0],
      [0.00034, 2],
      [0.00083, 0],
      [0.00055, 2]
    ]
  },
  "QS_mulGraftRoot[C5]": {
    "red_x_points": [
      [-1e-5, 0],
      [-1e-5, 0],
      [-1e-5, 0],
      [-1e-5, 0],
      [-1e-5, 0],
      [-0.0, 2],
      [-1e-5, 0],
      [-1e-5, 0],
      [-0.0, 2],
      [-1e-5, 0],
      [-0.0, 2],
      [-0.0, 2],
      [-0.0, 2],
      [-0.0, 2],
      [-0.0, 2],
      [-1e-5, 0],
      [-1e-5, 0],
      [-1e-5, 0],
      [-0.0, 2]
    ],
    "red_o_points": [],
    "y_categories": ["N", "NOT APPLICABLE", "nan"],
    "blue_o_points": [],
    "blue_x_points": [
      [0.00016, 1],
      [-0.0, 2],
      [-1e-5, 0],
      [-1e-5, 0],
      [-0.0, 2]
    ]
  },
  "QA_lstPexMuscstrength[ScapulaAbducSuprot]": {
    "red_x_points": [
      [0.00246, 0],
      [-0.0011, 2],
      [-0.0083, 1],
      [-0.0006, 2],
      [-0.01036, 1],
      [-0.00868, 1],
      [-0.00918, 1],
      [-0.00638, 1],
      [0.01102, 0],
      [-0.01006, 1],
      [-0.00639, 1],
      [-0.0016, 2],
      [-0.00057, 2],
      [-0.00201, 2],
      [-0.0008, 2],
      [0.00393, 0],
      [-0.00539, 1],
      [0.00238, 0],
      [-0.00772, 1],
      [-0.00093, 2],
      [-0.00079, 2],
      [-0.00055, 2],
      [-0.01093, 1],
      [0.0081, 0],
      [-0.00022, 2],
      [0.00017, 2],
      [0.00292, 0],
      [-0.00697, 1],
      [-0.00016, 2]
    ],
    "red_o_points": [],
    "y_categories": ["GREATER THAN OR EQUALS TO 3", "LESS THAN 3", "nan"],
    "blue_o_points": [],
    "blue_x_points": [
      [0.00016, 2],
      [0.00636, 0],
      [0.01407, 0],
      [0.01524, 0],
      [0.00042, 2],
      [0.00029, 2],
      [0.00344, 0],
      [0.00112, 2],
      [0.00142, 2],
      [0.00058, 2],
      [0.0138, 0],
      [0.004, 0],
      [0.0044, 0],
      [0.00031, 2],
      [0.00305, 1]
    ]
  },
  "participant_code": {
    "red_x_points": [
      [-0.02427, 1],
      [-0.0255, 2],
      [-0.02345, 3],
      [-0.02372, 4],
      [-0.02496, 5],
      [-0.02365, 8],
      [-0.02475, 9],
      [-0.02352, 10],
      [-0.02489, 11],
      [-0.02365, 13],
      [-0.02516, 14],
      [-0.02489, 18],
      [-0.02454, 19],
      [-0.02393, 20],
      [-0.02262, 23],
      [-0.0242, 26],
      [-0.02502, 28],
      [-0.0242, 29],
      [-0.02475, 30],
      [-0.02413, 31],
      [-0.02448, 32],
      [-0.02454, 34],
      [-0.02365, 36],
      [-0.02406, 38],
      [-0.0253, 39],
      [-0.02543, 40],
      [-0.02475, 41],
      [-0.02393, 42],
      [-0.02448, 43]
    ],
    "red_o_points": [],
    "y_categories": [
      "P16554",
      "P18297",
      "P19283",
      "P19287",
      "P23172",
      "P23391",
      "P30595",
      "P31645",
      "P31691",
      "P34778",
      "P35046",
      "P36328",
      "P43633",
      "P4544",
      "P46417",
      "P48965",
      "P53068",
      "P5497",
      "P58556",
      "P59529",
      "P62483",
      "P64658",
      "P65202",
      "P66816",
      "P6751",
      "P7408",
      "P75566",
      "P76226",
      "P79971",
      "P82621",
      "P82990",
      "P84549",
      "P84932",
      "P85825",
      "P86989",
      "P8770",
      "P87791",
      "P90550",
      "P93159",
      "P94969",
      "P96710",
      "P97130",
      "P9744",
      "P98500",
      "nan"
    ],
    "blue_o_points": [],
    "blue_x_points": [
      [0.04757, 0],
      [0.04888, 6],
      [0.04783, 7],
      [0.04625, 12],
      [0.0473, 15],
      [0.0452, 16],
      [0.04494, 17],
      [0.04691, 21],
      [0.04744, 22],
      [0.04665, 24],
      [0.04809, 25],
      [0.04822, 27],
      [0.04783, 33],
      [0.04573, 35],
      [0.04757, 37]
    ]
  },
  "QA_lstPexMuscstrength[ShoulderExrot]": {
    "red_x_points": [
      [-0.00014, 1],
      [-0.00046, 2],
      [-0.00181, 0],
      [-0.00027, 2],
      [0.00059, 1],
      [0.00022, 1],
      [-0.00047, 2],
      [-9e-5, 1],
      [0.00059, 1],
      [-0.00072, 2],
      [-0.00025, 1],
      [-0.00091, 2],
      [1e-5, 2],
      [-0.00082, 2],
      [-0.00039, 2],
      [-0.00025, 1],
      [-9e-5, 1],
      [-0.00022, 1],
      [-0.00038, 2],
      [1e-5, 2],
      [3e-5, 2],
      [1e-5, 2],
      [0.00085, 1],
      [-0.00634, 0],
      [5e-5, 2],
      [2e-5, 2],
      [-5e-5, 2],
      [3e-5, 1],
      [1e-5, 2]
    ],
    "red_o_points": [],
    "y_categories": ["GREATER THAN OR EQUALS TO 3", "LESS THAN 3", "nan"],
    "blue_o_points": [],
    "blue_x_points": [
      [1e-5, 2],
      [0.00014, 2],
      [0.00306, 1],
      [0.0039, 1],
      [2e-5, 2],
      [2e-5, 2],
      [0.00073, 0],
      [-0.00011, 2],
      [0.00031, 2],
      [1e-5, 2],
      [0.00219, 1],
      [0.0008, 0],
      [4e-5, 2],
      [0.00011, 2]
    ]
  },
  "QA_yonInjTbi": {
    "red_x_points": [
      [0.0075, 0],
      [-0.00176, 2],
      [-0.00187, 0],
      [-0.00185, 0],
      [-0.00197, 2],
      [0.0005, 1],
      [-0.00198, 0],
      [-0.00943, 2],
      [-0.00376, 2],
      [0.00114, 1],
      [-0.00424, 1],
      [-0.00366, 0],
      [0.00606, 0],
      [0.00066, 1],
      [0.00022, 1],
      [-0.00471, 1],
      [-0.00383, 1],
      [-0.00399, 1],
      [0.00063, 1],
      [-0.00496, 1],
      [0.00522, 0],
      [-0.0053, 1],
      [0.00115, 1],
      [0.00103, 1],
      [-0.00404, 1],
      [-0.00031, 2],
      [-0.00849, 2],
      [0.00044, 1],
      [-0.00576, 1]
    ],
    "red_o_points": [],
    "y_categories": ["N", "Y", "nan"],
    "blue_o_points": [],
    "blue_x_points": [
      [0.00031, 0],
      [-0.00284, 1],
      [0.00209, 1],
      [0.00306, 1],
      [0.00991, 0],
      [-2e-5, 1],
      [0.0, 1],
      [0.00245, 1],
      [0.01257, 0],
      [0.00935, 0],
      [0.00184, 1],
      [-0.00278, 1],
      [9e-5, 2],
      [0.01132, 0]
    ]
  },
  "QA_mulInjOrthesisType[ArmSling]": {
    "red_x_points": [
      [-0.0072, 2],
      [-0.00673, 2],
      [-0.00657, 2],
      [-0.00652, 2],
      [-0.00664, 2],
      [-0.00679, 2],
      [-0.00687, 2],
      [-0.00681, 2],
      [-0.00695, 2],
      [-0.0068, 2],
      [-0.00716, 2],
      [-0.00691, 2],
      [-0.0072, 2],
      [-0.00689, 2],
      [-0.021, 0],
      [-0.00689, 2],
      [-0.00684, 2],
      [-0.02151, 0],
      [-0.02098, 3],
      [-0.00717, 2],
      [-0.00684, 2],
      [-0.0069, 2],
      [-0.00694, 2],
      [-0.00676, 2],
      [-0.02016, 3],
      [-0.02143, 3],
      [-0.02149, 3],
      [-0.00661, 2],
      [-0.00701, 2]
    ],
    "red_o_points": [],
    "y_categories": ["N", "NOT APPLICABLE", "Y", "nan"],
    "blue_o_points": [],
    "blue_x_points": [
      [-0.00651, 2],
      [-0.00665, 2],
      [-0.00672, 2],
      [-0.00683, 2],
      [0.04373, 1],
      [0.03974, 1],
      [0.04152, 1],
      [0.04256, 1],
      [-0.00651, 2],
      [0.04284, 1],
      [-0.00674, 2],
      [0.04087, 1],
      [0.04067, 1],
      [0.0389, 1],
      [-0.00628, 2]
    ]
  },
  "QS_mulGraftNerve[Ul]": {
    "red_x_points": [
      [-5e-5, 2],
      [-0.00013, 0],
      [-0.00022, 0],
      [-0.00016, 0],
      [-0.00019, 0],
      [-0.00015, 0],
      [-0.00022, 0],
      [-8e-5, 2],
      [-0.00019, 0],
      [-0.00017, 0],
      [-0.0, 2],
      [-0.00018, 0],
      [-6e-5, 2],
      [-0.0002, 0],
      [-0.00021, 0],
      [-0.0, 2],
      [2e-5, 2],
      [-3e-5, 2],
      [-0.00016, 0],
      [0.0, 2],
      [-6e-5, 2],
      [-4e-5, 2],
      [-0.00022, 0],
      [-0.00022, 0],
      [-6e-5, 2],
      [0.00032, 1],
      [-3e-5, 2],
      [-0.0002, 0],
      [-9e-5, 2]
    ],
    "red_o_points": [],
    "y_categories": ["N", "NOT APPLICABLE", "nan"],
    "blue_o_points": [],
    "blue_x_points": [
      [0.00071, 1],
      [1e-5, 2],
      [-9e-5, 0],
      [-0.00014, 0],
      [0.0, 2],
      [0.00076, 1],
      [0.00053, 1],
      [-0.0001, 0],
      [0.00012, 2],
      [-4e-5, 2],
      [-0.0001, 0],
      [0.00074, 1],
      [2e-5, 2],
      [0.00061, 1],
      [-4e-5, 2]
    ]
  },
  "QS_mulGraftNerve[Ssr]": {
    "red_x_points": [
      [-3e-5, 0],
      [-3e-5, 0],
      [-3e-5, 0],
      [-1e-5, 2],
      [-3e-5, 0],
      [-1e-5, 2],
      [-3e-5, 0],
      [-3e-5, 0],
      [-3e-5, 2],
      [-3e-5, 2],
      [-1e-5, 2],
      [-1e-5, 2],
      [-3e-5, 0],
      [-3e-5, 0],
      [-1e-5, 2],
      [-3e-5, 1],
      [-1e-5, 2],
      [-1e-5, 2]
    ],
    "red_o_points": [],
    "y_categories": ["N", "NOT APPLICABLE", "nan"],
    "blue_o_points": [],
    "blue_x_points": [
      [0.00014, 1],
      [7e-5, 0],
      [7e-5, 0],
      [0.00014, 1],
      [-3e-5, 1],
      [-3e-5, 0],
      [-1e-5, 2],
      [-1e-5, 2],
      [7e-5, 0],
      [-3e-5, 2],
      [0.00014, 1],
      [-3e-5, 2]
    ]
  },
  "QA_yonInjUnconscio": {
    "red_x_points": [
      [-0.01134, 1],
      [-0.01154, 1],
      [-0.00209, 2],
      [-0.00254, 2],
      [-0.00214, 2],
      [-0.01229, 1],
      [-0.00234, 2],
      [-0.00271, 2],
      [-0.00232, 2],
      [-0.01207, 1],
      [-0.01096, 1],
      [-0.01195, 1],
      [-0.00304, 2],
      [-0.00239, 2],
      [-0.00935, 1],
      [-0.01118, 1],
      [-0.01066, 1],
      [-0.0095, 1],
      [-0.0101, 1],
      [-0.01119, 1],
      [-0.00322, 2],
      [-0.00249, 2],
      [-0.01219, 1],
      [-0.0117, 1],
      [-0.00296, 2],
      [-0.0025, 2],
      [-0.00283, 2],
      [-0.01081, 1],
      [-0.00326, 2]
    ],
    "red_o_points": [],
    "y_categories": ["N", "Y", "nan"],
    "blue_o_points": [],
    "blue_x_points": [
      [-0.00162, 2],
      [-0.00203, 2],
      [0.04559, 0],
      [-0.0014, 2],
      [-0.00802, 1],
      [-0.00759, 1],
      [0.03148, 0],
      [0.03901, 0],
      [-0.00216, 2],
      [0.03703, 0],
      [0.04286, 0],
      [-0.00173, 2],
      [-0.00832, 1],
      [-0.00208, 2],
      [0.04267, 0]
    ]
  },
  "QA_lstPexPalle[Elbow]": {
    "red_x_points": [
      [-0.00072, 4],
      [-0.00245, 4],
      [-0.00215, 4],
      [-0.00131, 3],
      [-0.00303, 4],
      [-0.00124, 3],
      [-0.00275, 4],
      [-0.00057, 4],
      [-0.00369, 4],
      [-0.00166, 3],
      [-0.00276, 1],
      [-0.00341, 4],
      [-0.00067, 4],
      [-0.004, 4],
      [-0.00206, 4],
      [-0.00031, 3],
      [-0.00827, 0],
      [-0.0003, 3],
      [-0.00687, 2],
      [-0.00023, 3],
      [-0.00058, 4],
      [-0.00055, 4],
      [-0.00386, 4],
      [-0.0042, 4],
      [-0.00022, 4],
      [-0.02017, 3],
      [-0.00038, 4],
      [-0.00639, 0],
      [-0.00053, 4]
    ],
    "red_o_points": [],
    "y_categories": ["ABS", "HYPO", "NAIA", "PT", "nan"],
    "blue_o_points": [],
    "blue_x_points": [
      [0.00365, 4],
      [0.00015, 4],
      [0.00314, 3],
      [0.03066, 1],
      [0.00019, 4],
      [0.00357, 4],
      [0.00935, 1],
      [-0.00252, 4],
      [0.0002, 4],
      [0.00058, 4],
      [0.02447, 1],
      [0.0033, 4],
      [0.00131, 3],
      [0.0036, 4],
      [0.00366, 3]
    ]
  },
  "QS_mulGraftNerve[MCA]": {
    "red_x_points": [
      [1e-5, 2],
      [-4e-5, 0],
      [-5e-5, 0],
      [-2e-5, 0],
      [-9e-5, 0],
      [-2e-5, 0],
      [-6e-5, 0],
      [1e-5, 2],
      [-9e-5, 0],
      [-2e-5, 0],
      [-1e-5, 2],
      [-3e-5, 0],
      [1e-5, 2],
      [-7e-5, 0],
      [-2e-5, 0],
      [-1e-5, 2],
      [-1e-5, 2],
      [-1e-5, 2],
      [-2e-5, 0],
      [-1e-5, 2],
      [1e-5, 2],
      [1e-5, 2],
      [-7e-5, 0],
      [-5e-5, 0],
      [-1e-5, 2],
      [9e-5, 1],
      [-1e-5, 2],
      [1e-5, 2]
    ],
    "red_o_points": [],
    "y_categories": ["N", "NOT APPLICABLE", "nan"],
    "blue_o_points": [],
    "blue_x_points": [
      [0.00033, 1],
      [0.0, 2],
      [-2e-5, 0],
      [9e-5, 1],
      [9e-5, 1],
      [-2e-5, 0],
      [1e-5, 2],
      [-1e-5, 2],
      [-2e-5, 0],
      [9e-5, 1],
      [-1e-5, 2],
      [9e-5, 1],
      [-1e-5, 2]
    ]
  },
  "QA_lstPexInspectio[Swelling]": {
    "red_x_points": [
      [0.00134, 1],
      [-0.00214, 1],
      [0.00107, 0],
      [-0.00157, 1],
      [-0.00023, 2],
      [0.00143, 0],
      [-0.00283, 1],
      [0.00146, 1],
      [-0.00568, 1],
      [-0.00502, 1],
      [-0.00672, 2],
      [-0.00434, 1],
      [-0.0029, 0],
      [-0.00422, 1],
      [-0.00119, 1],
      [-0.00299, 0],
      [-0.00697, 2],
      [0.00165, 1],
      [-0.00214, 1],
      [0.00104, 1],
      [-0.00399, 0],
      [0.0016, 1],
      [-0.00397, 1],
      [0.0032, 0],
      [0.00148, 1],
      [-0.0035, 0],
      [-0.00719, 2],
      [0.00054, 0],
      [0.00182, 1]
    ],
    "red_o_points": [],
    "y_categories": ["ABS", "NAIA", "PT", "nan"],
    "blue_o_points": [],
    "blue_x_points": [
      [0.00155, 1],
      [0.00331, 1],
      [0.00807, 0],
      [0.01078, 0],
      [0.00396, 1],
      [0.00103, 1],
      [0.00027, 0],
      [-0.00199, 1],
      [0.00329, 0],
      [0.00346, 1],
      [0.01111, 2],
      [0.00078, 1],
      [0.00237, 1],
      [-0.00017, 0],
      [0.00317, 1]
    ]
  },
  "QA_lstPexInspectio[SurgicalScar]": {
    "red_x_points": [
      [-0.00366, 1],
      [-0.00486, 1],
      [-0.00565, 0],
      [-0.00398, 1],
      [-0.00613, 1],
      [-0.00819, 0],
      [-0.00549, 1],
      [-0.00319, 1],
      [-0.00775, 1],
      [-0.00803, 1],
      [-0.00752, 0],
      [-0.00639, 1],
      [-0.00073, 2],
      [-0.00754, 1],
      [-0.00438, 0],
      [0.00469, 2],
      [0.00405, 2],
      [-0.00635, 1],
      [-0.00389, 1],
      [-0.0053, 1],
      [0.00031, 2],
      [-0.00321, 1],
      [-0.00764, 1],
      [0.01264, 2],
      [-0.00213, 1],
      [-0.0038, 1],
      [-0.00183, 1],
      [0.00537, 2],
      [-0.00288, 1]
    ],
    "red_o_points": [],
    "y_categories": ["ABS", "NAIA", "PT", "nan"],
    "blue_o_points": [],
    "blue_x_points": [
      [-0.001, 1],
      [0.0104, 2],
      [0.02057, 2],
      [0.02198, 2],
      [0.00051, 1],
      [0.00024, 1],
      [0.00141, 0],
      [-0.00408, 1],
      [0.00155, 1],
      [0.0004, 1],
      [0.02006, 2],
      [-0.0007, 1],
      [0.00899, 2],
      [0.00298, 0],
      [0.01016, 2]
    ]
  },
  "QA_intPexWristFlex": {
    "red_x_points": [
      [-8e-5, 2],
      [-0.00057, 2],
      [-0.00037, 2],
      [-0.00045, 2],
      [-0.00063, 2],
      [-0.00047, 0],
      [-0.00053, 2],
      [0.00021, 0],
      [-0.0009, 2],
      [-0.00085, 2],
      [-0.0001, 0],
      [-0.0008, 2],
      [-0.00017, 2],
      [-0.00066, 2],
      [-0.00043, 2],
      [-0.00023, 0],
      [3e-5, 0],
      [-0.00033, 0],
      [-0.00031, 0],
      [-6e-5, 2],
      [-0.00011, 2],
      [7e-5, 2],
      [-0.00087, 2],
      [-0.00069, 2],
      [2e-5, 2],
      [-0.0209, 1],
      [-0.00351, 1],
      [-0.00035, 0],
      [-6e-5, 2]
    ],
    "red_o_points": [],
    "y_categories": ["GREATER THAN OR EQUALS TO 60", "LESS THAN 60", "nan"],
    "blue_o_points": [],
    "blue_x_points": [
      [0.00422, 2],
      [0.00194, 0],
      [0.0005, 0],
      [-0.00092, 2],
      [0.00024, 2],
      [0.00359, 2],
      [0.00539, 0],
      [-0.00063, 2],
      [0.0003, 2],
      [0.00029, 2],
      [0.01067, 1],
      [0.00334, 2],
      [0.00039, 2],
      [0.00413, 2],
      [0.00066, 0]
    ]
  },
  "QS_mulGraftNerve[Me]": {
    "red_x_points": [
      [3e-5, 2],
      [-0.00028, 0],
      [-0.00034, 0],
      [-0.00032, 0],
      [-0.00027, 0],
      [-0.00027, 0],
      [-0.00022, 0],
      [-6e-5, 2],
      [-0.00036, 0],
      [-0.00031, 0],
      [-3e-5, 2],
      [-0.00021, 0],
      [-6e-5, 2],
      [-0.00028, 0],
      [-0.00014, 0],
      [-8e-5, 2],
      [1e-5, 2],
      [-3e-5, 2],
      [-0.00023, 0],
      [-2e-5, 2],
      [-5e-5, 2],
      [-6e-5, 2],
      [-0.00038, 0],
      [-0.00023, 0],
      [-4e-5, 2],
      [0.00038, 1],
      [-3e-5, 2],
      [-0.00027, 0],
      [-4e-5, 2]
    ],
    "red_o_points": [],
    "y_categories": ["N", "NOT APPLICABLE", "nan"],
    "blue_o_points": [],
    "blue_x_points": [
      [0.00136, 1],
      [-2e-5, 2],
      [-0.00013, 0],
      [-0.0001, 0],
      [-3e-5, 2],
      [0.00096, 1],
      [0.00065, 1],
      [-0.00023, 0],
      [-4e-5, 2],
      [-2e-5, 2],
      [-0.00016, 0],
      [0.00092, 1],
      [-4e-5, 2],
      [0.00109, 1],
      [-1e-5, 2]
    ]
  },
  "QS_mulGraftRoot[T2]": {
    "red_x_points": [
      [-4e-5, 2],
      [-3e-5, 0],
      [-2e-5, 0],
      [-3e-5, 0],
      [-2e-5, 0],
      [-1e-5, 2],
      [-1e-5, 0],
      [-1e-5, 0],
      [-1e-5, 2],
      [-1e-5, 2],
      [-3e-5, 0],
      [-2e-5, 0],
      [-1e-5, 2],
      [-1e-5, 2],
      [-1e-5, 2],
      [-2e-5, 0],
      [-1e-5, 2],
      [-4e-5, 2],
      [-4e-5, 2],
      [-3e-5, 0],
      [-3e-5, 0],
      [-1e-5, 2],
      [-1e-5, 2],
      [-2e-5, 0],
      [-4e-5, 2]
    ],
    "red_o_points": [],
    "y_categories": ["N", "NOT APPLICABLE", "nan"],
    "blue_o_points": [],
    "blue_x_points": [
      [0.00017, 1],
      [-1e-5, 2],
      [-2e-5, 0],
      [-3e-5, 0],
      [0.00013, 1],
      [0.00013, 1],
      [-2e-5, 0],
      [-1e-5, 2],
      [-1e-5, 2],
      [0.00013, 1],
      [-1e-5, 2],
      [0.00013, 1],
      [-1e-5, 2]
    ]
  },
  "QS_mulGraftNerve[Ax]": {
    "red_x_points": [
      [-7e-5, 2],
      [-0.00041, 0],
      [-0.00028, 0],
      [-0.00021, 0],
      [-0.00021, 0],
      [-0.00017, 0],
      [-0.00033, 0],
      [-6e-5, 2],
      [-0.00021, 0],
      [-0.00015, 0],
      [-3e-5, 2],
      [-0.00037, 0],
      [-7e-5, 2],
      [-0.00039, 0],
      [-0.0004, 0],
      [-0.0001, 2],
      [-4e-5, 2],
      [-3e-5, 2],
      [-0.00015, 0],
      [-9e-5, 2],
      [-8e-5, 2],
      [-9e-5, 2],
      [-0.00034, 0],
      [-0.00022, 0],
      [-7e-5, 2],
      [0.00048, 1],
      [-1e-5, 2],
      [-0.00019, 0],
      [-4e-5, 2]
    ],
    "red_o_points": [],
    "y_categories": ["N", "NOT APPLICABLE", "nan"],
    "blue_o_points": [],
    "blue_x_points": [
      [0.00193, 1],
      [-4e-5, 2],
      [-0.00016, 0],
      [-0.00011, 0],
      [0.0, 2],
      [0.00082, 1],
      [0.00061, 1],
      [-0.00019, 0],
      [-1e-5, 2],
      [-1e-5, 2],
      [-9e-5, 0],
      [0.00078, 1],
      [-4e-5, 2],
      [0.00085, 1],
      [1e-5, 2]
    ]
  },
  "QS_mulBpsurgeryType[Lysis]": {
    "red_x_points": [
      [-0.0012, 3],
      [-0.00438, 0],
      [-0.0165, 2],
      [-0.01655, 2],
      [-0.00302, 0],
      [-0.0168, 2],
      [-0.00329, 0],
      [-0.00148, 3],
      [-0.00318, 0],
      [-0.00286, 0],
      [-0.0011, 3],
      [-0.0032, 0],
      [-0.00141, 3],
      [-0.00425, 0],
      [-0.01511, 2],
      [-0.00114, 3],
      [-0.00099, 3],
      [-0.00088, 3],
      [-0.00304, 0],
      [-0.00104, 3],
      [-0.00131, 3],
      [-0.00147, 3],
      [-0.00341, 0],
      [-0.00326, 0],
      [-0.00161, 3],
      [0.01952, 1],
      [-0.00151, 3],
      [-0.01548, 2],
      [-0.00146, 3]
    ],
    "red_o_points": [],
    "y_categories": ["N", "NOT APPLICABLE", "Y", "nan"],
    "blue_o_points": [],
    "blue_x_points": [
      [0.02922, 1],
      [-0.0008, 3],
      [-0.00133, 0],
      [-0.0011, 0],
      [-0.00041, 3],
      [0.02514, 1],
      [0.02088, 1],
      [-0.00179, 0],
      [-0.00087, 3],
      [-0.0007, 3],
      [-0.00093, 0],
      [0.02274, 1],
      [-0.00062, 3],
      [0.0227, 1],
      [-0.00073, 3]
    ]
  },
  "QS_mulLysisSite[Trunk]": {
    "red_x_points": [
      [-0.00075, 3],
      [-0.00415, 0],
      [-0.00312, 0],
      [-0.00308, 0],
      [-0.00329, 0],
      [-0.01193, 2],
      [-0.00312, 0],
      [-0.00109, 3],
      [-0.00319, 0],
      [-0.00287, 0],
      [-0.00075, 3],
      [-0.00331, 0],
      [-0.00099, 3],
      [-0.00412, 0],
      [-0.01051, 2],
      [-0.00084, 3],
      [-0.00058, 3],
      [-0.00104, 3],
      [-0.00302, 0],
      [-0.00083, 3],
      [-0.00093, 3],
      [-0.00084, 3],
      [-0.00315, 0],
      [-0.0032, 0],
      [-0.001, 3],
      [0.01286, 1],
      [-0.00096, 3],
      [-0.01031, 2],
      [-0.00072, 3]
    ],
    "red_o_points": [],
    "y_categories": ["N", "NOT APPLICABLE", "Y", "nan"],
    "blue_o_points": [],
    "blue_x_points": [
      [0.02069, 1],
      [-0.0005, 3],
      [-0.00152, 0],
      [-0.00174, 0],
      [-0.0002, 3],
      [0.01694, 1],
      [0.01289, 1],
      [-0.00196, 0],
      [-0.0007, 3],
      [-0.00036, 3],
      [-0.00161, 0],
      [0.01466, 1],
      [-0.00053, 3],
      [0.0153, 1],
      [-0.00055, 3]
    ]
  },
  "QS_mulGraftTrunk[UpperTrunk]": {
    "red_x_points": [
      [-0.00035, 3],
      [-0.00259, 0],
      [-0.00206, 0],
      [-0.00161, 0],
      [-0.00206, 0],
      [-0.00167, 0],
      [-0.00176, 0],
      [-0.00051, 3],
      [-0.00207, 0],
      [-0.00173, 0],
      [-0.00035, 3],
      [-0.00201, 0],
      [-0.00035, 3],
      [-0.009, 2],
      [-0.00268, 0],
      [-0.00045, 3],
      [-0.00035, 3],
      [-0.00052, 3],
      [-0.00173, 0],
      [-0.0004, 3],
      [-0.00033, 3],
      [-0.00033, 3],
      [-0.00192, 0],
      [-0.00196, 0],
      [-0.00043, 3],
      [0.0064, 1],
      [-0.00057, 3],
      [-0.00178, 0],
      [-0.00044, 3]
    ],
    "red_o_points": [],
    "y_categories": ["N", "NOT APPLICABLE", "Y", "nan"],
    "blue_o_points": [],
    "blue_x_points": [
      [0.0096, 1],
      [-0.00027, 3],
      [-0.00078, 0],
      [-0.00044, 0],
      [5e-5, 3],
      [0.00873, 1],
      [0.00651, 1],
      [-0.00082, 0],
      [-0.00012, 3],
      [-0.00014, 3],
      [-0.00106, 0],
      [0.0075, 1],
      [-0.00035, 3],
      [0.00752, 1],
      [-0.00031, 3]
    ]
  },
  "QS_mulTransfSite[PhMc]": {
    "red_x_points": [
      [-0.00045, 3],
      [-0.00279, 0],
      [-0.00228, 0],
      [-0.00211, 0],
      [-0.00223, 0],
      [-0.00187, 0],
      [-0.00838, 2],
      [-0.00056, 3],
      [-0.00216, 0],
      [-0.0022, 0],
      [-0.00039, 3],
      [-0.00227, 0],
      [-0.00061, 3],
      [-0.00286, 0],
      [-0.00266, 0],
      [-0.00049, 3],
      [-0.00041, 3],
      [-0.00043, 3],
      [-0.00675, 2],
      [-0.00045, 3],
      [-0.00066, 3],
      [-0.00064, 3],
      [-0.00214, 0],
      [-0.00221, 0],
      [-0.0005, 3],
      [0.0088, 1],
      [-0.00057, 3],
      [-0.00195, 0],
      [-0.00056, 3]
    ],
    "red_o_points": [],
    "y_categories": ["N", "NOT APPLICABLE", "Y", "nan"],
    "blue_o_points": [],
    "blue_x_points": [
      [0.01378, 1],
      [-0.00034, 3],
      [-0.00133, 0],
      [-0.00163, 0],
      [-4e-5, 3],
      [0.01032, 1],
      [0.00842, 1],
      [-0.00146, 0],
      [-0.00035, 3],
      [-0.00013, 3],
      [-0.00137, 0],
      [0.00906, 1],
      [-0.00017, 3],
      [0.00839, 1],
      [-0.00042, 3]
    ]
  },
  "QS_mulLysisSite[Root]": {
    "red_x_points": [
      [-0.0003, 3],
      [-0.00208, 0],
      [-0.00694, 2],
      [-0.00173, 0],
      [-0.0019, 0],
      [-0.00156, 0],
      [-0.00194, 0],
      [-0.00043, 3],
      [-0.00204, 0],
      [-0.00174, 0],
      [-0.00029, 3],
      [-0.00169, 0],
      [-0.00051, 3],
      [-0.00242, 0],
      [-0.002, 0],
      [-0.00027, 3],
      [-0.00023, 3],
      [-0.00028, 3],
      [-0.00162, 0],
      [-0.00032, 3],
      [-0.00051, 3],
      [-0.0004, 3],
      [-0.00179, 0],
      [-0.00174, 0],
      [-0.00047, 3],
      [0.00551, 1],
      [-0.00043, 3],
      [-0.00574, 2],
      [-0.00036, 3]
    ],
    "red_o_points": [],
    "y_categories": ["N", "NOT APPLICABLE", "Y", "nan"],
    "blue_o_points": [],
    "blue_x_points": [
      [0.01127, 1],
      [-0.00021, 3],
      [-0.00109, 0],
      [-0.001, 0],
      [-2e-5, 3],
      [0.00808, 1],
      [0.00639, 1],
      [-0.00141, 0],
      [-0.00024, 3],
      [-5e-5, 3],
      [-0.00083, 0],
      [0.00766, 1],
      [-0.00019, 3],
      [0.00803, 1],
      [-0.00017, 3]
    ]
  },
  "QA_lstPexInspectio[ShoulderSubdisloc]": {
    "red_x_points": [
      [-0.00153, 1],
      [-0.00425, 1],
      [0.00384, 0],
      [-0.00329, 1],
      [-0.00533, 1],
      [-0.00241, 2],
      [-0.0044, 1],
      [-0.00254, 1],
      [-0.00674, 1],
      [-0.00676, 1],
      [-0.0007, 2],
      [-0.00578, 1],
      [-0.00234, 1],
      [-0.00664, 1],
      [-0.00295, 1],
      [-0.00272, 2],
      [-0.00041, 2],
      [-0.00045, 1],
      [-0.0033, 1],
      [-0.001, 1],
      [-0.0106, 0],
      [0.00338, 2],
      [-0.00145, 2],
      [-0.00093, 2],
      [-0.00178, 1],
      [-0.00998, 2],
      [-0.00175, 1],
      [-0.00106, 2],
      [-0.00226, 1]
    ],
    "red_o_points": [],
    "y_categories": ["ABS", "NAIA", "PT", "nan"],
    "blue_o_points": [],
    "blue_x_points": [
      [0.00335, 1],
      [0.00724, 2],
      [0.02656, 0],
      [0.00425, 2],
      [0.00032, 1],
      [0.00374, 1],
      [0.00444, 0],
      [-0.00328, 1],
      [0.01019, 2],
      [0.0005, 1],
      [0.02488, 0],
      [0.00159, 1],
      [0.00141, 1],
      [-0.00076, 2],
      [0.0017, 1]
    ]
  },
  "QA_yonPreTbi": {
    "red_x_points": [
      [-0.00082, 2],
      [-3e-5, 2],
      [-0.0001, 2],
      [-6e-5, 2],
      [-0.00011, 2],
      [-7e-5, 2],
      [-0.0001, 2],
      [-0.00078, 2],
      [-0.0001, 2],
      [-0.00011, 2],
      [-0.00091, 2],
      [-9e-5, 2],
      [-0.00081, 2],
      [-3e-5, 2],
      [-0.0, 2],
      [-0.0126, 1],
      [-0.00091, 2],
      [-0.0006, 2],
      [-5e-5, 2],
      [-0.00082, 2],
      [-0.00083, 2],
      [-0.0009, 2],
      [-0.00012, 2],
      [-0.00012, 2],
      [-0.00068, 2],
      [-1e-5, 2],
      [-0.00066, 2],
      [-0.00011, 2],
      [-0.00093, 2]
    ],
    "red_o_points": [],
    "y_categories": ["N", "Y", "nan"],
    "blue_o_points": [],
    "blue_x_points": [
      [-1e-5, 2],
      [0.02639, 0],
      [3e-5, 2],
      [-4e-5, 2],
      [-0.00046, 2],
      [-0.0, 2],
      [2e-5, 2],
      [-5e-5, 2],
      [-0.00076, 2],
      [-0.00048, 2],
      [5e-5, 2],
      [2e-5, 2],
      [-0.00045, 2],
      [-1e-5, 2],
      [-0.0008, 2]
    ]
  },
  "QS_mulGraftLevel[Trunk]": {
    "red_x_points": [
      [-0.0003, 3],
      [-0.00181, 0],
      [-0.00167, 0],
      [-0.00151, 0],
      [-0.0018, 0],
      [-0.00149, 0],
      [-0.00178, 0],
      [-0.00048, 3],
      [-0.00166, 0],
      [-0.00147, 0],
      [-0.00036, 3],
      [-0.00156, 0],
      [-0.00056, 3],
      [-0.00747, 2],
      [-0.00179, 0],
      [-0.0005, 3],
      [-0.00029, 3],
      [-0.00041, 3],
      [-0.00142, 0],
      [-0.0004, 3],
      [-0.00042, 3],
      [-0.00044, 3],
      [-0.00163, 0],
      [-0.0017, 0],
      [-0.0007, 3],
      [0.00517, 1],
      [-0.00034, 3],
      [-0.00144, 0],
      [-0.00051, 3]
    ],
    "red_o_points": [],
    "y_categories": ["N", "NOT APPLICABLE", "Y", "nan"],
    "blue_o_points": [],
    "blue_x_points": [
      [0.00938, 1],
      [-0.00039, 3],
      [-0.00073, 0],
      [-0.00073, 0],
      [9e-5, 3],
      [0.00754, 1],
      [0.00453, 1],
      [-0.00078, 0],
      [-0.0003, 3],
      [-4e-5, 3],
      [-0.00064, 0],
      [0.00648, 1],
      [-0.00023, 3],
      [0.00681, 1],
      [-0.00024, 3]
    ]
  },
  "QA_lstPexPain[C7]": {
    "red_x_points": [
      [-0.0025, 1],
      [-0.00357, 2],
      [-0.00368, 2],
      [-0.0019, 1],
      [-0.00462, 2],
      [-0.00311, 1],
      [-0.00194, 1],
      [-0.00505, 0],
      [-0.0042, 1],
      [0.00714, 0],
      [-0.00213, 1],
      [-0.00589, 2],
      [0.00163, 2],
      [-0.00491, 2],
      [-0.00205, 2],
      [-0.00448, 0],
      [-0.00095, 1],
      [-0.00436, 0],
      [-0.00331, 2],
      [-0.00351, 0],
      [0.00164, 2],
      [0.00126, 2],
      [-0.00594, 2],
      [-0.00634, 2],
      [-0.00351, 0],
      [-0.00169, 1],
      [-0.0015, 1],
      [-0.00204, 1],
      [-0.00182, 1]
    ],
    "red_o_points": [],
    "y_categories": ["NORM", "NPV", "nan"],
    "blue_o_points": [],
    "blue_x_points": [
      [8e-5, 1],
      [0.00377, 1],
      [0.01472, 0],
      [0.01915, 0],
      [0.00471, 2],
      [0.00019, 2],
      [0.00016, 1],
      [0.00032, 1],
      [0.00491, 2],
      [0.00439, 2],
      [0.01244, 0],
      [-7e-5, 1],
      [-0.00048, 0],
      [0.00176, 0],
      [0.00722, 1]
    ]
  },
  "QS_mulTransfSite[AcSsAA]": {
    "red_x_points": [
      [-0.00071, 3],
      [-0.0021, 2],
      [-0.00528, 0],
      [-0.00474, 0],
      [-0.00179, 2],
      [-0.00583, 0],
      [-0.00453, 0],
      [-0.00069, 3],
      [-0.00553, 0],
      [-0.00629, 0],
      [-0.00041, 3],
      [-0.00562, 0],
      [-0.00071, 3],
      [-0.00133, 2],
      [-0.00403, 0],
      [-0.00085, 3],
      [-0.00041, 3],
      [-0.00066, 3],
      [-0.00124, 2],
      [-0.0005, 3],
      [-0.00069, 3],
      [-0.00072, 3],
      [-0.00549, 0],
      [-0.00054, 2],
      [-0.00063, 3],
      [0.00884, 1],
      [-0.0006, 3],
      [-0.00404, 0],
      [-0.00062, 3]
    ],
    "red_o_points": [],
    "y_categories": ["N", "NOT APPLICABLE", "Y", "nan"],
    "blue_o_points": [],
    "blue_x_points": [
      [0.01446, 1],
      [-0.00045, 3],
      [0.00582, 2],
      [0.00402, 2],
      [-0.00012, 3],
      [0.01048, 1],
      [0.00936, 1],
      [-0.00291, 0],
      [-0.00054, 3],
      [-0.00027, 3],
      [-0.00219, 0],
      [0.00993, 1],
      [-0.00048, 3],
      [0.01088, 1],
      [-0.00028, 3]
    ]
  },
  "QS_mulTransfSite[C7ipsi]": {
    "red_x_points": [
      [-1e-5, 2],
      [-3e-5, 0],
      [-3e-5, 0],
      [-3e-5, 0],
      [-3e-5, 0],
      [-3e-5, 0],
      [-3e-5, 0],
      [-3e-5, 0],
      [-1e-5, 2],
      [-3e-5, 0],
      [-3e-5, 0],
      [-1e-5, 2],
      [-1e-5, 2],
      [-1e-5, 2],
      [-1e-5, 2],
      [-1e-5, 2],
      [-1e-5, 2],
      [-3e-5, 0],
      [-3e-5, 0],
      [-1e-5, 2],
      [9e-5, 1],
      [-1e-5, 2],
      [-1e-5, 2]
    ],
    "red_o_points": [],
    "y_categories": ["N", "NOT APPLICABLE", "nan"],
    "blue_o_points": [],
    "blue_x_points": [
      [9e-5, 1],
      [-1e-5, 2],
      [-3e-5, 0],
      [-1e-5, 2],
      [9e-5, 1],
      [-3e-5, 0],
      [-1e-5, 2],
      [-1e-5, 2],
      [-3e-5, 0],
      [9e-5, 1],
      [9e-5, 1],
      [-1e-5, 2]
    ]
  },
  "QS_mulGraftNerve[MP]": {
    "red_x_points": [
      [-9e-5, 0],
      [-3e-5, 0],
      [-3e-5, 0],
      [-3e-5, 0],
      [-3e-5, 0],
      [-3e-5, 0],
      [-1e-5, 2],
      [-3e-5, 0],
      [-3e-5, 0],
      [-1e-5, 2],
      [-3e-5, 0],
      [-2e-5, 2],
      [-9e-5, 0],
      [-3e-5, 0],
      [-1e-5, 2],
      [-1e-5, 2],
      [-1e-5, 2],
      [-2e-5, 2],
      [-1e-5, 2],
      [-1e-5, 2],
      [0.00016, 1],
      [-1e-5, 2],
      [-2e-5, 2]
    ],
    "red_o_points": [],
    "y_categories": ["N", "NOT APPLICABLE", "nan"],
    "blue_o_points": [],
    "blue_x_points": [
      [0.00016, 1],
      [-1e-5, 2],
      [-3e-5, 0],
      [-3e-5, 0],
      [-1e-5, 2],
      [0.00016, 1],
      [9e-5, 1],
      [-3e-5, 0],
      [-1e-5, 2],
      [-2e-5, 2],
      [-1e-5, 2],
      [9e-5, 1]
    ]
  },
  "QS_mulGraftNerve[LP]": {
    "red_x_points": [
      [-1e-5, 2],
      [-0.00019, 0],
      [-3e-5, 0],
      [-5e-5, 0],
      [-9e-5, 0],
      [-5e-5, 0],
      [-0.00012, 0],
      [-4e-5, 2],
      [-0.00012, 0],
      [-0.0001, 0],
      [-1e-5, 2],
      [-6e-5, 0],
      [-3e-5, 2],
      [-9e-5, 0],
      [-9e-5, 0],
      [-1e-5, 2],
      [-1e-5, 2],
      [-1e-5, 2],
      [-5e-5, 0],
      [-8e-5, 2],
      [-3e-5, 2],
      [-3e-5, 2],
      [-9e-5, 0],
      [-9e-5, 0],
      [-1e-5, 2],
      [0.00028, 1],
      [-4e-5, 2],
      [-9e-5, 0],
      [-1e-5, 2]
    ],
    "red_o_points": [],
    "y_categories": ["N", "NOT APPLICABLE", "nan"],
    "blue_o_points": [],
    "blue_x_points": [
      [0.00032, 1],
      [-4e-5, 2],
      [-5e-5, 0],
      [-6e-5, 0],
      [-1e-5, 2],
      [0.00038, 1],
      [0.00028, 1],
      [-9e-5, 0],
      [-1e-5, 2],
      [-1e-5, 2],
      [-5e-5, 0],
      [0.00033, 1],
      [-1e-5, 2],
      [0.00042, 1],
      [-1e-5, 2]
    ]
  },
  "QA_lstPexMuscstrength[WristFlex]": {
    "red_x_points": [
      [-0.00324, 1],
      [-0.00177, 2],
      [-0.00286, 1],
      [0.00128, 0],
      [-0.00399, 1],
      [0.00065, 0],
      [-0.00328, 1],
      [-0.00084, 0],
      [0.0022, 0],
      [0.0006, 0],
      [-0.00172, 0],
      [0.00125, 0],
      [-0.00204, 2],
      [-0.00296, 2],
      [-0.00086, 2],
      [-0.00589, 0],
      [-0.00019, 1],
      [-0.00746, 0],
      [-0.00279, 1],
      [-0.00429, 0],
      [-0.00187, 2],
      [-0.00088, 0],
      [0.00125, 0],
      [0.00165, 0],
      [-0.00227, 2],
      [-0.00153, 2],
      [-0.00271, 1],
      [-0.002, 1],
      [-0.00313, 2]
    ],
    "red_o_points": [],
    "y_categories": ["GREATER THAN OR EQUALS TO 3", "LESS THAN 3", "nan"],
    "blue_o_points": [],
    "blue_x_points": [
      [0.00101, 0],
      [0.0033, 0],
      [0.00203, 0],
      [0.00324, 0],
      [0.00192, 2],
      [-1e-5, 2],
      [0.0001, 0],
      [0.00184, 0],
      [0.00492, 0],
      [0.00138, 2],
      [0.00247, 0],
      [0.00068, 0],
      [0.01289, 1],
      [0.00089, 0],
      [0.01304, 1]
    ]
  },
  "QS_mulNeuromadSite[C5]": {
    "red_x_points": [
      [-6e-5, 2],
      [-0.001, 0],
      [-0.00084, 0],
      [-0.00089, 0],
      [-0.00077, 0],
      [-0.00086, 0],
      [-0.00087, 0],
      [-0.00027, 2],
      [-0.00085, 0],
      [-0.00089, 0],
      [-0.00015, 2],
      [-0.00074, 0],
      [-0.00015, 2],
      [-0.00103, 0],
      [-0.00106, 0],
      [-9e-5, 2],
      [-0.00011, 2],
      [-0.0002, 2],
      [-0.00075, 0],
      [-2e-5, 2],
      [-0.0002, 2],
      [-0.00011, 2],
      [-0.00074, 0],
      [-0.0008, 0],
      [-0.00016, 2],
      [0.00189, 1],
      [-0.00016, 2],
      [-0.00083, 0],
      [-0.00014, 2]
    ],
    "red_o_points": [],
    "y_categories": ["N", "NOT APPLICABLE", "nan"],
    "blue_o_points": [],
    "blue_x_points": [
      [0.00422, 1],
      [-8e-5, 2],
      [-0.00072, 0],
      [-0.00075, 0],
      [-5e-5, 2],
      [0.00295, 1],
      [0.00263, 1],
      [-0.00064, 0],
      [2e-5, 2],
      [-9e-5, 2],
      [-0.00052, 0],
      [0.00289, 1],
      [-5e-5, 2],
      [0.0031, 1],
      [-8e-5, 2]
    ]
  },
  "QS_mulNeuromadSite[C7]": {
    "red_x_points": [
      [-3e-5, 2],
      [-0.00082, 0],
      [-0.00079, 0],
      [-0.0006, 0],
      [-0.00065, 0],
      [-0.00067, 0],
      [-0.00071, 0],
      [-6e-5, 2],
      [-0.00066, 0],
      [-0.0006, 0],
      [-9e-5, 2],
      [-0.00078, 0],
      [-0.00015, 2],
      [-0.00071, 0],
      [-0.00091, 0],
      [-5e-5, 2],
      [-6e-5, 2],
      [-5e-5, 2],
      [-0.00064, 0],
      [-9e-5, 2],
      [-7e-5, 2],
      [-5e-5, 2],
      [-0.00077, 0],
      [-0.00084, 0],
      [-0.0001, 2],
      [0.00209, 1],
      [-8e-5, 2],
      [-0.00062, 0],
      [-8e-5, 2]
    ],
    "red_o_points": [],
    "y_categories": ["N", "NOT APPLICABLE", "nan"],
    "blue_o_points": [],
    "blue_x_points": [
      [0.0029, 1],
      [-1e-5, 2],
      [-0.00043, 0],
      [-0.00052, 0],
      [5e-5, 2],
      [0.00244, 1],
      [0.00208, 1],
      [-0.0005, 0],
      [-4e-5, 2],
      [-3e-5, 2],
      [-0.00059, 0],
      [0.00207, 1],
      [-3e-5, 2],
      [0.00232, 1],
      [-8e-5, 2]
    ]
  },
  "QS_mulLysisRoot[C5]": {
    "red_x_points": [
      [-0.0005, 3],
      [-0.0035, 0],
      [-0.00784, 2],
      [-0.00218, 0],
      [-0.00275, 0],
      [-0.00227, 0],
      [-0.00264, 0],
      [-0.00051, 3],
      [-0.0025, 0],
      [-0.00211, 0],
      [-0.00046, 3],
      [-0.00255, 0],
      [-0.00065, 3],
      [-0.00384, 0],
      [-0.00307, 0],
      [-0.00073, 3],
      [-0.00043, 3],
      [-0.00044, 3],
      [-0.0021, 0],
      [-0.00028, 3],
      [-0.00067, 3],
      [-0.00062, 3],
      [-0.00258, 0],
      [-0.00242, 0],
      [-0.00056, 3],
      [0.00826, 1],
      [-0.00057, 3],
      [-0.0078, 2],
      [-0.00087, 3]
    ],
    "red_o_points": [],
    "y_categories": ["N", "NOT APPLICABLE", "Y", "nan"],
    "blue_o_points": [],
    "blue_x_points": [
      [0.0153, 1],
      [-0.00054, 3],
      [-0.00085, 0],
      [-0.00151, 0],
      [-1e-5, 3],
      [0.01196, 1],
      [0.00885, 1],
      [-0.00187, 0],
      [-0.00015, 3],
      [-7e-5, 3],
      [-0.00064, 0],
      [0.00978, 1],
      [-0.00035, 3],
      [0.00969, 1],
      [-0.00038, 3]
    ]
  },
  "QS_mulGraftNerve[TD]": {
    "red_x_points": [
      [-2e-5, 2],
      [-0.00034, 0],
      [-0.00034, 0],
      [-0.00016, 0],
      [-0.00019, 0],
      [-0.00014, 0],
      [-0.00027, 0],
      [-8e-5, 2],
      [-0.00034, 0],
      [-0.0001, 0],
      [-5e-5, 2],
      [-0.00025, 0],
      [2e-5, 2],
      [-0.00025, 0],
      [-0.0004, 0],
      [-6e-5, 2],
      [-3e-5, 2],
      [-4e-5, 2],
      [-0.00013, 0],
      [-2e-5, 2],
      [-2e-5, 2],
      [-2e-5, 2],
      [-0.00029, 0],
      [-0.00028, 0],
      [-8e-5, 2],
      [0.00029, 1],
      [-7e-5, 2],
      [-0.00012, 0],
      [-5e-5, 2]
    ],
    "red_o_points": [],
    "y_categories": ["N", "NOT APPLICABLE", "nan"],
    "blue_o_points": [],
    "blue_x_points": [
      [0.001, 1],
      [-2e-5, 2],
      [-0.00013, 0],
      [-0.00011, 0],
      [5e-5, 2],
      [0.00124, 1],
      [0.00053, 1],
      [-0.00015, 0],
      [-1e-5, 2],
      [4e-5, 2],
      [-0.00011, 0],
      [0.00093, 1],
      [-1e-5, 2],
      [0.00061, 1],
      [-2e-5, 2]
    ]
  },
  "QA_intPexForearmSupin": {
    "red_x_points": [
      [-0.00089, 2],
      [-0.00363, 0],
      [-0.00089, 2],
      [-0.00062, 2],
      [-0.00121, 2],
      [0.0041, 1],
      [-0.00103, 2],
      [0.00217, 1],
      [-0.0012, 2],
      [-0.00139, 2],
      [-0.00648, 0],
      [-0.00632, 0],
      [-0.00052, 2],
      [-0.00126, 2],
      [-0.00037, 2],
      [0.00365, 1],
      [-0.00693, 0],
      [0.00125, 1],
      [0.00165, 1],
      [-0.00064, 2],
      [-0.00049, 2],
      [-0.00058, 2],
      [-0.00136, 2],
      [-0.00117, 2],
      [3e-5, 2],
      [-0.02073, 1],
      [-0.0003, 2],
      [-0.00357, 0],
      [-0.00073, 2]
    ],
    "red_o_points": [],
    "y_categories": ["GREATER THAN OR EQUALS TO 80", "LESS THAN 80", "nan"],
    "blue_o_points": [],
    "blue_x_points": [
      [0.00371, 2],
      [0.0062, 1],
      [0.00944, 1],
      [-0.00113, 2],
      [8e-5, 2],
      [0.00385, 2],
      [0.00532, 0],
      [-0.00052, 2],
      [-0.00027, 2],
      [9e-5, 2],
      [0.00858, 1],
      [0.00365, 2],
      [0.00025, 2],
      [0.00399, 2],
      [0.00625, 1]
    ]
  },
  "QS_mulGraftNerve[SS]": {
    "red_x_points": [
      [-3e-5, 2],
      [-7e-5, 0],
      [-7e-5, 0],
      [-5e-5, 0],
      [-9e-5, 0],
      [-7e-5, 0],
      [-2e-5, 0],
      [-2e-5, 2],
      [-9e-5, 0],
      [-9e-5, 0],
      [-2e-5, 2],
      [-2e-5, 0],
      [-2e-5, 2],
      [-9e-5, 0],
      [-7e-5, 0],
      [-1e-5, 2],
      [-2e-5, 2],
      [-2e-5, 2],
      [-4e-5, 0],
      [-3e-5, 2],
      [-2e-5, 2],
      [-2e-5, 2],
      [-5e-5, 0],
      [-4e-5, 0],
      [-2e-5, 2],
      [0.0002, 1],
      [-2e-5, 2],
      [-4e-5, 0],
      [-2e-5, 2]
    ],
    "red_o_points": [],
    "y_categories": ["N", "NOT APPLICABLE", "nan"],
    "blue_o_points": [],
    "blue_x_points": [
      [0.00038, 1],
      [-1e-5, 2],
      [-4e-5, 0],
      [-4e-5, 0],
      [-1e-5, 2],
      [0.0002, 1],
      [0.0002, 1],
      [-2e-5, 2],
      [-2e-5, 2],
      [-7e-5, 0],
      [0.0002, 1],
      [-2e-5, 2],
      [0.0002, 1],
      [-2e-5, 2]
    ]
  },
  "QS_mulGraftNerve[MCF]": {
    "red_x_points": [
      [4e-5, 2],
      [-8e-5, 0],
      [-6e-5, 0],
      [-2e-5, 0],
      [-9e-5, 0],
      [-0.00012, 0],
      [-9e-5, 0],
      [-3e-5, 2],
      [-4e-5, 0],
      [-8e-5, 0],
      [4e-5, 2],
      [-0.00012, 0],
      [-3e-5, 2],
      [-9e-5, 0],
      [-8e-5, 0],
      [4e-5, 2],
      [2e-5, 2],
      [2e-5, 2],
      [-0.00012, 0],
      [4e-5, 2],
      [-1e-5, 2],
      [-4e-5, 2],
      [-0.00012, 0],
      [-0.00012, 0],
      [-2e-5, 2],
      [0.00014, 1],
      [-1e-5, 2],
      [-0.00012, 0],
      [-1e-5, 2]
    ],
    "red_o_points": [],
    "y_categories": ["N", "NOT APPLICABLE", "nan"],
    "blue_o_points": [],
    "blue_x_points": [
      [0.00027, 1],
      [-4e-5, 2],
      [-9e-5, 0],
      [4e-5, 2],
      [0.00046, 1],
      [0.00013, 1],
      [-4e-5, 0],
      [-1e-5, 2],
      [-0.0, 2],
      [0.00013, 1],
      [4e-5, 2],
      [0.00027, 1],
      [-0.0, 2]
    ]
  },
  "QA_lstPexArthre[Index]": {
    "red_x_points": [
      [-0.00833, 0],
      [-0.00399, 2],
      [-0.00304, 2],
      [-0.00535, 0],
      [-0.00714, 0],
      [0.00626, 1],
      [-0.0068, 0],
      [0.00047, 2],
      [0.00739, 1],
      [-0.00951, 0],
      [0.00226, 1],
      [-0.00516, 2],
      [0.00018, 2],
      [0.00687, 1],
      [-0.00297, 2],
      [0.00278, 1],
      [-0.00791, 0],
      [0.00204, 1],
      [-0.00329, 2],
      [-0.00838, 0],
      [0.00025, 2],
      [0.00025, 2],
      [-0.00541, 2],
      [-0.00441, 2],
      [0.00229, 1],
      [-0.00084, 2],
      [0.00032, 2],
      [-0.0056, 0],
      [0.00032, 2]
    ],
    "red_o_points": [],
    "y_categories": ["NPV", "PV", "nan"],
    "blue_o_points": [],
    "blue_x_points": [
      [0.00041, 0],
      [0.00041, 2],
      [0.01092, 1],
      [0.01008, 1],
      [0.00178, 2],
      [-0.00019, 2],
      [0.00168, 1],
      [0.00935, 1],
      [0.0009, 2],
      [0.0007, 2],
      [0.01017, 1],
      [0.00154, 1],
      [0.00359, 1],
      [-0.00016, 2],
      [0.0053, 1]
    ]
  },
  "QS_mulTransfSite[IMc]": {
    "red_x_points": [
      [-0.00087, 3],
      [-0.01495, 2],
      [-0.00216, 0],
      [-0.01359, 2],
      [-0.00234, 0],
      [-0.00252, 0],
      [-0.00235, 0],
      [-0.00108, 3],
      [-0.00239, 0],
      [-0.00242, 0],
      [-0.00078, 3],
      [-0.00254, 0],
      [-0.00123, 3],
      [-0.00312, 0],
      [-0.01454, 2],
      [-0.00087, 3],
      [-0.00089, 3],
      [-0.00067, 3],
      [-0.00283, 0],
      [-0.00084, 3],
      [-0.00111, 3],
      [-0.0011, 3],
      [-0.00245, 0],
      [-0.01567, 2],
      [-0.00095, 3],
      [0.01512, 1],
      [-0.00098, 3],
      [-0.01432, 2],
      [-0.00135, 3]
    ],
    "red_o_points": [],
    "y_categories": ["N", "NOT APPLICABLE", "Y", "nan"],
    "blue_o_points": [],
    "blue_x_points": [
      [0.02724, 1],
      [-0.00075, 3],
      [-0.00062, 0],
      [-0.00075, 0],
      [-0.00025, 3],
      [0.02191, 1],
      [0.01685, 1],
      [-0.00166, 0],
      [-0.00052, 3],
      [-0.00052, 3],
      [-0.00082, 0],
      [0.0185, 1],
      [-0.00048, 3],
      [0.01831, 1],
      [-0.00063, 3]
    ]
  },
  "QS_mulLysisRoot[C7]": {
    "red_x_points": [
      [-0.00017, 3],
      [-0.00122, 0],
      [-0.00399, 2],
      [-0.00085, 0],
      [-0.00078, 0],
      [-0.00074, 0],
      [-0.00092, 0],
      [-0.00024, 3],
      [-0.00083, 0],
      [-0.00077, 0],
      [-0.00021, 3],
      [-0.00056, 0],
      [-0.0003, 3],
      [-0.00091, 0],
      [-0.00105, 0],
      [-0.00019, 3],
      [-0.00017, 3],
      [-0.00019, 3],
      [-0.00075, 0],
      [-0.00021, 3],
      [-0.00025, 3],
      [-0.00027, 3],
      [-0.0008, 0],
      [-0.00079, 0],
      [-0.00017, 3],
      [0.00315, 1],
      [-0.00018, 3],
      [-0.00066, 0],
      [-0.00017, 3]
    ],
    "red_o_points": [],
    "y_categories": ["N", "NOT APPLICABLE", "Y", "nan"],
    "blue_o_points": [],
    "blue_x_points": [
      [0.00431, 1],
      [-0.00018, 3],
      [-6e-5, 0],
      [-0.00067, 0],
      [-4e-5, 3],
      [0.00347, 1],
      [0.00295, 1],
      [-0.00075, 0],
      [-0.00024, 3],
      [-1e-5, 3],
      [-0.0004, 0],
      [0.00356, 1],
      [-0.00019, 3],
      [0.00359, 1],
      [-0.00014, 3]
    ]
  },
  "QS_mulGraftLevel[other]": {
    "red_x_points": [
      [-2e-5, 2],
      [-4e-5, 0],
      [-3e-5, 0],
      [-3e-5, 0],
      [-3e-5, 0],
      [-3e-5, 0],
      [-2e-5, 0],
      [-1e-5, 2],
      [-2e-5, 0],
      [-4e-5, 0],
      [-4e-5, 0],
      [-1e-5, 2],
      [-2e-5, 0],
      [-1e-5, 2],
      [-1e-5, 2],
      [-1e-5, 2],
      [-3e-5, 0],
      [-2e-5, 2],
      [-1e-5, 2],
      [-2e-5, 2],
      [-4e-5, 0],
      [-3e-5, 0],
      [-1e-5, 2],
      [9e-5, 1],
      [-3e-5, 0],
      [-2e-5, 2]
    ],
    "red_o_points": [],
    "y_categories": ["N", "NOT APPLICABLE", "nan"],
    "blue_o_points": [],
    "blue_x_points": [
      [0.00027, 1],
      [-1e-5, 2],
      [-3e-5, 0],
      [9e-5, 1],
      [-3e-5, 0],
      [-1e-5, 2],
      [-1e-5, 2],
      [-3e-5, 0],
      [9e-5, 1],
      [-1e-5, 2],
      [9e-5, 1],
      [-1e-5, 2]
    ]
  },
  "QS_mulGraftRoot[C4]": {
    "red_x_points": [
      [-2e-5, 2],
      [-3e-5, 0],
      [-3e-5, 0],
      [-3e-5, 0],
      [-3e-5, 0],
      [-2e-5, 2],
      [-3e-5, 0],
      [-3e-5, 0],
      [-2e-5, 2],
      [-3e-5, 0],
      [-2e-5, 2],
      [-3e-5, 0],
      [-3e-5, 0],
      [-2e-5, 2],
      [-2e-5, 2],
      [-2e-5, 2],
      [-2e-5, 2],
      [-2e-5, 2],
      [-3e-5, 0],
      [-2e-5, 2],
      [0.0001, 1],
      [-3e-5, 0],
      [-2e-5, 2]
    ],
    "red_o_points": [],
    "y_categories": ["N", "NOT APPLICABLE", "nan"],
    "blue_o_points": [],
    "blue_x_points": [
      [0.0001, 1],
      [-3e-5, 0],
      [-3e-5, 0],
      [-2e-5, 2],
      [0.0001, 1],
      [0.0001, 1],
      [-2e-5, 2],
      [-2e-5, 2],
      [-3e-5, 0],
      [0.0001, 1],
      [-2e-5, 2],
      [0.0001, 1]
    ]
  },
  "QS_mulLysisRoot[C6]": {
    "red_x_points": [
      [-0.00075, 3],
      [-0.0039, 0],
      [-0.01048, 2],
      [-0.00274, 0],
      [-0.00322, 0],
      [-0.00254, 0],
      [-0.00304, 0],
      [-0.0008, 3],
      [-0.00295, 0],
      [-0.00236, 0],
      [-0.00063, 3],
      [-0.00301, 0],
      [-0.00094, 3],
      [-0.00422, 0],
      [-0.00383, 0],
      [-0.00084, 3],
      [-0.00047, 3],
      [-0.00062, 3],
      [-0.00262, 0],
      [-0.00056, 3],
      [-0.00078, 3],
      [-0.00079, 3],
      [-0.00327, 0],
      [-0.00299, 0],
      [-0.00093, 3],
      [0.01134, 1],
      [-0.001, 3],
      [-0.00898, 2],
      [-0.00086, 3]
    ],
    "red_o_points": [],
    "y_categories": ["N", "NOT APPLICABLE", "Y", "nan"],
    "blue_o_points": [],
    "blue_x_points": [
      [0.01796, 1],
      [-0.00062, 3],
      [-0.00147, 0],
      [-0.00158, 0],
      [1e-5, 3],
      [0.01473, 1],
      [0.01095, 1],
      [-0.00218, 0],
      [-0.00059, 3],
      [-0.00021, 3],
      [-0.0015, 0],
      [0.01222, 1],
      [-0.00052, 3],
      [0.01199, 1],
      [-0.0004, 3]
    ]
  },
  "QS_mulTransfSite[AcMc]": {
    "red_x_points": [
      [-0.0004, 3],
      [-0.00197, 0],
      [-0.00148, 0],
      [-0.00136, 0],
      [-0.00148, 0],
      [-0.0012, 0],
      [-0.00144, 0],
      [-0.00038, 3],
      [-0.00164, 0],
      [-0.01015, 2],
      [-0.00035, 3],
      [-0.00154, 0],
      [-0.00033, 3],
      [-0.00174, 0],
      [-0.00195, 0],
      [-0.00057, 3],
      [-0.00031, 3],
      [-0.00045, 3],
      [-0.00131, 0],
      [-0.00054, 3],
      [-0.00041, 3],
      [-0.00045, 3],
      [-0.00136, 0],
      [-0.00157, 0],
      [-0.00027, 3],
      [0.00409, 1],
      [-0.00029, 3],
      [-0.00136, 0],
      [-0.00042, 3]
    ],
    "red_o_points": [],
    "y_categories": ["N", "NOT APPLICABLE", "Y", "nan"],
    "blue_o_points": [],
    "blue_x_points": [
      [0.00783, 1],
      [-0.00025, 3],
      [0.00105, 0],
      [0.00107, 0],
      [-8e-5, 3],
      [0.00659, 1],
      [0.00509, 1],
      [-0.0013, 0],
      [-0.00018, 3],
      [-8e-5, 3],
      [0.00124, 0],
      [0.00645, 1],
      [-0.00018, 3],
      [0.00587, 1],
      [-0.00053, 3]
    ]
  },
  "QS_mulTransfSite[Other]": {
    "red_x_points": [
      [-0.00131, 3],
      [-0.00913, 0],
      [-0.00798, 0],
      [-0.00803, 0],
      [-0.00758, 0],
      [-0.00762, 0],
      [-0.00789, 0],
      [-0.00153, 3],
      [-0.00832, 0],
      [-0.00796, 0],
      [-0.00129, 3],
      [-0.00836, 0],
      [-0.00149, 3],
      [-0.00946, 0],
      [-0.00834, 0],
      [-0.00132, 3],
      [-0.00141, 3],
      [-0.00105, 3],
      [-0.0072, 0],
      [-0.00122, 3],
      [-0.0014, 3],
      [-0.00127, 3],
      [-0.00827, 0],
      [-0.00768, 0],
      [-0.00133, 3],
      [0.01719, 1],
      [-0.00131, 3],
      [-0.00783, 0],
      [-0.00143, 3]
    ],
    "red_o_points": [],
    "y_categories": ["N", "NOT APPLICABLE", "Y", "nan"],
    "blue_o_points": [],
    "blue_x_points": [
      [0.02849, 1],
      [-0.00112, 3],
      [-0.00729, 0],
      [-0.00732, 0],
      [-0.00054, 3],
      [0.02217, 1],
      [0.01832, 1],
      [-0.00612, 0],
      [-0.00096, 3],
      [-0.00086, 3],
      [0.03759, 2],
      [0.02059, 1],
      [-0.00076, 3],
      [0.02056, 1],
      [-0.00093, 3]
    ]
  },
  "QA_yonInjBpsurg": {
    "red_x_points": [
      [-0.00091, 1],
      [-0.00066, 1],
      [-0.00045, 1],
      [-0.00069, 1],
      [-0.00065, 1],
      [-0.00044, 1],
      [-0.00068, 1],
      [-0.00067, 1],
      [-0.00079, 1],
      [-0.00064, 1],
      [-0.00062, 1],
      [-0.00064, 1],
      [-0.00083, 1],
      [-0.00081, 1],
      [-0.00052, 1],
      [-0.00076, 1],
      [-0.0006, 1],
      [-0.0007, 1],
      [-0.00043, 1],
      [-0.00073, 1],
      [-0.00082, 1],
      [-0.00077, 1],
      [-0.00059, 1],
      [-0.00064, 1],
      [-0.00072, 1],
      [0.0029, 0],
      [-0.00073, 1],
      [-0.00052, 1],
      [-0.00077, 1]
    ],
    "red_o_points": [],
    "y_categories": ["N", "Y", "nan"],
    "blue_o_points": [],
    "blue_x_points": [
      [0.00638, 0],
      [-0.00053, 1],
      [-0.00078, 1],
      [-0.00079, 1],
      [-0.0006, 1],
      [0.00376, 0],
      [0.0036, 0],
      [-0.00073, 1],
      [-0.0005, 1],
      [-0.00041, 1],
      [-0.00069, 1],
      [0.0044, 0],
      [-0.0005, 1],
      [0.00373, 0],
      [-0.00045, 1]
    ]
  },
  "QA_lstPexTouch[C8]": {
    "red_x_points": [
      [-0.00205, 1],
      [-0.00507, 2],
      [-0.00244, 1],
      [-0.00239, 1],
      [-0.00666, 2],
      [-0.00462, 1],
      [-0.00374, 1],
      [-0.00294, 0],
      [-0.00602, 1],
      [0.01138, 0],
      [-0.00127, 1],
      [-0.00895, 2],
      [-0.00217, 2],
      [-0.00779, 2],
      [-0.00388, 2],
      [-0.00219, 0],
      [-0.00189, 1],
      [-0.00212, 0],
      [-0.00481, 2],
      [-0.00194, 0],
      [-0.00128, 2],
      [-0.00543, 0],
      [-0.00545, 1],
      [-0.00937, 2],
      [-0.00311, 0],
      [-0.00568, 1],
      [-0.00137, 2],
      [-0.0021, 1],
      [-0.00123, 1]
    ],
    "red_o_points": [],
    "y_categories": ["NORM", "NPV", "nan"],
    "blue_o_points": [],
    "blue_x_points": [
      [0.00392, 0],
      [0.00605, 1],
      [0.02062, 0],
      [0.02318, 0],
      [0.00471, 2],
      [0.00085, 2],
      [-0.00023, 1],
      [-0.00173, 1],
      [0.00866, 1],
      [0.00544, 2],
      [0.01841, 0],
      [-0.00049, 1],
      [0.00021, 0],
      [0.0029, 0],
      [0.00409, 0]
    ]
  },
  "QS_mulNeuromadSite[T1]": {
    "red_x_points": [
      [-4e-5, 2],
      [-0.00074, 0],
      [-0.00062, 0],
      [-0.00087, 0],
      [-0.00079, 0],
      [-0.00079, 0],
      [-0.00089, 0],
      [-0.00024, 2],
      [-0.00078, 0],
      [-0.00091, 0],
      [-0.00023, 2],
      [-0.00091, 0],
      [-0.00019, 2],
      [-0.00107, 0],
      [-0.00107, 0],
      [-0.00022, 2],
      [-4e-5, 2],
      [-0.0001, 2],
      [-0.00068, 0],
      [-7e-5, 2],
      [-0.00015, 2],
      [-0.00017, 2],
      [-0.00087, 0],
      [-0.00074, 0],
      [-0.00025, 2],
      [0.00189, 1],
      [-0.00016, 2],
      [-0.00055, 0],
      [-0.00018, 2]
    ],
    "red_o_points": [],
    "y_categories": ["N", "NOT APPLICABLE", "nan"],
    "blue_o_points": [],
    "blue_x_points": [
      [0.00382, 1],
      [-0.00012, 2],
      [-0.00046, 0],
      [-0.00029, 0],
      [4e-5, 2],
      [0.0032, 1],
      [0.00206, 1],
      [-0.00066, 0],
      [-8e-5, 2],
      [-6e-5, 2],
      [-0.00053, 0],
      [0.00243, 1],
      [-0.00011, 2],
      [0.00322, 1],
      [-6e-5, 2]
    ]
  },
  "QS_mulBpsurgeryType[Graft]": {
    "red_x_points": [
      [-0.00016, 3],
      [-0.0013, 0],
      [-0.00109, 0],
      [-0.00095, 0],
      [-0.00103, 0],
      [-0.00116, 0],
      [-0.00085, 0],
      [-0.00029, 3],
      [-0.00112, 0],
      [-0.00107, 0],
      [-0.0002, 3],
      [-0.00092, 0],
      [-0.0003, 3],
      [-0.00511, 2],
      [-0.00126, 0],
      [-0.00023, 3],
      [-0.00011, 3],
      [-0.0002, 3],
      [-0.00086, 0],
      [-0.00011, 3],
      [-0.00023, 3],
      [-0.00027, 3],
      [-0.00087, 0],
      [-0.00112, 0],
      [-0.0004, 3],
      [0.00353, 1],
      [-0.00032, 3],
      [-0.00116, 0],
      [-0.00025, 3]
    ],
    "red_o_points": [],
    "y_categories": ["N", "NOT APPLICABLE", "Y", "nan"],
    "blue_o_points": [],
    "blue_x_points": [
      [0.00524, 1],
      [-0.00024, 3],
      [-0.00049, 0],
      [-0.00073, 0],
      [1e-5, 3],
      [0.00447, 1],
      [0.00392, 1],
      [-0.00047, 0],
      [-5e-5, 3],
      [-7e-5, 3],
      [-0.00063, 0],
      [0.0048, 1],
      [-0.00016, 3],
      [0.00394, 1],
      [-0.00018, 3]
    ]
  },
  "QS_mulNeuromadSite[T2]": {
    "red_x_points": [
      [-0.00017, 2],
      [-0.00173, 0],
      [-0.00111, 0],
      [-0.00128, 0],
      [-0.00115, 0],
      [-0.00136, 0],
      [-0.00137, 0],
      [-0.00026, 2],
      [-0.00147, 0],
      [-0.0013, 0],
      [-0.0002, 2],
      [-0.00147, 0],
      [-0.00031, 2],
      [-0.00167, 0],
      [-0.00136, 0],
      [-0.00016, 2],
      [-8e-5, 2],
      [-0.00016, 2],
      [-0.0013, 0],
      [-0.00016, 2],
      [-0.00029, 2],
      [-0.0003, 2],
      [-0.00123, 0],
      [-0.00148, 0],
      [-0.00028, 2],
      [0.00355, 1],
      [-0.00026, 2],
      [-0.00123, 0],
      [-0.00035, 2]
    ],
    "red_o_points": [],
    "y_categories": ["N", "NOT APPLICABLE", "nan"],
    "blue_o_points": [],
    "blue_x_points": [
      [0.00673, 1],
      [-0.00016, 2],
      [-0.00109, 0],
      [-0.00116, 0],
      [-5e-5, 2],
      [0.00528, 1],
      [0.00346, 1],
      [-0.00092, 0],
      [-0.00022, 2],
      [-0.00014, 2],
      [-0.00089, 0],
      [0.00445, 1],
      [-6e-5, 2],
      [0.00487, 1],
      [-0.00013, 2]
    ]
  },
  "QA_lstPexMuscstrength[WristExte]": {
    "red_x_points": [
      [-0.00549, 1],
      [-0.00487, 2],
      [-0.00523, 1],
      [-0.00469, 1],
      [-0.00648, 1],
      [-0.00556, 1],
      [-0.00584, 1],
      [-0.00047, 0],
      [0.00687, 0],
      [-0.00746, 1],
      [0.0008, 0],
      [0.00646, 0],
      [-0.00254, 2],
      [-0.00577, 2],
      [-0.00305, 2],
      [-3e-5, 0],
      [-0.00133, 1],
      [-0.00107, 0],
      [-0.00502, 1],
      [-0.00601, 1],
      [-0.00264, 2],
      [-0.00548, 1],
      [0.00568, 0],
      [0.00605, 0],
      [-0.00193, 2],
      [-0.00092, 2],
      [-0.00343, 1],
      [-0.00377, 1],
      [-0.00245, 2]
    ],
    "red_o_points": [],
    "y_categories": ["GREATER THAN OR EQUALS TO 3", "LESS THAN 3", "nan"],
    "blue_o_points": [],
    "blue_x_points": [
      [0.00313, 0],
      [0.00208, 1],
      [0.00843, 0],
      [0.00991, 0],
      [0.00121, 2],
      [-0.00027, 2],
      [0.00097, 0],
      [0.00851, 0],
      [0.01376, 0],
      [0.00053, 2],
      [0.00697, 0],
      [-0.00025, 1],
      [0.00603, 0],
      [0.0023, 0],
      [0.00238, 1]
    ]
  },
  "QS_mulNeuromadSite[C6]": {
    "red_x_points": [
      [-0.00015, 2],
      [-0.00055, 0],
      [-0.00052, 0],
      [-0.00056, 0],
      [-0.00064, 0],
      [-0.0004, 0],
      [-0.00063, 0],
      [-0.00011, 2],
      [-0.00064, 0],
      [-0.00062, 0],
      [-0.00019, 2],
      [-0.00066, 0],
      [-5e-5, 2],
      [-0.00091, 0],
      [-0.00077, 0],
      [-0.00014, 2],
      [-9e-5, 2],
      [-8e-5, 2],
      [-0.00045, 0],
      [-0.0001, 2],
      [-4e-5, 2],
      [-8e-5, 2],
      [-0.00044, 0],
      [-0.00061, 0],
      [-8e-5, 2],
      [0.00139, 1],
      [-0.00014, 2],
      [-0.00055, 0],
      [-0.00013, 2]
    ],
    "red_o_points": [],
    "y_categories": ["N", "NOT APPLICABLE", "nan"],
    "blue_o_points": [],
    "blue_x_points": [
      [0.00306, 1],
      [-6e-5, 2],
      [-0.00037, 0],
      [-0.00037, 0],
      [-4e-5, 2],
      [0.00191, 1],
      [0.002, 1],
      [-0.00046, 0],
      [-6e-5, 2],
      [-1e-5, 2],
      [-0.00033, 0],
      [0.00174, 1],
      [-0.00011, 2],
      [0.00205, 1],
      [-3e-5, 2]
    ]
  },
  "QA_lstPexPalle[Clavicle]": {
    "red_x_points": [
      [-0.00019, 3],
      [-0.00189, 3],
      [-0.00104, 3],
      [0.00067, 2],
      [-0.002, 3],
      [0.00215, 2],
      [-0.00174, 3],
      [0.0, 3],
      [-0.00254, 3],
      [0.00276, 2],
      [-0.01258, 0],
      [-0.00238, 3],
      [-0.00012, 3],
      [-0.00245, 3],
      [-0.00066, 3],
      [-0.01444, 0],
      [-0.01212, 0],
      [0.00985, 2],
      [-0.00342, 1],
      [-0.01348, 1],
      [-9e-5, 3],
      [-8e-5, 3],
      [-0.00268, 3],
      [-0.00303, 3],
      [-0.00025, 3],
      [-0.02337, 2],
      [1e-5, 3],
      [-0.00039, 0],
      [-0.00023, 3]
    ],
    "red_o_points": [],
    "y_categories": ["HYPO", "NAIA", "PT", "nan"],
    "blue_o_points": [],
    "blue_x_points": [
      [0.00426, 3],
      [0.00068, 3],
      [0.00607, 2],
      [0.00628, 2],
      [0.0009, 3],
      [0.00467, 3],
      [0.00577, 0],
      [-0.00141, 3],
      [0.00066, 3],
      [0.00048, 3],
      [0.01038, 0],
      [0.00422, 3],
      [0.01737, 2],
      [0.00441, 3],
      [0.02099, 2]
    ]
  },
  "QS_mulGraftNerve[LT]": {
    "red_x_points": [
      [-1e-5, 2],
      [-7e-5, 0],
      [-2e-5, 0],
      [-7e-5, 0],
      [-7e-5, 0],
      [-7e-5, 0],
      [-5e-5, 0],
      [-1e-5, 2],
      [-7e-5, 0],
      [-5e-5, 0],
      [-1e-5, 2],
      [-7e-5, 0],
      [2e-5, 2],
      [-0.00014, 0],
      [-0.00014, 0],
      [-1e-5, 2],
      [-1e-5, 2],
      [0.0, 2],
      [-5e-5, 0],
      [-1e-5, 2],
      [2e-5, 2],
      [-0.0, 2],
      [-7e-5, 0],
      [-5e-5, 0],
      [-1e-5, 2],
      [0.0002, 1],
      [0.0, 2],
      [-2e-5, 0],
      [-0.0, 2]
    ],
    "red_o_points": [],
    "y_categories": ["N", "NOT APPLICABLE", "nan"],
    "blue_o_points": [],
    "blue_x_points": [
      [9e-5, 1],
      [-1e-5, 2],
      [-4e-5, 0],
      [-7e-5, 0],
      [2e-5, 2],
      [0.0002, 1],
      [0.00022, 1],
      [-7e-5, 0],
      [-0.0, 2],
      [2e-5, 2],
      [-7e-5, 0],
      [0.0003, 1],
      [-1e-5, 2],
      [0.00021, 1],
      [-0.0, 2]
    ]
  },
  "QA_lstPexMuscstrength[ShoulderAbduc]": {
    "red_x_points": [
      [-0.00054, 1],
      [-0.00047, 1],
      [-0.0003, 1],
      [-0.00036, 1],
      [-0.00053, 1],
      [-0.00035, 1],
      [-0.00043, 1],
      [-0.00055, 1],
      [-0.00057, 1],
      [-0.00047, 1],
      [-0.00035, 1],
      [-0.00039, 1],
      [0.0003, 2],
      [0.00057, 2],
      [0.00015, 2],
      [-0.00033, 1],
      [-0.00036, 1],
      [-0.00052, 1],
      [-0.00035, 1],
      [0.00031, 2],
      [0.00021, 2],
      [-0.00037, 1],
      [-0.00046, 1],
      [-0.00036, 1],
      [-0.00052, 1],
      [0.00055, 2],
      [-0.0005, 1],
      [-0.00035, 1],
      [0.00055, 2]
    ],
    "red_o_points": [],
    "y_categories": ["GREATER THAN OR EQUALS TO 3", "LESS THAN 3", "nan"],
    "blue_o_points": [],
    "blue_x_points": [
      [0.00036, 2],
      [-0.00036, 1],
      [-0.00039, 1],
      [-0.00039, 1],
      [0.00059, 2],
      [0.00033, 2],
      [0.00252, 0],
      [0.00059, 2],
      [0.00054, 2],
      [0.00056, 2],
      [-0.00034, 1],
      [0.00345, 0],
      [-0.00034, 1],
      [-0.0001, 1],
      [-0.00021, 1]
    ]
  },
  "QA_yonInjPhysio": {
    "red_x_points": [
      [-0.00722, 0],
      [0.00058, 0],
      [0.00028, 0],
      [0.00019, 0],
      [-0.00213, 2],
      [0.00028, 0],
      [0.0006, 0],
      [-0.00581, 0],
      [0.00071, 0],
      [-0.00546, 1],
      [-0.00544, 0],
      [0.00082, 0],
      [-0.00641, 0],
      [-0.00379, 1],
      [-0.00128, 1],
      [0.00254, 1],
      [-0.0061, 0],
      [0.00386, 1],
      [0.00046, 0],
      [-0.00542, 0],
      [0.00308, 1],
      [0.00439, 1],
      [0.0009, 0],
      [-0.0083, 1],
      [-0.00826, 2],
      [-0.01188, 1],
      [-0.00763, 2],
      [0.00021, 0],
      [0.00485, 1]
    ],
    "red_o_points": [],
    "y_categories": ["N", "Y", "nan"],
    "blue_o_points": [],
    "blue_x_points": [
      [0.00434, 0],
      [0.00638, 1],
      [0.00535, 0],
      [0.00635, 0],
      [0.00761, 1],
      [0.00449, 0],
      [0.00281, 0],
      [0.00136, 0],
      [-0.001, 0],
      [0.00614, 1],
      [0.00377, 0],
      [0.0027, 0],
      [0.0065, 1],
      [-0.00199, 1],
      [0.00657, 1]
    ]
  },
  "QA_lstPexTouch[C7]": {
    "red_x_points": [
      [-0.00214, 1],
      [-0.00727, 2],
      [-0.00271, 1],
      [-0.00308, 1],
      [-0.00882, 2],
      [-0.00487, 1],
      [-0.00429, 1],
      [-0.00279, 0],
      [-0.00596, 1],
      [-0.00615, 1],
      [-0.00153, 1],
      [-0.01063, 2],
      [-0.00168, 2],
      [-0.00968, 2],
      [-0.00528, 2],
      [-0.00181, 0],
      [-0.00145, 1],
      [-0.00196, 0],
      [-0.0066, 2],
      [-0.0021, 0],
      [-0.00171, 2],
      [-0.00425, 0],
      [-0.00558, 1],
      [-0.00973, 2],
      [-0.00329, 0],
      [-0.00289, 1],
      [-0.00062, 2],
      [-0.0024, 1],
      [-0.00021, 1]
    ],
    "red_o_points": [],
    "y_categories": ["NORM", "NPV", "nan"],
    "blue_o_points": [],
    "blue_x_points": [
      [4e-5, 1],
      [0.00509, 1],
      [0.03051, 0],
      [0.03496, 0],
      [0.00544, 2],
      [0.0002, 2],
      [2e-5, 1],
      [-0.00192, 1],
      [0.00674, 1],
      [0.00534, 2],
      [0.02853, 0],
      [6e-5, 1],
      [0.00021, 0],
      [0.00272, 0],
      [0.00355, 0]
    ]
  },
  "QS_lstBpsurgSide": {
    "red_x_points": [
      [-0.00084, 3],
      [-0.01032, 0],
      [-0.00988, 0],
      [-0.00915, 0],
      [-0.01067, 0],
      [-0.01009, 0],
      [-0.0097, 0],
      [-0.00117, 3],
      [-0.01128, 0],
      [-0.0003, 2],
      [-0.00107, 3],
      [-0.00042, 2],
      [-0.00137, 3],
      [-0.00075, 2],
      [-0.00196, 2],
      [-0.00104, 3],
      [-0.00092, 3],
      [-0.00096, 3],
      [-0.00795, 0],
      [-0.00081, 3],
      [-0.00119, 3],
      [-0.00113, 3],
      [-0.0002, 2],
      [0.00014, 2],
      [-0.00111, 3],
      [0.01365, 1],
      [-0.00119, 3],
      [-0.00843, 0],
      [-0.00106, 3]
    ],
    "red_o_points": [],
    "y_categories": ["L", "NOT APPLICABLE", "R", "nan"],
    "blue_o_points": [],
    "blue_x_points": [
      [0.02357, 1],
      [-0.00087, 3],
      [0.00332, 2],
      [0.00415, 2],
      [-0.0002, 3],
      [0.01691, 1],
      [0.01303, 1],
      [-0.00294, 0],
      [-0.00071, 3],
      [-0.00033, 3],
      [0.00248, 2],
      [0.01667, 1],
      [-0.00068, 3],
      [0.01744, 1],
      [-0.00066, 3]
    ]
  },
  "QS_mulGraftNerve[IS]": {
    "red_x_points": [
      [1e-5, 2],
      [-6e-5, 0],
      [-6e-5, 0],
      [-6e-5, 0],
      [-6e-5, 0],
      [-6e-5, 0],
      [1e-5, 2],
      [-6e-5, 0],
      [-3e-5, 0],
      [-6e-5, 0],
      [1e-5, 2],
      [-6e-5, 0],
      [-6e-5, 0],
      [1e-5, 2],
      [1e-5, 2],
      [1e-5, 2],
      [-6e-5, 0],
      [-0.0, 2],
      [-0.0, 2],
      [1e-5, 2],
      [-3e-5, 0],
      [-6e-5, 0],
      [1e-5, 2],
      [0.00018, 1],
      [-0.0, 2],
      [-6e-5, 0],
      [-0.0, 2]
    ],
    "red_o_points": [],
    "y_categories": ["N", "NOT APPLICABLE", "nan"],
    "blue_o_points": [],
    "blue_x_points": [
      [0.00018, 1],
      [1e-5, 2],
      [-6e-5, 0],
      [-6e-5, 0],
      [-0.0, 2],
      [0.00018, 1],
      [9e-5, 1],
      [-3e-5, 0],
      [1e-5, 2],
      [1e-5, 2],
      [-3e-5, 0],
      [9e-5, 1],
      [1e-5, 2],
      [0.00018, 1],
      [1e-5, 2]
    ]
  },
  "QS_mulGraftLevel[Root]": {
    "red_x_points": [
      [1e-5, 2],
      [-5e-5, 0],
      [-5e-5, 0],
      [-5e-5, 0],
      [-5e-5, 0],
      [-5e-5, 0],
      [-5e-5, 0],
      [-5e-5, 0],
      [1e-5, 2],
      [-5e-5, 0],
      [-5e-5, 0],
      [1e-5, 2],
      [1e-5, 2],
      [1e-5, 2],
      [-5e-5, 0],
      [1e-5, 2],
      [1e-5, 2],
      [-5e-5, 0],
      [-5e-5, 0],
      [1e-5, 2],
      [0.0001, 1],
      [-5e-5, 0],
      [1e-5, 2]
    ],
    "red_o_points": [],
    "y_categories": ["N", "NOT APPLICABLE", "nan"],
    "blue_o_points": [],
    "blue_x_points": [
      [0.0001, 1],
      [1e-5, 2],
      [-5e-5, 0],
      [1e-5, 2],
      [0.0001, 1],
      [0.0001, 1],
      [1e-5, 2],
      [1e-5, 2],
      [0.0001, 1],
      [1e-5, 2],
      [0.0001, 1],
      [1e-5, 2]
    ]
  },
  "QS_mulGraftNerve[MC]": {
    "red_x_points": [
      [-4e-5, 2],
      [-0.00011, 0],
      [-0.00014, 0],
      [-9e-5, 0],
      [-0.00013, 0],
      [-0.0001, 0],
      [-0.00016, 0],
      [-5e-5, 2],
      [-9e-5, 0],
      [-7e-5, 0],
      [-5e-5, 2],
      [-4e-5, 0],
      [-5e-5, 2],
      [-8e-5, 0],
      [-0.00012, 0],
      [-4e-5, 2],
      [-2e-5, 2],
      [-3e-5, 2],
      [-0.00012, 0],
      [-4e-5, 2],
      [-5e-5, 2],
      [-3e-5, 2],
      [-7e-5, 0],
      [-0.00013, 0],
      [-3e-5, 2],
      [0.00028, 1],
      [-2e-5, 2],
      [-0.0001, 0],
      [-5e-5, 2]
    ],
    "red_o_points": [],
    "y_categories": ["N", "NOT APPLICABLE", "nan"],
    "blue_o_points": [],
    "blue_x_points": [
      [0.00065, 1],
      [-4e-5, 2],
      [-0.00011, 0],
      [-6e-5, 0],
      [-3e-5, 2],
      [0.0005, 1],
      [0.00028, 1],
      [-7e-5, 0],
      [-3e-5, 2],
      [-3e-5, 2],
      [-6e-5, 0],
      [0.00043, 1],
      [-3e-5, 2],
      [0.00041, 1],
      [-2e-5, 2]
    ]
  },
  "QS_mulLysisNerve[Ssr]": {
    "red_x_points": [
      [-0.0003, 3],
      [-0.00332, 0],
      [-0.00926, 2],
      [-0.00895, 2],
      [-0.00285, 0],
      [-0.00247, 0],
      [-0.00282, 0],
      [-0.00076, 3],
      [-0.00296, 0],
      [-0.00241, 0],
      [-0.00037, 3],
      [-0.00289, 0],
      [-0.00074, 3],
      [-0.00322, 0],
      [-0.00311, 0],
      [-0.0004, 3],
      [-0.00034, 3],
      [-0.00039, 3],
      [-0.00251, 0],
      [-0.00024, 3],
      [-0.00069, 3],
      [-0.00065, 3],
      [-0.00285, 0],
      [-0.00278, 0],
      [-0.00061, 3],
      [0.00831, 1],
      [-0.00077, 3],
      [-0.00246, 0],
      [-0.00061, 3]
    ],
    "red_o_points": [],
    "y_categories": ["N", "NOT APPLICABLE", "Y", "nan"],
    "blue_o_points": [],
    "blue_x_points": [
      [0.01655, 1],
      [-0.00013, 3],
      [-0.00179, 0],
      [-0.00185, 0],
      [-0.00013, 3],
      [0.01215, 1],
      [0.01112, 1],
      [-0.00214, 0],
      [-0.00012, 3],
      [-0.00019, 3],
      [-0.00191, 0],
      [0.01101, 1],
      [-0.00032, 3],
      [0.01139, 1],
      [-0.00022, 3]
    ]
  },
  "QS_mulNeuromadSite[C4]": {
    "red_x_points": [
      [-2e-5, 2],
      [-0.00051, 0],
      [-0.00025, 0],
      [-0.00035, 0],
      [-0.00034, 0],
      [-0.00034, 0],
      [-0.00045, 0],
      [-5e-5, 2],
      [-0.00036, 0],
      [-0.00018, 0],
      [-3e-5, 2],
      [-0.00037, 0],
      [-3e-5, 2],
      [-0.00046, 0],
      [-0.00041, 0],
      [1e-5, 2],
      [-0.0, 2],
      [5e-5, 2],
      [-0.00016, 0],
      [-1e-5, 2],
      [-4e-5, 2],
      [-5e-5, 2],
      [-0.00044, 0],
      [-0.00021, 0],
      [-4e-5, 2],
      [0.00086, 1],
      [-7e-5, 2],
      [-0.00025, 0],
      [-4e-5, 2]
    ],
    "red_o_points": [],
    "y_categories": ["N", "NOT APPLICABLE", "nan"],
    "blue_o_points": [],
    "blue_x_points": [
      [0.00192, 1],
      [-1e-5, 2],
      [-0.00017, 0],
      [-0.00019, 0],
      [3e-5, 2],
      [0.00115, 1],
      [0.00046, 1],
      [-0.0002, 0],
      [-1e-5, 2],
      [-2e-5, 2],
      [-0.00013, 0],
      [0.00087, 1],
      [6e-5, 2],
      [0.00073, 1],
      [4e-5, 2]
    ]
  },
  "QS_mulGraftNerve[Ra]": {
    "red_x_points": [
      [-7e-5, 2],
      [-0.00046, 0],
      [-0.0004, 0],
      [-0.0003, 0],
      [-0.00033, 0],
      [-0.00019, 0],
      [-0.0004, 0],
      [-7e-5, 2],
      [-0.00029, 0],
      [-0.00019, 0],
      [-9e-5, 2],
      [-0.00032, 0],
      [-9e-5, 2],
      [-0.00038, 0],
      [-0.00048, 0],
      [-6e-5, 2],
      [-7e-5, 2],
      [-9e-5, 2],
      [-0.00029, 0],
      [-8e-5, 2],
      [-4e-5, 2],
      [-8e-5, 2],
      [-0.0003, 0],
      [-0.00035, 0],
      [-8e-5, 2],
      [0.00103, 1],
      [-7e-5, 2],
      [-0.00016, 0],
      [-0.0001, 2]
    ],
    "red_o_points": [],
    "y_categories": ["N", "NOT APPLICABLE", "nan"],
    "blue_o_points": [],
    "blue_x_points": [
      [0.0014, 1],
      [-1e-5, 2],
      [-0.00016, 0],
      [-0.00022, 0],
      [5e-5, 2],
      [0.00139, 1],
      [0.00076, 1],
      [-0.00031, 0],
      [-2e-5, 2],
      [-2e-5, 2],
      [-0.00026, 0],
      [0.00111, 1],
      [-9e-5, 2],
      [0.00129, 1],
      [-9e-5, 2]
    ]
  },
  "QS_mulTransfSite[Oberlin]": {
    "red_x_points": [
      [-0.00111, 3],
      [-0.01702, 0],
      [-0.01649, 0],
      [-0.01662, 0],
      [-0.0169, 0],
      [0.00257, 2],
      [-0.01657, 0],
      [-0.00148, 3],
      [0.00264, 2],
      [0.00304, 2],
      [-0.00105, 3],
      [0.00223, 2],
      [-0.00162, 3],
      [0.00155, 2],
      [-0.01563, 0],
      [-0.00119, 3],
      [-0.00104, 3],
      [-0.00099, 3],
      [-0.0153, 0],
      [-0.00121, 3],
      [-0.00141, 3],
      [-0.00158, 3],
      [0.0024, 2],
      [-0.01589, 0],
      [-0.00145, 3],
      [0.01793, 1],
      [-0.00149, 3],
      [-0.01591, 0],
      [-0.00129, 3]
    ],
    "red_o_points": [],
    "y_categories": ["N", "NOT APPLICABLE", "Y", "nan"],
    "blue_o_points": [],
    "blue_x_points": [
      [0.03, 1],
      [-0.00093, 3],
      [0.00387, 2],
      [0.00493, 2],
      [-0.00043, 3],
      [0.0237, 1],
      [0.02072, 1],
      [0.00338, 2],
      [-0.0012, 3],
      [-0.00029, 3],
      [0.00404, 2],
      [0.02148, 1],
      [-0.00065, 3],
      [0.02318, 1],
      [-0.00092, 3]
    ]
  },
  "QA_intPexForearmProna": {
    "red_x_points": [
      [-0.00024, 2],
      [-0.00043, 0],
      [-0.00021, 2],
      [-0.00015, 2],
      [-0.00029, 2],
      [-0.00181, 0],
      [-0.00026, 2],
      [-0.01486, 0],
      [-0.00025, 2],
      [-0.00027, 2],
      [-0.01423, 0],
      [-0.00167, 0],
      [-0.00057, 2],
      [-0.00021, 2],
      [-1e-5, 2],
      [-0.0139, 0],
      [-0.01329, 0],
      [-0.01411, 0],
      [-0.00149, 0],
      [-0.00011, 2],
      [-0.00036, 2],
      [-0.00055, 2],
      [-0.00025, 2],
      [-0.00038, 2],
      [8e-5, 2],
      [0.00049, 1],
      [0.00015, 2],
      [-0.00174, 0],
      [-0.00038, 2]
    ],
    "red_o_points": [],
    "y_categories": ["GREATER THAN OR EQUALS TO 80", "LESS THAN 80", "nan"],
    "blue_o_points": [],
    "blue_x_points": [
      [-0.00015, 2],
      [0.04127, 1],
      [-0.00052, 0],
      [-0.00029, 2],
      [0.00068, 2],
      [1e-5, 2],
      [0.00114, 1],
      [4e-5, 2],
      [0.00033, 2],
      [0.00066, 2],
      [-0.00044, 0],
      [3e-5, 2],
      [0.00081, 2],
      [2e-5, 2],
      [0.03772, 1]
    ]
  },
  "QS_mulLysisSite[Nerve]": {
    "red_x_points": [
      [-0.00023, 3],
      [-0.00309, 0],
      [-0.00838, 2],
      [-0.00819, 2],
      [-0.00276, 0],
      [-0.00257, 0],
      [-0.00259, 0],
      [-0.0007, 3],
      [-0.0026, 0],
      [-0.00259, 0],
      [-0.00024, 3],
      [-0.00277, 0],
      [-0.00073, 3],
      [-0.00321, 0],
      [-0.00314, 0],
      [-0.00027, 3],
      [-0.00031, 3],
      [-0.00026, 3],
      [-0.00217, 0],
      [-0.00029, 3],
      [-0.00066, 3],
      [-0.00062, 3],
      [-0.00273, 0],
      [-0.0027, 0],
      [-0.00079, 3],
      [0.00863, 1],
      [-0.00053, 3],
      [-0.0022, 0],
      [-0.00071, 3]
    ],
    "red_o_points": [],
    "y_categories": ["N", "NOT APPLICABLE", "Y", "nan"],
    "blue_o_points": [],
    "blue_x_points": [
      [0.01562, 1],
      [-0.00041, 3],
      [-0.0017, 0],
      [-0.00197, 0],
      [-3e-5, 3],
      [0.01188, 1],
      [0.0085, 1],
      [-0.002, 0],
      [-0.00032, 3],
      [-0.00016, 3],
      [-0.00134, 0],
      [0.01067, 1],
      [-0.00021, 3],
      [0.01116, 1],
      [-0.00026, 3]
    ]
  },
  "QA_yonPexPain": {
    "red_x_points": [
      [-0.0068, 1],
      [-0.00038, 1],
      [-0.00039, 1],
      [-0.0004, 1],
      [-0.00047, 1],
      [-0.00135, 0],
      [-0.00022, 1],
      [-0.00623, 1],
      [-0.00349, 0],
      [-0.00068, 1],
      [-0.00393, 1],
      [-0.00112, 0],
      [-0.00786, 1],
      [-0.00029, 1],
      [-0.00033, 1],
      [0.00512, 0],
      [-0.00428, 1],
      [0.00505, 0],
      [-0.00046, 1],
      [0.00769, 0],
      [-0.01668, 2],
      [-0.0078, 1],
      [0.00015, 1],
      [-0.00055, 1],
      [-0.01269, 2],
      [-0.00126, 1],
      [-0.00752, 1],
      [-0.00022, 1],
      [-0.00827, 1]
    ],
    "red_o_points": [],
    "y_categories": ["N", "Y", "nan"],
    "blue_o_points": [],
    "blue_x_points": [
      [-0.00013, 1],
      [0.01849, 0],
      [0.00316, 0],
      [0.00176, 1],
      [-0.00484, 1],
      [0.00029, 2],
      [4e-5, 1],
      [0.00251, 1],
      [0.02294, 0],
      [0.01821, 0],
      [0.00142, 1],
      [0.00161, 0],
      [0.00995, 0],
      [-0.00013, 1],
      [0.00034, 1]
    ]
  },
  "QS_mulGraftNerve[FI]": {
    "red_x_points": [
      [-8e-5, 2],
      [-0.00045, 0],
      [-0.00032, 0],
      [-0.00039, 0],
      [-0.00024, 0],
      [-0.00029, 0],
      [-0.00034, 0],
      [-0.00023, 2],
      [-0.00043, 0],
      [-0.00025, 0],
      [-5e-5, 2],
      [-0.00031, 0],
      [-0.00014, 2],
      [-0.00046, 0],
      [-0.00029, 0],
      [-0.0002, 2],
      [-6e-5, 2],
      [-0.00014, 2],
      [-0.0002, 0],
      [-0.00014, 2],
      [-0.00014, 2],
      [-0.00011, 2],
      [-0.00032, 0],
      [-0.00035, 0],
      [-0.00023, 2],
      [0.00081, 1],
      [-0.00017, 2],
      [-0.00024, 0],
      [-0.00023, 2]
    ],
    "red_o_points": [],
    "y_categories": ["N", "NOT APPLICABLE", "nan"],
    "blue_o_points": [],
    "blue_x_points": [
      [0.00209, 1],
      [-8e-5, 2],
      [-0.00014, 0],
      [-0.0001, 0],
      [-5e-5, 2],
      [0.00153, 1],
      [0.001, 1],
      [-0.00027, 0],
      [-3e-5, 2],
      [-5e-5, 2],
      [-0.00019, 0],
      [0.00102, 1],
      [-4e-5, 2],
      [0.00132, 1],
      [-6e-5, 2]
    ]
  },
  "QA_lstPexPalle[Ulna]": {
    "red_x_points": [
      [-0.0005, 4],
      [-0.00238, 4],
      [-0.0016, 4],
      [-0.00649, 2],
      [-0.00277, 4],
      [-0.00882, 1],
      [-0.00239, 4],
      [-0.00053, 4],
      [-0.00289, 4],
      [0.00881, 3],
      [-0.00831, 1],
      [-0.00279, 4],
      [-0.00063, 4],
      [-0.00279, 4],
      [-0.00135, 4],
      [0.00358, 3],
      [-0.00839, 0],
      [0.00267, 3],
      [-0.00677, 0],
      [0.00464, 3],
      [-0.00051, 4],
      [-0.00045, 4],
      [-0.0028, 4],
      [-0.00279, 4],
      [-0.00035, 4],
      [0.0022, 3],
      [-0.00024, 4],
      [-0.00607, 0],
      [-0.00047, 4]
    ],
    "red_o_points": [],
    "y_categories": ["ABS", "HYPO", "NAIA", "PT", "nan"],
    "blue_o_points": [],
    "blue_x_points": [
      [-0.00039, 4],
      [-0.00033, 4],
      [0.01376, 3],
      [0.01626, 3],
      [-0.00014, 4],
      [-0.0001, 4],
      [0.00211, 3],
      [-0.00218, 4],
      [-0.00015, 4],
      [0.00013, 4],
      [0.01172, 3],
      [-0.00014, 4],
      [0.00379, 3],
      [-6e-5, 4],
      [0.00692, 3]
    ]
  },
  "QA_yonInjChesttube": {
    "red_x_points": [
      [-0.00181, 2],
      [-0.00199, 2],
      [0.00155, 0],
      [-0.00138, 2],
      [-0.00284, 2],
      [0.0008, 0],
      [-0.00345, 1],
      [-0.00122, 2],
      [-0.00291, 2],
      [-0.00294, 2],
      [0.00087, 0],
      [0.00219, 0],
      [-0.00278, 2],
      [-0.00235, 2],
      [0.00054, 0],
      [0.00084, 0],
      [0.0007, 0],
      [0.00091, 0],
      [-0.00276, 1],
      [-0.00157, 2],
      [-0.01196, 1],
      [-0.00211, 2],
      [-0.00296, 2],
      [0.00242, 0],
      [-0.002, 2],
      [-1e-5, 2],
      [-0.00192, 2],
      [0.00033, 0],
      [-0.00243, 2]
    ],
    "red_o_points": [],
    "y_categories": ["N", "Y", "nan"],
    "blue_o_points": [],
    "blue_x_points": [
      [-0.00068, 2],
      [0.00364, 0],
      [0.00392, 0],
      [-0.00153, 2],
      [0.00548, 0],
      [0.01157, 0],
      [0.0113, 0],
      [0.00299, 0],
      [0.00364, 0],
      [-1e-5, 2],
      [-7e-5, 2]
    ]
  }
}
