{
  "QS_mulLysisTrunk[Upper]": {
    "red_x_points": [
      [-0.00084, 3],
      [-0.00478, 0],
      [-0.00362, 0],
      [-0.00367, 0],
      [-0.004, 0],
      [-0.01363, 2],
      [-0.00399, 0],
      [-0.00126, 3],
      [-0.00419, 0],
      [-0.0036, 0],
      [-0.0008, 3],
      [-0.00391, 0],
      [-0.00114, 3],
      [-0.0048, 0],
      [-0.01365, 2],
      [-0.00108, 3],
      [-0.00092, 3],
      [-0.00091, 3],
      [-0.00377, 0],
      [-0.00087, 3],
      [-0.00093, 3],
      [-0.00117, 3],
      [-0.0039, 0],
      [-0.00372, 0],
      [-0.00108, 3],
      [0.01562, 1],
      [-0.00114, 3],
      [-0.01282, 2],
      [-0.00112, 3]
    ],
    "red_o_points": [],
    "y_categories": ["N", "NOT APPLICABLE", "Y", "nan"],
    "blue_o_points": [],
    "blue_x_points": [
      [0.02423, 1],
      [-0.00086, 3],
      [-0.00283, 0],
      [-0.00236, 0],
      [-0.00018, 3],
      [0.02103, 1],
      [0.01753, 1],
      [-0.0029, 0],
      [-0.00048, 3],
      [-0.00062, 3],
      [-0.00251, 0],
      [0.01889, 1],
      [-0.00057, 3],
      [0.01795, 1],
      [-0.00067, 3]
    ]
  },
  "QS_mulBpsurgeryType[Transf]": {
    "red_x_points": [
      [-0.00029, 3],
      [-0.00128, 2],
      [-0.00418, 0],
      [-0.00104, 2],
      [-0.00113, 2],
      [-0.00104, 2],
      [-0.00115, 2],
      [-0.00039, 3],
      [-0.00114, 2],
      [-0.00104, 2],
      [-0.0002, 3],
      [-0.00115, 2],
      [-0.00032, 3],
      [-0.0012, 2],
      [-0.00107, 2],
      [-0.00024, 3],
      [-0.00026, 3],
      [-0.0002, 3],
      [-0.00115, 2],
      [-0.00028, 3],
      [-0.00038, 3],
      [-0.00035, 3],
      [-0.00111, 2],
      [-0.00105, 2],
      [-0.00035, 3],
      [0.00365, 1],
      [-0.00039, 3],
      [-0.00106, 2],
      [-0.0004, 3]
    ],
    "red_o_points": [],
    "y_categories": ["N", "NOT APPLICABLE", "Y", "nan"],
    "blue_o_points": [],
    "blue_x_points": [
      [0.00575, 1],
      [-0.00024, 3],
      [-0.00036, 2],
      [-0.00096, 2],
      [-0.00013, 3],
      [0.00495, 1],
      [0.00392, 1],
      [-0.00086, 2],
      [-0.00023, 3],
      [-0.00016, 3],
      [-0.00079, 2],
      [0.0044, 1],
      [-0.00013, 3],
      [0.00522, 1],
      [-0.00019, 3]
    ]
  },
  "QS_mulGraftTrunk[MiddleTrunk]": {
    "red_x_points": [
      [-4e-5, 2],
      [-4e-5, 0],
      [-7e-5, 0],
      [-7e-5, 0],
      [-7e-5, 0],
      [-5e-5, 0],
      [-5e-5, 0],
      [-3e-5, 2],
      [-7e-5, 0],
      [-2e-5, 0],
      [-4e-5, 2],
      [-3e-5, 0],
      [-4e-5, 2],
      [-3e-5, 0],
      [-7e-5, 0],
      [-4e-5, 2],
      [-2e-5, 2],
      [-3e-5, 2],
      [-5e-5, 0],
      [-4e-5, 2],
      [-4e-5, 2],
      [-1e-5, 2],
      [-7e-5, 0],
      [-5e-5, 0],
      [-3e-5, 2],
      [0.00028, 1],
      [-3e-5, 2],
      [-7e-5, 0],
      [-1e-5, 2]
    ],
    "red_o_points": [],
    "y_categories": ["N", "NOT APPLICABLE", "nan"],
    "blue_o_points": [],
    "blue_x_points": [
      [0.00043, 1],
      [-2e-5, 2],
      [-7e-5, 0],
      [-2e-5, 0],
      [-3e-5, 2],
      [0.00028, 1],
      [0.00028, 1],
      [-7e-5, 0],
      [-3e-5, 2],
      [-1e-5, 2],
      [-7e-5, 0],
      [0.00019, 1],
      [-1e-5, 2],
      [0.00019, 1],
      [-3e-5, 2]
    ]
  },
  "QS_mulGraftNerve[Me]": {
    "red_x_points": [
      [-1e-5, 2],
      [-0.00018, 0],
      [-0.00015, 0],
      [-9e-5, 0],
      [-0.00012, 0],
      [-0.00012, 0],
      [-0.00013, 0],
      [4e-5, 2],
      [-0.00012, 0],
      [-0.00012, 0],
      [-1e-5, 2],
      [-0.00022, 0],
      [1e-5, 2],
      [-0.00021, 0],
      [-0.00012, 0],
      [-1e-5, 2],
      [-2e-5, 2],
      [-1e-5, 2],
      [-0.00012, 0],
      [-2e-5, 2],
      [-0.0, 2],
      [2e-5, 2],
      [-0.00013, 0],
      [-9e-5, 0],
      [-2e-5, 2],
      [0.00041, 1],
      [2e-5, 2],
      [-0.00012, 0],
      [1e-5, 2]
    ],
    "red_o_points": [],
    "y_categories": ["N", "NOT APPLICABLE", "nan"],
    "blue_o_points": [],
    "blue_x_points": [
      [0.00053, 1],
      [3e-5, 2],
      [-9e-5, 0],
      [-8e-5, 0],
      [1e-5, 2],
      [0.00049, 1],
      [0.00029, 1],
      [-0.00012, 0],
      [2e-5, 2],
      [2e-5, 2],
      [-5e-5, 0],
      [0.00029, 1],
      [-2e-5, 2],
      [0.00032, 1],
      [-2e-5, 2]
    ]
  },
  "QS_mulGraftNerve[Ph]": {
    "red_x_points": [
      [-6e-5, 2],
      [-0.00102, 0],
      [-0.00052, 0],
      [-0.00057, 0],
      [-0.00062, 0],
      [-0.00038, 0],
      [-0.00055, 0],
      [-0.00016, 2],
      [-0.0006, 0],
      [-0.00041, 0],
      [-9e-5, 2],
      [-0.0007, 0],
      [-0.00013, 2],
      [-0.00091, 0],
      [-0.00083, 0],
      [-8e-5, 2],
      [-7e-5, 2],
      [-0.00012, 2],
      [-0.00055, 0],
      [-0.00011, 2],
      [-0.00018, 2],
      [-0.00014, 2],
      [-0.0007, 0],
      [-0.0006, 0],
      [-0.00017, 2],
      [0.00197, 1],
      [-0.00013, 2],
      [-0.00051, 0],
      [-9e-5, 2]
    ],
    "red_o_points": [],
    "y_categories": ["N", "NOT APPLICABLE", "nan"],
    "blue_o_points": [],
    "blue_x_points": [
      [0.00318, 1],
      [-7e-5, 2],
      [-0.0003, 0],
      [-0.00045, 0],
      [2e-5, 2],
      [0.00228, 1],
      [0.00133, 1],
      [-0.00062, 0],
      [-0.00014, 2],
      [-1e-5, 2],
      [-0.00033, 0],
      [0.00239, 1],
      [-0.0001, 2],
      [0.00194, 1],
      [-0.00011, 2]
    ]
  },
  "QA_lstPexMuscstrength[ScapulaElev]": {
    "red_x_points": [
      [-0.00031, 0],
      [-0.00042, 2],
      [-0.0004, 2],
      [-0.00038, 2],
      [-0.00181, 1],
      [0.00046, 0],
      [-0.00068, 2],
      [-0.00311, 1],
      [0.00095, 0],
      [-0.00044, 2],
      [-0.00028, 0],
      [-0.00044, 2],
      [-9e-5, 2],
      [-0.00067, 2],
      [0.00031, 0],
      [-0.00014, 0],
      [-0.00031, 0],
      [-0.00027, 0],
      [-0.00049, 2],
      [0.00029, 2],
      [-0.00021, 2],
      [-0.00016, 2],
      [0.00033, 0],
      [0.00074, 0],
      [-6e-5, 2],
      [-0.0002, 2],
      [-0.0, 2],
      [-0.00129, 1],
      [-0.00016, 2]
    ],
    "red_o_points": [],
    "y_categories": ["GREATER THAN OR EQUALS TO 3", "LESS THAN 3", "nan"],
    "blue_o_points": [],
    "blue_x_points": [
      [-0.00014, 2],
      [6e-5, 2],
      [0.00115, 0],
      [0.00166, 0],
      [0.0002, 2],
      [-0.00037, 2],
      [0.00263, 0],
      [0.00032, 2],
      [0.00158, 0],
      [0.00046, 0],
      [0.00049, 2],
      [0.00079, 0],
      [0.0004, 2]
    ]
  },
  "QA_mulInjOrthesisType[ArmSling]": {
    "red_x_points": [
      [-0.00555, 2],
      [-0.00557, 2],
      [-0.00551, 2],
      [-0.00533, 2],
      [-0.00571, 2],
      [-0.0055, 2],
      [-0.00539, 2],
      [-0.0055, 2],
      [-0.00542, 2],
      [-0.00553, 2],
      [-0.0054, 2],
      [-0.00569, 2],
      [-0.00554, 2],
      [-0.00552, 2],
      [-0.01796, 0],
      [-0.00567, 2],
      [-0.00548, 2],
      [-0.01771, 0],
      [-0.01742, 3],
      [-0.0053, 2],
      [-0.00553, 2],
      [-0.00526, 2],
      [-0.0056, 2],
      [-0.00563, 2],
      [-0.01718, 3],
      [-0.01825, 3],
      [-0.01787, 3],
      [-0.00572, 2],
      [-0.00552, 2]
    ],
    "red_o_points": [],
    "y_categories": ["N", "NOT APPLICABLE", "Y", "nan"],
    "blue_o_points": [],
    "blue_x_points": [
      [-0.00541, 2],
      [-0.00532, 2],
      [-0.00517, 2],
      [-0.00557, 2],
      [0.03597, 1],
      [0.03308, 1],
      [0.03324, 1],
      [0.03355, 1],
      [-0.00545, 2],
      [0.03388, 1],
      [-0.00544, 2],
      [0.03285, 1],
      [0.0343, 1],
      [0.03384, 1],
      [-0.00506, 2]
    ]
  },
  "QA_mulInjOrthesisType[ShoulderSupport]": {
    "red_x_points": [
      [-0.00565, 0],
      [-0.00563, 0],
      [-0.00557, 0],
      [-0.01961, 2],
      [-0.00547, 0],
      [-0.00549, 0],
      [-0.00572, 0],
      [-0.01954, 2],
      [-0.00572, 0],
      [-0.0053, 0],
      [-0.0058, 0],
      [-0.00542, 0],
      [-0.00555, 0],
      [-0.0055, 0],
      [-0.0191, 2],
      [-0.00553, 0],
      [-0.00539, 0],
      [-0.02056, 2],
      [-0.01965, 3],
      [-0.00538, 0],
      [-0.0055, 0],
      [-0.00543, 0],
      [-0.00556, 0],
      [-0.00543, 0],
      [-0.01954, 3],
      [-0.02015, 3],
      [-0.01967, 3],
      [-0.00536, 0],
      [-0.00536, 0]
    ],
    "red_o_points": [],
    "y_categories": ["N", "NOT APPLICABLE", "Y", "nan"],
    "blue_o_points": [],
    "blue_x_points": [
      [-0.00521, 0],
      [-0.00513, 0],
      [-0.00558, 0],
      [-0.00534, 0],
      [0.03877, 1],
      [0.03782, 1],
      [0.03903, 1],
      [0.03876, 1],
      [-0.00536, 0],
      [0.03824, 1],
      [-0.0049, 0],
      [0.03811, 1],
      [0.04019, 1],
      [0.03942, 1],
      [-0.00524, 0]
    ]
  },
  "QA_yonInjUnconscio": {
    "red_x_points": [
      [-0.00975, 1],
      [-0.00933, 1],
      [-0.00171, 2],
      [-0.00179, 2],
      [-0.00174, 2],
      [-0.00956, 1],
      [-0.00187, 2],
      [-0.00219, 2],
      [-0.00177, 2],
      [-0.01066, 1],
      [-0.00962, 1],
      [-0.01053, 1],
      [-0.00254, 2],
      [-0.00181, 2],
      [-0.00808, 1],
      [-0.00968, 1],
      [-0.00922, 1],
      [-0.00861, 1],
      [-0.00848, 1],
      [-0.00962, 1],
      [-0.00255, 2],
      [-0.00217, 2],
      [-0.01045, 1],
      [-0.01003, 1],
      [-0.0024, 2],
      [-0.00195, 2],
      [-0.0022, 2],
      [-0.00952, 1],
      [-0.00231, 2]
    ],
    "red_o_points": [],
    "y_categories": ["N", "Y", "nan"],
    "blue_o_points": [],
    "blue_x_points": [
      [-0.00125, 2],
      [-0.0018, 2],
      [0.03724, 0],
      [-0.00107, 2],
      [-0.0062, 1],
      [-0.00654, 1],
      [0.02681, 0],
      [0.03174, 0],
      [-0.00157, 2],
      [0.03328, 0],
      [0.03586, 0],
      [-0.00145, 2],
      [-0.00719, 1],
      [-0.00163, 2],
      [0.03592, 0]
    ]
  },
  "QA_lstPexInspectio[SurgicalScar]": {
    "red_x_points": [
      [-0.00307, 1],
      [-0.00428, 1],
      [-0.0052, 0],
      [-0.00335, 1],
      [-0.00526, 1],
      [-0.00852, 0],
      [-0.00469, 1],
      [-0.00323, 1],
      [-0.00698, 1],
      [-0.0073, 1],
      [-0.00646, 0],
      [-0.00622, 1],
      [-0.00182, 2],
      [-0.00593, 1],
      [-0.0048, 0],
      [0.00421, 2],
      [0.00329, 2],
      [-0.00639, 1],
      [-0.0037, 1],
      [-0.00372, 1],
      [-0.00192, 2],
      [-0.00288, 1],
      [-0.00689, 1],
      [0.01079, 2],
      [-0.00275, 1],
      [-0.00374, 1],
      [-0.00157, 1],
      [0.00511, 2],
      [-0.00189, 1]
    ],
    "red_o_points": [],
    "y_categories": ["ABS", "NAIA", "PT", "nan"],
    "blue_o_points": [],
    "blue_x_points": [
      [-0.00046, 1],
      [0.00804, 2],
      [0.01933, 2],
      [0.02204, 2],
      [0.00054, 1],
      [-6e-5, 1],
      [0.00152, 0],
      [-0.00465, 1],
      [0.00243, 1],
      [0.00095, 1],
      [0.01918, 2],
      [-0.00074, 1],
      [0.00814, 2],
      [0.00293, 0],
      [0.00995, 2]
    ]
  },
  "QA_intPexWristFlex": {
    "red_x_points": [
      [-0.0003, 2],
      [-0.00063, 2],
      [-0.0004, 2],
      [-0.00065, 2],
      [-0.0007, 2],
      [-0.00069, 0],
      [-0.00056, 2],
      [0.00035, 0],
      [-0.00092, 2],
      [-0.00089, 2],
      [-0.00013, 0],
      [-0.00085, 2],
      [-7e-5, 2],
      [-0.0007, 2],
      [-0.00051, 2],
      [-0.00015, 0],
      [-6e-5, 0],
      [-7e-5, 0],
      [-0.00035, 0],
      [-0.00011, 2],
      [5e-5, 2],
      [-8e-5, 2],
      [-0.00102, 2],
      [-0.00063, 2],
      [-3e-5, 2],
      [-0.01929, 1],
      [-0.00258, 1],
      [-0.00069, 0],
      [-0.00013, 2]
    ],
    "red_o_points": [],
    "y_categories": ["GREATER THAN OR EQUALS TO 60", "LESS THAN 60", "nan"],
    "blue_o_points": [],
    "blue_x_points": [
      [0.00366, 2],
      [0.00261, 0],
      [0.00052, 0],
      [-0.00076, 2],
      [3e-5, 2],
      [0.00326, 2],
      [0.0046, 0],
      [-0.0006, 2],
      [6e-5, 2],
      [6e-5, 2],
      [0.01136, 1],
      [0.00347, 2],
      [0.00019, 2],
      [0.00368, 2],
      [0.00068, 0]
    ]
  },
  "QS_mulGraftTrunk[LowerTrunk]": {
    "red_x_points": [
      [3e-5, 2],
      [-3e-5, 0],
      [-4e-5, 0],
      [-3e-5, 0],
      [-7e-5, 0],
      [-4e-5, 0],
      [-3e-5, 0],
      [-7e-5, 0],
      [2e-5, 2],
      [-7e-5, 0],
      [2e-5, 2],
      [3e-5, 2],
      [-7e-5, 0],
      [-4e-5, 0],
      [3e-5, 2]
    ],
    "red_o_points": [],
    "y_categories": ["N", "NOT APPLICABLE", "nan"],
    "blue_o_points": [],
    "blue_x_points": [[0.00033, 1], [2e-5, 2], [3e-5, 2]]
  },
  "QS_mulGraftRoot[T2]": {
    "red_x_points": [
      [1e-5, 2],
      [-0.0002, 0],
      [-0.00015, 0],
      [-0.00012, 0],
      [-0.00022, 0],
      [-9e-5, 0],
      [-0.00019, 0],
      [1e-5, 2],
      [-0.0001, 0],
      [-0.00016, 0],
      [1e-5, 2],
      [-0.00017, 0],
      [-1e-5, 2],
      [-0.00023, 0],
      [-0.0002, 0],
      [0.0, 2],
      [0.0, 2],
      [1e-5, 2],
      [-0.00013, 0],
      [2e-5, 2],
      [-1e-5, 2],
      [-0.0, 2],
      [-0.00013, 0],
      [-0.00019, 0],
      [-0.0, 2],
      [0.00026, 1],
      [0.0, 2],
      [-0.00013, 0],
      [-1e-5, 2]
    ],
    "red_o_points": [],
    "y_categories": ["N", "NOT APPLICABLE", "nan"],
    "blue_o_points": [],
    "blue_x_points": [
      [0.00089, 1],
      [0.0, 2],
      [-5e-5, 0],
      [-0.00012, 0],
      [-0.0, 2],
      [0.00065, 1],
      [0.00018, 1],
      [-0.00013, 0],
      [1e-5, 2],
      [-1e-5, 2],
      [-9e-5, 0],
      [0.00036, 1],
      [0.0, 2],
      [0.0004, 1],
      [0.0, 2]
    ]
  },
  "QS_mulGraftRoot[C7]": {
    "red_x_points": [
      [-3e-5, 0],
      [-3e-5, 0],
      [-0.0, 2],
      [-3e-5, 0],
      [-3e-5, 0],
      [-0.0, 2],
      [-0.0, 2],
      [-0.0, 2],
      [-0.0, 2],
      [6e-5, 1],
      [-0.0, 2]
    ],
    "red_o_points": [],
    "y_categories": ["N", "NOT APPLICABLE", "nan"],
    "blue_o_points": [],
    "blue_x_points": [
      [-0.0, 2],
      [6e-5, 1],
      [-3e-5, 0],
      [-0.0, 2],
      [-0.0, 2],
      [6e-5, 1]
    ]
  },
  "QS_mulLysisSite[Trunk]": {
    "red_x_points": [
      [-0.00093, 3],
      [-0.00413, 0],
      [-0.00311, 0],
      [-0.00322, 0],
      [-0.00316, 0],
      [-0.01272, 2],
      [-0.0031, 0],
      [-0.00113, 3],
      [-0.00305, 0],
      [-0.0032, 0],
      [-0.00104, 3],
      [-0.0034, 0],
      [-0.00111, 3],
      [-0.00405, 0],
      [-0.01111, 2],
      [-0.00096, 3],
      [-0.00084, 3],
      [-0.00106, 3],
      [-0.0031, 0],
      [-0.00083, 3],
      [-0.00112, 3],
      [-0.00096, 3],
      [-0.00332, 0],
      [-0.00321, 0],
      [-0.00096, 3],
      [0.01294, 1],
      [-0.00096, 3],
      [-0.01108, 2],
      [-0.00099, 3]
    ],
    "red_o_points": [],
    "y_categories": ["N", "NOT APPLICABLE", "Y", "nan"],
    "blue_o_points": [],
    "blue_x_points": [
      [0.01968, 1],
      [-0.00062, 3],
      [-0.00168, 0],
      [-0.00173, 0],
      [-0.00022, 3],
      [0.01813, 1],
      [0.01527, 1],
      [-0.00248, 0],
      [-0.00091, 3],
      [-0.00046, 3],
      [-0.00153, 0],
      [0.01656, 1],
      [-0.00085, 3],
      [0.01647, 1],
      [-0.00072, 3]
    ]
  },
  "QS_mulTransfSite[PhMc]": {
    "red_x_points": [
      [-0.00067, 3],
      [-0.00325, 0],
      [-0.0023, 0],
      [-0.0023, 0],
      [-0.00248, 0],
      [-0.00224, 0],
      [-0.00795, 2],
      [-0.00073, 3],
      [-0.00228, 0],
      [-0.00223, 0],
      [-0.00059, 3],
      [-0.00254, 0],
      [-0.00088, 3],
      [-0.00294, 0],
      [-0.00305, 0],
      [-0.0007, 3],
      [-0.00053, 3],
      [-0.00062, 3],
      [-0.00745, 2],
      [-0.00057, 3],
      [-0.00095, 3],
      [-0.00072, 3],
      [-0.00244, 0],
      [-0.00254, 0],
      [-0.00073, 3],
      [0.00973, 1],
      [-0.00084, 3],
      [-0.00227, 0],
      [-0.00099, 3]
    ],
    "red_o_points": [],
    "y_categories": ["N", "NOT APPLICABLE", "Y", "nan"],
    "blue_o_points": [],
    "blue_x_points": [
      [0.01474, 1],
      [-0.00067, 3],
      [-0.00164, 0],
      [-0.0019, 0],
      [-0.00038, 3],
      [0.01207, 1],
      [0.00926, 1],
      [-0.00194, 0],
      [-0.00043, 3],
      [-0.00041, 3],
      [-0.00158, 0],
      [0.01114, 1],
      [-0.00048, 3],
      [0.01071, 1],
      [-0.00047, 3]
    ]
  },
  "QS_mulLysisSite[Root]": {
    "red_x_points": [
      [-0.00044, 3],
      [-0.00217, 0],
      [-0.00709, 2],
      [-0.00189, 0],
      [-0.00172, 0],
      [-0.00155, 0],
      [-0.00197, 0],
      [-0.00041, 3],
      [-0.00193, 0],
      [-0.00148, 0],
      [-0.00048, 3],
      [-0.00176, 0],
      [-0.00025, 3],
      [-0.00222, 0],
      [-0.00209, 0],
      [-0.00062, 3],
      [-0.00043, 3],
      [-0.00048, 3],
      [-0.00188, 0],
      [-0.0004, 3],
      [-0.00033, 3],
      [-0.00041, 3],
      [-0.00204, 0],
      [-0.00189, 0],
      [-0.00059, 3],
      [0.00688, 1],
      [-0.00041, 3],
      [-0.00652, 2],
      [-0.00037, 3]
    ],
    "red_o_points": [],
    "y_categories": ["N", "NOT APPLICABLE", "Y", "nan"],
    "blue_o_points": [],
    "blue_x_points": [
      [0.01142, 1],
      [-0.00027, 3],
      [-0.00103, 0],
      [-0.00141, 0],
      [-0.00019, 3],
      [0.00792, 1],
      [0.00712, 1],
      [-0.00149, 0],
      [-4e-5, 3],
      [-0.00017, 3],
      [-0.00092, 0],
      [0.008, 1],
      [-0.00031, 3],
      [0.00839, 1],
      [-4e-5, 3]
    ]
  },
  "QS_mulLysisNerve[SS]": {
    "red_x_points": [
      [-1e-5, 0],
      [-1e-5, 0],
      [-1e-5, 0],
      [-1e-5, 0],
      [-1e-5, 0],
      [-0.0, 2],
      [-1e-5, 0],
      [-1e-5, 0],
      [-0.0, 2],
      [-1e-5, 0],
      [-0.0, 2],
      [-0.0, 2],
      [-1e-5, 0],
      [-0.0, 2],
      [-1e-5, 0],
      [-1e-5, 0],
      [-0.0, 2]
    ],
    "red_o_points": [],
    "y_categories": ["N", "NOT APPLICABLE", "nan"],
    "blue_o_points": [],
    "blue_x_points": [
      [-0.0, 2],
      [-1e-5, 0],
      [-1e-5, 0],
      [-1e-5, 0],
      [0.00015, 1],
      [-0.0, 2]
    ]
  },
  "QS_mulGraftNerve[other]": {
    "red_x_points": [
      [-0.0, 2],
      [-0.00071, 0],
      [-0.00048, 0],
      [-0.00041, 0],
      [-0.00034, 0],
      [-0.00053, 0],
      [-0.00046, 0],
      [-0.00011, 2],
      [-0.00063, 0],
      [-0.00049, 0],
      [2e-5, 2],
      [-0.00044, 0],
      [-8e-5, 2],
      [-0.00063, 0],
      [-0.00054, 0],
      [1e-5, 2],
      [1e-5, 2],
      [4e-5, 2],
      [-0.00048, 0],
      [-4e-5, 2],
      [-6e-5, 2],
      [-9e-5, 2],
      [-0.0005, 0],
      [-0.00056, 0],
      [-8e-5, 2],
      [0.001, 1],
      [-0.00016, 2],
      [-0.00049, 0],
      [-3e-5, 2]
    ],
    "red_o_points": [],
    "y_categories": ["N", "NOT APPLICABLE", "nan"],
    "blue_o_points": [],
    "blue_x_points": [
      [0.00228, 1],
      [-4e-5, 2],
      [-0.00027, 0],
      [-0.00032, 0],
      [6e-5, 2],
      [0.00201, 1],
      [0.0013, 1],
      [-0.00028, 0],
      [1e-5, 2],
      [-5e-5, 2],
      [-0.0002, 0],
      [0.00139, 1],
      [0.0, 2],
      [0.00139, 1],
      [-3e-5, 2]
    ]
  },
  "QS_mulGraftNerve[DS]": {
    "red_x_points": [
      [-0.0, 2],
      [-0.00018, 0],
      [-0.00013, 0],
      [-6e-5, 0],
      [-0.00015, 0],
      [-0.00012, 0],
      [-0.0001, 0],
      [-6e-5, 2],
      [-0.00017, 0],
      [-0.00012, 0],
      [4e-5, 2],
      [-0.00018, 0],
      [-9e-5, 2],
      [-0.00017, 0],
      [-0.00018, 0],
      [1e-5, 2],
      [4e-5, 2],
      [1e-5, 2],
      [-4e-5, 0],
      [1e-5, 2],
      [-1e-5, 2],
      [-2e-5, 2],
      [-8e-5, 0],
      [-4e-5, 0],
      [-2e-5, 2],
      [0.00017, 1],
      [-6e-5, 2],
      [-0.00012, 0],
      [-9e-5, 2]
    ],
    "red_o_points": [],
    "y_categories": ["N", "NOT APPLICABLE", "nan"],
    "blue_o_points": [],
    "blue_x_points": [
      [0.00064, 1],
      [-1e-5, 2],
      [-3e-5, 0],
      [-6e-5, 0],
      [3e-5, 2],
      [0.00055, 1],
      [0.0001, 1],
      [-2e-5, 2],
      [-1e-5, 2],
      [-3e-5, 0],
      [0.00039, 1],
      [4e-5, 2],
      [0.00031, 1],
      [-0.0, 2]
    ]
  },
  "QS_mulGraftNerve[LP]": {
    "red_x_points": [
      [-2e-5, 2],
      [-0.00019, 0],
      [-0.00021, 0],
      [-0.00017, 0],
      [-0.00013, 0],
      [-0.00018, 0],
      [-0.00023, 0],
      [-2e-5, 2],
      [-0.00034, 0],
      [-0.0001, 0],
      [-1e-5, 2],
      [-0.0003, 0],
      [-1e-5, 2],
      [-0.00018, 0],
      [-0.00027, 0],
      [-6e-5, 2],
      [0.0, 2],
      [-6e-5, 2],
      [-0.00014, 0],
      [-2e-5, 2],
      [-1e-5, 2],
      [-2e-5, 2],
      [-0.00027, 0],
      [-0.00027, 0],
      [-0.0, 2],
      [0.0006, 1],
      [-5e-5, 2],
      [-0.00022, 0],
      [-3e-5, 2]
    ],
    "red_o_points": [],
    "y_categories": ["N", "NOT APPLICABLE", "nan"],
    "blue_o_points": [],
    "blue_x_points": [
      [0.00091, 1],
      [-5e-5, 2],
      [-0.00013, 0],
      [-0.00011, 0],
      [-2e-5, 2],
      [0.0008, 1],
      [0.00064, 1],
      [-0.00026, 0],
      [-2e-5, 2],
      [-1e-5, 2],
      [-0.00013, 0],
      [0.0008, 1],
      [-5e-5, 2],
      [0.00054, 1],
      [-1e-5, 2]
    ]
  },
  "QA_lstPexMuscstrength[WristFlex]": {
    "red_x_points": [
      [-0.00228, 1],
      [-0.0017, 2],
      [-0.00291, 1],
      [0.00048, 0],
      [-0.00348, 1],
      [0.00054, 0],
      [-0.00267, 1],
      [-0.00082, 0],
      [0.00165, 0],
      [0.00058, 0],
      [-0.0015, 0],
      [0.00127, 0],
      [-0.00177, 2],
      [-0.00291, 2],
      [-0.0008, 2],
      [-0.00501, 0],
      [-0.00045, 1],
      [-0.00799, 0],
      [-0.00222, 1],
      [-0.00374, 0],
      [-0.00204, 2],
      [-0.00062, 0],
      [0.0012, 0],
      [0.00149, 0],
      [-0.00246, 2],
      [-0.00112, 2],
      [-0.0025, 1],
      [-0.00168, 1],
      [-0.00232, 2]
    ],
    "red_o_points": [],
    "y_categories": ["GREATER THAN OR EQUALS TO 3", "LESS THAN 3", "nan"],
    "blue_o_points": [],
    "blue_x_points": [
      [0.00083, 0],
      [0.00212, 0],
      [0.00225, 0],
      [0.00241, 0],
      [0.00168, 2],
      [0.0, 2],
      [5e-5, 0],
      [0.00157, 0],
      [0.00457, 0],
      [0.00157, 2],
      [0.00228, 0],
      [0.00027, 0],
      [0.01277, 1],
      [0.00042, 0],
      [0.01298, 1]
    ]
  },
  "QS_mulNeuromadSite[C5]": {
    "red_x_points": [
      [-3e-5, 2],
      [-0.00086, 0],
      [-0.00054, 0],
      [-0.00053, 0],
      [-0.00068, 0],
      [-0.00057, 0],
      [-0.00052, 0],
      [-0.00014, 2],
      [-0.00064, 0],
      [-0.00056, 0],
      [-0.00011, 2],
      [-0.0006, 0],
      [-0.00018, 2],
      [-0.00069, 0],
      [-0.00089, 0],
      [-6e-5, 2],
      [-9e-5, 2],
      [-5e-5, 2],
      [-0.00053, 0],
      [-0.0001, 2],
      [-0.00015, 2],
      [-0.00016, 2],
      [-0.00064, 0],
      [-0.00056, 0],
      [-0.00011, 2],
      [0.00144, 1],
      [-0.00014, 2],
      [-0.00055, 0],
      [-0.00016, 2]
    ],
    "red_o_points": [],
    "y_categories": ["N", "NOT APPLICABLE", "nan"],
    "blue_o_points": [],
    "blue_x_points": [
      [0.00275, 1],
      [-0.00012, 2],
      [-0.00035, 0],
      [-0.00045, 0],
      [-7e-5, 2],
      [0.00258, 1],
      [0.00156, 1],
      [-0.00032, 0],
      [-1e-5, 2],
      [-0.00012, 2],
      [-0.00041, 0],
      [0.00215, 1],
      [-0.0, 2],
      [0.00227, 1],
      [-0.0001, 2]
    ]
  },
  "QS_mulNeuromadSite[C7]": {
    "red_x_points": [
      [-0.0002, 2],
      [-0.00091, 0],
      [-0.00081, 0],
      [-0.00069, 0],
      [-0.00078, 0],
      [-0.00072, 0],
      [-0.00074, 0],
      [-6e-5, 2],
      [-0.00088, 0],
      [-0.00064, 0],
      [-0.00014, 2],
      [-0.00076, 0],
      [-0.00018, 2],
      [-0.00089, 0],
      [-0.00092, 0],
      [-0.00015, 2],
      [-0.0001, 2],
      [-0.00017, 2],
      [-0.00058, 0],
      [-0.00011, 2],
      [-0.00013, 2],
      [-0.00013, 2],
      [-0.00065, 0],
      [-0.00059, 0],
      [-0.0001, 2],
      [0.00166, 1],
      [-0.00014, 2],
      [-0.00062, 0],
      [-0.00012, 2]
    ],
    "red_o_points": [],
    "y_categories": ["N", "NOT APPLICABLE", "nan"],
    "blue_o_points": [],
    "blue_x_points": [
      [0.00318, 1],
      [-4e-5, 2],
      [-0.00055, 0],
      [-0.00052, 0],
      [-8e-5, 2],
      [0.00274, 1],
      [0.0025, 1],
      [-0.00042, 0],
      [-9e-5, 2],
      [-2e-5, 2],
      [-0.00066, 0],
      [0.00266, 1],
      [-0.00012, 2],
      [0.00277, 1],
      [-7e-5, 2]
    ]
  },
  "QA_lstPexMuscstrength[WristExte]": {
    "red_x_points": [
      [-0.00381, 1],
      [-0.00375, 2],
      [-0.0043, 1],
      [-0.00428, 1],
      [-0.00527, 1],
      [-0.00585, 1],
      [-0.00456, 1],
      [0.00044, 0],
      [0.00531, 0],
      [-0.00675, 1],
      [0.00082, 0],
      [0.00561, 0],
      [-0.00235, 2],
      [-0.00631, 2],
      [-0.00275, 2],
      [-0.00071, 0],
      [-0.00169, 1],
      [-0.00043, 0],
      [-0.00447, 1],
      [-0.00426, 1],
      [-0.00222, 2],
      [-0.00346, 1],
      [0.00582, 0],
      [0.00508, 0],
      [-0.00168, 2],
      [-0.00098, 2],
      [-0.00277, 1],
      [-0.0034, 1],
      [-0.00214, 2]
    ],
    "red_o_points": [],
    "y_categories": ["GREATER THAN OR EQUALS TO 3", "LESS THAN 3", "nan"],
    "blue_o_points": [],
    "blue_x_points": [
      [0.00236, 0],
      [0.00178, 1],
      [0.00801, 0],
      [0.00858, 0],
      [0.00036, 2],
      [-0.00024, 2],
      [0.00119, 0],
      [0.00734, 0],
      [0.00871, 0],
      [0.00102, 2],
      [0.00735, 0],
      [-0.00015, 1],
      [0.00502, 0],
      [0.00113, 0],
      [0.00264, 1]
    ]
  },
  "QS_mulGraftNerve[TD]": {
    "red_x_points": [
      [-1e-5, 2],
      [-0.00042, 0],
      [-0.00018, 0],
      [-0.00014, 0],
      [-0.00026, 0],
      [-0.0002, 0],
      [-0.00013, 0],
      [-6e-5, 2],
      [-0.0002, 0],
      [-0.00018, 0],
      [-1e-5, 2],
      [-0.0002, 0],
      [-4e-5, 2],
      [-0.00034, 0],
      [-0.00023, 0],
      [-1e-5, 2],
      [-1e-5, 2],
      [-2e-5, 2],
      [-0.0002, 0],
      [-3e-5, 2],
      [1e-5, 2],
      [-4e-5, 2],
      [-0.00016, 0],
      [-0.00033, 0],
      [-5e-5, 2],
      [0.00045, 1],
      [-1e-5, 2],
      [-0.0002, 0],
      [-2e-5, 2]
    ],
    "red_o_points": [],
    "y_categories": ["N", "NOT APPLICABLE", "nan"],
    "blue_o_points": [],
    "blue_x_points": [
      [0.00124, 1],
      [-2e-5, 2],
      [-0.00013, 0],
      [-0.00015, 0],
      [5e-5, 2],
      [0.00088, 1],
      [0.00043, 1],
      [-8e-5, 0],
      [-2e-5, 2],
      [3e-5, 2],
      [-0.00011, 0],
      [0.00067, 1],
      [-2e-5, 2],
      [0.00052, 1],
      [-3e-5, 2]
    ]
  },
  "QS_mulGraftNerve[SS]": {
    "red_x_points": [
      [-3e-5, 2],
      [-8e-5, 0],
      [-6e-5, 0],
      [-6e-5, 0],
      [-6e-5, 0],
      [-0.00012, 0],
      [-6e-5, 0],
      [-3e-5, 2],
      [-0.0001, 0],
      [-0.0001, 0],
      [-0.0, 2],
      [-0.0001, 0],
      [-5e-5, 2],
      [-0.00016, 0],
      [-0.00018, 0],
      [-3e-5, 2],
      [-3e-5, 2],
      [-4e-5, 2],
      [-0.00014, 0],
      [-3e-5, 2],
      [-1e-5, 2],
      [-4e-5, 2],
      [-0.00014, 0],
      [-0.00014, 0],
      [-2e-5, 2],
      [0.00041, 1],
      [-4e-5, 2],
      [-0.0001, 0],
      [-5e-5, 2]
    ],
    "red_o_points": [],
    "y_categories": ["N", "NOT APPLICABLE", "nan"],
    "blue_o_points": [],
    "blue_x_points": [
      [0.00039, 1],
      [-1e-5, 2],
      [-6e-5, 0],
      [-6e-5, 0],
      [2e-5, 2],
      [0.00057, 1],
      [0.00029, 1],
      [-0.0001, 0],
      [-3e-5, 2],
      [-3e-5, 2],
      [-0.0001, 0],
      [0.00039, 1],
      [-3e-5, 2],
      [0.00039, 1],
      [-3e-5, 2]
    ]
  },
  "QS_mulLysisNerve[LT]": {
    "red_x_points": [
      [-2e-5, 2],
      [-3e-5, 0],
      [-3e-5, 0],
      [-3e-5, 0],
      [-3e-5, 0],
      [-2e-5, 2],
      [-3e-5, 0],
      [-3e-5, 0],
      [-2e-5, 2],
      [-3e-5, 0],
      [-2e-5, 2],
      [-3e-5, 0],
      [-2e-5, 2],
      [-2e-5, 2],
      [-3e-5, 0],
      [-2e-5, 2],
      [-2e-5, 2],
      [-3e-5, 0],
      [-3e-5, 0],
      [-2e-5, 2],
      [0.0001, 1],
      [-2e-5, 2],
      [-2e-5, 2]
    ],
    "red_o_points": [],
    "y_categories": ["N", "NOT APPLICABLE", "nan"],
    "blue_o_points": [],
    "blue_x_points": [
      [0.0001, 1],
      [-3e-5, 0],
      [-3e-5, 0],
      [-2e-5, 2],
      [0.0001, 1],
      [0.0001, 1],
      [-2e-5, 2],
      [-3e-5, 0],
      [0.0001, 1],
      [-2e-5, 2],
      [0.0001, 1],
      [-2e-5, 2]
    ]
  },
  "QA_lstPexArthre[Index]": {
    "red_x_points": [
      [-0.01098, 0],
      [-0.00508, 2],
      [-0.00335, 2],
      [-0.00643, 0],
      [-0.00892, 0],
      [0.00714, 1],
      [-0.00832, 0],
      [0.00083, 2],
      [0.00987, 1],
      [-0.01131, 0],
      [0.00264, 1],
      [-0.0068, 2],
      [0.00061, 2],
      [0.00937, 1],
      [-0.00363, 2],
      [0.00255, 1],
      [-0.00871, 0],
      [0.00215, 1],
      [-0.00563, 2],
      [-0.0105, 0],
      [0.00071, 2],
      [0.0006, 2],
      [-0.00734, 2],
      [-0.00628, 2],
      [0.00211, 1],
      [-0.00047, 2],
      [0.00064, 2],
      [-0.00589, 0],
      [0.00058, 2]
    ],
    "red_o_points": [],
    "y_categories": ["NPV", "PV", "nan"],
    "blue_o_points": [],
    "blue_x_points": [
      [-0.00038, 0],
      [0.00162, 2],
      [0.01271, 1],
      [0.01415, 1],
      [0.00283, 2],
      [-0.00018, 2],
      [0.00163, 1],
      [0.01152, 1],
      [0.00141, 2],
      [0.00149, 2],
      [0.012, 1],
      [0.00188, 1],
      [0.00402, 1],
      [-0.00017, 2],
      [0.00532, 1]
    ]
  },
  "QS_mulLysisRoot[C7]": {
    "red_x_points": [
      [-9e-5, 3],
      [-0.00148, 0],
      [-0.0041, 2],
      [-0.00092, 0],
      [-0.0011, 0],
      [-0.00113, 0],
      [-0.00131, 0],
      [-0.00024, 3],
      [-0.00108, 0],
      [-0.00106, 0],
      [-0.0003, 3],
      [-0.00122, 0],
      [-0.00015, 3],
      [-0.00149, 0],
      [-0.00136, 0],
      [-0.00031, 3],
      [-0.00018, 3],
      [-0.00016, 3],
      [-0.00093, 0],
      [-0.00011, 3],
      [-0.00013, 3],
      [-0.00021, 3],
      [-0.00097, 0],
      [-0.00124, 0],
      [-0.00015, 3],
      [0.00384, 1],
      [-0.00025, 3],
      [-0.00106, 0],
      [-0.00011, 3]
    ],
    "red_o_points": [],
    "y_categories": ["N", "NOT APPLICABLE", "Y", "nan"],
    "blue_o_points": [],
    "blue_x_points": [
      [0.00614, 1],
      [-0.00012, 3],
      [-0.0009, 0],
      [-0.00092, 0],
      [-5e-5, 3],
      [0.00466, 1],
      [0.00362, 1],
      [-0.00097, 0],
      [-0.00015, 3],
      [-0.00012, 3],
      [-0.00081, 0],
      [0.00438, 1],
      [-5e-5, 3],
      [0.00441, 1],
      [-0.00012, 3]
    ]
  },
  "QA_yonInjBpsurg": {
    "red_x_points": [
      [-0.00043, 1],
      [-0.0005, 1],
      [-0.0005, 1],
      [-0.0004, 1],
      [-0.00058, 1],
      [-0.0004, 1],
      [-0.00048, 1],
      [-0.00063, 1],
      [-0.00071, 1],
      [-0.00031, 1],
      [-0.00051, 1],
      [-0.00042, 1],
      [-0.00075, 1],
      [-0.00061, 1],
      [-0.00034, 1],
      [-0.00047, 1],
      [-0.00032, 1],
      [-0.00054, 1],
      [-0.00028, 1],
      [-0.00044, 1],
      [-0.00068, 1],
      [-0.00063, 1],
      [-0.00044, 1],
      [-0.00039, 1],
      [-0.00061, 1],
      [0.00221, 0],
      [-0.0007, 1],
      [-0.00033, 1],
      [-0.00078, 1]
    ],
    "red_o_points": [],
    "y_categories": ["N", "Y", "nan"],
    "blue_o_points": [],
    "blue_x_points": [
      [0.00416, 0],
      [-0.00044, 1],
      [-0.00037, 1],
      [-0.00076, 1],
      [-0.00037, 1],
      [0.00248, 0],
      [0.00276, 0],
      [-0.00039, 1],
      [-0.00058, 1],
      [-0.00016, 1],
      [-0.00045, 1],
      [0.00342, 0],
      [-0.00036, 1],
      [0.00325, 0],
      [-0.00022, 1]
    ]
  },
  "QS_mulNeuromadSite[T1]": {
    "red_x_points": [
      [-0.00016, 2],
      [-0.00158, 0],
      [-0.00113, 0],
      [-0.00124, 0],
      [-0.00105, 0],
      [-0.00113, 0],
      [-0.00127, 0],
      [-0.00023, 2],
      [-0.00105, 0],
      [-0.00103, 0],
      [-7e-5, 2],
      [-0.00117, 0],
      [-0.00022, 2],
      [-0.00145, 0],
      [-0.00163, 0],
      [-0.00014, 2],
      [-0.00016, 2],
      [-0.00017, 2],
      [-0.00112, 0],
      [-0.00025, 2],
      [-0.00026, 2],
      [-0.00028, 2],
      [-0.00111, 0],
      [-0.0012, 0],
      [-0.00022, 2],
      [0.00265, 1],
      [-0.00026, 2],
      [-0.00116, 0],
      [-0.00016, 2]
    ],
    "red_o_points": [],
    "y_categories": ["N", "NOT APPLICABLE", "nan"],
    "blue_o_points": [],
    "blue_x_points": [
      [0.00531, 1],
      [-0.0003, 2],
      [-0.00073, 0],
      [-0.00065, 0],
      [2e-5, 2],
      [0.00494, 1],
      [0.0032, 1],
      [-0.0009, 0],
      [-8e-5, 2],
      [-5e-5, 2],
      [-0.00074, 0],
      [0.00442, 1],
      [-9e-5, 2],
      [0.00403, 1],
      [-0.00013, 2]
    ]
  },
  "QS_mulBpsurgeryType[Graft]": {
    "red_x_points": [
      [-0.00027, 3],
      [-0.00145, 0],
      [-0.00115, 0],
      [-0.00102, 0],
      [-0.00114, 0],
      [-0.00087, 0],
      [-0.00122, 0],
      [-0.00033, 3],
      [-0.00124, 0],
      [-0.00096, 0],
      [-0.00021, 3],
      [-0.00115, 0],
      [-0.00042, 3],
      [-0.00604, 2],
      [-0.00141, 0],
      [-0.00032, 3],
      [-0.00026, 3],
      [-0.00029, 3],
      [-0.00106, 0],
      [-0.00034, 3],
      [-0.00032, 3],
      [-0.00041, 3],
      [-0.00113, 0],
      [-0.00117, 0],
      [-0.00045, 3],
      [0.00348, 1],
      [-0.0004, 3],
      [-0.00095, 0],
      [-0.00035, 3]
    ],
    "red_o_points": [],
    "y_categories": ["N", "NOT APPLICABLE", "Y", "nan"],
    "blue_o_points": [],
    "blue_x_points": [
      [0.00582, 1],
      [-0.00031, 3],
      [-0.00047, 0],
      [-0.00052, 0],
      [5e-5, 3],
      [0.00489, 1],
      [0.00473, 1],
      [-0.00071, 0],
      [-0.00021, 3],
      [-0.0, 3],
      [-0.00042, 0],
      [0.00495, 1],
      [-0.00018, 3],
      [0.00546, 1],
      [-0.00022, 3]
    ]
  },
  "QS_mulLysisRoot[C6]": {
    "red_x_points": [
      [-0.00041, 3],
      [-0.00409, 0],
      [-0.00993, 2],
      [-0.0024, 0],
      [-0.00295, 0],
      [-0.00266, 0],
      [-0.00278, 0],
      [-0.00043, 3],
      [-0.00336, 0],
      [-0.00245, 0],
      [-0.00069, 3],
      [-0.00293, 0],
      [-0.00049, 3],
      [-0.00378, 0],
      [-0.00353, 0],
      [-0.00059, 3],
      [-0.00048, 3],
      [-0.00058, 3],
      [-0.00246, 0],
      [-0.00039, 3],
      [-0.00046, 3],
      [-0.00044, 3],
      [-0.00304, 0],
      [-0.0027, 0],
      [-0.00063, 3],
      [0.00877, 1],
      [-0.00038, 3],
      [-0.00839, 2],
      [-0.00031, 3]
    ],
    "red_o_points": [],
    "y_categories": ["N", "NOT APPLICABLE", "Y", "nan"],
    "blue_o_points": [],
    "blue_x_points": [
      [0.01584, 1],
      [-0.00018, 3],
      [-0.00202, 0],
      [-0.00163, 0],
      [-0.00017, 3],
      [0.01374, 1],
      [0.00951, 1],
      [-0.00236, 0],
      [5e-5, 3],
      [-0.00013, 3],
      [-0.00159, 0],
      [0.01208, 1],
      [-0.00024, 3],
      [0.01232, 1],
      [-0.00023, 3]
    ]
  },
  "QA_lstPexPalle[Clavicle]": {
    "red_x_points": [
      [-0.00011, 3],
      [-0.00117, 3],
      [-0.00075, 3],
      [0.0013, 2],
      [-0.00149, 3],
      [0.00149, 2],
      [-0.00143, 3],
      [-9e-5, 3],
      [-0.00244, 3],
      [0.00235, 2],
      [-0.01181, 0],
      [-0.00198, 3],
      [0.00014, 3],
      [-0.00155, 3],
      [-0.00057, 3],
      [-0.01164, 0],
      [-0.01114, 0],
      [0.00848, 2],
      [-0.00282, 1],
      [-0.01251, 1],
      [7e-5, 3],
      [-4e-5, 3],
      [-0.00217, 3],
      [-0.00215, 3],
      [0.00011, 3],
      [-0.02202, 2],
      [0.00013, 3],
      [-0.00061, 0],
      [5e-5, 3]
    ],
    "red_o_points": [],
    "y_categories": ["HYPO", "NAIA", "PT", "nan"],
    "blue_o_points": [],
    "blue_x_points": [
      [0.00424, 3],
      [0.00057, 3],
      [0.00461, 2],
      [0.00546, 2],
      [0.00064, 3],
      [0.00403, 3],
      [0.00547, 0],
      [-0.00128, 3],
      [0.00038, 3],
      [0.00059, 3],
      [0.00822, 0],
      [0.0039, 3],
      [0.0149, 2],
      [0.00434, 3],
      [0.01829, 2]
    ]
  },
  "QA_lstPexTouch[C7]": {
    "red_x_points": [
      [-0.00198, 1],
      [-0.00716, 2],
      [-0.00287, 1],
      [-0.00313, 1],
      [-0.00857, 2],
      [-0.00397, 1],
      [-0.00447, 1],
      [-0.00311, 0],
      [-0.00549, 1],
      [-0.00547, 1],
      [-0.00058, 1],
      [-0.01035, 2],
      [-0.00107, 2],
      [-0.00894, 2],
      [-0.00513, 2],
      [-0.00171, 0],
      [-0.00111, 1],
      [-0.00128, 0],
      [-0.00687, 2],
      [-0.00199, 0],
      [-0.0009, 2],
      [-0.00431, 0],
      [-0.00587, 1],
      [-0.00987, 2],
      [-0.00274, 0],
      [-0.00262, 1],
      [-0.0015, 2],
      [-0.00232, 1],
      [-0.00039, 1]
    ],
    "red_o_points": [],
    "y_categories": ["NORM", "NPV", "nan"],
    "blue_o_points": [],
    "blue_x_points": [
      [3e-5, 1],
      [0.00546, 1],
      [0.02965, 0],
      [0.0328, 0],
      [0.00375, 2],
      [0.00018, 2],
      [-0.00227, 1],
      [0.00695, 1],
      [0.00288, 2],
      [0.02916, 0],
      [-8e-5, 1],
      [0.00064, 0],
      [0.00227, 0],
      [0.00436, 0]
    ]
  },
  "QA_yonInjPhysio": {
    "red_x_points": [
      [-0.00594, 0],
      [0.00074, 0],
      [0.00027, 0],
      [0.00032, 0],
      [-0.00212, 2],
      [0.00045, 0],
      [0.00052, 0],
      [-0.00506, 0],
      [0.00095, 0],
      [-0.00644, 1],
      [-0.00384, 0],
      [0.00113, 0],
      [-0.00432, 0],
      [-0.00436, 1],
      [-0.00152, 1],
      [0.00214, 1],
      [-0.00471, 0],
      [0.00338, 1],
      [0.00052, 0],
      [-0.0049, 0],
      [0.00339, 1],
      [0.00297, 1],
      [0.00144, 0],
      [-0.00593, 1],
      [-0.00768, 2],
      [-0.00862, 1],
      [-0.00601, 2],
      [7e-5, 0],
      [0.00375, 1]
    ],
    "red_o_points": [],
    "y_categories": ["N", "Y", "nan"],
    "blue_o_points": [],
    "blue_x_points": [
      [0.00319, 0],
      [0.00555, 1],
      [0.00442, 0],
      [0.00483, 0],
      [0.00526, 1],
      [0.00303, 0],
      [0.00241, 0],
      [0.00214, 0],
      [-0.00128, 0],
      [0.00504, 1],
      [0.00322, 0],
      [0.00221, 0],
      [0.0054, 1],
      [-0.00182, 1],
      [0.0058, 1]
    ]
  },
  "QS_mulGraftNerve[LT]": {
    "red_x_points": [
      [-4e-5, 2],
      [-8e-5, 0],
      [-9e-5, 0],
      [-1e-5, 0],
      [-8e-5, 0],
      [-7e-5, 0],
      [-9e-5, 0],
      [-4e-5, 2],
      [-6e-5, 0],
      [-0.0001, 0],
      [-3e-5, 2],
      [-0.0001, 0],
      [-3e-5, 2],
      [-8e-5, 0],
      [-8e-5, 0],
      [-1e-5, 2],
      [-3e-5, 2],
      [-3e-5, 2],
      [-8e-5, 0],
      [-2e-5, 2],
      [-4e-5, 2],
      [-4e-5, 2],
      [-8e-5, 0],
      [-9e-5, 0],
      [-4e-5, 2],
      [0.00036, 1],
      [-3e-5, 2],
      [-0.0001, 0],
      [-4e-5, 2]
    ],
    "red_o_points": [],
    "y_categories": ["N", "NOT APPLICABLE", "nan"],
    "blue_o_points": [],
    "blue_x_points": [
      [0.00042, 1],
      [-2e-5, 2],
      [-6e-5, 0],
      [-6e-5, 0],
      [-3e-5, 2],
      [0.00028, 1],
      [0.00027, 1],
      [-9e-5, 0],
      [0.0, 2],
      [-3e-5, 2],
      [-0.0001, 0],
      [0.00028, 1],
      [-1e-5, 2],
      [0.00036, 1],
      [-1e-5, 2]
    ]
  },
  "QS_mulGraftNerve[IS]": {
    "red_x_points": [
      [-3e-5, 2],
      [-0.00034, 0],
      [-0.00023, 0],
      [-0.00017, 0],
      [-0.00017, 0],
      [-0.00023, 0],
      [-0.00019, 0],
      [-5e-5, 2],
      [-0.00015, 0],
      [-0.00024, 0],
      [-4e-5, 2],
      [-0.00021, 0],
      [-4e-5, 2],
      [-0.00023, 0],
      [-0.00019, 0],
      [-5e-5, 2],
      [-5e-5, 2],
      [-5e-5, 2],
      [-0.00018, 0],
      [-5e-5, 2],
      [-5e-5, 2],
      [-2e-5, 2],
      [-0.00019, 0],
      [-0.00023, 0],
      [-4e-5, 2],
      [0.00056, 1],
      [-4e-5, 2],
      [-0.00017, 0],
      [-3e-5, 2]
    ],
    "red_o_points": [],
    "y_categories": ["N", "NOT APPLICABLE", "nan"],
    "blue_o_points": [],
    "blue_x_points": [
      [0.00115, 1],
      [-3e-5, 2],
      [-0.00017, 0],
      [-0.00021, 0],
      [-2e-5, 2],
      [0.00072, 1],
      [0.00073, 1],
      [-0.00019, 0],
      [-4e-5, 2],
      [-2e-5, 2],
      [-0.00018, 0],
      [0.00073, 1],
      [-4e-5, 2],
      [0.00069, 1],
      [-4e-5, 2]
    ]
  },
  "QS_mulGraftNerve[MC]": {
    "red_x_points": [
      [-0.00014, 2],
      [-0.00047, 0],
      [-0.00037, 0],
      [-0.00045, 0],
      [-0.00028, 0],
      [-0.00031, 0],
      [-0.00031, 0],
      [-8e-5, 2],
      [-0.0003, 0],
      [-0.00031, 0],
      [-3e-5, 2],
      [-0.00044, 0],
      [-6e-5, 2],
      [-0.00063, 0],
      [-0.00041, 0],
      [-0.00013, 2],
      [-5e-5, 2],
      [-0.00011, 2],
      [-0.00019, 0],
      [-6e-5, 2],
      [-7e-5, 2],
      [-8e-5, 2],
      [-0.00028, 0],
      [-0.00036, 0],
      [-7e-5, 2],
      [0.00104, 1],
      [-0.00016, 2],
      [-0.0003, 0],
      [-6e-5, 2]
    ],
    "red_o_points": [],
    "y_categories": ["N", "NOT APPLICABLE", "nan"],
    "blue_o_points": [],
    "blue_x_points": [
      [0.00196, 1],
      [-7e-5, 2],
      [-0.00027, 0],
      [-0.0003, 0],
      [-4e-5, 2],
      [0.00105, 1],
      [0.00116, 1],
      [-0.00034, 0],
      [-6e-5, 2],
      [-3e-5, 2],
      [-0.00016, 0],
      [0.0013, 1],
      [-0.00012, 2],
      [0.00141, 1],
      [-5e-5, 2]
    ]
  },
  "QS_mulGraftRoot[C8]": {
    "red_x_points": [
      [-2e-5, 0],
      [-2e-5, 0],
      [-2e-5, 0],
      [-6e-5, 2],
      [-2e-5, 0],
      [-6e-5, 2],
      [-6e-5, 2],
      [-6e-5, 2],
      [-6e-5, 2]
    ],
    "red_o_points": [],
    "y_categories": ["N", "NOT APPLICABLE", "nan"],
    "blue_o_points": [],
    "blue_x_points": [[0.00014, 1], [-2e-5, 0], [0.00014, 1], [0.00014, 1]]
  },
  "QS_mulTransfSite[MeMc]": {
    "red_x_points": [
      [1e-5, 2],
      [-5e-5, 0],
      [-0.00015, 0],
      [-5e-5, 0],
      [-5e-5, 0],
      [1e-5, 2],
      [1e-5, 2],
      [1e-5, 2],
      [1e-5, 2],
      [-5e-5, 0]
    ],
    "red_o_points": [],
    "y_categories": ["N", "NOT APPLICABLE", "nan"],
    "blue_o_points": [],
    "blue_x_points": [
      [5e-5, 2],
      [1e-5, 2],
      [0.00015, 1],
      [5e-5, 2],
      [5e-5, 1],
      [1e-5, 2]
    ]
  },
  "QA_lstPexMuscstrength[ElbowFlex]": {
    "red_x_points": [
      [-0.00722, 1],
      [0.00034, 2],
      [-0.00758, 1],
      [-0.00732, 1],
      [-0.0069, 1],
      [-0.00701, 1],
      [-0.0072, 1],
      [-0.00713, 1],
      [-0.00708, 1],
      [-0.00808, 1],
      [-0.00724, 1],
      [-0.00771, 1],
      [0.00042, 2],
      [-0.00073, 2],
      [0.00084, 2],
      [-0.00753, 1],
      [-0.0075, 1],
      [-0.00722, 1],
      [-0.00725, 1],
      [-0.00773, 1],
      [0.00026, 2],
      [-0.00719, 1],
      [-0.00806, 1],
      [-0.0073, 1],
      [-0.00706, 1],
      [0.00065, 2],
      [-0.00724, 1],
      [-0.00755, 1],
      [0.00019, 2]
    ],
    "red_o_points": [],
    "y_categories": ["GREATER THAN OR EQUALS TO 3", "LESS THAN 3", "nan"],
    "blue_o_points": [],
    "blue_x_points": [
      [0.00124, 2],
      [-0.00705, 1],
      [0.03554, 0],
      [-0.00718, 1],
      [0.00223, 2],
      [0.00174, 2],
      [0.02727, 0],
      [-0.00627, 1],
      [-0.00733, 1],
      [0.00156, 2],
      [0.03436, 0],
      [0.02793, 0],
      [0.03305, 0],
      [0.02944, 0],
      [-0.00643, 1]
    ]
  },
  "QS_mulGraftRoot[C6]": {
    "red_x_points": [
      [-2e-5, 2],
      [-6e-5, 0],
      [-6e-5, 0],
      [-6e-5, 0],
      [-4e-5, 0],
      [-2e-5, 0],
      [-2e-5, 2],
      [-6e-5, 0],
      [-6e-5, 0],
      [-0.0, 2],
      [-6e-5, 0],
      [-2e-5, 2],
      [-4e-5, 0],
      [-4e-5, 0],
      [-0.0, 2],
      [-0.0, 2],
      [-4e-5, 0],
      [-2e-5, 2],
      [-0.0, 2],
      [-0.0, 2],
      [-4e-5, 0],
      [0.0001, 1],
      [-0.0, 2],
      [-4e-5, 0],
      [-2e-5, 2]
    ],
    "red_o_points": [],
    "y_categories": ["N", "NOT APPLICABLE", "nan"],
    "blue_o_points": [],
    "blue_x_points": [
      [0.00028, 1],
      [-0.0, 2],
      [-0.0, 2],
      [0.0001, 1],
      [0.0001, 1],
      [-4e-5, 0],
      [-0.0, 2],
      [-4e-5, 0],
      [0.0001, 1],
      [-0.0, 2],
      [0.0001, 1],
      [-0.0, 2]
    ]
  },
  "QA_yonInjDisloc": {
    "red_x_points": [
      [1e-5, 2],
      [1e-5, 2],
      [0.0, 2],
      [0.0, 2],
      [-0.00046, 0],
      [1e-5, 2],
      [0.0, 2],
      [0.0, 2]
    ],
    "red_o_points": [],
    "y_categories": ["N", "Y", "nan"],
    "blue_o_points": [],
    "blue_x_points": [
      [0.0, 2],
      [1e-5, 2],
      [1e-5, 2],
      [1e-5, 2],
      [0.0, 2],
      [1e-5, 2],
      [0.00034, 1],
      [1e-5, 2],
      [0.0, 2]
    ]
  },
  "QS_mulTransfSite[MeBr]": {
    "red_x_points": [
      [-0.0, 2],
      [-3e-5, 0],
      [-3e-5, 0],
      [-3e-5, 0],
      [-3e-5, 0],
      [-3e-5, 0],
      [-0.0, 2],
      [-3e-5, 0],
      [-3e-5, 0],
      [-0.0, 2],
      [-3e-5, 0],
      [-3e-5, 0],
      [-0.0, 2],
      [-0.0, 2],
      [-3e-5, 0],
      [-0.0, 2],
      [-0.0, 2],
      [-3e-5, 0],
      [-3e-5, 0],
      [-0.0, 2],
      [-0.0, 2],
      [-3e-5, 0],
      [-0.0, 2]
    ],
    "red_o_points": [],
    "y_categories": ["N", "NOT APPLICABLE", "nan"],
    "blue_o_points": [],
    "blue_x_points": [
      [0.00013, 1],
      [-3e-5, 0],
      [-3e-5, 0],
      [-0.0, 2],
      [0.00013, 1],
      [0.00013, 1],
      [-0.0, 2],
      [-0.0, 2],
      [-3e-5, 0],
      [-0.0, 2],
      [0.00013, 1],
      [-0.0, 2]
    ]
  },
  "QS_mulGraftNerve[Ac]": {
    "red_x_points": [
      [-7e-5, 2],
      [-0.00033, 0],
      [-0.0002, 0],
      [-0.00023, 0],
      [-0.0003, 0],
      [-0.00028, 0],
      [-0.00033, 0],
      [-0.00016, 2],
      [-0.00025, 0],
      [-0.0002, 0],
      [-0.00012, 2],
      [-0.00022, 0],
      [-5e-5, 2],
      [-0.0004, 0],
      [-0.00033, 0],
      [-0.0001, 2],
      [-6e-5, 2],
      [-0.00016, 2],
      [-0.00019, 0],
      [-7e-5, 2],
      [-6e-5, 2],
      [-0.00016, 2],
      [-0.00028, 0],
      [-0.00029, 0],
      [-0.00015, 2],
      [0.00092, 1],
      [-6e-5, 2],
      [-0.00027, 0],
      [-4e-5, 2]
    ],
    "red_o_points": [],
    "y_categories": ["N", "NOT APPLICABLE", "nan"],
    "blue_o_points": [],
    "blue_x_points": [
      [0.0015, 1],
      [-6e-5, 2],
      [-0.00016, 0],
      [-8e-5, 0],
      [2e-5, 2],
      [0.0012, 1],
      [0.00095, 1],
      [-0.00022, 0],
      [-6e-5, 2],
      [-4e-5, 2],
      [-0.00012, 0],
      [0.00085, 1],
      [-4e-5, 2],
      [0.00079, 1],
      [-0.00011, 2]
    ]
  },
  "QS_mulNeuromadSite[C8]": {
    "red_x_points": [
      [-0.00018, 2],
      [-0.00147, 0],
      [-0.00114, 0],
      [-0.00096, 0],
      [-0.00119, 0],
      [-0.00092, 0],
      [-0.00119, 0],
      [-0.00014, 2],
      [-0.00126, 0],
      [-0.00112, 0],
      [-0.00014, 2],
      [-0.00126, 0],
      [-0.00022, 2],
      [-0.0015, 0],
      [-0.00163, 0],
      [-0.00023, 2],
      [-0.00021, 2],
      [-0.00019, 2],
      [-0.00102, 0],
      [-0.00032, 2],
      [-0.00024, 2],
      [-0.00026, 2],
      [-0.00143, 0],
      [-0.00127, 0],
      [-0.00025, 2],
      [0.00304, 1],
      [-0.00015, 2],
      [-0.00093, 0],
      [-0.00043, 2]
    ],
    "red_o_points": [],
    "y_categories": ["N", "NOT APPLICABLE", "nan"],
    "blue_o_points": [],
    "blue_x_points": [
      [0.00652, 1],
      [-7e-5, 2],
      [-0.00081, 0],
      [-0.00099, 0],
      [-4e-5, 2],
      [0.0038, 1],
      [0.00345, 1],
      [-0.00073, 0],
      [-5e-5, 2],
      [-8e-5, 2],
      [-0.00083, 0],
      [0.00432, 1],
      [-0.0001, 2],
      [0.00398, 1],
      [-0.00019, 2]
    ]
  },
  "QS_mulTransfSite[AcSsPA]": {
    "red_x_points": [
      [-0.00035, 3],
      [-0.00149, 0],
      [-0.00143, 0],
      [-0.0014, 0],
      [-0.00141, 0],
      [-0.00116, 0],
      [-0.00135, 0],
      [-0.00033, 3],
      [-0.0016, 0],
      [-0.00118, 0],
      [-0.00037, 3],
      [-0.00153, 0],
      [-0.00026, 3],
      [-0.00133, 0],
      [-0.00463, 2],
      [-0.00036, 3],
      [-0.00036, 3],
      [-0.00039, 3],
      [-0.00117, 0],
      [-0.00043, 3],
      [-0.00036, 3],
      [-0.00033, 3],
      [-0.00149, 0],
      [-0.00145, 0],
      [-0.00044, 3],
      [0.00473, 1],
      [-0.00037, 3],
      [-0.00132, 0],
      [-0.00033, 3]
    ],
    "red_o_points": [],
    "y_categories": ["N", "NOT APPLICABLE", "Y", "nan"],
    "blue_o_points": [],
    "blue_x_points": [
      [0.00685, 1],
      [-0.00022, 3],
      [-0.00088, 0],
      [-0.00112, 0],
      [-0.00018, 3],
      [0.00625, 1],
      [0.00478, 1],
      [-0.00099, 0],
      [-0.00024, 3],
      [-0.0002, 3],
      [-0.00103, 0],
      [0.00579, 1],
      [-0.00028, 3],
      [0.00568, 1],
      [-0.00029, 3]
    ]
  },
  "QA_lstPexPalle[Elbow]": {
    "red_x_points": [
      [-0.00063, 4],
      [-0.00293, 4],
      [-0.00174, 4],
      [-0.00171, 3],
      [-0.00281, 4],
      [-0.00055, 3],
      [-0.00293, 4],
      [-0.00033, 4],
      [-0.00398, 4],
      [-0.00042, 3],
      [-0.00207, 1],
      [-0.00405, 4],
      [-0.00058, 4],
      [-0.00344, 4],
      [-0.00147, 4],
      [0.00033, 3],
      [-0.00642, 0],
      [0.0005, 3],
      [-0.00596, 2],
      [0.00038, 3],
      [-0.00047, 4],
      [-0.00034, 4],
      [-0.00371, 4],
      [-0.00358, 4],
      [-0.00023, 4],
      [-0.01866, 3],
      [-0.00054, 4],
      [-0.00453, 0],
      [-0.00049, 4]
    ],
    "red_o_points": [],
    "y_categories": ["ABS", "HYPO", "NAIA", "PT", "nan"],
    "blue_o_points": [],
    "blue_x_points": [
      [0.00295, 4],
      [-0.00026, 4],
      [0.00344, 3],
      [0.02809, 1],
      [-2e-5, 4],
      [0.00347, 4],
      [0.00728, 1],
      [-0.00238, 4],
      [-7e-5, 4],
      [-0.00012, 4],
      [0.01984, 1],
      [0.00309, 4],
      [0.00158, 3],
      [0.00316, 4],
      [0.00333, 3]
    ]
  },
  "QS_mulGraftRoot[C5]": {
    "red_x_points": [
      [-1e-5, 2],
      [-2e-5, 0],
      [-4e-5, 0],
      [-2e-5, 0],
      [-4e-5, 0],
      [-4e-5, 0],
      [-4e-5, 0],
      [-1e-5, 2],
      [-4e-5, 0],
      [-4e-5, 0],
      [-1e-5, 2],
      [-4e-5, 0],
      [-1e-5, 2],
      [-4e-5, 0],
      [-2e-5, 0],
      [-1e-5, 2],
      [-2e-5, 0],
      [-1e-5, 2],
      [-1e-5, 2],
      [-1e-5, 2],
      [-4e-5, 0],
      [-1e-5, 0],
      [-1e-5, 2],
      [-2e-5, 0],
      [-0.0, 2]
    ],
    "red_o_points": [],
    "y_categories": ["N", "NOT APPLICABLE", "nan"],
    "blue_o_points": [],
    "blue_x_points": [
      [0.00029, 1],
      [-0.0, 2],
      [-4e-5, 0],
      [-2e-5, 0],
      [0.00013, 1],
      [-2e-5, 0],
      [-1e-5, 2],
      [-1e-5, 2],
      [-4e-5, 0],
      [0.00013, 1],
      [-1e-5, 2],
      [0.00013, 1],
      [-1e-5, 2]
    ]
  },
  "QA_lstPexMuscstrength[ScapulaAbducSuprot]": {
    "red_x_points": [
      [0.00304, 0],
      [-0.0009, 2],
      [-0.00676, 1],
      [-0.00051, 2],
      [-0.00866, 1],
      [-0.00843, 1],
      [-0.00843, 1],
      [-0.00587, 1],
      [0.00955, 0],
      [-0.00995, 1],
      [-0.00588, 1],
      [-0.00151, 2],
      [-0.00046, 2],
      [-0.00159, 2],
      [-0.00024, 2],
      [0.00384, 0],
      [-0.00594, 1],
      [0.00197, 0],
      [-0.00751, 1],
      [-0.00129, 2],
      [-0.00069, 2],
      [-0.0008, 2],
      [-0.01062, 1],
      [0.00791, 0],
      [-0.00044, 2],
      [0.00017, 2],
      [0.00334, 0],
      [-0.00637, 1],
      [-0.00047, 2]
    ],
    "red_o_points": [],
    "y_categories": ["GREATER THAN OR EQUALS TO 3", "LESS THAN 3", "nan"],
    "blue_o_points": [],
    "blue_x_points": [
      [0.00029, 2],
      [0.007, 0],
      [0.01289, 0],
      [0.013, 0],
      [0.00062, 2],
      [0.00034, 2],
      [0.00322, 0],
      [0.00081, 2],
      [0.00155, 2],
      [0.00025, 2],
      [0.0124, 0],
      [0.00372, 0],
      [0.00434, 0],
      [0.00037, 2],
      [0.00269, 1]
    ]
  },
  "participant_code": {
    "red_x_points": [
      [-0.02139, 1],
      [-0.02208, 2],
      [-0.02173, 3],
      [-0.02208, 4],
      [-0.02249, 5],
      [-0.02146, 8],
      [-0.02269, 9],
      [-0.02221, 10],
      [-0.02043, 11],
      [-0.02187, 13],
      [-0.02208, 14],
      [-0.0205, 18],
      [-0.02235, 19],
      [-0.0216, 20],
      [-0.02043, 23],
      [-0.0229, 26],
      [-0.02214, 28],
      [-0.02098, 29],
      [-0.02208, 30],
      [-0.02125, 31],
      [-0.0216, 32],
      [-0.02221, 34],
      [-0.0218, 36],
      [-0.02098, 38],
      [-0.02208, 39],
      [-0.02105, 40],
      [-0.02187, 41],
      [-0.02118, 42],
      [-0.02166, 43]
    ],
    "red_o_points": [],
    "y_categories": [
      "P16554",
      "P18297",
      "P19283",
      "P19287",
      "P23172",
      "P23391",
      "P30595",
      "P31645",
      "P31691",
      "P34778",
      "P35046",
      "P36328",
      "P43633",
      "P4544",
      "P46417",
      "P48965",
      "P53068",
      "P5497",
      "P58556",
      "P59529",
      "P62483",
      "P64658",
      "P65202",
      "P66816",
      "P6751",
      "P7408",
      "P75566",
      "P76226",
      "P79971",
      "P82621",
      "P82990",
      "P84549",
      "P84932",
      "P85825",
      "P86989",
      "P8770",
      "P87791",
      "P90550",
      "P93159",
      "P94969",
      "P96710",
      "P97130",
      "P9744",
      "P98500",
      "nan"
    ],
    "blue_o_points": [],
    "blue_x_points": [
      [0.0431, 0],
      [0.04192, 6],
      [0.04402, 7],
      [0.04284, 12],
      [0.03981, 15],
      [0.04047, 16],
      [0.04231, 17],
      [0.04336, 21],
      [0.04047, 22],
      [0.04284, 24],
      [0.04271, 25],
      [0.04126, 27],
      [0.03955, 33],
      [0.04113, 35],
      [0.04336, 37]
    ]
  },
  "QA_lstPexMuscstrength[ShoulderExrot]": {
    "red_x_points": [
      [-6e-5, 1],
      [-0.00046, 2],
      [-0.00115, 0],
      [-0.00026, 2],
      [0.00059, 1],
      [0.00028, 1],
      [-0.00048, 2],
      [-7e-5, 1],
      [0.00034, 1],
      [-0.00068, 2],
      [-0.0001, 1],
      [-0.00113, 2],
      [4e-5, 2],
      [-0.00096, 2],
      [-0.00073, 2],
      [-0.00014, 1],
      [-9e-5, 1],
      [-0.00017, 1],
      [-0.0005, 2],
      [-4e-5, 2],
      [4e-5, 2],
      [2e-5, 2],
      [0.0013, 1],
      [-0.00668, 0],
      [1e-5, 2],
      [-6e-5, 2],
      [3e-5, 2],
      [0.00024, 1],
      [2e-5, 2]
    ],
    "red_o_points": [],
    "y_categories": ["GREATER THAN OR EQUALS TO 3", "LESS THAN 3", "nan"],
    "blue_o_points": [],
    "blue_x_points": [
      [1e-5, 2],
      [0.00054, 2],
      [0.00295, 1],
      [0.00348, 1],
      [1e-5, 2],
      [1e-5, 2],
      [0.00051, 0],
      [-0.00043, 2],
      [0.00031, 2],
      [2e-5, 2],
      [0.00263, 1],
      [0.00048, 0],
      [0.00018, 2],
      [0.00013, 2]
    ]
  },
  "QA_yonInjTbi": {
    "red_x_points": [
      [0.00843, 0],
      [-0.00232, 2],
      [-0.0023, 0],
      [-0.00201, 0],
      [-0.00253, 2],
      [0.00087, 1],
      [-0.00245, 0],
      [-0.01088, 2],
      [-0.00433, 2],
      [0.00153, 1],
      [-0.00462, 1],
      [-0.00427, 0],
      [0.00705, 0],
      [0.00081, 1],
      [0.00041, 1],
      [-0.00524, 1],
      [-0.00463, 1],
      [-0.0056, 1],
      [0.0011, 1],
      [-0.00573, 1],
      [0.00732, 0],
      [-0.00613, 1],
      [0.0016, 1],
      [0.00122, 1],
      [-0.00559, 1],
      [-0.0012, 2],
      [-0.00952, 2],
      [0.00034, 1],
      [-0.00668, 1]
    ],
    "red_o_points": [],
    "y_categories": ["N", "Y", "nan"],
    "blue_o_points": [],
    "blue_x_points": [
      [0.0006, 0],
      [-0.0028, 1],
      [0.00253, 1],
      [0.00307, 1],
      [0.0118, 0],
      [3e-5, 1],
      [7e-5, 1],
      [0.0032, 1],
      [0.013, 0],
      [0.01147, 0],
      [0.00252, 1],
      [3e-5, 2],
      [-0.00382, 1],
      [-2e-5, 2],
      [0.01368, 0]
    ]
  },
  "QS_mulGraftNerve[Ul]": {
    "red_x_points": [
      [-2e-5, 2],
      [-0.00039, 0],
      [-0.00041, 0],
      [-0.00031, 0],
      [-0.00033, 0],
      [-0.00028, 0],
      [-0.00024, 0],
      [-2e-5, 2],
      [-0.00028, 0],
      [-0.00025, 0],
      [4e-5, 2],
      [-0.00036, 0],
      [-2e-5, 2],
      [-0.0004, 0],
      [-0.00035, 0],
      [-0.0, 2],
      [3e-5, 2],
      [-1e-5, 2],
      [-0.00029, 0],
      [-1e-5, 2],
      [0.0, 2],
      [-1e-5, 2],
      [-0.00033, 0],
      [-0.00028, 0],
      [-2e-5, 2],
      [0.00062, 1],
      [-3e-5, 2],
      [-0.00032, 0],
      [-2e-5, 2]
    ],
    "red_o_points": [],
    "y_categories": ["N", "NOT APPLICABLE", "nan"],
    "blue_o_points": [],
    "blue_x_points": [
      [0.00127, 1],
      [2e-5, 2],
      [-0.00014, 0],
      [-0.00012, 0],
      [3e-5, 2],
      [0.00108, 1],
      [0.00069, 1],
      [-0.00017, 0],
      [-1e-5, 2],
      [-0.0, 2],
      [-0.00023, 0],
      [0.00095, 1],
      [4e-5, 2],
      [0.00092, 1],
      [-4e-5, 2]
    ]
  },
  "QS_mulGraftNerve[Ssr]": {
    "red_x_points": [
      [6e-5, 2],
      [-0.00024, 0],
      [-9e-5, 0],
      [-0.00014, 0],
      [-3e-5, 0],
      [-0.00014, 0],
      [-9e-5, 0],
      [-3e-5, 0],
      [1e-5, 2],
      [-0.00018, 0],
      [1e-5, 2],
      [-0.00016, 0],
      [-9e-5, 0],
      [1e-5, 2],
      [1e-5, 2],
      [-3e-5, 0],
      [0.0, 2],
      [5e-5, 2],
      [4e-5, 2],
      [-8e-5, 0],
      [-0.00011, 0],
      [1e-5, 2],
      [0.00015, 1],
      [-3e-5, 0],
      [0.0, 2]
    ],
    "red_o_points": [],
    "y_categories": ["N", "NOT APPLICABLE", "nan"],
    "blue_o_points": [],
    "blue_x_points": [
      [0.00072, 1],
      [5e-5, 2],
      [-3e-5, 0],
      [-3e-5, 0],
      [1e-5, 2],
      [0.00015, 1],
      [8e-5, 1],
      [4e-5, 2],
      [-0.0, 2],
      [-3e-5, 0],
      [1e-5, 2],
      [8e-5, 1],
      [1e-5, 2]
    ]
  },
  "QA_intPexShoulderFlex": {
    "red_x_points": [
      [0.00013, 1],
      [-2e-5, 2],
      [-0.0003, 2],
      [-0.00012, 2],
      [-0.00548, 0],
      [-0.00012, 2],
      [-0.00038, 2],
      [-0.00051, 2],
      [0.00062, 1],
      [-0.00028, 2],
      [-0.00012, 2],
      [6e-5, 1],
      [8e-5, 1],
      [0.00017, 1],
      [-0.0001, 2],
      [-0.0003, 2],
      [-0.00034, 2],
      [3e-5, 1],
      [8e-5, 1]
    ],
    "red_o_points": [],
    "y_categories": ["GREATER THAN OR EQUALS TO 180", "LESS THAN 180", "nan"],
    "blue_o_points": [],
    "blue_x_points": [
      [3e-5, 1],
      [0.00402, 1],
      [-0.00012, 2],
      [3e-5, 1],
      [-0.00012, 2],
      [0.00277, 1],
      [8e-5, 1],
      [0.0002, 1]
    ]
  },
  "QS_mulGraftNerve[MCA]": {
    "red_x_points": [
      [-1e-5, 2],
      [-0.00015, 0],
      [-0.00019, 0],
      [-0.00012, 0],
      [-0.00023, 0],
      [-0.00016, 0],
      [-0.00016, 0],
      [-0.0, 2],
      [-0.00023, 0],
      [-9e-5, 0],
      [-2e-5, 2],
      [-0.00014, 0],
      [-1e-5, 2],
      [-0.00023, 0],
      [-0.0002, 0],
      [-1e-5, 2],
      [-1e-5, 2],
      [-2e-5, 2],
      [-0.00018, 0],
      [-0.0, 2],
      [-1e-5, 2],
      [-1e-5, 2],
      [-0.00017, 0],
      [-0.00016, 0],
      [-1e-5, 2],
      [0.00037, 1],
      [-2e-5, 2],
      [-0.00014, 0],
      [-2e-5, 2]
    ],
    "red_o_points": [],
    "y_categories": ["N", "NOT APPLICABLE", "nan"],
    "blue_o_points": [],
    "blue_x_points": [
      [0.00063, 1],
      [-0.0, 2],
      [-8e-5, 0],
      [-0.00018, 0],
      [-0.0, 2],
      [0.00054, 1],
      [0.00054, 1],
      [-0.00012, 0],
      [-0.0, 2],
      [-1e-5, 2],
      [-0.00016, 0],
      [0.00058, 1],
      [-2e-5, 2],
      [0.00063, 1],
      [-2e-5, 2]
    ]
  },
  "QA_lstPexInspectio[Swelling]": {
    "red_x_points": [
      [0.00153, 1],
      [-0.00182, 1],
      [0.00129, 0],
      [-0.00167, 1],
      [0.00033, 2],
      [0.00195, 0],
      [-0.00242, 1],
      [0.00125, 1],
      [-0.00495, 1],
      [-0.00615, 1],
      [-0.00652, 2],
      [-0.00458, 1],
      [-0.00345, 0],
      [-0.0045, 1],
      [-0.00184, 1],
      [-0.00147, 0],
      [-0.00665, 2],
      [0.00156, 1],
      [-0.00221, 1],
      [0.00153, 1],
      [-0.00352, 0],
      [0.00148, 1],
      [-0.00483, 1],
      [0.00349, 0],
      [0.00153, 1],
      [-0.00382, 0],
      [-0.00723, 2],
      [0.0007, 0],
      [0.00176, 1]
    ],
    "red_o_points": [],
    "y_categories": ["ABS", "NAIA", "PT", "nan"],
    "blue_o_points": [],
    "blue_x_points": [
      [0.00182, 1],
      [0.00253, 1],
      [0.0081, 0],
      [0.00962, 0],
      [0.00373, 1],
      [0.0015, 1],
      [-3e-5, 0],
      [-0.00256, 1],
      [0.00247, 0],
      [0.00354, 1],
      [0.01331, 2],
      [0.0009, 1],
      [0.0022, 1],
      [-0.00035, 0],
      [0.00244, 1]
    ]
  },
  "QS_mulGraftTrunk[UpperTrunk]": {
    "red_x_points": [
      [-0.00027, 3],
      [-0.00311, 0],
      [-0.00205, 0],
      [-0.00225, 0],
      [-0.00228, 0],
      [-0.00212, 0],
      [-0.00243, 0],
      [-0.00027, 3],
      [-0.00188, 0],
      [-0.00184, 0],
      [-0.00026, 3],
      [-0.00239, 0],
      [-0.00058, 3],
      [-0.00884, 2],
      [-0.00269, 0],
      [-0.00036, 3],
      [-0.00021, 3],
      [-0.00036, 3],
      [-0.00211, 0],
      [-0.00029, 3],
      [-0.00048, 3],
      [-0.00044, 3],
      [-0.00235, 0],
      [-0.0022, 0],
      [-0.00034, 3],
      [0.00625, 1],
      [-0.00032, 3],
      [-0.00202, 0],
      [-0.00044, 3]
    ],
    "red_o_points": [],
    "y_categories": ["N", "NOT APPLICABLE", "Y", "nan"],
    "blue_o_points": [],
    "blue_x_points": [
      [0.01127, 1],
      [-7e-5, 3],
      [-0.00127, 0],
      [-0.0012, 0],
      [-0.0, 3],
      [0.00986, 1],
      [0.00712, 1],
      [-0.00136, 0],
      [-0.00014, 3],
      [-0.0001, 3],
      [-0.00115, 0],
      [0.00811, 1],
      [-0.0003, 3],
      [0.00828, 1],
      [-0.00012, 3]
    ]
  },
  "QS_mulLysisDivision[ADivisionUTrunk]": {
    "red_x_points": [
      [0.0, 2],
      [-2e-5, 0],
      [-2e-5, 0],
      [-2e-5, 0],
      [-2e-5, 0],
      [-2e-5, 0],
      [-2e-5, 0],
      [0.0, 2],
      [-2e-5, 0],
      [0.0, 2],
      [-2e-5, 0],
      [0.0, 2],
      [0.0, 2],
      [0.0, 2],
      [0.0, 2],
      [0.0, 2],
      [-2e-5, 0],
      [-2e-5, 0],
      [0.0, 2]
    ],
    "red_o_points": [],
    "y_categories": ["N", "NOT APPLICABLE", "nan"],
    "blue_o_points": [],
    "blue_x_points": [[0.00017, 1], [0.0, 2], [-2e-5, 0], [0.0, 2]]
  },
  "QA_lstPexInspectio[ShoulderSubdisloc]": {
    "red_x_points": [
      [-0.00149, 1],
      [-0.00358, 1],
      [0.00316, 0],
      [-0.00258, 1],
      [-0.00487, 1],
      [-0.0027, 2],
      [-0.00409, 1],
      [-0.00205, 1],
      [-0.00667, 1],
      [-0.00635, 1],
      [-0.00133, 2],
      [-0.00601, 1],
      [-0.0019, 1],
      [-0.00636, 1],
      [-0.00242, 1],
      [-0.00263, 2],
      [-0.00081, 2],
      [-7e-5, 1],
      [-0.00303, 1],
      [-0.00065, 1],
      [-0.00891, 0],
      [0.00204, 2],
      [-0.002, 2],
      [-0.00095, 2],
      [-0.0013, 1],
      [-0.01078, 2],
      [-0.00156, 1],
      [-0.00096, 2],
      [-0.00186, 1]
    ],
    "red_o_points": [],
    "y_categories": ["ABS", "NAIA", "PT", "nan"],
    "blue_o_points": [],
    "blue_x_points": [
      [0.00319, 1],
      [0.00663, 2],
      [0.02536, 0],
      [0.00386, 2],
      [0.00039, 1],
      [0.00373, 1],
      [0.0048, 0],
      [-0.00305, 1],
      [0.00875, 2],
      [0.0004, 1],
      [0.02472, 0],
      [0.00231, 1],
      [0.00149, 1],
      [-0.00164, 2],
      [0.00179, 1]
    ]
  },
  "QA_yonPreTbi": {
    "red_x_points": [
      [-0.00074, 2],
      [-3e-5, 2],
      [-7e-5, 2],
      [-5e-5, 2],
      [-7e-5, 2],
      [-6e-5, 2],
      [-8e-5, 2],
      [-0.00061, 2],
      [-5e-5, 2],
      [-8e-5, 2],
      [-0.00087, 2],
      [-9e-5, 2],
      [-0.00063, 2],
      [-2e-5, 2],
      [-0.01064, 1],
      [-0.00088, 2],
      [-0.0006, 2],
      [-4e-5, 2],
      [-0.00076, 2],
      [-0.00067, 2],
      [-0.00084, 2],
      [-0.00011, 2],
      [-6e-5, 2],
      [-0.00056, 2],
      [-0.0, 2],
      [-0.00051, 2],
      [-9e-5, 2],
      [-0.00082, 2]
    ],
    "red_o_points": [],
    "y_categories": ["N", "Y", "nan"],
    "blue_o_points": [],
    "blue_x_points": [
      [-0.0, 2],
      [0.02256, 0],
      [2e-5, 2],
      [-6e-5, 2],
      [-0.00037, 2],
      [-0.0, 2],
      [2e-5, 2],
      [-6e-5, 2],
      [-0.00063, 2],
      [-0.00043, 2],
      [6e-5, 2],
      [2e-5, 2],
      [-0.00045, 2],
      [-0.00065, 2]
    ]
  },
  "QS_mulGraftLevel[Trunk]": {
    "red_x_points": [
      [-0.00031, 3],
      [-0.00243, 0],
      [-0.00157, 0],
      [-0.00174, 0],
      [-0.00193, 0],
      [-0.00175, 0],
      [-0.00194, 0],
      [-0.00057, 3],
      [-0.00199, 0],
      [-0.00161, 0],
      [-0.00049, 3],
      [-0.00184, 0],
      [-0.00035, 3],
      [-0.00744, 2],
      [-0.00227, 0],
      [-0.00058, 3],
      [-0.00029, 3],
      [-0.00042, 3],
      [-0.00165, 0],
      [-0.00039, 3],
      [-0.00041, 3],
      [-0.00046, 3],
      [-0.0018, 0],
      [-0.00166, 0],
      [-0.00033, 3],
      [0.00602, 1],
      [-0.00049, 3],
      [-0.00162, 0],
      [-0.00046, 3]
    ],
    "red_o_points": [],
    "y_categories": ["N", "NOT APPLICABLE", "Y", "nan"],
    "blue_o_points": [],
    "blue_x_points": [
      [0.01071, 1],
      [-0.00025, 3],
      [-0.00107, 0],
      [-0.00104, 0],
      [-6e-5, 3],
      [0.00789, 1],
      [0.00588, 1],
      [-0.00154, 0],
      [-0.00032, 3],
      [-0.00011, 3],
      [-0.00108, 0],
      [0.00752, 1],
      [-0.00035, 3],
      [0.00688, 1],
      [-0.00029, 3]
    ]
  },
  "QS_mulGraftNerve[Sc]": {
    "red_x_points": [
      [1e-5, 2],
      [-3e-5, 0],
      [-6e-5, 0],
      [-6e-5, 0],
      [-0.0001, 0],
      [-3e-5, 0],
      [-0.0001, 0],
      [2e-5, 2],
      [-0.0001, 0],
      [-4e-5, 0],
      [1e-5, 2],
      [-4e-5, 0],
      [1e-5, 2],
      [-0.0001, 0],
      [-6e-5, 0],
      [1e-5, 2],
      [1e-5, 2],
      [3e-5, 2],
      [-7e-5, 0],
      [2e-5, 2],
      [1e-5, 2],
      [3e-5, 2],
      [-7e-5, 0],
      [2e-5, 2],
      [0.00014, 1],
      [3e-5, 2],
      [-3e-5, 0],
      [3e-5, 2]
    ],
    "red_o_points": [],
    "y_categories": ["N", "NOT APPLICABLE", "nan"],
    "blue_o_points": [],
    "blue_x_points": [
      [0.00013, 1],
      [1e-5, 2],
      [-3e-5, 0],
      [-3e-5, 0],
      [3e-5, 2],
      [0.00014, 1],
      [8e-5, 1],
      [-6e-5, 0],
      [3e-5, 2],
      [3e-5, 2],
      [-3e-5, 0],
      [0.00013, 1],
      [1e-5, 2],
      [8e-5, 1],
      [1e-5, 2]
    ]
  },
  "QA_lstPexPain[C7]": {
    "red_x_points": [
      [-0.00151, 1],
      [-0.00418, 2],
      [-0.00315, 2],
      [-0.00121, 1],
      [-0.00393, 2],
      [-0.00342, 1],
      [-0.00179, 1],
      [-0.00601, 0],
      [-0.00453, 1],
      [0.00833, 0],
      [-0.00175, 1],
      [-0.00582, 2],
      [0.00144, 2],
      [-0.0056, 2],
      [-0.00284, 2],
      [-0.00466, 0],
      [-0.00139, 1],
      [-0.00482, 0],
      [-0.00378, 2],
      [-0.00499, 0],
      [0.00126, 2],
      [0.00135, 2],
      [-0.00715, 2],
      [-0.00652, 2],
      [-0.00406, 0],
      [-0.00266, 1],
      [-0.00129, 1],
      [-0.00187, 1],
      [-0.00164, 1]
    ],
    "red_o_points": [],
    "y_categories": ["NORM", "NPV", "nan"],
    "blue_o_points": [],
    "blue_x_points": [
      [0.00011, 1],
      [0.00403, 1],
      [0.01588, 0],
      [0.01747, 0],
      [0.00538, 2],
      [0.00016, 2],
      [8e-5, 1],
      [0.00129, 1],
      [0.00579, 2],
      [0.00562, 2],
      [0.01404, 0],
      [-1e-5, 1],
      [-0.00069, 0],
      [0.00291, 0],
      [0.0061, 1]
    ]
  },
  "QS_mulGraftNerve[MP]": {
    "red_x_points": [
      [-0.0, 2],
      [-7e-5, 0],
      [-3e-5, 0],
      [-3e-5, 0],
      [-7e-5, 0],
      [-3e-5, 0],
      [-4e-5, 0],
      [-0.0, 2],
      [-0.00013, 0],
      [-3e-5, 0],
      [-0.0, 2],
      [-7e-5, 0],
      [-7e-5, 0],
      [-0.0, 2],
      [-0.0, 2],
      [-3e-5, 0],
      [-0.0, 2],
      [-0.0, 2],
      [-0.0, 2],
      [-0.0001, 0],
      [-7e-5, 0],
      [0.0, 2],
      [9e-5, 1],
      [-0.0, 2],
      [-3e-5, 0],
      [-0.0, 2]
    ],
    "red_o_points": [],
    "y_categories": ["N", "NOT APPLICABLE", "nan"],
    "blue_o_points": [],
    "blue_x_points": [
      [0.0003, 1],
      [-0.0, 2],
      [-3e-5, 0],
      [-8e-5, 0],
      [-0.0, 2],
      [0.00022, 1],
      [-7e-5, 0],
      [8e-5, 2],
      [0.00022, 1],
      [-0.0, 2],
      [9e-5, 1],
      [-0.0, 2]
    ]
  },
  "QS_mulGraftNerve[Ax]": {
    "red_x_points": [
      [-1e-5, 2],
      [-0.00026, 0],
      [-0.0003, 0],
      [-0.00027, 0],
      [-0.00036, 0],
      [-0.00031, 0],
      [-0.00024, 0],
      [-0.00013, 2],
      [-0.00037, 0],
      [-0.00028, 0],
      [-2e-5, 2],
      [-0.00025, 0],
      [-4e-5, 2],
      [-0.00041, 0],
      [-0.00031, 0],
      [-6e-5, 2],
      [-3e-5, 2],
      [-5e-5, 2],
      [-0.00028, 0],
      [-7e-5, 2],
      [-3e-5, 2],
      [-7e-5, 2],
      [-0.0003, 0],
      [-0.00033, 0],
      [-8e-5, 2],
      [0.00063, 1],
      [-8e-5, 2],
      [-0.00024, 0],
      [-2e-5, 2]
    ],
    "red_o_points": [],
    "y_categories": ["N", "NOT APPLICABLE", "nan"],
    "blue_o_points": [],
    "blue_x_points": [
      [0.00165, 1],
      [-9e-5, 2],
      [-0.00021, 0],
      [-0.00031, 0],
      [0.0, 2],
      [0.00114, 1],
      [0.00076, 1],
      [-0.0002, 0],
      [-9e-5, 2],
      [-1e-5, 2],
      [-0.00013, 0],
      [0.00121, 1],
      [-5e-5, 2],
      [0.00092, 1],
      [-4e-5, 2]
    ]
  },
  "QA_intPexForearmSupin": {
    "red_x_points": [
      [-0.00069, 2],
      [-0.00395, 0],
      [-0.00078, 2],
      [-0.0005, 2],
      [-0.00099, 2],
      [0.00285, 1],
      [-0.00104, 2],
      [0.00178, 1],
      [-0.00109, 2],
      [-0.00127, 2],
      [-0.00517, 0],
      [-0.00588, 0],
      [-0.00049, 2],
      [-0.00113, 2],
      [-0.00033, 2],
      [0.00331, 1],
      [-0.00529, 0],
      [0.00107, 1],
      [0.002, 1],
      [-0.00053, 2],
      [-0.00046, 2],
      [-0.00063, 2],
      [-0.00123, 2],
      [-0.00104, 2],
      [-0.00014, 2],
      [-0.02199, 1],
      [-0.00031, 2],
      [-0.00302, 0],
      [-0.0007, 2]
    ],
    "red_o_points": [],
    "y_categories": ["GREATER THAN OR EQUALS TO 80", "LESS THAN 80", "nan"],
    "blue_o_points": [],
    "blue_x_points": [
      [0.00397, 2],
      [0.00565, 1],
      [0.00885, 1],
      [-0.00084, 2],
      [0.0, 2],
      [0.00405, 2],
      [0.00553, 0],
      [-0.00059, 2],
      [-0.00042, 2],
      [3e-5, 2],
      [0.00783, 1],
      [0.004, 2],
      [2e-5, 2],
      [0.00436, 2],
      [0.00519, 1]
    ]
  },
  "QS_mulGraftNerve[MCF]": {
    "red_x_points": [
      [-4e-5, 2],
      [-0.00011, 0],
      [-9e-5, 0],
      [-9e-5, 0],
      [-5e-5, 0],
      [-0.0001, 0],
      [-0.00011, 0],
      [-5e-5, 2],
      [-4e-5, 0],
      [-0.00011, 0],
      [-4e-5, 2],
      [-8e-5, 0],
      [-4e-5, 2],
      [-0.00017, 0],
      [-0.00016, 0],
      [-5e-5, 2],
      [-4e-5, 2],
      [-4e-5, 2],
      [-6e-5, 0],
      [-3e-5, 2],
      [-2e-5, 2],
      [-5e-5, 2],
      [-0.00011, 0],
      [-0.00011, 0],
      [-5e-5, 2],
      [0.0005, 1],
      [-4e-5, 2],
      [-9e-5, 0],
      [-5e-5, 2]
    ],
    "red_o_points": [],
    "y_categories": ["N", "NOT APPLICABLE", "nan"],
    "blue_o_points": [],
    "blue_x_points": [
      [0.0005, 1],
      [-1e-5, 2],
      [-5e-5, 0],
      [-0.00011, 0],
      [-3e-5, 2],
      [0.00042, 1],
      [0.00037, 1],
      [-0.00011, 0],
      [-4e-5, 2],
      [-4e-5, 2],
      [-9e-5, 0],
      [0.00038, 1],
      [-2e-5, 2],
      [0.00037, 1],
      [-5e-5, 2]
    ]
  },
  "QS_mulLysisSite[Nerve]": {
    "red_x_points": [
      [-0.00039, 3],
      [-0.00342, 0],
      [-0.00904, 2],
      [-0.00864, 2],
      [-0.0031, 0],
      [-0.0027, 0],
      [-0.00302, 0],
      [-0.00061, 3],
      [-0.00289, 0],
      [-0.00277, 0],
      [-0.00038, 3],
      [-0.0033, 0],
      [-0.00049, 3],
      [-0.00368, 0],
      [-0.00369, 0],
      [-0.00069, 3],
      [-0.00049, 3],
      [-0.00072, 3],
      [-0.00262, 0],
      [-0.00056, 3],
      [-0.00061, 3],
      [-0.00048, 3],
      [-0.00298, 0],
      [-0.00313, 0],
      [-0.00064, 3],
      [0.0093, 1],
      [-0.00057, 3],
      [-0.00279, 0],
      [-0.00044, 3]
    ],
    "red_o_points": [],
    "y_categories": ["N", "NOT APPLICABLE", "Y", "nan"],
    "blue_o_points": [],
    "blue_x_points": [
      [0.01684, 1],
      [-0.00026, 3],
      [-0.00179, 0],
      [-0.00173, 0],
      [1e-5, 3],
      [0.01351, 1],
      [0.011, 1],
      [-0.00248, 0],
      [-0.00035, 3],
      [-0.00019, 3],
      [-0.00151, 0],
      [0.01107, 1],
      [-0.00051, 3],
      [0.01213, 1],
      [-0.00019, 3]
    ]
  },
  "QS_mulTransfSite[IMc]": {
    "red_x_points": [
      [-0.00101, 3],
      [-0.01477, 2],
      [-0.00234, 0],
      [-0.01294, 2],
      [-0.00233, 0],
      [-0.00201, 0],
      [-0.00229, 0],
      [-0.00125, 3],
      [-0.00236, 0],
      [-0.00202, 0],
      [-0.00096, 3],
      [-0.00238, 0],
      [-0.00111, 3],
      [-0.00296, 0],
      [-0.01331, 2],
      [-0.00121, 3],
      [-0.00113, 3],
      [-0.00112, 3],
      [-0.00226, 0],
      [-0.00115, 3],
      [-0.00096, 3],
      [-0.0012, 3],
      [-0.00234, 0],
      [-0.01461, 2],
      [-0.00109, 3],
      [0.01546, 1],
      [-0.00117, 3],
      [-0.0143, 2],
      [-0.00117, 3]
    ],
    "red_o_points": [],
    "y_categories": ["N", "NOT APPLICABLE", "Y", "nan"],
    "blue_o_points": [],
    "blue_x_points": [
      [0.02395, 1],
      [-0.00068, 3],
      [-0.00088, 0],
      [-0.00068, 0],
      [-0.00061, 3],
      [0.02097, 1],
      [0.01836, 1],
      [-0.00148, 0],
      [-0.00068, 3],
      [-0.00071, 3],
      [-0.00119, 0],
      [0.01832, 1],
      [-0.00066, 3],
      [0.01884, 1],
      [-0.00061, 3]
    ]
  },
  "QS_mulGraftLevel[other]": {
    "red_x_points": [
      [-0.0, 2],
      [-3e-5, 0],
      [-3e-5, 0],
      [-3e-5, 0],
      [-3e-5, 0],
      [-0.0, 2],
      [-3e-5, 0],
      [-3e-5, 0],
      [-0.0, 2],
      [-3e-5, 0],
      [-0.0, 2],
      [-3e-5, 0],
      [-3e-5, 0],
      [-0.0, 2],
      [-0.0, 2],
      [-3e-5, 0],
      [-0.0, 2],
      [-0.0, 2],
      [-3e-5, 0],
      [-3e-5, 0],
      [-0.0, 2],
      [-3e-5, 0],
      [-0.0, 2]
    ],
    "red_o_points": [],
    "y_categories": ["N", "NOT APPLICABLE", "nan"],
    "blue_o_points": [],
    "blue_x_points": [
      [0.00013, 1],
      [-0.0, 2],
      [-3e-5, 0],
      [-0.0, 2],
      [0.00013, 1],
      [0.00013, 1],
      [-3e-5, 0],
      [-0.0, 2],
      [-3e-5, 0],
      [0.00013, 1],
      [-0.0, 2],
      [-0.0, 2]
    ]
  },
  "QS_lstBpsurgSide": {
    "red_x_points": [
      [-0.00068, 3],
      [-0.00962, 0],
      [-0.00985, 0],
      [-0.00912, 0],
      [-0.00975, 0],
      [-0.01038, 0],
      [-0.01003, 0],
      [-0.00099, 3],
      [-0.01078, 0],
      [0.00055, 2],
      [-0.00071, 3],
      [-0.00033, 2],
      [-0.00125, 3],
      [-0.00029, 2],
      [-0.00129, 2],
      [-0.00093, 3],
      [-0.00083, 3],
      [-0.0008, 3],
      [-0.00855, 0],
      [-0.00058, 3],
      [-0.00121, 3],
      [-0.00125, 3],
      [0.00023, 2],
      [0.00021, 2],
      [-0.0011, 3],
      [0.01441, 1],
      [-0.00101, 3],
      [-0.00902, 0],
      [-0.00129, 3]
    ],
    "red_o_points": [],
    "y_categories": ["L", "NOT APPLICABLE", "R", "nan"],
    "blue_o_points": [],
    "blue_x_points": [
      [0.0235, 1],
      [-0.00072, 3],
      [0.00288, 2],
      [0.00358, 2],
      [-0.00038, 3],
      [0.01617, 1],
      [0.01458, 1],
      [-0.00461, 0],
      [-0.0007, 3],
      [-0.00046, 3],
      [0.00252, 2],
      [0.01478, 1],
      [-0.00049, 3],
      [0.01618, 1],
      [-0.00061, 3]
    ]
  },
  "QS_mulTransfSite[AcMc]": {
    "red_x_points": [
      [-0.00028, 3],
      [-0.00291, 0],
      [-0.00176, 0],
      [-0.00174, 0],
      [-0.00196, 0],
      [-0.00173, 0],
      [-0.0019, 0],
      [-0.00045, 3],
      [-0.00183, 0],
      [-0.00823, 2],
      [-0.00028, 3],
      [-0.00195, 0],
      [-0.00033, 3],
      [-0.00252, 0],
      [-0.00237, 0],
      [-0.00068, 3],
      [-0.00017, 3],
      [-0.00025, 3],
      [-0.00176, 0],
      [-0.0004, 3],
      [-0.00049, 3],
      [-0.00047, 3],
      [-0.00216, 0],
      [-0.00189, 0],
      [-0.00048, 3],
      [0.00603, 1],
      [-0.00039, 3],
      [-0.00158, 0],
      [-0.00036, 3]
    ],
    "red_o_points": [],
    "y_categories": ["N", "NOT APPLICABLE", "Y", "nan"],
    "blue_o_points": [],
    "blue_x_points": [
      [0.0098, 1],
      [-0.00021, 3],
      [0.0007, 0],
      [0.00049, 0],
      [4e-5, 3],
      [0.00792, 1],
      [0.00551, 1],
      [-0.0013, 0],
      [-0.00018, 3],
      [-0.00013, 3],
      [-0.00039, 0],
      [0.0068, 1],
      [-0.00015, 3],
      [0.00684, 1],
      [-0.00044, 3]
    ]
  },
  "QS_mulTransfSite[Other]": {
    "red_x_points": [
      [-0.00098, 3],
      [-0.00756, 0],
      [-0.00661, 0],
      [-0.00648, 0],
      [-0.00708, 0],
      [-0.00698, 0],
      [-0.00653, 0],
      [-0.00111, 3],
      [-0.00699, 0],
      [-0.00665, 0],
      [-0.00106, 3],
      [-0.00633, 0],
      [-0.00128, 3],
      [-0.00758, 0],
      [-0.00739, 0],
      [-0.00108, 3],
      [-0.00093, 3],
      [-0.0011, 3],
      [-0.00566, 0],
      [-0.00095, 3],
      [-0.00132, 3],
      [-0.00125, 3],
      [-0.00675, 0],
      [-0.00685, 0],
      [-0.00134, 3],
      [0.01565, 1],
      [-0.0012, 3],
      [-0.00678, 0],
      [-0.00116, 3]
    ],
    "red_o_points": [],
    "y_categories": ["N", "NOT APPLICABLE", "Y", "nan"],
    "blue_o_points": [],
    "blue_x_points": [
      [0.02217, 1],
      [-0.0007, 3],
      [-0.00639, 0],
      [-0.00597, 0],
      [-0.00056, 3],
      [0.0193, 1],
      [0.01623, 1],
      [-0.00578, 0],
      [-0.00071, 3],
      [-0.00066, 3],
      [0.03089, 2],
      [0.01771, 1],
      [-0.00078, 3],
      [0.01717, 1],
      [-0.00062, 3]
    ]
  },
  "QA_lstPexTouch[C8]": {
    "red_x_points": [
      [-0.00171, 1],
      [-0.00513, 2],
      [-0.00262, 1],
      [-0.00223, 1],
      [-0.00541, 2],
      [-0.00379, 1],
      [-0.00284, 1],
      [-0.00292, 0],
      [-0.00513, 1],
      [0.00938, 0],
      [-0.0014, 1],
      [-0.00798, 2],
      [-0.00146, 2],
      [-0.00701, 2],
      [-0.00304, 2],
      [-0.00102, 0],
      [-0.00149, 1],
      [-0.0018, 0],
      [-0.00392, 2],
      [-0.00116, 0],
      [-0.00131, 2],
      [-0.00342, 0],
      [-0.00396, 1],
      [-0.00777, 2],
      [-0.00268, 0],
      [-0.00583, 1],
      [-0.00077, 2],
      [-0.00266, 1],
      [-0.00143, 1]
    ],
    "red_o_points": [],
    "y_categories": ["NORM", "NPV", "nan"],
    "blue_o_points": [],
    "blue_x_points": [
      [0.00365, 0],
      [0.00519, 1],
      [0.01732, 0],
      [0.02052, 0],
      [0.00378, 2],
      [0.00076, 2],
      [-0.00017, 1],
      [-0.00145, 1],
      [0.00567, 1],
      [0.00346, 2],
      [0.01571, 0],
      [-0.00017, 1],
      [0.00053, 0],
      [0.00336, 0],
      [0.00436, 0]
    ]
  },
  "QS_mulLysisNerve[Ssr]": {
    "red_x_points": [
      [-0.00092, 3],
      [-0.00321, 0],
      [-0.00942, 2],
      [-0.00895, 2],
      [-0.00251, 0],
      [-0.00218, 0],
      [-0.00261, 0],
      [-0.00078, 3],
      [-0.0027, 0],
      [-0.00241, 0],
      [-0.00053, 3],
      [-0.00267, 0],
      [-0.00086, 3],
      [-0.00355, 0],
      [-0.00348, 0],
      [-0.00091, 3],
      [-0.00052, 3],
      [-0.00073, 3],
      [-0.00258, 0],
      [-0.00059, 3],
      [-0.00083, 3],
      [-0.00083, 3],
      [-0.0027, 0],
      [-0.00248, 0],
      [-0.00076, 3],
      [0.00975, 1],
      [-0.00089, 3],
      [-0.0023, 0],
      [-0.00095, 3]
    ],
    "red_o_points": [],
    "y_categories": ["N", "NOT APPLICABLE", "Y", "nan"],
    "blue_o_points": [],
    "blue_x_points": [
      [0.01581, 1],
      [-0.00067, 3],
      [-0.00132, 0],
      [-0.00168, 0],
      [-0.00024, 3],
      [0.01238, 1],
      [0.01034, 1],
      [-0.00192, 0],
      [-0.00047, 3],
      [-0.00037, 3],
      [-0.00142, 0],
      [0.0125, 1],
      [-0.00052, 3],
      [0.01223, 1],
      [-0.00054, 3]
    ]
  },
  "QS_mulTransfSite[AcSsAA]": {
    "red_x_points": [
      [-0.00047, 3],
      [-0.00116, 2],
      [-0.00461, 0],
      [-0.00455, 0],
      [-0.00102, 2],
      [-0.00546, 0],
      [-0.0042, 0],
      [-0.00066, 3],
      [-0.00567, 0],
      [-0.00524, 0],
      [-0.00044, 3],
      [-0.00452, 0],
      [-0.0006, 3],
      [-0.00115, 2],
      [-0.00355, 0],
      [-0.00065, 3],
      [-0.00038, 3],
      [-0.00051, 3],
      [-0.00094, 2],
      [-0.00039, 3],
      [-0.00053, 3],
      [-0.00052, 3],
      [-0.00485, 0],
      [-0.00011, 2],
      [-0.00043, 3],
      [0.00749, 1],
      [-0.00056, 3],
      [-0.00406, 0],
      [-0.00052, 3]
    ],
    "red_o_points": [],
    "y_categories": ["N", "NOT APPLICABLE", "Y", "nan"],
    "blue_o_points": [],
    "blue_x_points": [
      [0.0125, 1],
      [-0.00041, 3],
      [0.00462, 2],
      [0.00447, 2],
      [-0.00019, 3],
      [0.00948, 1],
      [0.00834, 1],
      [-0.00249, 0],
      [-0.00049, 3],
      [-0.00019, 3],
      [-0.00222, 0],
      [0.00854, 1],
      [-0.00054, 3],
      [0.00899, 1],
      [-0.00015, 3]
    ]
  },
  "QS_mulLysisRoot[C5]": {
    "red_x_points": [
      [-0.00044, 3],
      [-0.00313, 0],
      [-0.00753, 2],
      [-0.00201, 0],
      [-0.00219, 0],
      [-0.00204, 0],
      [-0.00233, 0],
      [-0.00061, 3],
      [-0.00212, 0],
      [-0.00175, 0],
      [-0.00046, 3],
      [-0.00259, 0],
      [-0.00049, 3],
      [-0.00292, 0],
      [-0.00238, 0],
      [-0.00055, 3],
      [-0.00036, 3],
      [-0.0006, 3],
      [-0.00211, 0],
      [-0.00038, 3],
      [-0.0005, 3],
      [-0.00045, 3],
      [-0.00247, 0],
      [-0.0023, 0],
      [-0.00059, 3],
      [0.00814, 1],
      [-0.00047, 3],
      [-0.00708, 2],
      [-0.00049, 3]
    ],
    "red_o_points": [],
    "y_categories": ["N", "NOT APPLICABLE", "Y", "nan"],
    "blue_o_points": [],
    "blue_x_points": [
      [0.01356, 1],
      [-0.00027, 3],
      [-0.00141, 0],
      [-0.00132, 0],
      [-9e-5, 3],
      [0.01054, 1],
      [0.00781, 1],
      [-0.00166, 0],
      [-0.00019, 3],
      [-0.00024, 3],
      [-0.00147, 0],
      [0.00931, 1],
      [-0.00031, 3],
      [0.00928, 1],
      [-0.00034, 3]
    ]
  },
  "QS_mulNeuromadSite[C6]": {
    "red_x_points": [
      [-0.00023, 2],
      [-0.00136, 0],
      [-0.00067, 0],
      [-0.00072, 0],
      [-0.00093, 0],
      [-0.0008, 0],
      [-0.00095, 0],
      [-0.00025, 2],
      [-0.00092, 0],
      [-0.00072, 0],
      [-0.00023, 2],
      [-0.00086, 0],
      [-0.00029, 2],
      [-0.00108, 0],
      [-0.0011, 0],
      [-0.00025, 2],
      [-0.00019, 2],
      [-0.0003, 2],
      [-0.00066, 0],
      [-0.00031, 2],
      [-0.00028, 2],
      [-0.00024, 2],
      [-0.001, 0],
      [-0.00082, 0],
      [-0.00026, 2],
      [0.00262, 1],
      [-0.0003, 2],
      [-0.00073, 0],
      [-0.00021, 2]
    ],
    "red_o_points": [],
    "y_categories": ["N", "NOT APPLICABLE", "nan"],
    "blue_o_points": [],
    "blue_x_points": [
      [0.00444, 1],
      [-0.00019, 2],
      [-0.00058, 0],
      [-0.00064, 0],
      [2e-5, 2],
      [0.00392, 1],
      [0.00284, 1],
      [-0.00068, 0],
      [-0.0002, 2],
      [2e-5, 2],
      [-0.00079, 0],
      [0.00362, 1],
      [-0.00022, 2],
      [0.00273, 1],
      [-0.00022, 2]
    ]
  },
  "QS_mulBpsurgeryType[Lysis]": {
    "red_x_points": [
      [-0.00101, 3],
      [-0.00415, 0],
      [-0.01528, 2],
      [-0.01455, 2],
      [-0.00268, 0],
      [-0.0162, 2],
      [-0.00296, 0],
      [-0.00132, 3],
      [-0.00258, 0],
      [-0.00269, 0],
      [-0.00143, 3],
      [-0.00281, 0],
      [-0.00126, 3],
      [-0.00361, 0],
      [-0.01419, 2],
      [-0.00117, 3],
      [-0.00095, 3],
      [-0.00107, 3],
      [-0.00292, 0],
      [-0.00098, 3],
      [-0.00121, 3],
      [-0.00116, 3],
      [-0.00299, 0],
      [-0.00305, 0],
      [-0.00143, 3],
      [0.0182, 1],
      [-0.00113, 3],
      [-0.01494, 2],
      [-0.00131, 3]
    ],
    "red_o_points": [],
    "y_categories": ["N", "NOT APPLICABLE", "Y", "nan"],
    "blue_o_points": [],
    "blue_x_points": [
      [0.02677, 1],
      [-0.00081, 3],
      [-0.00083, 0],
      [-0.00096, 0],
      [-0.00023, 3],
      [0.02347, 1],
      [0.01939, 1],
      [-0.00145, 0],
      [-0.0007, 3],
      [-0.00037, 3],
      [-0.00107, 0],
      [0.02019, 1],
      [-0.00083, 3],
      [0.02098, 1],
      [-0.00069, 3]
    ]
  },
  "QS_mulGraftNerve[FI]": {
    "red_x_points": [
      [-4e-5, 2],
      [-0.00042, 0],
      [-0.00046, 0],
      [-0.00054, 0],
      [-0.00047, 0],
      [-0.00041, 0],
      [-0.00053, 0],
      [-6e-5, 2],
      [-0.0007, 0],
      [-0.00037, 0],
      [-5e-5, 2],
      [-0.00055, 0],
      [-8e-5, 2],
      [-0.00059, 0],
      [-0.00048, 0],
      [-4e-5, 2],
      [-3e-5, 2],
      [-2e-5, 2],
      [-0.00042, 0],
      [-1e-5, 2],
      [-8e-5, 2],
      [-8e-5, 2],
      [-0.0005, 0],
      [-0.00034, 0],
      [-7e-5, 2],
      [0.00107, 1],
      [-7e-5, 2],
      [-0.0003, 0],
      [-9e-5, 2]
    ],
    "red_o_points": [],
    "y_categories": ["N", "NOT APPLICABLE", "nan"],
    "blue_o_points": [],
    "blue_x_points": [
      [0.00207, 1],
      [-1e-5, 2],
      [-0.00027, 0],
      [-0.00029, 0],
      [-1e-5, 2],
      [0.0018, 1],
      [0.00103, 1],
      [-0.00041, 0],
      [-4e-5, 2],
      [-1e-5, 2],
      [-0.00034, 0],
      [0.0015, 1],
      [-3e-5, 2],
      [0.00178, 1],
      [-3e-5, 2]
    ]
  },
  "QA_lstPexMuscstrength[ShoulderAbduc]": {
    "red_x_points": [
      [-0.0003, 1],
      [-0.00033, 1],
      [-0.00022, 1],
      [-0.00025, 1],
      [-0.00027, 1],
      [-0.00031, 1],
      [-0.00029, 1],
      [-0.00035, 1],
      [-0.00038, 1],
      [-0.00029, 1],
      [-0.00034, 1],
      [-0.00019, 1],
      [0.00023, 2],
      [0.00013, 2],
      [0.00017, 2],
      [-0.00023, 1],
      [-0.00019, 1],
      [-0.00031, 1],
      [-0.00028, 1],
      [0.0002, 2],
      [0.0002, 2],
      [-0.00023, 1],
      [-0.00033, 1],
      [-0.00019, 1],
      [-0.00032, 1],
      [0.00019, 2],
      [-0.00032, 1],
      [-0.00023, 1],
      [0.0003, 2]
    ],
    "red_o_points": [],
    "y_categories": ["GREATER THAN OR EQUALS TO 3", "LESS THAN 3", "nan"],
    "blue_o_points": [],
    "blue_x_points": [
      [0.00028, 2],
      [-0.00025, 1],
      [-0.0003, 1],
      [-0.00029, 1],
      [0.00032, 2],
      [0.00028, 2],
      [0.00222, 0],
      [0.00036, 2],
      [0.00025, 2],
      [0.00029, 2],
      [-0.00032, 1],
      [0.00243, 0],
      [-0.00023, 1],
      [-7e-5, 1],
      [-0.00024, 1]
    ]
  },
  "QS_mulNeuromadSite[T2]": {
    "red_x_points": [
      [-0.00021, 2],
      [-0.00214, 0],
      [-0.00139, 0],
      [-0.00138, 0],
      [-0.00153, 0],
      [-0.00126, 0],
      [-0.0016, 0],
      [-0.00025, 2],
      [-0.00139, 0],
      [-0.00135, 0],
      [-0.00022, 2],
      [-0.0015, 0],
      [-0.00017, 2],
      [-0.00189, 0],
      [-0.00141, 0],
      [-0.00037, 2],
      [-0.00013, 2],
      [-0.00031, 2],
      [-0.00121, 0],
      [-0.00029, 2],
      [-0.00021, 2],
      [-0.0002, 2],
      [-0.0013, 0],
      [-0.00154, 0],
      [-0.00033, 2],
      [0.00438, 1],
      [-0.00019, 2],
      [-0.00131, 0],
      [-0.00011, 2]
    ],
    "red_o_points": [],
    "y_categories": ["N", "NOT APPLICABLE", "nan"],
    "blue_o_points": [],
    "blue_x_points": [
      [0.00699, 1],
      [-8e-5, 2],
      [-0.0008, 0],
      [-0.00081, 0],
      [0.00011, 2],
      [0.00499, 1],
      [0.00354, 1],
      [-0.00111, 0],
      [-5e-5, 2],
      [-5e-5, 2],
      [-0.00092, 0],
      [0.00465, 1],
      [-0.00016, 2],
      [0.00457, 1],
      [-6e-5, 2]
    ]
  },
  "QS_mulNeuromadSite[C4]": {
    "red_x_points": [
      [-2e-5, 2],
      [-0.00071, 0],
      [-0.00086, 0],
      [-0.00071, 0],
      [-0.00069, 0],
      [-0.00055, 0],
      [-0.00066, 0],
      [-0.0001, 2],
      [-0.00076, 0],
      [-0.00068, 0],
      [-3e-5, 2],
      [-0.00062, 0],
      [-9e-5, 2],
      [-0.00064, 0],
      [-0.00056, 0],
      [-2e-5, 2],
      [-7e-5, 2],
      [-5e-5, 2],
      [-0.00057, 0],
      [-5e-5, 2],
      [-8e-5, 2],
      [-4e-5, 2],
      [-0.00077, 0],
      [-0.00064, 0],
      [-0.00011, 2],
      [0.00151, 1],
      [-0.00011, 2],
      [-0.00058, 0],
      [-0.0001, 2]
    ],
    "red_o_points": [],
    "y_categories": ["N", "NOT APPLICABLE", "nan"],
    "blue_o_points": [],
    "blue_x_points": [
      [0.00296, 1],
      [-7e-5, 2],
      [-0.00036, 0],
      [-0.00043, 0],
      [-3e-5, 2],
      [0.00229, 1],
      [0.00132, 1],
      [-0.00048, 0],
      [-2e-5, 2],
      [-6e-5, 2],
      [-0.00053, 0],
      [0.00223, 1],
      [1e-5, 2],
      [0.00257, 1],
      [-4e-5, 2]
    ]
  },
  "QS_mulGraftNerve[Ra]": {
    "red_x_points": [
      [-4e-5, 2],
      [-0.00032, 0],
      [-0.00034, 0],
      [-0.00026, 0],
      [-0.00019, 0],
      [-0.00026, 0],
      [-0.00028, 0],
      [-3e-5, 2],
      [-0.00025, 0],
      [-0.0003, 0],
      [-2e-5, 2],
      [-0.00032, 0],
      [-5e-5, 2],
      [-0.00032, 0],
      [-0.00027, 0],
      [-3e-5, 2],
      [-3e-5, 2],
      [-3e-5, 2],
      [-0.00032, 0],
      [-5e-5, 2],
      [-6e-5, 2],
      [-3e-5, 2],
      [-0.00032, 0],
      [-0.00018, 0],
      [-2e-5, 2],
      [0.00065, 1],
      [-5e-5, 2],
      [-0.00032, 0],
      [-5e-5, 2]
    ],
    "red_o_points": [],
    "y_categories": ["N", "NOT APPLICABLE", "nan"],
    "blue_o_points": [],
    "blue_x_points": [
      [0.00118, 1],
      [-0.0, 2],
      [-0.00022, 0],
      [-0.00019, 0],
      [2e-5, 2],
      [0.00111, 1],
      [0.00086, 1],
      [-0.00023, 0],
      [-1e-5, 2],
      [-3e-5, 2],
      [-0.0002, 0],
      [0.0011, 1],
      [0.0, 2],
      [0.00073, 1],
      [-4e-5, 2]
    ]
  },
  "QS_mulTransfSite[Oberlin]": {
    "red_x_points": [
      [-0.00128, 3],
      [-0.01625, 0],
      [-0.01681, 0],
      [-0.01604, 0],
      [-0.0168, 0],
      [0.00227, 2],
      [-0.01713, 0],
      [-0.00146, 3],
      [0.00223, 2],
      [0.00231, 2],
      [-0.00127, 3],
      [0.00247, 2],
      [-0.00158, 3],
      [0.00152, 2],
      [-0.01596, 0],
      [-0.00123, 3],
      [-0.00132, 3],
      [-0.00103, 3],
      [-0.01523, 0],
      [-0.00121, 3],
      [-0.00151, 3],
      [-0.00139, 3],
      [0.00223, 2],
      [-0.01589, 0],
      [-0.00119, 3],
      [0.02018, 1],
      [-0.0012, 3],
      [-0.01653, 0],
      [-0.00151, 3]
    ],
    "red_o_points": [],
    "y_categories": ["N", "NOT APPLICABLE", "Y", "nan"],
    "blue_o_points": [],
    "blue_x_points": [
      [0.02983, 1],
      [-0.00086, 3],
      [0.00362, 2],
      [0.00401, 2],
      [-0.0004, 3],
      [0.02439, 1],
      [0.02158, 1],
      [0.00298, 2],
      [-0.00085, 3],
      [-0.00065, 3],
      [0.00359, 2],
      [0.02312, 1],
      [-0.00071, 3],
      [0.02185, 1],
      [-0.0009, 3]
    ]
  },
  "QA_intPexForearmProna": {
    "red_x_points": [
      [-0.00042, 2],
      [-0.00052, 0],
      [-0.00034, 2],
      [-0.00015, 2],
      [-0.00029, 2],
      [-0.00113, 0],
      [-0.00031, 2],
      [-0.01352, 0],
      [-0.00032, 2],
      [-0.00024, 2],
      [-0.01346, 0],
      [-0.00116, 0],
      [-0.0004, 2],
      [-0.00029, 2],
      [3e-5, 2],
      [-0.01299, 0],
      [-0.0126, 0],
      [-0.01322, 0],
      [-0.00083, 0],
      [-0.00023, 2],
      [-0.0004, 2],
      [-0.00052, 2],
      [-0.00021, 2],
      [-0.00034, 2],
      [0.00029, 2],
      [0.00077, 1],
      [0.00016, 2],
      [-0.00121, 0],
      [-0.00038, 2]
    ],
    "red_o_points": [],
    "y_categories": ["GREATER THAN OR EQUALS TO 80", "LESS THAN 80", "nan"],
    "blue_o_points": [],
    "blue_x_points": [
      [-0.00017, 2],
      [0.0366, 1],
      [-0.0004, 0],
      [-0.00025, 2],
      [0.00054, 2],
      [6e-5, 2],
      [0.00134, 1],
      [0.00014, 2],
      [0.00018, 2],
      [0.00051, 2],
      [-0.00031, 0],
      [8e-5, 2],
      [0.00085, 2],
      [3e-5, 2],
      [0.03506, 1]
    ]
  },
  "QA_yonInjChesttube": {
    "red_x_points": [
      [-0.00232, 2],
      [-0.00198, 2],
      [0.00185, 0],
      [-0.00129, 2],
      [-0.00255, 2],
      [0.00119, 0],
      [-0.00345, 1],
      [-0.00169, 2],
      [-0.00225, 2],
      [-0.00222, 2],
      [0.00102, 0],
      [0.00206, 0],
      [-0.00333, 2],
      [-0.00258, 2],
      [0.00072, 0],
      [0.00097, 0],
      [0.00126, 0],
      [0.00157, 0],
      [-0.00316, 1],
      [-0.00201, 2],
      [-0.01493, 1],
      [-0.00269, 2],
      [-0.00237, 2],
      [0.00243, 0],
      [-0.00238, 2],
      [-0.00029, 2],
      [-0.00258, 2],
      [0.00055, 0],
      [-0.00283, 2]
    ],
    "red_o_points": [],
    "y_categories": ["N", "Y", "nan"],
    "blue_o_points": [],
    "blue_x_points": [
      [0.0003, 1],
      [-0.00099, 2],
      [0.0029, 0],
      [0.00398, 0],
      [-0.00202, 2],
      [-0.0001, 2],
      [4e-5, 0],
      [0.00442, 0],
      [0.01283, 0],
      [0.01529, 0],
      [0.00255, 0],
      [-9e-5, 2],
      [0.00428, 0],
      [-2e-5, 2],
      [-8e-5, 2]
    ]
  },
  "QA_yonPexPain": {
    "red_x_points": [
      [-0.00575, 1],
      [-0.00037, 1],
      [-0.00065, 1],
      [-0.00022, 1],
      [-0.00026, 1],
      [-0.00127, 0],
      [-0.0002, 1],
      [-0.00464, 1],
      [-0.00174, 0],
      [-0.00037, 1],
      [-0.00324, 1],
      [-0.00067, 0],
      [-0.00634, 1],
      [-0.00036, 1],
      [-0.00016, 1],
      [0.00517, 0],
      [-0.00384, 1],
      [0.0048, 0],
      [-0.00035, 1],
      [0.00694, 0],
      [-0.01368, 2],
      [-0.00575, 1],
      [8e-5, 1],
      [-0.00072, 1],
      [-0.01024, 2],
      [-0.00083, 1],
      [-0.00467, 1],
      [-0.00025, 1],
      [-0.00621, 1]
    ],
    "red_o_points": [],
    "y_categories": ["N", "Y", "nan"],
    "blue_o_points": [],
    "blue_x_points": [
      [-0.00014, 1],
      [0.01484, 0],
      [0.00264, 0],
      [0.00081, 1],
      [-0.00383, 1],
      [0.00041, 2],
      [7e-5, 1],
      [0.00199, 1],
      [0.0164, 0],
      [0.01427, 0],
      [0.00091, 1],
      [0.00091, 0],
      [0.00769, 0],
      [-0.00012, 1],
      [-0.00105, 1]
    ]
  },
  "QS_mulTransfSite[IAx]": {
    "red_x_points": [
      [-1e-5, 0],
      [-1e-5, 0],
      [-1e-5, 0],
      [-1e-5, 2],
      [-1e-5, 0],
      [-1e-5, 2],
      [-1e-5, 2],
      [-1e-5, 2]
    ],
    "red_o_points": [],
    "y_categories": ["N", "NOT APPLICABLE", "nan"],
    "blue_o_points": [],
    "blue_x_points": [[0.00015, 1], [-1e-5, 0], [-1e-5, 2]]
  },
  "QA_lstPexPalle[Ulna]": {
    "red_x_points": [
      [-0.00059, 4],
      [-0.00245, 4],
      [-0.00192, 4],
      [-0.00704, 2],
      [-0.00313, 4],
      [-0.01029, 1],
      [-0.00281, 4],
      [-0.00037, 4],
      [-0.0036, 4],
      [0.01051, 3],
      [-0.00854, 1],
      [-0.0032, 4],
      [-0.00068, 4],
      [-0.00322, 4],
      [-0.00162, 4],
      [0.00406, 3],
      [-0.00892, 0],
      [0.00326, 3],
      [-0.00837, 0],
      [0.00402, 3],
      [-0.00051, 4],
      [-0.00061, 4],
      [-0.00339, 4],
      [-0.00283, 4],
      [-0.00032, 4],
      [0.00331, 3],
      [-0.00039, 4],
      [-0.00623, 0],
      [-0.00069, 4]
    ],
    "red_o_points": [],
    "y_categories": ["ABS", "HYPO", "NAIA", "PT", "nan"],
    "blue_o_points": [],
    "blue_x_points": [
      [-0.00038, 4],
      [0.00022, 4],
      [0.01514, 3],
      [0.0174, 3],
      [0.0, 4],
      [-0.00019, 4],
      [0.00272, 3],
      [-0.00253, 4],
      [-8e-5, 4],
      [-0.00011, 4],
      [0.01353, 3],
      [-0.00022, 4],
      [0.00425, 3],
      [-0.00014, 4],
      [0.00692, 3]
    ]
  }
}
