{
  "QA_lstPexPain[C8]": {
    "red_x_points": [
      [0.01277, 0],
      [-0.00839, 2],
      [-0.01215, 2],
      [0.01265, 0],
      [-0.00754, 2],
      [-0.01012, 1],
      [-0.01599, 1],
      [-0.0123, 1],
      [-0.01169, 2],
      [-0.00941, 2],
      [-0.01897, 2],
      [-0.00645, 2],
      [-0.01619, 1],
      [0.01396, 0],
      [-0.0138, 1],
      [-0.01322, 1],
      [-0.00643, 2],
      [-0.01369, 2],
      [-0.01921, 2],
      [-0.01154, 2],
      [-0.01666, 1],
      [-0.00814, 1],
      [-0.01803, 1]
    ],
    "red_o_points": [],
    "y_categories": ["NORM", "NPV", "nan"],
    "blue_o_points": [],
    "blue_x_points": [
      [-0.00882, 1],
      [-0.00828, 1],
      [0.0176, 0],
      [-0.00173, 1],
      [0.02637, 0],
      [0.02453, 0],
      [0.02278, 0],
      [0.02038, 0],
      [-0.0084, 2],
      [-0.00141, 2],
      [-0.00611, 2],
      [-0.00292, 1],
      [-0.00615, 2],
      [0.02034, 0],
      [0.01928, 0],
      [0.01806, 0],
      [-0.00685, 2],
      [0.01871, 0],
      [0.01957, 0],
      [0.02782, 0],
      [0.02578, 0]
    ]
  },
  "QA_lstPexPain[C7]": {
    "red_x_points": [
      [-0.01541, 1],
      [-0.01358, 2],
      [-0.01501, 2],
      [-0.01431, 1],
      [-0.01199, 2],
      [-0.00974, 1],
      [-0.01241, 1],
      [-0.0149, 1],
      [-0.01632, 2],
      [-0.0159, 2],
      [-0.02089, 2],
      [-0.01161, 2],
      [-0.01457, 1],
      [0.02457, 0],
      [-0.01404, 1],
      [-0.01169, 1],
      [-0.0098, 2],
      [-0.02213, 2],
      [-0.02322, 2],
      [-0.01508, 2],
      [-0.01743, 1],
      [-0.00862, 1],
      [-0.01568, 1]
    ],
    "red_o_points": [],
    "y_categories": ["NORM", "NPV", "nan"],
    "blue_o_points": [],
    "blue_x_points": [
      [-0.01041, 1],
      [-0.00997, 1],
      [0.03446, 0],
      [-0.00396, 1],
      [0.04408, 0],
      [-0.00546, 1],
      [0.04186, 0],
      [0.04249, 0],
      [-0.01259, 2],
      [-0.00183, 2],
      [-0.01111, 2],
      [-0.00535, 1],
      [-0.00971, 2],
      [0.03675, 0],
      [0.03307, 0],
      [0.03647, 0],
      [-0.01051, 2],
      [0.03324, 0],
      [0.04467, 0],
      [-0.01133, 1],
      [0.04487, 0]
    ]
  },
  "QA_mulInjOrthesisType[ArmSling]": {
    "red_x_points": [
      [-0.00746, 2],
      [-0.01446, 2],
      [-0.00504, 2],
      [-0.0006, 2],
      [-0.00869, 2],
      [-0.0006, 2],
      [-0.00109, 2],
      [-0.00762, 1],
      [-0.01506, 2],
      [-0.01262, 2],
      [-0.00417, 2],
      [-0.03282, 0],
      [-0.01409, 3],
      [-0.00242, 2],
      [-0.01895, 1],
      [-0.00141, 2],
      [-0.03062, 3],
      [-0.0138, 2],
      [-0.00329, 2],
      [-0.01055, 2],
      [-0.01129, 3],
      [-0.00175, 2],
      [-0.00556, 2]
    ],
    "red_o_points": [],
    "y_categories": ["N", "NOT APPLICABLE", "Y", "nan"],
    "blue_o_points": [],
    "blue_x_points": [
      [0.00111, 2],
      [0.00166, 2],
      [0.00096, 2],
      [0.00329, 2],
      [-0.00149, 2],
      [0.00318, 2],
      [0.00022, 2],
      [0.0001, 2],
      [0.07292, 1],
      [0.05315, 1],
      [-0.00989, 2],
      [0.02522, 1],
      [0.0462, 1],
      [-0.00055, 2],
      [0.01399, 0],
      [-0.00031, 2],
      [-0.01268, 2],
      [0.01382, 1],
      [0.01376, 1],
      [-0.00446, 2],
      [0.00377, 3]
    ]
  },
  "QA_yonPreFracture": {
    "red_x_points": [
      [-0.05337, 1],
      [0.0015, 2],
      [0.008, 0],
      [0.00445, 2],
      [0.0081, 0],
      [0.00854, 0],
      [-0.04578, 1],
      [0.01013, 0],
      [0.00106, 2],
      [-0.05512, 1],
      [-0.05686, 1],
      [-0.04246, 1],
      [0.00335, 2],
      [0.00963, 0],
      [0.0095, 0],
      [0.00901, 0],
      [0.00794, 0],
      [0.012, 0],
      [-0.05502, 1],
      [0.0085, 0],
      [0.0015, 2],
      [-0.03642, 1],
      [0.00177, 2]
    ],
    "red_o_points": [],
    "y_categories": ["N", "Y", "nan"],
    "blue_o_points": [],
    "blue_x_points": [
      [0.01285, 0],
      [0.01077, 2],
      [0.01165, 0],
      [0.01176, 0],
      [0.00891, 2],
      [0.01435, 0],
      [0.01229, 0],
      [0.01224, 2],
      [0.00562, 2],
      [0.01316, 0],
      [0.01711, 0],
      [0.01747, 0],
      [0.01488, 0],
      [0.01018, 0],
      [0.0097, 0],
      [0.00757, 2],
      [0.01529, 0],
      [0.01292, 0],
      [0.00984, 0],
      [0.00559, 2],
      [0.0059, 2]
    ]
  },
  "QA_lstPexTouch[C7]": {
    "red_x_points": [
      [-0.02019, 1],
      [-0.008, 2],
      [-0.01492, 1],
      [-0.01813, 1],
      [-0.00575, 2],
      [-0.01304, 1],
      [-0.01679, 1],
      [-0.01751, 1],
      [-0.00707, 2],
      [-0.00855, 2],
      [-0.0187, 1],
      [-0.00529, 2],
      [-0.01932, 1],
      [0.02133, 0],
      [-0.0193, 1],
      [-0.01672, 1],
      [-0.00384, 2],
      [0.01746, 0],
      [-0.01502, 1],
      [-0.01086, 2],
      [-0.02178, 1],
      [-0.01293, 1],
      [-0.02181, 1]
    ],
    "red_o_points": [],
    "y_categories": ["NORM", "NPV", "nan"],
    "blue_o_points": [],
    "blue_x_points": [
      [-0.0166, 1],
      [-0.0163, 1],
      [0.03188, 0],
      [-0.01065, 1],
      [0.03538, 0],
      [-0.01243, 1],
      [0.03646, 0],
      [-0.01318, 1],
      [-0.0025, 2],
      [0.00597, 2],
      [-0.00048, 2],
      [-0.01281, 1],
      [0.00139, 2],
      [0.02882, 0],
      [0.0264, 0],
      [0.02966, 0],
      [0.00153, 2],
      [0.02596, 0],
      [0.03689, 0],
      [0.04269, 0],
      [0.03863, 0]
    ]
  },
  "QA_lstPexTouch[C6]": {
    "red_x_points": [
      [-0.00767, 1],
      [-0.00569, 2],
      [-0.00655, 1],
      [-0.00424, 1],
      [-0.00487, 2],
      [-0.00308, 1],
      [-0.00377, 1],
      [-0.00767, 1],
      [-0.00558, 2],
      [-0.00612, 2],
      [-0.00557, 1],
      [-0.00293, 2],
      [-0.00611, 1],
      [-0.00773, 1],
      [-0.00857, 1],
      [-0.00406, 1],
      [-0.00283, 2],
      [-0.00781, 1],
      [-0.00471, 1],
      [-0.01142, 2],
      [-0.00737, 1],
      [-0.00326, 1],
      [-0.0057, 1]
    ],
    "red_o_points": [],
    "y_categories": ["NORM", "NPV", "nan"],
    "blue_o_points": [],
    "blue_x_points": [
      [-0.00519, 1],
      [-0.00529, 1],
      [0.03083, 0],
      [-0.00365, 1],
      [0.0459, 0],
      [-0.00386, 1],
      [-0.00395, 1],
      [-0.00358, 1],
      [-0.00168, 2],
      [0.00578, 2],
      [0.00044, 2],
      [-0.00461, 1],
      [0.00174, 2],
      [-0.00495, 1],
      [-0.00406, 1],
      [0.02632, 0],
      [0.00185, 2],
      [0.02578, 0],
      [0.04366, 0],
      [-0.00479, 1],
      [-0.00338, 1]
    ]
  },
  "participant_code": {
    "red_x_points": [
      [-0.07799, 0],
      [-0.07925, 2],
      [-0.07731, 3],
      [-0.07644, 4],
      [-0.07721, 5],
      [-0.07644, 9],
      [-0.07614, 14],
      [-0.07712, 17],
      [-0.07741, 19],
      [-0.07624, 20],
      [-0.07731, 22],
      [-0.07702, 23],
      [-0.07799, 24],
      [-0.0777, 26],
      [-0.0777, 28],
      [-0.07741, 29],
      [-0.07906, 31],
      [-0.07809, 35],
      [-0.07731, 37],
      [-0.07984, 39],
      [-0.07673, 41],
      [-0.0775, 42],
      [-0.07624, 43]
    ],
    "red_o_points": [],
    "y_categories": [
      "P16554",
      "P18297",
      "P19283",
      "P19287",
      "P23172",
      "P23391",
      "P30595",
      "P31645",
      "P31691",
      "P34778",
      "P35046",
      "P36328",
      "P43633",
      "P4544",
      "P46417",
      "P48965",
      "P53068",
      "P5497",
      "P58556",
      "P59529",
      "P62483",
      "P64658",
      "P65202",
      "P66816",
      "P67052",
      "P6751",
      "P7408",
      "P75566",
      "P76226",
      "P79971",
      "P82621",
      "P82990",
      "P84549",
      "P84932",
      "P85825",
      "P86989",
      "P8770",
      "P87791",
      "P90550",
      "P93159",
      "P94969",
      "P96710",
      "P9744",
      "P98500",
      "nan"
    ],
    "blue_o_points": [],
    "blue_x_points": [
      [0.08556, 1],
      [0.08309, 6],
      [0.08607, 7],
      [0.08453, 8],
      [0.08258, 10],
      [0.08412, 11],
      [0.0835, 12],
      [0.08597, 13],
      [0.08597, 15],
      [0.08453, 16],
      [0.08793, 18],
      [0.08731, 21],
      [0.08453, 25],
      [0.08422, 27],
      [0.08474, 30],
      [0.08422, 32],
      [0.08649, 33],
      [0.08412, 34],
      [0.08391, 36],
      [0.08525, 38],
      [0.08278, 40]
    ]
  },
  "QA_lstPexArthre[Shoulder]": {
    "red_x_points": [
      [0.01023, 2],
      [-0.00301, 3],
      [-0.00628, 3],
      [0.01161, 2],
      [-0.0217, 0],
      [-0.02597, 1],
      [0.01189, 2],
      [0.01361, 2],
      [-0.00325, 3],
      [0.00517, 2],
      [-0.0068, 3],
      [-0.00237, 3],
      [-0.00753, 3],
      [-0.05314, 1],
      [0.01182, 2],
      [-0.02857, 1],
      [-0.00196, 3],
      [-0.0073, 3],
      [-0.0104, 3],
      [-0.00362, 3],
      [-0.00675, 3],
      [-0.0229, 1],
      [-0.00723, 3]
    ],
    "red_o_points": [],
    "y_categories": ["NAIA", "NPV", "PV", "nan"],
    "blue_o_points": [],
    "blue_x_points": [
      [0.02, 2],
      [-0.00528, 3],
      [0.01148, 2],
      [0.01544, 2],
      [-0.00178, 3],
      [0.01469, 2],
      [0.01645, 2],
      [0.0161, 2],
      [-0.00202, 3],
      [-0.0005, 3],
      [-0.0014, 3],
      [0.02001, 2],
      [-0.00087, 3],
      [0.01454, 2],
      [0.00997, 2],
      [-0.00213, 1],
      [-0.00116, 3],
      [0.00877, 2],
      [-0.00137, 3],
      [0.01613, 2],
      [0.00737, 2]
    ]
  },
  "QA_lstPexTouch[T1]": {
    "red_x_points": [
      [-0.01712, 1],
      [-0.00534, 2],
      [-0.01083, 1],
      [0.0147, 0],
      [-0.00402, 2],
      [-0.00901, 1],
      [0.00967, 0],
      [-0.01546, 1],
      [-0.005, 2],
      [-0.00833, 2],
      [-0.01451, 1],
      [-0.00305, 2],
      [-0.01077, 1],
      [-0.02089, 1],
      [-0.01701, 1],
      [-0.01044, 1],
      [-0.00239, 2],
      [0.00407, 0],
      [-0.01514, 1],
      [-0.00996, 2],
      [-0.01671, 1],
      [-0.00824, 1],
      [-0.01071, 1]
    ],
    "red_o_points": [],
    "y_categories": ["NORM", "NPV", "nan"],
    "blue_o_points": [],
    "blue_x_points": [
      [-0.01156, 1],
      [-0.00859, 1],
      [0.02168, 0],
      [-0.01063, 1],
      [-0.01002, 1],
      [0.02695, 0],
      [0.02906, 0],
      [0.02562, 0],
      [-0.00064, 2],
      [0.00661, 2],
      [0.00166, 2],
      [-0.00961, 1],
      [0.00296, 2],
      [0.01907, 0],
      [0.01683, 0],
      [0.01763, 0],
      [0.00272, 2],
      [-0.00689, 1],
      [0.02717, 0],
      [0.02547, 0],
      [0.021, 0]
    ]
  },
  "QA_yonInjFracture": {
    "red_x_points": [
      [0.00511, 0],
      [-0.0144, 2],
      [0.00598, 0],
      [-0.01901, 2],
      [-0.01397, 1],
      [-0.0145, 1],
      [0.00738, 0],
      [0.01091, 0],
      [-0.02327, 1],
      [-0.01706, 1],
      [0.00571, 0],
      [-0.01398, 1],
      [-0.01925, 1],
      [-0.00184, 0],
      [-0.03353, 1],
      [-0.02024, 1],
      [-0.01626, 1],
      [0.00449, 0],
      [0.00428, 0],
      [0.01182, 0],
      [-0.01784, 1],
      [-0.01148, 1],
      [-0.03297, 1]
    ],
    "red_o_points": [],
    "y_categories": ["N", "Y", "nan"],
    "blue_o_points": [],
    "blue_x_points": [
      [0.01408, 0],
      [0.02196, 0],
      [0.00486, 0],
      [0.01391, 0],
      [0.0145, 2],
      [0.01045, 0],
      [0.00275, 1],
      [0.00486, 1],
      [-0.01377, 1],
      [0.01918, 0],
      [0.02357, 0],
      [0.01675, 0],
      [0.02111, 0],
      [0.00552, 0],
      [0.00633, 0],
      [0.00767, 2],
      [0.02359, 0],
      [0.00969, 0],
      [0.00394, 0],
      [-0.00533, 1],
      [0.00827, 2]
    ]
  },
  "QS_mulTransfSite[Oberlin]": {
    "red_x_points": [
      [-0.02176, 1],
      [-0.05969, 0],
      [-0.05774, 0],
      [-0.05941, 0],
      [-0.05632, 0],
      [-0.05283, 0],
      [0.01562, 3],
      [-0.02341, 1],
      [0.01831, 3],
      [0.02086, 2],
      [0.01697, 3],
      [-0.05572, 0],
      [0.01499, 3],
      [0.02278, 2],
      [-0.02725, 1],
      [0.01529, 3],
      [-0.05508, 0],
      [0.01583, 3],
      [0.02489, 2],
      [-0.05934, 0],
      [-0.02174, 1],
      [-0.05484, 0],
      [0.01608, 3]
    ],
    "red_o_points": [],
    "y_categories": ["N", "NOT APPLICABLE", "Y", "nan"],
    "blue_o_points": [],
    "blue_x_points": [
      [0.02115, 3],
      [0.01863, 3],
      [0.02756, 2],
      [0.0329, 2],
      [0.01935, 3],
      [0.03205, 2],
      [0.02802, 2],
      [0.02809, 2],
      [0.0221, 3],
      [-0.00191, 1],
      [0.02746, 2],
      [0.03329, 2],
      [0.02033, 3],
      [0.01804, 3],
      [0.01698, 3],
      [0.01671, 3],
      [0.02019, 3],
      [0.01704, 3],
      [-0.00985, 1],
      [0.0182, 3],
      [0.01719, 3]
    ]
  },
  "QA_yonPexPain": {
    "red_x_points": [
      [-0.02073, 1],
      [-0.02501, 1],
      [-0.01927, 1],
      [-0.01923, 1],
      [-0.02345, 1],
      [-0.0175, 1],
      [-0.01972, 1],
      [-0.01972, 1],
      [-0.02681, 1],
      [-0.0255, 1],
      [0.02874, 0],
      [-0.02306, 1],
      [-0.01961, 1],
      [-0.02216, 1],
      [0.02765, 0],
      [-0.02021, 1],
      [-0.02143, 1],
      [-0.02485, 1],
      [-0.02104, 1],
      [-0.02461, 1],
      [-0.02136, 1],
      [-0.0174, 1],
      [-0.02637, 1]
    ],
    "red_o_points": [],
    "y_categories": ["N", "Y", "nan"],
    "blue_o_points": [],
    "blue_x_points": [
      [-0.02137, 1],
      [0.04155, 0],
      [0.03501, 0],
      [0.03841, 0],
      [-0.01855, 1],
      [0.03992, 0],
      [-0.01939, 1],
      [-0.01802, 1],
      [-0.02501, 1],
      [0.06014, 2],
      [0.04919, 0],
      [-0.02173, 1],
      [0.048, 0],
      [0.03468, 0],
      [0.03309, 0],
      [0.03501, 0],
      [0.06225, 2],
      [0.03846, 0],
      [-0.01787, 1],
      [-0.02138, 1],
      [0.05026, 2]
    ]
  },
  "QA_lstPexMuscstrength[FingersFlex]": {
    "red_x_points": [
      [0.00358, 2],
      [0.00444, 2],
      [-0.05292, 1],
      [0.01582, 0],
      [-0.05327, 1],
      [-0.05097, 1],
      [-0.05857, 1],
      [0.01685, 0],
      [0.00508, 2],
      [0.00457, 2],
      [0.01659, 0],
      [0.00432, 2],
      [-0.06043, 1],
      [0.01675, 0],
      [0.01609, 0],
      [-0.05991, 1],
      [-0.05262, 1],
      [0.00574, 2],
      [0.01631, 0],
      [0.01327, 0],
      [0.00394, 2],
      [-0.05112, 1],
      [0.00339, 2]
    ],
    "red_o_points": [],
    "y_categories": ["GREATER THAN OR EQUALS TO 3", "LESS THAN 3", "nan"],
    "blue_o_points": [],
    "blue_x_points": [
      [0.02315, 0],
      [0.02185, 0],
      [0.01659, 0],
      [0.01657, 0],
      [0.02075, 0],
      [0.01778, 0],
      [0.01768, 0],
      [0.01825, 0],
      [0.0062, 2],
      [0.00714, 2],
      [0.00714, 2],
      [0.00847, 2],
      [0.00802, 2],
      [0.0193, 0],
      [0.01853, 0],
      [0.01815, 0],
      [0.0092, 2],
      [0.00683, 2],
      [0.01867, 0],
      [0.00719, 2],
      [0.00563, 2]
    ]
  },
  "QA_lstPexTouch[C8]": {
    "red_x_points": [
      [0.0134, 0],
      [-0.00641, 2],
      [-0.01671, 1],
      [-0.02123, 1],
      [-0.0045, 2],
      [-0.01168, 1],
      [-0.01505, 1],
      [-0.01519, 1],
      [-0.00631, 2],
      [-0.00683, 2],
      [-0.0172, 1],
      [-0.00377, 2],
      [-0.02247, 1],
      [0.01739, 0],
      [-0.01531, 1],
      [-0.01509, 1],
      [-0.00314, 2],
      [0.01196, 0],
      [-0.01416, 1],
      [-0.00931, 2],
      [-0.0183, 1],
      [-0.01266, 1],
      [-0.02197, 1]
    ],
    "red_o_points": [],
    "y_categories": ["NORM", "NPV", "nan"],
    "blue_o_points": [],
    "blue_x_points": [
      [-0.01538, 1],
      [-0.01647, 1],
      [0.02038, 0],
      [-0.01026, 1],
      [0.02914, 0],
      [-0.0106, 1],
      [0.02526, 0],
      [0.0303, 0],
      [-0.00172, 2],
      [0.00328, 2],
      [-0.00042, 2],
      [-0.01081, 1],
      [0.00245, 2],
      [0.02283, 0],
      [0.01945, 0],
      [0.02423, 0],
      [0.00282, 2],
      [0.0181, 0],
      [0.02344, 0],
      [0.03148, 0],
      [0.02702, 0]
    ]
  },
  "QA_equInjTbpiTime": {
    "red_x_points": [
      [-0.02214, 0],
      [-0.02136, 0],
      [0.0035, 3],
      [0.00329, 3],
      [-0.01765, 0],
      [-0.01405, 0],
      [-0.01524, 0],
      [-0.02337, 0],
      [0.00372, 3],
      [-0.02043, 0],
      [-0.0201, 0],
      [-0.01852, 0],
      [0.00297, 3],
      [0.00342, 3],
      [-0.02428, 0],
      [-0.01455, 0],
      [-0.02313, 2],
      [-0.04524, 2],
      [-0.01801, 0],
      [-0.03145, 2],
      [-0.02151, 0],
      [0.0036, 3],
      [0.0234, 1]
    ],
    "red_o_points": [],
    "y_categories": [
      "0 TO 6 MONTHS",
      "13 TO 24 MONTHS",
      "25 MONTHS OR MORE",
      "7 TO 12 MONTHS",
      "nan"
    ],
    "blue_o_points": [],
    "blue_x_points": [
      [-0.01635, 0],
      [0.04553, 1],
      [-0.01254, 0],
      [0.04688, 1],
      [0.00797, 3],
      [-0.01604, 0],
      [-0.01179, 0],
      [0.00738, 3],
      [-0.01654, 0],
      [-0.00186, 2],
      [0.05266, 1],
      [0.01215, 3],
      [0.05446, 1],
      [0.00876, 3],
      [0.03852, 1],
      [0.03681, 1],
      [0.01375, 3],
      [0.03763, 1],
      [0.01817, 3],
      [0.01126, 3],
      [-0.00966, 0]
    ]
  }
}
