{
  "QA_lstPexMuscstrength[ElbowFlex]": {
    "red_x_points": [
      [-0.00906, 1],
      [-0.00017, 2],
      [-0.00811, 1],
      [-0.00865, 1],
      [-0.00912, 1],
      [-0.00948, 1],
      [-0.00889, 1],
      [-0.00812, 1],
      [-0.00927, 1],
      [-0.00952, 1],
      [-0.00921, 1],
      [-0.00929, 1],
      [-0.00011, 2],
      [-0.00137, 2],
      [0.00047, 2],
      [-0.00926, 1],
      [-0.00943, 1],
      [-0.00833, 1],
      [-0.00835, 1],
      [-0.00925, 1],
      [1e-5, 2],
      [-0.00889, 1],
      [-0.00926, 1],
      [-0.00871, 1],
      [-0.00824, 1],
      [0.00031, 2],
      [-0.00859, 1],
      [-0.00909, 1],
      [-8e-5, 2]
    ],
    "red_o_points": [],
    "y_categories": ["GREATER THAN OR EQUALS TO 3", "LESS THAN 3", "nan"],
    "blue_o_points": [],
    "blue_x_points": [
      [0.00109, 2],
      [-0.00893, 1],
      [0.04482, 0],
      [-0.00856, 1],
      [0.00191, 2],
      [0.00154, 2],
      [0.03495, 0],
      [-0.00785, 1],
      [-0.00886, 1],
      [0.0015, 2],
      [0.04484, 0],
      [0.03445, 0],
      [0.03919, 0],
      [0.03523, 0],
      [-0.00828, 1]
    ]
  },
  "QS_mulGraftNerve[other]": {
    "red_x_points": [
      [-6e-5, 2],
      [-0.00037, 0],
      [-0.00026, 0],
      [-0.00039, 0],
      [-0.00026, 0],
      [-0.0003, 0],
      [-0.00043, 0],
      [-8e-5, 2],
      [-0.00042, 0],
      [-0.00023, 0],
      [-8e-5, 2],
      [-0.00031, 0],
      [-7e-5, 2],
      [-0.00034, 0],
      [-0.00037, 0],
      [-6e-5, 2],
      [-7e-5, 2],
      [-7e-5, 2],
      [-0.00027, 0],
      [-7e-5, 2],
      [-8e-5, 2],
      [-0.0001, 2],
      [-0.00031, 0],
      [-0.00026, 0],
      [-9e-5, 2],
      [0.00112, 1],
      [-8e-5, 2],
      [-0.00035, 0],
      [-0.0001, 2]
    ],
    "red_o_points": [],
    "y_categories": ["N", "NOT APPLICABLE", "nan"],
    "blue_o_points": [],
    "blue_x_points": [
      [0.0016, 1],
      [-7e-5, 2],
      [-0.00025, 0],
      [-0.00025, 0],
      [-6e-5, 2],
      [0.00112, 1],
      [0.00097, 1],
      [-0.0003, 0],
      [-3e-5, 2],
      [-8e-5, 2],
      [-0.00019, 0],
      [0.00129, 1],
      [-5e-5, 2],
      [0.00112, 1],
      [-4e-5, 2]
    ]
  },
  "QS_mulLysisTrunk[Upper]": {
    "red_x_points": [
      [-0.00092, 3],
      [-0.00446, 0],
      [-0.00354, 0],
      [-0.00364, 0],
      [-0.00358, 0],
      [-0.01338, 2],
      [-0.00364, 0],
      [-0.00078, 3],
      [-0.00362, 0],
      [-0.00324, 0],
      [-0.00106, 3],
      [-0.00352, 0],
      [-0.00085, 3],
      [-0.00448, 0],
      [-0.01249, 2],
      [-0.00092, 3],
      [-0.00087, 3],
      [-0.00072, 3],
      [-0.00359, 0],
      [-0.00094, 3],
      [-0.00083, 3],
      [-0.00068, 3],
      [-0.00368, 0],
      [-0.00342, 0],
      [-0.00069, 3],
      [0.01385, 1],
      [-0.00072, 3],
      [-0.01218, 2],
      [-0.0008, 3]
    ],
    "red_o_points": [],
    "y_categories": ["N", "NOT APPLICABLE", "Y", "nan"],
    "blue_o_points": [],
    "blue_x_points": [
      [0.02327, 1],
      [-0.00036, 3],
      [-0.00173, 0],
      [-0.002, 0],
      [-0.00014, 3],
      [0.01913, 1],
      [0.0145, 1],
      [-0.00249, 0],
      [-0.00067, 3],
      [-2e-5, 3],
      [-0.00157, 0],
      [0.01624, 1],
      [-0.0005, 3],
      [0.01634, 1],
      [-0.00061, 3]
    ]
  },
  "QS_mulBpsurgeryType[Transf]": {
    "red_x_points": [
      [-0.00013, 3],
      [-0.00081, 2],
      [-0.00332, 0],
      [-0.00047, 2],
      [-0.0007, 2],
      [-0.00046, 2],
      [-0.00064, 2],
      [-0.00019, 3],
      [-0.00078, 2],
      [-0.00054, 2],
      [-0.00012, 3],
      [-0.00042, 2],
      [-0.00016, 3],
      [-0.00084, 2],
      [-0.00063, 2],
      [-0.0002, 3],
      [-0.0001, 3],
      [-9e-5, 3],
      [-0.00035, 2],
      [-0.00015, 3],
      [-0.00021, 3],
      [-0.00013, 3],
      [-0.00061, 2],
      [-0.00048, 2],
      [-0.0002, 3],
      [0.00134, 1],
      [-0.00015, 3],
      [-0.00042, 2],
      [-0.00023, 3]
    ],
    "red_o_points": [],
    "y_categories": ["N", "NOT APPLICABLE", "Y", "nan"],
    "blue_o_points": [],
    "blue_x_points": [
      [0.00444, 1],
      [-7e-5, 3],
      [0.00011, 2],
      [-0.00029, 2],
      [3e-5, 3],
      [0.00231, 1],
      [0.00151, 1],
      [-0.0004, 2],
      [-0.00012, 3],
      [-3e-5, 3],
      [-0.0001, 2],
      [0.00222, 1],
      [-3e-5, 3],
      [0.00267, 1],
      [-8e-5, 3]
    ]
  },
  "QS_mulGraftTrunk[MiddleTrunk]": {
    "red_x_points": [
      [1e-5, 2],
      [-4e-5, 0],
      [-4e-5, 0],
      [-4e-5, 0],
      [-4e-5, 0],
      [-4e-5, 0],
      [-4e-5, 0],
      [1e-5, 2],
      [-4e-5, 0],
      [-4e-5, 0],
      [1e-5, 2],
      [-4e-5, 0],
      [1e-5, 2],
      [-4e-5, 0],
      [-4e-5, 0],
      [1e-5, 2],
      [1e-5, 2],
      [-4e-5, 0],
      [-4e-5, 0],
      [-4e-5, 0],
      [0.0001, 1],
      [1e-5, 2],
      [1e-5, 2]
    ],
    "red_o_points": [],
    "y_categories": ["N", "NOT APPLICABLE", "nan"],
    "blue_o_points": [],
    "blue_x_points": [
      [0.0001, 1],
      [1e-5, 2],
      [-4e-5, 0],
      [1e-5, 2],
      [0.0001, 1],
      [0.0001, 1],
      [1e-5, 2],
      [1e-5, 2],
      [-4e-5, 0],
      [0.0001, 1],
      [0.0001, 1],
      [1e-5, 2]
    ]
  },
  "QS_mulGraftNerve[Ac]": {
    "red_x_points": [
      [-2e-5, 2],
      [-0.00026, 0],
      [-0.00022, 0],
      [-0.00014, 0],
      [-0.00033, 0],
      [-0.00014, 0],
      [-0.00035, 0],
      [-4e-5, 2],
      [-0.00033, 0],
      [-0.00016, 0],
      [-4e-5, 2],
      [-9e-5, 0],
      [-6e-5, 2],
      [-0.00041, 0],
      [-0.00027, 0],
      [-3e-5, 2],
      [-1e-5, 2],
      [-3e-5, 2],
      [-0.00011, 0],
      [-4e-5, 2],
      [-2e-5, 2],
      [-1e-5, 2],
      [-0.00024, 0],
      [-0.00022, 0],
      [-3e-5, 2],
      [0.0006, 1],
      [-2e-5, 2],
      [-0.00013, 0],
      [-0.0, 2]
    ],
    "red_o_points": [],
    "y_categories": ["N", "NOT APPLICABLE", "nan"],
    "blue_o_points": [],
    "blue_x_points": [
      [0.00121, 1],
      [-2e-5, 2],
      [-8e-5, 0],
      [-0.0001, 0],
      [3e-5, 2],
      [0.00064, 1],
      [0.0005, 1],
      [-0.00018, 0],
      [0.0, 2],
      [3e-5, 2],
      [-0.00014, 0],
      [0.0006, 1],
      [-2e-5, 2],
      [0.00068, 1],
      [-1e-5, 2]
    ]
  },
  "QS_mulNeuromadSite[C8]": {
    "red_x_points": [
      [-8e-5, 2],
      [-0.00133, 0],
      [-0.00071, 0],
      [-0.00067, 0],
      [-0.00084, 0],
      [-0.00053, 0],
      [-0.0008, 0],
      [-0.00019, 2],
      [-0.00095, 0],
      [-0.00044, 0],
      [-8e-5, 2],
      [-0.00087, 0],
      [-0.00016, 2],
      [-0.00115, 0],
      [-0.00082, 0],
      [-0.0004, 2],
      [-9e-5, 2],
      [-0.00013, 2],
      [-0.00045, 0],
      [-8e-5, 2],
      [-0.00014, 2],
      [-0.0001, 2],
      [-0.00064, 0],
      [-0.00077, 0],
      [-0.00017, 2],
      [0.00169, 1],
      [-0.00017, 2],
      [-0.00049, 0],
      [-0.00017, 2]
    ],
    "red_o_points": [],
    "y_categories": ["N", "NOT APPLICABLE", "nan"],
    "blue_o_points": [],
    "blue_x_points": [
      [0.0044, 1],
      [-0.00016, 2],
      [-0.00016, 0],
      [-0.00019, 0],
      [9e-5, 2],
      [0.00249, 1],
      [0.00175, 1],
      [-0.00066, 0],
      [-8e-5, 2],
      [-6e-5, 2],
      [-0.00021, 0],
      [0.00241, 1],
      [-6e-5, 2],
      [0.0022, 1],
      [-1e-5, 2]
    ]
  },
  "QS_mulGraftNerve[Ph]": {
    "red_x_points": [
      [-4e-5, 2],
      [-0.00047, 0],
      [-0.00033, 0],
      [-0.00046, 0],
      [-0.0003, 0],
      [-0.00028, 0],
      [-0.00046, 0],
      [-5e-5, 2],
      [-0.0005, 0],
      [-0.00044, 0],
      [-5e-5, 2],
      [-0.00031, 0],
      [-1e-5, 2],
      [-0.00049, 0],
      [-0.00032, 0],
      [-6e-5, 2],
      [-6e-5, 2],
      [-6e-5, 2],
      [-0.00033, 0],
      [-8e-5, 2],
      [-2e-5, 2],
      [-2e-5, 2],
      [-0.00043, 0],
      [-0.00036, 0],
      [-4e-5, 2],
      [0.00092, 1],
      [-6e-5, 2],
      [-0.00026, 0],
      [4e-5, 2]
    ],
    "red_o_points": [],
    "y_categories": ["N", "NOT APPLICABLE", "nan"],
    "blue_o_points": [],
    "blue_x_points": [
      [0.00209, 1],
      [2e-5, 2],
      [-0.00026, 0],
      [-0.00032, 0],
      [-3e-5, 2],
      [0.00106, 1],
      [0.00105, 1],
      [-0.00025, 0],
      [0.0001, 2],
      [-4e-5, 2],
      [-0.00023, 0],
      [0.0013, 1],
      [4e-5, 2],
      [0.00085, 1],
      [-5e-5, 2]
    ]
  },
  "QS_mulTransfSite[AcSsPA]": {
    "red_x_points": [
      [-9e-5, 3],
      [-0.00123, 0],
      [-0.00092, 0],
      [-0.00077, 0],
      [-0.00079, 0],
      [-0.00062, 0],
      [-0.00096, 0],
      [-9e-5, 3],
      [-0.00096, 0],
      [-0.00071, 0],
      [-8e-5, 3],
      [-0.00085, 0],
      [-0.00014, 3],
      [-0.00127, 0],
      [-0.00251, 2],
      [-0.0001, 3],
      [-0.00011, 3],
      [-9e-5, 3],
      [-0.00075, 0],
      [-0.00011, 3],
      [-0.00012, 3],
      [-4e-5, 3],
      [-0.00083, 0],
      [-0.0009, 0],
      [-0.00013, 3],
      [0.0025, 1],
      [-0.00015, 3],
      [-0.00079, 0],
      [-9e-5, 3]
    ],
    "red_o_points": [],
    "y_categories": ["N", "NOT APPLICABLE", "Y", "nan"],
    "blue_o_points": [],
    "blue_x_points": [
      [0.00428, 1],
      [-4e-5, 3],
      [-0.00058, 0],
      [-0.0006, 0],
      [-1e-5, 3],
      [0.00376, 1],
      [0.00191, 1],
      [-0.00057, 0],
      [5e-5, 3],
      [7e-5, 3],
      [-0.00046, 0],
      [0.00287, 1],
      [2e-5, 3],
      [0.00305, 1],
      [-7e-5, 3]
    ]
  },
  "QA_lstPexMuscstrength[ScapulaElev]": {
    "red_x_points": [
      [-0.00031, 0],
      [-0.00052, 2],
      [-0.00078, 2],
      [-0.00044, 2],
      [-0.00294, 1],
      [0.00062, 0],
      [-0.0007, 2],
      [-0.00468, 1],
      [0.00106, 0],
      [-0.0004, 2],
      [-0.00029, 0],
      [-0.00054, 2],
      [-0.0004, 2],
      [-0.00118, 2],
      [5e-5, 0],
      [-0.0003, 0],
      [-0.00037, 0],
      [-0.00048, 0],
      [-0.00061, 2],
      [0.00014, 2],
      [-0.00044, 2],
      [-0.00043, 2],
      [0.00058, 0],
      [0.00032, 0],
      [-0.00018, 2],
      [-0.00043, 2],
      [-0.00051, 2],
      [-0.00094, 1],
      [-0.00023, 2]
    ],
    "red_o_points": [],
    "y_categories": ["GREATER THAN OR EQUALS TO 3", "LESS THAN 3", "nan"],
    "blue_o_points": [],
    "blue_x_points": [
      [-0.00024, 2],
      [0.00032, 2],
      [0.00176, 0],
      [0.00341, 0],
      [0.00031, 2],
      [-0.00029, 2],
      [0.00491, 0],
      [0.0002, 2],
      [0.00136, 0],
      [0.00129, 0],
      [0.00061, 2],
      [0.00109, 0],
      [0.00063, 2]
    ]
  },
  "QA_lstPexMuscstrength[ScapulaAbducSuprot]": {
    "red_x_points": [
      [0.00168, 0],
      [-0.00078, 2],
      [-0.00692, 1],
      [-0.00046, 2],
      [-0.0083, 1],
      [-0.00895, 1],
      [-0.00807, 1],
      [-0.00592, 1],
      [0.00926, 0],
      [-0.00957, 1],
      [-0.0068, 1],
      [-0.00116, 2],
      [-0.00055, 2],
      [-0.00147, 2],
      [-0.0005, 2],
      [0.00313, 0],
      [-0.00604, 1],
      [0.00127, 0],
      [-0.00695, 1],
      [-0.00221, 2],
      [-0.0005, 2],
      [-0.00123, 2],
      [-0.01069, 1],
      [0.00767, 0],
      [-0.00017, 2],
      [0.00013, 2],
      [0.00222, 0],
      [-0.00567, 1],
      [-0.0012, 2]
    ],
    "red_o_points": [],
    "y_categories": ["GREATER THAN OR EQUALS TO 3", "LESS THAN 3", "nan"],
    "blue_o_points": [],
    "blue_x_points": [
      [0.0003, 2],
      [0.00897, 0],
      [0.01266, 0],
      [0.01374, 0],
      [0.00042, 2],
      [0.00035, 2],
      [0.00309, 0],
      [0.00097, 2],
      [0.00196, 2],
      [0.00032, 2],
      [0.01206, 0],
      [0.00302, 0],
      [0.004, 0],
      [0.00039, 2],
      [0.0065, 1]
    ]
  },
  "participant_code": {
    "red_x_points": [
      [-0.02639, 1],
      [-0.02708, 2],
      [-0.02496, 3],
      [-0.02674, 4],
      [-0.02694, 5],
      [-0.02633, 8],
      [-0.02646, 9],
      [-0.02729, 10],
      [-0.02646, 11],
      [-0.0253, 13],
      [-0.0255, 14],
      [-0.02591, 18],
      [-0.02619, 19],
      [-0.02571, 20],
      [-0.02571, 23],
      [-0.02674, 26],
      [-0.0277, 28],
      [-0.0255, 29],
      [-0.02591, 30],
      [-0.02612, 31],
      [-0.02612, 32],
      [-0.02804, 34],
      [-0.02674, 36],
      [-0.02633, 38],
      [-0.02639, 39],
      [-0.02605, 40],
      [-0.02639, 41],
      [-0.02674, 42],
      [-0.02701, 43]
    ],
    "red_o_points": [],
    "y_categories": [
      "P16554",
      "P18297",
      "P19283",
      "P19287",
      "P23172",
      "P23391",
      "P30595",
      "P31645",
      "P31691",
      "P34778",
      "P35046",
      "P36328",
      "P43633",
      "P4544",
      "P46417",
      "P48965",
      "P53068",
      "P5497",
      "P58556",
      "P59529",
      "P62483",
      "P64658",
      "P65202",
      "P66816",
      "P6751",
      "P7408",
      "P75566",
      "P76226",
      "P79971",
      "P82621",
      "P82990",
      "P84549",
      "P84932",
      "P85825",
      "P86989",
      "P8770",
      "P87791",
      "P90550",
      "P93159",
      "P94969",
      "P96710",
      "P97130",
      "P9744",
      "P98500",
      "nan"
    ],
    "blue_o_points": [],
    "blue_x_points": [
      [0.05348, 0],
      [0.05243, 6],
      [0.05282, 7],
      [0.05098, 12],
      [0.05033, 15],
      [0.04928, 16],
      [0.05098, 17],
      [0.05085, 21],
      [0.0519, 22],
      [0.05151, 24],
      [0.0498, 25],
      [0.05006, 27],
      [0.04993, 33],
      [0.05006, 35],
      [0.05033, 37]
    ]
  },
  "QS_mulNeuromadSite[T2]": {
    "red_x_points": [
      [-6e-5, 2],
      [-0.00122, 0],
      [-0.00116, 0],
      [-0.00084, 0],
      [-0.001, 0],
      [-0.00095, 0],
      [-0.00097, 0],
      [-0.00015, 2],
      [-0.00117, 0],
      [-0.00086, 0],
      [-0.00014, 2],
      [-0.00098, 0],
      [-0.00016, 2],
      [-0.00121, 0],
      [-0.00098, 0],
      [-0.0001, 2],
      [-2e-5, 2],
      [-0.00019, 2],
      [-0.0009, 0],
      [1e-5, 2],
      [-0.00015, 2],
      [-0.00013, 2],
      [-0.00106, 0],
      [-0.00097, 0],
      [-0.00012, 2],
      [0.00228, 1],
      [-0.00027, 2],
      [-0.00089, 0],
      [-0.00019, 2]
    ],
    "red_o_points": [],
    "y_categories": ["N", "NOT APPLICABLE", "nan"],
    "blue_o_points": [],
    "blue_x_points": [
      [0.0042, 1],
      [-5e-5, 2],
      [-0.00039, 0],
      [-0.00072, 0],
      [9e-5, 2],
      [0.00337, 1],
      [0.00229, 1],
      [-0.00051, 0],
      [-2e-5, 2],
      [2e-5, 2],
      [-0.00039, 0],
      [0.00318, 1],
      [9e-5, 2],
      [0.00332, 1],
      [9e-5, 2]
    ]
  },
  "QA_yonInjTbi": {
    "red_x_points": [
      [0.00592, 0],
      [-0.00183, 2],
      [-0.00201, 0],
      [-0.00207, 0],
      [-0.00176, 2],
      [0.00064, 1],
      [-0.00204, 0],
      [-0.0091, 2],
      [-0.00406, 2],
      [0.00088, 1],
      [-0.00441, 1],
      [-0.00402, 0],
      [0.00787, 0],
      [0.00059, 1],
      [-0.00011, 1],
      [-0.00459, 1],
      [-0.00395, 1],
      [-0.00513, 1],
      [0.00074, 1],
      [-0.00544, 1],
      [0.00642, 0],
      [-0.00548, 1],
      [0.00151, 1],
      [0.0009, 1],
      [-0.00521, 1],
      [-0.00076, 2],
      [-0.00972, 2],
      [0.00021, 1],
      [-0.0072, 1]
    ],
    "red_o_points": [],
    "y_categories": ["N", "Y", "nan"],
    "blue_o_points": [],
    "blue_x_points": [
      [0.00038, 0],
      [-0.00239, 1],
      [0.00219, 1],
      [0.00262, 1],
      [0.01112, 0],
      [0.0003, 1],
      [5e-5, 1],
      [0.00407, 1],
      [0.01216, 0],
      [0.01018, 0],
      [0.00188, 1],
      [3e-5, 2],
      [-0.00337, 1],
      [0.01399, 0]
    ]
  },
  "QA_mulInjOrthesisType[ArmSling]": {
    "red_x_points": [
      [-0.00702, 2],
      [-0.00696, 2],
      [-0.00714, 2],
      [-0.00693, 2],
      [-0.00737, 2],
      [-0.00707, 2],
      [-0.00685, 2],
      [-0.00712, 2],
      [-0.00697, 2],
      [-0.00671, 2],
      [-0.00697, 2],
      [-0.00702, 2],
      [-0.00714, 2],
      [-0.0073, 2],
      [-0.02252, 0],
      [-0.00705, 2],
      [-0.00734, 2],
      [-0.0219, 0],
      [-0.02191, 3],
      [-0.00707, 2],
      [-0.00712, 2],
      [-0.00678, 2],
      [-0.00707, 2],
      [-0.00714, 2],
      [-0.02165, 3],
      [-0.02158, 3],
      [-0.0224, 3],
      [-0.00692, 2],
      [-0.00718, 2]
    ],
    "red_o_points": [],
    "y_categories": ["N", "NOT APPLICABLE", "Y", "nan"],
    "blue_o_points": [],
    "blue_x_points": [
      [-0.00662, 2],
      [-0.00674, 2],
      [-0.0068, 2],
      [-0.00703, 2],
      [0.04347, 1],
      [0.04363, 1],
      [0.04179, 1],
      [0.04389, 1],
      [-0.00661, 2],
      [0.04363, 1],
      [-0.007, 2],
      [0.04257, 1],
      [0.04263, 1],
      [0.04014, 1],
      [-0.00675, 2]
    ]
  },
  "QS_mulGraftNerve[Ul]": {
    "red_x_points": [
      [-1e-5, 2],
      [-9e-5, 0],
      [-3e-5, 0],
      [-8e-5, 0],
      [-7e-5, 0],
      [-4e-5, 0],
      [-4e-5, 0],
      [1e-5, 2],
      [-7e-5, 0],
      [-2e-5, 0],
      [-2e-5, 2],
      [-8e-5, 0],
      [-1e-5, 2],
      [-0.00012, 0],
      [-8e-5, 0],
      [-6e-5, 2],
      [-1e-5, 2],
      [-5e-5, 2],
      [-4e-5, 0],
      [-2e-5, 2],
      [-1e-5, 2],
      [-2e-5, 2],
      [-7e-5, 0],
      [-3e-5, 0],
      [-6e-5, 2],
      [7e-5, 1],
      [-1e-5, 2],
      [-4e-5, 0],
      [-2e-5, 2]
    ],
    "red_o_points": [],
    "y_categories": ["N", "NOT APPLICABLE", "nan"],
    "blue_o_points": [],
    "blue_x_points": [
      [0.0006, 1],
      [-0.0, 2],
      [2e-5, 0],
      [-2e-5, 0],
      [-1e-5, 2],
      [0.0002, 1],
      [0.00013, 1],
      [-4e-5, 0],
      [-1e-5, 2],
      [-1e-5, 2],
      [-2e-5, 0],
      [0.00013, 1],
      [-5e-5, 2],
      [0.00028, 1],
      [-6e-5, 2]
    ]
  },
  "QA_mulInjOrthesisType[ShoulderSupport]": {
    "red_x_points": [
      [-0.00667, 0],
      [-0.00659, 0],
      [-0.00624, 0],
      [-0.02344, 2],
      [-0.0066, 0],
      [-0.00644, 0],
      [-0.00625, 0],
      [-0.02423, 2],
      [-0.00651, 0],
      [-0.00644, 0],
      [-0.00646, 0],
      [-0.00668, 0],
      [-0.0068, 0],
      [-0.00643, 0],
      [-0.02409, 2],
      [-0.00628, 0],
      [-0.00642, 0],
      [-0.02451, 2],
      [-0.02483, 3],
      [-0.00672, 0],
      [-0.00634, 0],
      [-0.00651, 0],
      [-0.00618, 0],
      [-0.00643, 0],
      [-0.02464, 3],
      [-0.0242, 3],
      [-0.02409, 3],
      [-0.00643, 0],
      [-0.00649, 0]
    ],
    "red_o_points": [],
    "y_categories": ["N", "NOT APPLICABLE", "Y", "nan"],
    "blue_o_points": [],
    "blue_x_points": [
      [-0.00622, 0],
      [-0.00609, 0],
      [-0.00641, 0],
      [-0.006, 0],
      [0.04607, 1],
      [0.04521, 1],
      [0.04612, 1],
      [0.04682, 1],
      [-0.00569, 0],
      [0.04588, 1],
      [-0.00609, 0],
      [0.04754, 1],
      [0.04695, 1],
      [0.04784, 1],
      [-0.00599, 0]
    ]
  },
  "QA_yonInjUnconscio": {
    "red_x_points": [
      [-0.01215, 1],
      [-0.01216, 1],
      [-0.00193, 2],
      [-0.00227, 2],
      [-0.00215, 2],
      [-0.01336, 1],
      [-0.00194, 2],
      [-0.00298, 2],
      [-0.00245, 2],
      [-0.01351, 1],
      [-0.01225, 1],
      [-0.0139, 1],
      [-0.00319, 2],
      [-0.00218, 2],
      [-0.00972, 1],
      [-0.01193, 1],
      [-0.01271, 1],
      [-0.0096, 1],
      [-0.01019, 1],
      [-0.01165, 1],
      [-0.00285, 2],
      [-0.00281, 2],
      [-0.01373, 1],
      [-0.01251, 1],
      [-0.00285, 2],
      [-0.00268, 2],
      [-0.00312, 2],
      [-0.01309, 1],
      [-0.00362, 2]
    ],
    "red_o_points": [],
    "y_categories": ["N", "Y", "nan"],
    "blue_o_points": [],
    "blue_x_points": [
      [-0.00167, 2],
      [-0.00178, 2],
      [0.04763, 0],
      [-0.00085, 2],
      [-0.00798, 1],
      [-0.00787, 1],
      [0.03154, 0],
      [0.04158, 0],
      [-0.00215, 2],
      [0.0386, 0],
      [0.04606, 0],
      [-0.00195, 2],
      [-0.00783, 1],
      [-0.00187, 2],
      [0.04804, 0]
    ]
  },
  "QA_lstPexPalle[Elbow]": {
    "red_x_points": [
      [-0.00065, 4],
      [-0.00315, 4],
      [-0.00161, 4],
      [-0.00154, 3],
      [-0.00359, 4],
      [-0.00109, 3],
      [-0.00263, 4],
      [-0.00054, 4],
      [-0.00368, 4],
      [-0.00142, 3],
      [-0.00321, 1],
      [-0.00347, 4],
      [-0.00071, 4],
      [-0.00365, 4],
      [-0.00146, 4],
      [0.00048, 3],
      [-0.00826, 0],
      [0.00035, 3],
      [-0.00671, 2],
      [0.0009, 3],
      [-0.00075, 4],
      [-0.00074, 4],
      [-0.0044, 4],
      [-0.00385, 4],
      [-0.00022, 4],
      [-0.02304, 3],
      [-0.00048, 4],
      [-0.00608, 0],
      [-0.00054, 4]
    ],
    "red_o_points": [],
    "y_categories": ["ABS", "HYPO", "NAIA", "PT", "nan"],
    "blue_o_points": [],
    "blue_x_points": [
      [0.00417, 4],
      [-0.00039, 4],
      [0.00312, 3],
      [0.03069, 1],
      [0.0002, 4],
      [0.00405, 4],
      [0.00971, 1],
      [-0.00246, 4],
      [-0.00012, 4],
      [5e-5, 4],
      [0.02279, 1],
      [0.00355, 4],
      [0.00197, 3],
      [0.00434, 4],
      [0.00409, 3]
    ]
  },
  "QS_mulGraftNerve[MCA]": {
    "red_x_points": [
      [-2e-5, 2],
      [-2e-5, 0],
      [-3e-5, 0],
      [-3e-5, 0],
      [-2e-5, 0],
      [-2e-5, 0],
      [1e-5, 2],
      [-3e-5, 0],
      [0.0, 0],
      [-1e-5, 2],
      [-2e-5, 0],
      [-2e-5, 2],
      [-2e-5, 0],
      [1e-5, 2],
      [-1e-5, 2],
      [-2e-5, 2],
      [-1e-5, 2],
      [-1e-5, 2],
      [-2e-5, 0],
      [0.0, 0],
      [-2e-5, 0],
      [-1e-5, 2]
    ],
    "red_o_points": [],
    "y_categories": ["N", "NOT APPLICABLE", "nan"],
    "blue_o_points": [],
    "blue_x_points": [
      [0.00031, 1],
      [1e-5, 2],
      [0.0, 0],
      [-2e-5, 0],
      [-1e-5, 2],
      [0.0, 0],
      [1e-5, 2]
    ]
  },
  "QA_lstPexInspectio[Swelling]": {
    "red_x_points": [
      [0.00189, 1],
      [-0.00316, 1],
      [0.00147, 0],
      [-0.00179, 1],
      [-0.00012, 2],
      [0.00259, 0],
      [-0.00364, 1],
      [0.00189, 1],
      [-0.00693, 1],
      [-0.00705, 1],
      [-0.00903, 2],
      [-0.0059, 1],
      [-0.00522, 0],
      [-0.00638, 1],
      [-0.00137, 1],
      [-0.0038, 0],
      [-0.00893, 2],
      [0.00201, 1],
      [-0.00264, 1],
      [0.00183, 1],
      [-0.00496, 0],
      [0.00143, 1],
      [-0.00609, 1],
      [0.00429, 0],
      [0.00197, 1],
      [-0.0056, 0],
      [-0.00885, 2],
      [0.00056, 0],
      [0.00215, 1]
    ],
    "red_o_points": [],
    "y_categories": ["ABS", "NAIA", "PT", "nan"],
    "blue_o_points": [],
    "blue_x_points": [
      [0.0024, 1],
      [0.00494, 1],
      [0.01015, 0],
      [0.01327, 0],
      [0.00478, 1],
      [0.00241, 1],
      [-0.00017, 0],
      [-0.00285, 1],
      [0.00392, 0],
      [0.00479, 1],
      [0.01771, 2],
      [0.00162, 1],
      [0.00352, 1],
      [-0.00086, 0],
      [0.00373, 1]
    ]
  },
  "QA_lstPexInspectio[SurgicalScar]": {
    "red_x_points": [
      [-0.00446, 1],
      [-0.00462, 1],
      [-0.00586, 0],
      [-0.00383, 1],
      [-0.00654, 1],
      [-0.00885, 0],
      [-0.00588, 1],
      [-0.00286, 1],
      [-0.00785, 1],
      [-0.00959, 1],
      [-0.00733, 0],
      [-0.00755, 1],
      [-0.00226, 2],
      [-0.0086, 1],
      [-0.00522, 0],
      [0.00452, 2],
      [0.00366, 2],
      [-0.00824, 1],
      [-0.00459, 1],
      [-0.00678, 1],
      [-0.00271, 2],
      [-0.00338, 1],
      [-0.00696, 1],
      [0.01276, 2],
      [-0.00348, 1],
      [-0.00518, 1],
      [-0.00228, 1],
      [0.00503, 2],
      [-0.0031, 1]
    ],
    "red_o_points": [],
    "y_categories": ["ABS", "NAIA", "PT", "nan"],
    "blue_o_points": [],
    "blue_x_points": [
      [-0.00041, 1],
      [0.01193, 2],
      [0.02311, 2],
      [0.0266, 2],
      [0.00097, 1],
      [0.00012, 1],
      [0.00216, 0],
      [-0.00473, 1],
      [0.00218, 1],
      [0.00215, 1],
      [0.02086, 2],
      [-0.00042, 1],
      [0.01239, 2],
      [0.00331, 0],
      [0.01181, 2]
    ]
  },
  "QA_intPexWristFlex": {
    "red_x_points": [
      [-0.00015, 2],
      [-0.00073, 2],
      [-0.00037, 2],
      [-0.00039, 2],
      [-0.00075, 2],
      [-0.00043, 0],
      [-0.00071, 2],
      [0.00019, 0],
      [-0.00117, 2],
      [-0.00082, 2],
      [-0.00037, 0],
      [-0.00112, 2],
      [-0.00024, 2],
      [-0.00085, 2],
      [-0.0003, 2],
      [-0.00049, 0],
      [0.0, 0],
      [-0.00031, 0],
      [-0.0001, 0],
      [-0.00023, 2],
      [-0.00013, 2],
      [-0.00027, 2],
      [-0.00103, 2],
      [-0.00078, 2],
      [-0.00014, 2],
      [-0.02169, 1],
      [-0.00423, 1],
      [-2e-5, 0],
      [-0.00028, 2]
    ],
    "red_o_points": [],
    "y_categories": ["GREATER THAN OR EQUALS TO 60", "LESS THAN 60", "nan"],
    "blue_o_points": [],
    "blue_x_points": [
      [0.00397, 2],
      [0.00424, 0],
      [0.00044, 0],
      [-0.00045, 2],
      [5e-5, 2],
      [0.00378, 2],
      [0.00524, 0],
      [-0.00064, 2],
      [0.00013, 2],
      [5e-5, 2],
      [0.01154, 1],
      [0.00391, 2],
      [0.00051, 2],
      [0.00421, 2],
      [0.00095, 0]
    ]
  },
  "QS_mulGraftNerve[Me]": {
    "red_x_points": [
      [1e-5, 2],
      [-8e-5, 0],
      [-0.00011, 0],
      [-7e-5, 0],
      [-0.00011, 0],
      [-0.00012, 0],
      [-7e-5, 0],
      [0.0, 2],
      [-0.00011, 0],
      [-4e-5, 0],
      [2e-5, 2],
      [-4e-5, 0],
      [1e-5, 2],
      [-4e-5, 0],
      [-0.00012, 0],
      [1e-5, 2],
      [1e-5, 2],
      [1e-5, 2],
      [-8e-5, 0],
      [1e-5, 2],
      [-0.0, 2],
      [-0.0, 2],
      [-0.00012, 0],
      [-0.00012, 0],
      [-0.0, 2],
      [0.00026, 1],
      [-0.0, 2],
      [-0.00012, 0],
      [-1e-5, 2]
    ],
    "red_o_points": [],
    "y_categories": ["N", "NOT APPLICABLE", "nan"],
    "blue_o_points": [],
    "blue_x_points": [
      [0.00026, 1],
      [-0.0, 2],
      [-4e-5, 0],
      [-0.00011, 0],
      [1e-5, 2],
      [0.00035, 1],
      [0.00019, 1],
      [-4e-5, 0],
      [-0.0, 2],
      [1e-5, 2],
      [0.00026, 1],
      [1e-5, 2],
      [0.0001, 1],
      [0.0, 2]
    ]
  },
  "QS_mulBpsurgeryType[Lysis]": {
    "red_x_points": [
      [-0.00103, 3],
      [-0.00526, 0],
      [-0.0165, 2],
      [-0.01484, 2],
      [-0.00297, 0],
      [-0.01731, 2],
      [-0.0031, 0],
      [-0.00144, 3],
      [-0.00304, 0],
      [-0.00259, 0],
      [-0.00121, 3],
      [-0.00336, 0],
      [-0.00161, 3],
      [-0.00444, 0],
      [-0.01584, 2],
      [-0.00146, 3],
      [-0.00104, 3],
      [-0.00103, 3],
      [-0.0028, 0],
      [-0.00095, 3],
      [-0.00159, 3],
      [-0.00171, 3],
      [-0.00348, 0],
      [-0.00314, 0],
      [-0.00169, 3],
      [0.02073, 1],
      [-0.00142, 3],
      [-0.01647, 2],
      [-0.00155, 3]
    ],
    "red_o_points": [],
    "y_categories": ["N", "NOT APPLICABLE", "Y", "nan"],
    "blue_o_points": [],
    "blue_x_points": [
      [0.03075, 1],
      [-0.00101, 3],
      [-0.00045, 0],
      [-0.00064, 0],
      [-4e-5, 3],
      [0.02556, 1],
      [0.01946, 1],
      [-0.00144, 0],
      [-0.00088, 3],
      [-0.00023, 3],
      [-0.00117, 0],
      [0.02188, 1],
      [-0.00078, 3],
      [0.02201, 1],
      [-0.00089, 3]
    ]
  },
  "QS_mulLysisSite[Trunk]": {
    "red_x_points": [
      [-0.00056, 3],
      [-0.00411, 0],
      [-0.00352, 0],
      [-0.00269, 0],
      [-0.0034, 0],
      [-0.01286, 2],
      [-0.00336, 0],
      [-0.00085, 3],
      [-0.00327, 0],
      [-0.00332, 0],
      [-0.00082, 3],
      [-0.00329, 0],
      [-0.00099, 3],
      [-0.00406, 0],
      [-0.01099, 2],
      [-0.00087, 3],
      [-0.00065, 3],
      [-0.00066, 3],
      [-0.00314, 0],
      [-0.00057, 3],
      [-0.00088, 3],
      [-0.00094, 3],
      [-0.00347, 0],
      [-0.00363, 0],
      [-0.00092, 3],
      [0.01185, 1],
      [-0.00076, 3],
      [-0.01034, 2],
      [-0.00073, 3]
    ],
    "red_o_points": [],
    "y_categories": ["N", "NOT APPLICABLE", "Y", "nan"],
    "blue_o_points": [],
    "blue_x_points": [
      [0.02103, 1],
      [-0.00061, 3],
      [-0.00155, 0],
      [-0.00185, 0],
      [-0.00023, 3],
      [0.01781, 1],
      [0.01359, 1],
      [-0.00172, 0],
      [-0.00047, 3],
      [-0.00023, 3],
      [-0.00163, 0],
      [0.01528, 1],
      [-0.00034, 3],
      [0.01533, 1],
      [-0.0006, 3]
    ]
  },
  "QS_mulGraftTrunk[UpperTrunk]": {
    "red_x_points": [
      [-0.00018, 3],
      [-0.00264, 0],
      [-0.00158, 0],
      [-0.00172, 0],
      [-0.00162, 0],
      [-0.00151, 0],
      [-0.0017, 0],
      [-0.00057, 3],
      [-0.00181, 0],
      [-0.00171, 0],
      [-0.00031, 3],
      [-0.00199, 0],
      [-0.00056, 3],
      [-0.0084, 2],
      [-0.00238, 0],
      [-0.00038, 3],
      [-0.00026, 3],
      [-0.00041, 3],
      [-0.00164, 0],
      [-0.00028, 3],
      [-0.00055, 3],
      [-0.00047, 3],
      [-0.00173, 0],
      [-0.00186, 0],
      [-0.00065, 3],
      [0.0053, 1],
      [-0.00052, 3],
      [-0.0017, 0],
      [-0.00064, 3]
    ],
    "red_o_points": [],
    "y_categories": ["N", "NOT APPLICABLE", "Y", "nan"],
    "blue_o_points": [],
    "blue_x_points": [
      [0.01075, 1],
      [-0.0002, 3],
      [-0.00098, 0],
      [-0.00019, 0],
      [7e-5, 3],
      [0.00717, 1],
      [0.00651, 1],
      [-0.00093, 0],
      [-0.00028, 3],
      [-0.00017, 3],
      [-0.00088, 0],
      [0.00697, 1],
      [-0.00022, 3],
      [0.0071, 1],
      [-0.00023, 3]
    ]
  },
  "QS_mulTransfSite[PhMc]": {
    "red_x_points": [
      [-0.00036, 3],
      [-0.00295, 0],
      [-0.00214, 0],
      [-0.00227, 0],
      [-0.00234, 0],
      [-0.0021, 0],
      [-0.00893, 2],
      [-0.00063, 3],
      [-0.00248, 0],
      [-0.00208, 0],
      [-0.00043, 3],
      [-0.00246, 0],
      [-0.0007, 3],
      [-0.00316, 0],
      [-0.0028, 0],
      [-0.00061, 3],
      [-0.00023, 3],
      [-0.00048, 3],
      [-0.0072, 2],
      [-0.00049, 3],
      [-0.00064, 3],
      [-0.00075, 3],
      [-0.00251, 0],
      [-0.00231, 0],
      [-0.00057, 3],
      [0.00816, 1],
      [-0.00075, 3],
      [-0.00197, 0],
      [-0.00066, 3]
    ],
    "red_o_points": [],
    "y_categories": ["N", "NOT APPLICABLE", "Y", "nan"],
    "blue_o_points": [],
    "blue_x_points": [
      [0.01447, 1],
      [-0.00027, 3],
      [-0.00123, 0],
      [-0.00127, 0],
      [0.0, 3],
      [0.01214, 1],
      [0.00794, 1],
      [-0.00154, 0],
      [-0.00041, 3],
      [-0.0002, 3],
      [-0.00152, 0],
      [0.00965, 1],
      [-0.00042, 3],
      [0.00963, 1],
      [-0.00013, 3]
    ]
  },
  "QS_mulLysisSite[Root]": {
    "red_x_points": [
      [-0.00049, 3],
      [-0.00176, 0],
      [-0.00591, 2],
      [-0.00122, 0],
      [-0.0017, 0],
      [-0.00141, 0],
      [-0.00158, 0],
      [-0.00055, 3],
      [-0.00153, 0],
      [-0.00147, 0],
      [-0.00046, 3],
      [-0.00131, 0],
      [-0.00059, 3],
      [-0.00183, 0],
      [-0.00169, 0],
      [-0.00067, 3],
      [-0.00052, 3],
      [-0.00043, 3],
      [-0.00126, 0],
      [-0.00056, 3],
      [-0.00062, 3],
      [-0.00065, 3],
      [-0.00166, 0],
      [-0.00136, 0],
      [-0.00052, 3],
      [0.00483, 1],
      [-0.00048, 3],
      [-0.00497, 2],
      [-0.00055, 3]
    ],
    "red_o_points": [],
    "y_categories": ["N", "NOT APPLICABLE", "Y", "nan"],
    "blue_o_points": [],
    "blue_x_points": [
      [0.01063, 1],
      [-0.00043, 3],
      [-0.001, 0],
      [-0.00086, 0],
      [-0.00032, 3],
      [0.00786, 1],
      [0.00691, 1],
      [-0.00134, 0],
      [-0.00029, 3],
      [-0.00033, 3],
      [-0.00105, 0],
      [0.00647, 1],
      [-0.00017, 3],
      [0.00711, 1],
      [-0.00026, 3]
    ]
  },
  "QA_lstPexInspectio[ShoulderSubdisloc]": {
    "red_x_points": [
      [-0.0023, 1],
      [-0.00384, 1],
      [0.00254, 0],
      [-0.00302, 1],
      [-0.00563, 1],
      [-0.00165, 2],
      [-0.00519, 1],
      [-0.00264, 1],
      [-0.00807, 1],
      [-0.00842, 1],
      [-0.00121, 2],
      [-0.00774, 1],
      [-0.00284, 1],
      [-0.0083, 1],
      [-0.0024, 1],
      [-0.00354, 2],
      [-0.00065, 2],
      [-0.00019, 1],
      [-0.00319, 1],
      [-0.00144, 1],
      [-0.01018, 0],
      [0.00359, 2],
      [-0.00169, 2],
      [-0.00089, 2],
      [-0.0017, 1],
      [-0.00917, 2],
      [-0.0022, 1],
      [-0.00105, 2],
      [-0.00279, 1]
    ],
    "red_o_points": [],
    "y_categories": ["ABS", "NAIA", "PT", "nan"],
    "blue_o_points": [],
    "blue_x_points": [
      [0.00326, 1],
      [0.0078, 2],
      [0.02985, 0],
      [0.00602, 2],
      [0.00097, 1],
      [0.00382, 1],
      [0.00352, 0],
      [-0.00301, 1],
      [0.01185, 2],
      [0.00085, 1],
      [0.02537, 0],
      [0.00168, 1],
      [0.00228, 1],
      [-0.00033, 2],
      [0.00188, 1]
    ]
  },
  "QA_yonPreTbi": {
    "red_x_points": [
      [-0.0009, 2],
      [-3e-5, 2],
      [-0.00013, 2],
      [-8e-5, 2],
      [-0.00012, 2],
      [-0.00016, 2],
      [-0.00013, 2],
      [-0.00077, 2],
      [-0.00013, 2],
      [-0.00015, 2],
      [-0.00093, 2],
      [-0.00016, 2],
      [-0.00079, 2],
      [-4e-5, 2],
      [-1e-5, 2],
      [-0.01239, 1],
      [-0.00094, 2],
      [-0.00069, 2],
      [-8e-5, 2],
      [-0.00092, 2],
      [-0.00085, 2],
      [-0.00097, 2],
      [-0.00018, 2],
      [-0.00016, 2],
      [-0.00067, 2],
      [-0.0, 2],
      [-0.00063, 2],
      [-0.00017, 2],
      [-0.00077, 2]
    ],
    "red_o_points": [],
    "y_categories": ["N", "Y", "nan"],
    "blue_o_points": [],
    "blue_x_points": [
      [-1e-5, 2],
      [0.02721, 0],
      [-4e-5, 2],
      [-0.00019, 2],
      [-0.0005, 2],
      [-0.0, 2],
      [-0.0, 2],
      [-6e-5, 2],
      [-0.0008, 2],
      [-0.00046, 2],
      [-4e-5, 2],
      [0.0, 2],
      [-0.00043, 2],
      [-0.00074, 2]
    ]
  },
  "QS_mulGraftLevel[Trunk]": {
    "red_x_points": [
      [-0.00056, 3],
      [-0.00203, 0],
      [-0.00157, 0],
      [-0.00153, 0],
      [-0.00168, 0],
      [-0.00118, 0],
      [-0.00156, 0],
      [-0.00038, 3],
      [-0.00127, 0],
      [-0.00117, 0],
      [-0.00017, 3],
      [-0.00127, 0],
      [-0.00054, 3],
      [-0.00768, 2],
      [-0.00217, 0],
      [-0.00036, 3],
      [-0.00017, 3],
      [-0.00036, 3],
      [-0.00132, 0],
      [-0.00037, 3],
      [-0.00045, 3],
      [-0.00064, 3],
      [-0.00131, 0],
      [-0.00133, 0],
      [-0.00053, 3],
      [0.00525, 1],
      [-0.00053, 3],
      [-0.00128, 0],
      [-0.00046, 3]
    ],
    "red_o_points": [],
    "y_categories": ["N", "NOT APPLICABLE", "Y", "nan"],
    "blue_o_points": [],
    "blue_x_points": [
      [0.00899, 1],
      [-0.00038, 3],
      [-0.00028, 0],
      [-0.00034, 0],
      [2e-5, 3],
      [0.00614, 1],
      [0.00499, 1],
      [-0.00052, 0],
      [-0.00031, 3],
      [-0.00015, 3],
      [-0.00047, 0],
      [0.00562, 1],
      [-0.0003, 3],
      [0.00584, 1],
      [-0.00024, 3]
    ]
  },
  "QA_lstPexPain[C7]": {
    "red_x_points": [
      [-0.00155, 1],
      [-0.0034, 2],
      [-0.00213, 2],
      [-0.00104, 1],
      [-0.00389, 2],
      [-0.0031, 1],
      [-0.00185, 1],
      [-0.00577, 0],
      [-0.00493, 1],
      [0.00567, 0],
      [-0.00161, 1],
      [-0.00543, 2],
      [0.00174, 2],
      [-0.00504, 2],
      [-0.00161, 2],
      [-0.00486, 0],
      [-0.00102, 1],
      [-0.00539, 0],
      [-0.00243, 2],
      [-0.00408, 0],
      [0.00124, 2],
      [0.00135, 2],
      [-0.00586, 2],
      [-0.00589, 2],
      [-0.0047, 0],
      [-0.0034, 1],
      [-0.00089, 1],
      [-0.00151, 1],
      [-0.00106, 1]
    ],
    "red_o_points": [],
    "y_categories": ["NORM", "NPV", "nan"],
    "blue_o_points": [],
    "blue_x_points": [
      [-2e-5, 1],
      [0.00478, 1],
      [0.01338, 0],
      [0.01716, 0],
      [0.00514, 2],
      [0.00013, 2],
      [-3e-5, 1],
      [0.00122, 1],
      [0.0059, 2],
      [0.00505, 2],
      [0.01074, 0],
      [-2e-5, 1],
      [-0.00094, 0],
      [0.00357, 0],
      [0.00639, 1]
    ]
  },
  "QS_mulTransfSite[AcSsAA]": {
    "red_x_points": [
      [-0.00051, 3],
      [-0.00134, 2],
      [-0.00504, 0],
      [-0.00467, 0],
      [-0.00073, 2],
      [-0.00589, 0],
      [-0.00441, 0],
      [-0.00056, 3],
      [-0.00643, 0],
      [-0.00664, 0],
      [-0.00039, 3],
      [-0.00498, 0],
      [-0.00082, 3],
      [-0.00079, 2],
      [-0.00335, 0],
      [-0.0005, 3],
      [-0.00039, 3],
      [-0.00046, 3],
      [-0.0004, 2],
      [-0.00033, 3],
      [-0.00059, 3],
      [-0.00045, 3],
      [-0.00494, 0],
      [-2e-5, 2],
      [-0.00056, 3],
      [0.00542, 1],
      [-0.00061, 3],
      [-0.00346, 0],
      [-0.00062, 3]
    ],
    "red_o_points": [],
    "y_categories": ["N", "NOT APPLICABLE", "Y", "nan"],
    "blue_o_points": [],
    "blue_x_points": [
      [0.01347, 1],
      [-0.00038, 3],
      [0.00772, 2],
      [0.00711, 2],
      [-0.00015, 3],
      [0.00813, 1],
      [0.00596, 1],
      [-0.00196, 0],
      [-0.00023, 3],
      [-0.00023, 3],
      [-0.00204, 0],
      [0.00855, 1],
      [-0.00037, 3],
      [0.00889, 1],
      [2e-5, 3]
    ]
  },
  "QS_mulGraftNerve[DS]": {
    "red_x_points": [
      [0.0, 2],
      [-6e-5, 0],
      [-3e-5, 0],
      [-6e-5, 0],
      [-3e-5, 0],
      [-3e-5, 0],
      [-6e-5, 0],
      [-1e-5, 2],
      [-6e-5, 0],
      [-6e-5, 0],
      [-1e-5, 2],
      [-6e-5, 0],
      [0.0, 2],
      [-6e-5, 0],
      [-6e-5, 0],
      [0.0, 2],
      [0.0, 2],
      [0.0, 2],
      [-3e-5, 0],
      [0.0, 2],
      [-1e-5, 2],
      [-6e-5, 0],
      [-3e-5, 0],
      [0.00018, 1],
      [0.0, 2],
      [-6e-5, 0],
      [0.0, 2]
    ],
    "red_o_points": [],
    "y_categories": ["N", "NOT APPLICABLE", "nan"],
    "blue_o_points": [],
    "blue_x_points": [
      [0.00018, 1],
      [0.0, 2],
      [-6e-5, 0],
      [-3e-5, 0],
      [0.0, 2],
      [0.00018, 1],
      [-3e-5, 0],
      [0.0, 2],
      [-1e-5, 2],
      [-6e-5, 0],
      [0.00018, 1],
      [0.0, 2],
      [0.00018, 1],
      [1e-5, 2]
    ]
  },
  "QS_mulGraftNerve[MP]": {
    "red_x_points": [
      [-0.0, 2],
      [-3e-5, 0],
      [-3e-5, 0],
      [-3e-5, 0],
      [-3e-5, 0],
      [-3e-5, 0],
      [-0.0, 2],
      [-3e-5, 0],
      [-3e-5, 0],
      [-3e-5, 0],
      [-0.0, 2],
      [-3e-5, 0],
      [-0.0, 2],
      [-0.0, 2],
      [-3e-5, 0],
      [-0.0, 2],
      [-0.0, 2],
      [-0.0, 2],
      [-3e-5, 0],
      [-3e-5, 0],
      [-0.0, 2],
      [9e-5, 1],
      [-0.0, 2]
    ],
    "red_o_points": [],
    "y_categories": ["N", "NOT APPLICABLE", "nan"],
    "blue_o_points": [],
    "blue_x_points": [
      [-0.0, 2],
      [-3e-5, 0],
      [-0.0, 2],
      [9e-5, 1],
      [9e-5, 1],
      [-3e-5, 0],
      [-0.0, 2],
      [-3e-5, 0],
      [9e-5, 1],
      [-0.0, 2],
      [9e-5, 1],
      [-0.0, 2]
    ]
  },
  "QS_mulLysisSite[Nerve]": {
    "red_x_points": [
      [-0.00043, 3],
      [-0.00359, 0],
      [-0.01056, 2],
      [-0.00903, 2],
      [-0.00284, 0],
      [-0.00238, 0],
      [-0.00254, 0],
      [-0.00073, 3],
      [-0.00239, 0],
      [-0.00244, 0],
      [-0.00063, 3],
      [-0.00288, 0],
      [-0.00066, 3],
      [-0.00332, 0],
      [-0.00345, 0],
      [-0.00058, 3],
      [-0.00037, 3],
      [-0.00061, 3],
      [-0.0024, 0],
      [-0.00055, 3],
      [-0.00071, 3],
      [-0.00051, 3],
      [-0.00282, 0],
      [-0.00258, 0],
      [-0.00071, 3],
      [0.00972, 1],
      [-0.00057, 3],
      [-0.00217, 0],
      [-0.00058, 3]
    ],
    "red_o_points": [],
    "y_categories": ["N", "NOT APPLICABLE", "Y", "nan"],
    "blue_o_points": [],
    "blue_x_points": [
      [0.01616, 1],
      [-0.0002, 3],
      [-0.00099, 0],
      [-0.00184, 0],
      [-0.0, 3],
      [0.01233, 1],
      [0.00941, 1],
      [-0.00177, 0],
      [-0.00039, 3],
      [-0.0002, 3],
      [-0.00153, 0],
      [0.01142, 1],
      [-0.00036, 3],
      [0.01158, 1],
      [-0.00033, 3]
    ]
  },
  "QS_mulGraftNerve[Ax]": {
    "red_x_points": [
      [-2e-5, 2],
      [-8e-5, 0],
      [-0.00014, 0],
      [-8e-5, 0],
      [-0.00014, 0],
      [-0.00014, 0],
      [-7e-5, 0],
      [-2e-5, 2],
      [-0.00011, 0],
      [-4e-5, 0],
      [-3e-5, 2],
      [-9e-5, 0],
      [-1e-5, 2],
      [-0.00014, 0],
      [-0.00014, 0],
      [-2e-5, 2],
      [-2e-5, 2],
      [-2e-5, 2],
      [-0.00014, 0],
      [-1e-5, 2],
      [1e-5, 2],
      [-2e-5, 2],
      [-4e-5, 0],
      [-0.00011, 0],
      [-0.0, 2],
      [0.00032, 1],
      [-3e-5, 2],
      [-9e-5, 0],
      [-1e-5, 2]
    ],
    "red_o_points": [],
    "y_categories": ["N", "NOT APPLICABLE", "nan"],
    "blue_o_points": [],
    "blue_x_points": [
      [0.00023, 1],
      [-1e-5, 2],
      [-9e-5, 0],
      [-8e-5, 0],
      [-0.0, 2],
      [0.00045, 1],
      [0.00032, 1],
      [-7e-5, 0],
      [-2e-5, 2],
      [-1e-5, 2],
      [-7e-5, 0],
      [0.00043, 1],
      [-2e-5, 2],
      [0.0004, 1],
      [-2e-5, 2]
    ]
  },
  "QA_lstPexMuscstrength[WristFlex]": {
    "red_x_points": [
      [-0.0024, 1],
      [-0.00145, 2],
      [-0.00245, 1],
      [0.00089, 0],
      [-0.00327, 1],
      [0.00088, 0],
      [-0.0026, 1],
      [-0.00113, 0],
      [0.00209, 0],
      [0.00056, 0],
      [-0.00221, 0],
      [0.00117, 0],
      [-0.00161, 2],
      [-0.0027, 2],
      [-0.00073, 2],
      [-0.0059, 0],
      [-0.00021, 1],
      [-0.00911, 0],
      [-0.00244, 1],
      [-0.00462, 0],
      [-0.00184, 2],
      [-0.00122, 0],
      [0.00112, 0],
      [0.0011, 0],
      [-0.00221, 2],
      [-0.00086, 2],
      [-0.00196, 1],
      [-0.00172, 1],
      [-0.00234, 2]
    ],
    "red_o_points": [],
    "y_categories": ["GREATER THAN OR EQUALS TO 3", "LESS THAN 3", "nan"],
    "blue_o_points": [],
    "blue_x_points": [
      [0.00056, 0],
      [0.00234, 0],
      [0.00183, 0],
      [0.00237, 0],
      [0.0025, 2],
      [1e-5, 2],
      [0.0, 0],
      [0.00177, 0],
      [0.0036, 0],
      [0.00167, 2],
      [0.00193, 0],
      [0.00038, 0],
      [0.01357, 1],
      [0.00034, 0],
      [0.01431, 1]
    ]
  },
  "QS_mulNeuromadSite[C5]": {
    "red_x_points": [
      [-4e-5, 2],
      [-0.00093, 0],
      [-0.00056, 0],
      [-0.00058, 0],
      [-0.00062, 0],
      [-0.00057, 0],
      [-0.00056, 0],
      [-0.00015, 2],
      [-0.00055, 0],
      [-0.00055, 0],
      [-3e-5, 2],
      [-0.00065, 0],
      [-0.00016, 2],
      [-0.001, 0],
      [-0.0005, 0],
      [-0.0002, 2],
      [-0.00011, 2],
      [-0.00021, 2],
      [-0.00043, 0],
      [-0.00011, 2],
      [-0.00017, 2],
      [-5e-5, 2],
      [-0.00063, 0],
      [-0.00049, 0],
      [-0.00014, 2],
      [0.00198, 1],
      [-0.00027, 2],
      [-0.00051, 0],
      [-0.00016, 2]
    ],
    "red_o_points": [],
    "y_categories": ["N", "NOT APPLICABLE", "nan"],
    "blue_o_points": [],
    "blue_x_points": [
      [0.0033, 1],
      [-0.0001, 2],
      [-0.00043, 0],
      [-0.00051, 0],
      [-0.00012, 2],
      [0.00229, 1],
      [0.00145, 1],
      [-0.00049, 0],
      [-8e-5, 2],
      [-0.0001, 2],
      [-0.00026, 0],
      [0.00218, 1],
      [-0.00017, 2],
      [0.00206, 1],
      [-5e-5, 2]
    ]
  },
  "QS_mulNeuromadSite[C7]": {
    "red_x_points": [
      [-7e-5, 2],
      [-0.00102, 0],
      [-0.00074, 0],
      [-0.00063, 0],
      [-0.0008, 0],
      [-0.0006, 0],
      [-0.00075, 0],
      [-0.00016, 2],
      [-0.00073, 0],
      [-0.00063, 0],
      [-0.00012, 2],
      [-0.00079, 0],
      [-0.00018, 2],
      [-0.00096, 0],
      [-0.00084, 0],
      [-0.00015, 2],
      [-0.0001, 2],
      [-0.00017, 2],
      [-0.00076, 0],
      [-0.00014, 2],
      [-0.00013, 2],
      [-6e-5, 2],
      [-0.00077, 0],
      [-0.00088, 0],
      [-0.00014, 2],
      [0.00161, 1],
      [-0.00014, 2],
      [-0.00071, 0],
      [-9e-5, 2]
    ],
    "red_o_points": [],
    "y_categories": ["N", "NOT APPLICABLE", "nan"],
    "blue_o_points": [],
    "blue_x_points": [
      [0.00365, 1],
      [3e-5, 2],
      [-0.00034, 0],
      [-0.00045, 0],
      [2e-5, 2],
      [0.00284, 1],
      [0.00225, 1],
      [-0.00052, 0],
      [-0.00012, 2],
      [-6e-5, 2],
      [-0.00037, 0],
      [0.00269, 1],
      [-0.00021, 2],
      [0.00232, 1],
      [-8e-5, 2]
    ]
  },
  "QS_mulLysisRoot[C5]": {
    "red_x_points": [
      [-0.00026, 3],
      [-0.0033, 0],
      [-0.0075, 2],
      [-0.00191, 0],
      [-0.00224, 0],
      [-0.00202, 0],
      [-0.00235, 0],
      [-0.00056, 3],
      [-0.00238, 0],
      [-0.00244, 0],
      [-0.00031, 3],
      [-0.00252, 0],
      [-0.0007, 3],
      [-0.00314, 0],
      [-0.00308, 0],
      [-0.00063, 3],
      [-0.00035, 3],
      [-0.00057, 3],
      [-0.00209, 0],
      [-0.00035, 3],
      [-0.00049, 3],
      [-0.00058, 3],
      [-0.00242, 0],
      [-0.00236, 0],
      [-0.00063, 3],
      [0.00802, 1],
      [-0.0006, 3],
      [-0.0072, 2],
      [-0.00063, 3]
    ],
    "red_o_points": [],
    "y_categories": ["N", "NOT APPLICABLE", "Y", "nan"],
    "blue_o_points": [],
    "blue_x_points": [
      [0.01399, 1],
      [-0.00013, 3],
      [-0.00131, 0],
      [-0.00129, 0],
      [0.0001, 3],
      [0.01175, 1],
      [0.0083, 1],
      [-0.00174, 0],
      [1e-5, 3],
      [-0.00021, 3],
      [-0.00128, 0],
      [0.00834, 1],
      [-0.0001, 3],
      [0.00956, 1],
      [-0.00039, 3]
    ]
  },
  "QS_mulTransfSite[IMc]": {
    "red_x_points": [
      [-0.00096, 3],
      [-0.01642, 2],
      [-0.00225, 0],
      [-0.01446, 2],
      [-0.00216, 0],
      [-0.00235, 0],
      [-0.00243, 0],
      [-0.00136, 3],
      [-0.00255, 0],
      [-0.00223, 0],
      [-0.00106, 3],
      [-0.00261, 0],
      [-0.00139, 3],
      [-0.00346, 0],
      [-0.01565, 2],
      [-0.00115, 3],
      [-0.00096, 3],
      [-0.00093, 3],
      [-0.00251, 0],
      [-0.00094, 3],
      [-0.00129, 3],
      [-0.00137, 3],
      [-0.00242, 0],
      [-0.01639, 2],
      [-0.00143, 3],
      [0.01747, 1],
      [-0.00128, 3],
      [-0.01538, 2],
      [-0.00148, 3]
    ],
    "red_o_points": [],
    "y_categories": ["N", "NOT APPLICABLE", "Y", "nan"],
    "blue_o_points": [],
    "blue_x_points": [
      [0.02645, 1],
      [-0.00101, 3],
      [-0.00085, 0],
      [-0.00018, 0],
      [-0.00051, 3],
      [0.02348, 1],
      [0.01798, 1],
      [-0.00148, 0],
      [-0.00084, 3],
      [-0.00058, 3],
      [-0.0006, 0],
      [0.02107, 1],
      [-0.0007, 3],
      [0.02002, 1],
      [-0.00084, 3]
    ]
  },
  "QA_intPexForearmSupin": {
    "red_x_points": [
      [-0.00078, 2],
      [-0.0033, 0],
      [-0.0008, 2],
      [-0.0006, 2],
      [-0.001, 2],
      [0.00356, 1],
      [-0.00097, 2],
      [0.00199, 1],
      [-0.00132, 2],
      [-0.00121, 2],
      [-0.00644, 0],
      [-0.00575, 0],
      [-0.00051, 2],
      [-0.00122, 2],
      [-0.00035, 2],
      [0.00374, 1],
      [-0.00637, 0],
      [0.00114, 1],
      [0.00129, 1],
      [-0.00063, 2],
      [-0.00051, 2],
      [-0.00057, 2],
      [-0.0014, 2],
      [-0.00141, 2],
      [3e-5, 2],
      [-0.02146, 1],
      [-0.00011, 2],
      [-0.00254, 0],
      [-0.00054, 2]
    ],
    "red_o_points": [],
    "y_categories": ["GREATER THAN OR EQUALS TO 80", "LESS THAN 80", "nan"],
    "blue_o_points": [],
    "blue_x_points": [
      [0.00342, 2],
      [0.00561, 1],
      [0.00857, 1],
      [-0.00085, 2],
      [9e-5, 2],
      [0.00426, 2],
      [0.00523, 0],
      [-0.00047, 2],
      [-9e-5, 2],
      [0.00019, 2],
      [0.00774, 1],
      [0.00385, 2],
      [0.0004, 2],
      [0.00434, 2],
      [0.00579, 1]
    ]
  },
  "QS_mulGraftNerve[SS]": {
    "red_x_points": [
      [-2e-5, 2],
      [-0.00016, 0],
      [-0.00011, 0],
      [-0.00011, 0],
      [-6e-5, 0],
      [-8e-5, 0],
      [-0.00011, 0],
      [-1e-5, 2],
      [-8e-5, 0],
      [-8e-5, 0],
      [-1e-5, 2],
      [-6e-5, 0],
      [-4e-5, 2],
      [-8e-5, 0],
      [-0.00018, 0],
      [-1e-5, 2],
      [-2e-5, 2],
      [-2e-5, 2],
      [-8e-5, 0],
      [-2e-5, 2],
      [-3e-5, 2],
      [-2e-5, 2],
      [-3e-5, 0],
      [-5e-5, 0],
      [-3e-5, 2],
      [0.00018, 1],
      [-2e-5, 2],
      [-8e-5, 0],
      [-2e-5, 2]
    ],
    "red_o_points": [],
    "y_categories": ["N", "NOT APPLICABLE", "nan"],
    "blue_o_points": [],
    "blue_x_points": [
      [0.00023, 1],
      [-2e-5, 2],
      [-5e-5, 0],
      [-0.00011, 0],
      [8e-5, 2],
      [0.00041, 1],
      [0.00031, 1],
      [-8e-5, 0],
      [-3e-5, 2],
      [-1e-5, 2],
      [-5e-5, 0],
      [0.00036, 1],
      [-2e-5, 2],
      [0.00044, 1],
      [-1e-5, 2]
    ]
  },
  "QS_mulGraftNerve[MCF]": {
    "red_x_points": [
      [-4e-5, 0],
      [-4e-5, 0],
      [-4e-5, 0],
      [-4e-5, 0],
      [1e-5, 2],
      [-4e-5, 0],
      [-4e-5, 0],
      [1e-5, 2],
      [-4e-5, 0],
      [-4e-5, 0],
      [-4e-5, 0],
      [1e-5, 2],
      [-4e-5, 0],
      [1e-5, 2],
      [1e-5, 2],
      [1e-5, 2],
      [-4e-5, 0],
      [-4e-5, 0],
      [1e-5, 2],
      [9e-5, 1],
      [1e-5, 2],
      [-4e-5, 0],
      [1e-5, 2]
    ],
    "red_o_points": [],
    "y_categories": ["N", "NOT APPLICABLE", "nan"],
    "blue_o_points": [],
    "blue_x_points": [
      [9e-5, 1],
      [1e-5, 2],
      [-4e-5, 0],
      [1e-5, 2],
      [9e-5, 1],
      [1e-5, 2],
      [1e-5, 2],
      [-4e-5, 0],
      [9e-5, 1],
      [1e-5, 2],
      [9e-5, 1],
      [1e-5, 2]
    ]
  },
  "QA_lstPexArthre[Index]": {
    "red_x_points": [
      [-0.01043, 0],
      [-0.00501, 2],
      [-0.00303, 2],
      [-0.00604, 0],
      [-0.00831, 0],
      [0.0069, 1],
      [-0.0072, 0],
      [0.00018, 2],
      [0.00856, 1],
      [-0.01128, 0],
      [0.0028, 1],
      [-0.00636, 2],
      [4e-5, 2],
      [0.00752, 1],
      [-0.00303, 2],
      [0.00302, 1],
      [-0.00828, 0],
      [0.00226, 1],
      [-0.0043, 2],
      [-0.01059, 0],
      [0.00028, 2],
      [0.00032, 2],
      [-0.00667, 2],
      [-0.00546, 2],
      [0.0023, 1],
      [-0.00063, 2],
      [0.00023, 2],
      [-0.00493, 0],
      [0.0004, 2]
    ],
    "red_o_points": [],
    "y_categories": ["NPV", "PV", "nan"],
    "blue_o_points": [],
    "blue_x_points": [
      [0.00046, 0],
      [0.00111, 2],
      [0.01206, 1],
      [0.0137, 1],
      [0.00205, 2],
      [-0.0002, 2],
      [0.0015, 1],
      [0.01092, 1],
      [0.00144, 2],
      [0.00112, 2],
      [0.01103, 1],
      [0.00158, 1],
      [0.00405, 1],
      [-0.00022, 2],
      [0.00616, 1]
    ]
  },
  "QS_mulLysisRoot[C7]": {
    "red_x_points": [
      [-3e-5, 3],
      [-0.00118, 0],
      [-0.00391, 2],
      [-0.00084, 0],
      [-0.00099, 0],
      [-0.00087, 0],
      [-0.00096, 0],
      [-0.00022, 3],
      [-0.00087, 0],
      [-0.00088, 0],
      [-0.00014, 3],
      [-0.00099, 0],
      [-0.00022, 3],
      [-0.00101, 0],
      [-0.00102, 0],
      [-0.00021, 3],
      [-8e-5, 3],
      [-0.00017, 3],
      [-0.00078, 0],
      [-0.00014, 3],
      [-0.00026, 3],
      [-0.00013, 3],
      [-0.00104, 0],
      [-0.00095, 0],
      [-0.00015, 3],
      [0.00272, 1],
      [-0.00016, 3],
      [-0.00081, 0],
      [-0.00013, 3]
    ],
    "red_o_points": [],
    "y_categories": ["N", "NOT APPLICABLE", "Y", "nan"],
    "blue_o_points": [],
    "blue_x_points": [
      [0.00517, 1],
      [-3e-5, 3],
      [4e-5, 0],
      [-0.00052, 0],
      [-5e-5, 3],
      [0.0036, 1],
      [0.00253, 1],
      [-0.00072, 0],
      [-0.0, 3],
      [-1e-5, 3],
      [-0.00014, 0],
      [0.00341, 1],
      [-0.00015, 3],
      [0.00334, 1],
      [-3e-5, 3]
    ]
  },
  "QS_mulGraftLevel[other]": {
    "red_x_points": [
      [1e-5, 2],
      [-4e-5, 0],
      [-4e-5, 0],
      [-4e-5, 0],
      [-4e-5, 0],
      [-4e-5, 0],
      [1e-5, 2],
      [-4e-5, 0],
      [1e-5, 2],
      [-4e-5, 0],
      [-4e-5, 0],
      [-4e-5, 0],
      [1e-5, 2],
      [1e-5, 2],
      [1e-5, 2],
      [-4e-5, 0],
      [1e-5, 2],
      [-4e-5, 0],
      [-4e-5, 0],
      [1e-5, 2],
      [9e-5, 1],
      [1e-5, 2],
      [1e-5, 2]
    ],
    "red_o_points": [],
    "y_categories": ["N", "NOT APPLICABLE", "nan"],
    "blue_o_points": [],
    "blue_x_points": [
      [9e-5, 1],
      [1e-5, 2],
      [-4e-5, 0],
      [1e-5, 2],
      [9e-5, 1],
      [9e-5, 1],
      [-4e-5, 0],
      [1e-5, 2],
      [1e-5, 2],
      [1e-5, 2],
      [9e-5, 1],
      [1e-5, 2]
    ]
  },
  "QS_lstBpsurgSide": {
    "red_x_points": [
      [-0.00088, 3],
      [-0.0111, 0],
      [-0.01173, 0],
      [-0.00961, 0],
      [-0.01157, 0],
      [-0.01111, 0],
      [-0.01211, 0],
      [-0.00112, 3],
      [-0.01322, 0],
      [0.00115, 2],
      [-0.00114, 3],
      [6e-5, 2],
      [-0.00134, 3],
      [0.00049, 2],
      [-0.00197, 2],
      [-0.00119, 3],
      [-0.00086, 3],
      [-0.00091, 3],
      [-0.00823, 0],
      [-0.00101, 3],
      [-0.00139, 3],
      [-0.00119, 3],
      [0.00036, 2],
      [0.00082, 2],
      [-0.00133, 3],
      [0.01323, 1],
      [-0.00111, 3],
      [-0.00938, 0],
      [-0.00112, 3]
    ],
    "red_o_points": [],
    "y_categories": ["L", "NOT APPLICABLE", "R", "nan"],
    "blue_o_points": [],
    "blue_x_points": [
      [0.02683, 1],
      [-0.00063, 3],
      [0.00354, 2],
      [0.00604, 2],
      [-0.00026, 3],
      [0.01782, 1],
      [0.0139, 1],
      [-0.00293, 0],
      [-0.00073, 3],
      [-0.00035, 3],
      [0.00361, 2],
      [0.01687, 1],
      [-0.00047, 3],
      [0.0162, 1],
      [-0.00091, 3]
    ]
  },
  "QS_mulLysisRoot[C6]": {
    "red_x_points": [
      [-0.00058, 3],
      [-0.00468, 0],
      [-0.0119, 2],
      [-0.00281, 0],
      [-0.00352, 0],
      [-0.00308, 0],
      [-0.00321, 0],
      [-0.00087, 3],
      [-0.00354, 0],
      [-0.00291, 0],
      [-0.00088, 3],
      [-0.00354, 0],
      [-0.00079, 3],
      [-0.00449, 0],
      [-0.00441, 0],
      [-0.00081, 3],
      [-0.00044, 3],
      [-0.00058, 3],
      [-0.00323, 0],
      [-0.00054, 3],
      [-0.00088, 3],
      [-0.00083, 3],
      [-0.00354, 0],
      [-0.00341, 0],
      [-0.00088, 3],
      [0.01089, 1],
      [-0.00076, 3],
      [-0.00898, 2],
      [-0.00091, 3]
    ],
    "red_o_points": [],
    "y_categories": ["N", "NOT APPLICABLE", "Y", "nan"],
    "blue_o_points": [],
    "blue_x_points": [
      [0.02021, 1],
      [-0.0004, 3],
      [-0.00165, 0],
      [-0.00146, 0],
      [0.00025, 3],
      [0.01512, 1],
      [0.01187, 1],
      [-0.00263, 0],
      [-0.00048, 3],
      [-0.00016, 3],
      [-0.00173, 0],
      [0.01387, 1],
      [-0.00047, 3],
      [0.01436, 1],
      [-0.00056, 3]
    ]
  },
  "QS_mulTransfSite[AcMc]": {
    "red_x_points": [
      [-0.00019, 3],
      [-0.00175, 0],
      [-0.0012, 0],
      [-0.00129, 0],
      [-0.00138, 0],
      [-0.00111, 0],
      [-0.00127, 0],
      [-0.00046, 3],
      [-0.00143, 0],
      [-0.00917, 2],
      [-0.0003, 3],
      [-0.00105, 0],
      [-0.00032, 3],
      [-0.0019, 0],
      [-0.00185, 0],
      [-0.00057, 3],
      [-0.0002, 3],
      [-0.00036, 3],
      [-0.00124, 0],
      [-0.00044, 3],
      [-0.0004, 3],
      [-0.00048, 3],
      [-0.001, 0],
      [-0.00121, 0],
      [-0.00019, 3],
      [0.00349, 1],
      [-0.00027, 3],
      [-0.00122, 0],
      [-0.00029, 3]
    ],
    "red_o_points": [],
    "y_categories": ["N", "NOT APPLICABLE", "Y", "nan"],
    "blue_o_points": [],
    "blue_x_points": [
      [0.00737, 1],
      [-0.00027, 3],
      [0.00123, 0],
      [0.0007, 0],
      [5e-5, 3],
      [0.00571, 1],
      [0.00451, 1],
      [-0.00053, 0],
      [3e-5, 3],
      [-1e-5, 3],
      [0.00031, 0],
      [0.00553, 1],
      [-0.00018, 3],
      [0.00491, 1],
      [-0.00031, 3]
    ]
  },
  "QS_mulTransfSite[Other]": {
    "red_x_points": [
      [-0.00108, 3],
      [-0.00937, 0],
      [-0.00802, 0],
      [-0.00798, 0],
      [-0.0084, 0],
      [-0.00816, 0],
      [-0.00814, 0],
      [-0.00128, 3],
      [-0.00829, 0],
      [-0.00791, 0],
      [-0.00093, 3],
      [-0.00805, 0],
      [-0.00136, 3],
      [-0.00916, 0],
      [-0.00803, 0],
      [-0.00112, 3],
      [-0.00096, 3],
      [-0.00111, 3],
      [-0.00699, 0],
      [-0.00101, 3],
      [-0.00152, 3],
      [-0.0013, 3],
      [-0.00795, 0],
      [-0.0078, 0],
      [-0.00134, 3],
      [0.0177, 1],
      [-0.00118, 3],
      [-0.00723, 0],
      [-0.00138, 3]
    ],
    "red_o_points": [],
    "y_categories": ["N", "NOT APPLICABLE", "Y", "nan"],
    "blue_o_points": [],
    "blue_x_points": [
      [0.02804, 1],
      [-0.00081, 3],
      [-0.00613, 0],
      [-0.0072, 0],
      [-0.00053, 3],
      [0.02163, 1],
      [0.01849, 1],
      [-0.00662, 0],
      [-0.00087, 3],
      [-0.00064, 3],
      [0.03704, 2],
      [0.01987, 1],
      [-0.00088, 3],
      [0.01885, 1],
      [-0.00086, 3]
    ]
  },
  "QA_yonInjBpsurg": {
    "red_x_points": [
      [-0.00056, 1],
      [-0.00047, 1],
      [-0.00064, 1],
      [-0.00067, 1],
      [-0.00075, 1],
      [-0.00053, 1],
      [-0.00071, 1],
      [-0.00078, 1],
      [-0.00079, 1],
      [-0.00035, 1],
      [-0.0006, 1],
      [-0.00044, 1],
      [-0.00088, 1],
      [-0.0007, 1],
      [-0.00056, 1],
      [-0.00054, 1],
      [-0.00042, 1],
      [-0.00059, 1],
      [-0.00035, 1],
      [-0.00045, 1],
      [-0.00116, 1],
      [-0.00075, 1],
      [-0.00043, 1],
      [-0.00057, 1],
      [-0.00079, 1],
      [0.00208, 0],
      [-0.00074, 1],
      [-0.00041, 1],
      [-0.00092, 1]
    ],
    "red_o_points": [],
    "y_categories": ["N", "Y", "nan"],
    "blue_o_points": [],
    "blue_x_points": [
      [0.00506, 0],
      [-0.00053, 1],
      [-0.00053, 1],
      [-0.00082, 1],
      [-0.00042, 1],
      [0.00376, 0],
      [0.00324, 0],
      [-0.00047, 1],
      [-0.00049, 1],
      [-0.00032, 1],
      [-0.00048, 1],
      [0.00415, 0],
      [-0.00037, 1],
      [0.004, 0],
      [-0.00028, 1]
    ]
  },
  "QA_lstPexTouch[C8]": {
    "red_x_points": [
      [-0.00204, 1],
      [-0.00446, 2],
      [-0.00209, 1],
      [-0.00182, 1],
      [-0.00573, 2],
      [-0.00442, 1],
      [-0.00277, 1],
      [-0.00263, 0],
      [-0.00681, 1],
      [0.00942, 0],
      [-0.00187, 1],
      [-0.00856, 2],
      [-0.00226, 2],
      [-0.00777, 2],
      [-0.00323, 2],
      [-0.0021, 0],
      [-0.00182, 1],
      [-0.0017, 0],
      [-0.0038, 2],
      [-0.00281, 0],
      [-0.00248, 2],
      [-0.00508, 0],
      [-0.00535, 1],
      [-0.00927, 2],
      [-0.00337, 0],
      [-0.00704, 1],
      [-0.00083, 2],
      [-0.00221, 1],
      [-0.0011, 1]
    ],
    "red_o_points": [],
    "y_categories": ["NORM", "NPV", "nan"],
    "blue_o_points": [],
    "blue_x_points": [
      [0.00543, 0],
      [0.00662, 1],
      [0.01878, 0],
      [0.02395, 0],
      [0.00497, 2],
      [0.00156, 2],
      [-8e-5, 1],
      [-0.0012, 1],
      [0.00871, 1],
      [0.00516, 2],
      [0.01596, 0],
      [-0.00021, 1],
      [-0.0001, 0],
      [0.00253, 0],
      [0.00393, 0]
    ]
  },
  "QS_mulNeuromadSite[T1]": {
    "red_x_points": [
      [-0.00013, 2],
      [-0.00063, 0],
      [-0.00045, 0],
      [-0.00031, 0],
      [-0.00048, 0],
      [-0.00041, 0],
      [-0.0005, 0],
      [-8e-5, 2],
      [-0.0006, 0],
      [-0.00047, 0],
      [-9e-5, 2],
      [-0.0006, 0],
      [-9e-5, 2],
      [-0.00087, 0],
      [-0.00096, 0],
      [-0.0001, 2],
      [-5e-5, 2],
      [-4e-5, 2],
      [-0.00044, 0],
      [-0.00011, 2],
      [-7e-5, 2],
      [-7e-5, 2],
      [-0.00066, 0],
      [-0.00062, 0],
      [-6e-5, 2],
      [0.00099, 1],
      [-0.00012, 2],
      [-0.00037, 0],
      [-8e-5, 2]
    ],
    "red_o_points": [],
    "y_categories": ["N", "NOT APPLICABLE", "nan"],
    "blue_o_points": [],
    "blue_x_points": [
      [0.00303, 1],
      [-6e-5, 2],
      [-0.00018, 0],
      [-0.00024, 0],
      [0.00014, 2],
      [0.0018, 1],
      [0.00098, 1],
      [-0.0004, 0],
      [7e-5, 2],
      [8e-5, 2],
      [-0.00029, 0],
      [0.00194, 1],
      [-4e-5, 2],
      [0.00171, 1],
      [-6e-5, 2]
    ]
  },
  "QS_mulBpsurgeryType[Graft]": {
    "red_x_points": [
      [-0.00013, 3],
      [-0.00098, 0],
      [-0.00106, 0],
      [-0.00088, 0],
      [-0.00113, 0],
      [-0.00067, 0],
      [-0.00109, 0],
      [-0.00022, 3],
      [-0.00095, 0],
      [-0.00091, 0],
      [-0.00013, 3],
      [-0.00102, 0],
      [-0.00018, 3],
      [-0.00544, 2],
      [-0.0011, 0],
      [-0.00026, 3],
      [-0.00014, 3],
      [-0.00011, 3],
      [-0.00079, 0],
      [-0.00026, 3],
      [-0.00023, 3],
      [-0.00013, 3],
      [-0.00095, 0],
      [-0.00094, 0],
      [-0.00019, 3],
      [0.00286, 1],
      [-0.00016, 3],
      [-0.00083, 0],
      [-0.00025, 3]
    ],
    "red_o_points": [],
    "y_categories": ["N", "NOT APPLICABLE", "Y", "nan"],
    "blue_o_points": [],
    "blue_x_points": [
      [0.00532, 1],
      [-8e-5, 3],
      [-0.00048, 0],
      [-0.00013, 0],
      [1e-5, 3],
      [0.00366, 1],
      [0.00296, 1],
      [-0.00041, 0],
      [-2e-5, 3],
      [-0.0, 3],
      [-0.00027, 0],
      [0.00382, 1],
      [-0.00012, 3],
      [0.00406, 1],
      [-7e-5, 3]
    ]
  },
  "QA_lstPexMuscstrength[WristExte]": {
    "red_x_points": [
      [-0.0066, 1],
      [-0.00448, 2],
      [-0.00494, 1],
      [-0.00456, 1],
      [-0.00709, 1],
      [-0.00598, 1],
      [-0.00555, 1],
      [0.00018, 0],
      [0.00618, 0],
      [-0.00854, 1],
      [0.00033, 0],
      [0.0052, 0],
      [-0.00208, 2],
      [-0.00724, 2],
      [-0.00239, 2],
      [-0.00133, 0],
      [-0.00253, 1],
      [-0.00118, 0],
      [-0.00532, 1],
      [-0.00682, 1],
      [-0.00251, 2],
      [-0.0067, 1],
      [0.0053, 0],
      [0.00539, 0],
      [-0.00186, 2],
      [-0.00142, 2],
      [-0.00446, 1],
      [-0.00301, 1],
      [-0.00261, 2]
    ],
    "red_o_points": [],
    "y_categories": ["GREATER THAN OR EQUALS TO 3", "LESS THAN 3", "nan"],
    "blue_o_points": [],
    "blue_x_points": [
      [0.0041, 0],
      [0.00261, 1],
      [0.00933, 0],
      [0.01097, 0],
      [0.00241, 2],
      [-0.00027, 2],
      [0.00097, 0],
      [0.00844, 0],
      [0.01531, 0],
      [0.0015, 2],
      [0.00765, 0],
      [-0.00031, 1],
      [0.00853, 0],
      [0.00214, 0],
      [0.00324, 1]
    ]
  },
  "QS_mulNeuromadSite[C6]": {
    "red_x_points": [
      [-5e-5, 2],
      [-0.00075, 0],
      [-0.00055, 0],
      [-0.00047, 0],
      [-0.0005, 0],
      [-0.00037, 0],
      [-0.00051, 0],
      [-2e-5, 2],
      [-0.0005, 0],
      [-0.00042, 0],
      [-5e-5, 2],
      [-0.00059, 0],
      [-0.00014, 2],
      [-0.00059, 0],
      [-0.00058, 0],
      [-8e-5, 2],
      [-6e-5, 2],
      [-6e-5, 2],
      [-0.00038, 0],
      [-6e-5, 2],
      [-2e-5, 2],
      [-2e-5, 2],
      [-0.0005, 0],
      [-0.00052, 0],
      [-6e-5, 2],
      [0.0014, 1],
      [-4e-5, 2],
      [-0.00035, 0],
      [-6e-5, 2]
    ],
    "red_o_points": [],
    "y_categories": ["N", "NOT APPLICABLE", "nan"],
    "blue_o_points": [],
    "blue_x_points": [
      [0.00208, 1],
      [-4e-5, 2],
      [-0.00034, 0],
      [-0.00029, 0],
      [-1e-5, 2],
      [0.00187, 1],
      [0.00121, 1],
      [-0.00051, 0],
      [-2e-5, 2],
      [3e-5, 2],
      [-0.00034, 0],
      [0.00153, 1],
      [7e-5, 2],
      [0.00169, 1],
      [-3e-5, 2]
    ]
  },
  "QA_lstPexPalle[Clavicle]": {
    "red_x_points": [
      [-0.00019, 3],
      [-0.00121, 3],
      [-0.00074, 3],
      [0.00139, 2],
      [-0.00132, 3],
      [0.00203, 2],
      [-0.0013, 3],
      [-4e-5, 3],
      [-0.00235, 3],
      [0.00304, 2],
      [-0.01209, 0],
      [-0.00202, 3],
      [-0.00027, 3],
      [-0.002, 3],
      [-0.00084, 3],
      [-0.0146, 0],
      [-0.01243, 0],
      [0.00991, 2],
      [-0.00307, 1],
      [-0.01546, 1],
      [-0.00024, 3],
      [-0.00028, 3],
      [-0.00204, 3],
      [-0.00217, 3],
      [3e-5, 3],
      [-0.02362, 2],
      [7e-5, 3],
      [-0.00153, 0],
      [-0.00013, 3]
    ],
    "red_o_points": [],
    "y_categories": ["HYPO", "NAIA", "PT", "nan"],
    "blue_o_points": [],
    "blue_x_points": [
      [0.00486, 3],
      [0.00029, 3],
      [0.0055, 2],
      [0.0063, 2],
      [0.00062, 3],
      [0.00408, 3],
      [0.00609, 0],
      [-0.00119, 3],
      [0.00083, 3],
      [0.00061, 3],
      [0.00881, 0],
      [0.00437, 3],
      [0.01736, 2],
      [0.00476, 3],
      [0.0202, 2]
    ]
  },
  "QS_mulGraftNerve[LT]": {
    "red_x_points": [
      [-1e-5, 2],
      [-3e-5, 0],
      [-0.0001, 0],
      [-9e-5, 0],
      [-7e-5, 0],
      [-3e-5, 0],
      [-0.00013, 0],
      [-4e-5, 2],
      [-0.0001, 0],
      [-6e-5, 0],
      [-1e-5, 2],
      [-6e-5, 0],
      [-3e-5, 2],
      [-0.00013, 0],
      [-3e-5, 0],
      [-1e-5, 2],
      [-1e-5, 2],
      [-1e-5, 2],
      [-3e-5, 0],
      [-1e-5, 2],
      [-0.0, 2],
      [0.0, 2],
      [-3e-5, 0],
      [-6e-5, 0],
      [-1e-5, 2],
      [-1e-5, 2],
      [-6e-5, 0],
      [-3e-5, 2]
    ],
    "red_o_points": [],
    "y_categories": ["N", "NOT APPLICABLE", "nan"],
    "blue_o_points": [],
    "blue_x_points": [
      [0.00059, 1],
      [-1e-5, 2],
      [-6e-5, 0],
      [-3e-5, 0],
      [-1e-5, 2],
      [0.00026, 1],
      [0.00013, 1],
      [-3e-5, 0],
      [-0.0, 2],
      [-0.0, 2],
      [-6e-5, 0],
      [0.00026, 1],
      [-1e-5, 2],
      [0.00013, 1],
      [-1e-5, 2]
    ]
  },
  "QA_lstPexMuscstrength[ShoulderAbduc]": {
    "red_x_points": [
      [-0.00039, 1],
      [-0.00034, 1],
      [-0.00037, 1],
      [-0.00049, 1],
      [-0.00038, 1],
      [-0.00037, 1],
      [-0.00043, 1],
      [-0.00041, 1],
      [-0.00051, 1],
      [-0.00031, 1],
      [-0.0005, 1],
      [-0.00042, 1],
      [0.00042, 2],
      [0.00024, 2],
      [0.00025, 2],
      [-0.00047, 1],
      [-0.00038, 1],
      [-0.00045, 1],
      [-0.00026, 1],
      [0.00038, 2],
      [0.0004, 2],
      [-0.00036, 1],
      [-0.00038, 1],
      [-0.00044, 1],
      [-0.00055, 1],
      [0.00057, 2],
      [-0.0004, 1],
      [-0.00031, 1],
      [0.00042, 2]
    ],
    "red_o_points": [],
    "y_categories": ["GREATER THAN OR EQUALS TO 3", "LESS THAN 3", "nan"],
    "blue_o_points": [],
    "blue_x_points": [
      [0.00036, 2],
      [-0.00033, 1],
      [-0.00043, 1],
      [-0.00043, 1],
      [0.00049, 2],
      [0.00037, 2],
      [0.00293, 0],
      [0.00052, 2],
      [0.00052, 2],
      [0.00054, 2],
      [-0.00046, 1],
      [0.00304, 0],
      [-0.0004, 1],
      [-5e-5, 1],
      [-0.00041, 1]
    ]
  },
  "QA_yonInjPhysio": {
    "red_x_points": [
      [-0.00701, 0],
      [0.00062, 0],
      [0.00024, 0],
      [2e-5, 0],
      [-0.00153, 2],
      [0.00035, 0],
      [0.00034, 0],
      [-0.00603, 0],
      [0.00093, 0],
      [-0.00714, 1],
      [-0.00517, 0],
      [0.00092, 0],
      [-0.00593, 0],
      [-0.00507, 1],
      [-0.00183, 1],
      [0.00262, 1],
      [-0.00542, 0],
      [0.00445, 1],
      [0.00037, 0],
      [-0.00654, 0],
      [0.00333, 1],
      [0.00297, 1],
      [0.00126, 0],
      [-0.00641, 1],
      [-0.00879, 2],
      [-0.01255, 1],
      [-0.00879, 2],
      [0.0002, 0],
      [0.00437, 1]
    ],
    "red_o_points": [],
    "y_categories": ["N", "Y", "nan"],
    "blue_o_points": [],
    "blue_x_points": [
      [0.00531, 0],
      [0.00672, 1],
      [0.0052, 0],
      [0.00621, 0],
      [0.00749, 1],
      [0.00494, 0],
      [0.00279, 0],
      [0.00237, 0],
      [2e-5, 0],
      [0.00612, 1],
      [0.00401, 0],
      [0.00327, 0],
      [0.00566, 1],
      [-0.00272, 1],
      [0.0078, 1]
    ]
  },
  "QA_lstPexTouch[C7]": {
    "red_x_points": [
      [-0.00308, 1],
      [-0.00753, 2],
      [-0.00324, 1],
      [-0.00282, 1],
      [-0.01004, 2],
      [-0.00554, 1],
      [-0.00427, 1],
      [-0.00439, 0],
      [-0.00733, 1],
      [-0.00828, 1],
      [-0.00182, 1],
      [-0.01253, 2],
      [-0.00192, 2],
      [-0.01275, 2],
      [-0.00495, 2],
      [-0.00214, 0],
      [-0.00218, 1],
      [-0.00197, 0],
      [-0.00733, 2],
      [-0.0026, 0],
      [-0.00221, 2],
      [-0.00633, 0],
      [-0.00695, 1],
      [-0.01138, 2],
      [-0.00489, 0],
      [-0.00386, 1],
      [-0.00135, 2],
      [-0.0026, 1],
      [-0.00083, 1]
    ],
    "red_o_points": [],
    "y_categories": ["NORM", "NPV", "nan"],
    "blue_o_points": [],
    "blue_x_points": [
      [-0.00013, 1],
      [0.00785, 1],
      [0.03429, 0],
      [0.03938, 0],
      [0.00763, 2],
      [0.00021, 2],
      [-0.00021, 1],
      [-0.00324, 1],
      [0.01043, 1],
      [0.00754, 2],
      [0.03461, 0],
      [-7e-5, 1],
      [-0.00022, 0],
      [0.0035, 0],
      [0.00551, 0]
    ]
  },
  "QA_lstPexMuscstrength[ShoulderExrot]": {
    "red_x_points": [
      [-0.00015, 1],
      [-0.00049, 2],
      [-0.00102, 0],
      [-0.00046, 2],
      [0.0005, 1],
      [0.00024, 1],
      [-0.00035, 2],
      [-3e-5, 1],
      [0.0006, 1],
      [-0.00098, 2],
      [-0.00019, 1],
      [-0.00096, 2],
      [1e-5, 2],
      [-0.00097, 2],
      [-0.00033, 2],
      [-0.00015, 1],
      [-6e-5, 1],
      [-0.00012, 1],
      [-0.00034, 2],
      [-2e-5, 2],
      [3e-5, 2],
      [0.0, 2],
      [0.00117, 1],
      [-0.0074, 0],
      [4e-5, 2],
      [-2e-5, 2],
      [5e-5, 2],
      [0.00015, 1],
      [2e-5, 2]
    ],
    "red_o_points": [],
    "y_categories": ["GREATER THAN OR EQUALS TO 3", "LESS THAN 3", "nan"],
    "blue_o_points": [],
    "blue_x_points": [
      [0.00021, 2],
      [0.00307, 1],
      [0.00439, 1],
      [0.0006, 0],
      [0.00023, 2],
      [0.0003, 2],
      [0.00177, 1],
      [0.00052, 0],
      [6e-5, 2],
      [0.00012, 2]
    ]
  },
  "QA_intPexShoulderFlex": {
    "red_x_points": [
      [-5e-5, 2],
      [-0.0003, 2],
      [-0.00014, 2],
      [-0.00491, 0],
      [-6e-5, 2],
      [2e-5, 1],
      [-0.00043, 2],
      [-0.00069, 2],
      [-4e-5, 1],
      [0.00079, 1],
      [-0.00019, 2],
      [-8e-5, 2],
      [-2e-5, 1],
      [-4e-5, 1],
      [3e-5, 1],
      [8e-5, 1],
      [-0.00038, 2],
      [-0.00016, 2],
      [5e-5, 1]
    ],
    "red_o_points": [],
    "y_categories": ["GREATER THAN OR EQUALS TO 180", "LESS THAN 180", "nan"],
    "blue_o_points": [],
    "blue_x_points": [
      [8e-5, 1],
      [0.00394, 1],
      [0.0, 2],
      [-0.00024, 2],
      [0.00011, 2],
      [0.00217, 1],
      [0.00044, 1]
    ]
  },
  "QS_mulGraftNerve[IS]": {
    "red_x_points": [
      [0.0, 2],
      [-7e-5, 0],
      [-4e-5, 0],
      [-7e-5, 0],
      [-7e-5, 0],
      [-7e-5, 0],
      [-3e-5, 0],
      [1e-5, 2],
      [-3e-5, 0],
      [-7e-5, 0],
      [0.0, 2],
      [-7e-5, 0],
      [-0.0, 2],
      [-8e-5, 0],
      [-4e-5, 0],
      [0.0, 2],
      [-0.0, 2],
      [0.0, 2],
      [-7e-5, 0],
      [-0.0, 2],
      [1e-5, 2],
      [1e-5, 2],
      [-7e-5, 0],
      [-7e-5, 0],
      [0.0, 2],
      [0.00023, 1],
      [0.0, 2],
      [-4e-5, 0],
      [-5e-5, 2]
    ],
    "red_o_points": [],
    "y_categories": ["N", "NOT APPLICABLE", "nan"],
    "blue_o_points": [],
    "blue_x_points": [
      [0.00023, 1],
      [1e-5, 2],
      [-7e-5, 0],
      [0.0, 2],
      [0.00018, 1],
      [-3e-5, 0],
      [0.0, 2],
      [0.0, 2],
      [-7e-5, 0],
      [0.00018, 1],
      [0.0, 2],
      [0.00018, 1],
      [0.0, 2]
    ]
  },
  "QS_mulGraftNerve[MC]": {
    "red_x_points": [
      [0.0, 2],
      [-4e-5, 0],
      [-0.00011, 0],
      [-4e-5, 0],
      [-0.00011, 0],
      [-2e-5, 0],
      [-7e-5, 0],
      [-1e-5, 2],
      [-0.00011, 0],
      [-1e-5, 2],
      [-4e-5, 0],
      [1e-5, 2],
      [-9e-5, 0],
      [-4e-5, 0],
      [-1e-5, 2],
      [-1e-5, 2],
      [-2e-5, 0],
      [-1e-5, 2],
      [1e-5, 2],
      [1e-5, 2],
      [-0.0001, 0],
      [-1e-5, 2],
      [-1e-5, 2],
      [-2e-5, 0],
      [1e-5, 2]
    ],
    "red_o_points": [],
    "y_categories": ["N", "NOT APPLICABLE", "nan"],
    "blue_o_points": [],
    "blue_x_points": [
      [0.00033, 1],
      [0.0, 2],
      [-2e-5, 0],
      [-4e-5, 0],
      [-1e-5, 2],
      [0.00013, 1],
      [0.00013, 1],
      [-4e-5, 0],
      [1e-5, 2],
      [-1e-5, 2],
      [-2e-5, 0],
      [0.00026, 1],
      [-0.0, 2],
      [0.00012, 1],
      [-1e-5, 2]
    ]
  },
  "QS_mulLysisNerve[Ssr]": {
    "red_x_points": [
      [-0.00052, 3],
      [-0.00332, 0],
      [-0.0097, 2],
      [-0.00893, 2],
      [-0.00309, 0],
      [-0.00222, 0],
      [-0.00301, 0],
      [-0.00081, 3],
      [-0.00311, 0],
      [-0.00244, 0],
      [-0.00052, 3],
      [-0.00277, 0],
      [-0.00102, 3],
      [-0.00352, 0],
      [-0.00288, 0],
      [-0.00079, 3],
      [-0.00055, 3],
      [-0.00055, 3],
      [-0.00222, 0],
      [-0.00053, 3],
      [-0.00074, 3],
      [-0.00077, 3],
      [-0.00272, 0],
      [-0.00281, 0],
      [-0.00087, 3],
      [0.00772, 1],
      [-0.00088, 3],
      [-0.00205, 0],
      [-0.00095, 3]
    ],
    "red_o_points": [],
    "y_categories": ["N", "NOT APPLICABLE", "Y", "nan"],
    "blue_o_points": [],
    "blue_x_points": [
      [0.01775, 1],
      [-0.00058, 3],
      [-0.00125, 0],
      [-0.00157, 0],
      [-0.00034, 3],
      [0.01321, 1],
      [0.00874, 1],
      [-0.00191, 0],
      [-0.00047, 3],
      [-0.00035, 3],
      [-0.00155, 0],
      [0.01226, 1],
      [-0.00029, 3],
      [0.01315, 1],
      [-0.00023, 3]
    ]
  },
  "QS_mulNeuromadSite[C4]": {
    "red_x_points": [
      [-0.0, 2],
      [-0.00041, 0],
      [-0.00023, 0],
      [-0.00021, 0],
      [-0.00029, 0],
      [-0.00023, 0],
      [-0.00015, 0],
      [-5e-5, 2],
      [-0.00024, 0],
      [-0.00015, 0],
      [-3e-5, 2],
      [-0.0003, 0],
      [-9e-5, 2],
      [-0.00025, 0],
      [-0.00035, 0],
      [-1e-5, 2],
      [-3e-5, 2],
      [-2e-5, 2],
      [-0.00019, 0],
      [-4e-5, 2],
      [-0.00012, 2],
      [-7e-5, 2],
      [-0.00025, 0],
      [-0.00023, 0],
      [-7e-5, 2],
      [0.00037, 1],
      [-6e-5, 2],
      [-0.0002, 0],
      [-0.00013, 2]
    ],
    "red_o_points": [],
    "y_categories": ["N", "NOT APPLICABLE", "nan"],
    "blue_o_points": [],
    "blue_x_points": [
      [0.00128, 1],
      [-5e-5, 2],
      [-0.0001, 0],
      [-0.00016, 0],
      [-1e-5, 2],
      [0.00139, 1],
      [0.00053, 1],
      [-0.0002, 0],
      [-3e-5, 2],
      [-6e-5, 2],
      [-7e-5, 0],
      [0.0007, 1],
      [1e-5, 2],
      [0.00084, 1],
      [-4e-5, 2]
    ]
  },
  "QS_mulGraftNerve[Ra]": {
    "red_x_points": [
      [-2e-5, 2],
      [-0.00023, 0],
      [-0.00013, 0],
      [-2e-5, 0],
      [-0.00013, 0],
      [-2e-5, 0],
      [-0.00011, 0],
      [-8e-5, 2],
      [-9e-5, 0],
      [-4e-5, 0],
      [-5e-5, 2],
      [-0.00025, 0],
      [-0.0, 2],
      [-0.00028, 0],
      [-0.00023, 0],
      [-2e-5, 2],
      [-2e-5, 2],
      [-5e-5, 2],
      [0.0, 2],
      [-4e-5, 2],
      [-2e-5, 2],
      [-0.00014, 0],
      [-0.00011, 0],
      [-5e-5, 2],
      [0.00018, 1],
      [-4e-5, 2],
      [-6e-5, 0],
      [-9e-5, 2]
    ],
    "red_o_points": [],
    "y_categories": ["N", "NOT APPLICABLE", "nan"],
    "blue_o_points": [],
    "blue_x_points": [
      [0.00057, 1],
      [-3e-5, 2],
      [-3e-5, 0],
      [-1e-5, 0],
      [2e-5, 2],
      [0.00074, 1],
      [0.00018, 1],
      [-0.00011, 0],
      [0.0, 2],
      [1e-5, 2],
      [-3e-5, 0],
      [0.00041, 1],
      [-4e-5, 2],
      [0.00045, 1],
      [-2e-5, 2]
    ]
  },
  "QS_mulTransfSite[Oberlin]": {
    "red_x_points": [
      [-0.00165, 3],
      [-0.02274, 0],
      [-0.02309, 0],
      [-0.02108, 0],
      [-0.02147, 0],
      [0.00311, 2],
      [-0.02172, 0],
      [-0.00186, 3],
      [0.0037, 2],
      [0.00349, 2],
      [-0.00145, 3],
      [0.00301, 2],
      [-0.00228, 3],
      [0.00198, 2],
      [-0.02007, 0],
      [-0.00159, 3],
      [-0.00168, 3],
      [-0.00138, 3],
      [-0.01764, 0],
      [-0.00144, 3],
      [-0.00201, 3],
      [-0.00186, 3],
      [0.00326, 2],
      [-0.02238, 0],
      [-0.00152, 3],
      [0.02513, 1],
      [-0.0015, 3],
      [-0.02067, 0],
      [-0.00196, 3]
    ],
    "red_o_points": [],
    "y_categories": ["N", "NOT APPLICABLE", "Y", "nan"],
    "blue_o_points": [],
    "blue_x_points": [
      [0.04035, 1],
      [-0.00142, 3],
      [0.00531, 2],
      [0.00607, 2],
      [-0.00068, 3],
      [0.03118, 1],
      [0.02656, 1],
      [0.00419, 2],
      [-0.00097, 3],
      [-0.00074, 3],
      [0.00543, 2],
      [0.0282, 1],
      [-0.00089, 3],
      [0.028, 1],
      [-0.00127, 3]
    ]
  },
  "QA_intPexForearmProna": {
    "red_x_points": [
      [-0.00079, 2],
      [-0.00098, 0],
      [-0.00057, 2],
      [-0.00012, 2],
      [-0.00055, 2],
      [-0.0016, 0],
      [-0.00044, 2],
      [-0.01684, 0],
      [-0.00042, 2],
      [-0.00058, 2],
      [-0.01586, 0],
      [-0.00201, 0],
      [-0.00063, 2],
      [-0.00041, 2],
      [4e-5, 2],
      [-0.01823, 0],
      [-0.01704, 0],
      [-0.01609, 0],
      [-0.00123, 0],
      [-0.00041, 2],
      [-0.00079, 2],
      [-0.0009, 2],
      [-0.00042, 2],
      [-0.00055, 2],
      [0.00035, 2],
      [0.00068, 1],
      [0.00018, 2],
      [-0.00145, 0],
      [-0.00077, 2]
    ],
    "red_o_points": [],
    "y_categories": ["GREATER THAN OR EQUALS TO 80", "LESS THAN 80", "nan"],
    "blue_o_points": [],
    "blue_x_points": [
      [-0.00028, 2],
      [0.0507, 1],
      [-0.00029, 0],
      [-0.00027, 2],
      [0.00094, 2],
      [4e-5, 2],
      [0.00111, 1],
      [9e-5, 2],
      [5e-5, 2],
      [0.00095, 2],
      [-0.00053, 0],
      [4e-5, 2],
      [0.00091, 2],
      [8e-5, 2],
      [0.04488, 1]
    ]
  },
  "QA_yonInjChesttube": {
    "red_x_points": [
      [-0.00245, 2],
      [-0.00232, 2],
      [0.00195, 0],
      [-0.00135, 2],
      [-0.00267, 2],
      [0.00115, 0],
      [-0.00374, 1],
      [-0.00176, 2],
      [-0.00311, 2],
      [-0.00214, 2],
      [0.00175, 0],
      [0.00222, 0],
      [-0.00407, 2],
      [-0.00239, 2],
      [0.00081, 0],
      [0.00124, 0],
      [0.0013, 0],
      [0.00135, 0],
      [-0.00314, 1],
      [-0.00174, 2],
      [-0.01497, 1],
      [-0.00286, 2],
      [-0.00269, 2],
      [0.00191, 0],
      [-0.00265, 2],
      [-0.00011, 2],
      [-0.00276, 2],
      [0.00025, 0],
      [-0.003, 2]
    ],
    "red_o_points": [],
    "y_categories": ["N", "Y", "nan"],
    "blue_o_points": [],
    "blue_x_points": [
      [0.00014, 1],
      [-0.00077, 2],
      [0.00277, 0],
      [0.00459, 0],
      [-0.00216, 2],
      [-4e-5, 2],
      [0.00012, 0],
      [0.00589, 0],
      [0.01517, 0],
      [0.01359, 0],
      [0.00271, 0],
      [-6e-5, 2],
      [0.00441, 0],
      [-3e-5, 2],
      [-0.00033, 2]
    ]
  },
  "QA_yonPexPain": {
    "red_x_points": [
      [-0.00634, 1],
      [-0.00049, 1],
      [-0.00074, 1],
      [-0.00048, 1],
      [-0.00033, 1],
      [-0.00205, 0],
      [-0.0006, 1],
      [-0.00634, 1],
      [-0.0034, 0],
      [-0.00047, 1],
      [-0.00369, 1],
      [-0.00073, 0],
      [-0.00808, 1],
      [-0.00063, 1],
      [-0.00044, 1],
      [0.00517, 0],
      [-0.00424, 1],
      [0.00519, 0],
      [-0.00042, 1],
      [0.00828, 0],
      [-0.01611, 2],
      [-0.00798, 1],
      [-0.00019, 1],
      [-0.00072, 1],
      [-0.01346, 2],
      [-0.00122, 1],
      [-0.00689, 1],
      [-0.00031, 1],
      [-0.00849, 1]
    ],
    "red_o_points": [],
    "y_categories": ["N", "Y", "nan"],
    "blue_o_points": [],
    "blue_x_points": [
      [-0.0002, 1],
      [0.0197, 0],
      [0.00185, 0],
      [0.00179, 1],
      [-0.00426, 1],
      [0.00048, 2],
      [-2e-5, 1],
      [0.00401, 1],
      [0.02267, 0],
      [0.01904, 0],
      [0.00088, 1],
      [0.00073, 0],
      [0.00999, 0],
      [-0.00014, 1],
      [-0.00035, 1]
    ]
  },
  "QS_mulGraftNerve[FI]": {
    "red_x_points": [
      [-3e-5, 2],
      [-0.00029, 0],
      [-0.00026, 0],
      [-0.0003, 0],
      [-0.00021, 0],
      [-0.00024, 0],
      [-0.00024, 0],
      [-4e-5, 2],
      [-0.00032, 0],
      [-0.00023, 0],
      [-3e-5, 2],
      [-0.00029, 0],
      [-9e-5, 2],
      [-0.00027, 0],
      [-0.00019, 0],
      [-0.0, 2],
      [-1e-5, 2],
      [1e-5, 2],
      [-0.00024, 0],
      [-6e-5, 2],
      [-8e-5, 2],
      [-7e-5, 2],
      [-0.00024, 0],
      [-0.00024, 0],
      [0.0, 2],
      [0.00064, 1],
      [-4e-5, 2],
      [-0.00022, 0],
      [-5e-5, 2]
    ],
    "red_o_points": [],
    "y_categories": ["N", "NOT APPLICABLE", "nan"],
    "blue_o_points": [],
    "blue_x_points": [
      [0.00113, 1],
      [-4e-5, 2],
      [-9e-5, 0],
      [-0.00014, 0],
      [2e-5, 2],
      [0.00114, 1],
      [0.00063, 1],
      [-0.00022, 0],
      [0.0, 2],
      [-2e-5, 2],
      [-0.00017, 0],
      [0.00073, 1],
      [1e-5, 2],
      [0.00068, 1],
      [-2e-5, 2]
    ]
  },
  "QA_lstPexPalle[Ulna]": {
    "red_x_points": [
      [-0.00096, 4],
      [-0.00297, 4],
      [-0.00264, 4],
      [-0.00819, 2],
      [-0.00319, 4],
      [-0.01316, 1],
      [-0.00291, 4],
      [-0.00078, 4],
      [-0.00363, 4],
      [0.01258, 3],
      [-0.01105, 1],
      [-0.00372, 4],
      [-0.00102, 4],
      [-0.00335, 4],
      [-0.00166, 4],
      [0.00555, 3],
      [-0.01049, 0],
      [0.00388, 3],
      [-0.00901, 0],
      [0.00531, 3],
      [-0.00084, 4],
      [-0.00085, 4],
      [-0.00375, 4],
      [-0.00328, 4],
      [-0.00045, 4],
      [0.00313, 3],
      [-0.00056, 4],
      [-0.00836, 0],
      [-0.00103, 4]
    ],
    "red_o_points": [],
    "y_categories": ["ABS", "HYPO", "NAIA", "PT", "nan"],
    "blue_o_points": [],
    "blue_x_points": [
      [-0.00061, 4],
      [-0.00029, 4],
      [0.01743, 3],
      [0.02007, 3],
      [-0.0001, 4],
      [-0.00017, 4],
      [0.00258, 3],
      [-0.00242, 4],
      [-0.00032, 4],
      [5e-5, 4],
      [0.01516, 3],
      [-0.00017, 4],
      [0.00532, 3],
      [-0.00025, 4],
      [0.01112, 3]
    ]
  }
}
