{
  "QA_lstPexPain[C8]": {
    "red_x_points": [
      [-0.00849, 1],
      [-0.00175, 2],
      [-0.00219, 2],
      [-0.00157, 2],
      [-0.00775, 1],
      [-6e-5, 0],
      [-0.00015, 1],
      [-0.00038, 1],
      [0.00661, 0],
      [-0.00061, 0],
      [-0.00012, 0],
      [-0.00066, 0],
      [-0.00866, 1],
      [-0.01036, 2],
      [-0.00497, 2],
      [-0.00266, 2],
      [-0.00435, 2],
      [-0.00186, 2],
      [-0.00449, 2],
      [0.00689, 0],
      [-0.00886, 1],
      [0.00594, 0],
      [-0.00201, 2],
      [-0.00461, 2],
      [0.00553, 0],
      [-0.00514, 2],
      [-0.0037, 2],
      [-0.00199, 2],
      [-0.00593, 1],
      [-0.00977, 1],
      [-0.001, 1],
      [-0.00957, 1]
    ],
    "red_o_points": [],
    "y_categories": ["NORM", "NPV", "nan"],
    "blue_o_points": [],
    "blue_x_points": [
      [0.00701, 0],
      [-0.00111, 2],
      [0.00039, 1],
      [0.00771, 1],
      [0.00331, 0],
      [0.00017, 1],
      [0.00942, 0],
      [0.00368, 0],
      [0.0104, 0],
      [0.01246, 0]
    ]
  },
  "QS_mulLysisTrunk[Upper]": {
    "red_x_points": [
      [-0.0016, 3],
      [-0.00472, 0],
      [-0.00403, 0],
      [-0.0045, 0],
      [-0.00141, 3],
      [-0.00535, 0],
      [-0.01093, 2],
      [-0.00418, 0],
      [-0.00172, 3],
      [-0.00434, 0],
      [-0.00459, 0],
      [-0.00428, 0],
      [-0.00198, 3],
      [0.00938, 1],
      [-0.00153, 3],
      [-0.00455, 0],
      [-0.00138, 3],
      [-0.00861, 2],
      [-0.00192, 3],
      [-0.00188, 3],
      [-0.00112, 3],
      [-0.00161, 3],
      [-0.00439, 0],
      [-0.00112, 3],
      [-0.00274, 3],
      [-0.00118, 3],
      [-0.00463, 0],
      [-0.00379, 0],
      [0.00803, 1],
      [-0.00106, 3],
      [-0.00858, 2],
      [-0.00157, 3]
    ],
    "red_o_points": [],
    "y_categories": ["N", "NOT APPLICABLE", "Y", "nan"],
    "blue_o_points": [],
    "blue_x_points": [
      [0.01541, 1],
      [-0.00041, 3],
      [0.013, 1],
      [0.00143, 0],
      [-0.0017, 0],
      [0.01305, 1],
      [-0.00082, 3],
      [0.0136, 1],
      [-0.00038, 3],
      [0.00037, 3]
    ]
  },
  "QS_mulBpsurgeryType[Transf]": {
    "red_x_points": [
      [-0.00027, 3],
      [-0.00074, 2],
      [-0.00213, 0],
      [-0.00067, 2],
      [-0.00037, 3],
      [-0.00055, 2],
      [-0.00065, 2],
      [-0.00065, 2],
      [-0.00032, 3],
      [-0.00073, 2],
      [-0.00057, 2],
      [-0.0007, 2],
      [-0.00022, 3],
      [0.00151, 1],
      [-0.00026, 3],
      [-0.0007, 2],
      [-0.00023, 3],
      [-0.00064, 2],
      [-0.00016, 3],
      [-0.00044, 3],
      [-0.0002, 3],
      [-0.00032, 3],
      [-0.00061, 2],
      [-0.00033, 3],
      [-0.00015, 3],
      [-0.00035, 3],
      [-0.00074, 2],
      [-0.00064, 2],
      [0.00149, 1],
      [-0.00021, 3],
      [-0.00072, 2],
      [-0.00022, 3]
    ],
    "red_o_points": [],
    "y_categories": ["N", "NOT APPLICABLE", "Y", "nan"],
    "blue_o_points": [],
    "blue_x_points": [
      [0.0026, 1],
      [-0.00014, 3],
      [0.00195, 1],
      [-0.00043, 2],
      [-0.00015, 2],
      [0.00203, 1],
      [-9e-5, 3],
      [0.00238, 1],
      [-0.00015, 3],
      [-6e-5, 3]
    ]
  },
  "QS_equBpsurgTime": {
    "red_x_points": [
      [0.00049, 3],
      [-0.00554, 0],
      [0.00495, 2],
      [-0.00503, 0],
      [0.00052, 3],
      [-0.0092, 0],
      [-0.00573, 1],
      [-0.00597, 1],
      [0.00065, 3],
      [-0.00712, 1],
      [-0.0074, 0],
      [0.0069, 2],
      [0.00061, 3],
      [0.0006, 3],
      [0.00054, 3],
      [-0.00671, 1],
      [0.00064, 3],
      [0.0045, 2],
      [0.00049, 3],
      [0.00058, 3],
      [0.00053, 3],
      [0.00058, 3],
      [-0.00499, 0],
      [0.00067, 3],
      [0.00044, 3],
      [0.00059, 3],
      [-0.0066, 0],
      [-0.00517, 0],
      [0.00064, 3],
      [0.00061, 3],
      [0.00416, 2],
      [0.00057, 3]
    ],
    "red_o_points": [],
    "y_categories": [
      "0 TO 6 MONTHS",
      "13 TO 24 MONTHS",
      "7 TO 12 MONTHS",
      "nan"
    ],
    "blue_o_points": [],
    "blue_x_points": [
      [0.00047, 3],
      [0.00041, 3],
      [0.00051, 3],
      [0.00968, 2],
      [0.01076, 2],
      [0.00036, 3],
      [0.00079, 3],
      [0.00054, 3],
      [0.00075, 3],
      [0.0006, 3]
    ]
  },
  "QA_lstPexPain[C5]": {
    "red_x_points": [
      [-0.00208, 1],
      [-0.00422, 2],
      [-0.00399, 2],
      [-0.00397, 2],
      [-0.0018, 1],
      [-0.0007, 1],
      [-0.00084, 1],
      [-0.00101, 1],
      [-0.00244, 1],
      [-0.0011, 1],
      [-0.00097, 1],
      [-0.00083, 1],
      [-0.00209, 1],
      [-0.01296, 2],
      [-0.00535, 2],
      [-0.00442, 2],
      [-0.00562, 2],
      [-0.00405, 2],
      [-0.00515, 2],
      [-0.00203, 1],
      [-0.00173, 1],
      [-0.00178, 1],
      [-0.00434, 2],
      [-0.0057, 2],
      [-0.0018, 1],
      [-0.00531, 2],
      [-0.00406, 2],
      [-0.00382, 2],
      [-0.00349, 1],
      [-0.00347, 1],
      [-0.00089, 1],
      [-0.00204, 1]
    ],
    "red_o_points": [],
    "y_categories": ["NORM", "NPV", "nan"],
    "blue_o_points": [],
    "blue_x_points": [
      [0.01962, 0],
      [-0.00312, 2],
      [0.00031, 1],
      [-0.00037, 1],
      [-0.00044, 1],
      [6e-5, 1],
      [-0.00085, 1],
      [0.017, 0],
      [-0.00106, 1],
      [0.03133, 0]
    ]
  },
  "QS_mulGraftRoot[T1]": {
    "red_x_points": [
      [-5e-5, 0],
      [-5e-5, 0],
      [-5e-5, 0],
      [-5e-5, 2],
      [-3e-5, 0],
      [-3e-5, 0],
      [-5e-5, 0],
      [-5e-5, 2],
      [-5e-5, 0],
      [-2e-5, 0],
      [-5e-5, 0],
      [-5e-5, 2],
      [0.0002, 1],
      [-5e-5, 0],
      [-5e-5, 2],
      [-5e-5, 0],
      [-3e-5, 2],
      [-5e-5, 2],
      [-3e-5, 2],
      [-5e-5, 2],
      [-3e-5, 0],
      [-5e-5, 2],
      [-5e-5, 2],
      [-3e-5, 2],
      [-3e-5, 0],
      [-5e-5, 0],
      [8e-5, 1],
      [-3e-5, 2],
      [-2e-5, 0],
      [-3e-5, 2]
    ],
    "red_o_points": [],
    "y_categories": ["N", "NOT APPLICABLE", "nan"],
    "blue_o_points": [],
    "blue_x_points": [
      [0.0002, 1],
      [-3e-5, 2],
      [0.0002, 1],
      [-2e-5, 0],
      [-5e-5, 0],
      [0.0002, 1],
      [-3e-5, 2],
      [0.0002, 1],
      [-3e-5, 2]
    ]
  },
  "QS_mulGraftNerve[IS]": {
    "red_x_points": [
      [-1e-5, 2],
      [-0.00015, 0],
      [-9e-5, 0],
      [-0.00019, 0],
      [-1e-5, 2],
      [-4e-5, 0],
      [-9e-5, 0],
      [-0.00015, 0],
      [5e-5, 2],
      [-0.00026, 0],
      [-0.00015, 0],
      [-0.00022, 0],
      [-1e-5, 2],
      [7e-5, 1],
      [1e-5, 2],
      [-0.00019, 0],
      [-2e-5, 2],
      [-0.00013, 0],
      [1e-5, 2],
      [1e-5, 2],
      [-1e-5, 2],
      [1e-5, 2],
      [-0.00014, 0],
      [-1e-5, 2],
      [1e-5, 2],
      [-2e-5, 2],
      [-0.00019, 0],
      [-0.00019, 0],
      [0.00027, 1],
      [1e-5, 2],
      [-0.00019, 0],
      [-2e-5, 2]
    ],
    "red_o_points": [],
    "y_categories": ["N", "NOT APPLICABLE", "nan"],
    "blue_o_points": [],
    "blue_x_points": [
      [0.00068, 1],
      [1e-5, 2],
      [0.00025, 1],
      [-9e-5, 0],
      [-4e-5, 0],
      [0.00041, 1],
      [0.0, 2],
      [0.00018, 1],
      [4e-5, 2],
      [1e-5, 2]
    ]
  },
  "QS_mulGraftNerve[Me]": {
    "red_x_points": [
      [-1e-5, 2],
      [-0.00015, 0],
      [-0.00015, 0],
      [-0.00015, 0],
      [-4e-5, 2],
      [-0.00015, 0],
      [-0.00015, 0],
      [-0.00014, 0],
      [-4e-5, 2],
      [-0.00011, 0],
      [-0.00014, 0],
      [-0.0001, 0],
      [1e-5, 2],
      [0.00015, 1],
      [-4e-5, 2],
      [-7e-5, 0],
      [-4e-5, 2],
      [-0.00011, 0],
      [-1e-5, 2],
      [-2e-5, 2],
      [-1e-5, 2],
      [-1e-5, 2],
      [-0.00015, 0],
      [-4e-5, 2],
      [1e-5, 2],
      [1e-5, 2],
      [-7e-5, 0],
      [-0.0001, 0],
      [0.00036, 1],
      [-1e-5, 2],
      [-0.0001, 0],
      [-1e-5, 2]
    ],
    "red_o_points": [],
    "y_categories": ["N", "NOT APPLICABLE", "nan"],
    "blue_o_points": [],
    "blue_x_points": [
      [0.00018, 1],
      [-1e-5, 2],
      [0.00025, 1],
      [-7e-5, 0],
      [-7e-5, 0],
      [0.00019, 1],
      [2e-5, 2],
      [0.00026, 1],
      [-1e-5, 2],
      [1e-5, 2]
    ]
  },
  "QS_mulGraftNerve[Ph]": {
    "red_x_points": [
      [-6e-5, 2],
      [-0.00084, 0],
      [-0.00109, 0],
      [-0.00091, 0],
      [-0.00021, 2],
      [-0.00114, 0],
      [-0.00111, 0],
      [-0.00096, 0],
      [-8e-5, 2],
      [-0.00123, 0],
      [-0.0009, 0],
      [-0.00074, 0],
      [-4e-5, 2],
      [0.00103, 1],
      [-2e-5, 2],
      [-0.00108, 0],
      [-0.00015, 2],
      [-0.00112, 0],
      [-1e-5, 2],
      [-0.0002, 2],
      [-5e-5, 2],
      [-0.00014, 2],
      [-0.00091, 0],
      [-1e-5, 2],
      [-8e-5, 2],
      [-0.00017, 2],
      [-0.00104, 0],
      [-0.00071, 0],
      [0.0019, 1],
      [-1e-5, 2],
      [-0.00087, 0],
      [-0.00022, 2]
    ],
    "red_o_points": [],
    "y_categories": ["N", "NOT APPLICABLE", "nan"],
    "blue_o_points": [],
    "blue_x_points": [
      [0.00196, 1],
      [0.00011, 2],
      [0.00195, 1],
      [-0.00015, 0],
      [-0.00027, 0],
      [0.00216, 1],
      [1e-5, 2],
      [0.00219, 1],
      [-2e-5, 2],
      [9e-5, 2]
    ]
  },
  "QA_mulInjOrthesisType[ArmSling]": {
    "red_x_points": [
      [-0.00519, 2],
      [-0.00446, 2],
      [-0.00477, 2],
      [-0.0048, 2],
      [-0.00507, 2],
      [-0.00499, 2],
      [-0.00497, 2],
      [-0.00489, 2],
      [-0.00513, 2],
      [-0.00499, 2],
      [-0.00488, 2],
      [-0.00554, 2],
      [-0.00538, 2],
      [0.00842, 1],
      [-0.00644, 2],
      [-0.00486, 2],
      [-0.00592, 2],
      [-0.00897, 0],
      [0.01092, 1],
      [-0.0044, 2],
      [-0.00472, 2],
      [-0.01313, 0],
      [-0.0019, 3],
      [-0.00611, 2],
      [0.00687, 1],
      [-0.00567, 2],
      [-0.00502, 2],
      [-0.00409, 2],
      [-0.00997, 3],
      [-0.00078, 3],
      [-0.00446, 2],
      [-0.00569, 2]
    ],
    "red_o_points": [],
    "y_categories": ["N", "NOT APPLICABLE", "Y", "nan"],
    "blue_o_points": [],
    "blue_x_points": [
      [0.00245, 2],
      [0.01769, 1],
      [0.01203, 1],
      [0.02582, 1],
      [-0.00282, 2],
      [0.01101, 1],
      [-0.00174, 2],
      [0.01008, 1],
      [-0.00246, 2],
      [0.00919, 3]
    ]
  },
  "QA_mulInjOrthesisType[ShoulderSupport]": {
    "red_x_points": [
      [-0.00534, 0],
      [-0.00522, 0],
      [-0.00516, 0],
      [-0.00532, 0],
      [-0.00563, 0],
      [-0.00548, 0],
      [-0.00534, 0],
      [-0.00525, 0],
      [-0.01496, 2],
      [-0.00577, 0],
      [-0.00544, 0],
      [-0.00533, 0],
      [-0.00531, 0],
      [0.00985, 1],
      [-0.00646, 0],
      [-0.00573, 0],
      [-0.00593, 0],
      [-0.01078, 2],
      [0.0122, 1],
      [-0.00514, 0],
      [-0.00562, 0],
      [-0.01647, 2],
      [-0.0028, 3],
      [-0.00606, 0],
      [0.00784, 1],
      [-0.00585, 0],
      [-0.0059, 0],
      [-0.00457, 0],
      [-0.00975, 3],
      [-0.00131, 3],
      [-0.00516, 0],
      [-0.00556, 0]
    ],
    "red_o_points": [],
    "y_categories": ["N", "NOT APPLICABLE", "Y", "nan"],
    "blue_o_points": [],
    "blue_x_points": [
      [0.00203, 0],
      [0.01957, 1],
      [0.01351, 1],
      [0.02668, 1],
      [-0.00422, 0],
      [0.01342, 1],
      [-0.00114, 0],
      [0.01375, 1],
      [-0.00175, 0],
      [0.01181, 3]
    ]
  },
  "QS_mulGraftLevel[Nerve]": {
    "red_x_points": [
      [-6e-5, 2],
      [-3e-5, 0],
      [-1e-5, 0],
      [-1e-5, 0],
      [-6e-5, 2],
      [-3e-5, 0],
      [-6e-5, 2],
      [2e-5, 0],
      [-3e-5, 0],
      [-3e-5, 0],
      [-2e-5, 2],
      [-6e-5, 2],
      [-3e-5, 0],
      [-2e-5, 2],
      [-1e-5, 0],
      [-6e-5, 2],
      [-2e-5, 2],
      [-2e-5, 2],
      [-3e-5, 0],
      [-6e-5, 2],
      [-2e-5, 2],
      [-4e-5, 2],
      [2e-5, 0],
      [-1e-5, 0],
      [0.00011, 1],
      [-6e-5, 2],
      [-3e-5, 0],
      [-4e-5, 2]
    ],
    "red_o_points": [],
    "y_categories": ["N", "NOT APPLICABLE", "nan"],
    "blue_o_points": [],
    "blue_x_points": [
      [0.00011, 1],
      [-6e-5, 2],
      [0.00011, 1],
      [-1e-5, 0],
      [-3e-5, 0],
      [0.00014, 1],
      [-2e-5, 2],
      [-2e-5, 2]
    ]
  },
  "QA_lstInjTpbiSide": {
    "red_x_points": [
      [-0.00295, 1],
      [0.00071, 0],
      [-0.00071, 0],
      [5e-5, 0],
      [0.00043, 0],
      [-0.00073, 1],
      [-0.00094, 0],
      [-0.00081, 0],
      [-0.00422, 1],
      [-0.00089, 0],
      [-0.00114, 1],
      [-0.00121, 1],
      [-0.00265, 1],
      [-0.01278, 0],
      [-0.00651, 1],
      [-0.00262, 1],
      [0.00024, 0],
      [-0.00192, 1],
      [-0.0073, 1],
      [-0.00076, 0],
      [0.00013, 0],
      [-0.0007, 0],
      [0.0001, 0],
      [0.00248, 0],
      [-0.00559, 1],
      [-0.00428, 1],
      [-0.00098, 1],
      [-0.00043, 1],
      [-0.01208, 0],
      [-0.0044, 1],
      [-0.00096, 0],
      [0.00239, 0]
    ],
    "red_o_points": [],
    "y_categories": ["L", "R", "nan"],
    "blue_o_points": [],
    "blue_x_points": [
      [-0.00311, 0],
      [0.00598, 0],
      [0.00583, 1],
      [0.003, 0],
      [0.00308, 1],
      [0.00794, 1],
      [0.00279, 1],
      [0.00685, 1],
      [0.00494, 0],
      [0.00593, 0]
    ]
  },
  "QA_intPexWristFlex": {
    "red_x_points": [
      [-0.0002, 2],
      [-0.00107, 2],
      [-0.00116, 2],
      [-0.00112, 2],
      [-0.00099, 0],
      [-0.00582, 0],
      [-0.00476, 0],
      [-0.00122, 2],
      [-0.00148, 0],
      [-0.00169, 2],
      [-0.00165, 2],
      [-0.00158, 2],
      [-0.00185, 0],
      [0.00026, 2],
      [-0.00015, 2],
      [-0.00133, 2],
      [-9e-5, 2],
      [-0.00093, 2],
      [5e-5, 2],
      [-0.00197, 0],
      [-0.00098, 0],
      [-0.00105, 0],
      [-0.00245, 0],
      [-0.00022, 2],
      [-0.00011, 2],
      [-0.00017, 2],
      [-0.00171, 2],
      [-0.00095, 2],
      [-0.0149, 1],
      [-0.00043, 1],
      [-0.00256, 0],
      [-0.00016, 2]
    ],
    "red_o_points": [],
    "y_categories": ["GREATER THAN OR EQUALS TO 60", "LESS THAN 60", "nan"],
    "blue_o_points": [],
    "blue_x_points": [
      [0.00142, 2],
      [3e-5, 2],
      [0.00479, 0],
      [-0.00064, 2],
      [0.02529, 1],
      [0.00156, 2],
      [0.00015, 2],
      [0.00128, 2],
      [0.00179, 0],
      [0.00026, 2]
    ]
  },
  "QA_lstPexArthre[Shoulder]": {
    "red_x_points": [
      [-0.00043, 2],
      [-0.00183, 3],
      [-0.00187, 3],
      [-0.00178, 0],
      [-0.00322, 3],
      [-0.00273, 2],
      [-0.00161, 2],
      [0.0016, 1],
      [-0.00444, 3],
      [-0.00141, 2],
      [-0.0022, 2],
      [-0.00198, 2],
      [-0.00121, 2],
      [-0.00038, 3],
      [-0.00268, 3],
      [-0.00069, 2],
      [-0.00283, 3],
      [-0.00092, 3],
      [-0.00177, 3],
      [-0.00101, 2],
      [-0.00171, 1],
      [-0.00174, 2],
      [-0.00112, 3],
      [-0.00267, 3],
      [-0.00103, 2],
      [-0.00372, 3],
      [-0.00348, 3],
      [-0.00271, 3],
      [-0.00075, 3],
      [-0.00295, 3],
      [0.00159, 1],
      [-0.00277, 3]
    ],
    "red_o_points": [],
    "y_categories": ["NAIA", "NPV", "PV", "nan"],
    "blue_o_points": [],
    "blue_x_points": [
      [0.00034, 2],
      [-0.00111, 3],
      [9e-5, 2],
      [0.00146, 2],
      [0.01428, 1],
      [2e-5, 2],
      [0.01619, 1],
      [-0.00012, 3],
      [0.00274, 2],
      [0.00131, 2]
    ]
  },
  "QS_mulGraftRoot[T2]": {
    "red_x_points": [
      [-5e-5, 0],
      [-5e-5, 0],
      [-0.0, 2],
      [-5e-5, 0],
      [-0.0, 2],
      [-5e-5, 0],
      [-5e-5, 0],
      [-0.0, 2],
      [-0.0, 2],
      [-0.0, 2],
      [9e-5, 1],
      [-0.0, 2],
      [-0.0, 2]
    ],
    "red_o_points": [],
    "y_categories": ["N", "NOT APPLICABLE", "nan"],
    "blue_o_points": [],
    "blue_x_points": [[9e-5, 1], [9e-5, 1], [-0.0, 2]]
  },
  "QS_mulLysisSite[Trunk]": {
    "red_x_points": [
      [-0.00091, 3],
      [-0.00358, 0],
      [-0.00342, 0],
      [-0.00348, 0],
      [-0.00119, 3],
      [-0.00351, 0],
      [-0.00777, 2],
      [-0.00337, 0],
      [-0.00149, 3],
      [-0.0037, 0],
      [-0.0033, 0],
      [-0.00332, 0],
      [-0.00135, 3],
      [0.00676, 1],
      [-0.00137, 3],
      [-0.00419, 0],
      [-0.00113, 3],
      [-0.00684, 2],
      [-0.00103, 3],
      [-0.00128, 3],
      [-0.00094, 3],
      [-0.00094, 3],
      [-0.00281, 0],
      [-0.00115, 3],
      [-0.00132, 3],
      [-0.00106, 3],
      [-0.00335, 0],
      [-0.00325, 0],
      [0.00866, 1],
      [-0.001, 3],
      [-0.00725, 2],
      [-0.00121, 3]
    ],
    "red_o_points": [],
    "y_categories": ["N", "NOT APPLICABLE", "Y", "nan"],
    "blue_o_points": [],
    "blue_x_points": [
      [0.011, 1],
      [-0.0004, 3],
      [0.00937, 1],
      [0.0002, 0],
      [-0.00047, 0],
      [0.01047, 1],
      [-0.00042, 3],
      [0.01, 1],
      [-0.00041, 3],
      [-0.00032, 3]
    ]
  },
  "QA_equInjTbpiAge": {
    "red_x_points": [
      [0.00058, 1],
      [0.0001, 1],
      [-0.00019, 1],
      [-0.00045, 0],
      [0.00057, 1],
      [-0.00144, 0],
      [-0.00057, 1],
      [-0.00048, 1],
      [-0.00621, 0],
      [-0.00165, 0],
      [-0.00154, 0],
      [-0.00089, 1],
      [-0.0048, 0],
      [-0.01295, 1],
      [0.00093, 1],
      [-6e-5, 1],
      [0.00074, 1],
      [-0.00211, 0],
      [-0.00629, 0],
      [0.00115, 1],
      [-0.00391, 0],
      [0.00102, 1],
      [0.00011, 1],
      [0.0009, 1],
      [0.00028, 1],
      [-0.00497, 0],
      [-0.00014, 1],
      [2e-5, 1],
      [-0.01164, 1],
      [0.00071, 1],
      [-0.00098, 0],
      [0.00084, 1]
    ],
    "red_o_points": [],
    "y_categories": ["GREATER THAN OR EQUALS TO 30", "LESS THAN 30", "nan"],
    "blue_o_points": [],
    "blue_x_points": [
      [-0.00415, 1],
      [0.00236, 1],
      [0.0062, 0],
      [0.00276, 1],
      [0.00274, 0],
      [0.00651, 0],
      [0.00244, 1],
      [0.007, 0],
      [0.0036, 1],
      [0.00278, 1]
    ]
  },
  "QS_mulTransfSite[PhMc]": {
    "red_x_points": [
      [-0.00076, 3],
      [-0.00405, 0],
      [-0.00394, 0],
      [-0.0038, 0],
      [-0.00092, 3],
      [-0.00411, 0],
      [-0.00352, 0],
      [-0.00973, 2],
      [-0.0011, 3],
      [-0.00394, 0],
      [-0.00416, 0],
      [-0.00353, 0],
      [-0.0008, 3],
      [0.00738, 1],
      [-0.00071, 3],
      [-0.00424, 0],
      [-0.00069, 3],
      [-0.00376, 0],
      [-0.00063, 3],
      [-0.00082, 3],
      [-0.00059, 3],
      [-0.00073, 3],
      [-0.00708, 2],
      [-0.00065, 3],
      [-0.00071, 3],
      [-0.00076, 3],
      [-0.00389, 0],
      [-0.00412, 0],
      [0.0082, 1],
      [-0.00073, 3],
      [-0.00351, 0],
      [-0.00067, 3]
    ],
    "red_o_points": [],
    "y_categories": ["N", "NOT APPLICABLE", "Y", "nan"],
    "blue_o_points": [],
    "blue_x_points": [
      [0.01042, 1],
      [0.00023, 3],
      [0.00938, 1],
      [-0.00148, 0],
      [-0.00158, 0],
      [0.01097, 1],
      [-0.00013, 3],
      [0.01094, 1],
      [-0.00014, 3],
      [0.00023, 3]
    ]
  },
  "QS_mulLysisSite[Root]": {
    "red_x_points": [
      [-0.00052, 3],
      [-0.00184, 0],
      [-0.00531, 2],
      [-0.00209, 0],
      [-0.00042, 3],
      [-0.002, 0],
      [-0.00177, 0],
      [-0.00185, 0],
      [-0.00049, 3],
      [-0.00195, 0],
      [-0.00187, 0],
      [-0.00167, 0],
      [-0.00062, 3],
      [0.00483, 1],
      [-0.00053, 3],
      [-0.00198, 0],
      [-0.00032, 3],
      [-0.00198, 0],
      [-0.00045, 3],
      [-0.0006, 3],
      [-0.00047, 3],
      [-0.0004, 3],
      [-0.00204, 0],
      [-0.00061, 3],
      [-0.00029, 3],
      [-0.00046, 3],
      [-0.00187, 0],
      [-0.00186, 0],
      [0.00481, 1],
      [-0.00037, 3],
      [-0.00538, 2],
      [-0.0004, 3]
    ],
    "red_o_points": [],
    "y_categories": ["N", "NOT APPLICABLE", "Y", "nan"],
    "blue_o_points": [],
    "blue_x_points": [
      [0.00523, 1],
      [-0.00011, 3],
      [0.00491, 1],
      [-0.00069, 0],
      [-0.00018, 0],
      [0.00552, 1],
      [-0.00014, 3],
      [0.00568, 1],
      [-0.00029, 3],
      [-0.00015, 3]
    ]
  },
  "QA_yonInjOrtsurg": {
    "red_x_points": [
      [-0.00129, 2],
      [-0.0003, 2],
      [-1e-5, 2],
      [-7e-5, 2],
      [-0.00123, 2],
      [0.00024, 2],
      [0.00016, 2],
      [0.00023, 1],
      [-0.00132, 2],
      [-0.00134, 0],
      [0.00023, 1],
      [0.00013, 1],
      [-0.00159, 2],
      [-0.00509, 0],
      [0.005, 1],
      [-5e-5, 2],
      [-0.00168, 2],
      [-0.00181, 0],
      [-0.01092, 0],
      [-0.00866, 0],
      [0.0035, 1],
      [-0.0017, 2],
      [0.00032, 1],
      [-0.00233, 2],
      [-0.0017, 2],
      [-0.00163, 2],
      [-0.00112, 0],
      [-0.00099, 0],
      [3e-5, 1],
      [-0.00153, 2],
      [0.00037, 1],
      [-0.00151, 2]
    ],
    "red_o_points": [],
    "y_categories": ["N", "Y", "nan"],
    "blue_o_points": [],
    "blue_x_points": [
      [0.00032, 2],
      [0.01048, 1],
      [0.00102, 2],
      [0.00106, 2],
      [0.00055, 2],
      [0.00078, 2],
      [-0.00048, 2],
      [0.00038, 2],
      [0.00939, 1],
      [-0.00078, 2]
    ]
  },
  "QS_mulGraftNerve[other]": {
    "red_x_points": [
      [-0.00023, 2],
      [-0.00061, 0],
      [-0.00065, 0],
      [-0.00056, 0],
      [-0.00036, 2],
      [-0.00095, 0],
      [-0.00054, 0],
      [-0.00083, 0],
      [-0.00037, 2],
      [-0.00079, 0],
      [-0.00098, 0],
      [-0.00042, 0],
      [-2e-5, 2],
      [0.00095, 1],
      [-0.00021, 2],
      [-0.00074, 0],
      [-0.00033, 2],
      [-0.00076, 0],
      [-0.00054, 2],
      [-0.00018, 2],
      [-9e-5, 2],
      [-0.00015, 2],
      [-0.00061, 0],
      [-0.00039, 2],
      [-0.00031, 2],
      [-0.0003, 2],
      [-0.00068, 0],
      [-0.00058, 0],
      [0.00113, 1],
      [-4e-5, 2],
      [-0.00046, 0],
      [-0.00034, 2]
    ],
    "red_o_points": [],
    "y_categories": ["N", "NOT APPLICABLE", "nan"],
    "blue_o_points": [],
    "blue_x_points": [
      [0.00238, 1],
      [3e-5, 2],
      [0.00172, 1],
      [0.00022, 0],
      [-0.00018, 0],
      [0.00205, 1],
      [-0.00011, 2],
      [0.00181, 1],
      [-0.0001, 2],
      [9e-5, 2]
    ]
  },
  "QS_mulGraftNerve[DS]": {
    "red_x_points": [
      [0.0, 2],
      [-4e-5, 0],
      [-4e-5, 0],
      [0.0, 2],
      [-4e-5, 0],
      [-4e-5, 0],
      [0.0, 2],
      [-4e-5, 0],
      [0.0, 2],
      [0.0, 2],
      [-4e-5, 0],
      [0.0, 2],
      [-4e-5, 0],
      [0.0, 2],
      [0.0, 2],
      [0.0, 2],
      [-4e-5, 0],
      [0.0, 2],
      [0.0, 2],
      [0.0, 2],
      [-4e-5, 0],
      [9e-5, 1],
      [0.0, 2],
      [0.0, 2]
    ],
    "red_o_points": [],
    "y_categories": ["N", "NOT APPLICABLE", "nan"],
    "blue_o_points": [],
    "blue_x_points": [
      [0.0, 2],
      [9e-5, 1],
      [-4e-5, 0],
      [9e-5, 1],
      [0.0, 2],
      [0.0, 2]
    ]
  },
  "QS_mulGraftNerve[LP]": {
    "red_x_points": [
      [-0.0, 2],
      [-2e-5, 0],
      [-0.00011, 0],
      [-0.00011, 0],
      [-7e-5, 2],
      [-4e-5, 0],
      [-4e-5, 0],
      [-7e-5, 0],
      [-1e-5, 2],
      [-0.00017, 0],
      [-7e-5, 0],
      [-2e-5, 0],
      [-3e-5, 2],
      [-2e-5, 1],
      [-4e-5, 2],
      [-0.00012, 0],
      [-7e-5, 2],
      [-5e-5, 0],
      [-1e-5, 2],
      [-3e-5, 2],
      [-3e-5, 2],
      [-1e-5, 2],
      [-4e-5, 0],
      [-7e-5, 2],
      [-1e-5, 2],
      [-5e-5, 2],
      [-2e-5, 0],
      [-4e-5, 0],
      [0.00015, 1],
      [-5e-5, 2],
      [-6e-5, 0],
      [-8e-5, 2]
    ],
    "red_o_points": [],
    "y_categories": ["N", "NOT APPLICABLE", "nan"],
    "blue_o_points": [],
    "blue_x_points": [
      [0.00038, 1],
      [-1e-5, 2],
      [-0.0, 0],
      [0.0002, 1],
      [0.0003, 1],
      [1e-5, 2],
      [-1e-5, 2]
    ]
  },
  "QA_lstPexMuscstrength[WristFlex]": {
    "red_x_points": [
      [-0.00242, 1],
      [-0.00077, 2],
      [-0.00339, 1],
      [-0.00188, 1],
      [-0.00036, 0],
      [0.00075, 0],
      [0.00096, 0],
      [-0.00362, 1],
      [-0.00201, 0],
      [0.00098, 0],
      [0.0003, 0],
      [0.0003, 0],
      [-0.00199, 0],
      [-0.00083, 2],
      [-0.0004, 2],
      [-0.001, 2],
      [-0.00095, 0],
      [-0.00096, 2],
      [-0.00124, 2],
      [-0.00322, 0],
      [-0.00267, 1],
      [-0.00368, 0],
      [-0.0021, 1],
      [0.00018, 2],
      [-0.0061, 1],
      [-0.00276, 0],
      [0.00111, 0],
      [0.00081, 0],
      [-0.00083, 2],
      [-0.00294, 1],
      [-0.00342, 1],
      [-3e-5, 2]
    ],
    "red_o_points": [],
    "y_categories": ["GREATER THAN OR EQUALS TO 3", "LESS THAN 3", "nan"],
    "blue_o_points": [],
    "blue_x_points": [
      [0.00071, 0],
      [0.0005, 2],
      [0.0014, 0],
      [0.00416, 0],
      [0.00249, 0],
      [0.00139, 0],
      [0.00244, 0],
      [0.00143, 0],
      [0.00788, 1],
      [0.00543, 2]
    ]
  },
  "QS_mulNeuromadSite[C5]": {
    "red_x_points": [
      [-0.00021, 2],
      [-0.0013, 0],
      [-0.0009, 0],
      [-0.0011, 0],
      [-0.00014, 2],
      [-0.00114, 0],
      [-0.00065, 0],
      [-0.00102, 0],
      [-0.00032, 2],
      [-0.00134, 0],
      [-0.00117, 0],
      [-0.0011, 0],
      [-0.00026, 2],
      [0.00151, 1],
      [-0.0001, 2],
      [-0.00106, 0],
      [-0.00019, 2],
      [-0.00082, 0],
      [-0.00039, 2],
      [-0.00032, 2],
      [-0.00021, 2],
      [-0.00027, 2],
      [-0.00097, 0],
      [-0.00024, 2],
      [-0.00046, 2],
      [-0.00012, 2],
      [-0.00106, 0],
      [-0.00101, 0],
      [0.0011, 1],
      [-0.00021, 2],
      [-0.00078, 0],
      [-0.00011, 2]
    ],
    "red_o_points": [],
    "y_categories": ["N", "NOT APPLICABLE", "nan"],
    "blue_o_points": [],
    "blue_x_points": [
      [0.00319, 1],
      [0.00021, 2],
      [0.0024, 1],
      [0.00012, 0],
      [-0.00031, 0],
      [0.0021, 1],
      [4e-5, 2],
      [0.00223, 1],
      [-4e-5, 2],
      [-8e-5, 2]
    ]
  },
  "QS_mulNeuromadSite[C7]": {
    "red_x_points": [
      [-0.00016, 2],
      [-0.00145, 0],
      [-0.00145, 0],
      [-0.00151, 0],
      [-0.00026, 2],
      [-0.002, 0],
      [-0.00086, 0],
      [-0.00163, 0],
      [-0.00041, 2],
      [-0.00147, 0],
      [-0.0018, 0],
      [-0.00163, 0],
      [-0.00034, 2],
      [0.00275, 1],
      [-0.00025, 2],
      [-0.00163, 0],
      [-0.00022, 2],
      [-0.0016, 0],
      [-0.0003, 2],
      [-0.00035, 2],
      [-0.00011, 2],
      [-0.00049, 2],
      [-0.00135, 0],
      [-0.00019, 2],
      [-0.00024, 2],
      [-0.00016, 2],
      [-0.00128, 0],
      [-0.00113, 0],
      [0.00274, 1],
      [-0.00023, 2],
      [-0.00095, 0],
      [-0.00024, 2]
    ],
    "red_o_points": [],
    "y_categories": ["N", "NOT APPLICABLE", "nan"],
    "blue_o_points": [],
    "blue_x_points": [
      [0.00339, 1],
      [-9e-5, 2],
      [0.0036, 1],
      [-0.00024, 0],
      [-0.00047, 0],
      [0.0033, 1],
      [-0.00019, 2],
      [0.00291, 1],
      [5e-5, 2],
      [-2e-5, 2]
    ]
  },
  "QA_lstPexMuscstrength[WristExte]": {
    "red_x_points": [
      [0.00076, 1],
      [-0.00158, 2],
      [-0.00304, 1],
      [-0.00189, 1],
      [0.00085, 1],
      [0.00022, 0],
      [-0.00192, 1],
      [-0.00315, 1],
      [-0.00904, 0],
      [0.00245, 0],
      [0.0001, 0],
      [-0.00423, 1],
      [-0.00805, 0],
      [-0.00078, 2],
      [8e-5, 2],
      [-0.00156, 2],
      [-0.0054, 0],
      [-0.00109, 2],
      [0.00048, 2],
      [-0.00944, 0],
      [0.00146, 1],
      [-0.01071, 0],
      [-0.0016, 1],
      [0.00033, 2],
      [-0.00735, 0],
      [0.00066, 1],
      [0.00128, 0],
      [0.00083, 0],
      [-0.00084, 2],
      [0.00107, 1],
      [-0.00236, 1],
      [0.00066, 2]
    ],
    "red_o_points": [],
    "y_categories": ["GREATER THAN OR EQUALS TO 3", "LESS THAN 3", "nan"],
    "blue_o_points": [],
    "blue_x_points": [
      [0.00052, 0],
      [0.00226, 2],
      [0.00031, 0],
      [0.00573, 0],
      [0.00399, 0],
      [0.00063, 1],
      [0.00823, 1],
      [0.00051, 0],
      [0.01078, 1],
      [0.00686, 2]
    ]
  },
  "QS_mulTransfSite[IMc]": {
    "red_x_points": [
      [-0.00127, 3],
      [-0.00828, 2],
      [-0.00364, 0],
      [-0.00415, 0],
      [-0.00115, 3],
      [-0.00474, 0],
      [-0.00382, 0],
      [-0.00388, 0],
      [-0.00159, 3],
      [-0.00454, 0],
      [-0.00412, 0],
      [-0.00413, 0],
      [-0.0017, 3],
      [0.01045, 1],
      [-0.00141, 3],
      [-0.00411, 0],
      [-0.00141, 3],
      [-0.0092, 2],
      [-0.00185, 3],
      [-0.00168, 3],
      [-0.00127, 3],
      [-0.00087, 3],
      [-0.00367, 0],
      [-0.00128, 3],
      [-0.00116, 3],
      [-0.00149, 3],
      [-0.0038, 0],
      [-0.0084, 2],
      [0.01026, 1],
      [-0.00136, 3],
      [-0.00897, 2],
      [-0.00115, 3]
    ],
    "red_o_points": [],
    "y_categories": ["N", "NOT APPLICABLE", "Y", "nan"],
    "blue_o_points": [],
    "blue_x_points": [
      [0.01344, 1],
      [-0.00043, 3],
      [0.01221, 1],
      [-0.00061, 0],
      [-0.00123, 0],
      [0.01197, 1],
      [-0.00022, 3],
      [0.01297, 1],
      [-0.00046, 3],
      [-0.00032, 3]
    ]
  },
  "QS_mulGraftNerve[SS]": {
    "red_x_points": [
      [2e-5, 2],
      [-0.00022, 0],
      [-0.0002, 0],
      [-0.00026, 0],
      [3e-5, 2],
      [-0.0002, 0],
      [-0.00032, 0],
      [-0.00022, 0],
      [1e-5, 2],
      [-0.00026, 0],
      [-0.00025, 0],
      [-0.00025, 0],
      [5e-5, 2],
      [0.00047, 1],
      [4e-5, 2],
      [-0.00033, 0],
      [5e-5, 2],
      [-0.00028, 0],
      [2e-5, 2],
      [1e-5, 2],
      [5e-5, 2],
      [1e-5, 2],
      [-0.00032, 0],
      [3e-5, 2],
      [1e-5, 2],
      [3e-5, 2],
      [-0.00026, 0],
      [-0.00028, 0],
      [0.00037, 1],
      [6e-5, 2],
      [-0.00022, 0],
      [-2e-5, 2]
    ],
    "red_o_points": [],
    "y_categories": ["N", "NOT APPLICABLE", "nan"],
    "blue_o_points": [],
    "blue_x_points": [
      [0.00059, 1],
      [4e-5, 2],
      [0.00033, 1],
      [3e-5, 0],
      [-0.00014, 0],
      [0.00051, 1],
      [-1e-5, 2],
      [0.00046, 1],
      [3e-5, 2],
      [2e-5, 2]
    ]
  },
  "QA_lstPexArthre[Index]": {
    "red_x_points": [
      [-0.00127, 0],
      [-0.00096, 2],
      [-0.00221, 2],
      [-0.00115, 0],
      [-0.00276, 2],
      [0.0008, 1],
      [0.00077, 1],
      [-0.00171, 0],
      [-0.0036, 2],
      [0.0013, 1],
      [0.00083, 1],
      [-0.00474, 0],
      [4e-5, 1],
      [-0.00077, 2],
      [-0.00205, 2],
      [0.00076, 1],
      [-0.00256, 2],
      [-0.00118, 2],
      [-0.00186, 2],
      [-0.00044, 1],
      [-0.0022, 0],
      [-0.00074, 1],
      [-0.00058, 2],
      [-0.00258, 2],
      [-0.00034, 1],
      [-0.00365, 2],
      [-0.00142, 2],
      [-0.00091, 2],
      [-0.00097, 2],
      [-0.00241, 2],
      [-0.00281, 0],
      [-0.00295, 2]
    ],
    "red_o_points": [],
    "y_categories": ["NPV", "PV", "nan"],
    "blue_o_points": [],
    "blue_x_points": [
      [0.00145, 0],
      [-0.00088, 2],
      [0.00039, 1],
      [0.00497, 1],
      [0.00377, 1],
      [0.00047, 1],
      [0.01124, 0],
      [-0.00031, 2],
      [0.00367, 1],
      [0.00344, 1]
    ]
  },
  "QS_mulLysisRoot[C7]": {
    "red_x_points": [
      [-0.00051, 3],
      [-0.00158, 0],
      [-0.00525, 2],
      [-0.00151, 0],
      [-0.0006, 3],
      [-0.00147, 0],
      [-0.0014, 0],
      [-0.0015, 0],
      [-0.00076, 3],
      [-0.00158, 0],
      [-0.00144, 0],
      [-0.00129, 0],
      [-0.00051, 3],
      [0.00384, 1],
      [-0.00055, 3],
      [-0.00154, 0],
      [-0.00041, 3],
      [-0.00148, 0],
      [-0.00038, 3],
      [-0.00066, 3],
      [-0.00047, 3],
      [-0.00055, 3],
      [-0.00161, 0],
      [-0.00067, 3],
      [-0.00056, 3],
      [-0.00046, 3],
      [-0.0016, 0],
      [-0.00164, 0],
      [0.00313, 1],
      [-0.00047, 3],
      [-0.00117, 0],
      [-0.0006, 3]
    ],
    "red_o_points": [],
    "y_categories": ["N", "NOT APPLICABLE", "Y", "nan"],
    "blue_o_points": [],
    "blue_x_points": [
      [0.00503, 1],
      [-8e-5, 3],
      [0.00425, 1],
      [-0.00029, 0],
      [-0.00061, 0],
      [0.00424, 1],
      [-0.00039, 3],
      [0.00461, 1],
      [-0.00026, 3],
      [-0.00014, 3]
    ]
  },
  "QA_lstPexPain[T1]": {
    "red_x_points": [
      [-0.00739, 1],
      [-0.00217, 2],
      [-0.00236, 2],
      [-0.00176, 2],
      [-0.00791, 1],
      [-0.00632, 0],
      [0.00113, 1],
      [0.00106, 1],
      [0.00575, 0],
      [0.00289, 1],
      [-0.00441, 0],
      [-0.0043, 0],
      [0.00559, 0],
      [-0.01093, 2],
      [-0.0036, 2],
      [-0.00374, 2],
      [-0.00398, 2],
      [-0.00199, 2],
      [-0.00432, 2],
      [0.00497, 0],
      [-0.00841, 1],
      [0.00523, 0],
      [-0.00225, 2],
      [-0.00383, 2],
      [-0.00775, 1],
      [-0.00423, 2],
      [-0.00366, 2],
      [-0.00284, 2],
      [-0.00409, 1],
      [-0.00882, 1],
      [2e-5, 1],
      [-0.00859, 1]
    ],
    "red_o_points": [],
    "y_categories": ["NORM", "NPV", "nan"],
    "blue_o_points": [],
    "blue_x_points": [
      [-0.00015, 1],
      [-0.00032, 2],
      [0.00427, 0],
      [0.0069, 1],
      [0.00929, 1],
      [0.00016, 1],
      [0.01071, 0],
      [0.00469, 0],
      [0.01044, 0],
      [0.01282, 0]
    ]
  },
  "QA_lstPexKine[Shoulder]": {
    "red_x_points": [
      [-0.00093, 1],
      [-0.00209, 2],
      [-0.00234, 2],
      [-0.00223, 2],
      [-0.00395, 2],
      [-0.00304, 1],
      [-0.00195, 1],
      [0.00324, 0],
      [-0.00487, 2],
      [-0.0018, 1],
      [-0.00231, 1],
      [-0.00219, 1],
      [-0.00243, 1],
      [-0.00099, 2],
      [-0.00315, 2],
      [-0.00091, 1],
      [-0.00381, 2],
      [-0.00145, 2],
      [-0.00315, 2],
      [-0.00243, 1],
      [-0.00158, 1],
      [-0.0026, 1],
      [-0.00164, 2],
      [-0.00344, 2],
      [-0.00194, 1],
      [-0.00478, 2],
      [-0.00336, 2],
      [-0.00253, 2],
      [-0.00143, 2],
      [-0.00352, 2],
      [-0.00131, 1],
      [-0.00467, 2]
    ],
    "red_o_points": [],
    "y_categories": ["NPV", "PV", "nan"],
    "blue_o_points": [],
    "blue_x_points": [
      [0.00027, 1],
      [-0.00183, 2],
      [-0.00066, 1],
      [0.00097, 1],
      [0.01981, 0],
      [-0.00015, 1],
      [0.02726, 0],
      [-0.00046, 2],
      [-0.00026, 1],
      [0.0008, 1]
    ]
  },
  "QA_yonInjBpsurg": {
    "red_x_points": [
      [-0.00167, 1],
      [-0.00129, 1],
      [-0.0015, 1],
      [-0.00149, 1],
      [-0.00159, 1],
      [-0.00136, 1],
      [-0.00134, 1],
      [-0.0012, 1],
      [-0.00179, 1],
      [-0.00174, 1],
      [-0.0014, 1],
      [-0.00123, 1],
      [-0.00149, 1],
      [0.00393, 0],
      [-0.00154, 1],
      [-0.00135, 1],
      [-0.00184, 1],
      [-0.0011, 1],
      [-0.0017, 1],
      [-0.0017, 1],
      [-0.0013, 1],
      [-0.00143, 1],
      [-0.00101, 1],
      [-0.00162, 1],
      [-0.0017, 1],
      [-0.00152, 1],
      [-0.00146, 1],
      [-0.00156, 1],
      [0.00299, 0],
      [-0.00139, 1],
      [-0.00114, 1],
      [-0.00151, 1]
    ],
    "red_o_points": [],
    "y_categories": ["N", "Y", "nan"],
    "blue_o_points": [],
    "blue_x_points": [
      [0.00691, 0],
      [-0.00029, 1],
      [0.00594, 0],
      [-0.00136, 1],
      [-0.00135, 1],
      [0.00656, 0],
      [-0.00088, 1],
      [0.00767, 0],
      [-0.00069, 1],
      [-0.00076, 1]
    ]
  },
  "QA_equInjTbpiTime": {
    "red_x_points": [
      [-0.00124, 0],
      [-0.00318, 0],
      [0.00583, 3],
      [-0.00339, 0],
      [-0.00425, 1],
      [-0.00665, 0],
      [-0.00605, 1],
      [-0.00435, 0],
      [0.00055, 3],
      [-0.00629, 0],
      [-0.00517, 0],
      [0.01058, 3],
      [-0.002, 0],
      [-0.03164, 2],
      [-0.00067, 3],
      [-0.00408, 0],
      [9e-5, 0],
      [-0.00219, 0],
      [-0.01072, 1],
      [0.00278, 3],
      [-0.00262, 0],
      [-0.00514, 1],
      [-0.00709, 2],
      [0.00011, 3],
      [-0.00927, 1],
      [-0.01234, 2],
      [-0.00564, 0],
      [-0.0073, 2],
      [0.00142, 0],
      [-0.00126, 0],
      [0.00544, 3],
      [-0.00667, 1]
    ],
    "red_o_points": [],
    "y_categories": [
      "0 TO 6 MONTHS",
      "13 TO 24 MONTHS",
      "25 MONTHS OR MORE",
      "7 TO 12 MONTHS",
      "nan"
    ],
    "blue_o_points": [],
    "blue_x_points": [
      [0.00333, 0],
      [0.00699, 0],
      [0.00311, 0],
      [0.01687, 3],
      [0.01419, 3],
      [0.00381, 0],
      [0.00405, 1],
      [0.01007, 3],
      [0.00969, 3],
      [0.00526, 0]
    ]
  },
  "QS_mulBpsurgeryType[Graft]": {
    "red_x_points": [
      [-0.00019, 3],
      [-0.00067, 0],
      [-0.0006, 0],
      [-0.00093, 0],
      [-0.00014, 3],
      [-0.00093, 0],
      [-0.00068, 0],
      [-0.00078, 0],
      [-0.00019, 3],
      [-0.00077, 0],
      [-0.00079, 0],
      [-0.00075, 0],
      [-0.00016, 3],
      [0.00148, 1],
      [-0.0003, 3],
      [-0.00366, 2],
      [-0.00025, 3],
      [-0.00042, 0],
      [-0.00016, 3],
      [-0.0003, 3],
      [-0.00017, 3],
      [-0.00013, 3],
      [-0.0007, 0],
      [-0.00029, 3],
      [-0.00021, 3],
      [-0.00022, 3],
      [-0.00081, 0],
      [-0.00062, 0],
      [0.00181, 1],
      [-0.00012, 3],
      [-0.00087, 0],
      [-0.00011, 3]
    ],
    "red_o_points": [],
    "y_categories": ["N", "NOT APPLICABLE", "Y", "nan"],
    "blue_o_points": [],
    "blue_x_points": [
      [0.00301, 1],
      [-5e-5, 3],
      [0.00215, 1],
      [0.00042, 0],
      [-0.00049, 0],
      [0.0018, 1],
      [-5e-5, 3],
      [0.00229, 1],
      [-0.00018, 3],
      [-5e-5, 3]
    ]
  },
  "QS_mulLysisRoot[C6]": {
    "red_x_points": [
      [-0.00087, 3],
      [-0.00258, 0],
      [-0.0066, 2],
      [-0.00286, 0],
      [-0.00071, 3],
      [-0.00303, 0],
      [-0.0025, 0],
      [-0.00253, 0],
      [-0.00116, 3],
      [-0.00306, 0],
      [-0.003, 0],
      [-0.00239, 0],
      [-0.00109, 3],
      [0.00646, 1],
      [-0.00066, 3],
      [-0.00272, 0],
      [-0.00088, 3],
      [-0.00259, 0],
      [-0.00081, 3],
      [-0.00112, 3],
      [-0.00072, 3],
      [-0.00099, 3],
      [-0.00259, 0],
      [-0.00074, 3],
      [-0.00086, 3],
      [-0.00072, 3],
      [-0.00273, 0],
      [-0.00276, 0],
      [0.00667, 1],
      [-0.0006, 3],
      [-0.00579, 2],
      [-0.00072, 3]
    ],
    "red_o_points": [],
    "y_categories": ["N", "NOT APPLICABLE", "Y", "nan"],
    "blue_o_points": [],
    "blue_x_points": [
      [0.00899, 1],
      [-0.00025, 3],
      [0.00705, 1],
      [-0.0006, 0],
      [-0.00132, 0],
      [0.00695, 1],
      [-0.00042, 3],
      [0.00899, 1],
      [-0.00038, 3],
      [-0.00031, 3]
    ]
  },
  "QA_lstPexPalle[Clavicle]": {
    "red_x_points": [
      [-0.00263, 3],
      [-0.00147, 3],
      [-0.001, 3],
      [-0.00162, 3],
      [-0.0031, 3],
      [-0.00672, 2],
      [-0.00533, 2],
      [-0.00151, 3],
      [-0.00287, 3],
      [-0.00204, 3],
      [-0.0053, 2],
      [-0.00668, 2],
      [-0.00694, 0],
      [0.00026, 3],
      [-0.00298, 3],
      [-0.00168, 3],
      [-0.00283, 3],
      [-0.00096, 3],
      [-0.00217, 3],
      [-0.00915, 0],
      [-0.00894, 0],
      [-0.00222, 2],
      [-3e-5, 1],
      [-0.00254, 3],
      [-0.00302, 2],
      [-0.00255, 3],
      [-0.00199, 3],
      [-0.0014, 3],
      [-0.01532, 2],
      [-0.00229, 3],
      [0.00162, 0],
      [-0.00272, 3]
    ],
    "red_o_points": [],
    "y_categories": ["HYPO", "NAIA", "PT", "nan"],
    "blue_o_points": [],
    "blue_x_points": [
      [0.0013, 3],
      [-0.00081, 3],
      [0.00704, 0],
      [0.00045, 3],
      [0.0183, 0],
      [0.0011, 3],
      [0.03366, 1],
      [0.0012, 3],
      [0.00936, 2],
      [-0.0001, 3]
    ]
  },
  "QA_lstPexMuscstrength[ThumbOppo]": {
    "red_x_points": [
      [-0.00665, 1],
      [0.00093, 2],
      [-0.00477, 1],
      [-0.00406, 1],
      [-0.00602, 1],
      [0.00145, 0],
      [0.00093, 0],
      [-0.00554, 1],
      [0.00086, 0],
      [0.00124, 0],
      [0.00144, 0],
      [0.00157, 0],
      [0.00111, 0],
      [0.00062, 2],
      [0.00112, 2],
      [0.00067, 2],
      [0.00096, 0],
      [0.00064, 2],
      [0.00088, 2],
      [0.00114, 0],
      [-0.00583, 1],
      [0.00062, 0],
      [-0.00433, 1],
      [0.00115, 2],
      [0.00113, 2],
      [0.0013, 2],
      [0.00121, 0],
      [-0.00457, 1],
      [0.00086, 2],
      [-0.00713, 1],
      [-0.00575, 1],
      [0.00104, 2]
    ],
    "red_o_points": [],
    "y_categories": ["GREATER THAN OR EQUALS TO 3", "LESS THAN 3", "nan"],
    "blue_o_points": [],
    "blue_x_points": [
      [0.00068, 2],
      [0.0015, 2],
      [0.00114, 0],
      [0.00256, 2],
      [0.0034, 0],
      [0.00122, 0],
      [0.00341, 0],
      [0.00146, 0],
      [0.00199, 2],
      [0.00261, 2]
    ]
  },
  "QS_mulGraftNerve[LT]": {
    "red_x_points": [
      [2e-5, 2],
      [-0.00013, 0],
      [-3e-5, 0],
      [-9e-5, 0],
      [-4e-5, 2],
      [-0.00011, 0],
      [-0.00011, 0],
      [-6e-5, 0],
      [-2e-5, 2],
      [-8e-5, 0],
      [-9e-5, 0],
      [-0.00011, 0],
      [-3e-5, 2],
      [0.00016, 1],
      [2e-5, 2],
      [-0.00013, 0],
      [-2e-5, 2],
      [-6e-5, 0],
      [1e-5, 2],
      [-2e-5, 2],
      [-2e-5, 2],
      [1e-5, 2],
      [-9e-5, 0],
      [-2e-5, 2],
      [1e-5, 2],
      [-2e-5, 2],
      [-2e-5, 0],
      [-9e-5, 0],
      [0.00016, 1],
      [-2e-5, 2],
      [-9e-5, 0],
      [-1e-5, 2]
    ],
    "red_o_points": [],
    "y_categories": ["N", "NOT APPLICABLE", "nan"],
    "blue_o_points": [],
    "blue_x_points": [
      [0.00043, 1],
      [2e-5, 2],
      [-7e-5, 0],
      [-5e-5, 0],
      [0.0, 2],
      [0.0003, 1],
      [-2e-5, 2],
      [3e-5, 2]
    ]
  },
  "QA_lstPexTouch[T1]": {
    "red_x_points": [
      [-0.00901, 1],
      [-0.00217, 2],
      [0.00053, 1],
      [-0.00174, 2],
      [-0.00931, 1],
      [-0.00629, 0],
      [0.00171, 1],
      [0.00074, 1],
      [-0.01019, 1],
      [-0.00489, 0],
      [-0.00337, 0],
      [-0.00536, 0],
      [0.00683, 0],
      [-0.00752, 2],
      [-0.00359, 2],
      [-0.00289, 2],
      [-0.00962, 1],
      [-0.00278, 2],
      [-0.00346, 2],
      [0.00495, 0],
      [-0.00965, 1],
      [0.00732, 0],
      [-0.00256, 2],
      [-0.00349, 2],
      [-0.01018, 1],
      [0.00767, 0],
      [0.00172, 1],
      [-0.00209, 2],
      [-0.0018, 1],
      [-0.00411, 2],
      [0.00061, 1],
      [-0.01053, 1]
    ],
    "red_o_points": [],
    "y_categories": ["NORM", "NPV", "nan"],
    "blue_o_points": [],
    "blue_x_points": [
      [0.00046, 1],
      [0.00108, 2],
      [0.00064, 1],
      [0.00652, 1],
      [0.01027, 1],
      [0.00061, 1],
      [0.01159, 0],
      [0.00418, 0],
      [0.01103, 0],
      [0.01399, 0]
    ]
  },
  "QS_mulGraftNerve[MC]": {
    "red_x_points": [
      [-6e-5, 2],
      [-0.00035, 0],
      [-0.00018, 0],
      [-0.00017, 0],
      [-3e-5, 2],
      [-0.00014, 0],
      [-0.00015, 0],
      [-0.00021, 0],
      [4e-5, 2],
      [-0.00019, 0],
      [-0.0003, 0],
      [-0.00022, 0],
      [-4e-5, 2],
      [0.00032, 1],
      [-3e-5, 2],
      [-9e-5, 0],
      [-0.0001, 2],
      [-0.0002, 0],
      [-0.00015, 2],
      [-5e-5, 2],
      [-3e-5, 2],
      [-3e-5, 2],
      [-0.0001, 0],
      [-2e-5, 2],
      [-3e-5, 2],
      [-5e-5, 2],
      [-0.00018, 0],
      [-0.00019, 0],
      [0.00019, 1],
      [-5e-5, 2],
      [-0.00019, 0],
      [-3e-5, 2]
    ],
    "red_o_points": [],
    "y_categories": ["N", "NOT APPLICABLE", "nan"],
    "blue_o_points": [],
    "blue_x_points": [
      [0.00057, 1],
      [3e-5, 2],
      [0.00022, 1],
      [2e-5, 0],
      [-1e-5, 0],
      [0.00061, 1],
      [5e-5, 2],
      [0.00043, 1],
      [4e-5, 2],
      [2e-5, 2]
    ]
  },
  "QA_lstPexKine[Elbow]": {
    "red_x_points": [
      [-0.00242, 0],
      [-0.00071, 2],
      [-0.00124, 2],
      [-0.0009, 2],
      [-0.00295, 2],
      [0.00048, 1],
      [0.00073, 1],
      [-0.00211, 0],
      [-0.0044, 2],
      [0.00085, 1],
      [0.00059, 1],
      [0.00041, 1],
      [0.00019, 1],
      [-0.00061, 2],
      [-0.00201, 2],
      [0.00074, 1],
      [-0.00309, 2],
      [-0.0011, 2],
      [-0.0018, 2],
      [-0.0003, 1],
      [-0.00323, 0],
      [-0.00107, 1],
      [-0.00045, 2],
      [-0.00205, 2],
      [0.00033, 1],
      [-0.00331, 2],
      [-0.0013, 2],
      [-0.00082, 2],
      [-0.00079, 2],
      [-0.00253, 2],
      [-0.00298, 0],
      [-0.00229, 2]
    ],
    "red_o_points": [],
    "y_categories": ["NPV", "PV", "nan"],
    "blue_o_points": [],
    "blue_x_points": [
      [0.00068, 1],
      [-0.00081, 2],
      [0.00045, 1],
      [0.00279, 1],
      [0.00223, 1],
      [0.00041, 1],
      [0.01116, 0],
      [-0.00031, 2],
      [0.00429, 1],
      [0.00345, 1]
    ]
  },
  "QA_lstPexKine[Index]": {
    "red_x_points": [
      [-0.00191, 0],
      [-0.00053, 2],
      [-0.00131, 2],
      [-0.00065, 2],
      [-0.00298, 2],
      [0.0003, 1],
      [0.00069, 1],
      [-0.0027, 0],
      [-0.00521, 2],
      [0.00098, 1],
      [0.0006, 1],
      [0.00055, 1],
      [-0.00031, 1],
      [-0.00072, 2],
      [-0.00205, 2],
      [0.00048, 1],
      [-0.0032, 2],
      [-0.00087, 2],
      [-0.00145, 2],
      [-0.00152, 1],
      [-0.00277, 0],
      [-0.0013, 1],
      [-0.00065, 2],
      [-0.00196, 2],
      [-0.00093, 1],
      [-0.00378, 2],
      [-0.00119, 2],
      [-0.00082, 2],
      [-0.00083, 2],
      [-0.00252, 2],
      [-0.00257, 0],
      [-0.00284, 2]
    ],
    "red_o_points": [],
    "y_categories": ["NPV", "PV", "nan"],
    "blue_o_points": [],
    "blue_x_points": [
      [0.00048, 1],
      [-0.00073, 2],
      [0.00033, 1],
      [0.00344, 1],
      [0.00223, 1],
      [0.00057, 1],
      [0.01217, 0],
      [-0.00027, 2],
      [0.00433, 1],
      [0.0038, 1]
    ]
  },
  "QA_lstPexMuscstrength[ElbowFlex]": {
    "red_x_points": [
      [-0.00229, 1],
      [-0.00192, 2],
      [-0.00264, 1],
      [-0.00236, 1],
      [-0.00271, 1],
      [0.00637, 0],
      [-0.00304, 1],
      [-0.00289, 1],
      [-0.00278, 1],
      [-0.00323, 1],
      [-0.00337, 1],
      [-0.00366, 1],
      [-0.00287, 1],
      [-0.00194, 2],
      [-0.00244, 2],
      [-0.0028, 2],
      [-0.00275, 1],
      [-0.00233, 2],
      [-0.00237, 2],
      [-0.00268, 1],
      [-0.00236, 1],
      [-0.00197, 1],
      [-0.00229, 1],
      [-0.00224, 2],
      [0.00066, 0],
      [-0.00168, 1],
      [-0.00329, 1],
      [-0.0027, 1],
      [-0.00205, 2],
      [-0.00263, 1],
      [-0.00267, 1],
      [-0.00241, 2]
    ],
    "red_o_points": [],
    "y_categories": ["GREATER THAN OR EQUALS TO 3", "LESS THAN 3", "nan"],
    "blue_o_points": [],
    "blue_x_points": [
      [-0.00067, 2],
      [-0.00058, 2],
      [0.00802, 0],
      [-0.00032, 1],
      [0.0176, 0],
      [0.0085, 0],
      [-0.00102, 1],
      [0.00978, 0],
      [0.00078, 1],
      [7e-5, 1]
    ]
  },
  "QS_mulGraftRoot[C6]": {
    "red_x_points": [
      [0.0, 2],
      [-6e-5, 0],
      [-6e-5, 0],
      [-6e-5, 0],
      [0.0, 2],
      [-6e-5, 0],
      [-6e-5, 0],
      [0.0, 2],
      [-6e-5, 0],
      [-6e-5, 0],
      [0.0, 2],
      [8e-5, 1],
      [0.0, 2],
      [-6e-5, 0],
      [0.0, 2],
      [0.0, 2],
      [0.0, 2],
      [0.0, 2],
      [-6e-5, 0],
      [0.0, 2],
      [0.0, 2],
      [-6e-5, 0],
      [8e-5, 1],
      [-6e-5, 0]
    ],
    "red_o_points": [],
    "y_categories": ["N", "NOT APPLICABLE", "nan"],
    "blue_o_points": [],
    "blue_x_points": [
      [8e-5, 1],
      [8e-5, 1],
      [8e-5, 1],
      [0.0, 2],
      [8e-5, 1],
      [0.0, 2]
    ]
  },
  "QA_lstPexMuscstrength[FingersAddu]": {
    "red_x_points": [
      [0.00108, 0],
      [0.00021, 2],
      [-0.00381, 1],
      [-0.00371, 1],
      [-0.00454, 1],
      [0.00112, 0],
      [0.00125, 0],
      [-0.00393, 1],
      [0.00107, 0],
      [0.0014, 0],
      [0.0002, 2],
      [0.00136, 0],
      [0.00135, 0],
      [0.00025, 2],
      [0.00045, 2],
      [0.00015, 2],
      [0.00121, 0],
      [0.0002, 2],
      [0.00045, 2],
      [0.00139, 0],
      [-0.00442, 1],
      [0.00125, 0],
      [-0.00312, 1],
      [0.00039, 2],
      [0.00044, 2],
      [0.00036, 2],
      [0.00015, 2],
      [-0.0033, 1],
      [0.00034, 2],
      [-0.00542, 1],
      [-0.00409, 1],
      [0.00052, 2]
    ],
    "red_o_points": [],
    "y_categories": ["GREATER THAN OR EQUALS TO 3", "LESS THAN 3", "nan"],
    "blue_o_points": [],
    "blue_x_points": [
      [0.00018, 2],
      [0.00069, 2],
      [0.00127, 0],
      [0.00061, 2],
      [0.00249, 0],
      [0.00109, 0],
      [0.00296, 0],
      [0.00124, 0],
      [0.00077, 2],
      [0.00091, 2]
    ]
  },
  "QA_yonInjFracture": {
    "red_x_points": [
      [-0.00751, 0],
      [-0.00144, 2],
      [0.00099, 0],
      [-0.0017, 1],
      [-0.0076, 0],
      [0.00047, 0],
      [0.00059, 0],
      [-0.0024, 1],
      [0.00467, 2],
      [0.00121, 0],
      [-0.00299, 1],
      [-0.0043, 1],
      [-0.0075, 0],
      [-0.00077, 0],
      [0.00523, 1],
      [-0.00252, 1],
      [-0.00779, 0],
      [-0.00178, 1],
      [-0.00946, 0],
      [-0.00885, 0],
      [0.00575, 1],
      [-0.0088, 0],
      [-0.00098, 1],
      [-0.00856, 0],
      [-0.00929, 0],
      [-0.00875, 0],
      [0.00096, 0],
      [0.00088, 0],
      [-0.00781, 1],
      [0.00445, 2],
      [-0.00254, 1],
      [0.00437, 1]
    ],
    "red_o_points": [],
    "y_categories": ["N", "Y", "nan"],
    "blue_o_points": [],
    "blue_x_points": [
      [0.00249, 0],
      [0.00981, 1],
      [0.00081, 0],
      [0.00385, 0],
      [0.00274, 0],
      [0.00124, 1],
      [0.0087, 2],
      [0.00106, 0],
      [0.01099, 1],
      [0.01005, 2]
    ]
  },
  "QS_mulGraftNerve[Ac]": {
    "red_x_points": [
      [1e-5, 2],
      [-0.00074, 0],
      [-0.00099, 0],
      [-0.00062, 0],
      [-0.0001, 2],
      [-0.00099, 0],
      [-0.0009, 0],
      [-0.00075, 0],
      [-0.00023, 2],
      [-0.00071, 0],
      [-0.00087, 0],
      [-0.00083, 0],
      [-5e-5, 2],
      [0.00116, 1],
      [-0.00013, 2],
      [-0.00087, 0],
      [-1e-5, 2],
      [-0.00075, 0],
      [-4e-5, 2],
      [-0.00016, 2],
      [-4e-5, 2],
      [-0.00022, 2],
      [-0.00068, 0],
      [-3e-5, 2],
      [-0.00011, 2],
      [-4e-5, 2],
      [-0.00091, 0],
      [-0.00051, 0],
      [0.00116, 1],
      [-0.00016, 2],
      [-0.00058, 0],
      [-0.00018, 2]
    ],
    "red_o_points": [],
    "y_categories": ["N", "NOT APPLICABLE", "nan"],
    "blue_o_points": [],
    "blue_x_points": [
      [0.00172, 1],
      [4e-5, 2],
      [0.00174, 1],
      [-8e-5, 0],
      [-0.00018, 0],
      [0.00188, 1],
      [9e-5, 2],
      [0.0014, 1],
      [4e-5, 2],
      [0.00017, 2]
    ]
  },
  "QA_lstPexMuscstrength[FingersAbdu]": {
    "red_x_points": [
      [0.0002, 2],
      [5e-5, 2],
      [-0.00318, 1],
      [-0.0019, 1],
      [-0.00042, 1],
      [0.00119, 0],
      [0.00094, 0],
      [-0.00217, 1],
      [-0.00519, 0],
      [0.00146, 0],
      [0.00014, 2],
      [-0.00409, 1],
      [-0.00323, 0],
      [7e-5, 2],
      [0.00022, 2],
      [0.00013, 2],
      [-0.00238, 0],
      [-3e-5, 2],
      [0.0002, 2],
      [-0.0059, 0],
      [-0.00072, 1],
      [-0.00657, 0],
      [-0.00185, 1],
      [0.00036, 2],
      [0.00056, 2],
      [0.0003, 2],
      [-0.00276, 1],
      [-0.00209, 1],
      [0.0002, 2],
      [-0.0011, 1],
      [-0.00324, 1],
      [0.00033, 2]
    ],
    "red_o_points": [],
    "y_categories": ["GREATER THAN OR EQUALS TO 3", "LESS THAN 3", "nan"],
    "blue_o_points": [],
    "blue_x_points": [
      [9e-5, 2],
      [0.0006, 2],
      [0.00106, 0],
      [0.00192, 2],
      [0.00442, 0],
      [0.00105, 0],
      [0.0105, 1],
      [0.00105, 0],
      [0.00262, 2],
      [0.00298, 2]
    ]
  },
  "QS_mulNeuromadSite[C8]": {
    "red_x_points": [
      [-0.00074, 2],
      [-0.00273, 0],
      [-0.00187, 0],
      [-0.00224, 0],
      [-0.00071, 2],
      [-0.00321, 0],
      [-0.00231, 0],
      [-0.00267, 0],
      [-0.00082, 2],
      [-0.00275, 0],
      [-0.0026, 0],
      [-0.00267, 0],
      [-0.00102, 2],
      [0.00193, 1],
      [-0.00036, 2],
      [-0.00245, 0],
      [-0.00087, 2],
      [-0.00225, 0],
      [-0.0004, 2],
      [-0.00095, 2],
      [-0.00025, 2],
      [-0.00093, 2],
      [-0.00208, 0],
      [-0.00035, 2],
      [-0.00097, 2],
      [-0.00046, 2],
      [-0.00223, 0],
      [-0.0021, 0],
      [0.00263, 1],
      [-0.00043, 2],
      [-0.00163, 0],
      [-0.00038, 2]
    ],
    "red_o_points": [],
    "y_categories": ["N", "NOT APPLICABLE", "nan"],
    "blue_o_points": [],
    "blue_x_points": [
      [0.00751, 1],
      [0.00058, 2],
      [0.00573, 1],
      [0.00072, 0],
      [-0.00069, 0],
      [0.00526, 1],
      [-4e-5, 2],
      [0.00536, 1],
      [0.0, 2],
      [0.0002, 2]
    ]
  },
  "QS_mulTransfSite[AcSsPA]": {
    "red_x_points": [
      [-0.00057, 3],
      [-0.00157, 0],
      [-0.00152, 0],
      [-0.00176, 0],
      [-0.00023, 3],
      [-0.00185, 0],
      [-0.00142, 0],
      [-0.00172, 0],
      [-0.00057, 3],
      [-0.00169, 0],
      [-0.00191, 0],
      [-0.00186, 0],
      [-0.00038, 3],
      [0.00379, 1],
      [-0.00047, 3],
      [-0.00166, 0],
      [-0.00061, 3],
      [-0.00392, 2],
      [-0.00048, 3],
      [-0.00044, 3],
      [-0.00035, 3],
      [-0.00036, 3],
      [-0.00123, 0],
      [-0.00043, 3],
      [-0.00054, 3],
      [-0.00045, 3],
      [-0.00154, 0],
      [-0.00152, 0],
      [0.00243, 1],
      [-0.00041, 3],
      [-0.00135, 0],
      [-0.00062, 3]
    ],
    "red_o_points": [],
    "y_categories": ["N", "NOT APPLICABLE", "Y", "nan"],
    "blue_o_points": [],
    "blue_x_points": [
      [0.0052, 1],
      [3e-5, 3],
      [0.00379, 1],
      [-0.00016, 0],
      [-0.00096, 0],
      [0.00463, 1],
      [-0.00013, 3],
      [0.00492, 1],
      [-0.00019, 3],
      [-0.00011, 3]
    ]
  },
  "QA_lstPexMuscstrength[FingersFlex]": {
    "red_x_points": [
      [-1e-5, 0],
      [0.00018, 2],
      [-0.00272, 1],
      [-0.00156, 1],
      [0.0002, 0],
      [0.00042, 0],
      [0.0002, 0],
      [-0.00266, 1],
      [0.00017, 0],
      [0.0002, 0],
      [0.00033, 0],
      [0.00038, 0],
      [-0.00377, 1],
      [0.00025, 2],
      [0.00033, 2],
      [0.00031, 2],
      [0.00017, 0],
      [0.00027, 2],
      [0.00042, 2],
      [0.00019, 0],
      [-0.00293, 1],
      [0.00028, 0],
      [-0.00209, 1],
      [0.00045, 2],
      [0.00049, 2],
      [0.00048, 2],
      [0.00028, 0],
      [0.0002, 0],
      [0.00023, 2],
      [-0.00366, 1],
      [-0.00207, 1],
      [0.00038, 2]
    ],
    "red_o_points": [],
    "y_categories": ["GREATER THAN OR EQUALS TO 3", "LESS THAN 3", "nan"],
    "blue_o_points": [],
    "blue_x_points": [
      [0.00011, 2],
      [0.00048, 2],
      [0.00041, 0],
      [0.0014, 2],
      [0.00194, 0],
      [0.00028, 0],
      [0.00145, 0],
      [0.00032, 0],
      [0.00104, 2],
      [0.00144, 2]
    ]
  },
  "QA_lstPexPalle[Elbow]": {
    "red_x_points": [
      [-0.00195, 4],
      [-0.00074, 4],
      [-0.00128, 4],
      [-0.00092, 4],
      [-0.00142, 4],
      [-0.00376, 3],
      [-0.00276, 3],
      [-0.00138, 4],
      [-0.0016, 4],
      [-0.00148, 4],
      [0.00414, 1],
      [-0.00396, 3],
      [-0.00182, 1],
      [7e-5, 4],
      [-0.00137, 4],
      [-0.00092, 4],
      [-0.00119, 4],
      [-0.00091, 4],
      [-0.00085, 4],
      [0.00096, 3],
      [-0.00762, 0],
      [0.00026, 3],
      [-0.00271, 2],
      [-0.00118, 4],
      [-0.00194, 3],
      [-0.00157, 4],
      [-0.00136, 4],
      [-0.00101, 4],
      [-0.01224, 3],
      [-0.00134, 4],
      [-0.00473, 0],
      [-0.00145, 4]
    ],
    "red_o_points": [],
    "y_categories": ["ABS", "HYPO", "NAIA", "PT", "nan"],
    "blue_o_points": [],
    "blue_x_points": [
      [0.00101, 4],
      [-0.00058, 4],
      [0.00838, 1],
      [5e-5, 4],
      [0.01471, 1],
      [0.00127, 4],
      [0.00502, 3],
      [0.00096, 4],
      [0.00591, 3],
      [5e-5, 4]
    ]
  },
  "QA_lstPexMuscstrength[ScapulaAbducSuprot]": {
    "red_x_points": [
      [-0.00352, 0],
      [8e-5, 2],
      [-0.00171, 1],
      [-0.00132, 1],
      [-0.00276, 0],
      [0.00021, 0],
      [-0.00328, 1],
      [-0.00195, 1],
      [-0.00087, 1],
      [0.0008, 0],
      [-9e-5, 0],
      [-0.00363, 1],
      [-0.00095, 1],
      [0.00034, 2],
      [0.00079, 2],
      [0.00066, 2],
      [0.00134, 2],
      [0.00033, 2],
      [0.00092, 2],
      [-0.00687, 0],
      [2e-5, 1],
      [-0.00674, 0],
      [-0.00118, 1],
      [0.00105, 2],
      [-0.00595, 0],
      [0.00126, 2],
      [-0.00267, 1],
      [0.0002, 0],
      [0.00036, 2],
      [-0.00321, 0],
      [-0.00142, 1],
      [0.00081, 2]
    ],
    "red_o_points": [],
    "y_categories": ["GREATER THAN OR EQUALS TO 3", "LESS THAN 3", "nan"],
    "blue_o_points": [],
    "blue_x_points": [
      [0.00034, 2],
      [0.00125, 2],
      [0.00033, 0],
      [0.00361, 2],
      [0.00332, 0],
      [0.00027, 0],
      [0.00321, 2],
      [0.00057, 2],
      [0.00756, 1],
      [0.00391, 2]
    ]
  },
  "participant_code": {
    "red_x_points": [
      [-0.01864, 1],
      [-0.0197, 2],
      [-0.01982, 3],
      [-0.01811, 4],
      [-0.01864, 5],
      [-0.01888, 6],
      [-0.01876, 7],
      [-0.0187, 8],
      [-0.01817, 9],
      [-0.0187, 10],
      [-0.01917, 11],
      [-0.01894, 12],
      [-0.01882, 13],
      [-0.01876, 15],
      [-0.01882, 17],
      [-0.02005, 18],
      [-0.01929, 20],
      [-0.01911, 21],
      [-0.01906, 22],
      [-0.01835, 24],
      [-0.01847, 26],
      [-0.01917, 27],
      [-0.01923, 28],
      [-0.01906, 30],
      [-0.01911, 31],
      [-0.01864, 32],
      [-0.01876, 34],
      [-0.01911, 36],
      [-0.01876, 38],
      [-0.018, 39],
      [-0.01858, 40],
      [-0.0187, 41]
    ],
    "red_o_points": [],
    "y_categories": [
      "P16554",
      "P18297",
      "P19283",
      "P19287",
      "P23391",
      "P30595",
      "P31645",
      "P31691",
      "P34778",
      "P35046",
      "P36328",
      "P43633",
      "P4544",
      "P46417",
      "P48965",
      "P53068",
      "P5497",
      "P59529",
      "P62483",
      "P64658",
      "P65202",
      "P66816",
      "P6751",
      "P7408",
      "P75566",
      "P76226",
      "P79971",
      "P82621",
      "P82990",
      "P84549",
      "P84932",
      "P85825",
      "P86989",
      "P8770",
      "P87791",
      "P90550",
      "P93159",
      "P94969",
      "P96710",
      "P97130",
      "P9744",
      "P98500",
      "nan"
    ],
    "blue_o_points": [],
    "blue_x_points": [
      [0.03994, 0],
      [0.04093, 14],
      [0.03811, 16],
      [0.03994, 19],
      [0.03896, 23],
      [0.03712, 25],
      [0.0398, 29],
      [0.04023, 33],
      [0.04178, 35],
      [0.0398, 37]
    ]
  },
  "QA_lstPexMuscstrength[ShoulderExrot]": {
    "red_x_points": [
      [-0.00156, 1],
      [0.00028, 2],
      [0.00062, 0],
      [-0.00119, 1],
      [4e-5, 2],
      [-0.00188, 1],
      [-0.00141, 1],
      [0.00033, 2],
      [-0.00126, 1],
      [-0.00185, 1],
      [-0.0017, 1],
      [0.00012, 2],
      [-0.00159, 1],
      [0.00019, 2],
      [9e-5, 2],
      [0.00022, 2],
      [0.00013, 2],
      [0.00018, 2],
      [0.00012, 2],
      [-0.00156, 1],
      [-0.00138, 1],
      [-0.0017, 1],
      [0.00015, 2],
      [0.00016, 2],
      [9e-5, 2],
      [0.00015, 2],
      [-0.0014, 1],
      [0.00057, 0],
      [0.00024, 2],
      [0.00027, 2],
      [-0.0013, 1],
      [0.00021, 2]
    ],
    "red_o_points": [],
    "y_categories": ["GREATER THAN OR EQUALS TO 3", "LESS THAN 3", "nan"],
    "blue_o_points": [],
    "blue_x_points": [
      [0.0001, 2],
      [0.00029, 2],
      [0.00404, 0],
      [0.00083, 2],
      [-0.00044, 1],
      [0.00392, 0],
      [0.0003, 2],
      [-0.00019, 1],
      [0.00024, 2],
      [0.00017, 2]
    ]
  },
  "QS_mulGraftNerve[Ul]": {
    "red_x_points": [
      [-0.00017, 2],
      [-0.00025, 0],
      [-0.00029, 0],
      [-0.00013, 0],
      [-0.00011, 2],
      [-0.00024, 0],
      [-0.00024, 0],
      [-0.00027, 0],
      [-0.00025, 2],
      [-0.00048, 0],
      [-0.00037, 0],
      [-0.00029, 0],
      [-0.00028, 2],
      [0.00027, 1],
      [-0.00019, 2],
      [-0.00027, 0],
      [-0.00024, 2],
      [-0.00028, 0],
      [-0.00025, 2],
      [-0.0001, 2],
      [-0.00011, 2],
      [-0.00027, 2],
      [-0.00016, 0],
      [-0.00013, 2],
      [-0.00025, 2],
      [-0.00018, 2],
      [-0.00024, 0],
      [-0.00016, 0],
      [0.00049, 1],
      [-0.00014, 2],
      [-0.0003, 0],
      [-0.00018, 2]
    ],
    "red_o_points": [],
    "y_categories": ["N", "NOT APPLICABLE", "nan"],
    "blue_o_points": [],
    "blue_x_points": [
      [0.00142, 1],
      [-0.00011, 2],
      [0.00103, 1],
      [-0.0, 0],
      [-9e-5, 0],
      [0.00091, 1],
      [-5e-5, 2],
      [0.00105, 1],
      [-8e-5, 2],
      [-0.00012, 2]
    ]
  },
  "QS_mulGraftNerve[Ssr]": {
    "red_x_points": [
      [2e-5, 2],
      [-6e-5, 0],
      [-6e-5, 0],
      [-0.00013, 0],
      [-8e-5, 2],
      [-8e-5, 0],
      [-1e-5, 0],
      [-0.00013, 0],
      [-8e-5, 2],
      [-0.00013, 0],
      [-7e-5, 0],
      [-8e-5, 2],
      [7e-5, 1],
      [-6e-5, 0],
      [3e-5, 2],
      [-0.00013, 0],
      [-4e-5, 2],
      [-9e-5, 2],
      [2e-5, 2],
      [-9e-5, 2],
      [-7e-5, 0],
      [-7e-5, 0],
      [8e-5, 1],
      [3e-5, 2]
    ],
    "red_o_points": [],
    "y_categories": ["N", "NOT APPLICABLE", "nan"],
    "blue_o_points": [],
    "blue_x_points": [
      [0.00018, 1],
      [-3e-5, 2],
      [0.00018, 1],
      [3e-5, 0],
      [-1e-5, 0],
      [0.00017, 1],
      [0.00017, 1],
      [3e-5, 2]
    ]
  },
  "QS_mulGraftNerve[MCA]": {
    "red_x_points": [
      [-2e-5, 2],
      [-3e-5, 0],
      [-3e-5, 0],
      [-2e-5, 2],
      [-3e-5, 0],
      [-3e-5, 0],
      [-2e-5, 2],
      [-3e-5, 0],
      [-3e-5, 0],
      [-3e-5, 0],
      [-2e-5, 2],
      [-2e-5, 2],
      [-3e-5, 0],
      [-3e-5, 0],
      [-2e-5, 2],
      [-2e-5, 2],
      [-3e-5, 0],
      [-2e-5, 2],
      [-2e-5, 2],
      [-3e-5, 0],
      [-3e-5, 0],
      [-2e-5, 2],
      [-3e-5, 0],
      [-2e-5, 2]
    ],
    "red_o_points": [],
    "y_categories": ["N", "NOT APPLICABLE", "nan"],
    "blue_o_points": [],
    "blue_x_points": [
      [0.00014, 1],
      [-2e-5, 2],
      [0.00014, 1],
      [-3e-5, 0],
      [-3e-5, 0],
      [0.00014, 1],
      [-2e-5, 2],
      [0.00014, 1],
      [-2e-5, 2]
    ]
  },
  "QS_mulBpsurgeryType[Lysis]": {
    "red_x_points": [
      [-0.00178, 3],
      [-0.00441, 0],
      [-0.01242, 2],
      [-0.00501, 0],
      [-0.00165, 3],
      [-0.00556, 0],
      [-0.01166, 2],
      [-0.00463, 0],
      [-0.00203, 3],
      [-0.00504, 0],
      [-0.0049, 0],
      [-0.00488, 0],
      [-0.00227, 3],
      [0.01182, 1],
      [-0.00168, 3],
      [-0.00547, 0],
      [-0.00181, 3],
      [-0.01077, 2],
      [-0.00206, 3],
      [-0.00197, 3],
      [-0.00149, 3],
      [-0.00196, 3],
      [-0.00478, 0],
      [-0.00203, 3],
      [-0.00223, 3],
      [-0.00162, 3],
      [-0.00494, 0],
      [-0.00469, 0],
      [0.01281, 1],
      [-0.00139, 3],
      [-0.01133, 2],
      [-0.00162, 3]
    ],
    "red_o_points": [],
    "y_categories": ["N", "NOT APPLICABLE", "Y", "nan"],
    "blue_o_points": [],
    "blue_x_points": [
      [0.01814, 1],
      [-0.00067, 3],
      [0.01573, 1],
      [0.00035, 0],
      [-0.00115, 0],
      [0.01466, 1],
      [-0.00076, 3],
      [0.01758, 1],
      [-0.001, 3],
      [-0.00037, 3]
    ]
  },
  "QS_mulGraftTrunk[UpperTrunk]": {
    "red_x_points": [
      [-0.00036, 3],
      [-0.00199, 0],
      [-0.00157, 0],
      [-0.00194, 0],
      [-0.00034, 3],
      [-0.00209, 0],
      [-0.00178, 0],
      [-0.00195, 0],
      [-0.00036, 3],
      [-0.00199, 0],
      [-0.00188, 0],
      [-0.00185, 0],
      [-0.00029, 3],
      [0.00324, 1],
      [-0.00022, 3],
      [-0.00543, 2],
      [-0.00053, 3],
      [-0.0023, 0],
      [-0.00021, 3],
      [-0.00048, 3],
      [-0.00028, 3],
      [-0.00056, 3],
      [-0.00192, 0],
      [-0.00027, 3],
      [-0.00025, 3],
      [-0.00032, 3],
      [-0.00204, 0],
      [-0.00155, 0],
      [0.00408, 1],
      [-0.0002, 3],
      [-0.00181, 0],
      [-0.00033, 3]
    ],
    "red_o_points": [],
    "y_categories": ["N", "NOT APPLICABLE", "Y", "nan"],
    "blue_o_points": [],
    "blue_x_points": [
      [0.0057, 1],
      [0.00015, 3],
      [0.00521, 1],
      [-0.00063, 0],
      [-0.00089, 0],
      [0.00475, 1],
      [-0.0, 3],
      [0.00386, 1],
      [-0.00017, 3],
      [0.00025, 3]
    ]
  },
  "QS_mulGraftRoot[C8]": {
    "red_x_points": [
      [1e-5, 2],
      [-3e-5, 0],
      [-3e-5, 0],
      [-3e-5, 0],
      [1e-5, 2],
      [-3e-5, 0],
      [-3e-5, 0],
      [-3e-5, 0],
      [1e-5, 2],
      [1e-5, 2],
      [1e-5, 2],
      [1e-5, 2],
      [1e-5, 2],
      [1e-5, 2],
      [-3e-5, 0],
      [-3e-5, 0],
      [-3e-5, 0],
      [1e-5, 2]
    ],
    "red_o_points": [],
    "y_categories": ["N", "NOT APPLICABLE", "nan"],
    "blue_o_points": [],
    "blue_x_points": [[0.00017, 1], [1e-5, 2]]
  },
  "QA_mulInjTbpiCause[Motorcycle]": {
    "red_x_points": [
      [-0.00303, 0],
      [-0.00066, 1],
      [-0.00077, 1],
      [-0.00066, 1],
      [-0.00015, 1],
      [-0.00077, 1],
      [-0.00041, 1],
      [-0.00058, 1],
      [-0.00022, 1],
      [-0.00094, 1],
      [-0.00077, 1],
      [-0.00032, 1],
      [-0.00457, 0],
      [-0.02956, 1],
      [-0.00035, 1],
      [-0.00093, 1],
      [-0.00065, 1],
      [-0.0007, 1],
      [-0.00072, 1],
      [-0.00862, 0],
      [-1e-5, 1],
      [0.00178, 1],
      [-0.0004, 1],
      [-0.00047, 1],
      [-0.00052, 1],
      [-0.00472, 0],
      [-0.00042, 1],
      [-0.00073, 1],
      [-0.02866, 1],
      [-0.00038, 1],
      [-0.00041, 1],
      [-0.00062, 1]
    ],
    "red_o_points": [],
    "y_categories": ["N", "Y", "nan"],
    "blue_o_points": [],
    "blue_x_points": [
      [0.01444, 0],
      [-0.00035, 1],
      [0.01157, 0],
      [-0.00084, 1],
      [-0.00048, 1],
      [0.01263, 0],
      [0.00302, 1],
      [0.01378, 0],
      [0.0039, 1],
      [0.00249, 1]
    ]
  },
  "QA_yonInjUnconscio": {
    "red_x_points": [
      [-0.00582, 1],
      [-0.00665, 1],
      [-0.00334, 2],
      [-0.00311, 2],
      [-0.00334, 2],
      [0.01601, 0],
      [-0.00668, 1],
      [-0.00383, 2],
      [-0.00316, 2],
      [-0.00388, 2],
      [-0.00328, 2],
      [-0.00812, 1],
      [-0.00721, 1],
      [-0.01524, 1],
      [-0.00541, 2],
      [-0.00356, 2],
      [-0.00381, 2],
      [-0.00672, 1],
      [0.00451, 0],
      [-0.0083, 1],
      [-0.00634, 1],
      [-0.00791, 1],
      [-0.00606, 1],
      [-0.00483, 2],
      [-0.0083, 1],
      [-0.00376, 2],
      [-0.0075, 1],
      [-0.00646, 1],
      [-0.0015, 2],
      [-0.00397, 2],
      [-0.00672, 1],
      [-0.00389, 2]
    ],
    "red_o_points": [],
    "y_categories": ["N", "Y", "nan"],
    "blue_o_points": [],
    "blue_x_points": [
      [0.00016, 2],
      [0.00806, 1],
      [0.01577, 0],
      [0.02239, 0],
      [0.02248, 0],
      [0.00024, 2],
      [-0.00201, 1],
      [0.00048, 2],
      [0.02492, 0],
      [-0.00038, 2]
    ]
  },
  "QS_mulGraftLevel[Trunk]": {
    "red_x_points": [
      [-0.00017, 3],
      [-0.00114, 0],
      [-0.00133, 0],
      [-0.00127, 0],
      [-0.00021, 3],
      [-0.00119, 0],
      [-0.00127, 0],
      [-0.00124, 0],
      [-0.0002, 3],
      [-0.00126, 0],
      [-0.00141, 0],
      [-0.00127, 0],
      [-0.00025, 3],
      [0.00247, 1],
      [-0.00023, 3],
      [-0.004, 2],
      [-0.00029, 3],
      [-0.00084, 0],
      [-0.00019, 3],
      [-0.00021, 3],
      [-0.00013, 3],
      [-0.00031, 3],
      [-0.00118, 0],
      [-0.00018, 3],
      [-0.00018, 3],
      [-0.00025, 3],
      [-0.00106, 0],
      [-0.00116, 0],
      [0.00198, 1],
      [-0.00025, 3],
      [-0.00123, 0],
      [-0.00039, 3]
    ],
    "red_o_points": [],
    "y_categories": ["N", "NOT APPLICABLE", "Y", "nan"],
    "blue_o_points": [],
    "blue_x_points": [
      [0.00372, 1],
      [-0.0001, 3],
      [0.00242, 1],
      [5e-5, 0],
      [-0.00089, 0],
      [0.00347, 1],
      [0.0, 3],
      [0.00331, 1],
      [-0.0, 3],
      [0.00011, 3]
    ]
  },
  "QA_yonPreOrtsurg": {
    "red_x_points": [
      [-0.00083, 0],
      [-0.0001, 2],
      [0.00016, 0],
      [-1e-5, 0],
      [-0.00077, 0],
      [7e-5, 0],
      [4e-5, 0],
      [0.00015, 0],
      [0.00057, 2],
      [1e-5, 0],
      [1e-5, 0],
      [-0.00029, 2],
      [-0.00158, 1],
      [0.00013, 0],
      [0.00161, 2],
      [2e-5, 0],
      [-0.00097, 0],
      [-0.00068, 1],
      [-0.00557, 1],
      [-0.00073, 0],
      [-0.00037, 0],
      [-0.0007, 0],
      [3e-5, 0],
      [-0.00237, 0],
      [-0.00068, 0],
      [-0.00166, 0],
      [-0.0001, 2],
      [0.0, 0],
      [1e-5, 2],
      [-0.00078, 0],
      [-0.00087, 1],
      [0.00159, 2]
    ],
    "red_o_points": [],
    "y_categories": ["N", "Y", "nan"],
    "blue_o_points": [],
    "blue_x_points": [
      [8e-5, 0],
      [0.00267, 2],
      [0.00027, 0],
      [0.00087, 0],
      [0.00046, 0],
      [0.00018, 0],
      [0.00076, 2],
      [0.00014, 0],
      [0.00139, 2],
      [0.00172, 2]
    ]
  },
  "QS_mulGraftNerve[MP]": {
    "red_x_points": [
      [-0.0, 2],
      [-3e-5, 0],
      [-3e-5, 0],
      [-3e-5, 0],
      [-3e-5, 0],
      [-3e-5, 0],
      [-0.0, 2],
      [-3e-5, 0],
      [-3e-5, 0],
      [7e-5, 1],
      [-0.0, 2],
      [-3e-5, 0],
      [-3e-5, 0],
      [-0.0, 2],
      [-0.0, 2],
      [-0.0, 2],
      [-0.0, 2],
      [-0.0, 2],
      [-0.0, 2],
      [-3e-5, 0],
      [-3e-5, 0],
      [7e-5, 1],
      [-0.0, 2],
      [-3e-5, 0]
    ],
    "red_o_points": [],
    "y_categories": ["N", "NOT APPLICABLE", "nan"],
    "blue_o_points": [],
    "blue_x_points": [
      [7e-5, 1],
      [-0.0, 2],
      [-3e-5, 0],
      [-3e-5, 0],
      [-0.0, 2],
      [7e-5, 1],
      [-0.0, 2]
    ]
  },
  "QS_mulGraftNerve[Ax]": {
    "red_x_points": [
      [-3e-5, 2],
      [-6e-5, 0],
      [-0.00012, 0],
      [-0.00012, 0],
      [3e-5, 2],
      [-0.00031, 0],
      [-0.00013, 0],
      [-0.00012, 0],
      [-9e-5, 2],
      [-6e-5, 0],
      [-6e-5, 0],
      [-0.00012, 0],
      [-1e-5, 2],
      [0.00014, 1],
      [2e-5, 2],
      [-6e-5, 0],
      [-0.00011, 2],
      [-0.00012, 0],
      [3e-5, 2],
      [-0.00011, 2],
      [3e-5, 2],
      [-6e-5, 0],
      [1e-5, 2],
      [3e-5, 2],
      [3e-5, 2],
      [-0.00012, 0],
      [0.00014, 1],
      [3e-5, 2],
      [-0.00012, 0],
      [2e-5, 2]
    ],
    "red_o_points": [],
    "y_categories": ["N", "NOT APPLICABLE", "nan"],
    "blue_o_points": [],
    "blue_x_points": [
      [0.0003, 1],
      [3e-5, 2],
      [0.00016, 1],
      [-2e-5, 0],
      [0.00019, 1],
      [1e-5, 2],
      [0.00021, 1],
      [2e-5, 2],
      [3e-5, 2]
    ]
  },
  "QA_lstPexTouch[C7]": {
    "red_x_points": [
      [-0.00657, 1],
      [-0.00178, 2],
      [-0.00244, 1],
      [-0.00151, 2],
      [-0.00627, 1],
      [0.00182, 0],
      [-0.00215, 1],
      [-0.0021, 1],
      [0.00452, 0],
      [-0.00269, 1],
      [0.00148, 0],
      [-0.00296, 1],
      [-0.00679, 1],
      [-0.00724, 2],
      [-0.00369, 2],
      [-0.00196, 2],
      [-0.00571, 1],
      [-0.00147, 2],
      [-0.00388, 2],
      [0.00526, 0],
      [-0.00861, 1],
      [0.00529, 0],
      [-0.00189, 2],
      [-0.00379, 2],
      [0.00299, 0],
      [0.00568, 0],
      [-0.00238, 1],
      [-0.00189, 2],
      [-0.00125, 1],
      [-0.00298, 2],
      [-0.00225, 1],
      [-0.00773, 1]
    ],
    "red_o_points": [],
    "y_categories": ["NORM", "NPV", "nan"],
    "blue_o_points": [],
    "blue_x_points": [
      [-0.00029, 1],
      [0.00027, 2],
      [0.00063, 1],
      [0.00078, 1],
      [0.00797, 0],
      [0.00027, 1],
      [0.00848, 0],
      [0.00386, 0],
      [0.00828, 0],
      [0.0089, 0]
    ]
  },
  "QA_lstPexMuscstrength[ElbowExte]": {
    "red_x_points": [
      [-0.00108, 1],
      [-0.0008, 2],
      [0.00018, 1],
      [7e-5, 1],
      [-0.00077, 1],
      [-0.00438, 0],
      [0.00066, 1],
      [8e-5, 1],
      [3e-5, 1],
      [-0.00439, 0],
      [-0.00301, 0],
      [0.00087, 1],
      [0.00018, 1],
      [-0.00044, 2],
      [-0.00135, 2],
      [-0.00107, 2],
      [-0.00078, 1],
      [-0.00049, 2],
      [-0.00144, 2],
      [-0.00607, 0],
      [-0.0012, 1],
      [-0.00627, 0],
      [-2e-5, 1],
      [-0.00129, 2],
      [-0.00608, 0],
      [-0.00337, 0],
      [0.00085, 1],
      [-0.00086, 2],
      [-0.00075, 2],
      [-0.00089, 1],
      [0.00013, 1],
      [-0.00107, 2]
    ],
    "red_o_points": [],
    "y_categories": ["GREATER THAN OR EQUALS TO 3", "LESS THAN 3", "nan"],
    "blue_o_points": [],
    "blue_x_points": [
      [0.00019, 2],
      [0.00021, 2],
      [-0.00014, 0],
      [0.00428, 1],
      [0.00474, 1],
      [0.00027, 0],
      [0.00389, 0],
      [9e-5, 0],
      [0.0092, 1],
      [0.00591, 1]
    ]
  },
  "QS_mulGraftNerve[MCF]": {
    "red_x_points": [
      [-4e-5, 2],
      [-0.00012, 0],
      [-0.0002, 0],
      [-9e-5, 0],
      [-3e-5, 2],
      [-0.0002, 0],
      [-0.00011, 0],
      [-2e-5, 0],
      [1e-5, 2],
      [-0.00014, 0],
      [-0.0002, 0],
      [-0.00018, 0],
      [1e-5, 2],
      [0.00016, 1],
      [-1e-5, 2],
      [-0.0002, 0],
      [1e-5, 2],
      [-0.0002, 0],
      [-3e-5, 2],
      [1e-5, 2],
      [-2e-5, 2],
      [-1e-5, 2],
      [-0.00014, 0],
      [1e-5, 2],
      [-1e-5, 2],
      [-1e-5, 2],
      [-0.00016, 0],
      [-0.0002, 0],
      [0.00034, 1],
      [-1e-5, 2],
      [-0.00012, 0],
      [1e-5, 2]
    ],
    "red_o_points": [],
    "y_categories": ["N", "NOT APPLICABLE", "nan"],
    "blue_o_points": [],
    "blue_x_points": [
      [0.00041, 1],
      [1e-5, 2],
      [0.00023, 1],
      [-3e-5, 0],
      [-6e-5, 0],
      [0.00023, 1],
      [3e-5, 2],
      [0.00048, 1],
      [-4e-5, 2],
      [1e-5, 2]
    ]
  },
  "QS_mulGraftTrunk[LowerTrunk]": {
    "red_x_points": [
      [-1e-5, 2],
      [-0.00014, 0],
      [-0.00012, 0],
      [-0.00014, 0],
      [-0.0, 2],
      [-8e-5, 0],
      [-0.00014, 0],
      [-1e-5, 2],
      [-0.00014, 0],
      [-8e-5, 0],
      [-0.00012, 0],
      [-2e-5, 2],
      [0.00022, 1],
      [-1e-5, 2],
      [-3e-5, 0],
      [-1e-5, 2],
      [-0.00012, 0],
      [-1e-5, 2],
      [-1e-5, 2],
      [-2e-5, 2],
      [-1e-5, 2],
      [-8e-5, 0],
      [-1e-5, 2],
      [-0.0, 2],
      [-1e-5, 2],
      [-0.00012, 0],
      [-0.00014, 0],
      [-1e-5, 2],
      [-0.00014, 0],
      [-1e-5, 2]
    ],
    "red_o_points": [],
    "y_categories": ["N", "NOT APPLICABLE", "nan"],
    "blue_o_points": [],
    "blue_x_points": [
      [0.00025, 1],
      [-1e-5, 2],
      [0.00011, 1],
      [-3e-5, 0],
      [0.00011, 1],
      [-1e-5, 2],
      [0.00036, 1],
      [-1e-5, 2],
      [-1e-5, 2]
    ]
  },
  "QS_mulLysisSite[Nerve]": {
    "red_x_points": [
      [-0.00029, 3],
      [-0.00114, 0],
      [-0.00305, 2],
      [-0.00119, 0],
      [-0.00038, 3],
      [-0.00096, 0],
      [-0.00116, 0],
      [-0.00107, 0],
      [-0.00046, 3],
      [-0.00118, 0],
      [-0.00114, 0],
      [-0.00115, 0],
      [-0.00037, 3],
      [0.00252, 1],
      [-0.00037, 3],
      [-0.00094, 0],
      [-0.00041, 3],
      [-0.00097, 0],
      [-0.00034, 3],
      [-0.00042, 3],
      [-0.00037, 3],
      [-0.00032, 3],
      [-0.00107, 0],
      [-0.00038, 3],
      [-0.00043, 3],
      [-0.00036, 3],
      [-0.00104, 0],
      [-0.00096, 0],
      [0.00272, 1],
      [-0.0004, 3],
      [-0.001, 0],
      [-0.00037, 3]
    ],
    "red_o_points": [],
    "y_categories": ["N", "NOT APPLICABLE", "Y", "nan"],
    "blue_o_points": [],
    "blue_x_points": [
      [0.0039, 1],
      [-0.00017, 3],
      [0.00309, 1],
      [-0.00069, 0],
      [-0.00039, 0],
      [0.00299, 1],
      [-0.00011, 3],
      [0.00348, 1],
      [-0.00021, 3],
      [-0.00021, 3]
    ]
  },
  "QS_mulGraftNerve[TD]": {
    "red_x_points": [
      [-9e-5, 2],
      [-0.00023, 0],
      [-0.00018, 0],
      [-0.00027, 0],
      [-8e-5, 2],
      [-0.00015, 0],
      [-0.00015, 0],
      [-0.00021, 0],
      [-3e-5, 2],
      [-0.00024, 0],
      [-0.00017, 0],
      [-0.00016, 0],
      [-0.00015, 2],
      [0.00028, 1],
      [-7e-5, 2],
      [-0.00018, 0],
      [-1e-5, 2],
      [-0.00024, 0],
      [-6e-5, 2],
      [-7e-5, 2],
      [-8e-5, 2],
      [-3e-5, 2],
      [-0.00021, 0],
      [-8e-5, 2],
      [-5e-5, 2],
      [-8e-5, 2],
      [-0.00027, 0],
      [-0.00024, 0],
      [0.00018, 1],
      [-8e-5, 2],
      [-0.00024, 0],
      [-8e-5, 2]
    ],
    "red_o_points": [],
    "y_categories": ["N", "NOT APPLICABLE", "nan"],
    "blue_o_points": [],
    "blue_x_points": [
      [0.00065, 1],
      [-5e-5, 2],
      [0.00067, 1],
      [-9e-5, 0],
      [-0.00017, 0],
      [0.00061, 1],
      [-4e-5, 2],
      [0.00078, 1],
      [-5e-5, 2],
      [-8e-5, 2]
    ]
  },
  "QS_mulGraftLevel[other]": {
    "red_x_points": [
      [-2e-5, 0],
      [-2e-5, 0],
      [-2e-5, 0],
      [-1e-5, 2],
      [-2e-5, 0],
      [-2e-5, 0],
      [-2e-5, 0],
      [-2e-5, 0],
      [-2e-5, 0],
      [7e-5, 1],
      [-1e-5, 2],
      [-2e-5, 0],
      [-1e-5, 2],
      [-2e-5, 0],
      [-1e-5, 2],
      [-1e-5, 2],
      [-1e-5, 2],
      [-1e-5, 2],
      [-2e-5, 0],
      [-2e-5, 0],
      [7e-5, 1],
      [-1e-5, 2],
      [-2e-5, 0],
      [-1e-5, 2]
    ],
    "red_o_points": [],
    "y_categories": ["N", "NOT APPLICABLE", "nan"],
    "blue_o_points": [],
    "blue_x_points": [
      [7e-5, 1],
      [-1e-5, 2],
      [-2e-5, 0],
      [-2e-5, 0],
      [7e-5, 1],
      [-1e-5, 2],
      [7e-5, 1],
      [-1e-5, 2]
    ]
  },
  "QS_lstBpsurgSide": {
    "red_x_points": [
      [-0.00151, 3],
      [-0.00448, 0],
      [-0.00524, 0],
      [-0.0051, 0],
      [-0.0015, 3],
      [-0.00586, 2],
      [-0.00604, 0],
      [-0.00576, 0],
      [-0.00138, 3],
      [-0.00569, 0],
      [-0.0054, 2],
      [-0.00597, 2],
      [-0.00135, 3],
      [0.00864, 1],
      [-0.00125, 3],
      [-0.00622, 2],
      [-0.00189, 3],
      [-0.00555, 2],
      [-0.00178, 3],
      [-0.00159, 3],
      [-0.00107, 3],
      [-0.0015, 3],
      [-0.00434, 0],
      [-0.00143, 3],
      [-0.00202, 3],
      [-0.0014, 3],
      [-0.00502, 2],
      [-0.00501, 2],
      [0.00803, 1],
      [-0.00138, 3],
      [-0.00532, 0],
      [-0.00143, 3]
    ],
    "red_o_points": [],
    "y_categories": ["L", "NOT APPLICABLE", "R", "nan"],
    "blue_o_points": [],
    "blue_x_points": [
      [0.01325, 1],
      [-0.00014, 3],
      [0.0123, 1],
      [0.0035, 0],
      [0.00021, 2],
      [0.01142, 1],
      [-0.00035, 3],
      [0.01164, 1],
      [-0.00033, 3],
      [-0.00039, 3]
    ]
  },
  "QS_mulTransfSite[AcMc]": {
    "red_x_points": [
      [-0.0004, 3],
      [-0.00145, 0],
      [-0.00106, 0],
      [-0.00131, 0],
      [-0.00045, 3],
      [-0.00132, 0],
      [-0.00124, 0],
      [-0.00114, 0],
      [-0.00033, 3],
      [-0.00152, 0],
      [-0.00132, 0],
      [-0.00662, 2],
      [-0.0003, 3],
      [0.00301, 1],
      [-0.00033, 3],
      [-0.00137, 0],
      [-0.00038, 3],
      [-0.00129, 0],
      [-0.00046, 3],
      [-0.00063, 3],
      [-0.00044, 3],
      [-0.00045, 3],
      [-0.0013, 0],
      [-0.00035, 3],
      [-0.00033, 3],
      [-0.00045, 3],
      [-0.00135, 0],
      [-0.00129, 0],
      [0.00326, 1],
      [-0.00028, 3],
      [-0.00126, 0],
      [-0.00043, 3]
    ],
    "red_o_points": [],
    "y_categories": ["N", "NOT APPLICABLE", "Y", "nan"],
    "blue_o_points": [],
    "blue_x_points": [
      [0.00416, 1],
      [-0.00015, 3],
      [0.00372, 1],
      [0.00053, 0],
      [-0.00034, 0],
      [0.00317, 1],
      [-0.00016, 3],
      [0.00397, 1],
      [-0.00026, 3],
      [-0.00012, 3]
    ]
  },
  "QS_mulTransfSite[Other]": {
    "red_x_points": [
      [-0.00194, 3],
      [-0.01079, 0],
      [-0.01089, 0],
      [-0.01117, 0],
      [-0.00237, 3],
      [-0.01142, 0],
      [-0.01059, 0],
      [-0.01073, 0],
      [-0.00247, 3],
      [-0.01135, 0],
      [-0.01163, 0],
      [-0.01118, 0],
      [-0.00214, 3],
      [0.01692, 1],
      [-0.00207, 3],
      [-0.01122, 0],
      [-0.00211, 3],
      [-0.00982, 0],
      [-0.00238, 3],
      [-0.00205, 3],
      [-0.00223, 3],
      [-0.00216, 3],
      [-0.01068, 0],
      [-0.00235, 3],
      [-0.00245, 3],
      [-0.00184, 3],
      [-0.01069, 0],
      [-0.01046, 0],
      [0.01672, 1],
      [-0.00225, 3],
      [-0.01035, 0],
      [-0.00208, 3]
    ],
    "red_o_points": [],
    "y_categories": ["N", "NOT APPLICABLE", "Y", "nan"],
    "blue_o_points": [],
    "blue_x_points": [
      [0.01916, 1],
      [-0.00083, 3],
      [0.01727, 1],
      [-0.00514, 0],
      [0.03367, 2],
      [0.01874, 1],
      [-0.00126, 3],
      [0.01872, 1],
      [-0.00128, 3],
      [-0.00106, 3]
    ]
  },
  "QA_lstPexTouch[C8]": {
    "red_x_points": [
      [-0.00638, 1],
      [-0.00174, 2],
      [-0.00219, 1],
      [-0.00143, 2],
      [-0.0067, 1],
      [0.00159, 0],
      [-0.00175, 1],
      [-0.0025, 1],
      [0.00465, 0],
      [-0.00211, 1],
      [0.00167, 0],
      [0.00213, 0],
      [-0.00713, 1],
      [-0.00891, 2],
      [-0.00343, 2],
      [-0.0018, 2],
      [-0.00718, 1],
      [-0.00191, 2],
      [-0.00307, 2],
      [0.00451, 0],
      [-0.00672, 1],
      [0.00407, 0],
      [-0.00193, 2],
      [-0.00315, 2],
      [0.00366, 0],
      [0.00484, 0],
      [-0.00248, 1],
      [-0.00158, 2],
      [-0.00554, 1],
      [-0.00356, 2],
      [-0.00198, 1],
      [-0.00746, 1]
    ],
    "red_o_points": [],
    "y_categories": ["NORM", "NPV", "nan"],
    "blue_o_points": [],
    "blue_x_points": [
      [0.00718, 0],
      [-0.00029, 2],
      [3e-5, 1],
      [0.00085, 1],
      [0.00446, 0],
      [5e-5, 1],
      [0.0069, 0],
      [0.00448, 0],
      [0.00751, 0],
      [0.00905, 0]
    ]
  },
  "QS_mulLysisNerve[Ssr]": {
    "red_x_points": [
      [-0.00054, 3],
      [-0.00114, 0],
      [-0.00405, 2],
      [-0.00129, 0],
      [-0.00054, 3],
      [-0.00116, 0],
      [-0.001, 0],
      [-0.00102, 0],
      [-0.0007, 3],
      [-0.00131, 0],
      [-0.00129, 0],
      [-0.00111, 0],
      [-0.00035, 3],
      [0.00336, 1],
      [-0.00069, 3],
      [-0.001, 0],
      [-0.00052, 3],
      [-0.00095, 0],
      [-0.00035, 3],
      [-0.00058, 3],
      [-0.00044, 3],
      [-0.0005, 3],
      [-0.00094, 0],
      [-0.00075, 3],
      [-0.00039, 3],
      [-0.00046, 3],
      [-0.00091, 0],
      [-0.00091, 0],
      [0.00304, 1],
      [-0.00053, 3],
      [-0.00106, 0],
      [-0.00056, 3]
    ],
    "red_o_points": [],
    "y_categories": ["N", "NOT APPLICABLE", "Y", "nan"],
    "blue_o_points": [],
    "blue_x_points": [
      [0.00446, 1],
      [-0.00034, 3],
      [0.00281, 1],
      [-0.00027, 0],
      [-0.00042, 0],
      [0.00359, 1],
      [-0.00024, 3],
      [0.00356, 1],
      [-0.00033, 3],
      [-0.00022, 3]
    ]
  },
  "QS_mulTransfSite[AcSsAA]": {
    "red_x_points": [
      [-0.00188, 3],
      [-0.01318, 2],
      [-0.00308, 0],
      [-0.01221, 2],
      [-0.00174, 3],
      [-0.01577, 2],
      [-0.00293, 0],
      [-0.00313, 0],
      [-0.00194, 3],
      [-0.00295, 0],
      [-0.01458, 2],
      [-0.00287, 0],
      [-0.00232, 3],
      [0.01552, 1],
      [-0.00184, 3],
      [-0.01367, 2],
      [-0.00203, 3],
      [-0.00274, 0],
      [-0.00247, 3],
      [-0.00172, 3],
      [-0.00177, 3],
      [-0.00163, 3],
      [-0.01294, 2],
      [-0.0021, 3],
      [-0.0022, 3],
      [-0.00178, 3],
      [-0.003, 0],
      [-0.01216, 2],
      [0.01484, 1],
      [-0.00155, 3],
      [-0.00301, 0],
      [-0.00198, 3]
    ],
    "red_o_points": [],
    "y_categories": ["N", "NOT APPLICABLE", "Y", "nan"],
    "blue_o_points": [],
    "blue_x_points": [
      [0.01986, 1],
      [-0.00076, 3],
      [0.01656, 1],
      [0.00144, 0],
      [0.00036, 0],
      [0.01854, 1],
      [-0.00093, 3],
      [0.01702, 1],
      [-0.00044, 3],
      [-0.00038, 3]
    ]
  },
  "QS_mulLysisRoot[C5]": {
    "red_x_points": [
      [-0.0007, 3],
      [-0.00221, 0],
      [-0.0058, 2],
      [-0.00212, 0],
      [-0.00066, 3],
      [-0.00268, 0],
      [-0.00234, 0],
      [-0.00228, 0],
      [-0.00114, 3],
      [-0.00231, 0],
      [-0.00223, 0],
      [-0.00183, 0],
      [-0.001, 3],
      [0.00485, 1],
      [-0.00069, 3],
      [-0.0023, 0],
      [-0.00106, 3],
      [-0.00224, 0],
      [-0.00066, 3],
      [-0.00133, 3],
      [-0.00049, 3],
      [-0.00086, 3],
      [-0.00203, 0],
      [-0.00074, 3],
      [-0.0006, 3],
      [-0.0007, 3],
      [-0.00247, 0],
      [-0.00216, 0],
      [0.00551, 1],
      [-0.00057, 3],
      [-0.00527, 2],
      [-0.00085, 3]
    ],
    "red_o_points": [],
    "y_categories": ["N", "NOT APPLICABLE", "Y", "nan"],
    "blue_o_points": [],
    "blue_x_points": [
      [0.00686, 1],
      [-0.00033, 3],
      [0.00654, 1],
      [0.00023, 0],
      [-0.00104, 0],
      [0.00708, 1],
      [-0.00068, 3],
      [0.00734, 1],
      [-0.00038, 3],
      [-0.00016, 3]
    ]
  },
  "QS_mulNeuromadSite[C6]": {
    "red_x_points": [
      [-0.00062, 2],
      [-0.00067, 0],
      [-0.00051, 0],
      [-0.00084, 0],
      [-0.00026, 2],
      [-0.0014, 0],
      [-0.0008, 0],
      [-0.00068, 0],
      [-0.00037, 2],
      [-0.00106, 0],
      [-0.00109, 0],
      [-0.0011, 0],
      [-0.00043, 2],
      [0.00086, 1],
      [-0.00029, 2],
      [-0.00055, 0],
      [-0.00041, 2],
      [-0.00058, 0],
      [-0.00037, 2],
      [-0.00035, 2],
      [-9e-5, 2],
      [-0.00029, 2],
      [-0.00068, 0],
      [-0.0002, 2],
      [-0.00045, 2],
      [-0.00035, 2],
      [-0.00085, 0],
      [-0.0008, 0],
      [0.00082, 1],
      [-0.0003, 2],
      [-0.00051, 0],
      [-0.00019, 2]
    ],
    "red_o_points": [],
    "y_categories": ["N", "NOT APPLICABLE", "nan"],
    "blue_o_points": [],
    "blue_x_points": [
      [0.00235, 1],
      [-0.00016, 2],
      [0.00235, 1],
      [0.00013, 0],
      [-0.00043, 0],
      [0.00226, 1],
      [-0.0002, 2],
      [0.00251, 1],
      [5e-5, 2],
      [-0.0, 2]
    ]
  },
  "QS_mulNeuromadSite[T1]": {
    "red_x_points": [
      [-0.00051, 2],
      [-0.00156, 0],
      [-0.00182, 0],
      [-0.00141, 0],
      [-0.00057, 2],
      [-0.00166, 0],
      [-0.00144, 0],
      [-0.00185, 0],
      [-0.00072, 2],
      [-0.00166, 0],
      [-0.0017, 0],
      [-0.00156, 0],
      [-0.00063, 2],
      [0.00214, 1],
      [-0.00042, 2],
      [-0.00126, 0],
      [-0.00092, 2],
      [-0.00113, 0],
      [-0.00072, 2],
      [-0.00047, 2],
      [-0.00021, 2],
      [-0.0005, 2],
      [-0.0013, 0],
      [-0.00045, 2],
      [-0.00071, 2],
      [-0.0004, 2],
      [-0.00176, 0],
      [-0.00161, 0],
      [0.00241, 1],
      [-0.00046, 2],
      [-0.00146, 0],
      [-0.00054, 2]
    ],
    "red_o_points": [],
    "y_categories": ["N", "NOT APPLICABLE", "nan"],
    "blue_o_points": [],
    "blue_x_points": [
      [0.00397, 1],
      [-0.00033, 2],
      [0.00407, 1],
      [0.00011, 0],
      [-0.00064, 0],
      [0.00417, 1],
      [-0.00032, 2],
      [0.00453, 1],
      [-5e-5, 2],
      [-9e-5, 2]
    ]
  },
  "QA_lstPexMuscstrength[ShoulderAbduc]": {
    "red_x_points": [
      [-0.0032, 1],
      [-0.00277, 1],
      [-0.00275, 1],
      [-0.00296, 1],
      [-0.00317, 1],
      [-0.0034, 1],
      [-0.00308, 1],
      [-0.00281, 1],
      [-0.0032, 1],
      [-0.00288, 1],
      [-0.00318, 1],
      [-0.00281, 1],
      [-0.00348, 1],
      [0.001, 2],
      [0.00115, 2],
      [0.00122, 2],
      [0.0012, 2],
      [0.00146, 2],
      [0.00123, 2],
      [-0.00313, 1],
      [-0.00331, 1],
      [-0.00362, 1],
      [-0.00302, 1],
      [0.00121, 2],
      [-0.00392, 1],
      [-0.00287, 1],
      [-0.0029, 1],
      [-0.00299, 1],
      [0.00121, 2],
      [-0.00323, 1],
      [-0.00307, 1],
      [0.00165, 2]
    ],
    "red_o_points": [],
    "y_categories": ["GREATER THAN OR EQUALS TO 3", "LESS THAN 3", "nan"],
    "blue_o_points": [],
    "blue_x_points": [
      [0.00113, 2],
      [0.00168, 2],
      [0.01661, 0],
      [0.00222, 2],
      [-0.00218, 1],
      [0.0166, 0],
      [0.00185, 2],
      [-0.00125, 1],
      [-0.00166, 1],
      [-0.00194, 1]
    ]
  },
  "QS_mulNeuromadSite[T2]": {
    "red_x_points": [
      [-0.00041, 2],
      [-0.00182, 0],
      [-0.00182, 0],
      [-0.0015, 0],
      [-0.00037, 2],
      [-0.00252, 0],
      [-0.00156, 0],
      [-0.00185, 0],
      [-0.00062, 2],
      [-0.00227, 0],
      [-0.00242, 0],
      [-0.00171, 0],
      [-0.00062, 2],
      [0.00196, 1],
      [-0.00029, 2],
      [-0.00193, 0],
      [-0.00084, 2],
      [-0.00159, 0],
      [-0.00037, 2],
      [-0.00072, 2],
      [-0.00022, 2],
      [-0.00071, 2],
      [-0.00118, 0],
      [-0.00028, 2],
      [-0.00084, 2],
      [-0.00033, 2],
      [-0.00152, 0],
      [-0.00152, 0],
      [0.00262, 1],
      [-0.00023, 2],
      [-0.0012, 0],
      [-0.00045, 2]
    ],
    "red_o_points": [],
    "y_categories": ["N", "NOT APPLICABLE", "nan"],
    "blue_o_points": [],
    "blue_x_points": [
      [0.0057, 1],
      [-1e-5, 2],
      [0.0041, 1],
      [0.00022, 0],
      [-0.00058, 0],
      [0.00486, 1],
      [-0.0, 2],
      [0.00443, 1],
      [-1e-5, 2],
      [0.00013, 2]
    ]
  },
  "QS_mulNeuromadSite[C4]": {
    "red_x_points": [
      [-0.00042, 2],
      [-0.00164, 0],
      [-0.00118, 0],
      [-0.00151, 0],
      [-0.00071, 2],
      [-0.00201, 0],
      [-0.00139, 0],
      [-0.00111, 0],
      [-0.00057, 2],
      [-0.00162, 0],
      [-0.00158, 0],
      [-0.00141, 0],
      [-0.00054, 2],
      [0.00162, 1],
      [-0.00037, 2],
      [-0.0013, 0],
      [-0.00074, 2],
      [-0.00109, 0],
      [-0.00064, 2],
      [-0.00077, 2],
      [-0.00026, 2],
      [-0.00065, 2],
      [-0.00125, 0],
      [-0.00051, 2],
      [-0.0005, 2],
      [-0.00058, 2],
      [-0.00142, 0],
      [-0.00122, 0],
      [0.00212, 1],
      [-0.00037, 2],
      [-0.00107, 0],
      [-0.00079, 2]
    ],
    "red_o_points": [],
    "y_categories": ["N", "NOT APPLICABLE", "nan"],
    "blue_o_points": [],
    "blue_x_points": [
      [0.00481, 1],
      [-0.00015, 2],
      [0.00394, 1],
      [0.00034, 0],
      [-0.00036, 0],
      [0.0034, 1],
      [-0.00049, 2],
      [0.00352, 1],
      [-1e-5, 2],
      [0.00034, 2]
    ]
  },
  "QS_mulGraftNerve[Ra]": {
    "red_x_points": [
      [-3e-5, 2],
      [-0.00017, 0],
      [-0.0002, 0],
      [-0.00012, 0],
      [-3e-5, 2],
      [-0.00017, 0],
      [-0.00019, 0],
      [-0.00014, 0],
      [-6e-5, 2],
      [-0.00022, 0],
      [-0.00017, 0],
      [-0.00023, 0],
      [-6e-5, 2],
      [0.00032, 1],
      [-5e-5, 2],
      [-0.00023, 0],
      [-4e-5, 2],
      [-0.00014, 0],
      [-4e-5, 2],
      [-4e-5, 2],
      [-5e-5, 2],
      [-6e-5, 2],
      [-0.00023, 0],
      [-2e-5, 2],
      [-7e-5, 2],
      [-2e-5, 2],
      [-0.00023, 0],
      [-0.00014, 0],
      [7e-5, 1],
      [-3e-5, 2],
      [-0.00019, 0],
      [-3e-5, 2]
    ],
    "red_o_points": [],
    "y_categories": ["N", "NOT APPLICABLE", "nan"],
    "blue_o_points": [],
    "blue_x_points": [
      [0.00054, 1],
      [-7e-5, 2],
      [0.0004, 1],
      [5e-5, 0],
      [-8e-5, 0],
      [0.00047, 1],
      [-1e-5, 2],
      [0.00068, 1],
      [-1e-5, 2],
      [-2e-5, 2]
    ]
  },
  "QS_mulTransfSite[Oberlin]": {
    "red_x_points": [
      [-0.00244, 3],
      [-0.014, 0],
      [-0.01516, 0],
      [-0.01463, 0],
      [-0.00247, 3],
      [-0.00308, 2],
      [-0.00234, 2],
      [-0.01489, 0],
      [-0.00274, 3],
      [-0.00253, 2],
      [-0.00275, 2],
      [-0.0025, 2],
      [-0.00238, 3],
      [0.01778, 1],
      [-0.00225, 3],
      [-0.00295, 2],
      [-0.00247, 3],
      [-0.014, 0],
      [-0.00222, 3],
      [-0.00224, 3],
      [-0.00226, 3],
      [-0.00239, 3],
      [-0.01388, 0],
      [-0.00208, 3],
      [-0.00238, 3],
      [-0.00253, 3],
      [-0.00222, 2],
      [-0.01396, 0],
      [0.01738, 1],
      [-0.00235, 3],
      [-0.01457, 0],
      [-0.00217, 3]
    ],
    "red_o_points": [],
    "y_categories": ["N", "NOT APPLICABLE", "Y", "nan"],
    "blue_o_points": [],
    "blue_x_points": [
      [0.02101, 1],
      [-0.00102, 3],
      [0.01916, 1],
      [0.00217, 2],
      [0.00126, 2],
      [0.01986, 1],
      [-0.00083, 3],
      [0.01871, 1],
      [-0.00088, 3],
      [-0.00123, 3]
    ]
  },
  "QS_mulGraftNerve[FI]": {
    "red_x_points": [
      [-0.00011, 2],
      [-0.00084, 0],
      [-0.00079, 0],
      [-0.00097, 0],
      [-0.00012, 2],
      [-0.00087, 0],
      [-0.00071, 0],
      [-0.00096, 0],
      [-0.00025, 2],
      [-0.00138, 0],
      [-0.00116, 0],
      [-0.00075, 0],
      [-0.00023, 2],
      [0.00123, 1],
      [-0.00027, 2],
      [-0.00121, 0],
      [-0.00021, 2],
      [-0.00083, 0],
      [-0.00029, 2],
      [-0.00018, 2],
      [-4e-5, 2],
      [-0.0003, 2],
      [-0.00088, 0],
      [-0.00022, 2],
      [-0.00028, 2],
      [-0.00012, 2],
      [-0.00117, 0],
      [-0.00082, 0],
      [0.00115, 1],
      [-0.0001, 2],
      [-0.0008, 0],
      [-0.00025, 2]
    ],
    "red_o_points": [],
    "y_categories": ["N", "NOT APPLICABLE", "nan"],
    "blue_o_points": [],
    "blue_x_points": [
      [0.00327, 1],
      [8e-5, 2],
      [0.00205, 1],
      [4e-5, 0],
      [-0.0004, 0],
      [0.00233, 1],
      [-0.0001, 2],
      [0.00247, 1],
      [-8e-5, 2],
      [-7e-5, 2]
    ]
  },
  "QA_lstPexPalle[Ulna]": {
    "red_x_points": [
      [-0.00154, 3],
      [-0.0003, 3],
      [-0.00043, 3],
      [-0.00037, 3],
      [-0.00202, 3],
      [0.00085, 2],
      [-0.00234, 1],
      [-0.00049, 3],
      [-0.00196, 3],
      [-0.00047, 3],
      [0.00123, 2],
      [0.00092, 2],
      [-0.00605, 1],
      [-0.0002, 3],
      [-0.0015, 3],
      [-0.00035, 3],
      [-0.00161, 3],
      [-0.00024, 3],
      [-0.00114, 3],
      [0.00253, 2],
      [-0.00626, 0],
      [0.00297, 2],
      [-0.00101, 0],
      [-0.00128, 3],
      [0.00215, 2],
      [-0.00189, 3],
      [-0.00038, 3],
      [-0.00025, 3],
      [0.00092, 2],
      [-0.00155, 3],
      [-0.00263, 0],
      [-0.00128, 3]
    ],
    "red_o_points": [],
    "y_categories": ["ABS", "HYPO", "PT", "nan"],
    "blue_o_points": [],
    "blue_x_points": [
      [-8e-5, 3],
      [-0.00042, 3],
      [0.0009, 2],
      [-0.0002, 3],
      [0.00361, 2],
      [-0.00016, 3],
      [0.00649, 2],
      [-0.00012, 3],
      [0.00635, 2],
      [-0.00028, 3]
    ]
  }
}
