{
  "QS_mulGraftNerve[other]": {
    "red_x_points": [
      [-7e-5, 2],
      [-0.00012, 0],
      [-0.00012, 0],
      [-6e-5, 0],
      [-7e-5, 2],
      [-8e-5, 0],
      [5e-5, 0],
      [-6e-5, 0],
      [-2e-5, 2],
      [-0.0, 0],
      [-0.00012, 0],
      [-0.00024, 0],
      [-2e-5, 2],
      [3e-5, 1],
      [-2e-5, 2],
      [-0.00012, 0],
      [-0.0, 2],
      [-0.00012, 0],
      [-2e-5, 2],
      [-2e-5, 2],
      [-7e-5, 2],
      [-2e-5, 2],
      [-0.00012, 0],
      [-0.0, 2],
      [-0.00024, 2],
      [-2e-5, 2],
      [-0.00012, 0],
      [-6e-5, 0],
      [-5e-5, 1],
      [-7e-5, 2],
      [-0.0, 0],
      [-7e-5, 2]
    ],
    "red_o_points": [],
    "y_categories": ["N", "NOT APPLICABLE", "nan"],
    "blue_o_points": [],
    "blue_x_points": [
      [0.00025, 1],
      [-3e-5, 2],
      [0.00037, 1],
      [0.00017, 0],
      [3e-5, 0],
      [0.00029, 1],
      [-1e-5, 2],
      [0.00037, 1],
      [-2e-5, 2],
      [-1e-5, 2]
    ]
  },
  "QA_lstPexMuscstrength[ElbowFlex]": {
    "red_x_points": [
      [-0.00304, 1],
      [-0.00351, 2],
      [-0.00448, 1],
      [-0.00399, 1],
      [-0.00291, 1],
      [0.00946, 0],
      [-0.00426, 1],
      [-0.00437, 1],
      [-0.00367, 1],
      [-0.00482, 1],
      [-0.00482, 1],
      [-0.00476, 1],
      [-0.00344, 1],
      [-0.00319, 2],
      [-0.00363, 2],
      [-0.00448, 2],
      [-0.00367, 1],
      [-0.00331, 2],
      [-0.00461, 2],
      [-0.00318, 1],
      [-0.00329, 1],
      [-0.0026, 1],
      [-0.00319, 1],
      [-0.00306, 2],
      [0.00125, 0],
      [-0.00274, 1],
      [-0.00494, 1],
      [-0.00346, 1],
      [-0.00284, 2],
      [-0.00303, 1],
      [-0.00383, 1],
      [-0.0032, 2]
    ],
    "red_o_points": [],
    "y_categories": ["GREATER THAN OR EQUALS TO 3", "LESS THAN 3", "nan"],
    "blue_o_points": [],
    "blue_x_points": [
      [-0.00063, 2],
      [-0.00031, 2],
      [0.0101, 0],
      [0.00094, 1],
      [0.02849, 0],
      [0.01022, 0],
      [-0.00147, 1],
      [0.01148, 0],
      [0.00096, 1],
      [-0.00047, 1]
    ]
  },
  "QS_mulLysisTrunk[Upper]": {
    "red_x_points": [
      [-0.00109, 3],
      [-0.00619, 0],
      [-0.0059, 0],
      [-0.00639, 0],
      [-0.0014, 3],
      [-0.0067, 0],
      [-0.0127, 2],
      [-0.00615, 0],
      [-0.00124, 3],
      [-0.00619, 0],
      [-0.00635, 0],
      [-0.00579, 0],
      [-0.00075, 3],
      [0.0104, 1],
      [-0.00147, 3],
      [-0.00624, 0],
      [-0.00121, 3],
      [-0.01077, 2],
      [-0.00165, 3],
      [-0.00134, 3],
      [-0.0008, 3],
      [-0.00094, 3],
      [-0.0058, 0],
      [-0.00149, 3],
      [-0.00187, 3],
      [-0.0012, 3],
      [-0.00596, 0],
      [-0.00505, 0],
      [0.01325, 1],
      [-0.00067, 3],
      [-0.0117, 2],
      [-0.00141, 3]
    ],
    "red_o_points": [],
    "y_categories": ["N", "NOT APPLICABLE", "Y", "nan"],
    "blue_o_points": [],
    "blue_x_points": [
      [0.01866, 1],
      [2e-5, 3],
      [0.01454, 1],
      [0.00053, 0],
      [-0.00135, 0],
      [0.01445, 1],
      [-0.00015, 3],
      [0.01522, 1],
      [-0.00047, 3],
      [0.00015, 3]
    ]
  },
  "QS_mulNeuromadSite[C5]": {
    "red_x_points": [
      [8e-5, 2],
      [-0.00044, 0],
      [-0.0004, 0],
      [-0.00053, 0],
      [-6e-5, 2],
      [-0.00064, 0],
      [-0.0002, 0],
      [-0.00042, 0],
      [-4e-5, 2],
      [-0.00038, 0],
      [-0.00057, 0],
      [-0.00028, 0],
      [-0.0, 2],
      [0.00039, 1],
      [-4e-5, 2],
      [-0.00046, 0],
      [-3e-5, 2],
      [-0.00038, 0],
      [-0.00031, 2],
      [-0.0, 2],
      [8e-5, 2],
      [-1e-5, 2],
      [-0.00018, 0],
      [1e-5, 2],
      [-2e-5, 2],
      [1e-5, 2],
      [-0.00038, 0],
      [-0.00029, 0],
      [0.00071, 1],
      [2e-5, 2],
      [-0.00025, 0],
      [-4e-5, 2]
    ],
    "red_o_points": [],
    "y_categories": ["N", "NOT APPLICABLE", "nan"],
    "blue_o_points": [],
    "blue_x_points": [
      [0.00142, 1],
      [4e-5, 2],
      [0.00087, 1],
      [0.0001, 0],
      [-0.0001, 0],
      [0.00058, 1],
      [3e-5, 2],
      [0.0006, 1],
      [3e-5, 2],
      [6e-5, 2]
    ]
  },
  "QS_mulNeuromadSite[C7]": {
    "red_x_points": [
      [-0.00016, 2],
      [-0.001, 0],
      [-0.00107, 0],
      [-0.00117, 0],
      [-0.00016, 2],
      [-0.00123, 0],
      [-0.00088, 0],
      [-0.00122, 0],
      [-6e-5, 2],
      [-0.00112, 0],
      [-0.00137, 0],
      [-0.00094, 0],
      [-9e-5, 2],
      [0.00055, 1],
      [-0.00018, 2],
      [-0.00104, 0],
      [-0.00017, 2],
      [-0.00085, 0],
      [-0.00018, 2],
      [-0.00018, 2],
      [-0.00019, 2],
      [-5e-5, 2],
      [-0.00081, 0],
      [-0.00015, 2],
      [-0.00018, 2],
      [-0.00015, 2],
      [-0.00086, 0],
      [-0.00077, 0],
      [0.00154, 1],
      [-7e-5, 2],
      [-0.00068, 0],
      [-0.0001, 2]
    ],
    "red_o_points": [],
    "y_categories": ["N", "NOT APPLICABLE", "nan"],
    "blue_o_points": [],
    "blue_x_points": [
      [0.00311, 1],
      [0.0, 2],
      [0.00167, 1],
      [0.0003, 0],
      [-0.00031, 0],
      [0.0024, 1],
      [1e-5, 2],
      [0.00243, 1],
      [2e-5, 2],
      [0.0001, 2]
    ]
  },
  "QS_mulTransfSite[IMc]": {
    "red_x_points": [
      [-0.00164, 3],
      [-0.01058, 2],
      [-0.00388, 0],
      [-0.00424, 0],
      [-0.00175, 3],
      [-0.0051, 0],
      [-0.00378, 0],
      [-0.00389, 0],
      [-0.00166, 3],
      [-0.00459, 0],
      [-0.00429, 0],
      [-0.00409, 0],
      [-0.00151, 3],
      [0.01173, 1],
      [-0.00188, 3],
      [-0.00412, 0],
      [-0.00176, 3],
      [-0.0106, 2],
      [-0.00225, 3],
      [-0.00127, 3],
      [-0.00147, 3],
      [-0.00128, 3],
      [-0.00352, 0],
      [-0.002, 3],
      [-0.00214, 3],
      [-0.00142, 3],
      [-0.00439, 0],
      [-0.00946, 2],
      [0.01197, 1],
      [-0.00146, 3],
      [-0.01063, 2],
      [-0.00185, 3]
    ],
    "red_o_points": [],
    "y_categories": ["N", "NOT APPLICABLE", "Y", "nan"],
    "blue_o_points": [],
    "blue_x_points": [
      [0.01899, 1],
      [-0.00069, 3],
      [0.01277, 1],
      [0.00075, 0],
      [-0.00181, 0],
      [0.01442, 1],
      [-0.00068, 3],
      [0.01299, 1],
      [-0.0007, 3],
      [-0.00064, 3]
    ]
  },
  "QA_mulInjOrthesisType[ShoulderSupport]": {
    "red_x_points": [
      [-0.00792, 0],
      [-0.0069, 0],
      [-0.00799, 0],
      [-0.00835, 0],
      [-0.00737, 0],
      [-0.00817, 0],
      [-0.00729, 0],
      [-0.00764, 0],
      [-0.02261, 2],
      [-0.00836, 0],
      [-0.008, 0],
      [-0.00804, 0],
      [-0.00852, 0],
      [0.01755, 1],
      [-0.00849, 0],
      [-0.00807, 0],
      [-0.00866, 0],
      [-0.01403, 2],
      [0.01619, 1],
      [-0.00658, 0],
      [-0.00843, 0],
      [-0.02363, 2],
      [-0.00426, 3],
      [-0.00882, 0],
      [0.01299, 1],
      [-0.00795, 0],
      [-0.00763, 0],
      [-0.00692, 0],
      [-0.0156, 3],
      [-0.00202, 3],
      [-0.00691, 0],
      [-0.00816, 0]
    ],
    "red_o_points": [],
    "y_categories": ["N", "NOT APPLICABLE", "Y", "nan"],
    "blue_o_points": [],
    "blue_x_points": [
      [0.00136, 0],
      [0.02715, 1],
      [0.01876, 1],
      [0.03909, 1],
      [-0.00458, 0],
      [0.01943, 1],
      [-0.00251, 0],
      [0.01908, 1],
      [-0.00303, 0],
      [0.01653, 3]
    ]
  },
  "QA_mulInjOrthesisType[ArmSling]": {
    "red_x_points": [
      [-0.00793, 2],
      [-0.00753, 2],
      [-0.00756, 2],
      [-0.0075, 2],
      [-0.00682, 2],
      [-0.00706, 2],
      [-0.00804, 2],
      [-0.00802, 2],
      [-0.00697, 2],
      [-0.0082, 2],
      [-0.00754, 2],
      [-0.00796, 2],
      [-0.00889, 2],
      [0.0145, 1],
      [-0.00875, 2],
      [-0.00702, 2],
      [-0.00871, 2],
      [-0.01365, 0],
      [0.0161, 1],
      [-0.0077, 2],
      [-0.00764, 2],
      [-0.02279, 0],
      [-0.00343, 3],
      [-0.00886, 2],
      [0.01142, 1],
      [-0.00779, 2],
      [-0.00804, 2],
      [-0.00667, 2],
      [-0.01793, 3],
      [-0.00034, 3],
      [-0.00722, 2],
      [-0.00697, 2]
    ],
    "red_o_points": [],
    "y_categories": ["N", "NOT APPLICABLE", "Y", "nan"],
    "blue_o_points": [],
    "blue_x_points": [
      [0.00371, 2],
      [0.02583, 1],
      [0.01758, 1],
      [0.04153, 1],
      [-0.00534, 2],
      [0.01749, 1],
      [-0.00285, 2],
      [0.01544, 1],
      [-0.0042, 2],
      [0.01552, 3]
    ]
  },
  "QS_mulGraftNerve[Ac]": {
    "red_x_points": [
      [-2e-5, 2],
      [-0.00018, 0],
      [-8e-5, 0],
      [-4e-5, 0],
      [-2e-5, 2],
      [-9e-5, 0],
      [-0.00017, 0],
      [-0.00012, 0],
      [-2e-5, 2],
      [-0.00013, 0],
      [-0.00021, 0],
      [-0.00017, 0],
      [-3e-5, 2],
      [0.00017, 1],
      [-2e-5, 2],
      [-0.00041, 0],
      [1e-5, 2],
      [-0.00018, 0],
      [-4e-5, 2],
      [-2e-5, 2],
      [3e-5, 2],
      [1e-5, 2],
      [-4e-5, 0],
      [-2e-5, 2],
      [3e-5, 2],
      [-2e-5, 2],
      [-8e-5, 0],
      [-8e-5, 0],
      [0.00024, 1],
      [4e-5, 2],
      [-9e-5, 0]
    ],
    "red_o_points": [],
    "y_categories": ["N", "NOT APPLICABLE", "nan"],
    "blue_o_points": [],
    "blue_x_points": [
      [0.00041, 1],
      [0.00012, 2],
      [0.00025, 1],
      [-4e-5, 0],
      [-4e-5, 0],
      [7e-5, 1],
      [-2e-5, 2],
      [0.0001, 1],
      [4e-5, 2],
      [3e-5, 2]
    ]
  },
  "QA_lstPexPain[C5]": {
    "red_x_points": [
      [-0.003, 1],
      [-0.00617, 2],
      [-0.00633, 2],
      [-0.00602, 2],
      [-0.00294, 1],
      [-0.00105, 1],
      [-0.00107, 1],
      [-0.00143, 1],
      [-0.00313, 1],
      [-0.00127, 1],
      [-0.0014, 1],
      [-0.00098, 1],
      [-0.00325, 1],
      [-0.02161, 2],
      [-0.0087, 2],
      [-0.00568, 2],
      [-0.00802, 2],
      [-0.00614, 2],
      [-0.00843, 2],
      [-0.00284, 1],
      [-0.00279, 1],
      [-0.00297, 1],
      [-0.00729, 2],
      [-0.00807, 2],
      [-0.00359, 1],
      [-0.00992, 2],
      [-0.00585, 2],
      [-0.00581, 2],
      [-0.00498, 1],
      [-0.00593, 1],
      [-0.00111, 1],
      [-0.0033, 1]
    ],
    "red_o_points": [],
    "y_categories": ["NORM", "NPV", "nan"],
    "blue_o_points": [],
    "blue_x_points": [
      [0.028, 0],
      [-0.00421, 2],
      [0.00022, 1],
      [-0.00042, 1],
      [-0.00061, 1],
      [0.00031, 1],
      [-0.00122, 1],
      [0.02603, 0],
      [-0.0016, 1],
      [0.05492, 0]
    ]
  },
  "QS_mulLysisRoot[C7]": {
    "red_x_points": [
      [-0.00021, 3],
      [-0.00036, 0],
      [-0.00275, 2],
      [-0.00045, 0],
      [-0.00016, 3],
      [-0.00053, 0],
      [-0.00025, 0],
      [-0.00041, 0],
      [-0.00015, 3],
      [-0.00052, 0],
      [-0.00043, 0],
      [-0.00026, 0],
      [-0.00017, 3],
      [0.00113, 1],
      [-0.00026, 3],
      [-0.00045, 0],
      [-0.00024, 3],
      [-0.00045, 0],
      [-0.00016, 3],
      [-0.00017, 3],
      [-0.00014, 3],
      [-0.00014, 3],
      [-0.00042, 0],
      [-0.00017, 3],
      [-0.00017, 3],
      [-0.0002, 3],
      [-0.00039, 0],
      [-0.00042, 0],
      [0.00121, 1],
      [-0.00013, 3],
      [-0.00047, 0],
      [-0.0002, 3]
    ],
    "red_o_points": [],
    "y_categories": ["N", "NOT APPLICABLE", "Y", "nan"],
    "blue_o_points": [],
    "blue_x_points": [
      [0.00205, 1],
      [-0.00013, 3],
      [0.00134, 1],
      [0.0002, 0],
      [-0.00015, 0],
      [0.00109, 1],
      [-0.00011, 3],
      [0.00135, 1],
      [-0.0001, 3],
      [-0.0001, 3]
    ]
  },
  "QS_mulNeuromadSite[C8]": {
    "red_x_points": [
      [-9e-5, 2],
      [-0.00245, 0],
      [-0.00242, 0],
      [-0.00229, 0],
      [-0.00034, 2],
      [-0.00267, 0],
      [-0.00197, 0],
      [-0.00254, 0],
      [-0.00049, 2],
      [-0.00276, 0],
      [-0.00316, 0],
      [-0.00237, 0],
      [-0.00053, 2],
      [0.00205, 1],
      [-0.00017, 2],
      [-0.00259, 0],
      [-0.00045, 2],
      [-0.00233, 0],
      [-0.00104, 2],
      [-0.00041, 2],
      [-0.00021, 2],
      [-0.00037, 2],
      [-0.00245, 0],
      [-0.00034, 2],
      [-0.00183, 2],
      [-0.00014, 2],
      [-0.00212, 0],
      [-0.00175, 0],
      [0.00348, 1],
      [-0.0002, 2],
      [-0.00164, 0],
      [-0.00023, 2]
    ],
    "red_o_points": [],
    "y_categories": ["N", "NOT APPLICABLE", "nan"],
    "blue_o_points": [],
    "blue_x_points": [
      [0.00685, 1],
      [2e-5, 2],
      [0.00476, 1],
      [0.00148, 0],
      [-0.00027, 0],
      [0.0044, 1],
      [1e-5, 2],
      [0.00492, 1],
      [0.00022, 2],
      [0.00082, 2]
    ]
  },
  "QS_mulGraftNerve[Ph]": {
    "red_x_points": [
      [2e-5, 2],
      [-3e-5, 0],
      [-3e-5, 0],
      [-3e-5, 0],
      [2e-5, 2],
      [-3e-5, 0],
      [-3e-5, 0],
      [-3e-5, 0],
      [2e-5, 2],
      [-3e-5, 0],
      [-3e-5, 0],
      [-3e-5, 0],
      [2e-5, 2],
      [2e-5, 2],
      [2e-5, 2],
      [-3e-5, 0],
      [-3e-5, 0],
      [-3e-5, 0],
      [2e-5, 2]
    ],
    "red_o_points": [],
    "y_categories": ["N", "NOT APPLICABLE", "nan"],
    "blue_o_points": [],
    "blue_x_points": [[0.00017, 1], [2e-5, 2]]
  },
  "QA_lstPexPain[T1]": {
    "red_x_points": [
      [-0.01091, 1],
      [-0.00274, 2],
      [-0.00414, 2],
      [-0.00302, 2],
      [-0.01034, 1],
      [-0.0088, 0],
      [0.00189, 1],
      [0.0025, 1],
      [0.00926, 0],
      [0.00333, 1],
      [-0.00397, 0],
      [-0.00846, 0],
      [0.00953, 0],
      [-0.01904, 2],
      [-0.00815, 2],
      [-0.00526, 2],
      [-0.0071, 2],
      [-0.00176, 2],
      [-0.00745, 2],
      [0.00867, 0],
      [-0.01151, 1],
      [0.00919, 0],
      [-0.00459, 2],
      [-0.00779, 2],
      [-0.01149, 1],
      [-0.00777, 2],
      [-0.00585, 2],
      [-0.00279, 2],
      [-0.00775, 1],
      [-0.01587, 1],
      [0.0003, 1],
      [-0.01224, 1]
    ],
    "red_o_points": [],
    "y_categories": ["NORM", "NPV", "nan"],
    "blue_o_points": [],
    "blue_x_points": [
      [-4e-5, 1],
      [-0.0012, 2],
      [0.00863, 0],
      [0.00912, 1],
      [0.0158, 1],
      [0.00015, 1],
      [0.01424, 0],
      [0.00848, 0],
      [0.01296, 0],
      [0.02145, 0]
    ]
  },
  "QA_lstPexKine[Shoulder]": {
    "red_x_points": [
      [-0.00179, 1],
      [-0.00298, 2],
      [-0.00398, 2],
      [-0.00373, 2],
      [-0.0069, 2],
      [-0.00503, 1],
      [-0.00289, 1],
      [0.00661, 0],
      [-0.00983, 2],
      [-0.00264, 1],
      [-0.00323, 1],
      [-0.00353, 1],
      [-0.00324, 1],
      [-0.00136, 2],
      [-0.0068, 2],
      [-0.00223, 1],
      [-0.00694, 2],
      [-0.00219, 2],
      [-0.00624, 2],
      [-0.00315, 1],
      [-0.00162, 1],
      [-0.00374, 1],
      [-0.00218, 2],
      [-0.00647, 2],
      [-0.00276, 1],
      [-0.00824, 2],
      [-0.00741, 2],
      [-0.00375, 2],
      [-0.00175, 2],
      [-0.00629, 2],
      [-0.00153, 1],
      [-0.00697, 2]
    ],
    "red_o_points": [],
    "y_categories": ["NPV", "PV", "nan"],
    "blue_o_points": [],
    "blue_x_points": [
      [-1e-5, 1],
      [-0.00325, 2],
      [-0.00059, 1],
      [0.00098, 1],
      [0.02913, 0],
      [-0.00044, 1],
      [0.04995, 0],
      [-0.00035, 2],
      [0.00032, 1],
      [0.00059, 1]
    ]
  },
  "QS_mulTransfSite[AcSsPA]": {
    "red_x_points": [
      [-7e-5, 3],
      [-0.00095, 0],
      [-0.00104, 0],
      [-0.00116, 0],
      [-0.00014, 3],
      [-0.001, 0],
      [-0.00082, 0],
      [-0.001, 0],
      [-0.00019, 3],
      [-0.00123, 0],
      [-0.00099, 0],
      [-0.00092, 0],
      [-0.00022, 3],
      [0.00109, 1],
      [-0.0002, 3],
      [-0.00097, 0],
      [-0.00019, 3],
      [-0.0024, 2],
      [-0.0002, 3],
      [-0.00017, 3],
      [-0.00014, 3],
      [-0.00016, 3],
      [-0.00073, 0],
      [-0.0002, 3],
      [-0.00021, 3],
      [-0.00011, 3],
      [-0.00103, 0],
      [-0.00078, 0],
      [0.00242, 1],
      [-0.00016, 3],
      [-0.00073, 0],
      [-0.00024, 3]
    ],
    "red_o_points": [],
    "y_categories": ["N", "NOT APPLICABLE", "Y", "nan"],
    "blue_o_points": [],
    "blue_x_points": [
      [0.00344, 1],
      [-2e-5, 3],
      [0.00195, 1],
      [0.00023, 0],
      [-0.00075, 0],
      [0.00226, 1],
      [-1e-5, 3],
      [0.00227, 1],
      [3e-5, 3],
      [-4e-5, 3]
    ]
  },
  "QA_equInjTbpiTime": {
    "red_x_points": [
      [-0.00148, 0],
      [-0.00329, 0],
      [0.00783, 3],
      [-0.00461, 0],
      [-0.00518, 1],
      [-0.01014, 0],
      [-0.00643, 1],
      [-0.00664, 0],
      [0.00138, 3],
      [-0.00713, 0],
      [-0.00717, 0],
      [0.01387, 3],
      [-0.00362, 0],
      [-0.04742, 2],
      [-0.00108, 3],
      [-0.00589, 0],
      [1e-5, 0],
      [-0.00286, 0],
      [-0.01864, 1],
      [0.00025, 3],
      [-0.00151, 0],
      [-0.00536, 1],
      [-0.00879, 2],
      [-0.00072, 3],
      [-0.0145, 1],
      [-0.01739, 2],
      [-0.00636, 0],
      [-0.00893, 2],
      [0.00051, 0],
      [0.00094, 0],
      [0.00665, 3],
      [-0.00583, 1]
    ],
    "red_o_points": [],
    "y_categories": [
      "0 TO 6 MONTHS",
      "13 TO 24 MONTHS",
      "25 MONTHS OR MORE",
      "7 TO 12 MONTHS",
      "nan"
    ],
    "blue_o_points": [],
    "blue_x_points": [
      [0.00448, 0],
      [0.01128, 0],
      [0.00492, 0],
      [0.02007, 3],
      [0.01972, 3],
      [0.00567, 0],
      [0.00536, 1],
      [0.01454, 3],
      [0.00938, 3],
      [0.0071, 0]
    ]
  },
  "QS_mulTransfSite[AcSsAA]": {
    "red_x_points": [
      [-0.00188, 3],
      [-0.01618, 2],
      [-0.00467, 0],
      [-0.0166, 2],
      [-0.00217, 3],
      [-0.02351, 2],
      [-0.00456, 0],
      [-0.00543, 0],
      [-0.00237, 3],
      [-0.00534, 0],
      [-0.01887, 2],
      [-0.00459, 0],
      [-0.00224, 3],
      [0.01953, 1],
      [-0.00187, 3],
      [-0.01818, 2],
      [-0.00197, 3],
      [-0.00487, 0],
      [-0.00215, 3],
      [-0.00199, 3],
      [-0.00187, 3],
      [-0.00189, 3],
      [-0.01526, 2],
      [-0.00227, 3],
      [-0.00271, 3],
      [-0.00191, 3],
      [-0.0046, 0],
      [-0.01554, 2],
      [0.01989, 1],
      [-0.00176, 3],
      [-0.0051, 0],
      [-0.00183, 3]
    ],
    "red_o_points": [],
    "y_categories": ["N", "NOT APPLICABLE", "Y", "nan"],
    "blue_o_points": [],
    "blue_x_points": [
      [0.0259, 1],
      [-0.00015, 3],
      [0.02077, 1],
      [0.00145, 0],
      [0.00172, 0],
      [0.0237, 1],
      [-0.00096, 3],
      [0.02335, 1],
      [-0.00072, 3],
      [-0.00063, 3]
    ]
  },
  "QS_mulNeuromadSite[T2]": {
    "red_x_points": [
      [1e-5, 2],
      [-0.00202, 0],
      [-0.00166, 0],
      [-0.00191, 0],
      [-0.00012, 2],
      [-0.00243, 0],
      [-0.00217, 0],
      [-0.0021, 0],
      [-9e-5, 2],
      [-0.00252, 0],
      [-0.00246, 0],
      [-0.00202, 0],
      [-0.0002, 2],
      [0.00211, 1],
      [-0.00018, 2],
      [-0.00243, 0],
      [-0.00033, 2],
      [-0.00148, 0],
      [-0.00054, 2],
      [-7e-5, 2],
      [8e-5, 2],
      [-0.0001, 2],
      [-0.00162, 0],
      [-9e-5, 2],
      [-0.00029, 2],
      [-6e-5, 2],
      [-0.00183, 0],
      [-0.00193, 0],
      [0.00292, 1],
      [-0.00018, 2],
      [-0.00174, 0],
      [-0.00039, 2]
    ],
    "red_o_points": [],
    "y_categories": ["N", "NOT APPLICABLE", "nan"],
    "blue_o_points": [],
    "blue_x_points": [
      [0.00606, 1],
      [1e-5, 2],
      [0.00334, 1],
      [0.00061, 0],
      [-0.00057, 0],
      [0.00405, 1],
      [0.00012, 2],
      [0.00337, 1],
      [0.00018, 2],
      [0.00024, 2]
    ]
  },
  "QS_mulLysisRoot[C5]": {
    "red_x_points": [
      [-0.00043, 3],
      [-0.00193, 0],
      [-0.00689, 2],
      [-0.00198, 0],
      [-0.00063, 3],
      [-0.00168, 0],
      [-0.00168, 0],
      [-0.00188, 0],
      [-0.00117, 3],
      [-0.00188, 0],
      [-0.00164, 0],
      [-0.00122, 0],
      [-0.00047, 3],
      [0.00404, 1],
      [-0.001, 3],
      [-0.00178, 0],
      [-0.00056, 3],
      [-0.00152, 0],
      [-0.0007, 3],
      [-0.00081, 3],
      [-0.00056, 3],
      [-0.00053, 3],
      [-0.00148, 0],
      [-0.00091, 3],
      [-0.00071, 3],
      [-0.00045, 3],
      [-0.00183, 0],
      [-0.00175, 0],
      [0.00422, 1],
      [-0.00066, 3],
      [-0.00635, 2],
      [-0.00071, 3]
    ],
    "red_o_points": [],
    "y_categories": ["N", "NOT APPLICABLE", "Y", "nan"],
    "blue_o_points": [],
    "blue_x_points": [
      [0.00889, 1],
      [-0.00045, 3],
      [0.00407, 1],
      [0.00079, 0],
      [0.00035, 0],
      [0.00516, 1],
      [-0.00032, 3],
      [0.00569, 1],
      [-0.0007, 3],
      [-0.00012, 3]
    ]
  },
  "QS_mulNeuromadSite[C6]": {
    "red_x_points": [
      [-3e-5, 2],
      [-0.0003, 0],
      [-0.00046, 0],
      [-0.00038, 0],
      [-5e-5, 2],
      [-0.00051, 0],
      [-0.00047, 0],
      [-0.00044, 0],
      [-0.00011, 2],
      [-0.00056, 0],
      [-0.00049, 0],
      [-0.00033, 0],
      [-5e-5, 2],
      [0.00048, 1],
      [-6e-5, 2],
      [-0.00035, 0],
      [-2e-5, 2],
      [-0.00029, 0],
      [-0.00026, 2],
      [-4e-5, 2],
      [-6e-5, 2],
      [-3e-5, 2],
      [-0.00027, 0],
      [-8e-5, 2],
      [-0.00013, 2],
      [-4e-5, 2],
      [-0.0004, 0],
      [-0.00037, 0],
      [0.00052, 1],
      [-6e-5, 2],
      [-0.0004, 0],
      [-0.00025, 2]
    ],
    "red_o_points": [],
    "y_categories": ["N", "NOT APPLICABLE", "nan"],
    "blue_o_points": [],
    "blue_x_points": [
      [0.00109, 1],
      [-4e-5, 2],
      [0.00088, 1],
      [0.00017, 0],
      [-6e-5, 0],
      [0.00065, 1],
      [-1e-5, 2],
      [0.00093, 1],
      [-2e-5, 2],
      [5e-5, 2]
    ]
  },
  "QS_lstBpsurgSide": {
    "red_x_points": [
      [-0.00167, 3],
      [-0.00642, 0],
      [-0.00712, 0],
      [-0.00735, 0],
      [-0.00152, 3],
      [-0.00632, 2],
      [-0.00678, 0],
      [-0.00863, 0],
      [-0.00172, 3],
      [-0.00729, 0],
      [-0.00746, 2],
      [-0.00671, 2],
      [-0.00144, 3],
      [0.01064, 1],
      [-0.00142, 3],
      [-0.00722, 2],
      [-0.00132, 3],
      [-0.00629, 2],
      [-0.00183, 3],
      [-0.00179, 3],
      [-0.00165, 3],
      [-0.00163, 3],
      [-0.00608, 0],
      [-0.00136, 3],
      [-0.00227, 3],
      [-0.00119, 3],
      [-0.00628, 2],
      [-0.00496, 2],
      [0.01087, 1],
      [-0.00131, 3],
      [-0.00684, 0],
      [-0.00168, 3]
    ],
    "red_o_points": [],
    "y_categories": ["L", "NOT APPLICABLE", "R", "nan"],
    "blue_o_points": [],
    "blue_x_points": [
      [0.01757, 1],
      [-0.00046, 3],
      [0.0125, 1],
      [0.00291, 0],
      [0.00141, 2],
      [0.01466, 1],
      [-0.00045, 3],
      [0.01316, 1],
      [-0.00072, 3],
      [0.00013, 3]
    ]
  },
  "QS_mulNeuromadSite[T1]": {
    "red_x_points": [
      [-7e-5, 2],
      [-0.00093, 0],
      [-0.00084, 0],
      [-0.00081, 0],
      [-0.00014, 2],
      [-0.00129, 0],
      [-0.00105, 0],
      [-0.0008, 0],
      [-0.00019, 2],
      [-0.00108, 0],
      [-0.00098, 0],
      [-0.00122, 0],
      [-0.00013, 2],
      [0.00089, 1],
      [-7e-5, 2],
      [-0.00089, 0],
      [-0.00023, 2],
      [-0.00074, 0],
      [-0.0003, 2],
      [-0.00011, 2],
      [-0.00012, 2],
      [-0.00017, 2],
      [-0.00059, 0],
      [-0.00013, 2],
      [-0.00056, 2],
      [-0.00011, 2],
      [-0.00074, 0],
      [-0.00085, 0],
      [0.00088, 1],
      [-9e-5, 2],
      [-0.00069, 0],
      [-0.00024, 2]
    ],
    "red_o_points": [],
    "y_categories": ["N", "NOT APPLICABLE", "nan"],
    "blue_o_points": [],
    "blue_x_points": [
      [0.0029, 1],
      [-8e-5, 2],
      [0.00182, 1],
      [0.00025, 0],
      [-0.0004, 0],
      [0.002, 1],
      [-4e-5, 2],
      [0.00233, 1],
      [-2e-5, 2],
      [-0.0001, 2]
    ]
  },
  "QA_yonInjUnconscio": {
    "red_x_points": [
      [-0.00833, 1],
      [-0.00786, 1],
      [-0.00595, 2],
      [-0.00485, 2],
      [-0.00628, 2],
      [0.02503, 0],
      [-0.01154, 1],
      [-0.00661, 2],
      [-0.00726, 2],
      [-0.00784, 2],
      [-0.00615, 2],
      [-0.01434, 1],
      [-0.00897, 1],
      [-0.02656, 1],
      [-0.0086, 2],
      [-0.00572, 2],
      [-0.00662, 2],
      [-0.00782, 1],
      [0.00727, 0],
      [-0.01071, 1],
      [-0.00764, 1],
      [-0.00875, 1],
      [-0.00845, 1],
      [-0.00848, 2],
      [-0.01002, 1],
      [-0.00735, 2],
      [-0.01134, 1],
      [-0.00866, 1],
      [-0.00263, 2],
      [-0.0062, 2],
      [-0.00953, 1],
      [-0.00659, 2]
    ],
    "red_o_points": [],
    "y_categories": ["N", "Y", "nan"],
    "blue_o_points": [],
    "blue_x_points": [
      [0.00014, 2],
      [0.01046, 1],
      [0.02346, 0],
      [0.03654, 0],
      [0.03471, 0],
      [0.00132, 2],
      [-0.00313, 1],
      [0.00102, 2],
      [0.04152, 0],
      [-0.00149, 2]
    ]
  },
  "QA_lstPexTouch[C7]": {
    "red_x_points": [
      [-0.00957, 1],
      [-0.00225, 2],
      [-0.0036, 1],
      [-0.00258, 2],
      [-0.00882, 1],
      [0.00363, 0],
      [-0.0035, 1],
      [-0.00499, 1],
      [0.00652, 0],
      [-0.00314, 1],
      [0.00451, 0],
      [-0.00477, 1],
      [-0.0135, 1],
      [-0.01227, 2],
      [-0.0043, 2],
      [-0.00337, 2],
      [-0.01082, 1],
      [-0.00228, 2],
      [-0.00678, 2],
      [0.00773, 0],
      [-0.01043, 1],
      [0.0073, 0],
      [-0.00296, 2],
      [-0.00437, 2],
      [0.00483, 0],
      [0.00786, 0],
      [-0.00319, 1],
      [-0.00273, 2],
      [-0.00238, 1],
      [-0.00496, 2],
      [-0.0029, 1],
      [-0.00999, 1]
    ],
    "red_o_points": [],
    "y_categories": ["NORM", "NPV", "nan"],
    "blue_o_points": [],
    "blue_x_points": [
      [1e-5, 1],
      [0.00016, 2],
      [0.00153, 1],
      [0.00124, 1],
      [0.01306, 0],
      [0.00117, 1],
      [0.01213, 0],
      [0.00581, 0],
      [0.01036, 0],
      [0.01282, 0]
    ]
  },
  "QA_lstPexMuscstrength[ShoulderAbduc]": {
    "red_x_points": [
      [-0.00391, 1],
      [-0.00337, 1],
      [-0.00337, 1],
      [-0.00353, 1],
      [-0.00374, 1],
      [-0.0039, 1],
      [-0.00343, 1],
      [-0.00363, 1],
      [-0.00355, 1],
      [-0.00385, 1],
      [-0.00379, 1],
      [-0.00364, 1],
      [-0.00415, 1],
      [0.00075, 2],
      [0.00107, 2],
      [0.00146, 2],
      [0.0014, 2],
      [0.00118, 2],
      [0.00115, 2],
      [-0.0036, 1],
      [-0.00392, 1],
      [-0.00348, 1],
      [-0.00315, 1],
      [0.00126, 2],
      [-0.00517, 1],
      [-0.0034, 1],
      [-0.0037, 1],
      [-0.00327, 1],
      [0.0015, 2],
      [-0.00373, 1],
      [-0.00348, 1],
      [0.00153, 2]
    ],
    "red_o_points": [],
    "y_categories": ["GREATER THAN OR EQUALS TO 3", "LESS THAN 3", "nan"],
    "blue_o_points": [],
    "blue_x_points": [
      [0.00162, 2],
      [0.00199, 2],
      [0.02016, 0],
      [0.00272, 2],
      [-0.00292, 1],
      [0.01968, 0],
      [0.00222, 2],
      [-0.00144, 1],
      [-0.0022, 1],
      [-0.00233, 1]
    ]
  },
  "QA_lstPexMuscstrength[ThumbOppo]": {
    "red_x_points": [
      [-0.00739, 1],
      [0.00126, 2],
      [-0.00598, 1],
      [-0.00476, 1],
      [-0.00806, 1],
      [0.00149, 0],
      [0.00149, 0],
      [-0.00768, 1],
      [0.00117, 0],
      [0.00144, 0],
      [0.00169, 0],
      [0.00154, 0],
      [0.00114, 0],
      [0.00074, 2],
      [0.00148, 2],
      [0.00083, 2],
      [0.00133, 0],
      [0.00073, 2],
      [0.0012, 2],
      [0.00137, 0],
      [-0.00788, 1],
      [0.00111, 0],
      [-0.00507, 1],
      [0.00119, 2],
      [0.00177, 2],
      [0.00146, 2],
      [0.00101, 0],
      [-0.00473, 1],
      [0.00101, 2],
      [-0.00763, 1],
      [-0.00592, 1],
      [0.00087, 2]
    ],
    "red_o_points": [],
    "y_categories": ["GREATER THAN OR EQUALS TO 3", "LESS THAN 3", "nan"],
    "blue_o_points": [],
    "blue_x_points": [
      [0.00058, 2],
      [0.00159, 2],
      [0.00123, 0],
      [0.00387, 2],
      [0.00328, 0],
      [0.00172, 0],
      [0.00307, 0],
      [0.00162, 0],
      [0.0029, 2],
      [0.00234, 2]
    ]
  },
  "participant_code": {
    "red_x_points": [
      [-0.03435, 1],
      [-0.03405, 2],
      [-0.03576, 3],
      [-0.0327, 4],
      [-0.0347, 5],
      [-0.03411, 6],
      [-0.03411, 7],
      [-0.03305, 8],
      [-0.03388, 9],
      [-0.03423, 10],
      [-0.03329, 11],
      [-0.03546, 12],
      [-0.03482, 13],
      [-0.0337, 15],
      [-0.03358, 17],
      [-0.0337, 18],
      [-0.03405, 20],
      [-0.03317, 21],
      [-0.03382, 22],
      [-0.03258, 24],
      [-0.03317, 26],
      [-0.03329, 27],
      [-0.03429, 28],
      [-0.0344, 30],
      [-0.03417, 31],
      [-0.03505, 32],
      [-0.03399, 34],
      [-0.0337, 36],
      [-0.03341, 38],
      [-0.03376, 39],
      [-0.03488, 40],
      [-0.03364, 41]
    ],
    "red_o_points": [],
    "y_categories": [
      "P16554",
      "P18297",
      "P19283",
      "P19287",
      "P23391",
      "P30595",
      "P31645",
      "P31691",
      "P34778",
      "P35046",
      "P36328",
      "P43633",
      "P4544",
      "P46417",
      "P48965",
      "P53068",
      "P5497",
      "P59529",
      "P62483",
      "P64658",
      "P65202",
      "P66816",
      "P6751",
      "P7408",
      "P75566",
      "P76226",
      "P79971",
      "P82621",
      "P82990",
      "P84549",
      "P84932",
      "P85825",
      "P86989",
      "P8770",
      "P87791",
      "P90550",
      "P93159",
      "P94969",
      "P96710",
      "P97130",
      "P9744",
      "P98500",
      "nan"
    ],
    "blue_o_points": [],
    "blue_x_points": [
      [0.06944, 0],
      [0.06959, 14],
      [0.07072, 16],
      [0.07283, 19],
      [0.0693, 23],
      [0.06747, 25],
      [0.06987, 29],
      [0.0717, 33],
      [0.07297, 35],
      [0.07453, 37]
    ]
  },
  "QA_yonInjBpsurg": {
    "red_x_points": [
      [-0.00158, 1],
      [-0.00137, 1],
      [-0.00136, 1],
      [-0.00127, 1],
      [-0.00158, 1],
      [-0.00174, 1],
      [-0.00134, 1],
      [-0.00149, 1],
      [-0.00191, 1],
      [-0.00147, 1],
      [-0.00184, 1],
      [-0.00157, 1],
      [-0.00155, 1],
      [0.00343, 0],
      [-0.00189, 1],
      [-0.00149, 1],
      [-0.00157, 1],
      [-0.00102, 1],
      [-0.00117, 1],
      [-0.00178, 1],
      [-0.00146, 1],
      [-0.0013, 1],
      [-0.00099, 1],
      [-0.0017, 1],
      [-0.00172, 1],
      [-0.00161, 1],
      [-0.00119, 1],
      [-0.00126, 1],
      [0.00329, 0],
      [-0.0014, 1],
      [-0.00132, 1],
      [-0.00189, 1]
    ],
    "red_o_points": [],
    "y_categories": ["N", "Y", "nan"],
    "blue_o_points": [],
    "blue_x_points": [
      [0.0078, 0],
      [-0.00034, 1],
      [0.00602, 0],
      [-0.0014, 1],
      [-0.00138, 1],
      [0.00626, 0],
      [-0.00079, 1],
      [0.00693, 0],
      [-0.00078, 1],
      [-9e-5, 1]
    ]
  },
  "QA_lstPexTouch[T1]": {
    "red_x_points": [
      [-0.01065, 1],
      [-0.00202, 2],
      [0.00087, 1],
      [-0.00201, 2],
      [-0.01084, 1],
      [-0.00734, 0],
      [0.00072, 1],
      [0.00152, 1],
      [-0.01332, 1],
      [-0.00397, 0],
      [-0.00368, 0],
      [-0.00716, 0],
      [0.01006, 0],
      [-0.00997, 2],
      [-0.00635, 2],
      [-0.00355, 2],
      [-0.01168, 1],
      [-0.00103, 2],
      [-0.00745, 2],
      [0.00792, 0],
      [-0.01109, 1],
      [0.00934, 0],
      [-0.00391, 2],
      [-0.00684, 2],
      [-0.01176, 1],
      [0.00946, 0],
      [0.00214, 1],
      [-0.00163, 2],
      [-0.00339, 1],
      [-0.00689, 2],
      [0.00043, 1],
      [-0.01235, 1]
    ],
    "red_o_points": [],
    "y_categories": ["NORM", "NPV", "nan"],
    "blue_o_points": [],
    "blue_x_points": [
      [0.0009, 1],
      [8e-5, 2],
      [0.00121, 1],
      [0.00662, 1],
      [0.00894, 1],
      [0.00096, 1],
      [0.01575, 0],
      [0.00614, 0],
      [0.01328, 0],
      [0.01795, 0]
    ]
  },
  "QS_mulTransfSite[Other]": {
    "red_x_points": [
      [-0.00269, 3],
      [-0.01652, 0],
      [-0.01714, 0],
      [-0.01842, 0],
      [-0.00322, 3],
      [-0.01886, 0],
      [-0.01783, 0],
      [-0.01867, 0],
      [-0.00331, 3],
      [-0.01646, 0],
      [-0.01875, 0],
      [-0.01886, 0],
      [-0.00283, 3],
      [0.02499, 1],
      [-0.00294, 3],
      [-0.01687, 0],
      [-0.00272, 3],
      [-0.01655, 0],
      [-0.00395, 3],
      [-0.00327, 3],
      [-0.00307, 3],
      [-0.00276, 3],
      [-0.0175, 0],
      [-0.00338, 3],
      [-0.00329, 3],
      [-0.00292, 3],
      [-0.01717, 0],
      [-0.01783, 0],
      [0.0253, 1],
      [-0.00286, 3],
      [-0.01872, 0],
      [-0.00283, 3]
    ],
    "red_o_points": [],
    "y_categories": ["N", "NOT APPLICABLE", "Y", "nan"],
    "blue_o_points": [],
    "blue_x_points": [
      [0.03415, 1],
      [-0.00137, 3],
      [0.02684, 1],
      [-0.0068, 0],
      [0.05687, 2],
      [0.02788, 1],
      [-0.00119, 3],
      [0.02954, 1],
      [-0.0009, 3],
      [-0.00068, 3]
    ]
  },
  "QS_mulBpsurgeryType[Lysis]": {
    "red_x_points": [
      [-0.00178, 3],
      [-0.00598, 0],
      [-0.01422, 2],
      [-0.00644, 0],
      [-0.00191, 3],
      [-0.00625, 0],
      [-0.01459, 2],
      [-0.006, 0],
      [-0.00227, 3],
      [-0.00608, 0],
      [-0.00659, 0],
      [-0.00485, 0],
      [-0.00176, 3],
      [0.01304, 1],
      [-0.00211, 3],
      [-0.0057, 0],
      [-0.00145, 3],
      [-0.01208, 2],
      [-0.00254, 3],
      [-0.00216, 3],
      [-0.00178, 3],
      [-0.00177, 3],
      [-0.00538, 0],
      [-0.00205, 3],
      [-0.00316, 3],
      [-0.00142, 3],
      [-0.00504, 0],
      [-0.0047, 0],
      [0.01539, 1],
      [-0.00169, 3],
      [-0.01402, 2],
      [-0.00199, 3]
    ],
    "red_o_points": [],
    "y_categories": ["N", "NOT APPLICABLE", "Y", "nan"],
    "blue_o_points": [],
    "blue_x_points": [
      [0.02227, 1],
      [-0.00052, 3],
      [0.01641, 1],
      [0.00187, 0],
      [-0.0007, 0],
      [0.01639, 1],
      [-0.00095, 3],
      [0.01899, 1],
      [-0.00067, 3],
      [-0.00018, 3]
    ]
  },
  "QS_mulLysisSite[Trunk]": {
    "red_x_points": [
      [-0.00104, 3],
      [-0.00331, 0],
      [-0.00307, 0],
      [-0.00358, 0],
      [-0.00121, 3],
      [-0.00359, 0],
      [-0.00881, 2],
      [-0.00304, 0],
      [-0.00123, 3],
      [-0.0036, 0],
      [-0.00406, 0],
      [-0.00302, 0],
      [-0.00115, 3],
      [0.00752, 1],
      [-0.00099, 3],
      [-0.00395, 0],
      [-0.00122, 3],
      [-0.00626, 2],
      [-0.00094, 3],
      [-0.00107, 3],
      [-0.00109, 3],
      [-0.00114, 3],
      [-0.00285, 0],
      [-0.00127, 3],
      [-0.00132, 3],
      [-0.00105, 3],
      [-0.00344, 0],
      [-0.00305, 0],
      [0.00743, 1],
      [-0.00115, 3],
      [-0.00779, 2],
      [-0.00143, 3]
    ],
    "red_o_points": [],
    "y_categories": ["N", "NOT APPLICABLE", "Y", "nan"],
    "blue_o_points": [],
    "blue_x_points": [
      [0.01267, 1],
      [-0.00019, 3],
      [0.00972, 1],
      [0.00029, 0],
      [-0.00121, 0],
      [0.00922, 1],
      [-0.00041, 3],
      [0.01028, 1],
      [-0.00045, 3],
      [-0.00017, 3]
    ]
  },
  "QS_mulNeuromadSite[C4]": {
    "red_x_points": [
      [-0.00015, 2],
      [-0.00082, 0],
      [-0.00078, 0],
      [-0.00081, 0],
      [-0.00015, 2],
      [-0.00091, 0],
      [-0.00057, 0],
      [-0.00088, 0],
      [-0.00016, 2],
      [-0.00115, 0],
      [-0.00122, 0],
      [-0.00063, 0],
      [-0.00025, 2],
      [0.0009, 1],
      [-0.00024, 2],
      [-0.00098, 0],
      [-0.00023, 2],
      [-0.00078, 0],
      [-0.00022, 2],
      [-0.00022, 2],
      [-0.00016, 2],
      [-0.00018, 2],
      [-0.00059, 0],
      [-0.00024, 2],
      [-0.00036, 2],
      [-0.00011, 2],
      [-0.00083, 0],
      [-0.00064, 0],
      [0.00102, 1],
      [-9e-5, 2],
      [-0.0006, 0],
      [-0.00025, 2]
    ],
    "red_o_points": [],
    "y_categories": ["N", "NOT APPLICABLE", "nan"],
    "blue_o_points": [],
    "blue_x_points": [
      [0.00268, 1],
      [-0.00012, 2],
      [0.0017, 1],
      [0.00015, 0],
      [-0.00034, 0],
      [0.00191, 1],
      [-0.00013, 2],
      [0.00245, 1],
      [-2e-5, 2],
      [5e-5, 2]
    ]
  },
  "QS_mulGraftTrunk[UpperTrunk]": {
    "red_x_points": [
      [-0.00037, 3],
      [-0.00112, 0],
      [-0.00088, 0],
      [-0.00088, 0],
      [-0.00034, 3],
      [-0.00089, 0],
      [-0.00087, 0],
      [-0.00096, 0],
      [-0.00028, 3],
      [-0.00091, 0],
      [-0.00108, 0],
      [-0.00089, 0],
      [-0.00031, 3],
      [0.00185, 1],
      [-0.00023, 3],
      [-0.0031, 2],
      [-0.00036, 3],
      [-0.00087, 0],
      [-0.00029, 3],
      [-0.00034, 3],
      [-0.00027, 3],
      [-0.00032, 3],
      [-0.00083, 0],
      [-0.0004, 3],
      [-0.00029, 3],
      [-0.00026, 3],
      [-0.00091, 0],
      [-0.00076, 0],
      [0.00238, 1],
      [-0.00021, 3],
      [-0.00069, 0],
      [-0.00033, 3]
    ],
    "red_o_points": [],
    "y_categories": ["N", "NOT APPLICABLE", "Y", "nan"],
    "blue_o_points": [],
    "blue_x_points": [
      [0.00364, 1],
      [-0.00016, 3],
      [0.00233, 1],
      [0.00015, 0],
      [-0.00069, 0],
      [0.00282, 1],
      [-0.00027, 3],
      [0.00207, 1],
      [-0.00022, 3],
      [-0.00011, 3]
    ]
  },
  "QS_mulTransfSite[PhMc]": {
    "red_x_points": [
      [-0.00065, 3],
      [-0.00223, 0],
      [-0.00213, 0],
      [-0.0026, 0],
      [-0.00099, 3],
      [-0.00265, 0],
      [-0.00225, 0],
      [-0.00877, 2],
      [-0.00082, 3],
      [-0.00277, 0],
      [-0.00261, 0],
      [-0.00256, 0],
      [-0.00059, 3],
      [0.00625, 1],
      [-0.00076, 3],
      [-0.00295, 0],
      [-0.00056, 3],
      [-0.00276, 0],
      [-0.00075, 3],
      [-0.00065, 3],
      [-0.00053, 3],
      [-0.00065, 3],
      [-0.00539, 2],
      [-0.00071, 3],
      [-0.00127, 3],
      [-0.00084, 3],
      [-0.00234, 0],
      [-0.0024, 0],
      [0.00681, 1],
      [-0.00079, 3],
      [-0.00218, 0],
      [-0.00073, 3]
    ],
    "red_o_points": [],
    "y_categories": ["N", "NOT APPLICABLE", "Y", "nan"],
    "blue_o_points": [],
    "blue_x_points": [
      [0.00843, 1],
      [-0.0003, 3],
      [0.00699, 1],
      [-0.00093, 0],
      [-0.00011, 0],
      [0.0068, 1],
      [5e-5, 3],
      [0.00651, 1],
      [-0.0002, 3],
      [-0.00034, 3]
    ]
  },
  "QS_mulTransfSite[Oberlin]": {
    "red_x_points": [
      [-0.00274, 3],
      [-0.0205, 0],
      [-0.02111, 0],
      [-0.01995, 0],
      [-0.00325, 3],
      [-0.00384, 2],
      [-0.00342, 2],
      [-0.02068, 0],
      [-0.00377, 3],
      [-0.00434, 2],
      [-0.00401, 2],
      [-0.00322, 2],
      [-0.00297, 3],
      [0.0236, 1],
      [-0.00327, 3],
      [-0.00422, 2],
      [-0.00316, 3],
      [-0.02082, 0],
      [-0.00386, 3],
      [-0.00311, 3],
      [-0.00293, 3],
      [-0.00273, 3],
      [-0.01968, 0],
      [-0.00322, 3],
      [-0.00588, 3],
      [-0.00318, 3],
      [-0.00382, 2],
      [-0.02013, 0],
      [0.02467, 1],
      [-0.00281, 3],
      [-0.02112, 0],
      [-0.00348, 3]
    ],
    "red_o_points": [],
    "y_categories": ["N", "NOT APPLICABLE", "Y", "nan"],
    "blue_o_points": [],
    "blue_x_points": [
      [0.03087, 1],
      [-0.00109, 3],
      [0.02744, 1],
      [0.00371, 2],
      [0.00199, 2],
      [0.02749, 1],
      [-0.0015, 3],
      [0.03153, 1],
      [-0.0015, 3],
      [-0.00102, 3]
    ]
  },
  "QA_mulInjTbpiCause[Motorcycle]": {
    "red_x_points": [
      [-0.00231, 0],
      [-0.00063, 1],
      [-0.00064, 1],
      [-0.00061, 1],
      [-0.00028, 1],
      [-0.00084, 1],
      [-0.00041, 1],
      [-0.00071, 1],
      [0.0011, 1],
      [-0.00056, 1],
      [-0.00054, 1],
      [-0.00026, 1],
      [-0.01052, 0],
      [-0.04525, 1],
      [-0.00086, 1],
      [-0.00119, 1],
      [-0.00021, 1],
      [-0.0007, 1],
      [-0.0013, 1],
      [-0.01337, 0],
      [0.00036, 1],
      [0.00304, 1],
      [-0.00032, 1],
      [-0.00049, 1],
      [-0.00076, 1],
      [-0.00852, 0],
      [-0.00037, 1],
      [-0.00021, 1],
      [-0.04703, 1],
      [-0.00024, 1],
      [-0.00029, 1],
      [-0.00081, 1]
    ],
    "red_o_points": [],
    "y_categories": ["N", "Y", "nan"],
    "blue_o_points": [],
    "blue_x_points": [
      [0.02179, 0],
      [-0.00091, 1],
      [0.016, 0],
      [-0.00156, 1],
      [-0.00035, 1],
      [0.0199, 0],
      [0.00464, 1],
      [0.01853, 0],
      [0.00589, 1],
      [0.0041, 1]
    ]
  },
  "QS_mulLysisRoot[C6]": {
    "red_x_points": [
      [-0.00038, 3],
      [-0.00144, 0],
      [-0.00551, 2],
      [-0.00156, 0],
      [-0.00049, 3],
      [-0.00139, 0],
      [-0.00119, 0],
      [-0.00121, 0],
      [-0.00063, 3],
      [-0.00159, 0],
      [-0.0015, 0],
      [-0.001, 0],
      [-0.00034, 3],
      [0.00303, 1],
      [-0.00062, 3],
      [-0.00151, 0],
      [-0.00038, 3],
      [-0.00115, 0],
      [-0.0004, 3],
      [-0.00079, 3],
      [-0.0004, 3],
      [-0.00045, 3],
      [-0.00131, 0],
      [-0.00075, 3],
      [-0.00032, 3],
      [-0.00032, 3],
      [-0.00126, 0],
      [-0.00117, 0],
      [0.00264, 1],
      [-0.00039, 3],
      [-0.00484, 2],
      [-0.00051, 3]
    ],
    "red_o_points": [],
    "y_categories": ["N", "NOT APPLICABLE", "Y", "nan"],
    "blue_o_points": [],
    "blue_x_points": [
      [0.00613, 1],
      [-0.00025, 3],
      [0.00365, 1],
      [0.00106, 0],
      [-0.00027, 0],
      [0.00369, 1],
      [-0.00029, 3],
      [0.00455, 1],
      [-0.00022, 3],
      [-0.0001, 3]
    ]
  },
  "QS_mulGraftNerve[FI]": {
    "red_x_points": [
      [-0.00014, 2],
      [-0.0002, 0],
      [-0.00016, 0],
      [-0.00025, 0],
      [-0.00012, 2],
      [-0.00026, 0],
      [-0.0001, 0],
      [-0.00022, 0],
      [-9e-5, 2],
      [-0.00016, 0],
      [-0.00026, 0],
      [-0.00015, 0],
      [-4e-5, 2],
      [0.00052, 1],
      [-4e-5, 2],
      [-0.00024, 0],
      [1e-5, 2],
      [-0.00016, 0],
      [-4e-5, 2],
      [-6e-5, 2],
      [-6e-5, 2],
      [-3e-5, 2],
      [-0.00025, 0],
      [-4e-5, 2],
      [-2e-5, 2],
      [-1e-5, 2],
      [-0.00014, 0],
      [-0.00018, 0],
      [0.00042, 1],
      [1e-5, 2],
      [-0.00018, 0],
      [-0.00013, 2]
    ],
    "red_o_points": [],
    "y_categories": ["N", "NOT APPLICABLE", "nan"],
    "blue_o_points": [],
    "blue_x_points": [
      [0.00071, 1],
      [-1e-5, 2],
      [0.00034, 1],
      [-0.0001, 0],
      [-4e-5, 0],
      [0.00052, 1],
      [-1e-5, 2],
      [0.00034, 1],
      [3e-5, 2],
      [-1e-5, 2]
    ]
  }
}
