{
  "QA_lstPexPain[C7]": {
    "red_x_points": [
      [-0.02267, 1],
      [-0.01841, 2],
      [-0.02053, 2],
      [-0.01454, 1],
      [-0.0178, 2],
      [-0.01376, 1],
      [-0.01689, 1],
      [-0.02068, 1],
      [-0.02176, 2],
      [-0.02489, 2],
      [-0.03291, 2],
      [-0.01901, 2],
      [-0.01707, 1],
      [0.04631, 0],
      [-0.01955, 1],
      [-0.01655, 1],
      [-0.01545, 2],
      [-0.03203, 2],
      [-0.03968, 2],
      [-0.03022, 2],
      [-0.02158, 1],
      [-0.01355, 1],
      [-0.01906, 1]
    ],
    "red_o_points": [],
    "y_categories": ["NORM", "NPV", "nan"],
    "blue_o_points": [],
    "blue_x_points": [
      [-0.0162, 1],
      [-0.01395, 1],
      [0.05001, 0],
      [-0.00608, 1],
      [0.05889, 0],
      [-0.00775, 1],
      [0.06139, 0],
      [0.06047, 0],
      [-0.01971, 2],
      [-0.0034, 2],
      [-0.0156, 2],
      [-0.00901, 1],
      [-0.01403, 2],
      [0.0511, 0],
      [0.04686, 0],
      [0.04933, 0],
      [-0.01675, 2],
      [0.05241, 0],
      [0.06765, 0],
      [-0.01384, 1],
      [0.06047, 0]
    ]
  },
  "participant_code": {
    "red_x_points": [
      [-0.09839, 0],
      [-0.10033, 2],
      [-0.09732, 3],
      [-0.10081, 4],
      [-0.09751, 5],
      [-0.09975, 9],
      [-0.09693, 14],
      [-0.0978, 17],
      [-0.09712, 19],
      [-0.09955, 20],
      [-0.09868, 22],
      [-0.09887, 23],
      [-0.10081, 24],
      [-0.09839, 26],
      [-0.09848, 28],
      [-0.09741, 29],
      [-0.0979, 31],
      [-0.10033, 35],
      [-0.10179, 37],
      [-0.10033, 39],
      [-0.09848, 41],
      [-0.09771, 42],
      [-0.09625, 43]
    ],
    "red_o_points": [],
    "y_categories": [
      "P16554",
      "P18297",
      "P19283",
      "P19287",
      "P23172",
      "P23391",
      "P30595",
      "P31645",
      "P31691",
      "P34778",
      "P35046",
      "P36328",
      "P43633",
      "P4544",
      "P46417",
      "P48965",
      "P53068",
      "P5497",
      "P58556",
      "P59529",
      "P62483",
      "P64658",
      "P65202",
      "P66816",
      "P67052",
      "P6751",
      "P7408",
      "P75566",
      "P76226",
      "P79971",
      "P82621",
      "P82990",
      "P84549",
      "P84932",
      "P85825",
      "P86989",
      "P8770",
      "P87791",
      "P90550",
      "P93159",
      "P94969",
      "P96710",
      "P9744",
      "P98500",
      "nan"
    ],
    "blue_o_points": [],
    "blue_x_points": [
      [0.10716, 1],
      [0.10551, 6],
      [0.10644, 7],
      [0.1088, 8],
      [0.10829, 10],
      [0.10726, 11],
      [0.11004, 12],
      [0.10726, 13],
      [0.1089, 15],
      [0.10962, 16],
      [0.10561, 18],
      [0.10932, 21],
      [0.11045, 25],
      [0.1086, 27],
      [0.10736, 30],
      [0.10602, 32],
      [0.10901, 33],
      [0.10952, 34],
      [0.10983, 36],
      [0.10777, 38],
      [0.10818, 40]
    ]
  },
  "QA_equInjTbpiTime": {
    "red_x_points": [
      [-0.02631, 0],
      [-0.02382, 0],
      [0.00292, 3],
      [0.00328, 3],
      [-0.01898, 0],
      [-0.0151, 0],
      [-0.01709, 0],
      [-0.02239, 0],
      [0.00712, 3],
      [-0.02434, 0],
      [-0.02214, 0],
      [-0.02469, 0],
      [0.00388, 3],
      [0.00421, 3],
      [-0.0237, 0],
      [-0.0171, 0],
      [-0.02211, 2],
      [-0.0506, 2],
      [-0.01786, 0],
      [-0.03418, 2],
      [-0.02651, 0],
      [0.00272, 3],
      [0.03184, 1]
    ],
    "red_o_points": [],
    "y_categories": [
      "0 TO 6 MONTHS",
      "13 TO 24 MONTHS",
      "25 MONTHS OR MORE",
      "7 TO 12 MONTHS",
      "nan"
    ],
    "blue_o_points": [],
    "blue_x_points": [
      [-0.01738, 0],
      [0.04929, 1],
      [-0.01138, 0],
      [0.04783, 1],
      [0.00843, 3],
      [-0.01534, 0],
      [-0.01036, 0],
      [0.00719, 3],
      [-0.02448, 0],
      [0.0044, 2],
      [0.05722, 1],
      [0.01094, 3],
      [0.05884, 1],
      [0.00818, 3],
      [0.04143, 1],
      [0.04208, 1],
      [0.01589, 3],
      [0.04102, 1],
      [0.02007, 3],
      [0.01263, 3],
      [-0.01555, 0]
    ]
  },
  "QS_mulTransfSite[Oberlin]": {
    "red_x_points": [
      [-0.02605, 1],
      [-0.07254, 0],
      [-0.06729, 0],
      [-0.07323, 0],
      [-0.06628, 0],
      [-0.06354, 0],
      [0.0191, 3],
      [-0.02826, 1],
      [0.02233, 3],
      [0.02571, 2],
      [0.02109, 3],
      [-0.07332, 0],
      [0.01926, 3],
      [0.02822, 2],
      [-0.033, 1],
      [0.01839, 3],
      [-0.06737, 0],
      [0.01905, 3],
      [0.03063, 2],
      [-0.07548, 0],
      [-0.02705, 1],
      [-0.06648, 0],
      [0.02036, 3]
    ],
    "red_o_points": [],
    "y_categories": ["N", "NOT APPLICABLE", "Y", "nan"],
    "blue_o_points": [],
    "blue_x_points": [
      [0.02355, 3],
      [0.02256, 3],
      [0.03383, 2],
      [0.03798, 2],
      [0.02291, 3],
      [0.04102, 2],
      [0.0328, 2],
      [0.03561, 2],
      [0.02552, 3],
      [-0.00284, 1],
      [0.034, 2],
      [0.04036, 2],
      [0.02568, 3],
      [0.02246, 3],
      [0.02054, 3],
      [0.02104, 3],
      [0.0257, 3],
      [0.0213, 3],
      [-0.01335, 1],
      [0.02282, 3],
      [0.02226, 3]
    ]
  },
  "QA_lstPexTouch[C7]": {
    "red_x_points": [
      [-0.03086, 1],
      [-0.00756, 2],
      [-0.01769, 1],
      [-0.02077, 1],
      [-0.00808, 2],
      [-0.01643, 1],
      [-0.02563, 1],
      [-0.02587, 1],
      [-0.00648, 2],
      [-0.0105, 2],
      [-0.0259, 1],
      [-0.00748, 2],
      [-0.02593, 1],
      [0.03494, 0],
      [-0.02538, 1],
      [-0.02641, 1],
      [-0.00612, 2],
      [0.03289, 0],
      [-0.01945, 1],
      [-0.02099, 2],
      [-0.03139, 1],
      [-0.01732, 1],
      [-0.03144, 1]
    ],
    "red_o_points": [],
    "y_categories": ["NORM", "NPV", "nan"],
    "blue_o_points": [],
    "blue_x_points": [
      [-0.02736, 1],
      [-0.02264, 1],
      [0.04295, 0],
      [-0.01459, 1],
      [0.04536, 0],
      [-0.0173, 1],
      [0.04749, 0],
      [-0.01692, 1],
      [-0.00188, 2],
      [0.00879, 2],
      [-0.00191, 2],
      [-0.02099, 1],
      [0.0015, 2],
      [0.03914, 0],
      [0.03804, 0],
      [0.03613, 0],
      [0.00237, 2],
      [0.03637, 0],
      [0.05722, 0],
      [0.05968, 0],
      [0.04841, 0]
    ]
  },
  "QA_yonPexPain": {
    "red_x_points": [
      [-0.02741, 1],
      [-0.0322, 1],
      [-0.02258, 1],
      [-0.02201, 1],
      [-0.02732, 1],
      [-0.02203, 1],
      [-0.02575, 1],
      [-0.02414, 1],
      [-0.03482, 1],
      [-0.03298, 1],
      [0.03816, 0],
      [-0.03126, 1],
      [-0.02546, 1],
      [-0.0233, 1],
      [0.029, 0],
      [-0.02662, 1],
      [-0.02675, 1],
      [-0.02956, 1],
      [-0.02503, 1],
      [-0.02811, 1],
      [-0.02812, 1],
      [-0.02201, 1],
      [-0.03435, 1]
    ],
    "red_o_points": [],
    "y_categories": ["N", "Y", "nan"],
    "blue_o_points": [],
    "blue_x_points": [
      [-0.02541, 1],
      [0.04736, 0],
      [0.03872, 0],
      [0.04571, 0],
      [-0.02215, 1],
      [0.04741, 0],
      [-0.02081, 1],
      [-0.02001, 1],
      [-0.03607, 1],
      [0.08577, 2],
      [0.05958, 0],
      [-0.02547, 1],
      [0.06095, 0],
      [0.04016, 0],
      [0.04032, 0],
      [0.04076, 0],
      [0.07994, 2],
      [0.04824, 0],
      [-0.02032, 1],
      [-0.0284, 1],
      [0.06837, 2]
    ]
  },
  "QA_lstPexMuscstrength[FingersFlex]": {
    "red_x_points": [
      [0.00453, 2],
      [0.00587, 2],
      [-0.05804, 1],
      [0.01749, 0],
      [-0.05985, 1],
      [-0.05582, 1],
      [-0.06848, 1],
      [0.01781, 0],
      [0.00784, 2],
      [0.00564, 2],
      [0.01995, 0],
      [0.00582, 2],
      [-0.07264, 1],
      [0.01828, 0],
      [0.01786, 0],
      [-0.06937, 1],
      [-0.057, 1],
      [0.00591, 2],
      [0.01666, 0],
      [0.01253, 0],
      [0.00461, 2],
      [-0.05869, 1],
      [0.00526, 2]
    ],
    "red_o_points": [],
    "y_categories": ["GREATER THAN OR EQUALS TO 3", "LESS THAN 3", "nan"],
    "blue_o_points": [],
    "blue_x_points": [
      [0.02496, 0],
      [0.02426, 0],
      [0.01872, 0],
      [0.02011, 0],
      [0.02444, 0],
      [0.01998, 0],
      [0.01937, 0],
      [0.02029, 0],
      [0.00855, 2],
      [0.00772, 2],
      [0.00773, 2],
      [0.00795, 2],
      [0.00835, 2],
      [0.02355, 0],
      [0.0227, 0],
      [0.02303, 0],
      [0.00999, 2],
      [0.00705, 2],
      [0.01943, 0],
      [0.00877, 2],
      [0.00688, 2]
    ]
  },
  "QA_lstPexTouch[C8]": {
    "red_x_points": [
      [0.02172, 0],
      [-0.00688, 2],
      [-0.01747, 1],
      [-0.01897, 1],
      [-0.00676, 2],
      [-0.01349, 1],
      [-0.02079, 1],
      [-0.02293, 1],
      [-0.00506, 2],
      [-0.00864, 2],
      [-0.02334, 1],
      [-0.00638, 2],
      [-0.02378, 1],
      [0.02635, 0],
      [-0.02088, 1],
      [-0.02044, 1],
      [-0.00516, 2],
      [0.02031, 0],
      [-0.01769, 1],
      [-0.01738, 2],
      [-0.02225, 1],
      [-0.01628, 1],
      [-0.0236, 1]
    ],
    "red_o_points": [],
    "y_categories": ["NORM", "NPV", "nan"],
    "blue_o_points": [],
    "blue_x_points": [
      [-0.0233, 1],
      [-0.01883, 1],
      [0.027, 0],
      [-0.01079, 1],
      [0.03585, 0],
      [-0.01232, 1],
      [0.03215, 0],
      [0.03005, 0],
      [-0.00144, 2],
      [0.00967, 2],
      [-0.00103, 2],
      [-0.01738, 1],
      [0.00246, 2],
      [0.0288, 0],
      [0.02421, 0],
      [0.02427, 0],
      [0.0029, 2],
      [0.02186, 0],
      [0.03465, 0],
      [0.0329, 0],
      [0.02809, 0]
    ]
  }
}
