{
  "QA_lstPexPain[C8]": {
    "red_x_points": [
      [0.01066, 0],
      [-0.00864, 2],
      [-0.0081, 2],
      [0.00881, 0],
      [-0.00678, 2],
      [-0.00842, 1],
      [-0.01643, 1],
      [-0.01307, 1],
      [-0.01127, 2],
      [-0.0084, 2],
      [-0.01706, 2],
      [-0.00499, 2],
      [-0.01468, 1],
      [0.00791, 0],
      [-0.01671, 1],
      [-0.01224, 1],
      [-0.00482, 2],
      [-0.01042, 2],
      [-0.0152, 2],
      [-0.00724, 2],
      [-0.01687, 1],
      [-0.00716, 1],
      [-0.0184, 1]
    ],
    "red_o_points": [],
    "y_categories": ["NORM", "NPV", "nan"],
    "blue_o_points": [],
    "blue_x_points": [
      [-0.00916, 1],
      [-0.00844, 1],
      [0.01534, 0],
      [0.00087, 1],
      [0.02255, 0],
      [0.02247, 0],
      [0.01938, 0],
      [0.01877, 0],
      [-0.00794, 2],
      [-0.0009, 2],
      [-0.0051, 2],
      [-0.00022, 1],
      [-0.0052, 2],
      [0.0177, 0],
      [0.01783, 0],
      [0.01844, 0],
      [-0.00636, 2],
      [0.01864, 0],
      [0.01813, 0],
      [0.02781, 0],
      [0.02493, 0]
    ]
  },
  "QA_lstPexTouch[T1]": {
    "red_x_points": [
      [-0.01575, 1],
      [-0.00336, 2],
      [-0.00847, 1],
      [0.00895, 0],
      [-0.00341, 2],
      [-0.00832, 1],
      [0.00767, 0],
      [-0.01335, 1],
      [-0.00474, 2],
      [-0.00633, 2],
      [-0.0133, 1],
      [-0.00177, 2],
      [-0.0103, 1],
      [-0.02242, 1],
      [-0.01571, 1],
      [-0.00903, 1],
      [-0.0017, 2],
      [0.00315, 0],
      [-0.01342, 1],
      [-0.00627, 2],
      [-0.01531, 1],
      [-0.00594, 1],
      [-0.01119, 1]
    ],
    "red_o_points": [],
    "y_categories": ["NORM", "NPV", "nan"],
    "blue_o_points": [],
    "blue_x_points": [
      [-0.00937, 1],
      [-0.00683, 1],
      [0.01952, 0],
      [-0.01017, 1],
      [-0.00614, 1],
      [0.02736, 0],
      [0.02701, 0],
      [0.02433, 0],
      [-4e-5, 2],
      [0.0053, 2],
      [0.00041, 2],
      [-0.00768, 1],
      [0.00227, 2],
      [0.01437, 0],
      [0.01474, 0],
      [0.01416, 0],
      [0.00289, 2],
      [-0.006, 1],
      [0.02199, 0],
      [0.02212, 0],
      [0.02008, 0]
    ]
  },
  "QA_mulInjOrthesisType[ArmSling]": {
    "red_x_points": [
      [-0.00872, 2],
      [-0.01572, 2],
      [-0.00554, 2],
      [-0.00206, 2],
      [-0.00863, 2],
      [-0.00063, 2],
      [-5e-5, 2],
      [-0.01422, 1],
      [-0.01623, 2],
      [-0.01225, 2],
      [-0.00425, 2],
      [-0.03375, 0],
      [-0.01087, 3],
      [-0.00355, 2],
      [-0.02375, 1],
      [-0.00126, 2],
      [-0.02782, 3],
      [-0.01417, 2],
      [-0.00515, 2],
      [-0.01009, 2],
      [-0.01142, 3],
      [-0.00184, 2],
      [-0.00704, 2]
    ],
    "red_o_points": [],
    "y_categories": ["N", "NOT APPLICABLE", "Y", "nan"],
    "blue_o_points": [],
    "blue_x_points": [
      [0.00443, 2],
      [0.00161, 2],
      [0.00208, 2],
      [0.00536, 2],
      [-0.0006, 2],
      [0.00544, 2],
      [0.00059, 2],
      [0.00048, 2],
      [0.07154, 1],
      [0.05375, 1],
      [-0.00964, 2],
      [0.02977, 1],
      [0.04549, 1],
      [0.00049, 2],
      [0.0141, 0],
      [-6e-5, 2],
      [-0.01155, 2],
      [0.01504, 1],
      [0.01204, 1],
      [-0.00605, 2],
      [0.0047, 3]
    ]
  },
  "QA_lstPexPain[C6]": {
    "red_x_points": [
      [-0.00122, 1],
      [-0.00341, 2],
      [-0.00484, 2],
      [-0.00222, 1],
      [-0.00233, 2],
      [-0.00022, 1],
      [-0.00082, 1],
      [-0.00032, 1],
      [-0.0051, 2],
      [-0.00277, 2],
      [-0.01027, 2],
      [-0.00141, 2],
      [-0.0017, 1],
      [-0.00344, 1],
      [-0.00118, 1],
      [-0.00133, 1],
      [-0.00152, 2],
      [-0.00849, 2],
      [-0.0066, 2],
      [-0.00598, 2],
      [-0.0008, 1],
      [-0.00043, 1],
      [-0.00213, 1]
    ],
    "red_o_points": [],
    "y_categories": ["NORM", "NPV", "nan"],
    "blue_o_points": [],
    "blue_x_points": [
      [-0.00025, 1],
      [-0.00054, 1],
      [0.01296, 0],
      [0.00035, 1],
      [0.0225, 0],
      [0.00045, 1],
      [0.00039, 1],
      [-0.0001, 1],
      [-0.00201, 2],
      [-0.00134, 2],
      [-0.00213, 2],
      [-0.00054, 1],
      [-0.00136, 2],
      [0.01586, 0],
      [-0.00056, 1],
      [0.01492, 0],
      [-0.0026, 2],
      [0.01489, 0],
      [-0.00039, 1],
      [-0.00097, 1],
      [-0.001, 1]
    ]
  },
  "QA_lstPexTouch[C7]": {
    "red_x_points": [
      [-0.0199, 1],
      [-0.00743, 2],
      [-0.01444, 1],
      [-0.01885, 1],
      [-0.0051, 2],
      [-0.01216, 1],
      [-0.01793, 1],
      [-0.01942, 1],
      [-0.00696, 2],
      [-0.00832, 2],
      [-0.01818, 1],
      [-0.00505, 2],
      [-0.01811, 1],
      [0.01407, 0],
      [-0.0208, 1],
      [-0.01556, 1],
      [-0.00386, 2],
      [0.01659, 0],
      [-0.01495, 1],
      [-0.00545, 2],
      [-0.02293, 1],
      [-0.01244, 1],
      [-0.02004, 1]
    ],
    "red_o_points": [],
    "y_categories": ["NORM", "NPV", "nan"],
    "blue_o_points": [],
    "blue_x_points": [
      [-0.01437, 1],
      [-0.01541, 1],
      [0.02937, 0],
      [-0.00999, 1],
      [0.03431, 0],
      [-0.01056, 1],
      [0.03316, 0],
      [-0.01102, 1],
      [-0.00153, 2],
      [0.00571, 2],
      [-0.00108, 2],
      [-0.01092, 1],
      [0.00124, 2],
      [0.02755, 0],
      [0.0264, 0],
      [0.02789, 0],
      [0.00171, 2],
      [0.02566, 0],
      [0.03821, 0],
      [0.04212, 0],
      [0.03875, 0]
    ]
  },
  "QA_lstPexTouch[C6]": {
    "red_x_points": [
      [-0.00769, 1],
      [-0.00365, 2],
      [-0.00412, 1],
      [-0.00391, 1],
      [-0.00297, 2],
      [-0.00242, 1],
      [-0.00321, 1],
      [-0.00774, 1],
      [-0.00362, 2],
      [-0.00393, 2],
      [-0.00503, 1],
      [-0.00215, 2],
      [-0.00415, 1],
      [-0.009, 1],
      [-0.00868, 1],
      [-0.00291, 1],
      [-0.00218, 2],
      [-0.00644, 1],
      [-0.0035, 1],
      [-0.00719, 2],
      [-0.00725, 1],
      [-0.00231, 1],
      [-0.0048, 1]
    ],
    "red_o_points": [],
    "y_categories": ["NORM", "NPV", "nan"],
    "blue_o_points": [],
    "blue_x_points": [
      [-0.00438, 1],
      [-0.00423, 1],
      [0.02146, 0],
      [-0.00344, 1],
      [0.03568, 0],
      [-0.00354, 1],
      [-0.00303, 1],
      [-0.00332, 1],
      [-0.00082, 2],
      [0.00602, 2],
      [0.00028, 2],
      [-0.00326, 1],
      [0.00096, 2],
      [-0.00384, 1],
      [-0.00363, 1],
      [0.02224, 0],
      [0.00053, 2],
      [0.02478, 0],
      [0.03675, 0],
      [-0.00362, 1],
      [-0.00274, 1]
    ]
  },
  "QS_mulTransfSite[Oberlin]": {
    "red_x_points": [
      [-0.02235, 1],
      [-0.05805, 0],
      [-0.05606, 0],
      [-0.06354, 0],
      [-0.05535, 0],
      [-0.05323, 0],
      [0.01579, 3],
      [-0.02461, 1],
      [0.0172, 3],
      [0.02146, 2],
      [0.01609, 3],
      [-0.05716, 0],
      [0.01598, 3],
      [0.02315, 2],
      [-0.02744, 1],
      [0.01679, 3],
      [-0.05515, 0],
      [0.01614, 3],
      [0.02495, 2],
      [-0.06046, 0],
      [-0.02288, 1],
      [-0.0547, 0],
      [0.01635, 3]
    ],
    "red_o_points": [],
    "y_categories": ["N", "NOT APPLICABLE", "Y", "nan"],
    "blue_o_points": [],
    "blue_x_points": [
      [0.02174, 3],
      [0.01859, 3],
      [0.02719, 2],
      [0.03264, 2],
      [0.01882, 3],
      [0.03171, 2],
      [0.02827, 2],
      [0.0286, 2],
      [0.02143, 3],
      [-0.00335, 1],
      [0.02792, 2],
      [0.03497, 2],
      [0.01871, 3],
      [0.01929, 3],
      [0.01853, 3],
      [0.01756, 3],
      [0.02038, 3],
      [0.01731, 3],
      [-0.00979, 1],
      [0.01824, 3],
      [0.01831, 3]
    ]
  },
  "QA_lstPexArthre[Shoulder]": {
    "red_x_points": [
      [0.00902, 2],
      [-0.0022, 3],
      [-0.00517, 3],
      [0.00893, 2],
      [-0.02125, 0],
      [-0.0255, 1],
      [0.01002, 2],
      [0.01235, 2],
      [-0.00278, 3],
      [0.00326, 2],
      [-0.00667, 3],
      [-0.00156, 3],
      [-0.007, 3],
      [-0.05673, 1],
      [0.0117, 2],
      [-0.03079, 1],
      [-0.00106, 3],
      [-0.00582, 3],
      [-0.01056, 3],
      [-0.00284, 3],
      [-0.00622, 3],
      [-0.01968, 1],
      [-0.00755, 3]
    ],
    "red_o_points": [],
    "y_categories": ["NAIA", "NPV", "PV", "nan"],
    "blue_o_points": [],
    "blue_x_points": [
      [0.02027, 2],
      [-0.0038, 3],
      [0.01077, 2],
      [0.01845, 2],
      [-0.00136, 3],
      [0.01662, 2],
      [0.01841, 2],
      [0.01446, 2],
      [-0.00111, 3],
      [-0.00033, 3],
      [-0.00171, 3],
      [0.01857, 2],
      [-0.00024, 3],
      [0.01175, 2],
      [0.00949, 2],
      [-0.00178, 1],
      [-0.00075, 3],
      [0.00987, 2],
      [0.00024, 3],
      [0.0127, 2],
      [0.0076, 2]
    ]
  },
  "QA_lstPexTinel[TinelSign]": {
    "red_x_points": [
      [0.00162, 1],
      [-0.00334, 1],
      [-0.01408, 2],
      [0.00314, 1],
      [-0.00014, 1],
      [0.00153, 1],
      [-0.02042, 2],
      [-0.02509, 2],
      [-0.00682, 1],
      [-0.00128, 1],
      [-0.02671, 2],
      [-0.00481, 2],
      [0.0002, 1],
      [-0.032, 2],
      [0.00377, 1],
      [-0.01618, 2],
      [0.00025, 1],
      [0.00023, 1],
      [-0.02021, 2],
      [-0.01428, 2],
      [-0.00087, 1],
      [-0.01176, 2],
      [-0.00377, 1]
    ],
    "red_o_points": [],
    "y_categories": ["ABS", "NAIA", "PT", "nan"],
    "blue_o_points": [],
    "blue_x_points": [
      [0.01169, 1],
      [0.06228, 0],
      [0.02828, 0],
      [-0.01905, 2],
      [0.00915, 1],
      [0.00923, 1],
      [-0.01289, 2],
      [0.00919, 1],
      [0.01087, 2],
      [0.00234, 1],
      [0.00404, 1],
      [0.00781, 1],
      [0.00264, 1],
      [0.03282, 0],
      [0.00754, 1],
      [0.00607, 1],
      [0.00153, 2],
      [0.00364, 1],
      [0.01013, 1],
      [0.00187, 1],
      [0.00184, 1]
    ]
  },
  "QA_yonInjFracture": {
    "red_x_points": [
      [0.00606, 0],
      [-0.01438, 2],
      [0.00458, 0],
      [-0.01419, 2],
      [-0.0135, 1],
      [-0.01554, 1],
      [0.00438, 0],
      [0.00666, 0],
      [-0.01932, 1],
      [-0.01588, 1],
      [0.00455, 0],
      [-0.01102, 1],
      [-0.01744, 1],
      [-0.00334, 0],
      [-0.03409, 1],
      [-0.01873, 1],
      [-0.01254, 1],
      [0.00432, 0],
      [0.00277, 0],
      [0.00775, 0],
      [-0.01701, 1],
      [-0.00931, 1],
      [-0.0311, 1]
    ],
    "red_o_points": [],
    "y_categories": ["N", "Y", "nan"],
    "blue_o_points": [],
    "blue_x_points": [
      [0.01958, 0],
      [0.02115, 0],
      [0.00253, 0],
      [0.0128, 0],
      [0.00785, 2],
      [0.01134, 0],
      [0.01069, 1],
      [0.00452, 1],
      [-0.00902, 1],
      [0.01675, 0],
      [0.0211, 0],
      [0.01621, 0],
      [0.01761, 0],
      [0.00283, 0],
      [0.00576, 0],
      [0.00657, 2],
      [0.02058, 0],
      [0.00869, 0],
      [0.00481, 0],
      [-0.00179, 1],
      [0.00579, 2]
    ]
  },
  "QA_equInjTbpiTime": {
    "red_x_points": [
      [-0.02072, 0],
      [-0.01824, 0],
      [0.00346, 3],
      [0.00307, 3],
      [-0.01619, 0],
      [-0.01209, 0],
      [-0.01436, 0],
      [-0.02106, 0],
      [0.00394, 3],
      [-0.0197, 0],
      [-0.01927, 0],
      [-0.01509, 0],
      [0.00242, 3],
      [0.00023, 3],
      [-0.02288, 0],
      [-0.01365, 0],
      [-0.02172, 2],
      [-0.04288, 2],
      [-0.0179, 0],
      [-0.03049, 2],
      [-0.01911, 0],
      [0.00288, 3],
      [0.01752, 1]
    ],
    "red_o_points": [],
    "y_categories": [
      "0 TO 6 MONTHS",
      "13 TO 24 MONTHS",
      "25 MONTHS OR MORE",
      "7 TO 12 MONTHS",
      "nan"
    ],
    "blue_o_points": [],
    "blue_x_points": [
      [-0.01516, 0],
      [0.04064, 1],
      [-0.01154, 0],
      [0.04534, 1],
      [0.00789, 3],
      [-0.01366, 0],
      [-0.00888, 0],
      [0.00754, 3],
      [-0.01246, 0],
      [0.00144, 2],
      [0.05142, 1],
      [0.01283, 3],
      [0.0449, 1],
      [0.0078, 3],
      [0.0347, 1],
      [0.03211, 1],
      [0.0126, 3],
      [0.03262, 1],
      [0.01674, 3],
      [0.01218, 3],
      [-0.00723, 0]
    ]
  },
  "QA_lstPexMuscstrength[FingersAddu]": {
    "red_x_points": [
      [-0.00158, 2],
      [-0.00019, 2],
      [-0.02546, 1],
      [-0.0027, 2],
      [-0.02207, 1],
      [-0.02497, 1],
      [0.00949, 0],
      [0.00957, 0],
      [4e-5, 2],
      [0.00022, 2],
      [0.00534, 0],
      [0.00091, 2],
      [-0.02685, 1],
      [0.01133, 0],
      [0.00997, 0],
      [-0.02409, 1],
      [-0.02082, 1],
      [0.00162, 2],
      [-0.00242, 2],
      [-0.02318, 1],
      [-0.00194, 2],
      [-0.02091, 1],
      [-0.00296, 2]
    ],
    "red_o_points": [],
    "y_categories": ["GREATER THAN OR EQUALS TO 3", "LESS THAN 3", "nan"],
    "blue_o_points": [],
    "blue_x_points": [
      [0.01982, 0],
      [-0.00162, 1],
      [0.00809, 0],
      [0.00968, 0],
      [0.01604, 0],
      [0.01363, 0],
      [0.00414, 2],
      [0.01672, 0],
      [0.00138, 2],
      [0.00299, 2],
      [0.00284, 2],
      [0.00305, 2],
      [0.00285, 2],
      [0.01017, 0],
      [0.00984, 0],
      [0.00936, 0],
      [0.00456, 2],
      [0.00292, 2],
      [0.01424, 0],
      [0.00054, 2],
      [0.00045, 2]
    ]
  },
  "QA_yonPreFracture": {
    "red_x_points": [
      [-0.04936, 1],
      [0.00205, 2],
      [0.00795, 0],
      [0.00302, 2],
      [0.00827, 0],
      [0.00823, 0],
      [-0.04722, 1],
      [0.00956, 0],
      [0.0011, 2],
      [-0.05662, 1],
      [-0.05637, 1],
      [-0.0386, 1],
      [0.00243, 2],
      [0.00991, 0],
      [0.01007, 0],
      [0.00888, 0],
      [0.00681, 0],
      [0.01248, 0],
      [-0.05471, 1],
      [0.00769, 0],
      [0.00129, 2],
      [-0.03336, 1],
      [0.00148, 2]
    ],
    "red_o_points": [],
    "y_categories": ["N", "Y", "nan"],
    "blue_o_points": [],
    "blue_x_points": [
      [0.01431, 0],
      [0.00883, 2],
      [0.01189, 0],
      [0.01387, 0],
      [0.00663, 2],
      [0.01455, 0],
      [0.01419, 0],
      [0.01229, 2],
      [0.00568, 2],
      [0.01207, 0],
      [0.0167, 0],
      [0.01758, 0],
      [0.01394, 0],
      [0.00996, 0],
      [0.00934, 0],
      [0.00692, 2],
      [0.01502, 0],
      [0.01197, 0],
      [0.00928, 0],
      [0.00477, 2],
      [0.00523, 2]
    ]
  },
  "participant_code": {
    "red_x_points": [
      [-0.07537, 0],
      [-0.0744, 2],
      [-0.07333, 3],
      [-0.07372, 4],
      [-0.0742, 5],
      [-0.0743, 9],
      [-0.07275, 14],
      [-0.07333, 17],
      [-0.07614, 19],
      [-0.07313, 20],
      [-0.07313, 22],
      [-0.07362, 23],
      [-0.07614, 24],
      [-0.07391, 26],
      [-0.07381, 28],
      [-0.07527, 29],
      [-0.07546, 31],
      [-0.07381, 35],
      [-0.07411, 37],
      [-0.07488, 39],
      [-0.07362, 41],
      [-0.07566, 42],
      [-0.07566, 43]
    ],
    "red_o_points": [],
    "y_categories": [
      "P16554",
      "P18297",
      "P19283",
      "P19287",
      "P23172",
      "P23391",
      "P30595",
      "P31645",
      "P31691",
      "P34778",
      "P35046",
      "P36328",
      "P43633",
      "P4544",
      "P46417",
      "P48965",
      "P53068",
      "P5497",
      "P58556",
      "P59529",
      "P62483",
      "P64658",
      "P65202",
      "P66816",
      "P67052",
      "P6751",
      "P7408",
      "P75566",
      "P76226",
      "P79971",
      "P82621",
      "P82990",
      "P84549",
      "P84932",
      "P85825",
      "P86989",
      "P8770",
      "P87791",
      "P90550",
      "P93159",
      "P94969",
      "P96710",
      "P9744",
      "P98500",
      "nan"
    ],
    "blue_o_points": [],
    "blue_x_points": [
      [0.08227, 1],
      [0.0799, 6],
      [0.08289, 7],
      [0.08196, 8],
      [0.08021, 10],
      [0.08186, 11],
      [0.08011, 12],
      [0.08114, 13],
      [0.08371, 15],
      [0.08073, 16],
      [0.08155, 18],
      [0.08268, 21],
      [0.07939, 25],
      [0.08155, 27],
      [0.08134, 30],
      [0.08134, 32],
      [0.08083, 33],
      [0.08196, 34],
      [0.08206, 36],
      [0.08104, 38],
      [0.08124, 40]
    ]
  },
  "QA_lstPexPain[T1]": {
    "red_x_points": [
      [-0.01345, 1],
      [-0.00519, 2],
      [-0.00813, 2],
      [0.00156, 0],
      [-0.0032, 2],
      [-0.00144, 1],
      [-0.00554, 0],
      [-0.01226, 0],
      [-0.008, 2],
      [-0.00698, 2],
      [-0.01199, 2],
      [-0.00181, 2],
      [-0.00993, 1],
      [-0.02724, 1],
      [-0.00184, 1],
      [-0.00244, 1],
      [-0.00215, 2],
      [-0.01651, 2],
      [-0.01329, 2],
      [-0.00432, 2],
      [-0.01012, 1],
      [-0.0034, 1],
      [-0.0109, 1]
    ],
    "red_o_points": [],
    "y_categories": ["NORM", "NPV", "nan"],
    "blue_o_points": [],
    "blue_x_points": [
      [0.00835, 1],
      [0.00244, 1],
      [0.00875, 0],
      [0.00908, 1],
      [0.01776, 0],
      [0.00541, 1],
      [0.02038, 0],
      [0.02011, 0],
      [-0.00318, 2],
      [0.00279, 2],
      [-0.00291, 2],
      [0.00352, 1],
      [-0.00143, 2],
      [0.01176, 0],
      [0.00866, 0],
      [0.01049, 0],
      [-0.00228, 2],
      [-0.00849, 1],
      [0.01655, 0],
      [0.03138, 0],
      [0.01943, 0]
    ]
  },
  "QA_lstPexMuscstrength[FingersFlex]": {
    "red_x_points": [
      [0.00347, 2],
      [0.00377, 2],
      [-0.04796, 1],
      [0.0155, 0],
      [-0.04452, 1],
      [-0.04713, 1],
      [-0.05395, 1],
      [0.016, 0],
      [0.00463, 2],
      [0.00408, 2],
      [0.01534, 0],
      [0.00416, 2],
      [-0.05432, 1],
      [0.0149, 0],
      [0.01462, 0],
      [-0.05453, 1],
      [-0.04612, 1],
      [0.00521, 2],
      [0.01385, 0],
      [0.01093, 0],
      [0.00297, 2],
      [-0.04657, 1],
      [0.00256, 2]
    ],
    "red_o_points": [],
    "y_categories": ["GREATER THAN OR EQUALS TO 3", "LESS THAN 3", "nan"],
    "blue_o_points": [],
    "blue_x_points": [
      [0.02182, 0],
      [0.02072, 0],
      [0.01401, 0],
      [0.01517, 0],
      [0.01896, 0],
      [0.01641, 0],
      [0.01626, 0],
      [0.01619, 0],
      [0.00621, 2],
      [0.00686, 2],
      [0.00688, 2],
      [0.00769, 2],
      [0.00735, 2],
      [0.01617, 0],
      [0.0156, 0],
      [0.01563, 0],
      [0.00801, 2],
      [0.00552, 2],
      [0.01637, 0],
      [0.00637, 2],
      [0.00492, 2]
    ]
  },
  "QA_lstPexPain[C7]": {
    "red_x_points": [
      [-0.01345, 1],
      [-0.01365, 2],
      [-0.01192, 2],
      [-0.01549, 1],
      [-0.01173, 2],
      [-0.00907, 1],
      [-0.01158, 1],
      [-0.0131, 1],
      [-0.01354, 2],
      [-0.0134, 2],
      [-0.01771, 2],
      [-0.01086, 2],
      [-0.01269, 1],
      [0.01742, 0],
      [-0.01451, 1],
      [-0.01087, 1],
      [-0.00984, 2],
      [-0.01633, 2],
      [-0.01766, 2],
      [-0.01271, 2],
      [-0.01649, 1],
      [-0.00914, 1],
      [-0.01464, 1]
    ],
    "red_o_points": [],
    "y_categories": ["NORM", "NPV", "nan"],
    "blue_o_points": [],
    "blue_x_points": [
      [-0.00934, 1],
      [-0.01028, 1],
      [0.03374, 0],
      [-0.00409, 1],
      [0.03842, 0],
      [-0.00726, 1],
      [0.04034, 0],
      [0.04235, 0],
      [-0.01184, 2],
      [-0.00453, 2],
      [-0.0093, 2],
      [-0.00626, 1],
      [-0.00868, 2],
      [0.03103, 0],
      [0.03136, 0],
      [0.03376, 0],
      [-0.0099, 2],
      [0.03286, 0],
      [0.03907, 0],
      [-0.0106, 1],
      [0.04207, 0]
    ]
  },
  "QA_yonPexPain": {
    "red_x_points": [
      [-0.02093, 1],
      [-0.02469, 1],
      [-0.01983, 1],
      [-0.02003, 1],
      [-0.02249, 1],
      [-0.01891, 1],
      [-0.02016, 1],
      [-0.01964, 1],
      [-0.02768, 1],
      [-0.02429, 1],
      [0.02625, 0],
      [-0.02122, 1],
      [-0.02053, 1],
      [-0.02369, 1],
      [0.02573, 0],
      [-0.02103, 1],
      [-0.02113, 1],
      [-0.02486, 1],
      [-0.02221, 1],
      [-0.02362, 1],
      [-0.02123, 1],
      [-0.01727, 1],
      [-0.02701, 1]
    ],
    "red_o_points": [],
    "y_categories": ["N", "Y", "nan"],
    "blue_o_points": [],
    "blue_x_points": [
      [-0.02021, 1],
      [0.04491, 0],
      [0.03642, 0],
      [0.0413, 0],
      [-0.01812, 1],
      [0.03974, 0],
      [-0.01912, 1],
      [-0.01769, 1],
      [-0.02284, 1],
      [0.05621, 2],
      [0.04917, 0],
      [-0.02198, 1],
      [0.04596, 0],
      [0.03518, 0],
      [0.03229, 0],
      [0.03455, 0],
      [0.06491, 2],
      [0.03862, 0],
      [-0.01643, 1],
      [-0.02208, 1],
      [0.04965, 2]
    ]
  },
  "QA_lstPexTouch[C8]": {
    "red_x_points": [
      [0.00922, 0],
      [-0.00606, 2],
      [-0.01304, 1],
      [-0.01987, 1],
      [-0.00357, 2],
      [-0.01036, 1],
      [-0.01398, 1],
      [-0.01618, 1],
      [-0.00575, 2],
      [-0.00588, 2],
      [-0.01616, 1],
      [-0.00318, 2],
      [-0.0181, 1],
      [0.01105, 0],
      [-0.01579, 1],
      [-0.01342, 1],
      [-0.00288, 2],
      [0.00897, 0],
      [-0.01397, 1],
      [-0.00697, 2],
      [-0.01831, 1],
      [-0.01085, 1],
      [-0.01996, 1]
    ],
    "red_o_points": [],
    "y_categories": ["NORM", "NPV", "nan"],
    "blue_o_points": [],
    "blue_x_points": [
      [-0.01326, 1],
      [-0.01457, 1],
      [0.0185, 0],
      [-0.00838, 1],
      [0.02598, 0],
      [-0.0086, 1],
      [0.0237, 0],
      [0.02866, 0],
      [-0.00158, 2],
      [0.00334, 2],
      [0.00092, 2],
      [-0.00732, 1],
      [0.00244, 2],
      [0.01858, 0],
      [0.01844, 0],
      [0.02138, 0],
      [0.00294, 2],
      [0.01666, 0],
      [0.02356, 0],
      [0.03068, 0],
      [0.02297, 0]
    ]
  },
  "QA_mulInjOrthesisType[ShoulderSupport]": {
    "red_x_points": [
      [-0.0069, 0],
      [-0.01391, 0],
      [-0.00471, 0],
      [-0.02515, 2],
      [-0.00732, 0],
      [-8e-5, 0],
      [-0.00123, 0],
      [-0.01194, 1],
      [-0.01501, 0],
      [-0.01128, 0],
      [-0.0036, 0],
      [-0.02426, 2],
      [-0.01686, 3],
      [-0.00455, 0],
      [-0.01938, 1],
      [-0.0021, 0],
      [-0.02189, 3],
      [-0.01372, 0],
      [-0.00482, 0],
      [-0.009, 0],
      [-0.01384, 3],
      [-0.00117, 0],
      [-0.00612, 0]
    ],
    "red_o_points": [],
    "y_categories": ["N", "NOT APPLICABLE", "Y", "nan"],
    "blue_o_points": [],
    "blue_x_points": [
      [0.00375, 0],
      [0.00299, 0],
      [0.00162, 0],
      [0.00564, 0],
      [0.01555, 2],
      [0.00686, 0],
      [0.00077, 0],
      [0.00345, 0],
      [0.06094, 1],
      [0.0442, 1],
      [-0.00871, 0],
      [0.03063, 1],
      [0.04066, 1],
      [-0.00029, 0],
      [0.01043, 2],
      [-0.00099, 0],
      [-0.01073, 0],
      [0.01853, 1],
      [0.01266, 1],
      [-0.00354, 0],
      [0.00443, 3]
    ]
  }
}
