{
  "QA_lstPexMuscstrength[ElbowFlex]": {
    "red_x_points": [
      [-0.00311, 1],
      [-0.00301, 2],
      [-0.00384, 1],
      [-0.00308, 1],
      [-0.00287, 1],
      [0.00891, 0],
      [-0.00368, 1],
      [-0.00353, 1],
      [-0.00252, 1],
      [-0.00427, 1],
      [-0.00384, 1],
      [-0.00415, 1],
      [-0.00319, 1],
      [-0.00338, 2],
      [-0.00344, 2],
      [-0.00346, 2],
      [-0.00257, 1],
      [-0.0029, 2],
      [-0.0032, 2],
      [-0.00273, 1],
      [-0.00303, 1],
      [-0.00291, 1],
      [-0.00248, 1],
      [-0.00329, 2],
      [0.00237, 0],
      [-0.00178, 1],
      [-0.00411, 1],
      [-0.00287, 1],
      [-0.00297, 2],
      [-0.00272, 1],
      [-0.00281, 1],
      [-0.00366, 2]
    ],
    "red_o_points": [],
    "y_categories": ["GREATER THAN OR EQUALS TO 3", "LESS THAN 3", "nan"],
    "blue_o_points": [],
    "blue_x_points": [
      [-0.00051, 2],
      [-0.00062, 2],
      [0.01005, 0],
      [-5e-5, 1],
      [0.02199, 0],
      [0.00924, 0],
      [-0.00082, 1],
      [0.00942, 0],
      [-0.00027, 1],
      [-0.00011, 1]
    ]
  },
  "QS_mulLysisRoot[C6]": {
    "red_x_points": [
      [-0.00043, 3],
      [-0.00199, 0],
      [-0.00615, 2],
      [-0.0021, 0],
      [-0.00061, 3],
      [-0.00232, 0],
      [-0.0022, 0],
      [-0.00196, 0],
      [-0.0009, 3],
      [-0.00203, 0],
      [-0.00232, 0],
      [-0.00157, 0],
      [-0.00053, 3],
      [0.00452, 1],
      [-0.0008, 3],
      [-0.00243, 0],
      [-0.00061, 3],
      [-0.00179, 0],
      [-0.00073, 3],
      [-0.0009, 3],
      [-0.00043, 3],
      [-0.00053, 3],
      [-0.00213, 0],
      [-0.00092, 3],
      [-0.00098, 3],
      [-0.00056, 3],
      [-0.0022, 0],
      [-0.00215, 0],
      [0.00522, 1],
      [-0.00064, 3],
      [-0.00583, 2],
      [-0.00059, 3]
    ],
    "red_o_points": [],
    "y_categories": ["N", "NOT APPLICABLE", "Y", "nan"],
    "blue_o_points": [],
    "blue_x_points": [
      [0.00729, 1],
      [-0.0003, 3],
      [0.00586, 1],
      [0.00027, 0],
      [-0.00054, 0],
      [0.00586, 1],
      [-0.00031, 3],
      [0.00643, 1],
      [-0.00044, 3],
      [-7e-5, 3]
    ]
  },
  "QS_mulLysisTrunk[Upper]": {
    "red_x_points": [
      [-0.00114, 3],
      [-0.0049, 0],
      [-0.00491, 0],
      [-0.00578, 0],
      [-0.00131, 3],
      [-0.00576, 0],
      [-0.0111, 2],
      [-0.00529, 0],
      [-0.00138, 3],
      [-0.00556, 0],
      [-0.00679, 0],
      [-0.00458, 0],
      [-0.00067, 3],
      [0.00996, 1],
      [-0.00107, 3],
      [-0.00562, 0],
      [-0.00111, 3],
      [-0.01045, 2],
      [-0.00178, 3],
      [-0.00096, 3],
      [-0.00113, 3],
      [-0.00098, 3],
      [-0.00518, 0],
      [-0.00137, 3],
      [-0.00244, 3],
      [-0.00118, 3],
      [-0.00475, 0],
      [-0.00407, 0],
      [0.0112, 1],
      [-0.00105, 3],
      [-0.01136, 2],
      [-0.00144, 3]
    ],
    "red_o_points": [],
    "y_categories": ["N", "NOT APPLICABLE", "Y", "nan"],
    "blue_o_points": [],
    "blue_x_points": [
      [0.01779, 1],
      [-0.0002, 3],
      [0.01429, 1],
      [-0.00021, 0],
      [-0.00146, 0],
      [0.01371, 1],
      [-0.00027, 3],
      [0.01305, 1],
      [-0.00053, 3],
      [5e-5, 3]
    ]
  },
  "QA_lstPexPain[C5]": {
    "red_x_points": [
      [-0.00262, 1],
      [-0.00465, 2],
      [-0.0054, 2],
      [-0.00525, 2],
      [-0.00281, 1],
      [-0.00081, 1],
      [-0.00084, 1],
      [-0.00108, 1],
      [-0.00284, 1],
      [-0.00116, 1],
      [-0.00133, 1],
      [-0.00074, 1],
      [-0.00312, 1],
      [-0.01992, 2],
      [-0.00719, 2],
      [-0.00543, 2],
      [-0.00713, 2],
      [-0.00427, 2],
      [-0.00566, 2],
      [-0.00271, 1],
      [-0.00281, 1],
      [-0.00271, 1],
      [-0.00634, 2],
      [-0.00692, 2],
      [-0.00248, 1],
      [-0.00865, 2],
      [-0.00455, 2],
      [-0.00447, 2],
      [-0.00536, 1],
      [-0.00476, 1],
      [-0.00066, 1],
      [-0.00287, 1]
    ],
    "red_o_points": [],
    "y_categories": ["NORM", "NPV", "nan"],
    "blue_o_points": [],
    "blue_x_points": [
      [0.02441, 0],
      [-0.00306, 2],
      [0.00065, 1],
      [-0.00011, 1],
      [-0.00053, 1],
      [0.0003, 1],
      [-0.00131, 1],
      [0.02097, 0],
      [-0.00126, 1],
      [0.04851, 0]
    ]
  },
  "QS_mulGraftNerve[Ac]": {
    "red_x_points": [
      [4e-5, 2],
      [-0.00034, 0],
      [-0.00013, 0],
      [-0.00029, 0],
      [-1e-5, 2],
      [-0.00019, 0],
      [-9e-5, 0],
      [-0.00036, 0],
      [-7e-5, 2],
      [-0.0004, 0],
      [-0.00024, 0],
      [-0.0001, 0],
      [-5e-5, 2],
      [0.0001, 1],
      [-5e-5, 2],
      [-0.00038, 0],
      [4e-5, 2],
      [-0.00023, 0],
      [-6e-5, 2],
      [-6e-5, 2],
      [-4e-5, 2],
      [-6e-5, 2],
      [-0.0001, 0],
      [-3e-5, 2],
      [1e-5, 2],
      [-3e-5, 2],
      [-0.00026, 0],
      [-0.00014, 0],
      [0.00044, 1],
      [-4e-5, 2],
      [-4e-5, 0],
      [-6e-5, 2]
    ],
    "red_o_points": [],
    "y_categories": ["N", "NOT APPLICABLE", "nan"],
    "blue_o_points": [],
    "blue_x_points": [
      [0.0007, 1],
      [0.0001, 2],
      [0.00034, 1],
      [-9e-5, 0],
      [0.00058, 1],
      [0.0, 2],
      [0.00014, 1],
      [1e-5, 2],
      [3e-5, 2]
    ]
  },
  "QS_mulNeuromadSite[C8]": {
    "red_x_points": [
      [2e-5, 2],
      [-0.00233, 0],
      [-0.00199, 0],
      [-0.00253, 0],
      [-0.00035, 2],
      [-0.00252, 0],
      [-0.00188, 0],
      [-0.0022, 0],
      [-0.00033, 2],
      [-0.00285, 0],
      [-0.00299, 0],
      [-0.00191, 0],
      [-0.00011, 2],
      [0.00258, 1],
      [-0.00044, 2],
      [-0.00287, 0],
      [-0.00031, 2],
      [-0.00236, 0],
      [-0.00118, 2],
      [-0.00017, 2],
      [4e-5, 2],
      [-5e-5, 2],
      [-0.00189, 0],
      [-0.00024, 2],
      [-0.00116, 2],
      [-0.00031, 2],
      [-0.00231, 0],
      [-0.00179, 0],
      [0.00391, 1],
      [-0.00023, 2],
      [-0.00168, 0],
      [-0.00019, 2]
    ],
    "red_o_points": [],
    "y_categories": ["N", "NOT APPLICABLE", "nan"],
    "blue_o_points": [],
    "blue_x_points": [
      [0.00601, 1],
      [0.0001, 2],
      [0.00459, 1],
      [0.00053, 0],
      [-0.00039, 0],
      [0.00488, 1],
      [0.00013, 2],
      [0.00444, 1],
      [0.00015, 2],
      [0.00032, 2]
    ]
  },
  "QS_mulGraftNerve[Ph]": {
    "red_x_points": [
      [2e-5, 2],
      [-0.00017, 0],
      [-3e-5, 0],
      [-0.00014, 0],
      [0.0, 2],
      [-0.00011, 0],
      [-0.0001, 0],
      [-0.00014, 0],
      [-3e-5, 2],
      [-0.00012, 0],
      [-0.00017, 0],
      [-0.0001, 0],
      [0.0, 2],
      [9e-5, 1],
      [-3e-5, 2],
      [-0.00014, 0],
      [-2e-5, 2],
      [-7e-5, 0],
      [-3e-5, 2],
      [0.0, 2],
      [-2e-5, 2],
      [-3e-5, 2],
      [-7e-5, 0],
      [0.0, 2],
      [-0.00015, 2],
      [-3e-5, 2],
      [-0.00014, 0],
      [-0.0001, 0],
      [0.0002, 1],
      [-2e-5, 2],
      [-3e-5, 0],
      [0.0, 2]
    ],
    "red_o_points": [],
    "y_categories": ["N", "NOT APPLICABLE", "nan"],
    "blue_o_points": [],
    "blue_x_points": [
      [0.0005, 1],
      [2e-5, 2],
      [0.00041, 1],
      [-3e-5, 0],
      [-3e-5, 0],
      [0.00024, 1],
      [-3e-5, 2],
      [9e-5, 1],
      [0.0, 2],
      [1e-5, 2]
    ]
  },
  "QS_mulTransfSite[AcSsPA]": {
    "red_x_points": [
      [-0.00036, 3],
      [-0.00118, 0],
      [-0.00097, 0],
      [-0.00122, 0],
      [-0.00038, 3],
      [-0.00101, 0],
      [-0.00105, 0],
      [-0.00115, 0],
      [-0.00031, 3],
      [-0.00129, 0],
      [-0.00111, 0],
      [-0.00097, 0],
      [-0.00035, 3],
      [0.00203, 1],
      [-0.00035, 3],
      [-0.00116, 0],
      [-0.00037, 3],
      [-0.00315, 2],
      [-0.0007, 3],
      [-0.00029, 3],
      [-0.00036, 3],
      [-0.00034, 3],
      [-0.00116, 0],
      [-0.00042, 3],
      [-0.00057, 3],
      [-0.00039, 3],
      [-0.00101, 0],
      [-0.00102, 0],
      [0.00305, 1],
      [-0.00035, 3],
      [-0.00095, 0],
      [-0.00034, 3]
    ],
    "red_o_points": [],
    "y_categories": ["N", "NOT APPLICABLE", "Y", "nan"],
    "blue_o_points": [],
    "blue_x_points": [
      [0.00367, 1],
      [-4e-5, 3],
      [0.0035, 1],
      [-0.00029, 0],
      [-0.00075, 0],
      [0.00328, 1],
      [-0.0001, 3],
      [0.00371, 1],
      [-0.00024, 3],
      [-0.00029, 3]
    ]
  },
  "participant_code": {
    "red_x_points": [
      [-0.02911, 1],
      [-0.02705, 2],
      [-0.02894, 3],
      [-0.02788, 4],
      [-0.02952, 5],
      [-0.02929, 6],
      [-0.02864, 7],
      [-0.02782, 8],
      [-0.02994, 9],
      [-0.02811, 10],
      [-0.02841, 11],
      [-0.02888, 12],
      [-0.02758, 13],
      [-0.02835, 15],
      [-0.02782, 17],
      [-0.02794, 18],
      [-0.02852, 20],
      [-0.02735, 21],
      [-0.02782, 22],
      [-0.02723, 24],
      [-0.02923, 26],
      [-0.02846, 27],
      [-0.02888, 28],
      [-0.02829, 30],
      [-0.02888, 31],
      [-0.0287, 32],
      [-0.02911, 34],
      [-0.02935, 36],
      [-0.02923, 38],
      [-0.02805, 39],
      [-0.02894, 40],
      [-0.02852, 41]
    ],
    "red_o_points": [],
    "y_categories": [
      "P16554",
      "P18297",
      "P19283",
      "P19287",
      "P23391",
      "P30595",
      "P31645",
      "P31691",
      "P34778",
      "P35046",
      "P36328",
      "P43633",
      "P4544",
      "P46417",
      "P48965",
      "P53068",
      "P5497",
      "P59529",
      "P62483",
      "P64658",
      "P65202",
      "P66816",
      "P6751",
      "P7408",
      "P75566",
      "P76226",
      "P79971",
      "P82621",
      "P82990",
      "P84549",
      "P84932",
      "P85825",
      "P86989",
      "P8770",
      "P87791",
      "P90550",
      "P93159",
      "P94969",
      "P96710",
      "P97130",
      "P9744",
      "P98500",
      "nan"
    ],
    "blue_o_points": [],
    "blue_x_points": [
      [0.05759, 0],
      [0.06013, 14],
      [0.05858, 16],
      [0.05646, 19],
      [0.05815, 23],
      [0.05872, 25],
      [0.06126, 29],
      [0.05632, 33],
      [0.06436, 35],
      [0.06154, 37]
    ]
  },
  "QA_lstPexTouch[T1]": {
    "red_x_points": [
      [-0.00969, 1],
      [-0.0027, 2],
      [0.00116, 1],
      [-0.00319, 2],
      [-0.01192, 1],
      [-0.00758, 0],
      [0.00171, 1],
      [0.00298, 1],
      [-0.01089, 1],
      [-0.00518, 0],
      [-0.00449, 0],
      [-0.00695, 0],
      [0.00844, 0],
      [-0.01059, 2],
      [-0.00501, 2],
      [-0.00432, 2],
      [-0.01203, 1],
      [-0.00205, 2],
      [-0.00714, 2],
      [0.00837, 0],
      [-0.01104, 1],
      [0.00909, 0],
      [-0.00373, 2],
      [-0.00526, 2],
      [-0.01135, 1],
      [0.00922, 0],
      [0.00414, 1],
      [-0.00256, 2],
      [-0.00175, 1],
      [-0.00545, 2],
      [0.00042, 1],
      [-0.01159, 1]
    ],
    "red_o_points": [],
    "y_categories": ["NORM", "NPV", "nan"],
    "blue_o_points": [],
    "blue_x_points": [
      [0.00045, 1],
      [0.00073, 2],
      [0.00096, 1],
      [0.00717, 1],
      [0.01045, 1],
      [0.00068, 1],
      [0.01293, 0],
      [0.00621, 0],
      [0.01053, 0],
      [0.0138, 0]
    ]
  },
  "QA_mulInjOrthesisType[ArmSling]": {
    "red_x_points": [
      [-0.00673, 2],
      [-0.00716, 2],
      [-0.0076, 2],
      [-0.00718, 2],
      [-0.00667, 2],
      [-0.00722, 2],
      [-0.0073, 2],
      [-0.00704, 2],
      [-0.00584, 2],
      [-0.0078, 2],
      [-0.00692, 2],
      [-0.00749, 2],
      [-0.00671, 2],
      [0.01346, 1],
      [-0.00754, 2],
      [-0.00743, 2],
      [-0.0072, 2],
      [-0.01342, 0],
      [0.01512, 1],
      [-0.00673, 2],
      [-0.00707, 2],
      [-0.02208, 0],
      [-0.00349, 3],
      [-0.00786, 2],
      [0.01096, 1],
      [-0.00666, 2],
      [-0.00698, 2],
      [-0.00621, 2],
      [-0.01851, 3],
      [-0.00124, 3],
      [-0.0067, 2],
      [-0.00679, 2]
    ],
    "red_o_points": [],
    "y_categories": ["N", "NOT APPLICABLE", "Y", "nan"],
    "blue_o_points": [],
    "blue_x_points": [
      [0.00445, 2],
      [0.02003, 1],
      [0.01787, 1],
      [0.03941, 1],
      [-0.0046, 2],
      [0.01811, 1],
      [-0.00311, 2],
      [0.01736, 1],
      [-0.00386, 2],
      [0.01424, 3]
    ]
  },
  "QS_mulGraftNerve[Ul]": {
    "red_x_points": [
      [-2e-5, 2],
      [-2e-5, 0],
      [-2e-5, 0],
      [-2e-5, 2],
      [-2e-5, 0],
      [-2e-5, 0],
      [-2e-5, 2],
      [-2e-5, 0],
      [-2e-5, 0],
      [-2e-5, 2],
      [-2e-5, 0],
      [-2e-5, 2],
      [-2e-5, 2],
      [-2e-5, 2],
      [-2e-5, 2],
      [-2e-5, 0],
      [-2e-5, 0],
      [-2e-5, 2]
    ],
    "red_o_points": [],
    "y_categories": ["N", "NOT APPLICABLE", "nan"],
    "blue_o_points": [],
    "blue_x_points": [[0.00016, 1], [-2e-5, 0], [-2e-5, 2]]
  },
  "QA_mulInjOrthesisType[ShoulderSupport]": {
    "red_x_points": [
      [-0.00692, 0],
      [-0.0069, 0],
      [-0.00649, 0],
      [-0.00657, 0],
      [-0.00678, 0],
      [-0.00658, 0],
      [-0.00652, 0],
      [-0.00636, 0],
      [-0.01977, 2],
      [-0.00684, 0],
      [-0.00675, 0],
      [-0.00677, 0],
      [-0.00668, 0],
      [0.0145, 1],
      [-0.00745, 0],
      [-0.00695, 0],
      [-0.00696, 0],
      [-0.01131, 2],
      [0.01379, 1],
      [-0.00617, 0],
      [-0.00671, 0],
      [-0.02068, 2],
      [-0.00315, 3],
      [-0.00832, 0],
      [0.01314, 1],
      [-0.00719, 0],
      [-0.00648, 0],
      [-0.006, 0],
      [-0.01654, 3],
      [-0.00082, 3],
      [-0.00597, 0],
      [-0.00642, 0]
    ],
    "red_o_points": [],
    "y_categories": ["N", "NOT APPLICABLE", "Y", "nan"],
    "blue_o_points": [],
    "blue_x_points": [
      [0.00277, 0],
      [0.02232, 1],
      [0.01536, 1],
      [0.03396, 1],
      [-0.00413, 0],
      [0.01703, 1],
      [-0.00235, 0],
      [0.01649, 1],
      [-0.00274, 0],
      [0.01468, 3]
    ]
  },
  "QA_yonInjUnconscio": {
    "red_x_points": [
      [-0.00577, 1],
      [-0.00677, 1],
      [-0.00372, 2],
      [-0.00383, 2],
      [-0.00548, 2],
      [0.01852, 0],
      [-0.00811, 1],
      [-0.0046, 2],
      [-0.00537, 2],
      [-0.00561, 2],
      [-0.00487, 2],
      [-0.00953, 1],
      [-0.00698, 1],
      [-0.01991, 1],
      [-0.00659, 2],
      [-0.00461, 2],
      [-0.00533, 2],
      [-0.00673, 1],
      [0.00567, 0],
      [-0.00803, 1],
      [-0.00566, 1],
      [-0.00675, 1],
      [-0.00634, 1],
      [-0.00682, 2],
      [-0.00767, 1],
      [-0.00599, 2],
      [-0.00819, 1],
      [-0.00673, 1],
      [-0.00187, 2],
      [-0.00496, 2],
      [-0.00721, 1],
      [-0.00541, 2]
    ],
    "red_o_points": [],
    "y_categories": ["N", "Y", "nan"],
    "blue_o_points": [],
    "blue_x_points": [
      [0.00079, 2],
      [0.0069, 1],
      [0.01696, 0],
      [0.02699, 0],
      [0.02632, 0],
      [0.00126, 2],
      [-0.00165, 1],
      [0.00096, 2],
      [0.03063, 0],
      [-0.00072, 2]
    ]
  },
  "QS_mulTransfSite[Other]": {
    "red_x_points": [
      [-0.00246, 3],
      [-0.01443, 0],
      [-0.01459, 0],
      [-0.01471, 0],
      [-0.00243, 3],
      [-0.01549, 0],
      [-0.01493, 0],
      [-0.01541, 0],
      [-0.00265, 3],
      [-0.01568, 0],
      [-0.01523, 0],
      [-0.01535, 0],
      [-0.0025, 3],
      [0.02099, 1],
      [-0.00245, 3],
      [-0.01509, 0],
      [-0.00251, 3],
      [-0.01384, 0],
      [-0.00368, 3],
      [-0.00286, 3],
      [-0.0024, 3],
      [-0.00227, 3],
      [-0.01469, 0],
      [-0.00254, 3],
      [-0.00353, 3],
      [-0.00235, 3],
      [-0.01528, 0],
      [-0.01495, 0],
      [0.02175, 1],
      [-0.00232, 3],
      [-0.01541, 0],
      [-0.00257, 3]
    ],
    "red_o_points": [],
    "y_categories": ["N", "NOT APPLICABLE", "Y", "nan"],
    "blue_o_points": [],
    "blue_x_points": [
      [0.02631, 1],
      [-0.00138, 3],
      [0.02319, 1],
      [-0.00679, 0],
      [0.05095, 2],
      [0.02328, 1],
      [-0.00107, 3],
      [0.02487, 1],
      [-0.00106, 3],
      [-0.00043, 3]
    ]
  },
  "QA_lstInjTpbiSide": {
    "red_x_points": [
      [-0.0032, 1],
      [0.00037, 0],
      [-0.00034, 0],
      [0.00025, 0],
      [-0.00018, 0],
      [-0.00146, 1],
      [-0.00185, 0],
      [-0.0023, 0],
      [-0.00333, 1],
      [-0.0007, 0],
      [-0.00081, 1],
      [-0.00179, 1],
      [-0.00374, 1],
      [-0.01654, 0],
      [-0.00502, 1],
      [-0.00218, 1],
      [0.00039, 0],
      [-0.00161, 1],
      [-0.00803, 1],
      [0.00032, 0],
      [0.00143, 0],
      [-0.00072, 0],
      [0.00044, 0],
      [0.00223, 0],
      [-0.00585, 1],
      [-0.00369, 1],
      [-0.00058, 1],
      [-0.00031, 1],
      [-0.01444, 0],
      [-0.00628, 1],
      [-0.00028, 0],
      [0.00051, 0]
    ],
    "red_o_points": [],
    "y_categories": ["L", "R", "nan"],
    "blue_o_points": [],
    "blue_x_points": [
      [-0.00412, 0],
      [0.00851, 0],
      [0.00829, 1],
      [0.00336, 0],
      [0.00317, 1],
      [0.00923, 1],
      [0.00261, 1],
      [0.00748, 1],
      [0.00431, 0],
      [0.00456, 0]
    ]
  },
  "QS_mulLysisSite[Trunk]": {
    "red_x_points": [
      [-0.00078, 3],
      [-0.00395, 0],
      [-0.00332, 0],
      [-0.00364, 0],
      [-0.00087, 3],
      [-0.00369, 0],
      [-0.00942, 2],
      [-0.00353, 0],
      [-0.0012, 3],
      [-0.0035, 0],
      [-0.00369, 0],
      [-0.0032, 0],
      [-0.00082, 3],
      [0.00749, 1],
      [-0.00085, 3],
      [-0.00355, 0],
      [-0.00086, 3],
      [-0.00793, 2],
      [-0.00109, 3],
      [-0.00125, 3],
      [-0.0008, 3],
      [-0.00081, 3],
      [-0.00307, 0],
      [-0.00112, 3],
      [-0.00105, 3],
      [-0.00059, 3],
      [-0.00338, 0],
      [-0.00303, 0],
      [0.0079, 1],
      [-0.0007, 3],
      [-0.00794, 2],
      [-0.00098, 3]
    ],
    "red_o_points": [],
    "y_categories": ["N", "NOT APPLICABLE", "Y", "nan"],
    "blue_o_points": [],
    "blue_x_points": [
      [0.01246, 1],
      [0.00019, 3],
      [0.0075, 1],
      [0.0004, 0],
      [-0.00088, 0],
      [0.00928, 1],
      [-0.00022, 3],
      [0.01043, 1],
      [-0.00019, 3],
      [3e-5, 3]
    ]
  },
  "QS_mulGraftTrunk[UpperTrunk]": {
    "red_x_points": [
      [-0.00054, 3],
      [-0.00108, 0],
      [-0.00091, 0],
      [-0.00128, 0],
      [-0.0005, 3],
      [-0.00117, 0],
      [-0.00113, 0],
      [-0.00116, 0],
      [-0.00047, 3],
      [-0.00123, 0],
      [-0.00118, 0],
      [-0.0011, 0],
      [-0.00054, 3],
      [0.00247, 1],
      [-0.00051, 3],
      [-0.00358, 2],
      [-0.00049, 3],
      [-0.00087, 0],
      [-0.00061, 3],
      [-0.00059, 3],
      [-0.0004, 3],
      [-0.00038, 3],
      [-0.00121, 0],
      [-0.00055, 3],
      [-0.00051, 3],
      [-0.00055, 3],
      [-0.00099, 0],
      [-0.00106, 0],
      [0.00257, 1],
      [-0.0005, 3],
      [-0.00112, 0],
      [-0.00048, 3]
    ],
    "red_o_points": [],
    "y_categories": ["N", "NOT APPLICABLE", "Y", "nan"],
    "blue_o_points": [],
    "blue_x_points": [
      [0.00439, 1],
      [-6e-5, 3],
      [0.00318, 1],
      [-0.0003, 0],
      [-0.00062, 0],
      [0.00359, 1],
      [-0.00035, 3],
      [0.00378, 1],
      [-0.00021, 3],
      [-6e-5, 3]
    ]
  },
  "QS_mulTransfSite[PhMc]": {
    "red_x_points": [
      [-0.00103, 3],
      [-0.00312, 0],
      [-0.00271, 0],
      [-0.00317, 0],
      [-0.00118, 3],
      [-0.00309, 0],
      [-0.00282, 0],
      [-0.00915, 2],
      [-0.00127, 3],
      [-0.00274, 0],
      [-0.00341, 0],
      [-0.00318, 0],
      [-0.00117, 3],
      [0.00724, 1],
      [-0.00089, 3],
      [-0.00343, 0],
      [-0.00113, 3],
      [-0.00276, 0],
      [-0.00106, 3],
      [-0.00107, 3],
      [-0.00111, 3],
      [-0.00086, 3],
      [-0.00626, 2],
      [-0.00084, 3],
      [-0.0012, 3],
      [-0.00107, 3],
      [-0.00297, 0],
      [-0.0031, 0],
      [0.00815, 1],
      [-0.0009, 3],
      [-0.00285, 0],
      [-0.00113, 3]
    ],
    "red_o_points": [],
    "y_categories": ["N", "NOT APPLICABLE", "Y", "nan"],
    "blue_o_points": [],
    "blue_x_points": [
      [0.0104, 1],
      [-0.00024, 3],
      [0.00706, 1],
      [-0.00089, 0],
      [-0.00095, 0],
      [0.00867, 1],
      [-0.00047, 3],
      [0.00902, 1],
      [-0.00038, 3],
      [-0.00026, 3]
    ]
  },
  "QA_mulInjTbpiCause[Motorcycle]": {
    "red_x_points": [
      [-0.00222, 0],
      [-0.00062, 1],
      [-0.00052, 1],
      [-0.00061, 1],
      [-0.0003, 1],
      [-0.00071, 1],
      [-0.00035, 1],
      [-0.00064, 1],
      [0.00073, 1],
      [-0.00066, 1],
      [-0.00058, 1],
      [-0.00038, 1],
      [-0.00772, 0],
      [-0.04307, 1],
      [-0.00053, 1],
      [-0.00098, 1],
      [-0.00017, 1],
      [-0.00084, 1],
      [-0.00102, 1],
      [-0.01005, 0],
      [0.00022, 1],
      [0.00287, 1],
      [-0.00023, 1],
      [-0.00036, 1],
      [-0.00079, 1],
      [-0.00733, 0],
      [-0.0003, 1],
      [-0.00029, 1],
      [-0.04489, 1],
      [-5e-5, 1],
      [-0.00031, 1],
      [-0.0007, 1]
    ],
    "red_o_points": [],
    "y_categories": ["N", "Y", "nan"],
    "blue_o_points": [],
    "blue_x_points": [
      [0.01966, 0],
      [-0.00012, 1],
      [0.01565, 0],
      [-0.00137, 1],
      [-0.00069, 1],
      [0.0183, 0],
      [0.00388, 1],
      [0.01775, 0],
      [0.00356, 1],
      [0.0035, 1]
    ]
  },
  "QS_mulLysisSite[Root]": {
    "red_x_points": [
      [-0.0006, 3],
      [-0.00117, 0],
      [-0.00501, 2],
      [-0.00127, 0],
      [-0.00046, 3],
      [-0.00147, 0],
      [-0.00106, 0],
      [-0.00117, 0],
      [-0.00079, 3],
      [-0.00095, 0],
      [-0.00118, 0],
      [-0.00049, 0],
      [-0.00063, 3],
      [0.00315, 1],
      [-0.00075, 3],
      [-0.00124, 0],
      [-0.00049, 3],
      [-0.0011, 0],
      [-0.00046, 3],
      [-0.00097, 3],
      [-0.00052, 3],
      [-0.00048, 3],
      [-0.00107, 0],
      [-0.00078, 3],
      [-0.00065, 3],
      [-0.00049, 3],
      [-0.00134, 0],
      [-0.00121, 0],
      [0.00384, 1],
      [-0.00065, 3],
      [-0.0055, 2],
      [-0.00052, 3]
    ],
    "red_o_points": [],
    "y_categories": ["N", "NOT APPLICABLE", "Y", "nan"],
    "blue_o_points": [],
    "blue_x_points": [
      [0.00529, 1],
      [-0.00014, 3],
      [0.00433, 1],
      [0.00018, 0],
      [-0.00025, 0],
      [0.00413, 1],
      [-0.00023, 3],
      [0.00447, 1],
      [-0.00043, 3],
      [-0.00028, 3]
    ]
  },
  "QS_mulGraftLevel[Trunk]": {
    "red_x_points": [
      [-0.00029, 3],
      [-0.0008, 0],
      [-0.00087, 0],
      [-0.00097, 0],
      [-0.00024, 3],
      [-0.00081, 0],
      [-0.00107, 0],
      [-0.00079, 0],
      [-0.00021, 3],
      [-0.00075, 0],
      [-0.0008, 0],
      [-0.00086, 0],
      [-0.00016, 3],
      [0.00173, 1],
      [-0.00033, 3],
      [-0.00373, 2],
      [-0.00027, 3],
      [-0.00069, 0],
      [-0.00034, 3],
      [-0.0002, 3],
      [-0.00016, 3],
      [-0.0001, 3],
      [-0.00095, 0],
      [-0.00032, 3],
      [-0.0002, 3],
      [-0.00033, 3],
      [-0.00082, 0],
      [-0.00092, 0],
      [0.00186, 1],
      [-9e-5, 3],
      [-0.00092, 0],
      [-0.00019, 3]
    ],
    "red_o_points": [],
    "y_categories": ["N", "NOT APPLICABLE", "Y", "nan"],
    "blue_o_points": [],
    "blue_x_points": [
      [0.00285, 1],
      [-0.0, 3],
      [0.00253, 1],
      [3e-5, 0],
      [-0.00071, 0],
      [0.00177, 1],
      [-0.00028, 3],
      [0.00257, 1],
      [-9e-5, 3],
      [-7e-5, 3]
    ]
  },
  "QS_mulGraftNerve[other]": {
    "red_x_points": [
      [-1e-5, 2],
      [-0.0002, 0],
      [-0.00033, 0],
      [-0.00017, 0],
      [-4e-5, 2],
      [-0.0003, 0],
      [-0.0002, 0],
      [-0.0004, 0],
      [-9e-5, 2],
      [-0.00035, 0],
      [-0.00043, 0],
      [-0.00025, 0],
      [-3e-5, 2],
      [0.0003, 1],
      [-0.0001, 2],
      [-0.00041, 0],
      [-9e-5, 2],
      [-5e-5, 0],
      [-0.00012, 2],
      [-3e-5, 2],
      [-1e-5, 2],
      [-2e-5, 2],
      [-0.00026, 0],
      [-0.0001, 2],
      [-0.00017, 2],
      [-4e-5, 2],
      [-0.00033, 0],
      [-0.00023, 0],
      [0.00047, 1],
      [-1e-5, 2],
      [-0.00021, 0],
      [-0.00013, 2]
    ],
    "red_o_points": [],
    "y_categories": ["N", "NOT APPLICABLE", "nan"],
    "blue_o_points": [],
    "blue_x_points": [
      [0.00072, 1],
      [-0.0, 2],
      [0.00031, 1],
      [0.00017, 0],
      [-7e-5, 0],
      [0.00083, 1],
      [-4e-5, 2],
      [0.00057, 1],
      [-2e-5, 2],
      [3e-5, 2]
    ]
  },
  "QS_mulNeuromadSite[C5]": {
    "red_x_points": [
      [6e-5, 2],
      [-0.00061, 0],
      [-0.00058, 0],
      [-0.0008, 0],
      [4e-5, 2],
      [-0.00075, 0],
      [-0.00056, 0],
      [-0.00052, 0],
      [6e-5, 2],
      [-0.00076, 0],
      [-0.00072, 0],
      [-0.00068, 0],
      [1e-5, 2],
      [0.00093, 1],
      [4e-5, 2],
      [-0.0005, 0],
      [0.0001, 2],
      [-0.00061, 0],
      [8e-5, 2],
      [7e-5, 2],
      [5e-5, 2],
      [1e-5, 2],
      [-0.00054, 0],
      [6e-5, 2],
      [-6e-5, 2],
      [2e-5, 2],
      [-0.00054, 0],
      [-0.00062, 0],
      [0.0011, 1],
      [0.0001, 2],
      [-0.00062, 0],
      [2e-5, 2]
    ],
    "red_o_points": [],
    "y_categories": ["N", "NOT APPLICABLE", "nan"],
    "blue_o_points": [],
    "blue_x_points": [
      [0.00126, 1],
      [9e-5, 2],
      [0.0014, 1],
      [-0.00015, 0],
      [-0.00013, 0],
      [0.00113, 1],
      [8e-5, 2],
      [0.00108, 1],
      [9e-5, 2],
      [0.0001, 2]
    ]
  },
  "QS_mulNeuromadSite[C7]": {
    "red_x_points": [
      [-0.00022, 2],
      [-0.00135, 0],
      [-0.00097, 0],
      [-0.00124, 0],
      [-0.00025, 2],
      [-0.00125, 0],
      [-0.001, 0],
      [-0.00099, 0],
      [-0.00016, 2],
      [-0.00133, 0],
      [-0.00143, 0],
      [-0.00087, 0],
      [-0.00033, 2],
      [0.00084, 1],
      [-0.00023, 2],
      [-0.00104, 0],
      [-0.00026, 2],
      [-0.00104, 0],
      [-0.00023, 2],
      [-0.0002, 2],
      [-0.00013, 2],
      [-0.00014, 2],
      [-0.00084, 0],
      [-0.00026, 2],
      [-0.00056, 2],
      [-0.00013, 2],
      [-0.00118, 0],
      [-0.00096, 0],
      [0.00207, 1],
      [-9e-5, 2],
      [-0.00081, 0],
      [-0.00024, 2]
    ],
    "red_o_points": [],
    "y_categories": ["N", "NOT APPLICABLE", "nan"],
    "blue_o_points": [],
    "blue_x_points": [
      [0.00279, 1],
      [-0.00011, 2],
      [0.00182, 1],
      [0.00037, 0],
      [-0.00023, 0],
      [0.00249, 1],
      [3e-5, 2],
      [0.00216, 1],
      [-0.00015, 2],
      [5e-5, 2]
    ]
  },
  "QS_mulGraftNerve[TD]": {
    "red_x_points": [
      [1e-5, 2],
      [-3e-5, 0],
      [-9e-5, 0],
      [-9e-5, 0],
      [1e-5, 2],
      [-3e-5, 0],
      [-3e-5, 0],
      [-6e-5, 0],
      [-0.0, 2],
      [-6e-5, 0],
      [-9e-5, 0],
      [-3e-5, 0],
      [1e-5, 2],
      [-0.0, 2],
      [-9e-5, 0],
      [-1e-5, 2],
      [1e-5, 2],
      [1e-5, 2],
      [-0.0, 2],
      [-1e-5, 2],
      [0.0001, 1],
      [-1e-5, 2],
      [-3e-5, 0],
      [1e-5, 2]
    ],
    "red_o_points": [],
    "y_categories": ["N", "NOT APPLICABLE", "nan"],
    "blue_o_points": [],
    "blue_x_points": [
      [0.00025, 1],
      [-3e-5, 0],
      [1e-5, 2],
      [0.0001, 1],
      [1e-5, 2],
      [-1e-5, 2]
    ]
  },
  "QS_mulNeuromadSite[T1]": {
    "red_x_points": [
      [-9e-5, 2],
      [-0.00088, 0],
      [-0.00054, 0],
      [-0.00103, 0],
      [-0.00018, 2],
      [-0.00121, 0],
      [-0.00109, 0],
      [-0.0008, 0],
      [-0.00019, 2],
      [-0.00123, 0],
      [-0.00125, 0],
      [-0.00099, 0],
      [-0.0001, 2],
      [0.00116, 1],
      [-8e-5, 2],
      [-0.00131, 0],
      [-8e-5, 2],
      [-0.0009, 0],
      [-0.00012, 2],
      [-6e-5, 2],
      [-0.0, 2],
      [-8e-5, 2],
      [-0.00078, 0],
      [-0.00017, 2],
      [-0.00028, 2],
      [-8e-5, 2],
      [-0.00083, 0],
      [-0.00062, 0],
      [0.00166, 1],
      [-9e-5, 2],
      [-0.00075, 0],
      [-0.00026, 2]
    ],
    "red_o_points": [],
    "y_categories": ["N", "NOT APPLICABLE", "nan"],
    "blue_o_points": [],
    "blue_x_points": [
      [0.00298, 1],
      [5e-5, 2],
      [0.002, 1],
      [0.00012, 0],
      [-0.00035, 0],
      [0.00208, 1],
      [-3e-5, 2],
      [0.00181, 1],
      [-3e-5, 2],
      [2e-5, 2]
    ]
  },
  "QS_mulLysisSite[Nerve]": {
    "red_x_points": [
      [-0.00014, 3],
      [-0.00053, 0],
      [-0.00276, 2],
      [-0.00042, 0],
      [-0.00018, 3],
      [-0.00051, 0],
      [-0.00026, 0],
      [-0.00041, 0],
      [-0.00031, 3],
      [-0.00038, 0],
      [-0.00054, 0],
      [-0.00028, 0],
      [-0.00015, 3],
      [0.00121, 1],
      [-0.00028, 3],
      [-0.00052, 0],
      [-0.00021, 3],
      [-0.00027, 0],
      [-0.00013, 3],
      [-0.00017, 3],
      [-0.00022, 3],
      [-9e-5, 3],
      [-0.00049, 0],
      [-0.00026, 3],
      [-0.0001, 3],
      [-0.00011, 3],
      [-0.0004, 0],
      [-0.0003, 0],
      [0.00138, 1],
      [-5e-5, 3],
      [-0.00034, 0],
      [-0.00014, 3]
    ],
    "red_o_points": [],
    "y_categories": ["N", "NOT APPLICABLE", "Y", "nan"],
    "blue_o_points": [],
    "blue_x_points": [
      [0.00111, 1],
      [-5e-5, 3],
      [0.00089, 1],
      [0.00038, 0],
      [0.00026, 0],
      [0.00117, 1],
      [3e-5, 3],
      [0.00135, 1],
      [-0.00013, 3],
      [-3e-5, 3]
    ]
  },
  "QS_mulTransfSite[IMc]": {
    "red_x_points": [
      [-0.00128, 3],
      [-0.00969, 2],
      [-0.00315, 0],
      [-0.00417, 0],
      [-0.00158, 3],
      [-0.0042, 0],
      [-0.00332, 0],
      [-0.00386, 0],
      [-0.00191, 3],
      [-0.0041, 0],
      [-0.00394, 0],
      [-0.0034, 0],
      [-0.00174, 3],
      [0.01084, 1],
      [-0.00178, 3],
      [-0.00443, 0],
      [-0.00167, 3],
      [-0.0102, 2],
      [-0.00221, 3],
      [-0.00175, 3],
      [-0.00146, 3],
      [-0.00151, 3],
      [-0.00352, 0],
      [-0.00186, 3],
      [-0.00267, 3],
      [-0.00127, 3],
      [-0.00364, 0],
      [-0.00926, 2],
      [0.01188, 1],
      [-0.00106, 3],
      [-0.01045, 2],
      [-0.0018, 3]
    ],
    "red_o_points": [],
    "y_categories": ["N", "NOT APPLICABLE", "Y", "nan"],
    "blue_o_points": [],
    "blue_x_points": [
      [0.01617, 1],
      [-0.0007, 3],
      [0.01378, 1],
      [0.00071, 0],
      [-0.00178, 0],
      [0.01389, 1],
      [-0.00084, 3],
      [0.01314, 1],
      [-0.00105, 3],
      [-0.00027, 3]
    ]
  },
  "QS_mulLysisRoot[C7]": {
    "red_x_points": [
      [-0.00015, 3],
      [-0.00081, 0],
      [-0.00401, 2],
      [-0.00099, 0],
      [-0.00027, 3],
      [-0.00076, 0],
      [-0.00084, 0],
      [-0.00089, 0],
      [-0.0005, 3],
      [-0.00081, 0],
      [-0.00099, 0],
      [-0.00064, 0],
      [-0.0003, 3],
      [0.00189, 1],
      [-0.0004, 3],
      [-0.00076, 0],
      [-0.00027, 3],
      [-0.00084, 0],
      [-0.00026, 3],
      [-0.00032, 3],
      [-0.00032, 3],
      [-0.00035, 3],
      [-0.00073, 0],
      [-0.00039, 3],
      [-0.00032, 3],
      [-0.00018, 3],
      [-0.00092, 0],
      [-0.00084, 0],
      [0.0021, 1],
      [-0.00025, 3],
      [-0.00064, 0],
      [-0.0003, 3]
    ],
    "red_o_points": [],
    "y_categories": ["N", "NOT APPLICABLE", "Y", "nan"],
    "blue_o_points": [],
    "blue_x_points": [
      [0.003, 1],
      [-7e-5, 3],
      [0.00215, 1],
      [0.00014, 0],
      [-0.00028, 0],
      [0.00262, 1],
      [-0.00013, 3],
      [0.00278, 1],
      [-0.00019, 3],
      [-0.00013, 3]
    ]
  },
  "QS_lstBpsurgSide": {
    "red_x_points": [
      [-0.0011, 3],
      [-0.00729, 0],
      [-0.00768, 0],
      [-0.00801, 0],
      [-0.0013, 3],
      [-0.0075, 2],
      [-0.00775, 0],
      [-0.00866, 0],
      [-0.00153, 3],
      [-0.00758, 0],
      [-0.00759, 2],
      [-0.007, 2],
      [-0.00129, 3],
      [0.01019, 1],
      [-0.00125, 3],
      [-0.0086, 2],
      [-0.00116, 3],
      [-0.0073, 2],
      [-0.00169, 3],
      [-0.00131, 3],
      [-0.00102, 3],
      [-0.00144, 3],
      [-0.00727, 0],
      [-0.00098, 3],
      [-0.00138, 3],
      [-0.00114, 3],
      [-0.00684, 2],
      [-0.00605, 2],
      [0.01313, 1],
      [-0.00084, 3],
      [-0.00711, 0],
      [-0.00115, 3]
    ],
    "red_o_points": [],
    "y_categories": ["L", "NOT APPLICABLE", "R", "nan"],
    "blue_o_points": [],
    "blue_x_points": [
      [0.01791, 1],
      [-0.00046, 3],
      [0.01472, 1],
      [0.00336, 0],
      [0.00042, 2],
      [0.01537, 1],
      [-0.00044, 3],
      [0.01384, 1],
      [-0.00023, 3],
      [0.00048, 3]
    ]
  },
  "QA_lstPexPain[T1]": {
    "red_x_points": [
      [-0.00929, 1],
      [-0.00323, 2],
      [-0.00337, 2],
      [-0.00301, 2],
      [-0.0086, 1],
      [-0.00634, 0],
      [0.00147, 1],
      [0.00293, 1],
      [0.00812, 0],
      [0.00323, 1],
      [-0.00384, 0],
      [-0.00737, 0],
      [0.0075, 0],
      [-0.0172, 2],
      [-0.00598, 2],
      [-0.00477, 2],
      [-0.00541, 2],
      [-0.00231, 2],
      [-0.00613, 2],
      [0.00816, 0],
      [-0.00898, 1],
      [0.00826, 0],
      [-0.00505, 2],
      [-0.00513, 2],
      [-0.01007, 1],
      [-0.00567, 2],
      [-0.00515, 2],
      [-0.00259, 2],
      [-0.0051, 1],
      [-0.01149, 1],
      [0.00087, 1],
      [-0.01022, 1]
    ],
    "red_o_points": [],
    "y_categories": ["NORM", "NPV", "nan"],
    "blue_o_points": [],
    "blue_x_points": [
      [-0.00014, 1],
      [-0.00126, 2],
      [0.00736, 0],
      [0.00779, 1],
      [0.01129, 1],
      [-0.00017, 1],
      [0.01161, 0],
      [0.00736, 0],
      [0.01162, 0],
      [0.0152, 0]
    ]
  },
  "QS_mulTransfSite[AcMc]": {
    "red_x_points": [
      [-0.00022, 3],
      [-0.00091, 0],
      [-0.00074, 0],
      [-0.00075, 0],
      [-0.00025, 3],
      [-0.00075, 0],
      [-0.00096, 0],
      [-0.0008, 0],
      [-0.00028, 3],
      [-0.00093, 0],
      [-0.00085, 0],
      [-0.00538, 2],
      [-0.00027, 3],
      [0.00179, 1],
      [-0.00032, 3],
      [-0.00064, 0],
      [-0.0002, 3],
      [-0.0009, 0],
      [-0.00017, 3],
      [-0.00044, 3],
      [-0.0002, 3],
      [-0.00018, 3],
      [-0.00073, 0],
      [-0.0004, 3],
      [-0.00029, 3],
      [-0.00017, 3],
      [-0.00083, 0],
      [-0.0009, 0],
      [0.00167, 1],
      [-0.00024, 3],
      [-0.00078, 0],
      [-0.0002, 3]
    ],
    "red_o_points": [],
    "y_categories": ["N", "NOT APPLICABLE", "Y", "nan"],
    "blue_o_points": [],
    "blue_x_points": [
      [0.0027, 1],
      [-0.00011, 3],
      [0.00246, 1],
      [0.00028, 0],
      [0.00037, 0],
      [0.00265, 1],
      [-0.00015, 3],
      [0.00228, 1],
      [-0.00028, 3],
      [-7e-5, 3]
    ]
  },
  "QA_lstPexKine[Shoulder]": {
    "red_x_points": [
      [-0.00103, 1],
      [-0.00419, 2],
      [-0.0039, 2],
      [-0.00446, 2],
      [-0.00688, 2],
      [-0.00393, 1],
      [-0.0023, 1],
      [0.0067, 0],
      [-0.00912, 2],
      [-0.00212, 1],
      [-0.00321, 1],
      [-0.00309, 1],
      [-0.0018, 1],
      [-0.00141, 2],
      [-0.00569, 2],
      [-0.00196, 1],
      [-0.00653, 2],
      [-0.00271, 2],
      [-0.00611, 2],
      [-0.00172, 1],
      [-0.0006, 1],
      [-0.00158, 1],
      [-0.00365, 2],
      [-0.00641, 2],
      [-0.00147, 1],
      [-0.0085, 2],
      [-0.007, 2],
      [-0.00432, 2],
      [-0.00137, 2],
      [-0.00568, 2],
      [-0.0007, 1],
      [-0.00656, 2]
    ],
    "red_o_points": [],
    "y_categories": ["NPV", "PV", "nan"],
    "blue_o_points": [],
    "blue_x_points": [
      [1e-5, 1],
      [-0.00335, 2],
      [-0.00019, 1],
      [0.00137, 1],
      [0.02874, 0],
      [-8e-5, 1],
      [0.04449, 0],
      [-0.00045, 2],
      [0.00066, 1],
      [0.00059, 1]
    ]
  },
  "QA_yonInjBpsurg": {
    "red_x_points": [
      [-0.00192, 1],
      [-0.00159, 1],
      [-0.00197, 1],
      [-0.00182, 1],
      [-0.00199, 1],
      [-0.0022, 1],
      [-0.00175, 1],
      [-0.00177, 1],
      [-0.00224, 1],
      [-0.00209, 1],
      [-0.00185, 1],
      [-0.00195, 1],
      [-0.00189, 1],
      [0.00375, 0],
      [-0.002, 1],
      [-0.00209, 1],
      [-0.002, 1],
      [-0.00164, 1],
      [-0.00176, 1],
      [-0.00181, 1],
      [-0.00193, 1],
      [-0.00179, 1],
      [-0.00159, 1],
      [-0.00192, 1],
      [-0.00262, 1],
      [-0.00223, 1],
      [-0.0019, 1],
      [-0.00155, 1],
      [0.00545, 0],
      [-0.00195, 1],
      [-0.00149, 1],
      [-0.00169, 1]
    ],
    "red_o_points": [],
    "y_categories": ["N", "Y", "nan"],
    "blue_o_points": [],
    "blue_x_points": [
      [0.00825, 0],
      [-0.00041, 1],
      [0.0081, 0],
      [-0.0016, 1],
      [-0.00196, 1],
      [0.00776, 0],
      [-0.00093, 1],
      [0.00885, 0],
      [-0.0007, 1],
      [-0.00067, 1]
    ]
  },
  "QS_mulLysisNerve[Ssr]": {
    "red_x_points": [
      [-0.00035, 3],
      [-0.00038, 0],
      [-0.00277, 2],
      [-0.0003, 0],
      [-0.00019, 3],
      [-0.0004, 0],
      [-0.00037, 0],
      [-0.00023, 0],
      [-0.00044, 3],
      [-0.00036, 0],
      [-0.00044, 0],
      [-0.00025, 0],
      [-0.00029, 3],
      [0.00115, 1],
      [-0.00051, 3],
      [-0.00035, 0],
      [-0.0003, 3],
      [-0.00031, 0],
      [-0.00024, 3],
      [-0.00039, 3],
      [-0.00029, 3],
      [-0.00017, 3],
      [-0.00028, 0],
      [-0.0004, 3],
      [-0.00016, 3],
      [-0.00023, 3],
      [-0.00037, 0],
      [-0.00033, 0],
      [0.00129, 1],
      [-0.00024, 3],
      [-0.00036, 0],
      [-0.00027, 3]
    ],
    "red_o_points": [],
    "y_categories": ["N", "NOT APPLICABLE", "Y", "nan"],
    "blue_o_points": [],
    "blue_x_points": [
      [0.00183, 1],
      [-0.0001, 3],
      [0.00111, 1],
      [-0.00018, 0],
      [0.00014, 0],
      [0.0012, 1],
      [-0.00018, 3],
      [0.00177, 1],
      [-0.00016, 3],
      [-0.00023, 3]
    ]
  },
  "QS_mulTransfSite[AcSsAA]": {
    "red_x_points": [
      [-0.00221, 3],
      [-0.01694, 2],
      [-0.00419, 0],
      [-0.01597, 2],
      [-0.00253, 3],
      [-0.02066, 2],
      [-0.00362, 0],
      [-0.0044, 0],
      [-0.00231, 3],
      [-0.00407, 0],
      [-0.01707, 2],
      [-0.00365, 0],
      [-0.0022, 3],
      [0.01871, 1],
      [-0.00233, 3],
      [-0.01605, 2],
      [-0.00234, 3],
      [-0.00357, 0],
      [-0.00343, 3],
      [-0.00251, 3],
      [-0.00217, 3],
      [-0.00262, 3],
      [-0.01549, 2],
      [-0.00245, 3],
      [-0.0045, 3],
      [-0.00227, 3],
      [-0.00343, 0],
      [-0.01615, 2],
      [0.02057, 1],
      [-0.00251, 3],
      [-0.00353, 0],
      [-0.00233, 3]
    ],
    "red_o_points": [],
    "y_categories": ["N", "NOT APPLICABLE", "Y", "nan"],
    "blue_o_points": [],
    "blue_x_points": [
      [0.02542, 1],
      [-0.00116, 3],
      [0.02272, 1],
      [0.00202, 0],
      [0.0016, 0],
      [0.02134, 1],
      [-0.00101, 3],
      [0.0219, 1],
      [-0.00118, 3],
      [-0.00096, 3]
    ]
  },
  "QS_mulLysisRoot[C5]": {
    "red_x_points": [
      [-0.00072, 3],
      [-0.00301, 0],
      [-0.00746, 2],
      [-0.00332, 0],
      [-0.00071, 3],
      [-0.00338, 0],
      [-0.00267, 0],
      [-0.00293, 0],
      [-0.00116, 3],
      [-0.00297, 0],
      [-0.0029, 0],
      [-0.00244, 0],
      [-0.00059, 3],
      [0.007, 1],
      [-0.00102, 3],
      [-0.00309, 0],
      [-0.00064, 3],
      [-0.00294, 0],
      [-0.00077, 3],
      [-0.00083, 3],
      [-0.00068, 3],
      [-0.00067, 3],
      [-0.00288, 0],
      [-0.00091, 3],
      [-0.00076, 3],
      [-0.00058, 3],
      [-0.0028, 0],
      [-0.0027, 0],
      [0.00663, 1],
      [-0.00075, 3],
      [-0.00715, 2],
      [-0.00082, 3]
    ],
    "red_o_points": [],
    "y_categories": ["N", "NOT APPLICABLE", "Y", "nan"],
    "blue_o_points": [],
    "blue_x_points": [
      [0.00958, 1],
      [-0.00026, 3],
      [0.00753, 1],
      [-5e-5, 0],
      [-0.00087, 0],
      [0.00789, 1],
      [-0.00019, 3],
      [0.00876, 1],
      [-0.00045, 3],
      [-0.0002, 3]
    ]
  },
  "QS_mulNeuromadSite[C6]": {
    "red_x_points": [
      [-3e-5, 2],
      [-0.00048, 0],
      [-0.0005, 0],
      [-0.00057, 0],
      [-5e-5, 2],
      [-0.00076, 0],
      [-0.00031, 0],
      [-0.00046, 0],
      [-5e-5, 2],
      [-0.00057, 0],
      [-0.00073, 0],
      [-0.00046, 0],
      [-2e-5, 2],
      [0.00016, 1],
      [3e-5, 2],
      [-0.00061, 0],
      [1e-5, 2],
      [-0.00045, 0],
      [-0.00039, 2],
      [-4e-5, 2],
      [-2e-5, 2],
      [-2e-5, 2],
      [-0.00024, 0],
      [-1e-5, 2],
      [-0.00058, 2],
      [0.0, 2],
      [-0.00041, 0],
      [-0.00037, 0],
      [0.00057, 1],
      [-4e-5, 2],
      [-0.00049, 0],
      [2e-5, 2]
    ],
    "red_o_points": [],
    "y_categories": ["N", "NOT APPLICABLE", "nan"],
    "blue_o_points": [],
    "blue_x_points": [
      [0.00161, 1],
      [-3e-5, 2],
      [0.00058, 1],
      [0.00064, 0],
      [-0.0001, 0],
      [0.00108, 1],
      [7e-5, 2],
      [0.00069, 1],
      [0.00017, 2],
      [5e-5, 2]
    ]
  },
  "QS_mulBpsurgeryType[Lysis]": {
    "red_x_points": [
      [-0.00198, 3],
      [-0.00549, 0],
      [-0.01252, 2],
      [-0.00559, 0],
      [-0.00202, 3],
      [-0.0059, 0],
      [-0.01229, 2],
      [-0.00503, 0],
      [-0.00224, 3],
      [-0.00538, 0],
      [-0.00602, 0],
      [-0.00448, 0],
      [-0.0017, 3],
      [0.01274, 1],
      [-0.00228, 3],
      [-0.00571, 0],
      [-0.00203, 3],
      [-0.01189, 2],
      [-0.00246, 3],
      [-0.00243, 3],
      [-0.0017, 3],
      [-0.00176, 3],
      [-0.0056, 0],
      [-0.00202, 3],
      [-0.00259, 3],
      [-0.00173, 3],
      [-0.00501, 0],
      [-0.00478, 0],
      [0.01487, 1],
      [-0.00125, 3],
      [-0.01235, 2],
      [-0.00191, 3]
    ],
    "red_o_points": [],
    "y_categories": ["N", "NOT APPLICABLE", "Y", "nan"],
    "blue_o_points": [],
    "blue_x_points": [
      [0.01874, 1],
      [-0.0005, 3],
      [0.01631, 1],
      [0.00093, 0],
      [-0.00097, 0],
      [0.01624, 1],
      [-0.00068, 3],
      [0.0172, 1],
      [-0.00084, 3],
      [0.00011, 3]
    ]
  },
  "QA_lstPexTouch[C7]": {
    "red_x_points": [
      [-0.00892, 1],
      [-0.00195, 2],
      [-0.00288, 1],
      [-0.00234, 2],
      [-0.00842, 1],
      [0.00367, 0],
      [-0.00335, 1],
      [-0.00417, 1],
      [0.00608, 0],
      [-0.00272, 1],
      [0.00373, 0],
      [-0.00352, 1],
      [-0.01118, 1],
      [-0.0109, 2],
      [-0.00456, 2],
      [-0.00333, 2],
      [-0.00988, 1],
      [-0.0021, 2],
      [-0.00543, 2],
      [0.00772, 0],
      [-0.00982, 1],
      [0.00603, 0],
      [-0.00321, 2],
      [-0.00547, 2],
      [0.00487, 0],
      [0.0062, 0],
      [-0.00364, 1],
      [-0.00221, 2],
      [-0.00292, 1],
      [-0.00464, 2],
      [-0.00259, 1],
      [-0.00851, 1]
    ],
    "red_o_points": [],
    "y_categories": ["NORM", "NPV", "nan"],
    "blue_o_points": [],
    "blue_x_points": [
      [-5e-5, 1],
      [0.00035, 2],
      [0.00114, 1],
      [0.00053, 1],
      [0.0128, 0],
      [0.00097, 1],
      [0.00997, 0],
      [0.00563, 0],
      [0.00939, 0],
      [0.01343, 0]
    ]
  },
  "QA_lstPexMuscstrength[ShoulderAbduc]": {
    "red_x_points": [
      [-0.00386, 1],
      [-0.00322, 1],
      [-0.00324, 1],
      [-0.00335, 1],
      [-0.00363, 1],
      [-0.0037, 1],
      [-0.00354, 1],
      [-0.00351, 1],
      [-0.00341, 1],
      [-0.00329, 1],
      [-0.0034, 1],
      [-0.00357, 1],
      [-0.00395, 1],
      [0.00058, 2],
      [0.00156, 2],
      [0.00172, 2],
      [0.00167, 2],
      [0.00162, 2],
      [0.00117, 2],
      [-0.00364, 1],
      [-0.00366, 1],
      [-0.00339, 1],
      [-0.00335, 1],
      [0.00142, 2],
      [-0.00529, 1],
      [-0.00328, 1],
      [-0.00341, 1],
      [-0.00338, 1],
      [0.00078, 2],
      [-0.00378, 1],
      [-0.00322, 1],
      [0.00131, 2]
    ],
    "red_o_points": [],
    "y_categories": ["GREATER THAN OR EQUALS TO 3", "LESS THAN 3", "nan"],
    "blue_o_points": [],
    "blue_x_points": [
      [0.00137, 2],
      [0.00191, 2],
      [0.01937, 0],
      [0.00243, 2],
      [-0.00265, 1],
      [0.02158, 0],
      [0.002, 2],
      [-0.00113, 1],
      [-0.00221, 1],
      [-0.00217, 1]
    ]
  },
  "QA_lstPexMuscstrength[ThumbOppo]": {
    "red_x_points": [
      [-0.00766, 1],
      [0.00154, 2],
      [-0.00564, 1],
      [-0.00562, 1],
      [-0.0088, 1],
      [0.00161, 0],
      [0.00144, 0],
      [-0.00865, 1],
      [0.00138, 0],
      [0.00135, 0],
      [0.00134, 0],
      [0.00131, 0],
      [0.00085, 0],
      [0.00102, 2],
      [0.00145, 2],
      [0.00122, 2],
      [0.00091, 0],
      [0.00126, 2],
      [0.00142, 2],
      [0.00094, 0],
      [-0.00856, 1],
      [0.00068, 0],
      [-0.00572, 1],
      [0.00174, 2],
      [0.00218, 2],
      [0.00173, 2],
      [0.00122, 0],
      [-0.00515, 1],
      [0.0011, 2],
      [-0.00779, 1],
      [-0.00596, 1],
      [0.00192, 2]
    ],
    "red_o_points": [],
    "y_categories": ["GREATER THAN OR EQUALS TO 3", "LESS THAN 3", "nan"],
    "blue_o_points": [],
    "blue_x_points": [
      [0.00075, 2],
      [0.00227, 2],
      [0.00164, 0],
      [0.0041, 2],
      [0.00261, 0],
      [0.00161, 0],
      [0.0028, 0],
      [0.00153, 0],
      [0.0031, 2],
      [0.00317, 2]
    ]
  },
  "QS_mulNeuromadSite[T2]": {
    "red_x_points": [
      [-0.00021, 2],
      [-0.00131, 0],
      [-0.00142, 0],
      [-0.00148, 0],
      [-0.00013, 2],
      [-0.00204, 0],
      [-0.00143, 0],
      [-0.00167, 0],
      [-0.00025, 2],
      [-0.00161, 0],
      [-0.00172, 0],
      [-0.00201, 0],
      [-8e-5, 2],
      [0.00168, 1],
      [-0.00017, 2],
      [-0.00153, 0],
      [-0.00019, 2],
      [-0.00113, 0],
      [-0.00084, 2],
      [-0.00025, 2],
      [-0.00016, 2],
      [-0.00022, 2],
      [-0.00136, 0],
      [-0.00012, 2],
      [-0.00067, 2],
      [-0.0002, 2],
      [-0.00159, 0],
      [-0.00132, 0],
      [0.00204, 1],
      [-0.00018, 2],
      [-0.00162, 0],
      [-0.00013, 2]
    ],
    "red_o_points": [],
    "y_categories": ["N", "NOT APPLICABLE", "nan"],
    "blue_o_points": [],
    "blue_x_points": [
      [0.00469, 1],
      [-7e-5, 2],
      [0.00344, 1],
      [0.00042, 0],
      [-0.00042, 0],
      [0.00238, 1],
      [1e-5, 2],
      [0.0028, 1],
      [2e-5, 2],
      [0.00024, 2]
    ]
  },
  "QA_equInjTbpiTime": {
    "red_x_points": [
      [-0.00134, 0],
      [-0.0038, 0],
      [0.00752, 3],
      [-0.00438, 0],
      [-0.00386, 1],
      [-0.00835, 0],
      [-0.0056, 1],
      [-0.00543, 0],
      [0.00097, 3],
      [-0.00692, 0],
      [-0.00569, 0],
      [0.0114, 3],
      [-0.0029, 0],
      [-0.03879, 2],
      [0.00058, 3],
      [-0.00508, 0],
      [-0.00176, 0],
      [-0.00308, 0],
      [-0.01679, 1],
      [3e-5, 3],
      [-0.00118, 0],
      [-0.00479, 1],
      [-0.00879, 2],
      [0.0008, 3],
      [-0.01379, 1],
      [-0.01424, 2],
      [-0.00599, 0],
      [-0.00832, 2],
      [0.00035, 0],
      [0.00018, 0],
      [0.00726, 3],
      [-0.005, 1]
    ],
    "red_o_points": [],
    "y_categories": [
      "0 TO 6 MONTHS",
      "13 TO 24 MONTHS",
      "25 MONTHS OR MORE",
      "7 TO 12 MONTHS",
      "nan"
    ],
    "blue_o_points": [],
    "blue_x_points": [
      [0.003, 0],
      [0.0087, 0],
      [0.00477, 0],
      [0.0187, 3],
      [0.01721, 3],
      [0.0048, 0],
      [0.00575, 1],
      [0.01269, 3],
      [0.00867, 3],
      [0.0057, 0]
    ]
  },
  "QS_mulNeuromadSite[C4]": {
    "red_x_points": [
      [-0.00013, 2],
      [-0.00076, 0],
      [-0.00067, 0],
      [-0.00096, 0],
      [-0.00017, 2],
      [-0.00093, 0],
      [-0.00066, 0],
      [-0.00092, 0],
      [-0.00018, 2],
      [-0.00128, 0],
      [-0.00081, 0],
      [-0.0008, 0],
      [-3e-5, 2],
      [0.00092, 1],
      [-0.00028, 2],
      [-0.0011, 0],
      [-0.00023, 2],
      [-0.0005, 0],
      [-0.00027, 2],
      [-0.00018, 2],
      [-0.00013, 2],
      [-0.00022, 2],
      [-0.00026, 0],
      [-0.00018, 2],
      [-0.00038, 2],
      [-0.0002, 2],
      [-0.00082, 0],
      [-0.00056, 0],
      [0.00076, 1],
      [-0.00018, 2],
      [-0.00057, 0],
      [-0.00034, 2]
    ],
    "red_o_points": [],
    "y_categories": ["N", "NOT APPLICABLE", "nan"],
    "blue_o_points": [],
    "blue_x_points": [
      [0.00281, 1],
      [-0.0, 2],
      [0.0021, 1],
      [0.00029, 0],
      [-0.00034, 0],
      [0.00152, 1],
      [-6e-5, 2],
      [0.00191, 1],
      [-0.00013, 2],
      [-5e-5, 2]
    ]
  },
  "QS_mulTransfSite[Oberlin]": {
    "red_x_points": [
      [-0.00271, 3],
      [-0.01759, 0],
      [-0.01861, 0],
      [-0.01788, 0],
      [-0.00293, 3],
      [-0.00363, 2],
      [-0.00331, 2],
      [-0.01879, 0],
      [-0.00261, 3],
      [-0.00369, 2],
      [-0.00377, 2],
      [-0.00354, 2],
      [-0.00292, 3],
      [0.02188, 1],
      [-0.00292, 3],
      [-0.00377, 2],
      [-0.00274, 3],
      [-0.01826, 0],
      [-0.00344, 3],
      [-0.00293, 3],
      [-0.00268, 3],
      [-0.00248, 3],
      [-0.01834, 0],
      [-0.00267, 3],
      [-0.00396, 3],
      [-0.00292, 3],
      [-0.00366, 2],
      [-0.01817, 0],
      [0.02185, 1],
      [-0.00259, 3],
      [-0.0181, 0],
      [-0.00292, 3]
    ],
    "red_o_points": [],
    "y_categories": ["N", "NOT APPLICABLE", "Y", "nan"],
    "blue_o_points": [],
    "blue_x_points": [
      [0.02965, 1],
      [-0.0011, 3],
      [0.02363, 1],
      [0.00267, 2],
      [0.00138, 2],
      [0.02581, 1],
      [-0.00142, 3],
      [0.02505, 1],
      [-0.00106, 3],
      [-0.00072, 3]
    ]
  },
  "QS_mulGraftNerve[FI]": {
    "red_x_points": [
      [0.0, 2],
      [-0.0003, 0],
      [-0.00023, 0],
      [-0.00023, 0],
      [-5e-5, 2],
      [-0.0005, 0],
      [-0.00028, 0],
      [-0.00035, 0],
      [-5e-5, 2],
      [-0.00031, 0],
      [-0.00019, 0],
      [-0.00025, 0],
      [-5e-5, 2],
      [0.00047, 1],
      [-0.0001, 2],
      [-0.00023, 0],
      [-8e-5, 2],
      [-0.00038, 0],
      [-0.00015, 2],
      [-5e-5, 2],
      [-4e-5, 2],
      [-3e-5, 2],
      [-0.00034, 0],
      [-0.00016, 2],
      [-0.00024, 2],
      [-3e-5, 2],
      [-0.00029, 0],
      [-0.00035, 0],
      [0.00063, 1],
      [-2e-5, 2],
      [-0.00013, 0],
      [-2e-5, 2]
    ],
    "red_o_points": [],
    "y_categories": ["N", "NOT APPLICABLE", "nan"],
    "blue_o_points": [],
    "blue_x_points": [
      [0.0008, 1],
      [-0.0001, 2],
      [0.00061, 1],
      [0.00011, 0],
      [-0.00011, 0],
      [0.00058, 1],
      [-4e-5, 2],
      [0.00062, 1],
      [-2e-5, 2],
      [-3e-5, 2]
    ]
  }
}
