{
  "QA_lstPexPain[C8]": {
    "red_x_points": [
      [-0.00936, 1],
      [-0.00266, 2],
      [-0.00255, 2],
      [-0.00297, 2],
      [-0.00895, 1],
      [0.00047, 0],
      [-0.00036, 1],
      [-0.00063, 1],
      [0.00761, 0],
      [-0.00075, 0],
      [0.00047, 0],
      [-3e-5, 0],
      [-0.01044, 1],
      [-0.01501, 2],
      [-0.00519, 2],
      [-0.00357, 2],
      [-0.00465, 2],
      [-0.00205, 2],
      [-0.0058, 2],
      [0.00747, 0],
      [-0.0107, 1],
      [0.00702, 0],
      [-0.003, 2],
      [-0.00494, 2],
      [0.00433, 0],
      [-0.00618, 2],
      [-0.00418, 2],
      [-0.00277, 2],
      [-0.00666, 1],
      [-0.00991, 1],
      [-0.00186, 1],
      [-0.00977, 1]
    ],
    "red_o_points": [],
    "y_categories": ["NORM", "NPV", "nan"],
    "blue_o_points": [],
    "blue_x_points": [
      [0.00975, 0],
      [-0.00121, 2],
      [0.00041, 1],
      [0.00955, 1],
      [0.00443, 0],
      [0.00037, 1],
      [0.01205, 0],
      [0.00607, 0],
      [0.01237, 0],
      [0.01358, 0]
    ]
  },
  "QS_mulLysisRoot[C6]": {
    "red_x_points": [
      [-0.00107, 3],
      [-0.0025, 0],
      [-0.00805, 2],
      [-0.00244, 0],
      [-0.00097, 3],
      [-0.00228, 0],
      [-0.00209, 0],
      [-0.00202, 0],
      [-0.00123, 3],
      [-0.00242, 0],
      [-0.00253, 0],
      [-0.00171, 0],
      [-0.00115, 3],
      [0.00593, 1],
      [-0.0013, 3],
      [-0.00245, 0],
      [-0.0011, 3],
      [-0.00229, 0],
      [-0.00099, 3],
      [-0.00141, 3],
      [-0.0008, 3],
      [-0.00096, 3],
      [-0.00245, 0],
      [-0.00101, 3],
      [-0.00095, 3],
      [-0.00084, 3],
      [-0.00219, 0],
      [-0.002, 0],
      [0.00714, 1],
      [-0.00079, 3],
      [-0.00678, 2],
      [-0.00093, 3]
    ],
    "red_o_points": [],
    "y_categories": ["N", "NOT APPLICABLE", "Y", "nan"],
    "blue_o_points": [],
    "blue_x_points": [
      [0.00856, 1],
      [-0.0005, 3],
      [0.00688, 1],
      [-0.0001, 0],
      [-0.00017, 0],
      [0.00718, 1],
      [-0.00039, 3],
      [0.00732, 1],
      [-0.00059, 3],
      [-0.00041, 3]
    ]
  },
  "QS_mulLysisTrunk[Upper]": {
    "red_x_points": [
      [-0.00116, 3],
      [-0.00464, 0],
      [-0.00403, 0],
      [-0.00456, 0],
      [-0.00107, 3],
      [-0.00498, 0],
      [-0.01009, 2],
      [-0.00397, 0],
      [-0.00182, 3],
      [-0.00501, 0],
      [-0.00511, 0],
      [-0.00426, 0],
      [-0.0017, 3],
      [0.00918, 1],
      [-0.00108, 3],
      [-0.00514, 0],
      [-0.00147, 3],
      [-0.01072, 2],
      [-0.00153, 3],
      [-0.00221, 3],
      [-0.00133, 3],
      [-0.00159, 3],
      [-0.00485, 0],
      [-0.00141, 3],
      [-0.00234, 3],
      [-0.00117, 3],
      [-0.00507, 0],
      [-0.00439, 0],
      [0.01032, 1],
      [-0.00107, 3],
      [-0.01018, 2],
      [-0.00115, 3]
    ],
    "red_o_points": [],
    "y_categories": ["N", "NOT APPLICABLE", "Y", "nan"],
    "blue_o_points": [],
    "blue_x_points": [
      [0.01395, 1],
      [-0.00011, 3],
      [0.01404, 1],
      [0.00094, 0],
      [-0.00089, 0],
      [0.01355, 1],
      [-0.00061, 3],
      [0.01419, 1],
      [-0.00053, 3],
      [2e-5, 3]
    ]
  },
  "QS_mulBpsurgeryType[Transf]": {
    "red_x_points": [
      [-0.00017, 3],
      [-0.00047, 2],
      [-0.00245, 0],
      [-0.00056, 2],
      [-0.00016, 3],
      [-0.00061, 2],
      [-0.00058, 2],
      [-0.00054, 2],
      [-0.00023, 3],
      [-0.00035, 2],
      [-0.00056, 2],
      [-0.00034, 2],
      [-0.00011, 3],
      [0.0014, 1],
      [-0.00026, 3],
      [-0.0004, 2],
      [-0.00019, 3],
      [-0.00049, 2],
      [-0.00017, 3],
      [-0.00033, 3],
      [-0.00014, 3],
      [-0.0002, 3],
      [-0.00063, 2],
      [-0.00018, 3],
      [-0.00015, 3],
      [-0.00013, 3],
      [-0.00048, 2],
      [-0.00045, 2],
      [0.00117, 1],
      [-0.00011, 3],
      [-0.00051, 2],
      [-8e-5, 3]
    ],
    "red_o_points": [],
    "y_categories": ["N", "NOT APPLICABLE", "Y", "nan"],
    "blue_o_points": [],
    "blue_x_points": [
      [0.00164, 1],
      [-0.00015, 3],
      [0.00145, 1],
      [0.0, 2],
      [-6e-5, 2],
      [0.00143, 1],
      [-4e-5, 3],
      [0.00132, 1],
      [-0.0002, 3],
      [-8e-5, 3]
    ]
  },
  "QS_equBpsurgTime": {
    "red_x_points": [
      [0.00049, 3],
      [-0.00692, 0],
      [0.00507, 2],
      [-0.0064, 0],
      [0.00047, 3],
      [-0.01153, 0],
      [-0.00774, 1],
      [-0.00712, 1],
      [0.00043, 3],
      [-0.00952, 1],
      [-0.00854, 0],
      [0.01003, 2],
      [0.00038, 3],
      [0.00061, 3],
      [0.00057, 3],
      [-0.00861, 1],
      [0.00047, 3],
      [0.00514, 2],
      [0.00048, 3],
      [0.00061, 3],
      [0.0004, 3],
      [0.00049, 3],
      [-0.0057, 0],
      [0.00044, 3],
      [0.00062, 3],
      [0.00052, 3],
      [-0.00834, 0],
      [-0.00632, 0],
      [0.00057, 3],
      [0.00056, 3],
      [0.00525, 2],
      [0.00057, 3]
    ],
    "red_o_points": [],
    "y_categories": [
      "0 TO 6 MONTHS",
      "13 TO 24 MONTHS",
      "7 TO 12 MONTHS",
      "nan"
    ],
    "blue_o_points": [],
    "blue_x_points": [
      [0.00034, 3],
      [0.00053, 3],
      [0.0004, 3],
      [0.01396, 2],
      [0.0145, 2],
      [0.00037, 3],
      [0.00064, 3],
      [0.00055, 3],
      [0.00086, 3],
      [0.00077, 3]
    ]
  },
  "QA_equInjTbpiTime": {
    "red_x_points": [
      [-0.00012, 0],
      [-0.003, 0],
      [0.00585, 3],
      [-0.00377, 0],
      [-0.00485, 1],
      [-0.00671, 0],
      [-0.00681, 1],
      [-0.00448, 0],
      [-0.00095, 3],
      [-0.00693, 0],
      [-0.00518, 0],
      [0.0117, 3],
      [-0.00124, 0],
      [-0.034, 2],
      [-0.00156, 3],
      [-0.00412, 0],
      [0.00077, 0],
      [-0.00261, 0],
      [-0.01275, 1],
      [0.00047, 3],
      [-0.00181, 0],
      [-0.0063, 1],
      [-0.00771, 2],
      [-0.00152, 3],
      [-0.01207, 1],
      [-0.0142, 2],
      [-0.00541, 0],
      [-0.00779, 2],
      [0.00083, 0],
      [0.00101, 0],
      [0.00587, 3],
      [-0.00802, 1]
    ],
    "red_o_points": [],
    "y_categories": [
      "0 TO 6 MONTHS",
      "13 TO 24 MONTHS",
      "25 MONTHS OR MORE",
      "7 TO 12 MONTHS",
      "nan"
    ],
    "blue_o_points": [],
    "blue_x_points": [
      [0.00324, 0],
      [0.01017, 0],
      [0.00381, 0],
      [0.01746, 3],
      [0.01543, 3],
      [0.00408, 0],
      [0.004, 1],
      [0.01065, 3],
      [0.01054, 3],
      [0.00796, 0]
    ]
  },
  "QA_lstPexMuscstrength[FingersAddu]": {
    "red_x_points": [
      [0.00105, 0],
      [0.00025, 2],
      [-0.0037, 1],
      [-0.00331, 1],
      [-0.00518, 1],
      [0.00153, 0],
      [0.00117, 0],
      [-0.00448, 1],
      [0.00099, 0],
      [0.00113, 0],
      [0.00023, 2],
      [0.00142, 0],
      [0.00084, 0],
      [0.00011, 2],
      [0.00041, 2],
      [6e-5, 2],
      [0.00094, 0],
      [0.00015, 2],
      [0.00024, 2],
      [0.00098, 0],
      [-0.00507, 1],
      [0.00069, 0],
      [-0.00284, 1],
      [0.00038, 2],
      [0.00044, 2],
      [0.00038, 2],
      [8e-5, 2],
      [-0.00355, 1],
      [0.00022, 2],
      [-0.00572, 1],
      [-0.00385, 1],
      [0.00044, 2]
    ],
    "red_o_points": [],
    "y_categories": ["GREATER THAN OR EQUALS TO 3", "LESS THAN 3", "nan"],
    "blue_o_points": [],
    "blue_x_points": [
      [0.00015, 2],
      [0.00052, 2],
      [0.00104, 0],
      [0.00123, 2],
      [0.00284, 0],
      [0.00118, 0],
      [0.00412, 0],
      [0.00097, 0],
      [0.00105, 2],
      [0.00131, 2]
    ]
  },
  "QA_yonInjFracture": {
    "red_x_points": [
      [-0.01004, 0],
      [-0.00178, 2],
      [0.00109, 0],
      [-0.00198, 1],
      [-0.00901, 0],
      [0.00066, 0],
      [0.00083, 0],
      [-0.00371, 1],
      [0.00716, 2],
      [0.00103, 0],
      [-0.00276, 1],
      [-0.00653, 1],
      [-0.00886, 0],
      [-0.00133, 0],
      [0.00587, 1],
      [-0.00263, 1],
      [-0.01007, 0],
      [-0.00261, 1],
      [-0.01083, 0],
      [-0.01136, 0],
      [0.00597, 1],
      [-0.01342, 0],
      [-0.00167, 1],
      [-0.01146, 0],
      [-0.01283, 0],
      [-0.01253, 0],
      [0.00078, 0],
      [0.00076, 0],
      [-0.00899, 1],
      [0.00546, 2],
      [-0.00366, 1],
      [0.00559, 1]
    ],
    "red_o_points": [],
    "y_categories": ["N", "Y", "nan"],
    "blue_o_points": [],
    "blue_x_points": [
      [0.00266, 0],
      [0.01212, 1],
      [0.00097, 0],
      [0.0059, 0],
      [0.00519, 0],
      [0.0019, 1],
      [0.01216, 2],
      [0.00099, 0],
      [0.01552, 1],
      [0.01374, 2]
    ]
  },
  "QS_mulGraftNerve[Ac]": {
    "red_x_points": [
      [-0.00019, 2],
      [-0.00029, 0],
      [-0.00029, 0],
      [-0.00044, 0],
      [-6e-5, 2],
      [-0.00046, 0],
      [-0.00044, 0],
      [-0.00045, 0],
      [-0.0001, 2],
      [-0.00031, 0],
      [-0.00042, 0],
      [-0.0005, 0],
      [-0.00015, 2],
      [0.00046, 1],
      [-0.00011, 2],
      [-0.0004, 0],
      [-7e-5, 2],
      [-0.00046, 0],
      [-0.00018, 2],
      [-0.00012, 2],
      [-9e-5, 2],
      [-0.00013, 2],
      [-0.00044, 0],
      [-0.0001, 2],
      [-0.00028, 2],
      [-0.00014, 2],
      [-0.00027, 0],
      [-0.00038, 0],
      [0.00031, 1],
      [-8e-5, 2],
      [-0.00039, 0],
      [-7e-5, 2]
    ],
    "red_o_points": [],
    "y_categories": ["N", "NOT APPLICABLE", "nan"],
    "blue_o_points": [],
    "blue_x_points": [
      [0.00096, 1],
      [-7e-5, 2],
      [0.00075, 1],
      [0.00043, 0],
      [-0.0002, 0],
      [0.00119, 1],
      [-0.0, 2],
      [0.00099, 1],
      [4e-5, 2],
      [7e-5, 2]
    ]
  },
  "QS_mulNeuromadSite[C8]": {
    "red_x_points": [
      [-0.00031, 2],
      [-0.00304, 0],
      [-0.00275, 0],
      [-0.00305, 0],
      [-0.00031, 2],
      [-0.00304, 0],
      [-0.00231, 0],
      [-0.00272, 0],
      [-0.00091, 2],
      [-0.00331, 0],
      [-0.00317, 0],
      [-0.00293, 0],
      [-0.00049, 2],
      [0.00307, 1],
      [-0.00025, 2],
      [-0.00317, 0],
      [-0.00049, 2],
      [-0.00284, 0],
      [-0.00127, 2],
      [-0.00045, 2],
      [-0.00025, 2],
      [-0.00034, 2],
      [-0.00256, 0],
      [-0.00031, 2],
      [-0.00115, 2],
      [-0.00037, 2],
      [-0.00284, 0],
      [-0.00234, 0],
      [0.0041, 1],
      [-0.00016, 2],
      [-0.00196, 0],
      [-0.00039, 2]
    ],
    "red_o_points": [],
    "y_categories": ["N", "NOT APPLICABLE", "nan"],
    "blue_o_points": [],
    "blue_x_points": [
      [0.00782, 1],
      [0.00045, 2],
      [0.00604, 1],
      [0.00091, 0],
      [-0.00074, 0],
      [0.00566, 1],
      [-0.00023, 2],
      [0.00667, 1],
      [0.00021, 2],
      [0.00026, 2]
    ]
  },
  "QS_mulGraftNerve[Ph]": {
    "red_x_points": [
      [-1e-5, 2],
      [-0.00033, 0],
      [-0.00028, 0],
      [-0.00041, 0],
      [-0.00012, 2],
      [-0.0002, 0],
      [-0.00027, 0],
      [-0.00049, 0],
      [-0.00013, 2],
      [-0.00047, 0],
      [-0.00037, 0],
      [-0.00023, 0],
      [-1e-5, 2],
      [0.00023, 1],
      [-0.00022, 2],
      [-0.00042, 0],
      [-0.00022, 2],
      [-0.00022, 0],
      [-5e-5, 2],
      [-2e-5, 2],
      [-0.0, 2],
      [-2e-5, 2],
      [-0.00021, 0],
      [-8e-5, 2],
      [-4e-5, 2],
      [-6e-5, 2],
      [-0.00026, 0],
      [-0.00031, 0],
      [-0.0, 1],
      [-0.00011, 2],
      [-0.00031, 0],
      [-0.00017, 2]
    ],
    "red_o_points": [],
    "y_categories": ["N", "NOT APPLICABLE", "nan"],
    "blue_o_points": [],
    "blue_x_points": [
      [0.00125, 1],
      [6e-5, 2],
      [0.00058, 1],
      [0.00034, 0],
      [-3e-5, 0],
      [0.00055, 1],
      [-1e-5, 2],
      [0.00075, 1],
      [-0.0, 2],
      [-6e-5, 2]
    ]
  },
  "QS_mulTransfSite[AcSsPA]": {
    "red_x_points": [
      [-0.00037, 3],
      [-0.00131, 0],
      [-0.00134, 0],
      [-0.00157, 0],
      [-0.00046, 3],
      [-0.00155, 0],
      [-0.00119, 0],
      [-0.00165, 0],
      [-0.00065, 3],
      [-0.0017, 0],
      [-0.0018, 0],
      [-0.00153, 0],
      [-0.00043, 3],
      [0.00304, 1],
      [-0.00051, 3],
      [-0.00197, 0],
      [-0.00056, 3],
      [-0.00336, 2],
      [-0.00039, 3],
      [-0.00044, 3],
      [-0.00019, 3],
      [-0.00036, 3],
      [-0.00127, 0],
      [-0.00053, 3],
      [-0.00048, 3],
      [-0.00024, 3],
      [-0.0017, 0],
      [-0.00125, 0],
      [0.00331, 1],
      [-0.00034, 3],
      [-0.00122, 0],
      [-0.00045, 3]
    ],
    "red_o_points": [],
    "y_categories": ["N", "NOT APPLICABLE", "Y", "nan"],
    "blue_o_points": [],
    "blue_x_points": [
      [0.00438, 1],
      [-0.00013, 3],
      [0.0042, 1],
      [-0.00023, 0],
      [-0.00066, 0],
      [0.00402, 1],
      [-0.00025, 3],
      [0.00396, 1],
      [-0.00021, 3],
      [-0.00025, 3]
    ]
  },
  "QA_lstPexMuscstrength[FingersFlex]": {
    "red_x_points": [
      [0.00026, 0],
      [0.00024, 2],
      [-0.00216, 1],
      [-0.00185, 1],
      [0.00027, 0],
      [0.00043, 0],
      [0.00029, 0],
      [-0.00337, 1],
      [-0.00019, 0],
      [0.00015, 0],
      [0.00032, 0],
      [0.00038, 0],
      [-0.0039, 1],
      [0.00012, 2],
      [0.00042, 2],
      [0.00031, 2],
      [0.00025, 0],
      [0.00025, 2],
      [0.00036, 2],
      [0.00012, 0],
      [-0.00438, 1],
      [-8e-5, 0],
      [-0.00162, 1],
      [0.0004, 2],
      [0.0007, 2],
      [0.00075, 2],
      [0.00017, 0],
      [0.00035, 0],
      [0.00021, 2],
      [-0.00411, 1],
      [-0.00258, 1],
      [0.00041, 2]
    ],
    "red_o_points": [],
    "y_categories": ["GREATER THAN OR EQUALS TO 3", "LESS THAN 3", "nan"],
    "blue_o_points": [],
    "blue_x_points": [
      [9e-5, 2],
      [0.00054, 2],
      [0.0004, 0],
      [0.00207, 2],
      [0.00129, 0],
      [0.00041, 0],
      [0.0017, 0],
      [0.0004, 0],
      [0.00218, 2],
      [0.00131, 2]
    ]
  },
  "QA_lstPexMuscstrength[ScapulaAbducSuprot]": {
    "red_x_points": [
      [-0.00312, 0],
      [0.0002, 2],
      [-0.00276, 1],
      [-0.00094, 1],
      [-0.00313, 0],
      [9e-5, 0],
      [-0.00343, 1],
      [-0.00226, 1],
      [-0.00038, 1],
      [0.0006, 0],
      [-0.00069, 0],
      [-0.00364, 1],
      [0.00056, 1],
      [0.0, 2],
      [0.00059, 2],
      [0.00014, 2],
      [0.00098, 2],
      [0.00024, 2],
      [0.00072, 2],
      [-0.00721, 0],
      [0.00111, 1],
      [-0.00848, 0],
      [-0.00106, 1],
      [0.00052, 2],
      [-0.00625, 0],
      [0.00102, 2],
      [-0.00334, 1],
      [0.00028, 0],
      [-7e-5, 2],
      [-0.00372, 0],
      [-0.00233, 1],
      [0.00056, 2]
    ],
    "red_o_points": [],
    "y_categories": ["GREATER THAN OR EQUALS TO 3", "LESS THAN 3", "nan"],
    "blue_o_points": [],
    "blue_x_points": [
      [-0.0, 2],
      [0.00081, 2],
      [0.00029, 0],
      [0.00422, 2],
      [0.00453, 0],
      [0.00028, 0],
      [0.0047, 2],
      [0.00037, 2],
      [0.00874, 1],
      [0.00417, 2]
    ]
  },
  "participant_code": {
    "red_x_points": [
      [-0.02582, 1],
      [-0.02276, 2],
      [-0.02358, 3],
      [-0.02382, 4],
      [-0.02329, 5],
      [-0.02411, 6],
      [-0.02411, 7],
      [-0.02388, 8],
      [-0.02305, 9],
      [-0.02429, 10],
      [-0.02382, 11],
      [-0.02364, 12],
      [-0.0227, 13],
      [-0.02335, 15],
      [-0.02382, 17],
      [-0.02317, 18],
      [-0.02358, 20],
      [-0.02376, 21],
      [-0.02282, 22],
      [-0.02241, 24],
      [-0.02376, 26],
      [-0.02382, 27],
      [-0.02452, 28],
      [-0.02423, 30],
      [-0.02411, 31],
      [-0.02376, 32],
      [-0.02376, 34],
      [-0.02382, 36],
      [-0.02388, 38],
      [-0.02417, 39],
      [-0.02358, 40],
      [-0.02276, 41]
    ],
    "red_o_points": [],
    "y_categories": [
      "P16554",
      "P18297",
      "P19283",
      "P19287",
      "P23391",
      "P30595",
      "P31645",
      "P31691",
      "P34778",
      "P35046",
      "P36328",
      "P43633",
      "P4544",
      "P46417",
      "P48965",
      "P53068",
      "P5497",
      "P59529",
      "P62483",
      "P64658",
      "P65202",
      "P66816",
      "P6751",
      "P7408",
      "P75566",
      "P76226",
      "P79971",
      "P82621",
      "P82990",
      "P84549",
      "P84932",
      "P85825",
      "P86989",
      "P8770",
      "P87791",
      "P90550",
      "P93159",
      "P94969",
      "P96710",
      "P97130",
      "P9744",
      "P98500",
      "nan"
    ],
    "blue_o_points": [],
    "blue_x_points": [
      [0.04827, 0],
      [0.04983, 14],
      [0.047, 16],
      [0.04855, 19],
      [0.04686, 23],
      [0.05166, 25],
      [0.04898, 29],
      [0.0487, 33],
      [0.05406, 35],
      [0.04799, 37]
    ]
  },
  "QS_mulNeuromadSite[T2]": {
    "red_x_points": [
      [-0.0003, 2],
      [-0.00146, 0],
      [-0.00126, 0],
      [-0.00164, 0],
      [-0.00042, 2],
      [-0.0022, 0],
      [-0.00163, 0],
      [-0.00175, 0],
      [-0.00035, 2],
      [-0.0021, 0],
      [-0.00214, 0],
      [-0.00191, 0],
      [-0.00038, 2],
      [0.00164, 1],
      [-0.00022, 2],
      [-0.00156, 0],
      [-0.00053, 2],
      [-0.00156, 0],
      [-0.00055, 2],
      [-0.00059, 2],
      [-0.0002, 2],
      [-0.00045, 2],
      [-0.0013, 0],
      [-0.0004, 2],
      [-0.00072, 2],
      [-0.00027, 2],
      [-0.00141, 0],
      [-0.00157, 0],
      [0.0021, 1],
      [-0.00026, 2],
      [-0.00134, 0],
      [-0.00056, 2]
    ],
    "red_o_points": [],
    "y_categories": ["N", "NOT APPLICABLE", "nan"],
    "blue_o_points": [],
    "blue_x_points": [
      [0.00481, 1],
      [-0.00035, 2],
      [0.00418, 1],
      [0.00086, 0],
      [-0.00044, 0],
      [0.00394, 1],
      [-0.0001, 2],
      [0.00374, 1],
      [5e-5, 2],
      [0.00012, 2]
    ]
  },
  "QA_mulInjOrthesisType[ArmSling]": {
    "red_x_points": [
      [-0.00586, 2],
      [-0.00609, 2],
      [-0.00634, 2],
      [-0.00599, 2],
      [-0.00588, 2],
      [-0.00624, 2],
      [-0.00636, 2],
      [-0.00595, 2],
      [-0.00614, 2],
      [-0.00699, 2],
      [-0.0058, 2],
      [-0.0064, 2],
      [-0.00612, 2],
      [0.01199, 1],
      [-0.00712, 2],
      [-0.00693, 2],
      [-0.00715, 2],
      [-0.01076, 0],
      [0.01256, 1],
      [-0.00597, 2],
      [-0.006, 2],
      [-0.0163, 0],
      [-0.00373, 3],
      [-0.0071, 2],
      [0.00998, 1],
      [-0.00662, 2],
      [-0.00636, 2],
      [-0.0057, 2],
      [-0.01283, 3],
      [-0.00171, 3],
      [-0.00549, 2],
      [-0.00726, 2]
    ],
    "red_o_points": [],
    "y_categories": ["N", "NOT APPLICABLE", "Y", "nan"],
    "blue_o_points": [],
    "blue_x_points": [
      [0.00295, 2],
      [0.02049, 1],
      [0.01569, 1],
      [0.03207, 1],
      [-0.00422, 2],
      [0.01558, 1],
      [-0.00295, 2],
      [0.01351, 1],
      [-0.00308, 2],
      [0.01033, 3]
    ]
  },
  "QS_mulGraftNerve[Ul]": {
    "red_x_points": [
      [-7e-5, 2],
      [-0.00012, 0],
      [-6e-5, 0],
      [-6e-5, 0],
      [4e-5, 2],
      [-0.00015, 0],
      [-6e-5, 0],
      [-0.00012, 0],
      [-0.00012, 0],
      [-6e-5, 0],
      [-6e-5, 0],
      [3e-5, 2],
      [6e-5, 1],
      [4e-5, 2],
      [-0.00022, 0],
      [-5e-5, 2],
      [-0.00016, 0],
      [-4e-5, 2],
      [-5e-5, 2],
      [1e-5, 2],
      [4e-5, 2],
      [-6e-5, 0],
      [4e-5, 2],
      [-4e-5, 2],
      [1e-5, 2],
      [-0.00012, 0],
      [6e-5, 1],
      [4e-5, 2],
      [-0.00012, 0],
      [4e-5, 2]
    ],
    "red_o_points": [],
    "y_categories": ["N", "NOT APPLICABLE", "nan"],
    "blue_o_points": [],
    "blue_x_points": [
      [0.00014, 1],
      [0.00014, 2],
      [7e-5, 1],
      [0.00012, 0],
      [-3e-5, 0],
      [0.00014, 1],
      [-5e-5, 2],
      [0.00013, 1],
      [4e-5, 2]
    ]
  },
  "QA_mulInjOrthesisType[ShoulderSupport]": {
    "red_x_points": [
      [-0.00531, 0],
      [-0.00539, 0],
      [-0.00539, 0],
      [-0.00546, 0],
      [-0.00567, 0],
      [-0.00462, 0],
      [-0.00543, 0],
      [-0.00537, 0],
      [-0.01672, 2],
      [-0.00624, 0],
      [-0.00544, 0],
      [-0.00547, 0],
      [-0.00504, 0],
      [0.01047, 1],
      [-0.00704, 0],
      [-0.00553, 0],
      [-0.00682, 0],
      [-0.00988, 2],
      [0.01187, 1],
      [-0.00443, 0],
      [-0.00519, 0],
      [-0.01607, 2],
      [-0.00217, 3],
      [-0.00688, 0],
      [0.00774, 1],
      [-0.00543, 0],
      [-0.0051, 0],
      [-0.00485, 0],
      [-0.00839, 3],
      [-0.00161, 3],
      [-0.00475, 0],
      [-0.00638, 0]
    ],
    "red_o_points": [],
    "y_categories": ["N", "NOT APPLICABLE", "Y", "nan"],
    "blue_o_points": [],
    "blue_x_points": [
      [0.00176, 0],
      [0.01934, 1],
      [0.01351, 1],
      [0.02601, 1],
      [-0.00355, 0],
      [0.01492, 1],
      [-0.00055, 0],
      [0.01268, 1],
      [-0.00066, 0],
      [0.01197, 3]
    ]
  },
  "QA_yonInjUnconscio": {
    "red_x_points": [
      [-0.00562, 1],
      [-0.0071, 1],
      [-0.00412, 2],
      [-0.00342, 2],
      [-0.00383, 2],
      [0.01859, 0],
      [-0.00796, 1],
      [-0.00425, 2],
      [-0.00448, 2],
      [-0.00515, 2],
      [-0.00417, 2],
      [-0.00991, 1],
      [-0.00636, 1],
      [-0.01792, 1],
      [-0.00676, 2],
      [-0.00413, 2],
      [-0.00435, 2],
      [-0.00722, 1],
      [0.0044, 0],
      [-0.00799, 1],
      [-0.00622, 1],
      [-0.00859, 1],
      [-0.00659, 1],
      [-0.0056, 2],
      [-0.00976, 1],
      [-0.0049, 2],
      [-0.00778, 1],
      [-0.00695, 1],
      [-0.00159, 2],
      [-0.00397, 2],
      [-0.00794, 1],
      [-0.00525, 2]
    ],
    "red_o_points": [],
    "y_categories": ["N", "Y", "nan"],
    "blue_o_points": [],
    "blue_x_points": [
      [0.00038, 2],
      [0.0083, 1],
      [0.01598, 0],
      [0.0263, 0],
      [0.02628, 0],
      [0.0008, 2],
      [-0.00208, 1],
      [0.0009, 2],
      [0.02688, 0],
      [-0.00071, 2]
    ]
  },
  "QS_mulTransfSite[Other]": {
    "red_x_points": [
      [-0.00229, 3],
      [-0.01339, 0],
      [-0.0131, 0],
      [-0.01334, 0],
      [-0.00276, 3],
      [-0.01392, 0],
      [-0.01351, 0],
      [-0.01369, 0],
      [-0.00242, 3],
      [-0.01404, 0],
      [-0.01441, 0],
      [-0.01244, 0],
      [-0.00243, 3],
      [0.01958, 1],
      [-0.00233, 3],
      [-0.01331, 0],
      [-0.00257, 3],
      [-0.01279, 0],
      [-0.00252, 3],
      [-0.00222, 3],
      [-0.00217, 3],
      [-0.00228, 3],
      [-0.01358, 0],
      [-0.00219, 3],
      [-0.00301, 3],
      [-0.00214, 3],
      [-0.01344, 0],
      [-0.01259, 0],
      [0.01996, 1],
      [-0.00229, 3],
      [-0.01219, 0],
      [-0.00257, 3]
    ],
    "red_o_points": [],
    "y_categories": ["N", "NOT APPLICABLE", "Y", "nan"],
    "blue_o_points": [],
    "blue_x_points": [
      [0.0237, 1],
      [-0.00107, 3],
      [0.02057, 1],
      [-0.00616, 0],
      [0.04486, 2],
      [0.02093, 1],
      [-0.00077, 3],
      [0.02267, 1],
      [-0.00102, 3],
      [-0.00034, 3]
    ]
  },
  "QA_lstInjTpbiSide": {
    "red_x_points": [
      [-0.00357, 1],
      [0.00074, 0],
      [0.00018, 0],
      [0.00018, 0],
      [0.0002, 0],
      [-0.00142, 1],
      [-0.00167, 0],
      [-0.00191, 0],
      [-0.00534, 1],
      [-0.00139, 0],
      [-0.00157, 1],
      [-0.00188, 1],
      [-0.00369, 1],
      [-0.01394, 0],
      [-0.00726, 1],
      [-0.00274, 1],
      [0.00049, 0],
      [-0.00235, 1],
      [-0.00792, 1],
      [-3e-5, 0],
      [0.00075, 0],
      [-0.00022, 0],
      [-0.00081, 0],
      [0.0031, 0],
      [-0.00739, 1],
      [-0.00655, 1],
      [-0.00064, 1],
      [-0.00032, 1],
      [-0.0154, 0],
      [-0.00479, 1],
      [-0.0013, 0],
      [0.00198, 0]
    ],
    "red_o_points": [],
    "y_categories": ["L", "R", "nan"],
    "blue_o_points": [],
    "blue_x_points": [
      [-0.00529, 0],
      [0.0076, 0],
      [0.00859, 1],
      [0.00448, 0],
      [0.0032, 1],
      [0.00933, 1],
      [0.00264, 1],
      [0.00747, 1],
      [0.00704, 0],
      [0.0071, 0]
    ]
  },
  "QA_lstPexArthre[Shoulder]": {
    "red_x_points": [
      [-0.00156, 2],
      [-0.0012, 3],
      [-0.0022, 3],
      [-0.00199, 0],
      [-0.00301, 3],
      [-0.00399, 2],
      [-0.00125, 2],
      [0.00169, 1],
      [-0.00654, 3],
      [-0.00204, 2],
      [-0.00258, 2],
      [-0.00256, 2],
      [-0.00153, 2],
      [-0.00032, 3],
      [-0.00267, 3],
      [-0.00151, 2],
      [-0.00294, 3],
      [-0.00145, 3],
      [-0.00187, 3],
      [-0.00227, 2],
      [-0.00021, 1],
      [-0.00226, 2],
      [-0.00143, 3],
      [-0.00211, 3],
      [-0.0016, 2],
      [-0.00403, 3],
      [-0.00341, 3],
      [-0.00228, 3],
      [-0.00037, 3],
      [-0.00218, 3],
      [-0.00041, 1],
      [-0.0029, 3]
    ],
    "red_o_points": [],
    "y_categories": ["NAIA", "NPV", "PV", "nan"],
    "blue_o_points": [],
    "blue_x_points": [
      [6e-5, 2],
      [-0.0008, 3],
      [5e-5, 2],
      [0.00194, 2],
      [0.01726, 1],
      [-0.00025, 2],
      [0.01801, 1],
      [0.00028, 3],
      [0.00336, 2],
      [0.00089, 2]
    ]
  },
  "QA_lstPexPain[C5]": {
    "red_x_points": [
      [-0.00239, 1],
      [-0.004, 2],
      [-0.00441, 2],
      [-0.00409, 2],
      [-0.00235, 1],
      [-0.00087, 1],
      [-0.00057, 1],
      [-0.00069, 1],
      [-0.00299, 1],
      [-0.00096, 1],
      [-0.00074, 1],
      [-0.00078, 1],
      [-0.00207, 1],
      [-0.01678, 2],
      [-0.00569, 2],
      [-0.00465, 2],
      [-0.00608, 2],
      [-0.00379, 2],
      [-0.00548, 2],
      [-0.00226, 1],
      [-0.00204, 1],
      [-0.00193, 1],
      [-0.0046, 2],
      [-0.0059, 2],
      [-0.00248, 1],
      [-0.00697, 2],
      [-0.00445, 2],
      [-0.00411, 2],
      [-0.00536, 1],
      [-0.00446, 1],
      [-0.00073, 1],
      [-0.00316, 1]
    ],
    "red_o_points": [],
    "y_categories": ["NORM", "NPV", "nan"],
    "blue_o_points": [],
    "blue_x_points": [
      [0.02163, 0],
      [-0.00262, 2],
      [0.00033, 1],
      [-0.00031, 1],
      [-0.00056, 1],
      [8e-5, 1],
      [-0.00124, 1],
      [0.01915, 0],
      [-0.00102, 1],
      [0.03947, 0]
    ]
  },
  "QS_mulBpsurgeryType[Lysis]": {
    "red_x_points": [
      [-0.00154, 3],
      [-0.00522, 0],
      [-0.01361, 2],
      [-0.00599, 0],
      [-0.00189, 3],
      [-0.0062, 0],
      [-0.01368, 2],
      [-0.00512, 0],
      [-0.00217, 3],
      [-0.00589, 0],
      [-0.00648, 0],
      [-0.00481, 0],
      [-0.00175, 3],
      [0.01291, 1],
      [-0.00181, 3],
      [-0.006, 0],
      [-0.00174, 3],
      [-0.01272, 2],
      [-0.0021, 3],
      [-0.00179, 3],
      [-0.00148, 3],
      [-0.00162, 3],
      [-0.00513, 0],
      [-0.00191, 3],
      [-0.00222, 3],
      [-0.00168, 3],
      [-0.00524, 0],
      [-0.0052, 0],
      [0.01513, 1],
      [-0.00159, 3],
      [-0.01331, 2],
      [-0.00145, 3]
    ],
    "red_o_points": [],
    "y_categories": ["N", "NOT APPLICABLE", "Y", "nan"],
    "blue_o_points": [],
    "blue_x_points": [
      [0.01914, 1],
      [-0.00052, 3],
      [0.01704, 1],
      [0.00076, 0],
      [-0.00105, 0],
      [0.01845, 1],
      [-0.00047, 3],
      [0.01813, 1],
      [-0.0006, 3],
      [-0.00036, 3]
    ]
  },
  "QS_mulLysisSite[Trunk]": {
    "red_x_points": [
      [-0.00099, 3],
      [-0.00328, 0],
      [-0.00348, 0],
      [-0.00343, 0],
      [-0.00104, 3],
      [-0.00356, 0],
      [-0.00905, 2],
      [-0.00356, 0],
      [-0.00131, 3],
      [-0.00361, 0],
      [-0.00414, 0],
      [-0.00307, 0],
      [-0.00154, 3],
      [0.00827, 1],
      [-0.00088, 3],
      [-0.00363, 0],
      [-0.00168, 3],
      [-0.00689, 2],
      [-0.00093, 3],
      [-0.00148, 3],
      [-0.00092, 3],
      [-0.00098, 3],
      [-0.00363, 0],
      [-0.00108, 3],
      [-0.00122, 3],
      [-0.00097, 3],
      [-0.00319, 0],
      [-0.00345, 0],
      [0.00803, 1],
      [-0.00096, 3],
      [-0.00698, 2],
      [-0.00098, 3]
    ],
    "red_o_points": [],
    "y_categories": ["N", "NOT APPLICABLE", "Y", "nan"],
    "blue_o_points": [],
    "blue_x_points": [
      [0.01321, 1],
      [8e-5, 3],
      [0.00996, 1],
      [-0.00017, 0],
      [-0.00026, 0],
      [0.00959, 1],
      [-0.00057, 3],
      [0.00945, 1],
      [-0.0004, 3],
      [-0.00018, 3]
    ]
  },
  "QS_mulGraftTrunk[UpperTrunk]": {
    "red_x_points": [
      [-0.00011, 3],
      [-0.00127, 0],
      [-0.00115, 0],
      [-0.00138, 0],
      [-0.00024, 3],
      [-0.00125, 0],
      [-0.001, 0],
      [-0.00135, 0],
      [-0.00025, 3],
      [-0.00138, 0],
      [-0.00155, 0],
      [-0.00111, 0],
      [-0.00035, 3],
      [0.00229, 1],
      [-0.0003, 3],
      [-0.00384, 2],
      [-0.00023, 3],
      [-0.00128, 0],
      [-0.00028, 3],
      [-0.00026, 3],
      [-0.00011, 3],
      [-0.00031, 3],
      [-0.00116, 0],
      [-0.00035, 3],
      [-0.0002, 3],
      [-0.00019, 3],
      [-0.00144, 0],
      [-0.00141, 0],
      [0.0022, 1],
      [-0.00012, 3],
      [-0.00118, 0],
      [-0.00034, 3]
    ],
    "red_o_points": [],
    "y_categories": ["N", "NOT APPLICABLE", "Y", "nan"],
    "blue_o_points": [],
    "blue_x_points": [
      [0.00435, 1],
      [-7e-5, 3],
      [0.00306, 1],
      [0.00044, 0],
      [-0.00059, 0],
      [0.00364, 1],
      [-0.00016, 3],
      [0.00297, 1],
      [-9e-5, 3],
      [-2e-5, 3]
    ]
  },
  "QS_mulTransfSite[PhMc]": {
    "red_x_points": [
      [-0.00059, 3],
      [-0.00266, 0],
      [-0.00244, 0],
      [-0.00278, 0],
      [-0.00093, 3],
      [-0.00277, 0],
      [-0.00237, 0],
      [-0.00676, 2],
      [-0.00081, 3],
      [-0.00316, 0],
      [-0.00298, 0],
      [-0.00244, 0],
      [-0.00073, 3],
      [0.0042, 1],
      [-0.00084, 3],
      [-0.00297, 0],
      [-0.00066, 3],
      [-0.0025, 0],
      [-0.00052, 3],
      [-0.00058, 3],
      [-0.00066, 3],
      [-0.00035, 3],
      [-0.00542, 2],
      [-0.00084, 3],
      [-0.00103, 3],
      [-0.00092, 3],
      [-0.00254, 0],
      [-0.00257, 0],
      [0.00618, 1],
      [-0.00068, 3],
      [-0.00241, 0],
      [-0.00082, 3]
    ],
    "red_o_points": [],
    "y_categories": ["N", "NOT APPLICABLE", "Y", "nan"],
    "blue_o_points": [],
    "blue_x_points": [
      [0.00809, 1],
      [0.00012, 3],
      [0.00743, 1],
      [-0.00025, 0],
      [-0.00103, 0],
      [0.00841, 1],
      [-0.00023, 3],
      [0.00728, 1],
      [-0.00021, 3],
      [-0.00019, 3]
    ]
  },
  "QA_mulInjTbpiCause[Motorcycle]": {
    "red_x_points": [
      [-0.00174, 0],
      [-0.00063, 1],
      [-0.00055, 1],
      [-0.00053, 1],
      [-0.00011, 1],
      [-0.00061, 1],
      [-0.00033, 1],
      [-0.00054, 1],
      [0.00077, 1],
      [-0.00048, 1],
      [-0.00029, 1],
      [-0.00021, 1],
      [-0.00552, 0],
      [-0.0304, 1],
      [-0.0003, 1],
      [-0.00061, 1],
      [-0.00013, 1],
      [-0.00063, 1],
      [-0.00101, 1],
      [-0.0088, 0],
      [0.00019, 1],
      [0.00165, 1],
      [-0.00035, 1],
      [-0.00027, 1],
      [-0.00051, 1],
      [-0.00529, 0],
      [-0.00041, 1],
      [-0.00035, 1],
      [-0.03213, 1],
      [-0.00014, 1],
      [-0.00026, 1],
      [-0.00024, 1]
    ],
    "red_o_points": [],
    "y_categories": ["N", "Y", "nan"],
    "blue_o_points": [],
    "blue_x_points": [
      [0.01498, 0],
      [-0.00036, 1],
      [0.01196, 0],
      [-0.00133, 1],
      [-0.00037, 1],
      [0.01374, 0],
      [0.00259, 1],
      [0.01247, 0],
      [0.00379, 1],
      [0.00261, 1]
    ]
  },
  "QS_mulLysisSite[Root]": {
    "red_x_points": [
      [-0.00077, 3],
      [-0.00156, 0],
      [-0.00582, 2],
      [-0.00134, 0],
      [-0.00058, 3],
      [-0.00184, 0],
      [-0.00139, 0],
      [-0.00146, 0],
      [-0.00081, 3],
      [-0.00163, 0],
      [-0.00158, 0],
      [-0.00122, 0],
      [-0.0008, 3],
      [0.00373, 1],
      [-0.0008, 3],
      [-0.00158, 0],
      [-0.00066, 3],
      [-0.00128, 0],
      [-0.00066, 3],
      [-0.00089, 3],
      [-0.00054, 3],
      [-0.00058, 3],
      [-0.00142, 0],
      [-0.00076, 3],
      [-0.00066, 3],
      [-0.00049, 3],
      [-0.00152, 0],
      [-0.00156, 0],
      [0.00353, 1],
      [-0.00047, 3],
      [-0.00533, 2],
      [-0.00063, 3]
    ],
    "red_o_points": [],
    "y_categories": ["N", "NOT APPLICABLE", "Y", "nan"],
    "blue_o_points": [],
    "blue_x_points": [
      [0.00591, 1],
      [-0.00022, 3],
      [0.00433, 1],
      [0.00023, 0],
      [0.00031, 0],
      [0.00419, 1],
      [-0.00023, 3],
      [0.00514, 1],
      [-0.00036, 3],
      [-0.0001, 3]
    ]
  },
  "QA_yonInjOrtsurg": {
    "red_x_points": [
      [-0.00123, 2],
      [0.0, 2],
      [0.00015, 2],
      [7e-5, 2],
      [-0.00132, 2],
      [0.00022, 2],
      [9e-5, 2],
      [0.00033, 1],
      [-0.00175, 2],
      [-0.00135, 0],
      [0.00017, 1],
      [0.00034, 1],
      [-0.00146, 2],
      [-0.00548, 0],
      [0.00459, 1],
      [0.0, 2],
      [-0.00157, 2],
      [-0.0023, 0],
      [-0.01167, 0],
      [-0.01057, 0],
      [0.00378, 1],
      [-0.00184, 2],
      [0.00029, 1],
      [-0.00272, 2],
      [-0.00108, 2],
      [-0.00217, 2],
      [-0.00149, 0],
      [-0.00115, 0],
      [0.00107, 1],
      [-0.00188, 2],
      [0.00021, 1],
      [-0.00115, 2]
    ],
    "red_o_points": [],
    "y_categories": ["N", "Y", "nan"],
    "blue_o_points": [],
    "blue_x_points": [
      [0.00025, 2],
      [0.01125, 1],
      [0.00053, 2],
      [0.00095, 2],
      [0.00032, 2],
      [0.00059, 2],
      [-0.0003, 2],
      [0.0006, 2],
      [0.01118, 1],
      [-0.00079, 2]
    ]
  },
  "QA_lstPexMuscstrength[ThumbOppo]": {
    "red_x_points": [
      [-0.00621, 1],
      [0.00085, 2],
      [-0.00473, 1],
      [-0.00364, 1],
      [-0.00731, 1],
      [0.00106, 0],
      [0.00116, 0],
      [-0.00643, 1],
      [0.00044, 0],
      [0.00109, 0],
      [0.00117, 0],
      [0.00095, 0],
      [0.0009, 0],
      [0.00081, 2],
      [0.00098, 2],
      [0.0008, 2],
      [0.00095, 0],
      [0.0009, 2],
      [0.00108, 2],
      [0.00091, 0],
      [-0.00735, 1],
      [0.00088, 0],
      [-0.00392, 1],
      [0.00105, 2],
      [0.00162, 2],
      [0.0011, 2],
      [0.00108, 0],
      [-0.00383, 1],
      [0.00107, 2],
      [-0.00699, 1],
      [-0.00532, 1],
      [0.00146, 2]
    ],
    "red_o_points": [],
    "y_categories": ["GREATER THAN OR EQUALS TO 3", "LESS THAN 3", "nan"],
    "blue_o_points": [],
    "blue_x_points": [
      [0.00053, 2],
      [0.00172, 2],
      [0.00125, 0],
      [0.00305, 2],
      [0.00284, 0],
      [0.00152, 0],
      [0.0046, 0],
      [0.00094, 0],
      [0.00272, 2],
      [0.00223, 2]
    ]
  },
  "QS_mulGraftLevel[Trunk]": {
    "red_x_points": [
      [-0.00034, 3],
      [-0.00118, 0],
      [-0.00103, 0],
      [-0.00111, 0],
      [-0.00033, 3],
      [-0.00127, 0],
      [-0.00122, 0],
      [-0.00089, 0],
      [-0.00029, 3],
      [-0.00117, 0],
      [-0.00114, 0],
      [-0.0014, 0],
      [-0.00029, 3],
      [0.00172, 1],
      [-0.00035, 3],
      [-0.00424, 2],
      [-0.0002, 3],
      [-0.00105, 0],
      [-0.00022, 3],
      [-0.00029, 3],
      [-0.0003, 3],
      [-0.00016, 3],
      [-0.00098, 0],
      [-0.00026, 3],
      [-0.00027, 3],
      [-0.00025, 3],
      [-0.00101, 0],
      [-0.00113, 0],
      [0.00238, 1],
      [-0.00025, 3],
      [-0.00104, 0],
      [-0.00024, 3]
    ],
    "red_o_points": [],
    "y_categories": ["N", "NOT APPLICABLE", "Y", "nan"],
    "blue_o_points": [],
    "blue_x_points": [
      [0.0035, 1],
      [-0.00012, 3],
      [0.00331, 1],
      [-0.0001, 0],
      [-0.00087, 0],
      [0.0034, 1],
      [-0.00013, 3],
      [0.00299, 1],
      [-5e-5, 3],
      [-0.00013, 3]
    ]
  },
  "QS_mulGraftNerve[FI]": {
    "red_x_points": [
      [-2e-5, 2],
      [-0.00055, 0],
      [-0.00047, 0],
      [-0.00068, 0],
      [-0.00015, 2],
      [-0.00062, 0],
      [-0.00049, 0],
      [-0.00064, 0],
      [-0.00013, 2],
      [-0.00041, 0],
      [-0.00047, 0],
      [-0.00062, 0],
      [-8e-5, 2],
      [0.00043, 1],
      [-7e-5, 2],
      [-0.00056, 0],
      [-0.00012, 2],
      [-0.00044, 0],
      [-7e-5, 2],
      [-0.00016, 2],
      [-4e-5, 2],
      [-5e-5, 2],
      [-0.00044, 0],
      [-0.00013, 2],
      [-0.00026, 2],
      [-0.00024, 2],
      [-0.00054, 0],
      [-0.0004, 0],
      [0.00055, 1],
      [-0.00011, 2],
      [-0.00045, 0],
      [-7e-5, 2]
    ],
    "red_o_points": [],
    "y_categories": ["N", "NOT APPLICABLE", "nan"],
    "blue_o_points": [],
    "blue_x_points": [
      [0.00176, 1],
      [4e-5, 2],
      [0.00091, 1],
      [0.00011, 0],
      [-0.00013, 0],
      [0.00107, 1],
      [-5e-5, 2],
      [0.001, 1],
      [-3e-5, 2],
      [0.00018, 2]
    ]
  },
  "QS_mulGraftNerve[other]": {
    "red_x_points": [
      [-6e-5, 2],
      [-0.00041, 0],
      [-0.00036, 0],
      [-0.00053, 0],
      [-9e-5, 2],
      [-0.00059, 0],
      [-0.00053, 0],
      [-0.00053, 0],
      [-0.00014, 2],
      [-0.00042, 0],
      [-0.00054, 0],
      [-0.00049, 0],
      [-3e-5, 2],
      [0.00066, 1],
      [-0.00011, 2],
      [-0.00049, 0],
      [-0.00017, 2],
      [-0.00021, 0],
      [-2e-5, 2],
      [-7e-5, 2],
      [-4e-5, 2],
      [-1e-5, 2],
      [-0.00044, 0],
      [-9e-5, 2],
      [-5e-5, 2],
      [-0.00015, 2],
      [-0.00037, 0],
      [-0.00046, 0],
      [0.00077, 1],
      [-0.0001, 2],
      [-0.00041, 0],
      [-0.00012, 2]
    ],
    "red_o_points": [],
    "y_categories": ["N", "NOT APPLICABLE", "nan"],
    "blue_o_points": [],
    "blue_x_points": [
      [0.00101, 1],
      [-4e-5, 2],
      [0.00086, 1],
      [-0.00014, 0],
      [0.00081, 1],
      [-2e-5, 2],
      [0.0014, 1],
      [2e-5, 2],
      [-3e-5, 2]
    ]
  },
  "QS_mulTransfSite[AcSsAA]": {
    "red_x_points": [
      [-0.00231, 3],
      [-0.01468, 2],
      [-0.004, 0],
      [-0.01534, 2],
      [-0.00227, 3],
      [-0.02003, 2],
      [-0.00348, 0],
      [-0.00352, 0],
      [-0.00262, 3],
      [-0.00433, 0],
      [-0.01586, 2],
      [-0.00356, 0],
      [-0.00234, 3],
      [0.01603, 1],
      [-0.00224, 3],
      [-0.01604, 2],
      [-0.00237, 3],
      [-0.00354, 0],
      [-0.0034, 3],
      [-0.00231, 3],
      [-0.00223, 3],
      [-0.00239, 3],
      [-0.01435, 2],
      [-0.0023, 3],
      [-0.00298, 3],
      [-0.0021, 3],
      [-0.00359, 0],
      [-0.01415, 2],
      [0.01882, 1],
      [-0.00206, 3],
      [-0.00345, 0],
      [-0.00212, 3]
    ],
    "red_o_points": [],
    "y_categories": ["N", "NOT APPLICABLE", "Y", "nan"],
    "blue_o_points": [],
    "blue_x_points": [
      [0.0239, 1],
      [-0.00043, 3],
      [0.01999, 1],
      [0.00201, 0],
      [0.00178, 0],
      [0.01947, 1],
      [-0.00048, 3],
      [0.02164, 1],
      [-0.00084, 3],
      [-0.00027, 3]
    ]
  },
  "QS_mulGraftNerve[Ra]": {
    "red_x_points": [
      [-4e-5, 0],
      [-4e-5, 0],
      [-4e-5, 0],
      [0.0, 2],
      [-4e-5, 0],
      [0.0, 2],
      [-4e-5, 0],
      [-4e-5, 0],
      [-4e-5, 0],
      [0.0001, 1],
      [0.0, 2],
      [-4e-5, 0],
      [0.0, 2],
      [-4e-5, 0],
      [0.0, 2],
      [0.0, 2],
      [0.0, 2],
      [0.0, 2],
      [0.0, 2],
      [-4e-5, 0],
      [-4e-5, 0],
      [0.0, 2],
      [-4e-5, 0],
      [0.0, 2]
    ],
    "red_o_points": [],
    "y_categories": ["N", "NOT APPLICABLE", "nan"],
    "blue_o_points": [],
    "blue_x_points": [
      [-4e-5, 0],
      [0.0001, 1],
      [0.0, 2],
      [0.0001, 1],
      [0.0, 2],
      [0.0, 2]
    ]
  },
  "QS_mulGraftNerve[Ax]": {
    "red_x_points": [
      [1e-5, 2],
      [-4e-5, 0],
      [-7e-5, 0],
      [-9e-5, 0],
      [-4e-5, 0],
      [-7e-5, 0],
      [-2e-5, 2],
      [-4e-5, 0],
      [-4e-5, 0],
      [-4e-5, 0],
      [1e-5, 2],
      [-3e-5, 0],
      [1e-5, 2],
      [-4e-5, 0],
      [-0.0, 2],
      [1e-5, 2],
      [1e-5, 2],
      [-4e-5, 0],
      [1e-5, 2],
      [-2e-5, 2],
      [-4e-5, 0],
      [-4e-5, 0],
      [0.0001, 1],
      [1e-5, 2],
      [-4e-5, 0],
      [-3e-5, 2]
    ],
    "red_o_points": [],
    "y_categories": ["N", "NOT APPLICABLE", "nan"],
    "blue_o_points": [],
    "blue_x_points": [
      [0.00027, 1],
      [1e-5, 2],
      [0.00016, 1],
      [-9e-5, 0],
      [1e-5, 2],
      [0.0001, 1],
      [-1e-5, 2],
      [1e-5, 2]
    ]
  },
  "QS_mulNeuromadSite[C5]": {
    "red_x_points": [
      [-3e-5, 2],
      [-0.00051, 0],
      [-0.00038, 0],
      [-0.00023, 0],
      [-2e-5, 2],
      [-0.00072, 0],
      [-0.00042, 0],
      [-0.00048, 0],
      [-4e-5, 2],
      [-0.00056, 0],
      [-0.00066, 0],
      [-0.00038, 0],
      [-5e-5, 2],
      [0.00029, 1],
      [-5e-5, 2],
      [-0.00017, 0],
      [-0.00017, 2],
      [-0.00017, 0],
      [-2e-5, 2],
      [-0.0001, 2],
      [0.0, 2],
      [-0.0001, 2],
      [-0.00035, 0],
      [-3e-5, 2],
      [-0.00015, 2],
      [2e-5, 2],
      [-0.00048, 0],
      [-0.00039, 0],
      [0.00029, 1],
      [-0.0, 2],
      [-0.00033, 0],
      [-7e-5, 2]
    ],
    "red_o_points": [],
    "y_categories": ["N", "NOT APPLICABLE", "nan"],
    "blue_o_points": [],
    "blue_x_points": [
      [0.00105, 1],
      [0.0, 2],
      [0.00054, 1],
      [0.00031, 0],
      [-0.00031, 0],
      [0.00069, 1],
      [-4e-5, 2],
      [0.00146, 1],
      [9e-5, 2],
      [0.00012, 2]
    ]
  },
  "QS_mulNeuromadSite[C7]": {
    "red_x_points": [
      [-0.0003, 2],
      [-0.0009, 0],
      [-0.00074, 0],
      [-0.00063, 0],
      [-0.00016, 2],
      [-0.00113, 0],
      [-0.00082, 0],
      [-0.00081, 0],
      [-0.00035, 2],
      [-0.00098, 0],
      [-0.00111, 0],
      [-0.00087, 0],
      [-0.00038, 2],
      [0.00084, 1],
      [-0.0002, 2],
      [-0.0009, 0],
      [-0.00029, 2],
      [-0.00079, 0],
      [-0.00022, 2],
      [-0.00032, 2],
      [-0.00023, 2],
      [-0.00037, 2],
      [-0.00051, 0],
      [-0.00021, 2],
      [-0.00024, 2],
      [-0.00013, 2],
      [-0.00093, 0],
      [-0.00088, 0],
      [0.00115, 1],
      [-0.00026, 2],
      [-0.0008, 0],
      [-0.00021, 2]
    ],
    "red_o_points": [],
    "y_categories": ["N", "NOT APPLICABLE", "nan"],
    "blue_o_points": [],
    "blue_x_points": [
      [0.00266, 1],
      [0.00019, 2],
      [0.0021, 1],
      [0.00033, 0],
      [-0.00044, 0],
      [0.00211, 1],
      [2e-5, 2],
      [0.00189, 1],
      [-3e-5, 2],
      [1e-5, 2]
    ]
  },
  "QS_mulLysisRoot[C5]": {
    "red_x_points": [
      [-0.00091, 3],
      [-0.00326, 0],
      [-0.00752, 2],
      [-0.00302, 0],
      [-0.00078, 3],
      [-0.00324, 0],
      [-0.00272, 0],
      [-0.00287, 0],
      [-0.00162, 3],
      [-0.00316, 0],
      [-0.00312, 0],
      [-0.0021, 0],
      [-0.00098, 3],
      [0.00627, 1],
      [-0.00109, 3],
      [-0.00306, 0],
      [-0.00103, 3],
      [-0.00238, 0],
      [-0.00103, 3],
      [-0.00156, 3],
      [-0.00075, 3],
      [-0.00089, 3],
      [-0.00285, 0],
      [-0.00128, 3],
      [-0.00137, 3],
      [-0.00103, 3],
      [-0.00267, 0],
      [-0.00237, 0],
      [0.00579, 1],
      [-0.00085, 3],
      [-0.00692, 2],
      [-0.0011, 3]
    ],
    "red_o_points": [],
    "y_categories": ["N", "NOT APPLICABLE", "Y", "nan"],
    "blue_o_points": [],
    "blue_x_points": [
      [0.0101, 1],
      [-0.00012, 3],
      [0.00796, 1],
      [0.00042, 0],
      [-0.00035, 0],
      [0.00753, 1],
      [-0.0006, 3],
      [0.00972, 1],
      [-0.00068, 3],
      [0.0001, 3]
    ]
  },
  "QS_mulGraftNerve[TD]": {
    "red_x_points": [
      [-7e-5, 2],
      [-0.00015, 0],
      [-0.0002, 0],
      [-0.00014, 0],
      [-2e-5, 2],
      [-0.00037, 0],
      [-0.0002, 0],
      [-0.00017, 0],
      [-5e-5, 2],
      [-0.00017, 0],
      [-0.00036, 0],
      [-0.00015, 0],
      [2e-5, 2],
      [7e-5, 1],
      [-3e-5, 2],
      [-0.0002, 0],
      [-5e-5, 2],
      [-0.00015, 0],
      [-2e-5, 2],
      [-1e-5, 2],
      [0.0, 2],
      [-1e-5, 2],
      [-0.00015, 0],
      [-2e-5, 2],
      [-4e-5, 2],
      [-5e-5, 2],
      [-0.0002, 0],
      [-5e-5, 0],
      [0.00037, 1],
      [-5e-5, 2],
      [-0.00015, 0],
      [-7e-5, 2]
    ],
    "red_o_points": [],
    "y_categories": ["N", "NOT APPLICABLE", "nan"],
    "blue_o_points": [],
    "blue_x_points": [
      [0.00049, 1],
      [0.0, 2],
      [0.0005, 1],
      [0.00016, 0],
      [-0.00013, 0],
      [0.00045, 1],
      [-1e-5, 2],
      [0.00061, 1],
      [-1e-5, 2],
      [-1e-5, 2]
    ]
  },
  "QS_mulGraftNerve[IS]": {
    "red_x_points": [
      [-5e-5, 0],
      [-5e-5, 0],
      [-0.0001, 2],
      [-5e-5, 0],
      [-0.0001, 2],
      [-0.0001, 2],
      [-7e-5, 1],
      [-7e-5, 2]
    ],
    "red_o_points": [],
    "y_categories": ["N", "NOT APPLICABLE", "nan"],
    "blue_o_points": [],
    "blue_x_points": [[0.0001, 1], [0.00013, 0], [-5e-5, 0], [0.0001, 1]]
  },
  "QS_mulLysisSite[Nerve]": {
    "red_x_points": [
      [-0.00015, 3],
      [-0.00022, 0],
      [-0.00224, 2],
      [-0.00042, 0],
      [-0.0001, 3],
      [-0.00035, 0],
      [-0.00025, 0],
      [-0.00046, 0],
      [-0.00014, 3],
      [-0.00046, 0],
      [-0.00039, 0],
      [-0.00016, 0],
      [-0.00012, 3],
      [0.00052, 1],
      [-0.0001, 3],
      [-0.00045, 0],
      [-0.00011, 3],
      [-0.00039, 0],
      [-6e-5, 3],
      [-9e-5, 3],
      [-6e-5, 3],
      [-0.00014, 3],
      [-0.00035, 0],
      [-0.00019, 3],
      [-5e-5, 3],
      [-6e-5, 3],
      [-0.00042, 0],
      [-0.00039, 0],
      [0.00121, 1],
      [-0.00014, 3],
      [-0.00028, 0],
      [-0.00015, 3]
    ],
    "red_o_points": [],
    "y_categories": ["N", "NOT APPLICABLE", "Y", "nan"],
    "blue_o_points": [],
    "blue_x_points": [
      [0.00144, 1],
      [-3e-5, 3],
      [0.00101, 1],
      [0.00013, 0],
      [-7e-5, 0],
      [0.00119, 1],
      [-9e-5, 3],
      [0.00155, 1],
      [-7e-5, 3],
      [-6e-5, 3]
    ]
  },
  "QS_mulTransfSite[IMc]": {
    "red_x_points": [
      [-0.00127, 3],
      [-0.00988, 2],
      [-0.00414, 0],
      [-0.00481, 0],
      [-0.00131, 3],
      [-0.00506, 0],
      [-0.00422, 0],
      [-0.00443, 0],
      [-0.0012, 3],
      [-0.0041, 0],
      [-0.00449, 0],
      [-0.00408, 0],
      [-0.0012, 3],
      [0.01035, 1],
      [-0.00101, 3],
      [-0.00457, 0],
      [-0.00121, 3],
      [-0.01033, 2],
      [-0.00132, 3],
      [-0.00142, 3],
      [-0.00098, 3],
      [-0.00112, 3],
      [-0.00381, 0],
      [-0.00109, 3],
      [-0.00131, 3],
      [-0.00135, 3],
      [-0.00425, 0],
      [-0.00891, 2],
      [0.0117, 1],
      [-0.00107, 3],
      [-0.01007, 2],
      [-0.00125, 3]
    ],
    "red_o_points": [],
    "y_categories": ["N", "NOT APPLICABLE", "Y", "nan"],
    "blue_o_points": [],
    "blue_x_points": [
      [0.01493, 1],
      [-9e-5, 3],
      [0.01322, 1],
      [-0.00036, 0],
      [-0.00162, 0],
      [0.01434, 1],
      [-0.00043, 3],
      [0.01272, 1],
      [-0.00054, 3],
      [-0.0004, 3]
    ]
  },
  "QS_mulLysisRoot[C7]": {
    "red_x_points": [
      [-0.00024, 3],
      [-0.0013, 0],
      [-0.00329, 2],
      [-0.00132, 0],
      [-0.00023, 3],
      [-0.00145, 0],
      [-0.00131, 0],
      [-0.00112, 0],
      [-0.00022, 3],
      [-0.00111, 0],
      [-0.00132, 0],
      [-0.00109, 0],
      [-0.00025, 3],
      [0.00246, 1],
      [-0.00017, 3],
      [-0.00127, 0],
      [-0.00026, 3],
      [-0.00126, 0],
      [-0.00017, 3],
      [-0.00029, 3],
      [-7e-5, 3],
      [-0.0002, 3],
      [-0.00109, 0],
      [-0.00019, 3],
      [-0.0002, 3],
      [-0.00031, 3],
      [-0.00135, 0],
      [-0.00106, 0],
      [0.00273, 1],
      [-0.0001, 3],
      [-0.001, 0],
      [-0.00013, 3]
    ],
    "red_o_points": [],
    "y_categories": ["N", "NOT APPLICABLE", "Y", "nan"],
    "blue_o_points": [],
    "blue_x_points": [
      [0.00347, 1],
      [-5e-5, 3],
      [0.00342, 1],
      [-0.00065, 0],
      [-0.00058, 0],
      [0.003, 1],
      [0.0, 3],
      [0.00269, 1],
      [-7e-5, 3],
      [-4e-5, 3]
    ]
  },
  "QS_lstBpsurgSide": {
    "red_x_points": [
      [-0.00165, 3],
      [-0.00729, 0],
      [-0.00736, 0],
      [-0.00725, 0],
      [-0.00158, 3],
      [-0.00684, 2],
      [-0.00886, 0],
      [-0.00784, 0],
      [-0.00231, 3],
      [-0.00823, 0],
      [-0.00711, 2],
      [-0.0068, 2],
      [-0.00217, 3],
      [0.01317, 1],
      [-0.00171, 3],
      [-0.00789, 2],
      [-0.00219, 3],
      [-0.00858, 2],
      [-0.00199, 3],
      [-0.00206, 3],
      [-0.00155, 3],
      [-0.00193, 3],
      [-0.00699, 0],
      [-0.00186, 3],
      [-0.00214, 3],
      [-0.00164, 3],
      [-0.00648, 2],
      [-0.00577, 2],
      [0.01304, 1],
      [-0.00142, 3],
      [-0.00734, 0],
      [-0.00189, 3]
    ],
    "red_o_points": [],
    "y_categories": ["L", "NOT APPLICABLE", "R", "nan"],
    "blue_o_points": [],
    "blue_x_points": [
      [0.01755, 1],
      [-0.00027, 3],
      [0.01618, 1],
      [0.00381, 0],
      [5e-5, 2],
      [0.01681, 1],
      [-0.00095, 3],
      [0.01752, 1],
      [-0.00077, 3],
      [-0.00088, 3]
    ]
  },
  "QA_lstPexPain[T1]": {
    "red_x_points": [
      [-0.00939, 1],
      [-0.0021, 2],
      [-0.00323, 2],
      [-0.00192, 2],
      [-0.01072, 1],
      [-0.00732, 0],
      [0.00083, 1],
      [0.00091, 1],
      [0.0074, 0],
      [0.00319, 1],
      [-0.00411, 0],
      [-0.00712, 0],
      [0.00562, 0],
      [-0.01531, 2],
      [-0.00449, 2],
      [-0.0035, 2],
      [-0.00472, 2],
      [-0.0028, 2],
      [-0.00488, 2],
      [0.00548, 0],
      [-0.0115, 1],
      [0.00682, 0],
      [-0.00304, 2],
      [-0.0051, 2],
      [-0.01099, 1],
      [-0.00481, 2],
      [-0.0045, 2],
      [-0.00278, 2],
      [-0.00679, 1],
      [-0.01175, 1],
      [7e-5, 1],
      [-0.01042, 1]
    ],
    "red_o_points": [],
    "y_categories": ["NORM", "NPV", "nan"],
    "blue_o_points": [],
    "blue_x_points": [
      [-4e-5, 1],
      [-0.00031, 2],
      [0.00669, 0],
      [0.00819, 1],
      [0.01421, 1],
      [0.00028, 1],
      [0.01205, 0],
      [0.00676, 0],
      [0.01339, 0],
      [0.01692, 0]
    ]
  },
  "QS_mulTransfSite[AcMc]": {
    "red_x_points": [
      [-0.00038, 3],
      [-0.00083, 0],
      [-0.00059, 0],
      [-0.00066, 0],
      [-0.00033, 3],
      [-0.00088, 0],
      [-0.00099, 0],
      [-0.00069, 0],
      [-0.00057, 3],
      [-0.00114, 0],
      [-0.00088, 0],
      [-0.00695, 2],
      [-0.00049, 3],
      [0.00233, 1],
      [-0.00042, 3],
      [-0.00095, 0],
      [-0.00044, 3],
      [-0.00092, 0],
      [-0.00037, 3],
      [-0.00065, 3],
      [-0.00025, 3],
      [-0.0005, 3],
      [-0.00074, 0],
      [-0.00031, 3],
      [-0.00046, 3],
      [-0.00027, 3],
      [-0.00095, 0],
      [-0.00082, 0],
      [0.00158, 1],
      [-0.00031, 3],
      [-0.00086, 0],
      [-0.00019, 3]
    ],
    "red_o_points": [],
    "y_categories": ["N", "NOT APPLICABLE", "Y", "nan"],
    "blue_o_points": [],
    "blue_x_points": [
      [0.00264, 1],
      [-0.00016, 3],
      [0.00277, 1],
      [0.00059, 0],
      [0.00078, 0],
      [0.00247, 1],
      [-0.00027, 3],
      [0.00365, 1],
      [-0.00022, 3],
      [-0.00027, 3]
    ]
  },
  "QA_lstPexKine[Shoulder]": {
    "red_x_points": [
      [-0.00111, 1],
      [-0.00215, 2],
      [-0.00233, 2],
      [-0.00248, 2],
      [-0.00486, 2],
      [-0.00384, 1],
      [-0.00219, 1],
      [0.00352, 0],
      [-0.00703, 2],
      [-0.00241, 1],
      [-0.00252, 1],
      [-0.00309, 1],
      [-0.00197, 1],
      [-0.00095, 2],
      [-0.00322, 2],
      [-0.00118, 1],
      [-0.00373, 2],
      [-0.00143, 2],
      [-0.00341, 2],
      [-0.0022, 1],
      [-0.00102, 1],
      [-0.00218, 1],
      [-0.00207, 2],
      [-0.00337, 2],
      [-0.00218, 1],
      [-0.00405, 2],
      [-0.00442, 2],
      [-0.00274, 2],
      [-0.00104, 2],
      [-0.00376, 2],
      [-0.00142, 1],
      [-0.0039, 2]
    ],
    "red_o_points": [],
    "y_categories": ["NPV", "PV", "nan"],
    "blue_o_points": [],
    "blue_x_points": [
      [-8e-5, 1],
      [-0.00173, 2],
      [-0.00035, 1],
      [0.00154, 1],
      [0.02029, 0],
      [-0.00025, 1],
      [0.03331, 0],
      [-4e-5, 2],
      [4e-5, 1],
      [5e-5, 1]
    ]
  },
  "QA_yonInjBpsurg": {
    "red_x_points": [
      [-0.0019, 1],
      [-0.00105, 1],
      [-0.00111, 1],
      [-0.00142, 1],
      [-0.00157, 1],
      [-0.0019, 1],
      [-0.0015, 1],
      [-0.00146, 1],
      [-0.00148, 1],
      [-0.00177, 1],
      [-0.00146, 1],
      [-0.0015, 1],
      [-0.00195, 1],
      [0.00241, 0],
      [-0.00155, 1],
      [-0.00129, 1],
      [-0.00178, 1],
      [-0.00111, 1],
      [-0.00136, 1],
      [-0.00195, 1],
      [-0.00156, 1],
      [-0.00169, 1],
      [-0.00087, 1],
      [-0.0015, 1],
      [-0.00229, 1],
      [-0.00163, 1],
      [-0.00146, 1],
      [-0.0012, 1],
      [0.00462, 0],
      [-0.00134, 1],
      [-0.00113, 1],
      [-0.0015, 1]
    ],
    "red_o_points": [],
    "y_categories": ["N", "Y", "nan"],
    "blue_o_points": [],
    "blue_x_points": [
      [0.00725, 0],
      [-0.00042, 1],
      [0.00683, 0],
      [-0.00132, 1],
      [-0.00157, 1],
      [0.00689, 0],
      [-0.00087, 1],
      [0.00709, 0],
      [-0.00093, 1],
      [-0.00053, 1]
    ]
  },
  "QA_lstPexTouch[C8]": {
    "red_x_points": [
      [-0.00734, 1],
      [-0.00218, 2],
      [-0.00223, 1],
      [-0.00197, 2],
      [-0.00641, 1],
      [0.00202, 0],
      [-0.00236, 1],
      [-0.00271, 1],
      [0.00471, 0],
      [-0.00243, 1],
      [0.00246, 0],
      [0.00146, 0],
      [-0.00804, 1],
      [-0.01173, 2],
      [-0.00437, 2],
      [-0.00226, 2],
      [-0.00697, 1],
      [-0.00168, 2],
      [-0.00405, 2],
      [0.00547, 0],
      [-0.00831, 1],
      [0.00493, 0],
      [-0.00178, 2],
      [-0.00414, 2],
      [0.0035, 0],
      [0.00539, 0],
      [-0.00258, 1],
      [-0.0017, 2],
      [-0.008, 1],
      [-0.004, 2],
      [-0.00274, 1],
      [-0.00721, 1]
    ],
    "red_o_points": [],
    "y_categories": ["NORM", "NPV", "nan"],
    "blue_o_points": [],
    "blue_x_points": [
      [0.00861, 0],
      [-0.00021, 2],
      [0.00032, 1],
      [0.00169, 1],
      [0.00575, 0],
      [-0.00022, 1],
      [0.00838, 0],
      [0.00551, 0],
      [0.00776, 0],
      [0.00921, 0]
    ]
  },
  "QA_lstPexMuscstrength[FingersAbdu]": {
    "red_x_points": [
      [8e-5, 2],
      [0.00013, 2],
      [-0.00277, 1],
      [-0.00225, 1],
      [2e-5, 1],
      [0.00116, 0],
      [0.00095, 0],
      [-0.00359, 1],
      [-0.00555, 0],
      [0.00191, 0],
      [-0.00011, 2],
      [-0.00494, 1],
      [-0.0051, 0],
      [-2e-5, 2],
      [0.00026, 2],
      [-0.00023, 2],
      [-0.003, 0],
      [-0.0001, 2],
      [0.00012, 2],
      [-0.00744, 0],
      [-0.00157, 1],
      [-0.00783, 0],
      [-0.00227, 1],
      [0.0001, 2],
      [8e-5, 2],
      [0.00082, 2],
      [-0.00337, 1],
      [-0.00234, 1],
      [5e-5, 2],
      [-0.00123, 1],
      [-0.00299, 1],
      [7e-5, 2]
    ],
    "red_o_points": [],
    "y_categories": ["GREATER THAN OR EQUALS TO 3", "LESS THAN 3", "nan"],
    "blue_o_points": [],
    "blue_x_points": [
      [9e-5, 2],
      [0.00037, 2],
      [0.00096, 0],
      [0.00244, 2],
      [0.00594, 0],
      [0.00155, 0],
      [0.01333, 1],
      [0.001, 0],
      [0.0029, 2],
      [0.00284, 2]
    ]
  },
  "QS_mulBpsurgeryType[Graft]": {
    "red_x_points": [
      [-0.00023, 3],
      [-0.00068, 0],
      [-0.00054, 0],
      [-0.00086, 0],
      [-0.00037, 3],
      [-0.00085, 0],
      [-0.00074, 0],
      [-0.00083, 0],
      [-0.0004, 3],
      [-0.00078, 0],
      [-0.00088, 0],
      [-0.00078, 0],
      [-0.00031, 3],
      [0.00164, 1],
      [-0.00027, 3],
      [-0.00258, 2],
      [-0.0003, 3],
      [-0.00066, 0],
      [-0.00025, 3],
      [-0.00039, 3],
      [-0.00035, 3],
      [-0.00036, 3],
      [-0.00066, 0],
      [-0.00025, 3],
      [-0.00025, 3],
      [-0.00033, 3],
      [-0.00073, 0],
      [-0.0007, 0],
      [0.00157, 1],
      [-0.00031, 3],
      [-0.00064, 0],
      [-0.00024, 3]
    ],
    "red_o_points": [],
    "y_categories": ["N", "NOT APPLICABLE", "Y", "nan"],
    "blue_o_points": [],
    "blue_x_points": [
      [0.00314, 1],
      [-0.0001, 3],
      [0.00238, 1],
      [-0.00051, 0],
      [-0.00062, 0],
      [0.00181, 1],
      [-4e-5, 3],
      [0.00233, 1],
      [-1e-5, 3],
      [-0.00015, 3]
    ]
  },
  "QA_lstPexMuscstrength[WristExte]": {
    "red_x_points": [
      [0.00072, 1],
      [-0.00147, 2],
      [-0.00318, 1],
      [-0.0016, 1],
      [0.00088, 1],
      [0.00035, 0],
      [-0.00308, 1],
      [-0.00431, 1],
      [-0.01121, 0],
      [0.00149, 0],
      [-0.00017, 0],
      [-0.00542, 1],
      [-0.00643, 0],
      [-0.00086, 2],
      [0.00017, 2],
      [-0.00121, 2],
      [-0.00532, 0],
      [-0.00208, 2],
      [0.00055, 2],
      [-0.01079, 0],
      [0.00117, 1],
      [-0.01195, 0],
      [-0.00108, 1],
      [-3e-5, 2],
      [-0.00776, 0],
      [0.00187, 1],
      [0.00162, 0],
      [0.0009, 0],
      [-0.00106, 2],
      [0.0009, 1],
      [-0.00342, 1],
      [-0.00037, 2]
    ],
    "red_o_points": [],
    "y_categories": ["GREATER THAN OR EQUALS TO 3", "LESS THAN 3", "nan"],
    "blue_o_points": [],
    "blue_x_points": [
      [0.00057, 0],
      [0.00155, 2],
      [0.00046, 0],
      [0.00764, 0],
      [0.00594, 0],
      [0.00077, 1],
      [0.01101, 1],
      [0.00036, 0],
      [0.00914, 1],
      [0.00839, 2]
    ]
  },
  "QS_mulNeuromadSite[C6]": {
    "red_x_points": [
      [-0.00019, 2],
      [-0.00033, 0],
      [-0.00063, 0],
      [-0.00079, 0],
      [-7e-5, 2],
      [-0.00071, 0],
      [-0.00059, 0],
      [-0.00059, 0],
      [1e-5, 2],
      [-0.00076, 0],
      [-0.00094, 0],
      [-0.00063, 0],
      [-0.00011, 2],
      [0.00057, 1],
      [-5e-5, 2],
      [-0.00064, 0],
      [-5e-5, 2],
      [-0.00025, 0],
      [-5e-5, 2],
      [-2e-5, 2],
      [-4e-5, 2],
      [-3e-5, 2],
      [-0.00048, 0],
      [-6e-5, 2],
      [3e-5, 2],
      [-6e-5, 2],
      [-0.00042, 0],
      [-0.00045, 0],
      [0.00077, 1],
      [-0.00012, 2],
      [-0.00055, 0],
      [-7e-5, 2]
    ],
    "red_o_points": [],
    "y_categories": ["N", "NOT APPLICABLE", "nan"],
    "blue_o_points": [],
    "blue_x_points": [
      [0.00173, 1],
      [-6e-5, 2],
      [0.00114, 1],
      [0.0002, 0],
      [-0.00041, 0],
      [0.00104, 1],
      [-2e-5, 2],
      [0.0015, 1],
      [5e-5, 2],
      [-2e-5, 2]
    ]
  },
  "QS_mulNeuromadSite[T1]": {
    "red_x_points": [
      [-0.00011, 2],
      [-0.00096, 0],
      [-0.00102, 0],
      [-0.00128, 0],
      [-0.00026, 2],
      [-0.00121, 0],
      [-0.00099, 0],
      [-0.00139, 0],
      [-0.00048, 2],
      [-0.00126, 0],
      [-0.0012, 0],
      [-0.0008, 0],
      [-0.00028, 2],
      [0.00136, 1],
      [-0.0004, 2],
      [-0.0012, 0],
      [-0.00025, 2],
      [-0.00106, 0],
      [-0.00045, 2],
      [-0.00031, 2],
      [-0.00013, 2],
      [-0.00046, 2],
      [-0.00107, 0],
      [-0.00028, 2],
      [-0.00058, 2],
      [-0.00034, 2],
      [-0.00117, 0],
      [-0.00109, 0],
      [0.00159, 1],
      [-0.00019, 2],
      [-0.00087, 0],
      [-0.00045, 2]
    ],
    "red_o_points": [],
    "y_categories": ["N", "NOT APPLICABLE", "nan"],
    "blue_o_points": [],
    "blue_x_points": [
      [0.00354, 1],
      [4e-5, 2],
      [0.00216, 1],
      [0.00044, 0],
      [-0.00062, 0],
      [0.00219, 1],
      [-0.00012, 2],
      [0.00271, 1],
      [-2e-5, 2],
      [7e-5, 2]
    ]
  },
  "QA_lstPexTouch[C7]": {
    "red_x_points": [
      [-0.00936, 1],
      [-0.00205, 2],
      [-0.00261, 1],
      [-0.00219, 2],
      [-0.00803, 1],
      [0.00209, 0],
      [-0.00274, 1],
      [-0.00384, 1],
      [0.00612, 0],
      [-0.00286, 1],
      [0.00319, 0],
      [-0.00314, 1],
      [-0.00974, 1],
      [-0.00783, 2],
      [-0.00428, 2],
      [-0.00219, 2],
      [-0.00854, 1],
      [-0.00223, 2],
      [-0.00513, 2],
      [0.00706, 0],
      [-0.00973, 1],
      [0.00579, 0],
      [-0.0022, 2],
      [-0.00439, 2],
      [0.00398, 0],
      [0.00666, 0],
      [-0.00241, 1],
      [-0.00203, 2],
      [-0.00199, 1],
      [-0.00472, 2],
      [-0.00289, 1],
      [-0.00905, 1]
    ],
    "red_o_points": [],
    "y_categories": ["NORM", "NPV", "nan"],
    "blue_o_points": [],
    "blue_x_points": [
      [0.0001, 1],
      [5e-5, 2],
      [0.00105, 1],
      [0.00188, 1],
      [0.00921, 0],
      [0.00049, 1],
      [0.00925, 0],
      [0.00427, 0],
      [0.01015, 0],
      [0.01196, 0]
    ]
  },
  "QA_lstPexMuscstrength[ShoulderAbduc]": {
    "red_x_points": [
      [-0.00382, 1],
      [-0.00334, 1],
      [-0.00327, 1],
      [-0.00348, 1],
      [-0.0038, 1],
      [-0.00371, 1],
      [-0.00324, 1],
      [-0.00329, 1],
      [-0.00362, 1],
      [-0.00311, 1],
      [-0.00336, 1],
      [-0.00349, 1],
      [-0.00361, 1],
      [0.00094, 2],
      [0.001, 2],
      [0.00154, 2],
      [0.00139, 2],
      [0.00123, 2],
      [0.0011, 2],
      [-0.00346, 1],
      [-0.00386, 1],
      [-0.00338, 1],
      [-0.00304, 1],
      [0.0015, 2],
      [-0.00458, 1],
      [-0.00354, 1],
      [-0.00317, 1],
      [-0.00311, 1],
      [0.00097, 2],
      [-0.00339, 1],
      [-0.00361, 1],
      [0.00126, 2]
    ],
    "red_o_points": [],
    "y_categories": ["GREATER THAN OR EQUALS TO 3", "LESS THAN 3", "nan"],
    "blue_o_points": [],
    "blue_x_points": [
      [0.00133, 2],
      [0.00167, 2],
      [0.01962, 0],
      [0.00191, 2],
      [-0.00265, 1],
      [0.01853, 0],
      [0.00184, 2],
      [-0.00191, 1],
      [-0.00196, 1],
      [-0.0023, 1]
    ]
  },
  "QS_mulGraftNerve[LT]": {
    "red_x_points": [
      [-1e-5, 2],
      [-3e-5, 0],
      [-3e-5, 0],
      [-3e-5, 0],
      [-1e-5, 2],
      [-3e-5, 0],
      [-3e-5, 0],
      [-3e-5, 0],
      [-3e-5, 0],
      [-3e-5, 0],
      [-1e-5, 2],
      [-1e-5, 2],
      [-1e-5, 2],
      [-1e-5, 2],
      [-1e-5, 2],
      [-1e-5, 2],
      [-1e-5, 2],
      [-3e-5, 0],
      [-3e-5, 0],
      [-3e-5, 0]
    ],
    "red_o_points": [],
    "y_categories": ["N", "NOT APPLICABLE", "nan"],
    "blue_o_points": [],
    "blue_x_points": [[0.00017, 1], [-1e-5, 2]]
  },
  "QA_lstPexTouch[T1]": {
    "red_x_points": [
      [-0.00838, 1],
      [-0.00266, 2],
      [0.00102, 1],
      [-0.0023, 2],
      [-0.0088, 1],
      [-0.0081, 0],
      [0.0021, 1],
      [0.00178, 1],
      [-0.01169, 1],
      [-0.00545, 0],
      [-0.00377, 0],
      [-0.00664, 0],
      [0.00633, 0],
      [-0.00932, 2],
      [-0.00356, 2],
      [-0.00381, 2],
      [-0.00989, 1],
      [-0.00173, 2],
      [-0.004, 2],
      [0.00489, 0],
      [-0.01118, 1],
      [0.00562, 0],
      [-0.00293, 2],
      [-0.00375, 2],
      [-0.0094, 1],
      [0.00833, 0],
      [0.00313, 1],
      [-0.00271, 2],
      [-0.00261, 1],
      [-0.00506, 2],
      [-9e-5, 1],
      [-0.01096, 1]
    ],
    "red_o_points": [],
    "y_categories": ["NORM", "NPV", "nan"],
    "blue_o_points": [],
    "blue_x_points": [
      [0.00092, 1],
      [0.00131, 2],
      [0.00141, 1],
      [0.0068, 1],
      [0.01191, 1],
      [0.0013, 1],
      [0.01201, 0],
      [0.00473, 0],
      [0.01051, 0],
      [0.0155, 0]
    ]
  },
  "QS_mulGraftNerve[MC]": {
    "red_x_points": [
      [1e-5, 2],
      [-5e-5, 0],
      [-0.00012, 0],
      [-3e-5, 0],
      [-3e-5, 2],
      [-3e-5, 0],
      [-2e-5, 0],
      [-0.00012, 0],
      [-6e-5, 2],
      [-4e-5, 0],
      [-5e-5, 0],
      [-6e-5, 0],
      [0.0, 2],
      [2e-5, 1],
      [1e-5, 2],
      [-7e-5, 0],
      [-4e-5, 2],
      [-0.00013, 2],
      [0.0, 2],
      [1e-5, 2],
      [-5e-5, 2],
      [-3e-5, 2],
      [-5e-5, 0],
      [-5e-5, 0],
      [0.0001, 1],
      [-5e-5, 2],
      [-2e-5, 0],
      [-4e-5, 2]
    ],
    "red_o_points": [],
    "y_categories": ["N", "NOT APPLICABLE", "nan"],
    "blue_o_points": [],
    "blue_x_points": [
      [0.00045, 1],
      [0.00014, 1],
      [7e-5, 0],
      [-1e-5, 0],
      [-1e-5, 2],
      [0.00011, 1],
      [1e-5, 2],
      [-5e-5, 2]
    ]
  },
  "QS_mulNeuromadSite[C4]": {
    "red_x_points": [
      [-0.00012, 2],
      [-0.00145, 0],
      [-0.00135, 0],
      [-0.00122, 0],
      [-0.00011, 2],
      [-0.00163, 0],
      [-0.0014, 0],
      [-0.00123, 0],
      [-9e-5, 2],
      [-0.00145, 0],
      [-0.0017, 0],
      [-0.00133, 0],
      [-0.00037, 2],
      [0.00209, 1],
      [-7e-5, 2],
      [-0.00142, 0],
      [-0.00017, 2],
      [-0.00125, 0],
      [-0.00023, 2],
      [-0.00023, 2],
      [-3e-5, 2],
      [-0.00022, 2],
      [-0.00148, 0],
      [-0.00019, 2],
      [-0.00039, 2],
      [-0.00021, 2],
      [-0.00116, 0],
      [-0.00113, 0],
      [0.00176, 1],
      [-9e-5, 2],
      [-0.00101, 0],
      [-0.00018, 2]
    ],
    "red_o_points": [],
    "y_categories": ["N", "NOT APPLICABLE", "nan"],
    "blue_o_points": [],
    "blue_x_points": [
      [0.00357, 1],
      [0.00027, 2],
      [0.00254, 1],
      [0.00024, 0],
      [-0.00029, 0],
      [0.0026, 1],
      [-4e-5, 2],
      [0.00272, 1],
      [3e-5, 2],
      [0.00026, 2]
    ]
  },
  "QS_mulLysisNerve[Ssr]": {
    "red_x_points": [
      [-0.00029, 3],
      [-0.00049, 0],
      [-0.00333, 2],
      [-0.00051, 0],
      [-0.00043, 3],
      [-0.00062, 0],
      [-0.00045, 0],
      [-0.00041, 0],
      [-0.00032, 3],
      [-0.00055, 0],
      [-0.00049, 0],
      [-0.00073, 0],
      [-0.00027, 3],
      [0.00145, 1],
      [-0.00044, 3],
      [-0.0004, 0],
      [-0.00031, 3],
      [-0.00044, 0],
      [-0.00054, 3],
      [-0.00041, 3],
      [-0.00032, 3],
      [-0.00032, 3],
      [-0.00048, 0],
      [-0.00035, 3],
      [-0.00035, 3],
      [-0.00036, 3],
      [-0.00045, 0],
      [-0.00046, 0],
      [0.00131, 1],
      [-0.00039, 3],
      [-0.00032, 0],
      [-0.00026, 3]
    ],
    "red_o_points": [],
    "y_categories": ["N", "NOT APPLICABLE", "Y", "nan"],
    "blue_o_points": [],
    "blue_x_points": [
      [0.00245, 1],
      [-0.00019, 3],
      [0.0018, 1],
      [0.00052, 0],
      [-0.00014, 0],
      [0.00175, 1],
      [-0.00011, 3],
      [0.00209, 1],
      [-7e-5, 3],
      [-0.00019, 3]
    ]
  },
  "QS_mulTransfSite[Oberlin]": {
    "red_x_points": [
      [-0.00217, 3],
      [-0.01507, 0],
      [-0.01664, 0],
      [-0.016, 0],
      [-0.00201, 3],
      [-0.00377, 2],
      [-0.00291, 2],
      [-0.01593, 0],
      [-0.00237, 3],
      [-0.00293, 2],
      [-0.00308, 2],
      [-0.00246, 2],
      [-0.0023, 3],
      [0.01844, 1],
      [-0.00231, 3],
      [-0.00286, 2],
      [-0.00253, 3],
      [-0.01655, 0],
      [-0.00222, 3],
      [-0.00255, 3],
      [-0.00245, 3],
      [-0.00221, 3],
      [-0.01582, 0],
      [-0.002, 3],
      [-0.00323, 3],
      [-0.00209, 3],
      [-0.00262, 2],
      [-0.0157, 0],
      [0.01967, 1],
      [-0.00189, 3],
      [-0.01653, 0],
      [-0.00226, 3]
    ],
    "red_o_points": [],
    "y_categories": ["N", "NOT APPLICABLE", "Y", "nan"],
    "blue_o_points": [],
    "blue_x_points": [
      [0.02403, 1],
      [-0.00093, 3],
      [0.02056, 1],
      [0.00287, 2],
      [0.00184, 2],
      [0.02144, 1],
      [-0.00121, 3],
      [0.0212, 1],
      [-0.0009, 3],
      [-0.0007, 3]
    ]
  },
  "QA_lstPexMuscstrength[ElbowFlex]": {
    "red_x_points": [
      [-0.00307, 1],
      [-0.00268, 2],
      [-0.00363, 1],
      [-0.0033, 1],
      [-0.00308, 1],
      [0.00818, 0],
      [-0.00377, 1],
      [-0.00371, 1],
      [-0.00313, 1],
      [-0.00458, 1],
      [-0.00353, 1],
      [-0.00431, 1],
      [-0.00312, 1],
      [-0.00296, 2],
      [-0.00293, 2],
      [-0.00299, 2],
      [-0.00345, 1],
      [-0.00318, 2],
      [-0.00346, 2],
      [-0.00276, 1],
      [-0.00269, 1],
      [-0.00243, 1],
      [-0.00287, 1],
      [-0.00315, 2],
      [0.00231, 0],
      [-0.0018, 1],
      [-0.00392, 1],
      [-0.00291, 1],
      [-0.00281, 2],
      [-0.00277, 1],
      [-0.00385, 1],
      [-0.00312, 2]
    ],
    "red_o_points": [],
    "y_categories": ["GREATER THAN OR EQUALS TO 3", "LESS THAN 3", "nan"],
    "blue_o_points": [],
    "blue_x_points": [
      [-0.00052, 2],
      [-0.00097, 2],
      [0.00981, 0],
      [-0.00064, 1],
      [0.02208, 0],
      [0.00994, 0],
      [-0.00123, 1],
      [0.01243, 0],
      [0.00024, 1],
      [0.00029, 1]
    ]
  },
  "QA_lstPexKine[Index]": {
    "red_x_points": [
      [-0.00169, 0],
      [-0.00058, 2],
      [-0.00105, 2],
      [-0.00071, 2],
      [-0.00359, 2],
      [0.00022, 1],
      [0.00048, 1],
      [-0.00228, 0],
      [-0.0048, 2],
      [0.00111, 1],
      [0.00018, 1],
      [0.00047, 1],
      [0.0001, 1],
      [-0.00062, 2],
      [-0.0026, 2],
      [0.00046, 1],
      [-0.00336, 2],
      [-0.00076, 2],
      [-0.00191, 2],
      [-5e-5, 1],
      [-0.00429, 0],
      [-0.00041, 1],
      [-0.00051, 2],
      [-0.00217, 2],
      [-0.00034, 1],
      [-0.00453, 2],
      [-0.00115, 2],
      [-0.00062, 2],
      [-0.00074, 2],
      [-0.00277, 2],
      [-0.00177, 0],
      [-0.00288, 2]
    ],
    "red_o_points": [],
    "y_categories": ["NPV", "PV", "nan"],
    "blue_o_points": [],
    "blue_x_points": [
      [0.00045, 1],
      [-0.00083, 2],
      [0.00036, 1],
      [0.00238, 1],
      [0.00149, 1],
      [0.0009, 1],
      [0.01247, 0],
      [-0.00033, 2],
      [0.00472, 1],
      [0.00443, 1]
    ]
  },
  "QA_lstPexPalle[Clavicle]": {
    "red_x_points": [
      [-0.00414, 3],
      [-0.00137, 3],
      [-0.00135, 3],
      [-0.00161, 3],
      [-0.0042, 3],
      [-0.00858, 2],
      [-0.00632, 2],
      [-0.00179, 3],
      [-0.00493, 3],
      [-0.00204, 3],
      [-0.00703, 2],
      [-0.00912, 2],
      [-0.01029, 0],
      [0.0003, 3],
      [-0.00448, 3],
      [-0.00234, 3],
      [-0.00411, 3],
      [-0.00113, 3],
      [-0.00329, 3],
      [-0.01265, 0],
      [-0.01053, 0],
      [-0.00232, 2],
      [-0.00011, 1],
      [-0.00425, 3],
      [-0.0046, 2],
      [-0.00412, 3],
      [-0.0024, 3],
      [-0.00183, 3],
      [-0.02089, 2],
      [-0.00316, 3],
      [0.00161, 0],
      [-0.00385, 3]
    ],
    "red_o_points": [],
    "y_categories": ["HYPO", "NAIA", "PT", "nan"],
    "blue_o_points": [],
    "blue_x_points": [
      [0.00245, 3],
      [-0.00115, 3],
      [0.00879, 0],
      [0.00043, 3],
      [0.02409, 0],
      [0.00209, 3],
      [0.04443, 1],
      [0.00169, 3],
      [0.01219, 2],
      [-0.00096, 3]
    ]
  }
}
