{
  "QA_lstPexMuscstrength[ElbowFlex]": {
    "red_x_points": [
      [-0.00558, 1],
      [0.00046, 2],
      [-0.00237, 1],
      [-0.00253, 1],
      [0.00153, 0],
      [-0.00233, 1],
      [-0.00275, 1],
      [-0.00497, 1],
      [-0.00252, 1],
      [-0.00228, 1],
      [-0.0023, 1],
      [-0.00541, 1],
      [0.00082, 2],
      [0.00462, 2],
      [0.00051, 2],
      [-0.0051, 1],
      [0.00031, 2],
      [0.00086, 0],
      [-0.00526, 1],
      [-0.0052, 1],
      [-0.00484, 1],
      [-0.0024, 1],
      [0.00484, 2],
      [-8e-5, 0],
      [-0.00549, 1],
      [-0.00243, 1],
      [-0.00527, 1],
      [-0.00238, 1],
      [-0.005, 1],
      [0.00083, 2],
      [-0.00225, 1]
    ],
    "red_o_points": [],
    "y_categories": ["GREATER THAN OR EQUALS TO 3", "LESS THAN 3", "nan"],
    "blue_o_points": [],
    "blue_x_points": [
      [0.00031, 2],
      [0.00782, 2],
      [0.00584, 0],
      [0.00229, 1],
      [0.00759, 2],
      [0.00683, 0],
      [0.0073, 0]
    ]
  },
  "QS_mulGraftNerve[other]": {
    "red_x_points": [
      [-0.00029, 2],
      [-0.00093, 0],
      [-0.00115, 0],
      [-0.00099, 0],
      [-0.00099, 0],
      [-0.001, 0],
      [-0.00098, 0],
      [-0.00026, 2],
      [-0.00109, 0],
      [-0.00103, 0],
      [-0.00109, 0],
      [-0.00051, 2],
      [0.00133, 1],
      [-0.0005, 2],
      [-0.00091, 0],
      [-0.00059, 2],
      [-0.00085, 0],
      [-0.00092, 0],
      [-0.00033, 2],
      [-0.00034, 2],
      [-0.00034, 2],
      [-0.00086, 0],
      [-0.00055, 2],
      [-0.00065, 2],
      [-0.00045, 2],
      [-0.00089, 0],
      [-0.00045, 2],
      [-0.00115, 0],
      [-0.00038, 2],
      [0.0018, 1],
      [-0.00093, 0]
    ],
    "red_o_points": [],
    "y_categories": ["N", "NOT APPLICABLE", "nan"],
    "blue_o_points": [],
    "blue_x_points": [
      [0.00439, 1],
      [-2e-5, 2],
      [0.0021, 1],
      [0.0004, 0],
      [-1e-5, 2],
      [0.00197, 1],
      [0.00241, 1]
    ]
  },
  "QS_mulLysisTrunk[Upper]": {
    "red_x_points": [
      [-0.00216, 3],
      [-0.00317, 0],
      [-0.00318, 0],
      [-0.00325, 0],
      [-0.00373, 0],
      [-0.00606, 2],
      [-0.00318, 0],
      [-0.00229, 3],
      [-0.00298, 0],
      [-0.00304, 0],
      [-0.00331, 0],
      [-0.00238, 3],
      [0.00874, 1],
      [-0.00168, 3],
      [-0.00324, 0],
      [-0.00228, 3],
      [-0.00658, 2],
      [-0.00366, 0],
      [-0.00221, 3],
      [-0.00202, 3],
      [-0.00216, 3],
      [-0.003, 0],
      [-0.00204, 3],
      [-0.00246, 3],
      [-0.00236, 3],
      [-0.00295, 0],
      [-0.00226, 3],
      [-0.00305, 0],
      [-0.00185, 3],
      [0.01029, 1],
      [-0.00544, 2]
    ],
    "red_o_points": [],
    "y_categories": ["N", "NOT APPLICABLE", "Y", "nan"],
    "blue_o_points": [],
    "blue_x_points": [
      [0.01457, 1],
      [-0.00059, 3],
      [0.0094, 1],
      [-0.00216, 0],
      [-0.00084, 3],
      [0.01096, 1],
      [0.01191, 1]
    ]
  },
  "QS_mulGraftTrunk[UpperTrunk]": {
    "red_x_points": [
      [-0.00035, 3],
      [-0.00075, 0],
      [-0.00056, 0],
      [-0.0008, 0],
      [-0.00083, 0],
      [-0.00072, 0],
      [-0.00066, 0],
      [-0.00029, 3],
      [-0.00065, 0],
      [-0.00073, 0],
      [-0.00063, 0],
      [-0.00041, 3],
      [0.00192, 1],
      [-0.00053, 3],
      [-0.00198, 2],
      [-0.00043, 3],
      [-0.00057, 0],
      [-0.00064, 0],
      [-0.00038, 3],
      [-0.00045, 3],
      [-0.00037, 3],
      [-0.0007, 0],
      [-0.00058, 3],
      [-0.00032, 3],
      [-0.00041, 3],
      [-0.00075, 0],
      [-0.00034, 3],
      [-0.00059, 0],
      [-0.00034, 3],
      [0.00214, 1],
      [-0.00066, 0]
    ],
    "red_o_points": [],
    "y_categories": ["N", "NOT APPLICABLE", "Y", "nan"],
    "blue_o_points": [],
    "blue_x_points": [
      [0.00276, 1],
      [-0.00022, 3],
      [0.00164, 1],
      [-0.00029, 0],
      [-0.00015, 3],
      [0.00182, 1],
      [0.00315, 1]
    ]
  },
  "QS_mulGraftNerve[Ax]": {
    "red_x_points": [
      [-2e-5, 2],
      [-1e-5, 0],
      [-6e-5, 0],
      [-6e-5, 0],
      [-7e-5, 0],
      [-7e-5, 0],
      [-6e-5, 0],
      [-2e-5, 2],
      [-7e-5, 0],
      [-7e-5, 0],
      [-7e-5, 0],
      [-2e-5, 2],
      [0.00012, 1],
      [-4e-5, 2],
      [-7e-5, 0],
      [-4e-5, 2],
      [-5e-5, 0],
      [-1e-5, 0],
      [-2e-5, 2],
      [-1e-5, 2],
      [-1e-5, 2],
      [-4e-5, 2],
      [-1e-5, 2],
      [-3e-5, 2],
      [-6e-5, 0],
      [-3e-5, 2],
      [-7e-5, 0],
      [0.00012, 1],
      [-2e-5, 0]
    ],
    "red_o_points": [],
    "y_categories": ["N", "NOT APPLICABLE", "nan"],
    "blue_o_points": [],
    "blue_x_points": [
      [0.00049, 1],
      [-3e-5, 2],
      [0.0001, 1],
      [0.0, 0],
      [0.0001, 1]
    ]
  },
  "QA_lstPexMuscstrength[WristFlex]": {
    "red_x_points": [
      [-0.00399, 1],
      [2e-5, 2],
      [-0.00117, 1],
      [-0.00096, 1],
      [0.00023, 0],
      [0.00051, 0],
      [-0.00105, 1],
      [-0.00238, 0],
      [0.00032, 0],
      [0.00018, 0],
      [0.00019, 0],
      [-0.00281, 0],
      [-0.0017, 2],
      [0.00352, 2],
      [0.00024, 2],
      [-0.00259, 0],
      [0.00024, 2],
      [0.0001, 0],
      [-0.00239, 0],
      [-0.0036, 1],
      [-0.00239, 0],
      [-0.0013, 1],
      [0.00258, 2],
      [-0.01421, 1],
      [-0.00231, 0],
      [0.00019, 0],
      [-0.00469, 1],
      [0.00024, 0],
      [0.00301, 2],
      [0.00028, 2],
      [-0.00097, 1]
    ],
    "red_o_points": [],
    "y_categories": ["GREATER THAN OR EQUALS TO 3", "LESS THAN 3", "nan"],
    "blue_o_points": [],
    "blue_x_points": [
      [0.00021, 0],
      [0.00501, 2],
      [0.00227, 0],
      [0.0032, 0],
      [0.00563, 2],
      [0.0024, 0],
      [0.00194, 0]
    ]
  },
  "QS_mulNeuromadSite[C5]": {
    "red_x_points": [
      [-0.0011, 2],
      [-0.0027, 0],
      [-0.00308, 0],
      [-0.00289, 0],
      [-0.00385, 0],
      [-0.00261, 0],
      [-0.00294, 0],
      [-0.00113, 2],
      [-0.00282, 0],
      [-0.00331, 0],
      [-0.00299, 0],
      [-0.00115, 2],
      [0.00397, 1],
      [-0.00123, 2],
      [-0.00352, 0],
      [-0.00148, 2],
      [-0.00271, 0],
      [-0.00311, 0],
      [-0.00122, 2],
      [-0.00103, 2],
      [-0.00081, 2],
      [-0.00263, 0],
      [-0.00111, 2],
      [-0.00132, 2],
      [-0.00134, 2],
      [-0.00256, 0],
      [-0.00105, 2],
      [-0.00286, 0],
      [-0.00072, 2],
      [0.00525, 1],
      [-0.00293, 0]
    ],
    "red_o_points": [],
    "y_categories": ["N", "NOT APPLICABLE", "nan"],
    "blue_o_points": [],
    "blue_x_points": [
      [0.01291, 1],
      [-8e-5, 2],
      [0.00607, 1],
      [0.00016, 0],
      [5e-5, 2],
      [0.00698, 1],
      [0.00629, 1]
    ]
  },
  "QS_mulNeuromadSite[C7]": {
    "red_x_points": [
      [-0.00057, 2],
      [-0.00218, 0],
      [-0.00235, 0],
      [-0.00215, 0],
      [-0.00269, 0],
      [-0.00211, 0],
      [-0.00227, 0],
      [-0.00061, 2],
      [-0.00247, 0],
      [-0.00234, 0],
      [-0.00225, 0],
      [-0.00064, 2],
      [0.00271, 1],
      [-0.00064, 2],
      [-0.00255, 0],
      [-0.00066, 2],
      [-0.00268, 0],
      [-0.00251, 0],
      [-0.00061, 2],
      [-0.00055, 2],
      [-0.00046, 2],
      [-0.00213, 0],
      [-0.00052, 2],
      [-0.00078, 2],
      [-0.00072, 2],
      [-0.00212, 0],
      [-0.00058, 2],
      [-0.00225, 0],
      [-0.00052, 2],
      [0.00442, 1],
      [-0.00199, 0]
    ],
    "red_o_points": [],
    "y_categories": ["N", "NOT APPLICABLE", "nan"],
    "blue_o_points": [],
    "blue_x_points": [
      [0.00825, 1],
      [-7e-5, 2],
      [0.00541, 1],
      [0.00015, 0],
      [6e-5, 2],
      [0.00458, 1],
      [0.00602, 1]
    ]
  },
  "QS_mulTransfSite[IMc]": {
    "red_x_points": [
      [-0.00257, 3],
      [-0.00718, 2],
      [-0.00475, 0],
      [-0.00438, 0],
      [-0.00468, 0],
      [-0.00446, 0],
      [-0.0048, 0],
      [-0.00225, 3],
      [-0.00475, 0],
      [-0.00488, 0],
      [-0.00427, 0],
      [-0.00232, 3],
      [0.01223, 1],
      [-0.00254, 3],
      [-0.00486, 0],
      [-0.00248, 3],
      [-0.00745, 2],
      [-0.00466, 0],
      [-0.00236, 3],
      [-0.00255, 3],
      [-0.00219, 3],
      [-0.00438, 0],
      [-0.00237, 3],
      [-0.00283, 3],
      [-0.00245, 3],
      [-0.00441, 0],
      [-0.00235, 3],
      [-0.00701, 2],
      [-0.00217, 3],
      [0.01192, 1],
      [-0.00698, 2]
    ],
    "red_o_points": [],
    "y_categories": ["N", "NOT APPLICABLE", "Y", "nan"],
    "blue_o_points": [],
    "blue_x_points": [
      [0.02163, 1],
      [-0.00051, 3],
      [0.01245, 1],
      [-0.00186, 0],
      [-0.00078, 3],
      [0.01342, 1],
      [0.01265, 1]
    ]
  },
  "QS_mulGraftNerve[SS]": {
    "red_x_points": [[-8e-5, 0], [-8e-5, 2], [5e-5, 1]],
    "red_o_points": [],
    "y_categories": ["N", "NOT APPLICABLE", "nan"],
    "blue_o_points": [],
    "blue_x_points": [[5e-5, 1]]
  },
  "QA_mulInjOrthesisType[ArmSling]": {
    "red_x_points": [
      [-0.01272, 2],
      [-0.0121, 2],
      [-0.01223, 2],
      [-0.0126, 2],
      [-0.01131, 2],
      [-0.01197, 2],
      [-0.01209, 2],
      [-0.01258, 2],
      [-0.01174, 2],
      [-0.01188, 2],
      [-0.01213, 2],
      [-0.01269, 2],
      [0.03246, 1],
      [-0.012, 2],
      [-0.01197, 2],
      [-0.01242, 2],
      [-0.01361, 0],
      [-0.01209, 2],
      [-0.01283, 2],
      [-0.01258, 2],
      [-0.0151, 0],
      [-0.01503, 3],
      [-0.01248, 2],
      [0.03426, 1],
      [-0.01309, 2],
      [-0.01145, 2],
      [-0.01271, 2],
      [-0.01253, 2],
      [-0.015, 3],
      [-0.02253, 3],
      [-0.01198, 2]
    ],
    "red_o_points": [],
    "y_categories": ["N", "NOT APPLICABLE", "Y", "nan"],
    "blue_o_points": [],
    "blue_x_points": [
      [-0.00577, 2],
      [0.03748, 1],
      [0.03029, 1],
      [0.039, 1],
      [0.03588, 1],
      [0.03119, 1],
      [0.03135, 1]
    ]
  },
  "QS_mulNeuromadSite[C6]": {
    "red_x_points": [
      [-0.00047, 2],
      [-0.00163, 0],
      [-0.00148, 0],
      [-0.0014, 0],
      [-0.00209, 0],
      [-0.00145, 0],
      [-0.00168, 0],
      [-0.00039, 2],
      [-0.0015, 0],
      [-0.00139, 0],
      [-0.00113, 0],
      [-0.00037, 2],
      [0.00233, 1],
      [-0.00061, 2],
      [-0.00169, 0],
      [-0.00046, 2],
      [-0.00126, 0],
      [-0.00166, 0],
      [-0.00043, 2],
      [-0.00039, 2],
      [-0.00022, 2],
      [-0.00112, 0],
      [-0.00052, 2],
      [-0.00064, 2],
      [-0.00058, 2],
      [-0.00139, 0],
      [-0.00051, 2],
      [-0.00128, 0],
      [-0.0001, 2],
      [0.00222, 1],
      [-0.00127, 0]
    ],
    "red_o_points": [],
    "y_categories": ["N", "NOT APPLICABLE", "nan"],
    "blue_o_points": [],
    "blue_x_points": [
      [0.00671, 1],
      [0.00021, 2],
      [0.00311, 1],
      [-7e-5, 0],
      [5e-5, 2],
      [0.00312, 1],
      [0.00337, 1]
    ]
  },
  "QS_mulGraftNerve[Ac]": {
    "red_x_points": [
      [-0.0002, 2],
      [-0.00057, 0],
      [-0.00054, 0],
      [-0.00063, 0],
      [-0.00059, 0],
      [-0.00057, 0],
      [-0.00064, 0],
      [-0.00021, 2],
      [-0.0005, 0],
      [-0.00069, 0],
      [-0.00045, 0],
      [-0.00019, 2],
      [-2e-5, 1],
      [-0.0001, 2],
      [-0.00056, 0],
      [-0.0001, 2],
      [-0.00048, 0],
      [-0.00057, 0],
      [-0.00017, 2],
      [-0.00021, 2],
      [-0.00011, 2],
      [-0.00043, 0],
      [-0.00014, 2],
      [-0.00037, 2],
      [-0.0002, 2],
      [-0.00054, 0],
      [-0.00021, 2],
      [-0.00052, 0],
      [-6e-5, 2],
      [0.00126, 1],
      [-0.00057, 0]
    ],
    "red_o_points": [],
    "y_categories": ["N", "NOT APPLICABLE", "nan"],
    "blue_o_points": [],
    "blue_x_points": [
      [0.00271, 1],
      [7e-5, 2],
      [0.00144, 1],
      [0.00015, 0],
      [2e-5, 2],
      [0.00123, 1],
      [0.00116, 1]
    ]
  },
  "QS_mulLysisRoot[C7]": {
    "red_x_points": [
      [-0.00015, 3],
      [-0.00028, 0],
      [-0.00071, 2],
      [-0.00018, 0],
      [-0.00025, 0],
      [-0.00026, 0],
      [-0.00016, 0],
      [-0.00012, 3],
      [-0.00025, 0],
      [-0.00022, 0],
      [-0.00028, 0],
      [-0.0002, 3],
      [0.00091, 1],
      [-7e-5, 3],
      [-0.00024, 0],
      [-0.00014, 3],
      [-0.00016, 0],
      [-0.00025, 0],
      [-0.00014, 3],
      [-0.00019, 3],
      [-0.00018, 3],
      [-0.00025, 0],
      [-0.00017, 3],
      [-0.00019, 3],
      [-0.00018, 3],
      [-0.00024, 0],
      [-7e-5, 3],
      [-0.00031, 0],
      [-0.00018, 3],
      [0.00081, 1],
      [-0.00025, 0]
    ],
    "red_o_points": [],
    "y_categories": ["N", "NOT APPLICABLE", "Y", "nan"],
    "blue_o_points": [],
    "blue_x_points": [
      [0.00072, 1],
      [-8e-5, 3],
      [0.00067, 1],
      [-0.00029, 0],
      [-7e-5, 3],
      [0.00085, 1],
      [0.00082, 1]
    ]
  },
  "QS_mulNeuromadSite[C8]": {
    "red_x_points": [
      [-0.00119, 2],
      [-0.00457, 0],
      [-0.00473, 0],
      [-0.0049, 0],
      [-0.00462, 0],
      [-0.00443, 0],
      [-0.00459, 0],
      [-0.00148, 2],
      [-0.00452, 0],
      [-0.00452, 0],
      [-0.00428, 0],
      [-0.00139, 2],
      [0.00766, 1],
      [-0.00141, 2],
      [-0.00488, 0],
      [-0.0018, 2],
      [-0.00461, 0],
      [-0.00449, 0],
      [-0.00157, 2],
      [-0.00123, 2],
      [-0.00089, 2],
      [-0.00382, 0],
      [-0.00126, 2],
      [-0.00107, 2],
      [-0.00135, 2],
      [-0.00425, 0],
      [-0.00123, 2],
      [-0.00457, 0],
      [-0.00093, 2],
      [0.00725, 1],
      [-0.00466, 0]
    ],
    "red_o_points": [],
    "y_categories": ["N", "NOT APPLICABLE", "nan"],
    "blue_o_points": [],
    "blue_x_points": [
      [0.01847, 1],
      [5e-5, 2],
      [0.00917, 1],
      [0.0003, 0],
      [-0.00018, 2],
      [0.00977, 1],
      [0.01146, 1]
    ]
  },
  "QS_mulGraftNerve[Ph]": {
    "red_x_points": [
      [-0.00016, 2],
      [-0.00023, 0],
      [-0.00013, 0],
      [-0.00021, 0],
      [-0.00021, 0],
      [-0.0002, 0],
      [-0.00019, 0],
      [-0.00013, 2],
      [-0.00026, 0],
      [-0.00024, 0],
      [-0.00022, 0],
      [-8e-5, 2],
      [0.00023, 1],
      [-0.00018, 2],
      [-0.0002, 0],
      [-0.00014, 2],
      [-0.0002, 0],
      [-0.00012, 2],
      [-0.00015, 2],
      [-9e-5, 2],
      [-9e-5, 0],
      [-0.00015, 2],
      [-9e-5, 2],
      [-0.00018, 2],
      [-0.00015, 0],
      [-0.00018, 2],
      [-0.00025, 0],
      [-7e-5, 2],
      [0.00023, 1],
      [-0.00021, 0]
    ],
    "red_o_points": [],
    "y_categories": ["N", "NOT APPLICABLE", "nan"],
    "blue_o_points": [],
    "blue_x_points": [
      [0.00163, 1],
      [-6e-5, 2],
      [0.00029, 1],
      [-1e-5, 0],
      [-7e-5, 2],
      [0.00035, 1],
      [0.00054, 1]
    ]
  },
  "QS_mulTransfSite[AcSsPA]": {
    "red_x_points": [
      [-0.00025, 3],
      [-0.00055, 0],
      [-0.0004, 0],
      [-0.00049, 0],
      [-0.00059, 0],
      [-0.00043, 0],
      [-0.00044, 0],
      [-0.00029, 3],
      [-0.00054, 0],
      [-0.00036, 0],
      [-0.00052, 0],
      [-0.00031, 3],
      [0.00126, 1],
      [-0.00033, 3],
      [-0.00055, 0],
      [-0.0003, 3],
      [-0.00187, 2],
      [-0.00055, 0],
      [-0.00031, 3],
      [-0.00025, 3],
      [-0.00024, 3],
      [-0.00045, 0],
      [-0.00025, 3],
      [-0.00027, 3],
      [-0.0003, 3],
      [-0.00054, 0],
      [-0.00023, 3],
      [-0.00039, 0],
      [-0.0003, 3],
      [0.00144, 1],
      [-0.00047, 0]
    ],
    "red_o_points": [],
    "y_categories": ["N", "NOT APPLICABLE", "Y", "nan"],
    "blue_o_points": [],
    "blue_x_points": [
      [0.00191, 1],
      [-3e-5, 3],
      [0.00128, 1],
      [-0.00022, 0],
      [-0.00012, 3],
      [0.00138, 1],
      [0.00178, 1]
    ]
  },
  "QS_mulTransfSite[AcMc]": {
    "red_x_points": [
      [-0.00028, 3],
      [-0.00051, 0],
      [-0.00049, 0],
      [-0.00051, 0],
      [-0.00044, 0],
      [-0.00057, 0],
      [-0.00044, 0],
      [-0.00022, 3],
      [-0.00053, 0],
      [-0.0005, 0],
      [-0.00136, 2],
      [-0.00024, 3],
      [0.00175, 1],
      [-0.00035, 3],
      [-0.00052, 0],
      [-0.00031, 3],
      [-0.00047, 0],
      [-0.00042, 0],
      [-0.00036, 3],
      [-0.00026, 3],
      [-0.00025, 3],
      [-0.00054, 0],
      [-0.00033, 3],
      [-0.00037, 3],
      [-0.00036, 3],
      [-0.00048, 0],
      [-0.00034, 3],
      [-0.00053, 0],
      [-0.00029, 3],
      [0.00168, 1],
      [-0.00049, 0]
    ],
    "red_o_points": [],
    "y_categories": ["N", "NOT APPLICABLE", "Y", "nan"],
    "blue_o_points": [],
    "blue_x_points": [
      [0.00203, 1],
      [-7e-5, 3],
      [0.00181, 1],
      [-0.00064, 0],
      [-0.00013, 3],
      [0.00157, 1],
      [0.00202, 1]
    ]
  },
  "QS_mulTransfSite[Other]": {
    "red_x_points": [
      [-0.00039, 3],
      [-0.00058, 0],
      [-0.00052, 0],
      [-0.00068, 0],
      [-0.00043, 0],
      [-0.00063, 0],
      [-0.00067, 0],
      [-0.00055, 3],
      [-0.00076, 0],
      [-0.00062, 0],
      [-0.00052, 0],
      [-0.00038, 3],
      [0.00176, 1],
      [-0.00045, 3],
      [-0.00064, 0],
      [-0.00043, 3],
      [-0.00059, 0],
      [-0.00374, 2],
      [-0.00037, 3],
      [-0.00024, 3],
      [-0.00044, 3],
      [-0.00063, 0],
      [-0.00037, 3],
      [-0.00046, 3],
      [-0.00048, 3],
      [-0.00069, 0],
      [-0.00061, 3],
      [-0.00066, 0],
      [-0.00038, 3],
      [0.00264, 1],
      [-0.0005, 0]
    ],
    "red_o_points": [],
    "y_categories": ["N", "NOT APPLICABLE", "Y", "nan"],
    "blue_o_points": [],
    "blue_x_points": [
      [0.00214, 1],
      [-0.00022, 3],
      [0.00283, 1],
      [8e-5, 0],
      [-4e-5, 3],
      [0.00201, 1],
      [0.00211, 1]
    ]
  },
  "QA_yonInjBpsurg": {
    "red_x_points": [
      [-0.00404, 1],
      [-0.00379, 1],
      [-0.00454, 1],
      [-0.00433, 1],
      [-0.00492, 1],
      [-0.00438, 1],
      [-0.00434, 1],
      [-0.00414, 1],
      [-0.00458, 1],
      [-0.00419, 1],
      [-0.00408, 1],
      [-0.00428, 1],
      [0.00916, 0],
      [-0.00412, 1],
      [-0.00455, 1],
      [-0.00458, 1],
      [-0.00314, 1],
      [-0.00451, 1],
      [-0.00462, 1],
      [-0.00417, 1],
      [-0.00364, 1],
      [-0.00366, 1],
      [-0.00413, 1],
      [-0.0046, 1],
      [-0.00547, 1],
      [-0.00352, 1],
      [-0.00427, 1],
      [-0.00427, 1],
      [-0.00402, 1],
      [0.01111, 0],
      [-0.00376, 1]
    ],
    "red_o_points": [],
    "y_categories": ["N", "Y", "nan"],
    "blue_o_points": [],
    "blue_x_points": [
      [0.02444, 0],
      [-0.00089, 1],
      [0.01264, 0],
      [-0.00308, 1],
      [-0.00139, 1],
      [0.01408, 0],
      [0.01766, 0]
    ]
  },
  "QS_mulNeuromadSite[T1]": {
    "red_x_points": [
      [-0.00154, 2],
      [-0.00433, 0],
      [-0.00477, 0],
      [-0.00437, 0],
      [-0.00403, 0],
      [-0.00389, 0],
      [-0.00433, 0],
      [-0.00142, 2],
      [-0.00447, 0],
      [-0.00475, 0],
      [-0.00413, 0],
      [-0.00148, 2],
      [0.00701, 1],
      [-0.00152, 2],
      [-0.00496, 0],
      [-0.00171, 2],
      [-0.00434, 0],
      [-0.00453, 0],
      [-0.00152, 2],
      [-0.00151, 2],
      [-0.00133, 2],
      [-0.00398, 0],
      [-0.00118, 2],
      [-0.00151, 2],
      [-0.0017, 2],
      [-0.0044, 0],
      [-0.00165, 2],
      [-0.00423, 0],
      [-0.00118, 2],
      [0.0075, 1],
      [-0.00445, 0]
    ],
    "red_o_points": [],
    "y_categories": ["N", "NOT APPLICABLE", "nan"],
    "blue_o_points": [],
    "blue_x_points": [
      [0.01813, 1],
      [8e-5, 2],
      [0.00936, 1],
      [0.00029, 0],
      [0.00022, 2],
      [0.00924, 1],
      [0.01208, 1]
    ]
  },
  "QS_mulTransfSite[AcSsAA]": {
    "red_x_points": [
      [-0.0025, 3],
      [-0.00782, 2],
      [-0.00297, 0],
      [-0.00806, 2],
      [-0.00866, 2],
      [-0.00325, 0],
      [-0.00361, 0],
      [-0.00273, 3],
      [-0.00329, 0],
      [-0.00814, 2],
      [-0.00316, 0],
      [-0.00264, 3],
      [0.01281, 1],
      [-0.00295, 3],
      [-0.0086, 2],
      [-0.00287, 3],
      [-0.00289, 0],
      [-0.00327, 0],
      [-0.00309, 3],
      [-0.00263, 3],
      [-0.00259, 3],
      [-0.0075, 2],
      [-0.0031, 3],
      [-0.00247, 3],
      [-0.00278, 3],
      [-0.00336, 0],
      [-0.0029, 3],
      [-0.00799, 2],
      [-0.00252, 3],
      [0.01419, 1],
      [-0.00332, 0]
    ],
    "red_o_points": [],
    "y_categories": ["N", "NOT APPLICABLE", "Y", "nan"],
    "blue_o_points": [],
    "blue_x_points": [
      [0.01942, 1],
      [-0.00144, 3],
      [0.01391, 1],
      [-0.00017, 0],
      [-0.00083, 3],
      [0.01332, 1],
      [0.01537, 1]
    ]
  },
  "QS_mulNeuromadSite[T2]": {
    "red_x_points": [
      [-0.0018, 2],
      [-0.00572, 0],
      [-0.00653, 0],
      [-0.00622, 0],
      [-0.00569, 0],
      [-0.00559, 0],
      [-0.00623, 0],
      [-0.00215, 2],
      [-0.00598, 0],
      [-0.00598, 0],
      [-0.00585, 0],
      [-0.00178, 2],
      [0.00946, 1],
      [-0.00208, 2],
      [-0.00608, 0],
      [-0.00265, 2],
      [-0.00554, 0],
      [-0.00626, 0],
      [-0.00217, 2],
      [-0.00194, 2],
      [-0.00188, 2],
      [-0.00559, 0],
      [-0.00213, 2],
      [-0.00241, 2],
      [-0.00273, 2],
      [-0.00559, 0],
      [-0.00223, 2],
      [-0.00546, 0],
      [-0.00165, 2],
      [0.012, 1],
      [-0.0056, 0]
    ],
    "red_o_points": [],
    "y_categories": ["N", "NOT APPLICABLE", "nan"],
    "blue_o_points": [],
    "blue_x_points": [
      [0.02231, 1],
      [-0.00027, 2],
      [0.01219, 1],
      [0.00048, 0],
      [-0.00056, 2],
      [0.01384, 1],
      [0.0156, 1]
    ]
  },
  "QS_mulLysisRoot[C5]": {
    "red_x_points": [
      [-0.00061, 3],
      [-0.00097, 0],
      [-0.00212, 2],
      [-0.001, 0],
      [-0.00099, 0],
      [-0.00106, 0],
      [-0.00103, 0],
      [-0.00071, 3],
      [-0.001, 0],
      [-0.00093, 0],
      [-0.00092, 0],
      [-0.00085, 3],
      [0.00354, 1],
      [-0.0007, 3],
      [-0.00099, 0],
      [-0.00078, 3],
      [-0.00089, 0],
      [-0.00092, 0],
      [-0.00049, 3],
      [-0.00066, 3],
      [-0.00078, 3],
      [-0.00094, 0],
      [-0.00089, 3],
      [-0.00074, 3],
      [-0.0009, 3],
      [-0.00095, 0],
      [-0.00062, 3],
      [-0.00085, 0],
      [-0.00087, 3],
      [0.00285, 1],
      [-0.00183, 2]
    ],
    "red_o_points": [],
    "y_categories": ["N", "NOT APPLICABLE", "Y", "nan"],
    "blue_o_points": [],
    "blue_x_points": [
      [0.00404, 1],
      [-0.00044, 3],
      [0.00317, 1],
      [-0.0011, 0],
      [-0.00023, 3],
      [0.00324, 1],
      [0.00423, 1]
    ]
  },
  "QS_mulGraftNerve[FI]": {
    "red_x_points": [
      [-3e-5, 2],
      [-0.00041, 0],
      [-0.00033, 0],
      [-0.00031, 0],
      [-0.00046, 0],
      [-0.00029, 0],
      [-0.00037, 0],
      [-0.00013, 2],
      [-0.00028, 0],
      [-0.00032, 0],
      [-0.00022, 0],
      [-0.00016, 2],
      [8e-5, 1],
      [-7e-5, 2],
      [-0.00035, 0],
      [-0.00015, 2],
      [-0.00049, 0],
      [-0.00065, 0],
      [-0.00012, 2],
      [-8e-5, 2],
      [-5e-5, 2],
      [-0.0004, 0],
      [2e-5, 2],
      [-0.00018, 2],
      [-0.00016, 2],
      [-0.00029, 0],
      [-3e-5, 2],
      [-0.00034, 0],
      [-6e-5, 2],
      [0.00044, 1],
      [-0.00036, 0]
    ],
    "red_o_points": [],
    "y_categories": ["N", "NOT APPLICABLE", "nan"],
    "blue_o_points": [],
    "blue_x_points": [
      [0.00181, 1],
      [0.00015, 2],
      [0.00084, 1],
      [0.00014, 0],
      [0.00012, 2],
      [0.00064, 1],
      [0.00111, 1]
    ]
  },
  "QS_mulGraftNerve[Ul]": {
    "red_x_points": [
      [-6e-5, 2],
      [-7e-5, 0],
      [-6e-5, 0],
      [-0.00012, 0],
      [-6e-5, 0],
      [-9e-5, 0],
      [-9e-5, 0],
      [-5e-5, 2],
      [-6e-5, 0],
      [-9e-5, 0],
      [-6e-5, 0],
      [-3e-5, 2],
      [0.00018, 1],
      [-5e-5, 2],
      [-8e-5, 0],
      [-4e-5, 2],
      [-0.00017, 0],
      [-1e-5, 0],
      [-5e-5, 2],
      [-6e-5, 2],
      [-6e-5, 2],
      [-0.00012, 0],
      [-2e-5, 2],
      [-5e-5, 2],
      [-4e-5, 2],
      [-0.00012, 0],
      [-6e-5, 2],
      [-1e-5, 0],
      [-5e-5, 2],
      [0.00018, 1],
      [-0.00012, 0]
    ],
    "red_o_points": [],
    "y_categories": ["N", "NOT APPLICABLE", "nan"],
    "blue_o_points": [],
    "blue_x_points": [
      [0.0003, 1],
      [-5e-5, 2],
      [0.0002, 1],
      [4e-5, 0],
      [-2e-5, 2],
      [0.0001, 1],
      [0.00058, 1]
    ]
  },
  "QS_mulBpsurgeryType[Lysis]": {
    "red_x_points": [
      [-0.0034, 3],
      [-0.00464, 0],
      [-0.00877, 2],
      [-0.00454, 0],
      [-0.00523, 0],
      [-0.0079, 2],
      [-0.00466, 0],
      [-0.00325, 3],
      [-0.00445, 0],
      [-0.00456, 0],
      [-0.00424, 0],
      [-0.00291, 3],
      [0.01293, 1],
      [-0.0034, 3],
      [-0.00503, 0],
      [-0.00373, 3],
      [-0.0078, 2],
      [-0.00549, 0],
      [-0.0031, 3],
      [-0.00306, 3],
      [-0.0027, 3],
      [-0.00408, 0],
      [-0.00354, 3],
      [-0.00327, 3],
      [-0.00324, 3],
      [-0.00451, 0],
      [-0.00314, 3],
      [-0.00438, 0],
      [-0.00281, 3],
      [0.01429, 1],
      [-0.00719, 2]
    ],
    "red_o_points": [],
    "y_categories": ["N", "NOT APPLICABLE", "Y", "nan"],
    "blue_o_points": [],
    "blue_x_points": [
      [0.02386, 1],
      [-0.00089, 3],
      [0.01516, 1],
      [-0.00152, 0],
      [-0.00117, 3],
      [0.01521, 1],
      [0.01621, 1]
    ]
  },
  "QA_yonInjUnconscio": {
    "red_x_points": [
      [-0.00446, 1],
      [-0.00467, 1],
      [-0.00256, 2],
      [-0.00212, 2],
      [0.00846, 0],
      [-0.00509, 1],
      [-0.00292, 2],
      [-0.00444, 2],
      [-0.00309, 2],
      [-0.00215, 2],
      [-0.00478, 1],
      [-0.00509, 1],
      [-0.02914, 1],
      [-0.00566, 2],
      [-0.00315, 2],
      [-0.00483, 2],
      [-0.00462, 1],
      [0.01014, 0],
      [-0.00499, 1],
      [-0.00443, 1],
      [-0.00421, 1],
      [-0.005, 1],
      [-0.0051, 2],
      [-0.01118, 1],
      [-0.00403, 2],
      [-0.00481, 1],
      [0.01119, 0],
      [-0.0043, 1],
      [-0.00438, 2],
      [-0.00143, 2],
      [-0.00448, 1]
    ],
    "red_o_points": [],
    "y_categories": ["N", "Y", "nan"],
    "blue_o_points": [],
    "blue_x_points": [
      [0.00141, 2],
      [-0.00254, 1],
      [0.01584, 0],
      [0.02306, 0],
      [0.02545, 0],
      [0.00307, 2],
      [0.0029, 2]
    ]
  },
  "QS_mulTransfSite[Oberlin]": {
    "red_x_points": [
      [-0.00473, 3],
      [-0.01308, 0],
      [-0.01359, 0],
      [-0.01429, 0],
      [-0.00715, 2],
      [-0.00662, 2],
      [-0.01394, 0],
      [-0.00457, 3],
      [-0.00738, 2],
      [-0.00715, 2],
      [-0.00665, 2],
      [-0.00481, 3],
      [0.02285, 1],
      [-0.00474, 3],
      [-0.00659, 2],
      [-0.00535, 3],
      [-0.01403, 0],
      [-0.00836, 2],
      [-0.00445, 3],
      [-0.0047, 3],
      [-0.00442, 3],
      [-0.01243, 0],
      [-0.00459, 3],
      [-0.00546, 3],
      [-0.0053, 3],
      [-0.00623, 2],
      [-0.005, 3],
      [-0.01381, 0],
      [-0.00447, 3],
      [0.0262, 1],
      [-0.01437, 0]
    ],
    "red_o_points": [],
    "y_categories": ["N", "NOT APPLICABLE", "Y", "nan"],
    "blue_o_points": [],
    "blue_x_points": [
      [0.03538, 1],
      [-0.00192, 3],
      [0.02744, 1],
      [-0.00077, 2],
      [-0.00226, 3],
      [0.02863, 1],
      [0.0282, 1]
    ]
  },
  "QA_lstPexMuscstrength[ShoulderAbduc]": {
    "red_x_points": [
      [-0.00739, 1],
      [-0.00706, 1],
      [-0.00699, 1],
      [-0.00655, 1],
      [-0.00761, 1],
      [-0.00714, 1],
      [-0.00725, 1],
      [-0.00694, 1],
      [-0.00669, 1],
      [-0.00733, 1],
      [-0.00649, 1],
      [-0.00748, 1],
      [0.0029, 2],
      [0.00593, 2],
      [0.00634, 2],
      [0.00624, 2],
      [0.00626, 2],
      [-0.00775, 1],
      [-0.00693, 1],
      [-0.00678, 1],
      [-0.00752, 1],
      [-0.00667, 1],
      [0.00581, 2],
      [-0.01116, 1],
      [-0.007, 1],
      [-0.00688, 1],
      [-0.00731, 1],
      [-0.00683, 1],
      [-0.00651, 1],
      [0.00305, 2],
      [-0.00694, 1]
    ],
    "red_o_points": [],
    "y_categories": ["GREATER THAN OR EQUALS TO 3", "LESS THAN 3", "nan"],
    "blue_o_points": [],
    "blue_x_points": [
      [0.00451, 2],
      [0.00704, 2],
      [0.02968, 0],
      [0.00799, 2],
      [0.00649, 2],
      [0.02884, 0],
      [-0.00164, 1]
    ]
  },
  "participant_code": {
    "red_x_points": [
      [-0.023, 1],
      [-0.02328, 2],
      [-0.02342, 3],
      [-0.02384, 4],
      [-0.02333, 5],
      [-0.02403, 6],
      [-0.02408, 7],
      [-0.02277, 8],
      [-0.02249, 9],
      [-0.02324, 10],
      [-0.02482, 11],
      [-0.02333, 12],
      [-0.02375, 14],
      [-0.02263, 16],
      [-0.0224, 17],
      [-0.02286, 19],
      [-0.02342, 20],
      [-0.02366, 22],
      [-0.02319, 23],
      [-0.02249, 25],
      [-0.02277, 26],
      [-0.02361, 27],
      [-0.0231, 28],
      [-0.02501, 29],
      [-0.02352, 30],
      [-0.0244, 32],
      [-0.0231, 33],
      [-0.02296, 34],
      [-0.02356, 35],
      [-0.02282, 36],
      [-0.02352, 37]
    ],
    "red_o_points": [],
    "y_categories": [
      "P16554",
      "P18297",
      "P19283",
      "P19287",
      "P23391",
      "P31645",
      "P31691",
      "P34778",
      "P35046",
      "P36328",
      "P43633",
      "P4544",
      "P46417",
      "P48965",
      "P53068",
      "P5497",
      "P59529",
      "P62483",
      "P64658",
      "P65202",
      "P66816",
      "P6751",
      "P7408",
      "P75566",
      "P76226",
      "P79971",
      "P82621",
      "P82990",
      "P84932",
      "P85825",
      "P86989",
      "P8770",
      "P87791",
      "P90550",
      "P93159",
      "P94969",
      "P96710",
      "P9744",
      "nan"
    ],
    "blue_o_points": [],
    "blue_x_points": [
      [0.06945, 0],
      [0.07129, 13],
      [0.06899, 15],
      [0.06469, 18],
      [0.06623, 21],
      [0.06515, 24],
      [0.06868, 31]
    ]
  },
  "QA_mulInjOrthesisType[ShoulderSupport]": {
    "red_x_points": [
      [-0.01483, 0],
      [-0.01416, 0],
      [-0.01425, 0],
      [-0.01391, 0],
      [-0.01441, 0],
      [-0.01454, 0],
      [-0.01409, 0],
      [-0.01728, 2],
      [-0.01446, 0],
      [-0.01388, 0],
      [-0.01328, 0],
      [-0.01456, 0],
      [0.03973, 1],
      [-0.01507, 0],
      [-0.01394, 0],
      [-0.01481, 0],
      [-0.01685, 2],
      [-0.01461, 0],
      [-0.0144, 0],
      [-0.01411, 0],
      [-0.01738, 2],
      [-0.01708, 3],
      [-0.01481, 0],
      [0.03955, 1],
      [-0.0142, 0],
      [-0.01355, 0],
      [-0.01435, 0],
      [-0.01305, 0],
      [-0.01781, 3],
      [-0.02574, 3],
      [-0.01438, 0]
    ],
    "red_o_points": [],
    "y_categories": ["N", "NOT APPLICABLE", "Y", "nan"],
    "blue_o_points": [],
    "blue_x_points": [
      [-0.00641, 0],
      [0.0419, 1],
      [0.03542, 1],
      [0.04802, 1],
      [0.04177, 1],
      [0.0347, 1],
      [0.03675, 1]
    ]
  },
  "QS_mulGraftNerve[Me]": {
    "red_x_points": [
      [-0.00017, 2],
      [-0.00025, 0],
      [-0.00019, 0],
      [-0.0001, 0],
      [-0.00022, 0],
      [-0.00012, 0],
      [-0.00019, 0],
      [-5e-5, 2],
      [-0.00015, 0],
      [-0.00021, 0],
      [-0.00019, 0],
      [-0.00013, 2],
      [0.00022, 1],
      [-0.00014, 2],
      [-0.00025, 0],
      [-0.00013, 2],
      [-0.00013, 0],
      [-0.00023, 0],
      [-9e-5, 2],
      [-0.00017, 2],
      [-4e-5, 2],
      [-0.00016, 0],
      [-0.00014, 2],
      [-5e-5, 2],
      [-0.00014, 2],
      [-0.00022, 0],
      [-0.00011, 2],
      [-0.0002, 0],
      [-3e-5, 2],
      [0.0001, 1],
      [-0.00021, 0]
    ],
    "red_o_points": [],
    "y_categories": ["N", "NOT APPLICABLE", "nan"],
    "blue_o_points": [],
    "blue_x_points": [
      [0.00105, 1],
      [-1e-5, 2],
      [0.00045, 1],
      [0.0001, 0],
      [-6e-5, 2],
      [0.00022, 1],
      [0.00024, 1]
    ]
  },
  "QS_lstBpsurgSide": {
    "red_x_points": [
      [-0.00548, 3],
      [-0.00774, 0],
      [-0.00788, 0],
      [-0.00754, 0],
      [-0.01602, 2],
      [-0.00691, 0],
      [-0.00781, 0],
      [-0.00491, 3],
      [-0.00808, 0],
      [-0.01437, 2],
      [-0.01598, 2],
      [-0.00525, 3],
      [0.02658, 1],
      [-0.00549, 3],
      [-0.01674, 2],
      [-0.00526, 3],
      [-0.01586, 2],
      [-0.01562, 2],
      [-0.00524, 3],
      [-0.00499, 3],
      [-0.00443, 3],
      [-0.00673, 0],
      [-0.00505, 3],
      [-0.00494, 3],
      [-0.00535, 3],
      [-0.01476, 2],
      [-0.00491, 3],
      [-0.01472, 2],
      [-0.00504, 3],
      [0.02672, 1],
      [-0.00757, 0]
    ],
    "red_o_points": [],
    "y_categories": ["L", "NOT APPLICABLE", "R", "nan"],
    "blue_o_points": [],
    "blue_x_points": [
      [0.03763, 1],
      [-0.00197, 3],
      [0.02887, 1],
      [0.00185, 0],
      [-0.00187, 3],
      [0.02828, 1],
      [0.03193, 1]
    ]
  },
  "QS_mulGraftNerve[IS]": {
    "red_x_points": [
      [-2e-5, 2],
      [-5e-5, 0],
      [-6e-5, 0],
      [-6e-5, 0],
      [-1e-5, 0],
      [-1e-5, 2],
      [-6e-5, 0],
      [-5e-5, 0],
      [-5e-5, 0],
      [-1e-5, 2],
      [0.0, 1],
      [-2e-5, 2],
      [-6e-5, 0],
      [-5e-5, 0],
      [-6e-5, 0],
      [-1e-5, 2],
      [-2e-5, 2],
      [-1e-5, 2],
      [-5e-5, 0],
      [-2e-5, 2],
      [-3e-5, 2],
      [-1e-5, 2],
      [-6e-5, 0],
      [-1e-5, 2],
      [-6e-5, 0],
      [-1e-5, 2],
      [-6e-5, 0]
    ],
    "red_o_points": [],
    "y_categories": ["N", "NOT APPLICABLE", "nan"],
    "blue_o_points": [],
    "blue_x_points": [
      [0.00031, 1],
      [-1e-5, 2],
      [0.00012, 1],
      [8e-5, 0],
      [-3e-5, 2],
      [0.00012, 1],
      [0.00012, 1]
    ]
  },
  "QS_mulGraftNerve[MC]": {
    "red_x_points": [
      [-1e-5, 2],
      [-5e-5, 0],
      [-6e-5, 0],
      [-6e-5, 0],
      [-6e-5, 0],
      [-6e-5, 0],
      [-6e-5, 0],
      [0.0, 2],
      [-1e-5, 0],
      [-6e-5, 0],
      [-6e-5, 0],
      [0.0, 2],
      [9e-5, 1],
      [-1e-5, 2],
      [-1e-5, 0],
      [-6e-5, 0],
      [0.0, 2],
      [-1e-5, 2],
      [0.0, 2],
      [0.0, 2],
      [0.0, 2],
      [-5e-5, 0],
      [-6e-5, 0],
      [0.0, 2],
      [9e-5, 1],
      [-6e-5, 0]
    ],
    "red_o_points": [],
    "y_categories": ["N", "NOT APPLICABLE", "nan"],
    "blue_o_points": [],
    "blue_x_points": [
      [0.00019, 1],
      [0.0, 2],
      [9e-5, 1],
      [0.0, 2],
      [9e-5, 1],
      [9e-5, 1]
    ]
  },
  "QS_mulLysisSite[Trunk]": {
    "red_x_points": [
      [-0.00166, 3],
      [-0.00254, 0],
      [-0.00254, 0],
      [-0.00241, 0],
      [-0.00243, 0],
      [-0.0051, 2],
      [-0.00281, 0],
      [-0.00155, 3],
      [-0.0024, 0],
      [-0.00253, 0],
      [-0.00254, 0],
      [-0.00162, 3],
      [0.00803, 1],
      [-0.00171, 3],
      [-0.0026, 0],
      [-0.00186, 3],
      [-0.0048, 2],
      [-0.00249, 0],
      [-0.00162, 3],
      [-0.0015, 3],
      [-0.00162, 3],
      [-0.00246, 0],
      [-0.00161, 3],
      [-0.00154, 3],
      [-0.00177, 3],
      [-0.00224, 0],
      [-0.0018, 3],
      [-0.00256, 0],
      [-0.00175, 3],
      [0.00892, 1],
      [-0.00413, 2]
    ],
    "red_o_points": [],
    "y_categories": ["N", "NOT APPLICABLE", "Y", "nan"],
    "blue_o_points": [],
    "blue_x_points": [
      [0.01025, 1],
      [-0.00065, 3],
      [0.00807, 1],
      [-0.00171, 0],
      [-0.00077, 3],
      [0.00902, 1],
      [0.00919, 1]
    ]
  },
  "QS_mulNeuromadSite[C4]": {
    "red_x_points": [
      [-0.00054, 2],
      [-0.00145, 0],
      [-0.00128, 0],
      [-0.00163, 0],
      [-0.00164, 0],
      [-0.00134, 0],
      [-0.00166, 0],
      [-0.00056, 2],
      [-0.00155, 0],
      [-0.00131, 0],
      [-0.00159, 0],
      [-0.00057, 2],
      [0.00107, 1],
      [-0.00067, 2],
      [-0.00114, 0],
      [-0.00079, 2],
      [-0.0012, 0],
      [-0.00159, 0],
      [-0.00057, 2],
      [-0.00056, 2],
      [-0.00038, 2],
      [-0.00132, 0],
      [-0.00071, 2],
      [-0.00058, 2],
      [-0.00054, 2],
      [-0.00137, 0],
      [-0.00068, 2],
      [-0.00159, 0],
      [-0.00046, 2],
      [0.00266, 1],
      [-0.00123, 0]
    ],
    "red_o_points": [],
    "y_categories": ["N", "NOT APPLICABLE", "nan"],
    "blue_o_points": [],
    "blue_x_points": [
      [0.0067, 1],
      [-1e-5, 2],
      [0.00329, 1],
      [0.00011, 0],
      [-0.0001, 2],
      [0.00297, 1],
      [0.00401, 1]
    ]
  },
  "QS_mulGraftNerve[Ra]": {
    "red_x_points": [
      [-0.0001, 0],
      [-6e-5, 0],
      [-9e-5, 0],
      [-0.0001, 0],
      [-6e-5, 0],
      [-0.0001, 0],
      [1e-5, 2],
      [-9e-5, 0],
      [-0.0001, 0],
      [-6e-5, 0],
      [1e-5, 2],
      [0.00011, 1],
      [-0.0, 2],
      [-6e-5, 0],
      [-0.0, 2],
      [-5e-5, 0],
      [-0.0, 2],
      [-0.0, 2],
      [1e-5, 2],
      [-5e-5, 0],
      [-0.0, 2],
      [1e-5, 2],
      [-1e-5, 2],
      [-0.0001, 0],
      [-0.0, 2],
      [-0.0001, 0],
      [1e-5, 2],
      [0.0001, 1],
      [-6e-5, 0]
    ],
    "red_o_points": [],
    "y_categories": ["N", "NOT APPLICABLE", "nan"],
    "blue_o_points": [],
    "blue_x_points": [
      [0.0003, 1],
      [1e-5, 2],
      [0.0001, 1],
      [1e-5, 2],
      [0.00022, 1],
      [0.00022, 1]
    ]
  },
  "QS_mulTransfSite[PhMc]": {
    "red_x_points": [
      [-0.00116, 3],
      [-0.00216, 0],
      [-0.002, 0],
      [-0.00209, 0],
      [-0.00232, 0],
      [-0.00214, 0],
      [-0.00409, 2],
      [-0.00118, 3],
      [-0.00218, 0],
      [-0.00192, 0],
      [-0.00198, 0],
      [-0.00132, 3],
      [0.00678, 1],
      [-0.00143, 3],
      [-0.00201, 0],
      [-0.00136, 3],
      [-0.00202, 0],
      [-0.0023, 0],
      [-0.00118, 3],
      [-0.00144, 3],
      [-0.00122, 3],
      [-0.0039, 2],
      [-0.00137, 3],
      [-0.00104, 3],
      [-0.00136, 3],
      [-0.002, 0],
      [-0.00146, 3],
      [-0.00198, 0],
      [-0.00102, 3],
      [0.00623, 1],
      [-0.00211, 0]
    ],
    "red_o_points": [],
    "y_categories": ["N", "NOT APPLICABLE", "Y", "nan"],
    "blue_o_points": [],
    "blue_x_points": [
      [0.00853, 1],
      [-0.00072, 3],
      [0.00639, 1],
      [-0.00187, 0],
      [-0.00077, 3],
      [0.00632, 1],
      [0.00676, 1]
    ]
  },
  "QA_mulInjTbpiCause[Motorcycle]": {
    "red_x_points": [
      [0.00146, 0],
      [-0.00089, 1],
      [-0.00124, 1],
      [-0.00089, 1],
      [-0.00184, 1],
      [-0.0008, 1],
      [-0.00121, 1],
      [-0.00124, 1],
      [-0.00117, 1],
      [-0.00086, 1],
      [-0.00067, 1],
      [0.00117, 0],
      [-0.04151, 1],
      [-0.00143, 1],
      [-0.00151, 1],
      [-0.00154, 1],
      [-0.00091, 1],
      [-0.00162, 1],
      [0.0016, 0],
      [-0.00072, 1],
      [-0.00079, 1],
      [-0.00078, 1],
      [-0.00117, 1],
      [-0.00305, 1],
      [0.00186, 0],
      [-0.00084, 1],
      [-0.00088, 1],
      [-0.00081, 1],
      [-0.00117, 1],
      [-0.04041, 1],
      [-0.00067, 1]
    ],
    "red_o_points": [],
    "y_categories": ["N", "Y", "nan"],
    "blue_o_points": [],
    "blue_x_points": [
      [0.01931, 0],
      [-0.00083, 1],
      [0.01766, 0],
      [-0.002, 1],
      [-0.00107, 1],
      [0.01785, 0],
      [0.01811, 0]
    ]
  },
  "QS_mulLysisRoot[C6]": {
    "red_x_points": [
      [-0.00081, 3],
      [-0.0012, 0],
      [-0.00227, 2],
      [-0.00114, 0],
      [-0.00115, 0],
      [-0.0009, 0],
      [-0.00105, 0],
      [-0.00065, 3],
      [-0.00103, 0],
      [-0.00114, 0],
      [-0.0012, 0],
      [-0.00055, 3],
      [0.00373, 1],
      [-0.00062, 3],
      [-0.00096, 0],
      [-0.00085, 3],
      [-0.00119, 0],
      [-0.00114, 0],
      [-0.00077, 3],
      [-0.0007, 3],
      [-0.00057, 3],
      [-0.00111, 0],
      [-0.00069, 3],
      [-0.0006, 3],
      [-0.00065, 3],
      [-0.0011, 0],
      [-0.00066, 3],
      [-0.0013, 0],
      [-0.00064, 3],
      [0.00385, 1],
      [-0.00221, 2]
    ],
    "red_o_points": [],
    "y_categories": ["N", "NOT APPLICABLE", "Y", "nan"],
    "blue_o_points": [],
    "blue_x_points": [
      [0.00383, 1],
      [-0.00044, 3],
      [0.00385, 1],
      [-0.00118, 0],
      [-0.00037, 3],
      [0.00421, 1],
      [0.00458, 1]
    ]
  },
  "QS_mulGraftLevel[Trunk]": {
    "red_x_points": [
      [-0.00017, 3],
      [-0.00022, 0],
      [-0.00017, 0],
      [-0.00013, 0],
      [-0.00019, 0],
      [-0.00019, 0],
      [-0.00018, 0],
      [-0.00012, 3],
      [-0.00016, 0],
      [-9e-5, 0],
      [-0.00016, 0],
      [-0.00016, 3],
      [0.0007, 1],
      [-0.00033, 3],
      [-0.00122, 2],
      [-0.0003, 3],
      [-0.00013, 0],
      [-0.0002, 0],
      [-0.00011, 3],
      [-0.00014, 3],
      [-6e-5, 3],
      [-0.00022, 0],
      [-0.00024, 3],
      [-0.0001, 3],
      [-0.00012, 3],
      [-0.00013, 0],
      [-0.00018, 3],
      [-0.00019, 0],
      [-0.00015, 3],
      [0.00041, 1],
      [-0.00023, 0]
    ],
    "red_o_points": [],
    "y_categories": ["N", "NOT APPLICABLE", "Y", "nan"],
    "blue_o_points": [],
    "blue_x_points": [
      [0.00086, 1],
      [-0.00022, 3],
      [0.00063, 1],
      [0.00045, 0],
      [4e-5, 3],
      [0.00067, 1],
      [0.00067, 1]
    ]
  }
}
