{
  "QA_lstPexMuscstrength[ElbowFlex]": {
    "red_x_points": [
      [-0.01125, 1],
      [-0.00051, 2],
      [-0.01005, 1],
      [-0.00974, 1],
      [-0.01028, 1],
      [-0.0107, 1],
      [-0.01067, 1],
      [-0.00997, 1],
      [-0.01027, 1],
      [-0.01133, 1],
      [-0.01051, 1],
      [-0.0116, 1],
      [-0.00025, 2],
      [-0.0029, 2],
      [0.00073, 2],
      [-0.01093, 1],
      [-0.01081, 1],
      [-0.01036, 1],
      [-0.00966, 1],
      [-0.01117, 1],
      [-8e-5, 2],
      [-0.01037, 1],
      [-0.01143, 1],
      [-0.01106, 1],
      [-0.00952, 1],
      [0.00073, 2],
      [-0.00941, 1],
      [-0.01081, 1],
      [-0.00031, 2]
    ],
    "red_o_points": [],
    "y_categories": ["GREATER THAN OR EQUALS TO 3", "LESS THAN 3", "nan"],
    "blue_o_points": [],
    "blue_x_points": [
      [0.00153, 2],
      [-0.00982, 1],
      [0.05318, 0],
      [-0.0104, 1],
      [0.00281, 2],
      [0.0023, 2],
      [0.04073, 0],
      [-0.00932, 1],
      [-0.01027, 1],
      [0.00178, 2],
      [0.05135, 0],
      [0.04064, 0],
      [0.04841, 0],
      [0.04128, 0],
      [-0.00973, 1]
    ]
  },
  "QS_mulGraftNerve[other]": {
    "red_x_points": [
      [3e-5, 2],
      [-0.00011, 0],
      [-4e-5, 0],
      [-8e-5, 0],
      [-8e-5, 0],
      [1e-5, 2],
      [-4e-5, 0],
      [-4e-5, 0],
      [2e-5, 2],
      [-0.00015, 0],
      [-7e-5, 0],
      [3e-5, 2],
      [3e-5, 2],
      [-4e-5, 0],
      [-8e-5, 0],
      [7e-5, 1],
      [3e-5, 2]
    ],
    "red_o_points": [],
    "y_categories": ["N", "NOT APPLICABLE", "nan"],
    "blue_o_points": [],
    "blue_x_points": [[0.00038, 1], [3e-5, 2], [7e-5, 1], [3e-5, 2], [0.0, 2]]
  },
  "QS_mulLysisTrunk[Upper]": {
    "red_x_points": [
      [-0.00052, 3],
      [-0.00612, 0],
      [-0.00372, 0],
      [-0.00342, 0],
      [-0.00385, 0],
      [-0.01497, 2],
      [-0.00393, 0],
      [-0.00082, 3],
      [-0.00375, 0],
      [-0.00337, 0],
      [-0.00086, 3],
      [-0.00382, 0],
      [-0.00096, 3],
      [-0.00524, 0],
      [-0.0132, 2],
      [-0.00072, 3],
      [-0.00079, 3],
      [-0.00063, 3],
      [-0.00426, 0],
      [-0.00073, 3],
      [-0.00075, 3],
      [-0.00072, 3],
      [-0.0041, 0],
      [-0.00432, 0],
      [-0.00089, 3],
      [0.01463, 1],
      [-0.00074, 3],
      [-0.0121, 2],
      [-0.0009, 3]
    ],
    "red_o_points": [],
    "y_categories": ["N", "NOT APPLICABLE", "Y", "nan"],
    "blue_o_points": [],
    "blue_x_points": [
      [0.02359, 1],
      [-0.0004, 3],
      [-0.0018, 0],
      [-0.00154, 0],
      [0.00015, 3],
      [0.02287, 1],
      [0.01538, 1],
      [-0.00251, 0],
      [-0.0005, 3],
      [-0.00012, 3],
      [-0.00195, 0],
      [0.01708, 1],
      [-0.00039, 3],
      [0.01634, 1],
      [-0.00062, 3]
    ]
  },
  "QS_mulBpsurgeryType[Transf]": {
    "red_x_points": [
      [-4e-5, 3],
      [-0.00029, 2],
      [-0.00212, 0],
      [-0.00015, 2],
      [-0.00038, 2],
      [-0.00016, 2],
      [-0.00038, 2],
      [-0.00017, 3],
      [-0.00032, 2],
      [-0.00013, 2],
      [-3e-5, 3],
      [-0.00031, 2],
      [-0.00019, 3],
      [-0.00032, 2],
      [-0.00025, 2],
      [-4e-5, 3],
      [-4e-5, 3],
      [-3e-5, 3],
      [-0.00013, 2],
      [-2e-5, 3],
      [-0.00019, 3],
      [-0.00016, 3],
      [-0.00019, 2],
      [-0.00023, 2],
      [-0.00011, 3],
      [0.00079, 1],
      [-9e-5, 3],
      [-0.00015, 2],
      [-0.00022, 3]
    ],
    "red_o_points": [],
    "y_categories": ["N", "NOT APPLICABLE", "Y", "nan"],
    "blue_o_points": [],
    "blue_x_points": [
      [0.00257, 1],
      [-7e-5, 3],
      [-2e-5, 2],
      [-0.00018, 2],
      [-1e-5, 3],
      [0.00102, 1],
      [0.00045, 1],
      [-7e-5, 2],
      [-5e-5, 3],
      [-2e-5, 3],
      [9e-5, 2],
      [0.00133, 1],
      [-2e-5, 3],
      [0.00109, 1],
      [-3e-5, 3]
    ]
  },
  "participant_code": {
    "red_x_points": [
      [-0.03455, 1],
      [-0.03476, 2],
      [-0.03592, 3],
      [-0.03544, 4],
      [-0.03304, 5],
      [-0.0351, 8],
      [-0.03448, 9],
      [-0.0338, 10],
      [-0.03373, 11],
      [-0.03435, 13],
      [-0.03352, 14],
      [-0.03421, 18],
      [-0.03538, 19],
      [-0.03476, 20],
      [-0.034, 23],
      [-0.03496, 26],
      [-0.03339, 28],
      [-0.03373, 29],
      [-0.03435, 30],
      [-0.03332, 31],
      [-0.03435, 32],
      [-0.03421, 34],
      [-0.03407, 36],
      [-0.03373, 38],
      [-0.03435, 39],
      [-0.03387, 40],
      [-0.03455, 41],
      [-0.03394, 42],
      [-0.0351, 43]
    ],
    "red_o_points": [],
    "y_categories": [
      "P16554",
      "P18297",
      "P19283",
      "P19287",
      "P23172",
      "P23391",
      "P30595",
      "P31645",
      "P31691",
      "P34778",
      "P35046",
      "P36328",
      "P43633",
      "P4544",
      "P46417",
      "P48965",
      "P53068",
      "P5497",
      "P58556",
      "P59529",
      "P62483",
      "P64658",
      "P65202",
      "P66816",
      "P6751",
      "P7408",
      "P75566",
      "P76226",
      "P79971",
      "P82621",
      "P82990",
      "P84549",
      "P84932",
      "P85825",
      "P86989",
      "P8770",
      "P87791",
      "P90550",
      "P93159",
      "P94969",
      "P96710",
      "P97130",
      "P9744",
      "P98500",
      "nan"
    ],
    "blue_o_points": [],
    "blue_x_points": [
      [0.06478, 0],
      [0.06688, 6],
      [0.06741, 7],
      [0.06452, 12],
      [0.06596, 15],
      [0.06504, 16],
      [0.06478, 17],
      [0.06688, 21],
      [0.06518, 22],
      [0.06504, 24],
      [0.06793, 25],
      [0.0678, 27],
      [0.06688, 33],
      [0.06767, 35],
      [0.0682, 37]
    ]
  },
  "QS_mulNeuromadSite[C8]": {
    "red_x_points": [
      [-8e-5, 2],
      [-0.00036, 0],
      [-0.00019, 0],
      [-0.00011, 0],
      [-0.00025, 0],
      [-0.00015, 0],
      [-0.00023, 0],
      [-6e-5, 2],
      [-0.00027, 0],
      [-0.00019, 0],
      [-3e-5, 2],
      [-0.00018, 0],
      [-4e-5, 2],
      [-0.00026, 0],
      [-7e-5, 0],
      [-0.00019, 2],
      [-5e-5, 2],
      [-0.00012, 2],
      [-0.00015, 0],
      [-0.00013, 2],
      [-1e-5, 2],
      [-5e-5, 2],
      [-0.00013, 0],
      [-0.00012, 0],
      [-5e-5, 2],
      [0.00023, 1],
      [-2e-5, 2],
      [-0.00017, 0],
      [-1e-5, 2]
    ],
    "red_o_points": [],
    "y_categories": ["N", "NOT APPLICABLE", "nan"],
    "blue_o_points": [],
    "blue_x_points": [
      [0.00154, 1],
      [-1e-5, 2],
      [-0.0, 0],
      [0.00014, 0],
      [1e-5, 2],
      [0.00068, 1],
      [0.00042, 1],
      [-4e-5, 0],
      [-0.0, 2],
      [2e-5, 2],
      [0.0, 0],
      [0.0005, 1],
      [-0.00012, 2],
      [0.00037, 1],
      [-8e-5, 2]
    ]
  },
  "QS_mulGraftNerve[Ph]": {
    "red_x_points": [
      [1e-5, 2],
      [-6e-5, 0],
      [-6e-5, 0],
      [-3e-5, 0],
      [-6e-5, 0],
      [-3e-5, 0],
      [-6e-5, 0],
      [0.0, 2],
      [-3e-5, 0],
      [-3e-5, 0],
      [0.0, 2],
      [-3e-5, 0],
      [1e-5, 2],
      [-6e-5, 0],
      [-3e-5, 0],
      [0.0, 2],
      [0.0, 2],
      [0.0, 2],
      [1e-5, 2],
      [-6e-5, 0],
      [-6e-5, 0],
      [0.0, 2],
      [9e-5, 1],
      [-3e-5, 0],
      [1e-5, 2]
    ],
    "red_o_points": [],
    "y_categories": ["N", "NOT APPLICABLE", "nan"],
    "blue_o_points": [],
    "blue_x_points": [
      [0.00026, 1],
      [1e-5, 2],
      [-3e-5, 0],
      [9e-5, 1],
      [9e-5, 1],
      [-3e-5, 0],
      [0.0, 2],
      [0.0, 2],
      [-3e-5, 0],
      [0.0, 2],
      [9e-5, 1],
      [0.0, 2]
    ]
  },
  "QS_mulTransfSite[AcSsPA]": {
    "red_x_points": [
      [-0.0001, 3],
      [-0.00072, 0],
      [-0.00046, 0],
      [-0.00037, 0],
      [-0.00047, 0],
      [-0.00027, 0],
      [-0.00046, 0],
      [-7e-5, 3],
      [-0.00037, 0],
      [-0.00039, 0],
      [-8e-5, 3],
      [-0.00038, 0],
      [-0.00015, 3],
      [-0.00066, 0],
      [-0.00255, 2],
      [-7e-5, 3],
      [-8e-5, 3],
      [-8e-5, 3],
      [-0.00041, 0],
      [-9e-5, 3],
      [-6e-5, 3],
      [-0.0001, 3],
      [-0.00056, 0],
      [-0.00037, 0],
      [-7e-5, 3],
      [0.00127, 1],
      [-9e-5, 3],
      [-0.0003, 0],
      [-2e-5, 3]
    ],
    "red_o_points": [],
    "y_categories": ["N", "NOT APPLICABLE", "Y", "nan"],
    "blue_o_points": [],
    "blue_x_points": [
      [0.00214, 1],
      [-4e-5, 3],
      [-0.00019, 0],
      [-0.00017, 0],
      [2e-5, 3],
      [0.00254, 1],
      [0.00133, 1],
      [-0.00031, 0],
      [-7e-5, 3],
      [-2e-5, 3],
      [-6e-5, 0],
      [0.00185, 1],
      [-4e-5, 3],
      [0.00161, 1],
      [-5e-5, 3]
    ]
  },
  "QA_lstPexPalle[Elbow]": {
    "red_x_points": [
      [-0.00057, 4],
      [-0.00314, 4],
      [-0.00253, 4],
      [-0.00192, 3],
      [-0.00391, 4],
      [-0.0018, 3],
      [-0.00357, 4],
      [-0.00047, 4],
      [-0.00505, 4],
      [-0.00147, 3],
      [-0.00503, 1],
      [-0.00572, 4],
      [-0.00069, 4],
      [-0.00615, 4],
      [-0.00182, 4],
      [0.00055, 3],
      [-0.01193, 0],
      [0.00016, 3],
      [-0.00826, 2],
      [0.00066, 3],
      [-0.00051, 4],
      [-0.00053, 4],
      [-0.00647, 4],
      [-0.00425, 4],
      [-0.0002, 4],
      [-0.02563, 3],
      [-0.00026, 4],
      [-0.00581, 0],
      [-0.00048, 4]
    ],
    "red_o_points": [],
    "y_categories": ["ABS", "HYPO", "NAIA", "PT", "nan"],
    "blue_o_points": [],
    "blue_x_points": [
      [0.00437, 4],
      [0.00015, 4],
      [0.00392, 3],
      [0.03971, 1],
      [4e-5, 4],
      [0.00453, 4],
      [0.01022, 1],
      [-0.00338, 4],
      [0.00079, 4],
      [0.00073, 4],
      [0.02818, 1],
      [0.0042, 4],
      [0.00222, 3],
      [0.00454, 4],
      [0.00658, 3]
    ]
  },
  "QA_lstPexArthre[Index]": {
    "red_x_points": [
      [-0.00999, 0],
      [-0.00565, 2],
      [-0.00385, 2],
      [-0.00679, 0],
      [-0.00956, 0],
      [0.00737, 1],
      [-0.00965, 0],
      [0.00078, 2],
      [0.01062, 1],
      [-0.01539, 0],
      [0.00335, 1],
      [-0.00786, 2],
      [0.00043, 2],
      [0.01058, 1],
      [-0.00267, 2],
      [0.00333, 1],
      [-0.01065, 0],
      [0.00262, 1],
      [-0.00514, 2],
      [-0.01307, 0],
      [0.0003, 2],
      [0.00044, 2],
      [-0.00803, 2],
      [-0.00653, 2],
      [0.00266, 1],
      [-0.00119, 2],
      [0.00045, 2],
      [-0.00617, 0],
      [0.00051, 2]
    ],
    "red_o_points": [],
    "y_categories": ["NPV", "PV", "nan"],
    "blue_o_points": [],
    "blue_x_points": [
      [8e-5, 0],
      [0.0015, 2],
      [0.01467, 1],
      [0.01628, 1],
      [0.0032, 2],
      [-0.00026, 2],
      [0.00194, 1],
      [0.01312, 1],
      [0.00151, 2],
      [0.0013, 2],
      [0.01241, 1],
      [0.00188, 1],
      [0.00456, 1],
      [-0.0002, 2],
      [0.00676, 1]
    ]
  },
  "QA_mulInjOrthesisType[ArmSling]": {
    "red_x_points": [
      [-0.00888, 2],
      [-0.00836, 2],
      [-0.00797, 2],
      [-0.00798, 2],
      [-0.00841, 2],
      [-0.00839, 2],
      [-0.00819, 2],
      [-0.00823, 2],
      [-0.00817, 2],
      [-0.0085, 2],
      [-0.00886, 2],
      [-0.00814, 2],
      [-0.00864, 2],
      [-0.00871, 2],
      [-0.02731, 0],
      [-0.0087, 2],
      [-0.00898, 2],
      [-0.02783, 0],
      [-0.02638, 3],
      [-0.00888, 2],
      [-0.00884, 2],
      [-0.00817, 2],
      [-0.00866, 2],
      [-0.0087, 2],
      [-0.02616, 3],
      [-0.02749, 3],
      [-0.02595, 3],
      [-0.00835, 2],
      [-0.00843, 2]
    ],
    "red_o_points": [],
    "y_categories": ["N", "NOT APPLICABLE", "Y", "nan"],
    "blue_o_points": [],
    "blue_x_points": [
      [-0.00783, 2],
      [-0.0082, 2],
      [-0.00806, 2],
      [-0.0079, 2],
      [0.052, 1],
      [0.05186, 1],
      [0.05049, 1],
      [0.05057, 1],
      [-0.00792, 2],
      [0.05258, 1],
      [-0.00807, 2],
      [0.05043, 1],
      [0.05236, 1],
      [0.0522, 1],
      [-0.00826, 2]
    ]
  },
  "QS_lstBpsurgSide": {
    "red_x_points": [
      [-0.00033, 3],
      [-0.01292, 0],
      [-0.01433, 0],
      [-0.01128, 0],
      [-0.01398, 0],
      [-0.0123, 0],
      [-0.01351, 0],
      [-0.00135, 3],
      [-0.01379, 0],
      [0.00128, 2],
      [-0.00081, 3],
      [0.0002, 2],
      [-0.00125, 3],
      [0.00106, 2],
      [-0.00297, 2],
      [-0.00062, 3],
      [-0.00049, 3],
      [-0.00052, 3],
      [-0.0085, 0],
      [-0.00053, 3],
      [-0.00119, 3],
      [-0.0012, 3],
      [0.0002, 2],
      [0.00028, 2],
      [-0.00132, 3],
      [0.01498, 1],
      [-0.00128, 3],
      [-0.01223, 0],
      [-0.00144, 3]
    ],
    "red_o_points": [],
    "y_categories": ["L", "NOT APPLICABLE", "R", "nan"],
    "blue_o_points": [],
    "blue_x_points": [
      [0.03227, 1],
      [-0.00064, 3],
      [0.0045, 2],
      [0.00741, 2],
      [9e-5, 3],
      [0.02011, 1],
      [0.01283, 1],
      [-0.00373, 0],
      [-0.00064, 3],
      [-0.00031, 3],
      [0.00355, 2],
      [0.01711, 1],
      [-0.00015, 3],
      [0.0182, 1],
      [-0.00048, 3]
    ]
  },
  "QA_mulInjOrthesisType[ShoulderSupport]": {
    "red_x_points": [
      [-0.00869, 0],
      [-0.00885, 0],
      [-0.00916, 0],
      [-0.03236, 2],
      [-0.00876, 0],
      [-0.00882, 0],
      [-0.00869, 0],
      [-0.03222, 2],
      [-0.00894, 0],
      [-0.0089, 0],
      [-0.00882, 0],
      [-0.00882, 0],
      [-0.00888, 0],
      [-0.00874, 0],
      [-0.03171, 2],
      [-0.00875, 0],
      [-0.00873, 0],
      [-0.03317, 2],
      [-0.03203, 3],
      [-0.00836, 0],
      [-0.00861, 0],
      [-0.00879, 0],
      [-0.00876, 0],
      [-0.00889, 0],
      [-0.03367, 3],
      [-0.03316, 3],
      [-0.03209, 3],
      [-0.00911, 0],
      [-0.00866, 0]
    ],
    "red_o_points": [],
    "y_categories": ["N", "NOT APPLICABLE", "Y", "nan"],
    "blue_o_points": [],
    "blue_x_points": [
      [-0.00864, 0],
      [-0.00791, 0],
      [-0.00853, 0],
      [-0.00857, 0],
      [0.06628, 1],
      [0.06404, 1],
      [0.06084, 1],
      [0.06136, 1],
      [-0.00798, 0],
      [0.06338, 1],
      [-0.00828, 0],
      [0.06167, 1],
      [0.06466, 1],
      [0.06154, 1],
      [-0.00874, 0]
    ]
  },
  "QA_yonInjUnconscio": {
    "red_x_points": [
      [-0.01551, 1],
      [-0.01517, 1],
      [-0.00233, 2],
      [-0.0026, 2],
      [-0.00258, 2],
      [-0.01629, 1],
      [-0.00216, 2],
      [-0.00334, 2],
      [-0.00259, 2],
      [-0.01665, 1],
      [-0.01486, 1],
      [-0.01647, 1],
      [-0.00355, 2],
      [-0.00276, 2],
      [-0.01137, 1],
      [-0.01542, 1],
      [-0.01524, 1],
      [-0.01175, 1],
      [-0.01199, 1],
      [-0.01508, 1],
      [-0.00424, 2],
      [-0.00321, 2],
      [-0.01798, 1],
      [-0.01547, 1],
      [-0.00364, 2],
      [-0.00291, 2],
      [-0.00354, 2],
      [-0.01552, 1],
      [-0.00387, 2]
    ],
    "red_o_points": [],
    "y_categories": ["N", "Y", "nan"],
    "blue_o_points": [],
    "blue_x_points": [
      [-0.00152, 2],
      [-0.00196, 2],
      [0.05788, 0],
      [-0.00126, 2],
      [-0.00852, 1],
      [-0.00987, 1],
      [0.03745, 0],
      [0.04877, 0],
      [-0.00226, 2],
      [0.04869, 0],
      [0.05684, 0],
      [-0.0021, 2],
      [-0.00975, 1],
      [-0.0021, 2],
      [0.05783, 0]
    ]
  },
  "QA_lstPexInspectio[SurgicalScar]": {
    "red_x_points": [
      [-0.00352, 1],
      [-0.00524, 1],
      [-0.0075, 0],
      [-0.0038, 1],
      [-0.00713, 1],
      [-0.01218, 0],
      [-0.00662, 1],
      [-0.00254, 1],
      [-0.01034, 1],
      [-0.01251, 1],
      [-0.00967, 0],
      [-0.01016, 1],
      [-0.00113, 2],
      [-0.01142, 1],
      [-0.00543, 0],
      [0.00696, 2],
      [0.00438, 2],
      [-0.00585, 1],
      [-0.0047, 1],
      [-0.00646, 1],
      [0.00037, 2],
      [-0.00298, 1],
      [-0.01049, 1],
      [0.01471, 2],
      [-0.00298, 1],
      [-0.00494, 1],
      [-0.00142, 1],
      [0.00486, 2],
      [-0.00273, 1]
    ],
    "red_o_points": [],
    "y_categories": ["ABS", "NAIA", "PT", "nan"],
    "blue_o_points": [],
    "blue_x_points": [
      [-0.00063, 1],
      [0.0083, 2],
      [0.02811, 2],
      [0.03497, 2],
      [0.00154, 1],
      [0.00046, 1],
      [0.00176, 0],
      [-0.00556, 1],
      [-0.00052, 1],
      [0.00208, 1],
      [0.0273, 2],
      [-0.00057, 1],
      [0.00852, 2],
      [0.00291, 0],
      [0.01179, 2]
    ]
  },
  "QS_mulBpsurgeryType[Lysis]": {
    "red_x_points": [
      [-0.00123, 3],
      [-0.00517, 0],
      [-0.01796, 2],
      [-0.01493, 2],
      [-0.00362, 0],
      [-0.01865, 2],
      [-0.00336, 0],
      [-0.0013, 3],
      [-0.00301, 0],
      [-0.00269, 0],
      [-0.00138, 3],
      [-0.00321, 0],
      [-0.00167, 3],
      [-0.00526, 0],
      [-0.01651, 2],
      [-0.00126, 3],
      [-0.00113, 3],
      [-0.00106, 3],
      [-0.00314, 0],
      [-0.00119, 3],
      [-0.00163, 3],
      [-0.00168, 3],
      [-0.00365, 0],
      [-0.00321, 0],
      [-0.00146, 3],
      [0.0188, 1],
      [-0.00154, 3],
      [-0.01673, 2],
      [-0.0014, 3]
    ],
    "red_o_points": [],
    "y_categories": ["N", "NOT APPLICABLE", "Y", "nan"],
    "blue_o_points": [],
    "blue_x_points": [
      [0.03605, 1],
      [-0.0007, 3],
      [-0.0004, 0],
      [-0.00109, 0],
      [0.00018, 3],
      [0.02786, 1],
      [0.0194, 1],
      [-0.00126, 0],
      [-0.00078, 3],
      [-0.00057, 3],
      [-0.00075, 0],
      [0.02213, 1],
      [-0.00044, 3],
      [0.02169, 1],
      [-0.0011, 3]
    ]
  },
  "QS_mulLysisSite[Trunk]": {
    "red_x_points": [
      [-0.00055, 3],
      [-0.00437, 0],
      [-0.00361, 0],
      [-0.00297, 0],
      [-0.0035, 0],
      [-0.01299, 2],
      [-0.00359, 0],
      [-0.00069, 3],
      [-0.00333, 0],
      [-0.00329, 0],
      [-0.00086, 3],
      [-0.00374, 0],
      [-0.00078, 3],
      [-0.00433, 0],
      [-0.01133, 2],
      [-0.00086, 3],
      [-0.00058, 3],
      [-0.00077, 3],
      [-0.00303, 0],
      [-0.00061, 3],
      [-0.00075, 3],
      [-0.00057, 3],
      [-0.00369, 0],
      [-0.00359, 0],
      [-0.00096, 3],
      [0.01188, 1],
      [-0.00065, 3],
      [-0.01135, 2],
      [-0.00063, 3]
    ],
    "red_o_points": [],
    "y_categories": ["N", "NOT APPLICABLE", "Y", "nan"],
    "blue_o_points": [],
    "blue_x_points": [
      [0.02412, 1],
      [-0.00019, 3],
      [-0.00162, 0],
      [-0.00184, 0],
      [-0.0001, 3],
      [0.01723, 1],
      [0.01368, 1],
      [-0.00234, 0],
      [-0.00027, 3],
      [-0.00036, 3],
      [-0.00132, 0],
      [0.01441, 1],
      [-0.00028, 3],
      [0.01572, 1],
      [-0.00073, 3]
    ]
  },
  "QS_mulGraftTrunk[UpperTrunk]": {
    "red_x_points": [
      [-0.00017, 3],
      [-0.0024, 0],
      [-0.00139, 0],
      [-0.00129, 0],
      [-0.00171, 0],
      [-0.00092, 0],
      [-0.00153, 0],
      [-0.0004, 3],
      [-0.00131, 0],
      [-0.00126, 0],
      [-0.00022, 3],
      [-0.00151, 0],
      [-0.00017, 3],
      [-0.01071, 2],
      [-0.00249, 0],
      [-0.00023, 3],
      [-0.00018, 3],
      [-0.00025, 3],
      [-0.00094, 0],
      [-0.00019, 3],
      [-0.00041, 3],
      [-0.00038, 3],
      [-0.00156, 0],
      [-0.00134, 0],
      [-0.00054, 3],
      [0.00417, 1],
      [-0.00046, 3],
      [-0.00097, 0],
      [-0.00034, 3]
    ],
    "red_o_points": [],
    "y_categories": ["N", "NOT APPLICABLE", "Y", "nan"],
    "blue_o_points": [],
    "blue_x_points": [
      [0.01136, 1],
      [-0.00021, 3],
      [0.00019, 0],
      [0.00024, 0],
      [7e-5, 3],
      [0.00693, 1],
      [0.00367, 1],
      [-0.00025, 0],
      [-0.00015, 3],
      [-8e-5, 3],
      [-0.00017, 0],
      [0.00542, 1],
      [-0.00015, 3],
      [0.00446, 1],
      [-0.00021, 3]
    ]
  },
  "QS_mulTransfSite[PhMc]": {
    "red_x_points": [
      [-0.00043, 3],
      [-0.00284, 0],
      [-0.00196, 0],
      [-0.00142, 0],
      [-0.00202, 0],
      [-0.00159, 0],
      [-0.00727, 2],
      [-0.00047, 3],
      [-0.00193, 0],
      [-0.00159, 0],
      [-0.00036, 3],
      [-0.00213, 0],
      [-0.00067, 3],
      [-0.00255, 0],
      [-0.00209, 0],
      [-0.00059, 3],
      [-0.00025, 3],
      [-0.00046, 3],
      [-0.00532, 2],
      [-0.0004, 3],
      [-0.00054, 3],
      [-0.00051, 3],
      [-0.00213, 0],
      [-0.00191, 0],
      [-0.00056, 3],
      [0.00695, 1],
      [-0.00042, 3],
      [-0.00195, 0],
      [-0.00042, 3]
    ],
    "red_o_points": [],
    "y_categories": ["N", "NOT APPLICABLE", "Y", "nan"],
    "blue_o_points": [],
    "blue_x_points": [
      [0.01224, 1],
      [-0.00024, 3],
      [-0.00113, 0],
      [-0.00127, 0],
      [-9e-5, 3],
      [0.00913, 1],
      [0.00593, 1],
      [-0.00136, 0],
      [-0.00016, 3],
      [-9e-5, 3],
      [-0.00099, 0],
      [0.00787, 1],
      [-0.00043, 3],
      [0.00853, 1],
      [-0.0001, 3]
    ]
  },
  "QS_mulLysisRoot[C6]": {
    "red_x_points": [
      [-0.00013, 3],
      [-0.00378, 0],
      [-0.01063, 2],
      [-0.00238, 0],
      [-0.00294, 0],
      [-0.00271, 0],
      [-0.00304, 0],
      [-0.00072, 3],
      [-0.00345, 0],
      [-0.00246, 0],
      [-0.00016, 3],
      [-0.00331, 0],
      [-0.00074, 3],
      [-0.00368, 0],
      [-0.00332, 0],
      [-0.00016, 3],
      [-0.00022, 3],
      [-0.00014, 3],
      [-0.00261, 0],
      [-0.00019, 3],
      [-0.00048, 3],
      [-0.00054, 3],
      [-0.00333, 0],
      [-0.00312, 0],
      [-0.00082, 3],
      [0.00824, 1],
      [-0.00056, 3],
      [-0.00847, 2],
      [-0.00065, 3]
    ],
    "red_o_points": [],
    "y_categories": ["N", "NOT APPLICABLE", "Y", "nan"],
    "blue_o_points": [],
    "blue_x_points": [
      [0.0191, 1],
      [-0.00014, 3],
      [-0.00102, 0],
      [-0.00182, 0],
      [0.00033, 3],
      [0.01311, 1],
      [0.0087, 1],
      [-0.00165, 0],
      [-0.00026, 3],
      [-4e-5, 3],
      [-0.00104, 0],
      [0.01061, 1],
      [4e-5, 3],
      [0.01089, 1],
      [-0.0003, 3]
    ]
  },
  "QA_lstPexInspectio[ShoulderSubdisloc]": {
    "red_x_points": [
      [-0.00177, 1],
      [-0.00542, 1],
      [0.00401, 0],
      [-0.00313, 1],
      [-0.00698, 1],
      [-0.0031, 2],
      [-0.0057, 1],
      [-0.00261, 1],
      [-0.00837, 1],
      [-0.00982, 1],
      [-0.00234, 2],
      [-0.00885, 1],
      [-0.00265, 1],
      [-0.01103, 1],
      [-0.00272, 1],
      [-0.00398, 2],
      [-0.00097, 2],
      [0.00019, 1],
      [-0.0044, 1],
      [-0.00114, 1],
      [-0.01026, 0],
      [0.00481, 2],
      [-0.00209, 2],
      [-0.00059, 2],
      [-0.0014, 1],
      [-0.01677, 2],
      [-0.00199, 1],
      [-0.00105, 2],
      [-0.00416, 1]
    ],
    "red_o_points": [],
    "y_categories": ["ABS", "NAIA", "PT", "nan"],
    "blue_o_points": [],
    "blue_x_points": [
      [0.00601, 1],
      [0.00948, 2],
      [0.03574, 0],
      [0.00804, 2],
      [0.00029, 1],
      [0.00659, 1],
      [0.00528, 0],
      [-0.00359, 1],
      [0.01011, 2],
      [0.00015, 1],
      [0.03125, 0],
      [0.00446, 1],
      [0.00255, 1],
      [-0.00408, 2],
      [0.00199, 1]
    ]
  },
  "QS_mulGraftLevel[Trunk]": {
    "red_x_points": [
      [-5e-5, 3],
      [-0.00189, 0],
      [-0.00095, 0],
      [-0.00087, 0],
      [-0.0013, 0],
      [-0.00076, 0],
      [-0.00116, 0],
      [-0.00021, 3],
      [-0.00089, 0],
      [-0.0008, 0],
      [-0.0001, 3],
      [-0.0011, 0],
      [-0.00017, 3],
      [-0.00835, 2],
      [-0.00166, 0],
      [-9e-5, 3],
      [-5e-5, 3],
      [-8e-5, 3],
      [-0.00108, 0],
      [-0.0, 3],
      [-0.00019, 3],
      [-0.00014, 3],
      [-0.00126, 0],
      [-0.0012, 0],
      [-0.00016, 3],
      [0.00321, 1],
      [-0.00018, 3],
      [-0.00084, 0],
      [-0.00016, 3]
    ],
    "red_o_points": [],
    "y_categories": ["N", "NOT APPLICABLE", "Y", "nan"],
    "blue_o_points": [],
    "blue_x_points": [
      [0.00745, 1],
      [-5e-5, 3],
      [8e-5, 0],
      [0.00067, 0],
      [4e-5, 3],
      [0.00513, 1],
      [0.00246, 1],
      [-0.00013, 0],
      [-1e-5, 3],
      [-1e-5, 3],
      [-0.0002, 0],
      [0.00363, 1],
      [0.0, 3],
      [0.00352, 1],
      [-0.00011, 3]
    ]
  },
  "QA_lstPexPain[C7]": {
    "red_x_points": [
      [-0.00196, 1],
      [-0.00525, 2],
      [-0.00376, 2],
      [-0.00061, 1],
      [-0.0065, 2],
      [-0.0035, 1],
      [-0.00265, 1],
      [-0.00541, 0],
      [-0.00404, 1],
      [0.01037, 0],
      [-0.00129, 1],
      [-0.00766, 2],
      [0.0028, 2],
      [-0.00811, 2],
      [-0.00183, 2],
      [-0.00785, 0],
      [-0.00111, 1],
      [-0.00608, 0],
      [-0.00337, 2],
      [-0.00748, 0],
      [0.00188, 2],
      [0.00198, 2],
      [-0.00769, 2],
      [-0.00578, 2],
      [-0.00489, 0],
      [-0.00261, 1],
      [-0.00176, 1],
      [-0.00139, 1],
      [-0.00148, 1]
    ],
    "red_o_points": [],
    "y_categories": ["NORM", "NPV", "nan"],
    "blue_o_points": [],
    "blue_x_points": [
      [6e-5, 1],
      [0.00333, 1],
      [0.01557, 0],
      [0.02186, 0],
      [0.00759, 2],
      [0.0004, 2],
      [5e-5, 1],
      [0.00162, 1],
      [0.00675, 2],
      [0.00641, 2],
      [0.01408, 0],
      [0.00023, 1],
      [-0.00312, 0],
      [0.0025, 0],
      [0.00969, 1]
    ]
  },
  "QS_mulBpsurgeryType[Graft]": {
    "red_x_points": [
      [-8e-5, 3],
      [-0.00067, 0],
      [-0.00055, 0],
      [-0.00041, 0],
      [-0.00064, 0],
      [-0.0002, 0],
      [-0.00053, 0],
      [-9e-5, 3],
      [-0.00013, 0],
      [-0.00031, 0],
      [-0.00014, 3],
      [-0.00029, 0],
      [-0.00013, 3],
      [-0.00626, 2],
      [-0.0005, 0],
      [-9e-5, 3],
      [-5e-5, 3],
      [-6e-5, 3],
      [-0.00033, 0],
      [-3e-5, 3],
      [-0.00018, 3],
      [-0.00015, 3],
      [-0.0004, 0],
      [-0.00051, 0],
      [-0.0003, 3],
      [0.00105, 1],
      [-0.0001, 3],
      [-0.00033, 0],
      [-0.00016, 3]
    ],
    "red_o_points": [],
    "y_categories": ["N", "NOT APPLICABLE", "Y", "nan"],
    "blue_o_points": [],
    "blue_x_points": [
      [0.00352, 1],
      [-7e-5, 3],
      [0.00054, 0],
      [0.00083, 0],
      [-0.0, 3],
      [0.00185, 1],
      [0.00123, 1],
      [0.0001, 0],
      [-0.0001, 3],
      [-5e-5, 3],
      [0.00038, 0],
      [0.00226, 1],
      [-9e-5, 3],
      [0.00224, 1],
      [-8e-5, 3]
    ]
  },
  "QS_mulNeuromadSite[C5]": {
    "red_x_points": [
      [9e-5, 2],
      [-0.00045, 0],
      [-0.00042, 0],
      [-0.00014, 0],
      [-0.00047, 0],
      [-0.00015, 0],
      [-0.00035, 0],
      [1e-5, 2],
      [-0.00042, 0],
      [-0.00019, 0],
      [7e-5, 2],
      [-0.00038, 0],
      [7e-5, 2],
      [-0.00043, 0],
      [-0.00032, 0],
      [7e-5, 2],
      [6e-5, 2],
      [6e-5, 2],
      [-0.00018, 0],
      [7e-5, 2],
      [3e-5, 2],
      [5e-5, 2],
      [-0.00044, 0],
      [-0.0003, 0],
      [1e-5, 2],
      [6e-5, 1],
      [-3e-5, 2],
      [-0.00018, 0],
      [6e-5, 2]
    ],
    "red_o_points": [],
    "y_categories": ["N", "NOT APPLICABLE", "nan"],
    "blue_o_points": [],
    "blue_x_points": [
      [0.00155, 1],
      [6e-5, 2],
      [-3e-5, 0],
      [-7e-5, 0],
      [9e-5, 2],
      [0.00118, 1],
      [0.00022, 1],
      [-0.0001, 0],
      [9e-5, 2],
      [4e-5, 2],
      [-6e-5, 0],
      [0.00069, 1],
      [7e-5, 2],
      [0.0004, 1],
      [2e-5, 2]
    ]
  },
  "QS_mulNeuromadSite[C7]": {
    "red_x_points": [
      [7e-5, 2],
      [-0.00035, 0],
      [-0.00023, 0],
      [-0.00024, 0],
      [-0.00031, 0],
      [-0.00022, 0],
      [-0.00027, 0],
      [-1e-5, 2],
      [-0.00021, 0],
      [-0.00015, 0],
      [6e-5, 2],
      [-0.00025, 0],
      [-6e-5, 2],
      [-0.00028, 0],
      [-0.00017, 0],
      [-4e-5, 2],
      [7e-5, 2],
      [4e-5, 2],
      [-0.0001, 0],
      [5e-5, 2],
      [-7e-5, 2],
      [-2e-5, 2],
      [-0.00013, 0],
      [-0.00021, 0],
      [-2e-5, 2],
      [0.00019, 1],
      [-2e-5, 2],
      [-0.00016, 0],
      [-6e-5, 2]
    ],
    "red_o_points": [],
    "y_categories": ["N", "NOT APPLICABLE", "nan"],
    "blue_o_points": [],
    "blue_x_points": [
      [0.00124, 1],
      [-1e-5, 2],
      [1e-5, 0],
      [1e-5, 0],
      [1e-5, 2],
      [0.00076, 1],
      [8e-5, 1],
      [-7e-5, 0],
      [-1e-5, 2],
      [-2e-5, 2],
      [-4e-5, 0],
      [0.00054, 1],
      [4e-5, 2],
      [0.00056, 1],
      [1e-5, 2]
    ]
  },
  "QS_mulTransfSite[IMc]": {
    "red_x_points": [
      [-0.00098, 3],
      [-0.02081, 2],
      [-0.0031, 0],
      [-0.01607, 2],
      [-0.00289, 0],
      [-0.00293, 0],
      [-0.00294, 0],
      [-0.00145, 3],
      [-0.00319, 0],
      [-0.00291, 0],
      [-0.00112, 3],
      [-0.00297, 0],
      [-0.00174, 3],
      [-0.00523, 0],
      [-0.01702, 2],
      [-0.00119, 3],
      [-0.0011, 3],
      [-0.00094, 3],
      [-0.00296, 0],
      [-0.00087, 3],
      [-0.00167, 3],
      [-0.00157, 3],
      [-0.00316, 0],
      [-0.01959, 2],
      [-0.00128, 3],
      [0.01923, 1],
      [-0.00124, 3],
      [-0.01736, 2],
      [-0.00148, 3]
    ],
    "red_o_points": [],
    "y_categories": ["N", "NOT APPLICABLE", "Y", "nan"],
    "blue_o_points": [],
    "blue_x_points": [
      [0.03401, 1],
      [-0.00073, 3],
      [-0.0007, 0],
      [-0.00028, 0],
      [-0.00021, 3],
      [0.02675, 1],
      [0.02129, 1],
      [-0.00205, 0],
      [-0.00054, 3],
      [-0.00036, 3],
      [-0.00081, 0],
      [0.02273, 1],
      [-0.00056, 3],
      [0.02262, 1],
      [-0.00064, 3]
    ]
  },
  "QA_yonInjChesttube": {
    "red_x_points": [
      [-0.00244, 2],
      [-0.00279, 2],
      [0.00311, 0],
      [-0.00204, 2],
      [-0.00444, 2],
      [0.00154, 0],
      [-0.00588, 1],
      [-0.00223, 2],
      [-0.00442, 2],
      [-0.004, 2],
      [0.00104, 0],
      [0.00389, 0],
      [-0.00362, 2],
      [-0.00394, 2],
      [0.0011, 0],
      [0.00121, 0],
      [0.00102, 0],
      [0.00135, 0],
      [-0.00391, 1],
      [-0.00153, 2],
      [-0.01615, 1],
      [-0.00385, 2],
      [-0.00424, 2],
      [0.00273, 0],
      [-0.0023, 2],
      [-7e-5, 2],
      [-0.003, 2],
      [0.00044, 0],
      [-0.0035, 2]
    ],
    "red_o_points": [],
    "y_categories": ["N", "Y", "nan"],
    "blue_o_points": [],
    "blue_x_points": [
      [0.00014, 1],
      [-0.00052, 2],
      [0.00399, 0],
      [0.00721, 0],
      [-0.00216, 2],
      [-1e-5, 2],
      [0.00758, 0],
      [0.0181, 0],
      [0.01368, 0],
      [0.00415, 0],
      [-2e-5, 2],
      [0.00446, 0],
      [-2e-5, 2],
      [0.00033, 2]
    ]
  },
  "QS_mulLysisRoot[C7]": {
    "red_x_points": [
      [-6e-5, 3],
      [-0.00063, 0],
      [-0.00326, 2],
      [-0.00053, 0],
      [-0.00077, 0],
      [-0.0005, 0],
      [-0.00075, 0],
      [-0.0001, 3],
      [-0.00068, 0],
      [-0.00058, 0],
      [-3e-5, 3],
      [-0.00057, 0],
      [-9e-5, 3],
      [-0.00061, 0],
      [-0.00057, 0],
      [-3e-5, 3],
      [-6e-5, 3],
      [-3e-5, 3],
      [-0.00061, 0],
      [-5e-5, 3],
      [-0.00016, 3],
      [-0.00015, 3],
      [-0.0007, 0],
      [-0.00058, 0],
      [-8e-5, 3],
      [0.00153, 1],
      [-0.0001, 3],
      [-0.0006, 0],
      [-0.00019, 3]
    ],
    "red_o_points": [],
    "y_categories": ["N", "NOT APPLICABLE", "Y", "nan"],
    "blue_o_points": [],
    "blue_x_points": [
      [0.00445, 1],
      [0.0, 3],
      [-7e-5, 0],
      [-0.00037, 0],
      [1e-5, 3],
      [0.00202, 1],
      [0.00178, 1],
      [-0.00048, 0],
      [-8e-5, 3],
      [-4e-5, 3],
      [-2e-5, 0],
      [0.00194, 1],
      [-1e-5, 3],
      [0.0024, 1],
      [-0.0, 3]
    ]
  },
  "QS_mulTransfSite[AcMc]": {
    "red_x_points": [
      [-8e-5, 3],
      [-0.00133, 0],
      [-0.00114, 0],
      [-0.00066, 0],
      [-0.00084, 0],
      [-0.00062, 0],
      [-0.00089, 0],
      [-0.00013, 3],
      [-0.00063, 0],
      [-0.01277, 2],
      [-0.00011, 3],
      [-0.00095, 0],
      [-0.0001, 3],
      [-0.00103, 0],
      [-0.00099, 0],
      [-0.00073, 3],
      [-4e-5, 3],
      [-0.00027, 3],
      [-0.00081, 0],
      [-0.00033, 3],
      [-0.00015, 3],
      [-0.00011, 3],
      [-0.00096, 0],
      [-0.00108, 0],
      [-0.00021, 3],
      [0.00222, 1],
      [-7e-5, 3],
      [-0.00067, 0],
      [-7e-5, 3]
    ],
    "red_o_points": [],
    "y_categories": ["N", "NOT APPLICABLE", "Y", "nan"],
    "blue_o_points": [],
    "blue_x_points": [
      [0.00543, 1],
      [-3e-5, 3],
      [0.00414, 0],
      [0.0028, 0],
      [5e-5, 3],
      [0.00319, 1],
      [0.00213, 1],
      [-0.00047, 0],
      [-0.0, 3],
      [6e-5, 3],
      [0.00259, 0],
      [0.00277, 1],
      [-9e-5, 3],
      [0.00333, 1],
      [-0.00039, 3]
    ]
  },
  "QS_mulTransfSite[Other]": {
    "red_x_points": [
      [-0.00084, 3],
      [-0.0108, 0],
      [-0.00863, 0],
      [-0.00764, 0],
      [-0.00877, 0],
      [-0.00928, 0],
      [-0.00866, 0],
      [-0.00125, 3],
      [-0.00945, 0],
      [-0.00915, 0],
      [-0.00088, 3],
      [-0.00966, 0],
      [-0.00161, 3],
      [-0.00996, 0],
      [-0.00875, 0],
      [-0.00111, 3],
      [-0.0009, 3],
      [-0.00096, 3],
      [-0.00728, 0],
      [-0.00102, 3],
      [-0.00124, 3],
      [-0.00123, 3],
      [-0.0104, 0],
      [-0.00865, 0],
      [-0.00134, 3],
      [0.01737, 1],
      [-0.00129, 3],
      [-0.00916, 0],
      [-0.00163, 3]
    ],
    "red_o_points": [],
    "y_categories": ["N", "NOT APPLICABLE", "Y", "nan"],
    "blue_o_points": [],
    "blue_x_points": [
      [0.0329, 1],
      [-0.00054, 3],
      [-0.00689, 0],
      [-0.0077, 0],
      [-6e-5, 3],
      [0.02365, 1],
      [0.01918, 1],
      [-0.00625, 0],
      [-0.00071, 3],
      [-0.00056, 3],
      [0.04389, 2],
      [0.01898, 1],
      [-0.0005, 3],
      [0.01964, 1],
      [-0.00085, 3]
    ]
  },
  "QA_yonInjBpsurg": {
    "red_x_points": [
      [-0.00023, 1],
      [-0.0004, 1],
      [-0.00039, 1],
      [-0.00036, 1],
      [-0.00036, 1],
      [-0.00022, 1],
      [-0.00051, 1],
      [-0.00056, 1],
      [-0.00045, 1],
      [-0.0002, 1],
      [-0.00031, 1],
      [-0.00019, 1],
      [-0.00081, 1],
      [-0.00068, 1],
      [-0.00023, 1],
      [-0.00023, 1],
      [-0.00017, 1],
      [-0.00023, 1],
      [-0.0002, 1],
      [-0.00019, 1],
      [-0.00085, 1],
      [-0.00045, 1],
      [-0.00016, 1],
      [-0.00019, 1],
      [-0.00052, 1],
      [0.00118, 0],
      [-0.0004, 1],
      [-0.00018, 1],
      [-0.00083, 1]
    ],
    "red_o_points": [],
    "y_categories": ["N", "Y", "nan"],
    "blue_o_points": [],
    "blue_x_points": [
      [0.0043, 0],
      [-0.00028, 1],
      [-0.0002, 1],
      [-0.00054, 1],
      [-0.00014, 1],
      [0.0019, 0],
      [0.00126, 0],
      [-0.00019, 1],
      [-0.00029, 1],
      [-0.00012, 1],
      [-0.00024, 1],
      [0.0021, 0],
      [-0.00015, 1],
      [0.00206, 0],
      [-0.00016, 1]
    ]
  },
  "QA_lstPexTouch[C8]": {
    "red_x_points": [
      [-0.00247, 1],
      [-0.00587, 2],
      [-0.00278, 1],
      [-0.00191, 1],
      [-0.0076, 2],
      [-0.00394, 1],
      [-0.00352, 1],
      [-0.00361, 0],
      [-0.00552, 1],
      [0.01201, 0],
      [-0.00339, 1],
      [-0.0087, 2],
      [-0.00343, 2],
      [-0.01025, 2],
      [-0.00255, 2],
      [-0.00101, 0],
      [-0.00277, 1],
      [-0.00215, 0],
      [-0.005, 2],
      [-0.00265, 0],
      [-0.00352, 2],
      [-0.00567, 0],
      [-0.00525, 1],
      [-0.00822, 2],
      [-0.00401, 0],
      [-0.00828, 1],
      [-0.0013, 2],
      [-0.00267, 1],
      [0.00032, 1]
    ],
    "red_o_points": [],
    "y_categories": ["NORM", "NPV", "nan"],
    "blue_o_points": [],
    "blue_x_points": [
      [0.00621, 0],
      [0.00859, 1],
      [0.01846, 0],
      [0.02588, 0],
      [0.00623, 2],
      [0.00178, 2],
      [-0.0004, 1],
      [-0.00117, 1],
      [0.01077, 1],
      [0.00509, 2],
      [0.01621, 0],
      [-0.00065, 1],
      [-0.00052, 0],
      [0.00412, 0],
      [0.00516, 0]
    ]
  },
  "QS_mulLysisNerve[Ssr]": {
    "red_x_points": [
      [-0.00039, 3],
      [-0.00289, 0],
      [-0.00946, 2],
      [-0.00786, 2],
      [-0.00277, 0],
      [-0.00174, 0],
      [-0.00244, 0],
      [-0.00062, 3],
      [-0.00255, 0],
      [-0.00203, 0],
      [-0.00049, 3],
      [-0.00236, 0],
      [-0.00055, 3],
      [-0.00294, 0],
      [-0.00252, 0],
      [-0.00056, 3],
      [-0.00034, 3],
      [-0.00033, 3],
      [-0.00203, 0],
      [-0.00051, 3],
      [-0.00053, 3],
      [-0.00066, 3],
      [-0.00239, 0],
      [-0.0023, 0],
      [-0.00074, 3],
      [0.00855, 1],
      [-0.00053, 3],
      [-0.00182, 0],
      [-0.00068, 3]
    ],
    "red_o_points": [],
    "y_categories": ["N", "NOT APPLICABLE", "Y", "nan"],
    "blue_o_points": [],
    "blue_x_points": [
      [0.01492, 1],
      [-0.00032, 3],
      [-0.00061, 0],
      [-0.00145, 0],
      [-8e-5, 3],
      [0.01076, 1],
      [0.00777, 1],
      [-0.00183, 0],
      [-0.00019, 3],
      [-5e-5, 3],
      [-0.0011, 0],
      [0.00893, 1],
      [-0.00015, 3],
      [0.01022, 1],
      [-0.00038, 3]
    ]
  },
  "QS_mulTransfSite[AcSsAA]": {
    "red_x_points": [
      [7e-5, 3],
      [-0.00163, 2],
      [-0.00696, 0],
      [-0.00573, 0],
      [-0.00071, 2],
      [-0.00656, 0],
      [-0.00669, 0],
      [-0.00052, 3],
      [-0.00831, 0],
      [-0.00784, 0],
      [-0.00012, 3],
      [-0.00656, 0],
      [-0.00058, 3],
      [-0.00046, 2],
      [-0.00409, 0],
      [-0.00025, 3],
      [5e-5, 3],
      [-0.00012, 3],
      [-0.00103, 2],
      [-3e-5, 3],
      [-0.00061, 3],
      [-0.00055, 3],
      [-0.00693, 0],
      [-0.00088, 2],
      [-0.00042, 3],
      [0.00702, 1],
      [-0.00049, 3],
      [-0.00501, 0],
      [-0.0006, 3]
    ],
    "red_o_points": [],
    "y_categories": ["N", "NOT APPLICABLE", "Y", "nan"],
    "blue_o_points": [],
    "blue_x_points": [
      [0.01939, 1],
      [-0.0002, 3],
      [0.0079, 2],
      [0.00831, 2],
      [0.00022, 3],
      [0.00964, 1],
      [0.00644, 1],
      [-0.00298, 0],
      [-9e-5, 3],
      [0.00015, 3],
      [-0.00318, 0],
      [0.01046, 1],
      [3e-5, 3],
      [0.01036, 1],
      [0.00013, 3]
    ]
  },
  "QS_mulLysisRoot[C5]": {
    "red_x_points": [
      [-0.00037, 3],
      [-0.00218, 0],
      [-0.00731, 2],
      [-0.00151, 0],
      [-0.00177, 0],
      [-0.00176, 0],
      [-0.00198, 0],
      [-0.00059, 3],
      [-0.00186, 0],
      [-0.00203, 0],
      [-0.00027, 3],
      [-0.00203, 0],
      [-0.00062, 3],
      [-0.00232, 0],
      [-0.00194, 0],
      [-0.00031, 3],
      [-0.00033, 3],
      [-0.00026, 3],
      [-0.00182, 0],
      [-0.00026, 3],
      [-0.00063, 3],
      [-0.00076, 3],
      [-0.00217, 0],
      [-0.00197, 0],
      [-0.00069, 3],
      [0.00631, 1],
      [-0.00055, 3],
      [-0.00585, 2],
      [-0.00058, 3]
    ],
    "red_o_points": [],
    "y_categories": ["N", "NOT APPLICABLE", "Y", "nan"],
    "blue_o_points": [],
    "blue_x_points": [
      [0.01218, 1],
      [-0.00027, 3],
      [-0.00055, 0],
      [-0.00112, 0],
      [-0.0001, 3],
      [0.00903, 1],
      [0.0068, 1],
      [-0.00129, 0],
      [-0.00024, 3],
      [-0.00029, 3],
      [-0.00071, 0],
      [0.00765, 1],
      [-0.00015, 3],
      [0.00782, 1],
      [-0.00034, 3]
    ]
  },
  "QS_mulNeuromadSite[C6]": {
    "red_x_points": [
      [2e-5, 2],
      [-0.00017, 0],
      [-0.00014, 0],
      [-8e-5, 0],
      [-0.00017, 0],
      [-7e-5, 0],
      [-0.00019, 0],
      [1e-5, 2],
      [-0.0003, 0],
      [-9e-5, 0],
      [3e-5, 2],
      [-0.00012, 0],
      [1e-5, 2],
      [-0.00023, 0],
      [-9e-5, 0],
      [5e-5, 2],
      [3e-5, 2],
      [2e-5, 2],
      [-4e-5, 0],
      [5e-5, 2],
      [5e-5, 2],
      [3e-5, 2],
      [-0.00019, 0],
      [-0.00011, 0],
      [-6e-5, 1],
      [-0.0, 2],
      [-2e-5, 0],
      [-0.0, 2]
    ],
    "red_o_points": [],
    "y_categories": ["N", "NOT APPLICABLE", "nan"],
    "blue_o_points": [],
    "blue_x_points": [
      [0.00111, 1],
      [0.0001, 2],
      [-1e-5, 0],
      [-7e-5, 0],
      [2e-5, 2],
      [0.00027, 1],
      [-5e-5, 0],
      [0.0001, 2],
      [-0.0, 2],
      [0.00016, 1],
      [4e-5, 2],
      [0.00011, 1],
      [3e-5, 2]
    ]
  },
  "QS_mulNeuromadSite[T1]": {
    "red_x_points": [
      [6e-5, 2],
      [-0.00032, 0],
      [-0.0002, 0],
      [-0.0001, 0],
      [-0.00034, 0],
      [-0.00023, 0],
      [-0.0003, 0],
      [-3e-5, 2],
      [-0.0003, 0],
      [-0.00031, 0],
      [3e-5, 2],
      [-0.0003, 0],
      [-0.0, 2],
      [-0.00025, 0],
      [-0.00029, 0],
      [-2e-5, 2],
      [6e-5, 2],
      [3e-5, 2],
      [-0.00025, 0],
      [-2e-5, 2],
      [0.0, 2],
      [-4e-5, 2],
      [-0.00029, 0],
      [-0.0004, 0],
      [-4e-5, 2],
      [0.00016, 1],
      [-1e-5, 2],
      [-0.00021, 0],
      [-4e-5, 2]
    ],
    "red_o_points": [],
    "y_categories": ["N", "NOT APPLICABLE", "nan"],
    "blue_o_points": [],
    "blue_x_points": [
      [0.00147, 1],
      [5e-5, 2],
      [-5e-5, 0],
      [-5e-5, 0],
      [0.0001, 2],
      [0.00083, 1],
      [0.00045, 1],
      [-0.0001, 0],
      [1e-5, 2],
      [-1e-5, 2],
      [-8e-5, 0],
      [0.00072, 1],
      [9e-5, 2],
      [0.00054, 1],
      [-1e-5, 2]
    ]
  },
  "QA_lstPexTouch[C7]": {
    "red_x_points": [
      [-0.0015, 1],
      [-0.00818, 2],
      [-0.00343, 1],
      [-0.00336, 1],
      [-0.01014, 2],
      [-0.0057, 1],
      [-0.00566, 1],
      [-0.00667, 0],
      [-0.00755, 1],
      [-0.00827, 1],
      [-0.00413, 1],
      [-0.01343, 2],
      [-0.00254, 2],
      [-0.01263, 2],
      [-0.00441, 2],
      [-0.00102, 0],
      [-0.00312, 1],
      [-0.00304, 0],
      [-0.007, 2],
      [-0.00305, 0],
      [-0.00306, 2],
      [-0.00846, 0],
      [-0.00836, 1],
      [-0.0108, 2],
      [-0.00403, 0],
      [-0.00399, 1],
      [-0.0009, 2],
      [-0.00264, 1],
      [0.0017, 1]
    ],
    "red_o_points": [],
    "y_categories": ["NORM", "NPV", "nan"],
    "blue_o_points": [],
    "blue_x_points": [
      [-2e-5, 1],
      [0.009, 1],
      [0.0349, 0],
      [0.04717, 0],
      [0.00758, 2],
      [0.00012, 2],
      [-7e-5, 1],
      [-0.00325, 1],
      [0.01211, 1],
      [0.00668, 2],
      [0.03222, 0],
      [-0.00079, 0],
      [0.0037, 0],
      [0.00601, 0]
    ]
  },
  "QS_mulLysisSite[Root]": {
    "red_x_points": [
      [-8e-5, 3],
      [-0.00152, 0],
      [-0.00627, 2],
      [-0.00101, 0],
      [-0.00143, 0],
      [-0.00114, 0],
      [-0.00143, 0],
      [-0.00021, 3],
      [-0.00132, 0],
      [-0.00094, 0],
      [-0.0001, 3],
      [-0.0012, 0],
      [-0.00025, 3],
      [-0.00151, 0],
      [-0.00116, 0],
      [-0.00014, 3],
      [-0.0002, 3],
      [-0.0002, 3],
      [-0.00107, 0],
      [-0.00022, 3],
      [-0.00027, 3],
      [-0.00016, 3],
      [-0.00132, 0],
      [-0.00095, 0],
      [-0.00024, 3],
      [0.00463, 1],
      [-0.0003, 3],
      [-0.0045, 2],
      [-0.00022, 3]
    ],
    "red_o_points": [],
    "y_categories": ["N", "NOT APPLICABLE", "Y", "nan"],
    "blue_o_points": [],
    "blue_x_points": [
      [0.00893, 1],
      [3e-5, 3],
      [-0.00028, 0],
      [-0.00065, 0],
      [3e-5, 3],
      [0.00473, 1],
      [0.00374, 1],
      [-0.00074, 0],
      [0.0001, 3],
      [-2e-5, 3],
      [-0.00016, 0],
      [0.00464, 1],
      [-0.00016, 3],
      [0.00454, 1],
      [-5e-5, 3]
    ]
  },
  "QS_mulNeuromadSite[T2]": {
    "red_x_points": [
      [2e-5, 2],
      [-0.00097, 0],
      [-0.00037, 0],
      [-0.00029, 0],
      [-0.00048, 0],
      [-0.00034, 0],
      [-0.00039, 0],
      [-2e-5, 2],
      [-0.00038, 0],
      [-0.00018, 0],
      [0.0, 2],
      [-0.00034, 0],
      [-0.00015, 2],
      [-0.00085, 0],
      [-0.00078, 0],
      [2e-5, 2],
      [-0.0, 2],
      [-1e-5, 2],
      [-0.00031, 0],
      [-2e-5, 2],
      [-0.00011, 2],
      [-4e-5, 2],
      [-0.00045, 0],
      [-0.00044, 0],
      [-5e-5, 2],
      [0.00101, 1],
      [-5e-5, 2],
      [-0.00026, 0],
      [-0.0001, 2]
    ],
    "red_o_points": [],
    "y_categories": ["N", "NOT APPLICABLE", "nan"],
    "blue_o_points": [],
    "blue_x_points": [
      [0.00225, 1],
      [-2e-5, 2],
      [-2e-5, 0],
      [-6e-5, 0],
      [4e-5, 2],
      [0.00173, 1],
      [0.0007, 1],
      [-0.00021, 0],
      [-2e-5, 2],
      [3e-5, 2],
      [-6e-5, 0],
      [0.00096, 1],
      [1e-5, 2],
      [0.00101, 1],
      [-2e-5, 2]
    ]
  },
  "QS_mulNeuromadSite[C4]": {
    "red_x_points": [
      [-1e-5, 2],
      [-6e-5, 0],
      [-0.0001, 0],
      [-6e-5, 0],
      [-3e-5, 0],
      [-3e-5, 0],
      [1e-5, 2],
      [-6e-5, 0],
      [-1e-5, 2],
      [-9e-5, 0],
      [-4e-5, 2],
      [-6e-5, 0],
      [-2e-5, 0],
      [-1e-5, 2],
      [-1e-5, 2],
      [-9e-5, 0],
      [-1e-5, 2],
      [-3e-5, 2],
      [1e-5, 2],
      [-9e-5, 0],
      [-9e-5, 0],
      [-1e-5, 2],
      [0.00016, 1],
      [0.0, 2],
      [-2e-5, 0],
      [-3e-5, 2]
    ],
    "red_o_points": [],
    "y_categories": ["N", "NOT APPLICABLE", "nan"],
    "blue_o_points": [],
    "blue_x_points": [
      [0.00042, 1],
      [0.0, 2],
      [-2e-5, 0],
      [1e-5, 2],
      [0.00016, 1],
      [9e-5, 1],
      [-2e-5, 0],
      [1e-5, 2],
      [0.0, 2],
      [-2e-5, 0],
      [-1e-5, 2],
      [0.00016, 1],
      [-1e-5, 2]
    ]
  },
  "QS_mulTransfSite[Oberlin]": {
    "red_x_points": [
      [-0.0019, 3],
      [-0.0265, 0],
      [-0.02636, 0],
      [-0.02348, 0],
      [-0.02575, 0],
      [0.00397, 2],
      [-0.02639, 0],
      [-0.00226, 3],
      [0.00449, 2],
      [0.00418, 2],
      [-0.002, 3],
      [0.0042, 2],
      [-0.00258, 3],
      [0.00231, 2],
      [-0.02252, 0],
      [-0.00214, 3],
      [-0.00207, 3],
      [-0.00167, 3],
      [-0.02309, 0],
      [-0.0021, 3],
      [-0.00265, 3],
      [-0.00236, 3],
      [0.00414, 2],
      [-0.0265, 0],
      [-0.00204, 3],
      [0.02911, 1],
      [-0.0021, 3],
      [-0.02621, 0],
      [-0.00268, 3]
    ],
    "red_o_points": [],
    "y_categories": ["N", "NOT APPLICABLE", "Y", "nan"],
    "blue_o_points": [],
    "blue_x_points": [
      [0.04885, 1],
      [-0.00155, 3],
      [0.00677, 2],
      [0.00782, 2],
      [-0.00099, 3],
      [0.0378, 1],
      [0.03038, 1],
      [0.00516, 2],
      [-0.00152, 3],
      [-0.00101, 3],
      [0.00633, 2],
      [0.03444, 1],
      [-0.00096, 3],
      [0.03305, 1],
      [-0.00163, 3]
    ]
  },
  "QA_intPexForearmProna": {
    "red_x_points": [
      [-0.00087, 2],
      [-0.00105, 0],
      [-0.00067, 2],
      [-0.00034, 2],
      [-0.00061, 2],
      [-0.0028, 0],
      [-0.0007, 2],
      [-0.0205, 0],
      [-0.00063, 2],
      [-0.00056, 2],
      [-0.02035, 0],
      [-0.00298, 0],
      [-0.00107, 2],
      [-0.00073, 2],
      [6e-5, 2],
      [-0.02099, 0],
      [-0.02024, 0],
      [-0.01806, 0],
      [-0.00202, 0],
      [-0.00071, 2],
      [-0.00128, 2],
      [-0.00119, 2],
      [-0.00058, 2],
      [-0.00061, 2],
      [0.00027, 2],
      [0.00073, 1],
      [0.00016, 2],
      [-0.0027, 0],
      [-0.00121, 2]
    ],
    "red_o_points": [],
    "y_categories": ["GREATER THAN OR EQUALS TO 80", "LESS THAN 80", "nan"],
    "blue_o_points": [],
    "blue_x_points": [
      [-0.00059, 2],
      [0.0628, 1],
      [-0.00047, 0],
      [-0.00037, 2],
      [0.00092, 2],
      [6e-5, 2],
      [0.00097, 1],
      [0.00023, 2],
      [-0.00038, 2],
      [0.00099, 2],
      [-0.00044, 0],
      [0.0001, 2],
      [0.00121, 2],
      [6e-5, 2],
      [0.05714, 1]
    ]
  },
  "QS_mulLysisSite[Nerve]": {
    "red_x_points": [
      [-0.00038, 3],
      [-0.00337, 0],
      [-0.00963, 2],
      [-0.00719, 2],
      [-0.00261, 0],
      [-0.00204, 0],
      [-0.00272, 0],
      [-0.00065, 3],
      [-0.00244, 0],
      [-0.00209, 0],
      [-0.00036, 3],
      [-0.00252, 0],
      [-0.001, 3],
      [-0.00326, 0],
      [-0.00316, 0],
      [-0.00048, 3],
      [-0.00045, 3],
      [-0.00036, 3],
      [-0.00222, 0],
      [-0.00047, 3],
      [-0.00084, 3],
      [-0.00073, 3],
      [-0.00268, 0],
      [-0.00258, 0],
      [-0.0007, 3],
      [0.008, 1],
      [-0.0007, 3],
      [-0.00218, 0],
      [-0.00091, 3]
    ],
    "red_o_points": [],
    "y_categories": ["N", "NOT APPLICABLE", "Y", "nan"],
    "blue_o_points": [],
    "blue_x_points": [
      [0.01783, 1],
      [-0.00047, 3],
      [-0.00097, 0],
      [-0.00159, 0],
      [-0.00019, 3],
      [0.0117, 1],
      [0.00807, 1],
      [-0.00151, 0],
      [-0.00039, 3],
      [-0.00029, 3],
      [-0.00095, 0],
      [0.00987, 1],
      [-0.00014, 3],
      [0.01003, 1],
      [-0.00029, 3]
    ]
  },
  "QA_yonPexPain": {
    "red_x_points": [
      [-0.0085, 1],
      [-0.00107, 1],
      [-0.0011, 1],
      [-0.00064, 1],
      [-0.00116, 1],
      [-0.00179, 0],
      [-0.00057, 1],
      [-0.00756, 1],
      [-0.00225, 0],
      [-0.0008, 1],
      [-0.00578, 1],
      [-0.00066, 0],
      [-0.01058, 1],
      [-0.00065, 1],
      [-0.00038, 1],
      [0.00774, 0],
      [-0.00676, 1],
      [0.00575, 0],
      [-0.00042, 1],
      [0.00955, 0],
      [-0.02011, 2],
      [-0.01078, 1],
      [-0.00022, 1],
      [-0.00127, 1],
      [-0.01599, 2],
      [-0.00268, 1],
      [-0.00845, 1],
      [-0.00038, 1],
      [-0.01132, 1]
    ],
    "red_o_points": [],
    "y_categories": ["N", "Y", "nan"],
    "blue_o_points": [],
    "blue_x_points": [
      [-0.00037, 1],
      [0.02764, 0],
      [0.00436, 0],
      [0.00132, 1],
      [-0.00636, 1],
      [0.00091, 2],
      [5e-5, 1],
      [0.00321, 1],
      [0.03017, 0],
      [0.02112, 0],
      [0.00144, 1],
      [0.00337, 0],
      [0.01206, 0],
      [-0.00022, 1],
      [0.00011, 1]
    ]
  },
  "QA_lstPexPalle[Ulna]": {
    "red_x_points": [
      [-0.00094, 4],
      [-0.00363, 4],
      [-0.00274, 4],
      [-0.00826, 2],
      [-0.00415, 4],
      [-0.01368, 1],
      [-0.00375, 4],
      [-0.00062, 4],
      [-0.00507, 4],
      [0.01435, 3],
      [-0.01438, 1],
      [-0.00491, 4],
      [-0.00107, 4],
      [-0.00492, 4],
      [-0.00139, 4],
      [0.00689, 3],
      [-0.01454, 0],
      [0.00383, 3],
      [-0.00916, 0],
      [0.00593, 3],
      [-0.00081, 4],
      [-0.00094, 4],
      [-0.0051, 4],
      [-0.00405, 4],
      [-0.00027, 4],
      [0.00309, 3],
      [-0.00023, 4],
      [-0.00901, 0],
      [-0.00104, 4]
    ],
    "red_o_points": [],
    "y_categories": ["ABS", "HYPO", "NAIA", "PT", "nan"],
    "blue_o_points": [],
    "blue_x_points": [
      [-0.00069, 4],
      [-1e-5, 4],
      [0.02048, 3],
      [0.02478, 3],
      [0.00076, 4],
      [-0.00014, 4],
      [0.0021, 3],
      [-0.00325, 4],
      [0.00033, 4],
      [0.00057, 4],
      [0.01822, 3],
      [-0.00015, 4],
      [0.00503, 3],
      [-0.00013, 4],
      [0.01267, 3]
    ]
  }
}
