{
  "QA_lstPexPain[C8]": {
    "red_x_points": [
      [-0.00949, 1],
      [-0.00317, 2],
      [-0.00344, 2],
      [-0.00368, 2],
      [-0.00972, 1],
      [0.00057, 0],
      [-0.00068, 1],
      [-0.0007, 1],
      [0.00789, 0],
      [0.00018, 0],
      [0.00153, 0],
      [1e-5, 0],
      [-0.01079, 1],
      [-0.01603, 2],
      [-0.00542, 2],
      [-0.00401, 2],
      [-0.00531, 2],
      [-0.00216, 2],
      [-0.00644, 2],
      [0.00875, 0],
      [-0.00895, 1],
      [0.00745, 0],
      [-0.00418, 2],
      [-0.00577, 2],
      [0.00402, 0],
      [-0.00625, 2],
      [-0.00552, 2],
      [-0.00259, 2],
      [-0.0078, 1],
      [-0.01028, 1],
      [-0.00146, 1],
      [-0.00944, 1]
    ],
    "red_o_points": [],
    "y_categories": ["NORM", "NPV", "nan"],
    "blue_o_points": [],
    "blue_x_points": [
      [0.01103, 0],
      [-0.00245, 2],
      [0.00124, 1],
      [0.00955, 1],
      [0.00468, 0],
      [0.00117, 1],
      [0.01233, 0],
      [0.00615, 0],
      [0.01088, 0],
      [0.01451, 0]
    ]
  },
  "QS_mulLysisSite[Root]": {
    "red_x_points": [
      [-0.00032, 3],
      [-0.00091, 0],
      [-0.00429, 2],
      [-0.00095, 0],
      [-0.00033, 3],
      [-0.0011, 0],
      [-0.00081, 0],
      [-0.00078, 0],
      [-0.00078, 3],
      [-0.0008, 0],
      [-0.00083, 0],
      [-0.00043, 0],
      [-0.00043, 3],
      [0.00261, 1],
      [-0.0006, 3],
      [-0.00092, 0],
      [-0.00027, 3],
      [-0.00093, 0],
      [-0.00028, 3],
      [-0.00056, 3],
      [-0.00022, 3],
      [-0.00037, 3],
      [-0.00115, 0],
      [-0.0008, 3],
      [-0.00031, 3],
      [-0.00029, 3],
      [-0.00093, 0],
      [-0.00106, 0],
      [0.00283, 1],
      [-0.00027, 3],
      [-0.00398, 2],
      [-0.00053, 3]
    ],
    "red_o_points": [],
    "y_categories": ["N", "NOT APPLICABLE", "Y", "nan"],
    "blue_o_points": [],
    "blue_x_points": [
      [0.00374, 1],
      [-0.0001, 3],
      [0.00303, 1],
      [0.00033, 0],
      [-0.00017, 0],
      [0.0032, 1],
      [-9e-5, 3],
      [0.00329, 1],
      [-0.00029, 3],
      [-0.00019, 3]
    ]
  },
  "QS_mulLysisTrunk[Upper]": {
    "red_x_points": [
      [-0.00116, 3],
      [-0.00413, 0],
      [-0.00418, 0],
      [-0.00499, 0],
      [-0.00133, 3],
      [-0.0048, 0],
      [-0.01032, 2],
      [-0.00435, 0],
      [-0.00156, 3],
      [-0.00431, 0],
      [-0.00534, 0],
      [-0.00418, 0],
      [-0.0012, 3],
      [0.00887, 1],
      [-0.00173, 3],
      [-0.00493, 0],
      [-0.00145, 3],
      [-0.00914, 2],
      [-0.00186, 3],
      [-0.00115, 3],
      [-0.00097, 3],
      [-0.00121, 3],
      [-0.00416, 0],
      [-0.00126, 3],
      [-0.00243, 3],
      [-0.00138, 3],
      [-0.00403, 0],
      [-0.00372, 0],
      [0.01058, 1],
      [-0.00109, 3],
      [-0.00983, 2],
      [-0.00141, 3]
    ],
    "red_o_points": [],
    "y_categories": ["N", "NOT APPLICABLE", "Y", "nan"],
    "blue_o_points": [],
    "blue_x_points": [
      [0.01534, 1],
      [-0.00029, 3],
      [0.01198, 1],
      [0.00121, 0],
      [-0.0016, 0],
      [0.01204, 1],
      [-0.00054, 3],
      [0.01396, 1],
      [-0.00031, 3],
      [-0.00039, 3]
    ]
  },
  "QA_lstPexPain[C5]": {
    "red_x_points": [
      [-0.00274, 1],
      [-0.00627, 2],
      [-0.00738, 2],
      [-0.00643, 2],
      [-0.00309, 1],
      [-0.00109, 1],
      [-0.00085, 1],
      [-0.00156, 1],
      [-0.00317, 1],
      [-0.00148, 1],
      [-0.00143, 1],
      [-0.00099, 1],
      [-0.00317, 1],
      [-0.02105, 2],
      [-0.0089, 2],
      [-0.00681, 2],
      [-0.00748, 2],
      [-0.00623, 2],
      [-0.00797, 2],
      [-0.00288, 1],
      [-0.00292, 1],
      [-0.00293, 1],
      [-0.00756, 2],
      [-0.00855, 2],
      [-0.003, 1],
      [-0.00916, 2],
      [-0.00613, 2],
      [-0.00586, 2],
      [-0.00624, 1],
      [-0.00521, 1],
      [-0.00106, 1],
      [-0.0032, 1]
    ],
    "red_o_points": [],
    "y_categories": ["NORM", "NPV", "nan"],
    "blue_o_points": [],
    "blue_x_points": [
      [0.02992, 0],
      [-0.0035, 2],
      [0.00014, 1],
      [-0.00053, 1],
      [-0.00052, 1],
      [-4e-5, 1],
      [-0.00138, 1],
      [0.02527, 0],
      [-0.00163, 1],
      [0.05331, 0]
    ]
  },
  "QS_mulGraftNerve[Ac]": {
    "red_x_points": [
      [0.0, 2],
      [-4e-5, 0],
      [-0.0001, 0],
      [-5e-5, 0],
      [-4e-5, 0],
      [-4e-5, 0],
      [-0.0001, 0],
      [1e-5, 2],
      [-0.0001, 0],
      [-5e-5, 0],
      [-4e-5, 0],
      [0.0, 2],
      [8e-5, 1],
      [1e-5, 2],
      [-4e-5, 0],
      [-1e-5, 2],
      [-0.00016, 0],
      [0.0, 2],
      [0.0, 2],
      [-4e-5, 0],
      [1e-5, 2],
      [0.0, 2],
      [-4e-5, 0],
      [-4e-5, 0],
      [0.0002, 1],
      [1e-5, 2],
      [-4e-5, 0],
      [0.0, 2]
    ],
    "red_o_points": [],
    "y_categories": ["N", "NOT APPLICABLE", "nan"],
    "blue_o_points": [],
    "blue_x_points": [
      [0.00012, 1],
      [-1e-5, 2],
      [-4e-5, 0],
      [0.00016, 1],
      [0.0, 2],
      [0.00016, 1],
      [0.0, 2]
    ]
  },
  "QS_mulNeuromadSite[C8]": {
    "red_x_points": [
      [-0.00029, 2],
      [-0.00254, 0],
      [-0.00224, 0],
      [-0.00236, 0],
      [-0.00033, 2],
      [-0.00271, 0],
      [-0.00182, 0],
      [-0.00254, 0],
      [-0.00076, 2],
      [-0.0025, 0],
      [-0.00296, 0],
      [-0.00226, 0],
      [-0.0004, 2],
      [0.00185, 1],
      [-0.0005, 2],
      [-0.00243, 0],
      [-0.00051, 2],
      [-0.00184, 0],
      [-0.00153, 2],
      [-0.00062, 2],
      [-0.00018, 2],
      [-0.00061, 2],
      [-0.00224, 0],
      [-0.00041, 2],
      [-0.00209, 2],
      [-0.00035, 2],
      [-0.00213, 0],
      [-0.00155, 0],
      [0.0031, 1],
      [-0.00013, 2],
      [-0.00155, 0],
      [-0.00076, 2]
    ],
    "red_o_points": [],
    "y_categories": ["N", "NOT APPLICABLE", "nan"],
    "blue_o_points": [],
    "blue_x_points": [
      [0.00629, 1],
      [2e-5, 2],
      [0.00484, 1],
      [0.00172, 0],
      [-0.00034, 0],
      [0.00515, 1],
      [-0.00033, 2],
      [0.00523, 1],
      [-5e-5, 2],
      [0.0001, 2]
    ]
  },
  "QS_mulGraftNerve[Ph]": {
    "red_x_points": [
      [-0.0001, 2],
      [-4e-5, 0],
      [-4e-5, 0],
      [-1e-5, 2],
      [3e-5, 0],
      [-4e-5, 0],
      [-1e-5, 2],
      [-4e-5, 0],
      [-4e-5, 0],
      [-0.0001, 2],
      [-4e-5, 0],
      [-1e-5, 2],
      [-0.0001, 2],
      [-1e-5, 2],
      [-1e-5, 2],
      [-1e-5, 2]
    ],
    "red_o_points": [],
    "y_categories": ["N", "NOT APPLICABLE", "nan"],
    "blue_o_points": [],
    "blue_x_points": [[0.0001, 1], [3e-5, 0], [0.00016, 1], [-1e-5, 2]]
  },
  "QS_mulTransfSite[AcSsPA]": {
    "red_x_points": [
      [-0.00031, 3],
      [-0.00111, 0],
      [-0.00112, 0],
      [-0.00113, 0],
      [-0.00042, 3],
      [-0.00154, 0],
      [-0.00112, 0],
      [-0.00122, 0],
      [-0.00037, 3],
      [-0.0014, 0],
      [-0.00152, 0],
      [-0.00141, 0],
      [-0.0004, 3],
      [0.00289, 1],
      [-0.0004, 3],
      [-0.00123, 0],
      [-0.00031, 3],
      [-0.00353, 2],
      [-0.00043, 3],
      [-0.0004, 3],
      [-0.00027, 3],
      [-0.00038, 3],
      [-0.00112, 0],
      [-0.00044, 3],
      [-0.00031, 3],
      [-0.00033, 3],
      [-0.00122, 0],
      [-0.00128, 0],
      [0.00304, 1],
      [-0.00038, 3],
      [-0.00118, 0],
      [-0.00042, 3]
    ],
    "red_o_points": [],
    "y_categories": ["N", "NOT APPLICABLE", "Y", "nan"],
    "blue_o_points": [],
    "blue_x_points": [
      [0.00393, 1],
      [-0.00015, 3],
      [0.00294, 1],
      [-0.00026, 0],
      [-0.00085, 0],
      [0.00317, 1],
      [-0.00017, 3],
      [0.00336, 1],
      [-5e-5, 3],
      [-0.00016, 3]
    ]
  },
  "participant_code": {
    "red_x_points": [
      [-0.03029, 1],
      [-0.02988, 2],
      [-0.03146, 3],
      [-0.02988, 4],
      [-0.02988, 5],
      [-0.03046, 6],
      [-0.03088, 7],
      [-0.02999, 8],
      [-0.03117, 9],
      [-0.0307, 10],
      [-0.02994, 11],
      [-0.02988, 12],
      [-0.02988, 13],
      [-0.02964, 15],
      [-0.03005, 17],
      [-0.03035, 18],
      [-0.02988, 20],
      [-0.0297, 21],
      [-0.02994, 22],
      [-0.02876, 24],
      [-0.02917, 26],
      [-0.03029, 27],
      [-0.03041, 28],
      [-0.0297, 30],
      [-0.03058, 31],
      [-0.03076, 32],
      [-0.03093, 34],
      [-0.02982, 36],
      [-0.02941, 38],
      [-0.03023, 39],
      [-0.03046, 40],
      [-0.0297, 41]
    ],
    "red_o_points": [],
    "y_categories": [
      "P16554",
      "P18297",
      "P19283",
      "P19287",
      "P23391",
      "P30595",
      "P31645",
      "P31691",
      "P34778",
      "P35046",
      "P36328",
      "P43633",
      "P4544",
      "P46417",
      "P48965",
      "P53068",
      "P5497",
      "P59529",
      "P62483",
      "P64658",
      "P65202",
      "P66816",
      "P6751",
      "P7408",
      "P75566",
      "P76226",
      "P79971",
      "P82621",
      "P82990",
      "P84549",
      "P84932",
      "P85825",
      "P86989",
      "P8770",
      "P87791",
      "P90550",
      "P93159",
      "P94969",
      "P96710",
      "P97130",
      "P9744",
      "P98500",
      "nan"
    ],
    "blue_o_points": [],
    "blue_x_points": [
      [0.06281, 0],
      [0.06479, 14],
      [0.06281, 16],
      [0.06408, 19],
      [0.06098, 23],
      [0.06069, 25],
      [0.06211, 29],
      [0.06267, 33],
      [0.06309, 35],
      [0.06578, 37]
    ]
  },
  "QA_lstPexTouch[T1]": {
    "red_x_points": [
      [-0.00968, 1],
      [-0.00216, 2],
      [0.00164, 1],
      [-0.00288, 2],
      [-0.01069, 1],
      [-0.01015, 0],
      [0.00289, 1],
      [0.00244, 1],
      [-0.01177, 1],
      [-0.00543, 0],
      [-0.00592, 0],
      [-0.0085, 0],
      [0.00718, 0],
      [-0.00985, 2],
      [-0.00428, 2],
      [-0.00372, 2],
      [-0.01174, 1],
      [-0.00159, 2],
      [-0.00501, 2],
      [0.00798, 0],
      [-0.0105, 1],
      [0.00817, 0],
      [-0.00361, 2],
      [-0.00434, 2],
      [-0.01218, 1],
      [0.00775, 0],
      [0.00362, 1],
      [-0.00236, 2],
      [-0.00179, 1],
      [-0.00404, 2],
      [0.00061, 1],
      [-0.01095, 1]
    ],
    "red_o_points": [],
    "y_categories": ["NORM", "NPV", "nan"],
    "blue_o_points": [],
    "blue_x_points": [
      [0.00069, 1],
      [0.00113, 2],
      [0.0011, 1],
      [0.00743, 1],
      [0.0125, 1],
      [0.00078, 1],
      [0.01251, 0],
      [0.00589, 0],
      [0.01118, 0],
      [0.01432, 0]
    ]
  },
  "QA_mulInjOrthesisType[ArmSling]": {
    "red_x_points": [
      [-0.00712, 2],
      [-0.00623, 2],
      [-0.00696, 2],
      [-0.00698, 2],
      [-0.00683, 2],
      [-0.00739, 2],
      [-0.00758, 2],
      [-0.00762, 2],
      [-0.00635, 2],
      [-0.00732, 2],
      [-0.00703, 2],
      [-0.00753, 2],
      [-0.00713, 2],
      [0.01345, 1],
      [-0.00818, 2],
      [-0.0078, 2],
      [-0.00805, 2],
      [-0.01309, 0],
      [0.01724, 1],
      [-0.00604, 2],
      [-0.0075, 2],
      [-0.02353, 0],
      [-0.00377, 3],
      [-0.00847, 2],
      [0.00939, 1],
      [-0.00715, 2],
      [-0.00641, 2],
      [-0.00653, 2],
      [-0.014, 3],
      [-0.00347, 3],
      [-0.00696, 2],
      [-0.0073, 2]
    ],
    "red_o_points": [],
    "y_categories": ["N", "NOT APPLICABLE", "Y", "nan"],
    "blue_o_points": [],
    "blue_x_points": [
      [0.00247, 2],
      [0.02341, 1],
      [0.01753, 1],
      [0.03704, 1],
      [-0.005, 2],
      [0.01666, 1],
      [-0.00221, 2],
      [0.01683, 1],
      [-0.00303, 2],
      [0.01376, 3]
    ]
  },
  "QS_lstBpsurgSide": {
    "red_x_points": [
      [-0.00125, 3],
      [-0.00729, 0],
      [-0.00753, 0],
      [-0.00748, 0],
      [-0.00113, 3],
      [-0.0079, 2],
      [-0.00749, 0],
      [-0.00893, 0],
      [-0.00142, 3],
      [-0.00783, 0],
      [-0.00724, 2],
      [-0.00782, 2],
      [-0.00145, 3],
      [0.0123, 1],
      [-0.00142, 3],
      [-0.00786, 2],
      [-0.00148, 3],
      [-0.00786, 2],
      [-0.00123, 3],
      [-0.0015, 3],
      [-0.00128, 3],
      [-0.00117, 3],
      [-0.007, 0],
      [-0.00152, 3],
      [-0.00119, 3],
      [-0.00104, 3],
      [-0.00682, 2],
      [-0.00625, 2],
      [0.01388, 1],
      [-0.00109, 3],
      [-0.00737, 0],
      [-0.00125, 3]
    ],
    "red_o_points": [],
    "y_categories": ["L", "NOT APPLICABLE", "R", "nan"],
    "blue_o_points": [],
    "blue_x_points": [
      [0.01931, 1],
      [-0.0005, 3],
      [0.01528, 1],
      [0.00125, 0],
      [0.00053, 2],
      [0.01542, 1],
      [-0.00031, 3],
      [0.01449, 1],
      [-0.00062, 3],
      [5e-5, 3]
    ]
  },
  "QA_mulInjOrthesisType[ShoulderSupport]": {
    "red_x_points": [
      [-0.00653, 0],
      [-0.00626, 0],
      [-0.00678, 0],
      [-0.00667, 0],
      [-0.0068, 0],
      [-0.007, 0],
      [-0.00672, 0],
      [-0.00736, 0],
      [-0.02089, 2],
      [-0.00804, 0],
      [-0.00721, 0],
      [-0.00727, 0],
      [-0.00612, 0],
      [0.01483, 1],
      [-0.00745, 0],
      [-0.00761, 0],
      [-0.00762, 0],
      [-0.01295, 2],
      [0.01389, 1],
      [-0.00498, 0],
      [-0.00651, 0],
      [-0.02186, 2],
      [-0.00384, 3],
      [-0.00757, 0],
      [0.01154, 1],
      [-0.00663, 0],
      [-0.00696, 0],
      [-0.00641, 0],
      [-0.01183, 3],
      [-0.00273, 3],
      [-0.00648, 0],
      [-0.00689, 0]
    ],
    "red_o_points": [],
    "y_categories": ["N", "NOT APPLICABLE", "Y", "nan"],
    "blue_o_points": [],
    "blue_x_points": [
      [0.00146, 0],
      [0.02283, 1],
      [0.01665, 1],
      [0.03696, 1],
      [-0.00487, 0],
      [0.01823, 1],
      [-0.00112, 0],
      [0.01607, 1],
      [-0.00233, 0],
      [0.01406, 3]
    ]
  },
  "QA_yonInjUnconscio": {
    "red_x_points": [
      [-0.00615, 1],
      [-0.00733, 1],
      [-0.00503, 2],
      [-0.00404, 2],
      [-0.00503, 2],
      [0.02043, 0],
      [-0.00818, 1],
      [-0.00514, 2],
      [-0.00592, 2],
      [-0.00641, 2],
      [-0.0061, 2],
      [-0.01078, 1],
      [-0.00809, 1],
      [-0.02104, 1],
      [-0.00693, 2],
      [-0.00502, 2],
      [-0.00605, 2],
      [-0.00673, 1],
      [0.00469, 0],
      [-0.01079, 1],
      [-0.00661, 1],
      [-0.0089, 1],
      [-0.00767, 1],
      [-0.00834, 2],
      [-0.00851, 1],
      [-0.00563, 2],
      [-0.00898, 1],
      [-0.00691, 1],
      [-0.00218, 2],
      [-0.00547, 2],
      [-0.00747, 1],
      [-0.00559, 2]
    ],
    "red_o_points": [],
    "y_categories": ["N", "Y", "nan"],
    "blue_o_points": [],
    "blue_x_points": [
      [0.00067, 2],
      [0.01111, 1],
      [0.01791, 0],
      [0.03098, 0],
      [0.02638, 0],
      [0.00079, 2],
      [-0.00213, 1],
      [0.00121, 2],
      [0.03497, 0],
      [-6e-5, 2]
    ]
  },
  "QS_mulTransfSite[Other]": {
    "red_x_points": [
      [-0.00241, 3],
      [-0.01547, 0],
      [-0.01567, 0],
      [-0.01578, 0],
      [-0.00216, 3],
      [-0.01704, 0],
      [-0.01563, 0],
      [-0.01596, 0],
      [-0.00244, 3],
      [-0.01572, 0],
      [-0.01613, 0],
      [-0.01575, 0],
      [-0.00234, 3],
      [0.02208, 1],
      [-0.0023, 3],
      [-0.0152, 0],
      [-0.00227, 3],
      [-0.01483, 0],
      [-0.00316, 3],
      [-0.00256, 3],
      [-0.00238, 3],
      [-0.00211, 3],
      [-0.01498, 0],
      [-0.00206, 3],
      [-0.00348, 3],
      [-0.00237, 3],
      [-0.01551, 0],
      [-0.01532, 0],
      [0.02271, 1],
      [-0.0022, 3],
      [-0.01513, 0],
      [-0.00257, 3]
    ],
    "red_o_points": [],
    "y_categories": ["N", "NOT APPLICABLE", "Y", "nan"],
    "blue_o_points": [],
    "blue_x_points": [
      [0.02573, 1],
      [-0.00081, 3],
      [0.02272, 1],
      [-0.00657, 0],
      [0.05486, 2],
      [0.0221, 1],
      [-0.00085, 3],
      [0.02379, 1],
      [-0.00061, 3],
      [-0.00046, 3]
    ]
  },
  "QA_lstInjTpbiSide": {
    "red_x_points": [
      [-0.00364, 1],
      [0.0004, 0],
      [-0.00035, 0],
      [0.00012, 0],
      [0.00045, 0],
      [-0.00153, 1],
      [-0.00164, 0],
      [-0.00195, 0],
      [-0.00429, 1],
      [-0.00088, 0],
      [-0.00061, 1],
      [-0.00118, 1],
      [-0.00506, 1],
      [-0.01612, 0],
      [-0.00437, 1],
      [-0.00174, 1],
      [0.00152, 0],
      [-0.00156, 1],
      [-0.00761, 1],
      [0.00022, 0],
      [0.00149, 0],
      [-0.00065, 0],
      [0.00024, 0],
      [0.00211, 0],
      [-0.00548, 1],
      [-0.00524, 1],
      [-0.00038, 1],
      [-0.00066, 1],
      [-0.01855, 0],
      [-0.00639, 1],
      [-0.00115, 0],
      [0.00049, 0]
    ],
    "red_o_points": [],
    "y_categories": ["L", "R", "nan"],
    "blue_o_points": [],
    "blue_x_points": [
      [-0.00564, 0],
      [0.00834, 0],
      [0.00905, 1],
      [0.00306, 0],
      [0.00338, 1],
      [0.01034, 1],
      [0.00294, 1],
      [0.00934, 1],
      [0.00499, 0],
      [0.00568, 0]
    ]
  },
  "QS_mulGraftNerve[MC]": {
    "red_x_points": [
      [-2e-5, 2],
      [-8e-5, 0],
      [-5e-5, 0],
      [-8e-5, 0],
      [-8e-5, 0],
      [-2e-5, 2],
      [-8e-5, 0],
      [-2e-5, 2],
      [-2e-5, 2],
      [-2e-5, 2],
      [-2e-5, 2],
      [-3e-5, 0]
    ],
    "red_o_points": [],
    "y_categories": ["N", "NOT APPLICABLE", "nan"],
    "blue_o_points": [],
    "blue_x_points": [
      [0.00014, 1],
      [0.00015, 1],
      [-3e-5, 0],
      [0.00028, 1],
      [-2e-5, 2],
      [-2e-5, 2]
    ]
  },
  "QS_mulLysisSite[Trunk]": {
    "red_x_points": [
      [-0.00119, 3],
      [-0.00303, 0],
      [-0.00317, 0],
      [-0.0034, 0],
      [-0.00111, 3],
      [-0.0035, 0],
      [-0.00995, 2],
      [-0.00297, 0],
      [-0.00126, 3],
      [-0.00304, 0],
      [-0.00358, 0],
      [-0.00308, 0],
      [-0.0008, 3],
      [0.00859, 1],
      [-0.0011, 3],
      [-0.00285, 0],
      [-0.00119, 3],
      [-0.00713, 2],
      [-0.00138, 3],
      [-0.00115, 3],
      [-0.00134, 3],
      [-0.00127, 3],
      [-0.00274, 0],
      [-0.00092, 3],
      [-0.00126, 3],
      [-0.00071, 3],
      [-0.00269, 0],
      [-0.00276, 0],
      [0.00715, 1],
      [-0.00103, 3],
      [-0.00869, 2],
      [-0.00132, 3]
    ],
    "red_o_points": [],
    "y_categories": ["N", "NOT APPLICABLE", "Y", "nan"],
    "blue_o_points": [],
    "blue_x_points": [
      [0.01201, 1],
      [-0.00044, 3],
      [0.00932, 1],
      [0.00125, 0],
      [-0.00075, 0],
      [0.0099, 1],
      [-0.00058, 3],
      [0.00914, 1],
      [-0.00046, 3],
      [-0.00028, 3]
    ]
  },
  "QS_mulGraftTrunk[UpperTrunk]": {
    "red_x_points": [
      [-0.0003, 3],
      [-0.00119, 0],
      [-0.00085, 0],
      [-0.0012, 0],
      [-0.00021, 3],
      [-0.00157, 0],
      [-0.00107, 0],
      [-0.00103, 0],
      [-0.00029, 3],
      [-0.00128, 0],
      [-0.00116, 0],
      [-0.00131, 0],
      [-0.00021, 3],
      [0.00212, 1],
      [-0.00042, 3],
      [-0.00416, 2],
      [-0.00043, 3],
      [-0.00083, 0],
      [-0.00031, 3],
      [-0.0002, 3],
      [-0.00015, 3],
      [-0.00014, 3],
      [-0.00095, 0],
      [-0.00037, 3],
      [-0.00025, 3],
      [-0.00025, 3],
      [-0.0011, 0],
      [-0.0011, 0],
      [0.00259, 1],
      [-0.00024, 3],
      [-0.00097, 0],
      [-0.00029, 3]
    ],
    "red_o_points": [],
    "y_categories": ["N", "NOT APPLICABLE", "Y", "nan"],
    "blue_o_points": [],
    "blue_x_points": [
      [0.00374, 1],
      [-9e-5, 3],
      [0.00265, 1],
      [0.00069, 0],
      [-0.00074, 0],
      [0.00224, 1],
      [-0.00012, 3],
      [0.00294, 1],
      [-0.00011, 3],
      [-0.0001, 3]
    ]
  },
  "QS_mulTransfSite[PhMc]": {
    "red_x_points": [
      [-0.00075, 3],
      [-0.00319, 0],
      [-0.00267, 0],
      [-0.00295, 0],
      [-0.00097, 3],
      [-0.00319, 0],
      [-0.00291, 0],
      [-0.00952, 2],
      [-0.00107, 3],
      [-0.00304, 0],
      [-0.00324, 0],
      [-0.00319, 0],
      [-0.00091, 3],
      [0.00598, 1],
      [-0.001, 3],
      [-0.00306, 0],
      [-0.0009, 3],
      [-0.00304, 0],
      [-0.00135, 3],
      [-0.00079, 3],
      [-0.00084, 3],
      [-0.00102, 3],
      [-0.00584, 2],
      [-0.0009, 3],
      [-0.00135, 3],
      [-0.00079, 3],
      [-0.00275, 0],
      [-0.00295, 0],
      [0.00648, 1],
      [-0.00076, 3],
      [-0.00258, 0],
      [-0.0011, 3]
    ],
    "red_o_points": [],
    "y_categories": ["N", "NOT APPLICABLE", "Y", "nan"],
    "blue_o_points": [],
    "blue_x_points": [
      [0.01037, 1],
      [-0.00015, 3],
      [0.00803, 1],
      [0.00051, 0],
      [-0.0009, 0],
      [0.00977, 1],
      [-0.00018, 3],
      [0.00873, 1],
      [-0.00039, 3],
      [-0.00028, 3]
    ]
  },
  "QA_mulInjTbpiCause[Motorcycle]": {
    "red_x_points": [
      [-0.00177, 0],
      [-0.00054, 1],
      [-0.00054, 1],
      [-0.00063, 1],
      [-0.00029, 1],
      [-0.0007, 1],
      [-0.00032, 1],
      [-0.00052, 1],
      [0.00164, 1],
      [-0.00056, 1],
      [-0.00054, 1],
      [-9e-5, 1],
      [-0.00715, 0],
      [-0.03943, 1],
      [-0.00047, 1],
      [-0.00079, 1],
      [-0.00029, 1],
      [-0.00054, 1],
      [-0.00133, 1],
      [-0.01644, 0],
      [0.00035, 1],
      [0.0033, 1],
      [-0.00029, 1],
      [-0.00025, 1],
      [-0.0008, 1],
      [-0.00825, 0],
      [-0.00033, 1],
      [-0.0003, 1],
      [-0.04303, 1],
      [-0.0003, 1],
      [-0.0003, 1],
      [-0.00057, 1]
    ],
    "red_o_points": [],
    "y_categories": ["N", "Y", "nan"],
    "blue_o_points": [],
    "blue_x_points": [
      [0.01843, 0],
      [-0.00102, 1],
      [0.01538, 0],
      [-0.00194, 1],
      [-0.00043, 1],
      [0.01832, 0],
      [0.0052, 1],
      [0.01697, 0],
      [0.00568, 1],
      [0.00399, 1]
    ]
  },
  "QS_mulLysisRoot[C6]": {
    "red_x_points": [
      [-0.00069, 3],
      [-0.0018, 0],
      [-0.00593, 2],
      [-0.00178, 0],
      [-0.00086, 3],
      [-0.00196, 0],
      [-0.00187, 0],
      [-0.00162, 0],
      [-0.00052, 3],
      [-0.00165, 0],
      [-0.00205, 0],
      [-0.00152, 0],
      [-0.00076, 3],
      [0.00428, 1],
      [-0.0007, 3],
      [-0.002, 0],
      [-0.00074, 3],
      [-0.00171, 0],
      [-0.00054, 3],
      [-0.00073, 3],
      [-0.00071, 3],
      [-0.00061, 3],
      [-0.00159, 0],
      [-0.00065, 3],
      [-0.00055, 3],
      [-0.00048, 3],
      [-0.00159, 0],
      [-0.00184, 0],
      [0.00483, 1],
      [-0.00069, 3],
      [-0.00554, 2],
      [-0.0007, 3]
    ],
    "red_o_points": [],
    "y_categories": ["N", "NOT APPLICABLE", "Y", "nan"],
    "blue_o_points": [],
    "blue_x_points": [
      [0.00728, 1],
      [-0.00035, 3],
      [0.00565, 1],
      [-0.00023, 0],
      [-0.00081, 0],
      [0.00578, 1],
      [-0.00017, 3],
      [0.00564, 1],
      [-0.00048, 3],
      [-0.00021, 3]
    ]
  },
  "QS_mulGraftLevel[Trunk]": {
    "red_x_points": [
      [-0.0001, 3],
      [-0.00022, 0],
      [-0.0002, 0],
      [-0.0002, 0],
      [-0.00014, 3],
      [-0.00029, 0],
      [-0.00019, 0],
      [-0.00026, 0],
      [-9e-5, 3],
      [-0.00028, 0],
      [-0.00021, 0],
      [-0.00033, 0],
      [-0.0001, 3],
      [0.00073, 1],
      [-0.00021, 3],
      [-0.00167, 2],
      [-0.00014, 3],
      [-0.00021, 0],
      [-0.00015, 3],
      [-0.00017, 3],
      [-0.00015, 3],
      [-3e-5, 3],
      [-0.00019, 0],
      [-0.0002, 3],
      [-0.0001, 3],
      [-0.00021, 3],
      [-0.00028, 0],
      [-0.00027, 0],
      [0.0002, 1],
      [-0.0001, 3],
      [-0.00022, 0],
      [-0.0001, 3]
    ],
    "red_o_points": [],
    "y_categories": ["N", "NOT APPLICABLE", "Y", "nan"],
    "blue_o_points": [],
    "blue_x_points": [
      [0.00089, 1],
      [-3e-5, 3],
      [0.00062, 1],
      [0.00033, 0],
      [-0.00023, 0],
      [0.00069, 1],
      [-0.0001, 3],
      [0.001, 1],
      [-6e-5, 3],
      [-1e-5, 3]
    ]
  },
  "QS_mulGraftNerve[other]": {
    "red_x_points": [
      [2e-5, 2],
      [-0.00018, 0],
      [-9e-5, 0],
      [-5e-5, 0],
      [-5e-5, 2],
      [-7e-5, 0],
      [-6e-5, 0],
      [-0.00013, 0],
      [-3e-5, 2],
      [-0.00014, 0],
      [-0.00014, 0],
      [-2e-5, 0],
      [-6e-5, 2],
      [-0.00015, 1],
      [-1e-5, 2],
      [-0.00013, 0],
      [-5e-5, 2],
      [-3e-5, 2],
      [2e-5, 2],
      [-4e-5, 2],
      [1e-5, 2],
      [-8e-5, 2],
      [-1e-5, 2],
      [-8e-5, 0],
      [-2e-5, 0],
      [0.00017, 1],
      [-1e-5, 2],
      [-3e-5, 0],
      [-5e-5, 2]
    ],
    "red_o_points": [],
    "y_categories": ["N", "NOT APPLICABLE", "nan"],
    "blue_o_points": [],
    "blue_x_points": [
      [0.00031, 1],
      [9e-5, 2],
      [0.00026, 1],
      [0.00018, 0],
      [-3e-5, 0],
      [0.00014, 1],
      [-1e-5, 2],
      [0.00019, 1],
      [-1e-5, 2],
      [6e-5, 2]
    ]
  },
  "QS_mulNeuromadSite[C5]": {
    "red_x_points": [
      [1e-5, 2],
      [-0.00049, 0],
      [-0.00024, 0],
      [-0.00024, 0],
      [-1e-5, 2],
      [-0.00051, 0],
      [-0.0004, 0],
      [-0.00035, 0],
      [-0.0, 2],
      [-0.00036, 0],
      [-0.00036, 0],
      [-0.00036, 0],
      [0.0, 2],
      [-0.0001, 1],
      [5e-5, 2],
      [-0.00034, 0],
      [6e-5, 2],
      [-0.00027, 0],
      [4e-5, 2],
      [5e-5, 2],
      [1e-5, 2],
      [4e-5, 2],
      [-0.00027, 0],
      [5e-5, 2],
      [-0.00012, 2],
      [1e-5, 2],
      [-0.00033, 0],
      [-0.00027, 0],
      [0.00036, 1],
      [2e-5, 2],
      [-0.00022, 0],
      [5e-5, 2]
    ],
    "red_o_points": [],
    "y_categories": ["N", "NOT APPLICABLE", "nan"],
    "blue_o_points": [],
    "blue_x_points": [
      [0.00109, 1],
      [0.00014, 2],
      [0.00084, 1],
      [0.0001, 0],
      [-0.0001, 0],
      [0.00059, 1],
      [6e-5, 2],
      [0.0006, 1],
      [6e-5, 2],
      [0.00017, 2]
    ]
  },
  "QS_mulNeuromadSite[C7]": {
    "red_x_points": [
      [-3e-5, 2],
      [-0.00049, 0],
      [-0.00052, 0],
      [-0.00055, 0],
      [-6e-5, 2],
      [-0.00056, 0],
      [-0.00047, 0],
      [-0.00057, 0],
      [-6e-5, 2],
      [-0.00063, 0],
      [-0.00061, 0],
      [-0.00056, 0],
      [3e-5, 2],
      [0.00062, 1],
      [1e-5, 2],
      [-0.00062, 0],
      [-1e-5, 2],
      [-0.00052, 0],
      [-0.00017, 2],
      [-5e-5, 2],
      [1e-5, 2],
      [-6e-5, 2],
      [-0.00032, 0],
      [2e-5, 2],
      [-0.00025, 2],
      [-7e-5, 2],
      [-0.00048, 0],
      [-0.00056, 0],
      [0.00067, 1],
      [-2e-5, 2],
      [-0.00036, 0],
      [-3e-5, 2]
    ],
    "red_o_points": [],
    "y_categories": ["N", "NOT APPLICABLE", "nan"],
    "blue_o_points": [],
    "blue_x_points": [
      [0.00126, 1],
      [0.00019, 2],
      [0.00104, 1],
      [8e-5, 0],
      [-0.00012, 0],
      [0.00107, 1],
      [2e-5, 2],
      [0.00121, 1],
      [1e-5, 2],
      [-4e-5, 2]
    ]
  },
  "QS_mulTransfSite[IMc]": {
    "red_x_points": [
      [-0.00161, 3],
      [-0.01034, 2],
      [-0.00348, 0],
      [-0.00347, 0],
      [-0.00152, 3],
      [-0.00401, 0],
      [-0.00327, 0],
      [-0.00361, 0],
      [-0.00184, 3],
      [-0.00367, 0],
      [-0.00375, 0],
      [-0.00323, 0],
      [-0.00194, 3],
      [0.00916, 1],
      [-0.00188, 3],
      [-0.00345, 0],
      [-0.00183, 3],
      [-0.00956, 2],
      [-0.00172, 3],
      [-0.00208, 3],
      [-0.00149, 3],
      [-0.00163, 3],
      [-0.00344, 0],
      [-0.00183, 3],
      [-0.00216, 3],
      [-0.00189, 3],
      [-0.00335, 0],
      [-0.00914, 2],
      [0.01065, 1],
      [-0.00165, 3],
      [-0.00924, 2],
      [-0.00189, 3]
    ],
    "red_o_points": [],
    "y_categories": ["N", "NOT APPLICABLE", "Y", "nan"],
    "blue_o_points": [],
    "blue_x_points": [
      [0.01577, 1],
      [-0.0007, 3],
      [0.0143, 1],
      [0.00056, 0],
      [-0.00179, 0],
      [0.01203, 1],
      [-0.00078, 3],
      [0.01401, 1],
      [-0.00063, 3],
      [-0.0005, 3]
    ]
  },
  "QS_mulNeuromadSite[T1]": {
    "red_x_points": [
      [-3e-5, 2],
      [-0.0009, 0],
      [-0.00082, 0],
      [-0.00083, 0],
      [-0.00012, 2],
      [-0.00104, 0],
      [-0.00075, 0],
      [-0.00098, 0],
      [-5e-5, 2],
      [-0.00101, 0],
      [-0.00109, 0],
      [-0.00064, 0],
      [-7e-5, 2],
      [0.00115, 1],
      [-1e-5, 2],
      [-0.00098, 0],
      [-8e-5, 2],
      [-0.00079, 0],
      [-0.00028, 2],
      [-8e-5, 2],
      [-0.00011, 2],
      [-6e-5, 2],
      [-0.00085, 0],
      [-4e-5, 2],
      [-0.00039, 2],
      [-7e-5, 2],
      [-0.00076, 0],
      [-0.00067, 0],
      [0.00121, 1],
      [-0.0, 2],
      [-0.00069, 0],
      [-0.00014, 2]
    ],
    "red_o_points": [],
    "y_categories": ["N", "NOT APPLICABLE", "nan"],
    "blue_o_points": [],
    "blue_x_points": [
      [0.00187, 1],
      [-9e-5, 2],
      [0.00154, 1],
      [0.00032, 0],
      [-0.00011, 0],
      [0.00178, 1],
      [2e-5, 2],
      [0.00206, 1],
      [-0.0, 2],
      [0.0001, 2]
    ]
  },
  "QS_mulLysisSite[Nerve]": {
    "red_x_points": [
      [-0.00018, 3],
      [-0.00032, 0],
      [-0.00188, 2],
      [-0.00041, 0],
      [-0.00017, 3],
      [-0.00039, 0],
      [-0.00019, 0],
      [-0.00033, 0],
      [-0.00034, 3],
      [-0.00043, 0],
      [-0.00041, 0],
      [-0.00036, 0],
      [-0.00018, 3],
      [0.00103, 1],
      [-0.0002, 3],
      [-0.00038, 0],
      [-0.00014, 3],
      [-0.00038, 0],
      [-0.00011, 3],
      [-0.00012, 3],
      [-0.00013, 3],
      [-0.0001, 3],
      [-0.00037, 0],
      [-0.00015, 3],
      [-0.0001, 3],
      [-0.0001, 3],
      [-0.00022, 0],
      [-0.00037, 0],
      [0.00095, 1],
      [-6e-5, 3],
      [-0.00027, 0],
      [-0.00013, 3]
    ],
    "red_o_points": [],
    "y_categories": ["N", "NOT APPLICABLE", "Y", "nan"],
    "blue_o_points": [],
    "blue_x_points": [
      [0.00143, 1],
      [-4e-5, 3],
      [0.00072, 1],
      [-2e-5, 0],
      [-0.00019, 0],
      [0.00093, 1],
      [-8e-5, 3],
      [0.00135, 1],
      [-0.00015, 3],
      [-9e-5, 3]
    ]
  },
  "QS_mulLysisRoot[C7]": {
    "red_x_points": [
      [-0.00027, 3],
      [-0.0008, 0],
      [-0.00303, 2],
      [-0.00078, 0],
      [-0.00024, 3],
      [-0.00095, 0],
      [-0.00096, 0],
      [-0.00076, 0],
      [-0.00037, 3],
      [-0.00068, 0],
      [-0.00072, 0],
      [-0.00064, 0],
      [-0.00024, 3],
      [0.0019, 1],
      [-0.0003, 3],
      [-0.00068, 0],
      [-0.0002, 3],
      [-0.00084, 0],
      [-0.0002, 3],
      [-0.00035, 3],
      [-0.00022, 3],
      [-0.0002, 3],
      [-0.00072, 0],
      [-0.00025, 3],
      [-0.00024, 3],
      [-0.0002, 3],
      [-0.00077, 0],
      [-0.00078, 0],
      [0.00154, 1],
      [-0.00017, 3],
      [-0.00076, 0],
      [-0.0002, 3]
    ],
    "red_o_points": [],
    "y_categories": ["N", "NOT APPLICABLE", "Y", "nan"],
    "blue_o_points": [],
    "blue_x_points": [
      [0.00322, 1],
      [-0.00015, 3],
      [0.00223, 1],
      [-7e-5, 0],
      [-0.00051, 0],
      [0.00213, 1],
      [-0.00015, 3],
      [0.00217, 1],
      [-0.00019, 3],
      [-5e-5, 3]
    ]
  },
  "QS_mulGraftNerve[Ul]": {
    "red_x_points": [
      [-6e-5, 0],
      [-6e-5, 0],
      [-2e-5, 2],
      [-6e-5, 0],
      [-2e-5, 2],
      [-6e-5, 0],
      [-2e-5, 2],
      [-6e-5, 0],
      [-2e-5, 2],
      [-2e-5, 2],
      [-2e-5, 2],
      [-2e-5, 2],
      [-2e-5, 2]
    ],
    "red_o_points": [],
    "y_categories": ["N", "NOT APPLICABLE", "nan"],
    "blue_o_points": [],
    "blue_x_points": [[0.00014, 1], [0.00014, 1], [0.00014, 1], [-2e-5, 2]]
  },
  "QA_lstPexPain[T1]": {
    "red_x_points": [
      [-0.00921, 1],
      [-0.00277, 2],
      [-0.00257, 2],
      [-0.00286, 2],
      [-0.00991, 1],
      [-0.00925, 0],
      [0.00164, 1],
      [0.00253, 1],
      [0.00719, 0],
      [0.00375, 1],
      [-0.00481, 0],
      [-0.00799, 0],
      [0.00731, 0],
      [-0.01436, 2],
      [-0.00556, 2],
      [-0.00483, 2],
      [-0.00508, 2],
      [-0.00144, 2],
      [-0.00572, 2],
      [0.0072, 0],
      [-0.01024, 1],
      [0.00895, 0],
      [-0.00446, 2],
      [-0.00484, 2],
      [-0.01181, 1],
      [-0.0068, 2],
      [-0.00528, 2],
      [-0.00258, 2],
      [-0.00675, 1],
      [-0.01208, 1],
      [0.0004, 1],
      [-0.00941, 1]
    ],
    "red_o_points": [],
    "y_categories": ["NORM", "NPV", "nan"],
    "blue_o_points": [],
    "blue_x_points": [
      [0.00018, 1],
      [-0.00069, 2],
      [0.0081, 0],
      [0.00813, 1],
      [0.01513, 1],
      [0.00011, 1],
      [0.01228, 0],
      [0.00515, 0],
      [0.0109, 0],
      [0.0165, 0]
    ]
  },
  "QS_mulTransfSite[AcMc]": {
    "red_x_points": [
      [-0.00027, 3],
      [-0.0007, 0],
      [-0.00045, 0],
      [-0.00062, 0],
      [-0.00018, 3],
      [-0.00084, 0],
      [-0.00061, 0],
      [-0.00042, 0],
      [-0.00052, 3],
      [-0.00066, 0],
      [-0.00096, 0],
      [-0.0081, 2],
      [-0.00045, 3],
      [0.00142, 1],
      [-0.0003, 3],
      [-0.0008, 0],
      [-0.00043, 3],
      [-0.0005, 0],
      [-0.0003, 3],
      [-0.00074, 3],
      [-0.00032, 3],
      [-0.00044, 3],
      [-0.00066, 0],
      [-0.0004, 3],
      [-0.00045, 3],
      [-0.00024, 3],
      [-0.00062, 0],
      [-0.00065, 0],
      [0.00198, 1],
      [-0.00036, 3],
      [-0.00055, 0],
      [-0.00022, 3]
    ],
    "red_o_points": [],
    "y_categories": ["N", "NOT APPLICABLE", "Y", "nan"],
    "blue_o_points": [],
    "blue_x_points": [
      [0.00319, 1],
      [-0.0002, 3],
      [0.00251, 1],
      [0.001, 0],
      [0.00066, 0],
      [0.00224, 1],
      [-3e-5, 3],
      [0.00255, 1],
      [2e-5, 3],
      [-0.00015, 3]
    ]
  },
  "QA_lstPexKine[Shoulder]": {
    "red_x_points": [
      [-0.00135, 1],
      [-0.00295, 2],
      [-0.00379, 2],
      [-0.00333, 2],
      [-0.00557, 2],
      [-0.00545, 1],
      [-0.0023, 1],
      [0.00465, 0],
      [-0.00914, 2],
      [-0.003, 1],
      [-0.00344, 1],
      [-0.00416, 1],
      [-0.00249, 1],
      [-0.00102, 2],
      [-0.00433, 2],
      [-0.00232, 1],
      [-0.00423, 2],
      [-0.00254, 2],
      [-0.00452, 2],
      [-0.00339, 1],
      [-0.00118, 1],
      [-0.00314, 1],
      [-0.00287, 2],
      [-0.005, 2],
      [-0.00202, 1],
      [-0.00725, 2],
      [-0.00655, 2],
      [-0.00384, 2],
      [-0.00133, 2],
      [-0.00468, 2],
      [-0.00134, 1],
      [-0.00561, 2]
    ],
    "red_o_points": [],
    "y_categories": ["NPV", "PV", "nan"],
    "blue_o_points": [],
    "blue_x_points": [
      [-5e-5, 1],
      [-0.0027, 2],
      [-0.00039, 1],
      [0.00165, 1],
      [0.03146, 0],
      [-0.00017, 1],
      [0.04224, 0],
      [-0.00036, 2],
      [1e-5, 1],
      [0.00022, 1]
    ]
  },
  "QA_yonInjBpsurg": {
    "red_x_points": [
      [-0.00144, 1],
      [-0.00126, 1],
      [-0.00142, 1],
      [-0.00143, 1],
      [-0.00157, 1],
      [-0.00174, 1],
      [-0.00161, 1],
      [-0.00157, 1],
      [-0.00177, 1],
      [-0.00183, 1],
      [-0.00171, 1],
      [-0.00153, 1],
      [-0.00163, 1],
      [0.00221, 0],
      [-0.00135, 1],
      [-0.00153, 1],
      [-0.00157, 1],
      [-0.00118, 1],
      [-0.00147, 1],
      [-0.00177, 1],
      [-0.00147, 1],
      [-0.00169, 1],
      [-0.00121, 1],
      [-0.00165, 1],
      [-0.0026, 1],
      [-0.00178, 1],
      [-0.00146, 1],
      [-0.00104, 1],
      [0.00318, 0],
      [-0.00145, 1],
      [-0.00146, 1],
      [-0.00173, 1]
    ],
    "red_o_points": [],
    "y_categories": ["N", "Y", "nan"],
    "blue_o_points": [],
    "blue_x_points": [
      [0.00715, 0],
      [0.00018, 1],
      [0.00656, 0],
      [-0.00121, 1],
      [-0.00146, 1],
      [0.00599, 0],
      [-0.00075, 1],
      [0.00699, 0],
      [-0.00083, 1],
      [-0.00034, 1]
    ]
  },
  "QA_lstPexTouch[C8]": {
    "red_x_points": [
      [-0.00854, 1],
      [-0.00273, 2],
      [-0.00254, 1],
      [-0.00282, 2],
      [-0.00845, 1],
      [0.00323, 0],
      [-0.00334, 1],
      [-0.00408, 1],
      [0.00615, 0],
      [-0.00354, 1],
      [0.00418, 0],
      [0.00321, 0],
      [-0.00923, 1],
      [-0.01488, 2],
      [-0.00536, 2],
      [-0.00348, 2],
      [-0.0099, 1],
      [-0.00231, 2],
      [-0.00578, 2],
      [0.00757, 0],
      [-0.00871, 1],
      [0.00637, 0],
      [-0.00336, 2],
      [-0.00554, 2],
      [0.00529, 0],
      [0.00712, 0],
      [-0.00352, 1],
      [-0.00318, 2],
      [-0.00736, 1],
      [-0.00529, 2],
      [-0.00318, 1],
      [-0.00951, 1]
    ],
    "red_o_points": [],
    "y_categories": ["NORM", "NPV", "nan"],
    "blue_o_points": [],
    "blue_x_points": [
      [0.01186, 0],
      [-0.00117, 2],
      [-0.00023, 1],
      [0.00143, 1],
      [0.00697, 0],
      [0.00015, 1],
      [0.01038, 0],
      [0.00686, 0],
      [0.00899, 0],
      [0.01133, 0]
    ]
  },
  "QS_mulLysisNerve[Ssr]": {
    "red_x_points": [
      [-0.00012, 3],
      [-0.00032, 0],
      [-0.0024, 2],
      [-0.00041, 0],
      [-0.00021, 3],
      [-0.00047, 0],
      [-0.00034, 0],
      [-9e-5, 0],
      [-0.00018, 3],
      [-0.00037, 0],
      [-0.00039, 0],
      [-0.00026, 0],
      [-0.00014, 3],
      [0.00079, 1],
      [-0.0003, 3],
      [-0.00036, 0],
      [-0.00018, 3],
      [-0.00043, 0],
      [-0.00012, 3],
      [-0.00018, 3],
      [-0.00021, 3],
      [-0.0001, 3],
      [-0.00017, 0],
      [-0.00031, 3],
      [-0.00013, 3],
      [-0.00011, 3],
      [-0.00034, 0],
      [-0.00041, 0],
      [0.00069, 1],
      [-0.00011, 3],
      [-0.00028, 0],
      [-0.00019, 3]
    ],
    "red_o_points": [],
    "y_categories": ["N", "NOT APPLICABLE", "Y", "nan"],
    "blue_o_points": [],
    "blue_x_points": [
      [0.00172, 1],
      [-0.00011, 3],
      [0.00099, 1],
      [0.00037, 0],
      [-0.00014, 0],
      [0.00076, 1],
      [-0.0001, 3],
      [0.00132, 1],
      [-0.00011, 3],
      [1e-5, 3]
    ]
  },
  "QS_mulTransfSite[AcSsAA]": {
    "red_x_points": [
      [-0.00212, 3],
      [-0.01483, 2],
      [-0.004, 0],
      [-0.01513, 2],
      [-0.00248, 3],
      [-0.02026, 2],
      [-0.00404, 0],
      [-0.00369, 0],
      [-0.0026, 3],
      [-0.00485, 0],
      [-0.017, 2],
      [-0.00334, 0],
      [-0.00233, 3],
      [0.01662, 1],
      [-0.00236, 3],
      [-0.01647, 2],
      [-0.00233, 3],
      [-0.00374, 0],
      [-0.00267, 3],
      [-0.00225, 3],
      [-0.00222, 3],
      [-0.00216, 3],
      [-0.01415, 2],
      [-0.00245, 3],
      [-0.00344, 3],
      [-0.00213, 3],
      [-0.00382, 0],
      [-0.01501, 2],
      [0.01822, 1],
      [-0.00203, 3],
      [-0.00394, 0],
      [-0.00241, 3]
    ],
    "red_o_points": [],
    "y_categories": ["N", "NOT APPLICABLE", "Y", "nan"],
    "blue_o_points": [],
    "blue_x_points": [
      [0.02613, 1],
      [-0.00087, 3],
      [0.0201, 1],
      [0.00144, 0],
      [0.00176, 0],
      [0.01915, 1],
      [-0.00086, 3],
      [0.02242, 1],
      [-0.00079, 3],
      [-0.00032, 3]
    ]
  },
  "QS_mulLysisRoot[C5]": {
    "red_x_points": [
      [-0.00125, 3],
      [-0.00251, 0],
      [-0.00746, 2],
      [-0.0025, 0],
      [-0.00124, 3],
      [-0.00294, 0],
      [-0.0022, 0],
      [-0.00244, 0],
      [-0.00172, 3],
      [-0.0022, 0],
      [-0.00242, 0],
      [-0.00181, 0],
      [-0.00114, 3],
      [0.00512, 1],
      [-0.00162, 3],
      [-0.00265, 0],
      [-0.00107, 3],
      [-0.00225, 0],
      [-0.00122, 3],
      [-0.00163, 3],
      [-0.00111, 3],
      [-0.00088, 3],
      [-0.00232, 0],
      [-0.00142, 3],
      [-0.00104, 3],
      [-0.00086, 3],
      [-0.00247, 0],
      [-0.00191, 0],
      [0.00611, 1],
      [-0.00114, 3],
      [-0.00732, 2],
      [-0.00126, 3]
    ],
    "red_o_points": [],
    "y_categories": ["N", "NOT APPLICABLE", "Y", "nan"],
    "blue_o_points": [],
    "blue_x_points": [
      [0.00947, 1],
      [-0.00027, 3],
      [0.00731, 1],
      [0.00094, 0],
      [-0.00043, 0],
      [0.00768, 1],
      [-0.00031, 3],
      [0.00842, 1],
      [-0.0006, 3],
      [-0.00065, 3]
    ]
  },
  "QS_mulNeuromadSite[C6]": {
    "red_x_points": [
      [-2e-5, 2],
      [-0.00064, 0],
      [-0.00051, 0],
      [-0.00061, 0],
      [-2e-5, 2],
      [-0.0009, 0],
      [-0.00052, 0],
      [-0.00065, 0],
      [-3e-5, 2],
      [-0.00065, 0],
      [-0.00068, 0],
      [-0.00063, 0],
      [-0.0, 2],
      [0.00022, 1],
      [-0.0, 2],
      [-0.00038, 0],
      [0.0, 2],
      [-0.00035, 0],
      [4e-5, 2],
      [-3e-5, 2],
      [-2e-5, 2],
      [-5e-5, 2],
      [-0.00038, 0],
      [-2e-5, 2],
      [-0.0, 2],
      [8e-5, 2],
      [-0.00072, 0],
      [-0.00038, 0],
      [0.00065, 1],
      [-0.0, 2],
      [-0.00036, 0],
      [-0.00014, 2]
    ],
    "red_o_points": [],
    "y_categories": ["N", "NOT APPLICABLE", "nan"],
    "blue_o_points": [],
    "blue_x_points": [
      [0.00153, 1],
      [7e-5, 2],
      [0.00084, 1],
      [0.00028, 0],
      [-0.0002, 0],
      [0.00122, 1],
      [4e-5, 2],
      [0.0011, 1],
      [1e-5, 2],
      [3e-5, 2]
    ]
  },
  "QS_mulBpsurgeryType[Lysis]": {
    "red_x_points": [
      [-0.00186, 3],
      [-0.00551, 0],
      [-0.01412, 2],
      [-0.00535, 0],
      [-0.00215, 3],
      [-0.00639, 0],
      [-0.01521, 2],
      [-0.00494, 0],
      [-0.00271, 3],
      [-0.00612, 0],
      [-0.00649, 0],
      [-0.00405, 0],
      [-0.00173, 3],
      [0.01343, 1],
      [-0.00179, 3],
      [-0.00601, 0],
      [-0.00258, 3],
      [-0.01323, 2],
      [-0.00176, 3],
      [-0.00234, 3],
      [-0.00202, 3],
      [-0.00206, 3],
      [-0.00527, 0],
      [-0.0021, 3],
      [-0.00303, 3],
      [-0.00166, 3],
      [-0.00494, 0],
      [-0.00544, 0],
      [0.01417, 1],
      [-0.00195, 3],
      [-0.01411, 2],
      [-0.00235, 3]
    ],
    "red_o_points": [],
    "y_categories": ["N", "NOT APPLICABLE", "Y", "nan"],
    "blue_o_points": [],
    "blue_x_points": [
      [0.0201, 1],
      [3e-5, 3],
      [0.01795, 1],
      [0.0022, 0],
      [-0.00092, 0],
      [0.01835, 1],
      [-0.00084, 3],
      [0.01905, 1],
      [-0.00083, 3],
      [-0.00026, 3]
    ]
  },
  "QA_lstPexTouch[C7]": {
    "red_x_points": [
      [-0.00785, 1],
      [-0.00262, 2],
      [-0.00242, 1],
      [-0.00269, 2],
      [-0.00744, 1],
      [0.00399, 0],
      [-0.0032, 1],
      [-0.0033, 1],
      [0.00671, 0],
      [-0.00309, 1],
      [0.00387, 0],
      [-0.00395, 1],
      [-0.01197, 1],
      [-0.00842, 2],
      [-0.00442, 2],
      [-0.003, 2],
      [-0.00962, 1],
      [-0.00205, 2],
      [-0.00606, 2],
      [0.00753, 0],
      [-0.00848, 1],
      [0.00634, 0],
      [-0.00331, 2],
      [-0.0044, 2],
      [0.00271, 0],
      [0.00677, 0],
      [-0.00343, 1],
      [-0.00275, 2],
      [-0.00285, 1],
      [-0.00444, 2],
      [-0.00259, 1],
      [-0.00818, 1]
    ],
    "red_o_points": [],
    "y_categories": ["NORM", "NPV", "nan"],
    "blue_o_points": [],
    "blue_x_points": [
      [-7e-5, 1],
      [-0.00109, 2],
      [0.00174, 1],
      [0.00087, 1],
      [0.00984, 0],
      [0.00124, 1],
      [0.01152, 0],
      [0.00485, 0],
      [0.00988, 0],
      [0.01172, 0]
    ]
  },
  "QA_lstPexMuscstrength[ShoulderAbduc]": {
    "red_x_points": [
      [-0.004, 1],
      [-0.00357, 1],
      [-0.00366, 1],
      [-0.00403, 1],
      [-0.00416, 1],
      [-0.00425, 1],
      [-0.0039, 1],
      [-0.00437, 1],
      [-0.00391, 1],
      [-0.00421, 1],
      [-0.00423, 1],
      [-0.00397, 1],
      [-0.00436, 1],
      [0.0011, 2],
      [0.00107, 2],
      [0.00098, 2],
      [0.00127, 2],
      [0.00119, 2],
      [0.00091, 2],
      [-0.00396, 1],
      [-0.00441, 1],
      [-0.00427, 1],
      [-0.00363, 1],
      [0.00115, 2],
      [-0.00523, 1],
      [-0.00377, 1],
      [-0.00399, 1],
      [-0.0041, 1],
      [0.00165, 2],
      [-0.00415, 1],
      [-0.00418, 1],
      [0.00139, 2]
    ],
    "red_o_points": [],
    "y_categories": ["GREATER THAN OR EQUALS TO 3", "LESS THAN 3", "nan"],
    "blue_o_points": [],
    "blue_x_points": [
      [0.00142, 2],
      [0.00189, 2],
      [0.02342, 0],
      [0.00254, 2],
      [-0.00296, 1],
      [0.0232, 0],
      [0.00211, 2],
      [-0.00149, 1],
      [-0.00275, 1],
      [-0.00256, 1]
    ]
  },
  "QA_lstPexMuscstrength[ThumbOppo]": {
    "red_x_points": [
      [-0.00679, 1],
      [0.00119, 2],
      [-0.00517, 1],
      [-0.00474, 1],
      [-0.00784, 1],
      [0.00123, 0],
      [0.00124, 0],
      [-0.008, 1],
      [0.00097, 0],
      [0.00113, 0],
      [0.00122, 0],
      [0.00132, 0],
      [0.00088, 0],
      [0.001, 2],
      [0.00136, 2],
      [0.00103, 2],
      [0.00053, 0],
      [0.0011, 2],
      [0.00123, 2],
      [0.00089, 0],
      [-0.00752, 1],
      [0.00068, 0],
      [-0.00482, 1],
      [0.00167, 2],
      [0.00162, 2],
      [0.00166, 2],
      [0.00115, 0],
      [-0.00483, 1],
      [0.00135, 2],
      [-0.0068, 1],
      [-0.00542, 1],
      [0.00189, 2]
    ],
    "red_o_points": [],
    "y_categories": ["GREATER THAN OR EQUALS TO 3", "LESS THAN 3", "nan"],
    "blue_o_points": [],
    "blue_x_points": [
      [0.00077, 2],
      [0.0022, 2],
      [0.00104, 0],
      [0.00379, 2],
      [0.00275, 0],
      [0.00117, 0],
      [0.0027, 0],
      [0.00104, 0],
      [0.00332, 2],
      [0.00307, 2]
    ]
  },
  "QS_mulNeuromadSite[T2]": {
    "red_x_points": [
      [-0.00022, 2],
      [-0.00145, 0],
      [-0.00119, 0],
      [-0.00142, 0],
      [-0.0002, 2],
      [-0.00152, 0],
      [-0.00081, 0],
      [-0.00158, 0],
      [-0.0002, 2],
      [-0.00155, 0],
      [-0.00149, 0],
      [-0.00131, 0],
      [-9e-5, 2],
      [0.00155, 1],
      [-0.0002, 2],
      [-0.00141, 0],
      [-0.00018, 2],
      [-0.00094, 0],
      [-0.00039, 2],
      [-0.0002, 2],
      [-8e-5, 2],
      [-0.00015, 2],
      [-0.00106, 0],
      [-0.00017, 2],
      [-0.00106, 2],
      [-0.00018, 2],
      [-0.001, 0],
      [-0.00106, 0],
      [0.00162, 1],
      [-8e-5, 2],
      [-0.0006, 0],
      [-0.00035, 2]
    ],
    "red_o_points": [],
    "y_categories": ["N", "NOT APPLICABLE", "nan"],
    "blue_o_points": [],
    "blue_x_points": [
      [0.00408, 1],
      [3e-5, 2],
      [0.00181, 1],
      [0.00049, 0],
      [-0.00031, 0],
      [0.00248, 1],
      [-2e-5, 2],
      [0.0024, 1],
      [-7e-5, 2],
      [0.00026, 2]
    ]
  },
  "QA_equInjTbpiTime": {
    "red_x_points": [
      [-0.00109, 0],
      [-0.00343, 0],
      [0.00673, 3],
      [-0.00412, 0],
      [-0.00362, 1],
      [-0.00877, 0],
      [-0.00568, 1],
      [-0.0055, 0],
      [-0.00121, 3],
      [-0.00606, 0],
      [-0.00675, 0],
      [0.01136, 3],
      [-0.00325, 0],
      [-0.03894, 2],
      [-0.00078, 3],
      [-0.00542, 0],
      [-0.00057, 0],
      [-0.00248, 0],
      [-0.01487, 1],
      [-0.00033, 3],
      [-0.0009, 0],
      [-0.00483, 1],
      [-0.00747, 2],
      [-0.00106, 3],
      [-0.01369, 1],
      [-0.01476, 2],
      [-0.00639, 0],
      [-0.00703, 2],
      [0.00046, 0],
      [0.00011, 0],
      [0.00623, 3],
      [-0.00543, 1]
    ],
    "red_o_points": [],
    "y_categories": [
      "0 TO 6 MONTHS",
      "13 TO 24 MONTHS",
      "25 MONTHS OR MORE",
      "7 TO 12 MONTHS",
      "nan"
    ],
    "blue_o_points": [],
    "blue_x_points": [
      [0.00354, 0],
      [0.0106, 0],
      [0.00475, 0],
      [0.01939, 3],
      [0.01618, 3],
      [0.00493, 0],
      [0.00621, 1],
      [0.01134, 3],
      [0.0068, 3],
      [0.00786, 0]
    ]
  },
  "QS_mulNeuromadSite[C4]": {
    "red_x_points": [
      [1e-5, 2],
      [-0.00116, 0],
      [-0.00095, 0],
      [-0.00121, 0],
      [-3e-5, 2],
      [-0.00102, 0],
      [-0.00074, 0],
      [-0.00095, 0],
      [-6e-5, 2],
      [-0.00084, 0],
      [-0.00095, 0],
      [-0.00099, 0],
      [2e-5, 2],
      [0.00139, 1],
      [-6e-5, 2],
      [-0.00111, 0],
      [2e-5, 2],
      [-0.00078, 0],
      [-0.00023, 2],
      [-1e-5, 2],
      [3e-5, 2],
      [-0.0001, 2],
      [-0.00081, 0],
      [-0.0001, 2],
      [-0.00015, 2],
      [-0.00012, 2],
      [-0.0009, 0],
      [-0.00103, 0],
      [0.00179, 1],
      [-6e-5, 2],
      [-0.00082, 0],
      [-0.00016, 2]
    ],
    "red_o_points": [],
    "y_categories": ["N", "NOT APPLICABLE", "nan"],
    "blue_o_points": [],
    "blue_x_points": [
      [0.00239, 1],
      [0.00023, 2],
      [0.00151, 1],
      [-4e-5, 0],
      [-0.00035, 0],
      [0.00188, 1],
      [1e-5, 2],
      [0.00204, 1],
      [6e-5, 2],
      [5e-5, 2]
    ]
  },
  "QS_mulTransfSite[Oberlin]": {
    "red_x_points": [
      [-0.00296, 3],
      [-0.01973, 0],
      [-0.02011, 0],
      [-0.01966, 0],
      [-0.00326, 3],
      [-0.00352, 2],
      [-0.00292, 2],
      [-0.01995, 0],
      [-0.0036, 3],
      [-0.0038, 2],
      [-0.00422, 2],
      [-0.00312, 2],
      [-0.00303, 3],
      [0.02403, 1],
      [-0.00294, 3],
      [-0.00395, 2],
      [-0.00299, 3],
      [-0.01909, 0],
      [-0.00353, 3],
      [-0.00318, 3],
      [-0.00278, 3],
      [-0.00279, 3],
      [-0.01899, 0],
      [-0.00287, 3],
      [-0.00385, 3],
      [-0.00322, 3],
      [-0.00294, 2],
      [-0.01819, 0],
      [0.02394, 1],
      [-0.00281, 3],
      [-0.01919, 0],
      [-0.00337, 3]
    ],
    "red_o_points": [],
    "y_categories": ["N", "NOT APPLICABLE", "Y", "nan"],
    "blue_o_points": [],
    "blue_x_points": [
      [0.03188, 1],
      [-0.00159, 3],
      [0.02506, 1],
      [0.00318, 2],
      [0.00102, 2],
      [0.02591, 1],
      [-0.00134, 3],
      [0.02619, 1],
      [-0.00108, 3],
      [-0.00108, 3]
    ]
  },
  "QA_lstPexMuscstrength[ElbowFlex]": {
    "red_x_points": [
      [-0.00342, 1],
      [-0.00266, 2],
      [-0.00423, 1],
      [-0.00398, 1],
      [-0.00315, 1],
      [0.01018, 0],
      [-0.00405, 1],
      [-0.00467, 1],
      [-0.00287, 1],
      [-0.00527, 1],
      [-0.00494, 1],
      [-0.00566, 1],
      [-0.00309, 1],
      [-0.00296, 2],
      [-0.00308, 2],
      [-0.00371, 2],
      [-0.00323, 1],
      [-0.00282, 2],
      [-0.00445, 2],
      [-0.00315, 1],
      [-0.00321, 1],
      [-0.00215, 1],
      [-0.0032, 1],
      [-0.00283, 2],
      [0.0007, 0],
      [-0.00243, 1],
      [-0.00449, 1],
      [-0.00332, 1],
      [-0.00274, 2],
      [-0.00313, 1],
      [-0.00378, 1],
      [-0.00347, 2]
    ],
    "red_o_points": [],
    "y_categories": ["GREATER THAN OR EQUALS TO 3", "LESS THAN 3", "nan"],
    "blue_o_points": [],
    "blue_x_points": [
      [-0.00049, 2],
      [-0.00102, 2],
      [0.01072, 0],
      [-0.00099, 1],
      [0.0255, 0],
      [0.01274, 0],
      [-0.00063, 1],
      [0.01211, 0],
      [-0.00024, 1],
      [-0.00057, 1]
    ]
  },
  "QS_mulGraftNerve[FI]": {
    "red_x_points": [
      [-0.0, 2],
      [-6e-5, 0],
      [-6e-5, 0],
      [-6e-5, 0],
      [-0.0, 2],
      [-0.00015, 0],
      [-0.00012, 0],
      [-0.00012, 0],
      [-0.00016, 2],
      [-0.00018, 0],
      [-0.00025, 0],
      [-0.00015, 0],
      [-6e-5, 2],
      [0.00011, 1],
      [-6e-5, 0],
      [-6e-5, 2],
      [-6e-5, 0],
      [-0.0, 2],
      [-0.00014, 2],
      [-0.0, 2],
      [-0.00016, 2],
      [-0.00012, 0],
      [0.0, 2],
      [-0.0, 2],
      [-0.0, 2],
      [-0.00015, 0],
      [-0.00012, 0],
      [-7e-5, 1],
      [-0.0, 2],
      [-0.00012, 0],
      [-7e-5, 2]
    ],
    "red_o_points": [],
    "y_categories": ["N", "NOT APPLICABLE", "nan"],
    "blue_o_points": [],
    "blue_x_points": [
      [0.00011, 1],
      [-0.0, 2],
      [0.00048, 1],
      [0.00013, 0],
      [-4e-5, 0],
      [0.00049, 1],
      [-6e-5, 2],
      [0.00037, 1],
      [-0.0, 2],
      [-0.0, 2]
    ]
  }
}
