{
  "QA_lstPexPain[C8]": {
    "red_x_points": [
      [-0.0093, 1],
      [-0.00202, 2],
      [-0.00161, 2],
      [-0.00196, 2],
      [-0.00956, 1],
      [-0.00044, 0],
      [0.0001, 1],
      [-0.00044, 1],
      [0.00783, 0],
      [-0.00082, 0],
      [0.00033, 0],
      [0.00023, 0],
      [-0.00969, 1],
      [-0.01063, 2],
      [-0.00492, 2],
      [-0.00221, 2],
      [-0.00508, 2],
      [-0.00158, 2],
      [-0.00502, 2],
      [0.00846, 0],
      [-0.00943, 1],
      [0.00734, 0],
      [-0.00264, 2],
      [-0.00495, 2],
      [0.00536, 0],
      [-0.00524, 2],
      [-0.00325, 2],
      [-0.00191, 2],
      [-0.00514, 1],
      [-0.0105, 1],
      [-0.00084, 1],
      [-0.00999, 1]
    ],
    "red_o_points": [],
    "y_categories": ["NORM", "NPV", "nan"],
    "blue_o_points": [],
    "blue_x_points": [
      [0.00706, 0],
      [-0.00094, 2],
      [0.0006, 1],
      [0.00745, 1],
      [0.00308, 0],
      [0.00039, 1],
      [0.01131, 0],
      [0.00406, 0],
      [0.01124, 0],
      [0.01281, 0]
    ]
  },
  "QS_mulLysisTrunk[Upper]": {
    "red_x_points": [
      [-0.00125, 3],
      [-0.0044, 0],
      [-0.00472, 0],
      [-0.00514, 0],
      [-0.0011, 3],
      [-0.00491, 0],
      [-0.01188, 2],
      [-0.0051, 0],
      [-0.00118, 3],
      [-0.00513, 0],
      [-0.00486, 0],
      [-0.00474, 0],
      [-0.00152, 3],
      [0.00919, 1],
      [-0.00098, 3],
      [-0.00428, 0],
      [-0.00151, 3],
      [-0.00968, 2],
      [-0.00128, 3],
      [-0.00166, 3],
      [-0.00107, 3],
      [-0.00115, 3],
      [-0.00494, 0],
      [-0.00129, 3],
      [-0.002, 3],
      [-0.00113, 3],
      [-0.00508, 0],
      [-0.00512, 0],
      [0.01022, 1],
      [-0.00103, 3],
      [-0.01016, 2],
      [-0.00157, 3]
    ],
    "red_o_points": [],
    "y_categories": ["N", "NOT APPLICABLE", "Y", "nan"],
    "blue_o_points": [],
    "blue_x_points": [
      [0.01548, 1],
      [-0.00031, 3],
      [0.01384, 1],
      [0.00021, 0],
      [-0.00134, 0],
      [0.01386, 1],
      [-0.00059, 3],
      [0.01315, 1],
      [-0.00037, 3],
      [-6e-5, 3]
    ]
  },
  "QS_mulBpsurgeryType[Transf]": {
    "red_x_points": [
      [-0.00013, 3],
      [-0.00048, 2],
      [-0.00181, 0],
      [-0.00059, 2],
      [-1e-5, 3],
      [-0.00056, 2],
      [-0.00055, 2],
      [-0.00051, 2],
      [-0.00026, 3],
      [-0.00056, 2],
      [-0.00063, 2],
      [-0.00058, 2],
      [-5e-5, 3],
      [0.00142, 1],
      [-0.00033, 3],
      [-0.00049, 2],
      [-0.00016, 3],
      [-0.00052, 2],
      [-0.00012, 3],
      [-0.0003, 3],
      [-0.0001, 3],
      [-2e-5, 3],
      [-0.00068, 2],
      [-0.00017, 3],
      [-0.00012, 3],
      [-0.00013, 3],
      [-0.00069, 2],
      [-0.0006, 2],
      [0.00152, 1],
      [-0.00013, 3],
      [-0.00056, 2],
      [-9e-5, 3]
    ],
    "red_o_points": [],
    "y_categories": ["N", "NOT APPLICABLE", "Y", "nan"],
    "blue_o_points": [],
    "blue_x_points": [
      [0.00165, 1],
      [-7e-5, 3],
      [0.00138, 1],
      [-0.0003, 2],
      [-0.00041, 2],
      [0.0015, 1],
      [-1e-5, 3],
      [0.00133, 1],
      [4e-5, 3],
      [-6e-5, 3]
    ]
  },
  "QS_equBpsurgTime": {
    "red_x_points": [
      [0.00042, 3],
      [-0.00579, 0],
      [0.00506, 2],
      [-0.00599, 0],
      [0.0004, 3],
      [-0.01002, 0],
      [-0.00641, 1],
      [-0.00641, 1],
      [0.00071, 3],
      [-0.00766, 1],
      [-0.0075, 0],
      [0.00657, 2],
      [0.00058, 3],
      [0.0007, 3],
      [0.00063, 3],
      [-0.00673, 1],
      [0.0004, 3],
      [0.0049, 2],
      [0.00054, 3],
      [0.00052, 3],
      [0.00062, 3],
      [0.00056, 3],
      [-0.00575, 0],
      [0.00054, 3],
      [0.00055, 3],
      [0.00063, 3],
      [-0.00703, 0],
      [-0.00508, 0],
      [0.00069, 3],
      [0.00056, 3],
      [0.00406, 2],
      [0.00052, 3]
    ],
    "red_o_points": [],
    "y_categories": [
      "0 TO 6 MONTHS",
      "13 TO 24 MONTHS",
      "7 TO 12 MONTHS",
      "nan"
    ],
    "blue_o_points": [],
    "blue_x_points": [
      [0.00059, 3],
      [0.00055, 3],
      [0.00056, 3],
      [0.01155, 2],
      [0.01231, 2],
      [0.00054, 3],
      [0.00074, 3],
      [0.00057, 3],
      [0.00086, 3],
      [0.0007, 3]
    ]
  },
  "QA_lstPexPain[C5]": {
    "red_x_points": [
      [-0.00166, 1],
      [-0.00425, 2],
      [-0.00422, 2],
      [-0.00447, 2],
      [-0.00158, 1],
      [-0.00082, 1],
      [-0.00069, 1],
      [-0.00081, 1],
      [-0.0022, 1],
      [-0.00095, 1],
      [-0.00096, 1],
      [-0.00077, 1],
      [-0.00192, 1],
      [-0.01496, 2],
      [-0.00543, 2],
      [-0.00433, 2],
      [-0.00547, 2],
      [-0.00404, 2],
      [-0.00539, 2],
      [-0.00203, 1],
      [-0.00151, 1],
      [-0.00177, 1],
      [-0.00499, 2],
      [-0.00592, 2],
      [-0.00201, 1],
      [-0.00546, 2],
      [-0.00384, 2],
      [-0.00439, 2],
      [-0.00331, 1],
      [-0.00339, 1],
      [-0.0006, 1],
      [-0.00187, 1]
    ],
    "red_o_points": [],
    "y_categories": ["NORM", "NPV", "nan"],
    "blue_o_points": [],
    "blue_x_points": [
      [0.02102, 0],
      [-0.00279, 2],
      [0.00031, 1],
      [-0.00026, 1],
      [-0.00051, 1],
      [0.00025, 1],
      [-0.0009, 1],
      [0.01623, 0],
      [-0.00101, 1],
      [0.03459, 0]
    ]
  },
  "QS_mulGraftRoot[T1]": {
    "red_x_points": [
      [4e-5, 2],
      [-0.00016, 0],
      [-6e-5, 0],
      [-0.0001, 0],
      [1e-5, 2],
      [-6e-5, 0],
      [-6e-5, 0],
      [1e-5, 2],
      [-6e-5, 0],
      [6e-5, 1],
      [1e-5, 2],
      [-0.0001, 0],
      [4e-5, 2],
      [-0.00016, 0],
      [1e-5, 2],
      [1e-5, 2],
      [1e-5, 2],
      [1e-5, 2],
      [-6e-5, 0],
      [1e-5, 2],
      [1e-5, 2],
      [-0.00016, 0],
      [-6e-5, 0],
      [6e-5, 1],
      [1e-5, 2],
      [1e-5, 2]
    ],
    "red_o_points": [],
    "y_categories": ["N", "NOT APPLICABLE", "nan"],
    "blue_o_points": [],
    "blue_x_points": [
      [0.00016, 1],
      [3e-5, 2],
      [0.00016, 1],
      [1e-5, 2],
      [1e-5, 2],
      [4e-5, 2]
    ]
  },
  "QS_mulGraftNerve[IS]": {
    "red_x_points": [
      [-2e-5, 2],
      [-0.00011, 0],
      [-0.00011, 0],
      [-0.00011, 0],
      [-2e-5, 2],
      [-0.00011, 0],
      [-0.00011, 0],
      [-0.00011, 0],
      [1e-5, 2],
      [-0.00011, 0],
      [-6e-5, 0],
      [-8e-5, 0],
      [-2e-5, 2],
      [0.0001, 1],
      [-1e-5, 2],
      [-3e-5, 0],
      [-2e-5, 2],
      [-3e-5, 2],
      [-1e-5, 2],
      [2e-5, 2],
      [-2e-5, 2],
      [-8e-5, 0],
      [1e-5, 2],
      [1e-5, 2],
      [2e-5, 2],
      [-8e-5, 0],
      [-4e-5, 0],
      [0.00019, 1],
      [-3e-5, 2],
      [-0.00011, 0],
      [-1e-5, 2]
    ],
    "red_o_points": [],
    "y_categories": ["N", "NOT APPLICABLE", "nan"],
    "blue_o_points": [],
    "blue_x_points": [
      [0.00026, 1],
      [-2e-5, 2],
      [0.00019, 1],
      [-8e-5, 0],
      [-3e-5, 0],
      [0.00019, 1],
      [1e-5, 2],
      [0.0001, 1],
      [-2e-5, 2]
    ]
  },
  "QS_mulGraftTrunk[LowerTrunk]": {
    "red_x_points": [
      [0.0, 2],
      [-7e-5, 0],
      [-7e-5, 0],
      [-7e-5, 0],
      [0.0, 2],
      [-7e-5, 0],
      [-4e-5, 0],
      [0.0, 2],
      [-4e-5, 0],
      [-4e-5, 0],
      [-7e-5, 0],
      [-7e-5, 0],
      [0.0, 2],
      [-3e-5, 0],
      [0.0, 2],
      [0.0, 2],
      [0.0, 2],
      [0.0, 2],
      [-7e-5, 0],
      [0.0, 2],
      [0.0, 2],
      [0.0, 2],
      [-3e-5, 0],
      [-7e-5, 0],
      [0.00019, 1],
      [-7e-5, 0],
      [0.0, 2]
    ],
    "red_o_points": [],
    "y_categories": ["N", "NOT APPLICABLE", "nan"],
    "blue_o_points": [],
    "blue_x_points": [
      [9e-5, 1],
      [0.0, 2],
      [0.0001, 1],
      [-4e-5, 0],
      [-3e-5, 0],
      [0.00019, 1],
      [0.0, 2],
      [0.00019, 1],
      [0.0, 2],
      [0.0, 2]
    ]
  },
  "QS_mulGraftNerve[Ph]": {
    "red_x_points": [
      [-0.0002, 2],
      [-0.00091, 0],
      [-0.00055, 0],
      [-0.00078, 0],
      [-0.0002, 2],
      [-0.00066, 0],
      [-0.00048, 0],
      [-0.00072, 0],
      [-7e-5, 2],
      [-0.00083, 0],
      [-0.00086, 0],
      [-0.00066, 0],
      [-0.00012, 2],
      [0.00076, 1],
      [2e-5, 2],
      [-0.0008, 0],
      [-0.00017, 2],
      [-0.00075, 0],
      [1e-5, 2],
      [-6e-5, 2],
      [-0.00013, 2],
      [-0.0001, 2],
      [-0.00047, 0],
      [-8e-5, 2],
      [-0.00013, 2],
      [-0.0001, 2],
      [-0.00071, 0],
      [-0.00053, 0],
      [0.00112, 1],
      [-8e-5, 2],
      [-0.00059, 0],
      [-0.00011, 2]
    ],
    "red_o_points": [],
    "y_categories": ["N", "NOT APPLICABLE", "nan"],
    "blue_o_points": [],
    "blue_x_points": [
      [0.00213, 1],
      [8e-5, 2],
      [0.00145, 1],
      [-6e-5, 0],
      [-0.00026, 0],
      [0.0016, 1],
      [4e-5, 2],
      [0.00142, 1],
      [0.0, 2],
      [5e-5, 2]
    ]
  },
  "QA_mulInjOrthesisType[ArmSling]": {
    "red_x_points": [
      [-0.00563, 2],
      [-0.00562, 2],
      [-0.00534, 2],
      [-0.00535, 2],
      [-0.00558, 2],
      [-0.00546, 2],
      [-0.00615, 2],
      [-0.0055, 2],
      [-0.00484, 2],
      [-0.00583, 2],
      [-0.00522, 2],
      [-0.00573, 2],
      [-0.00536, 2],
      [0.00922, 1],
      [-0.00685, 2],
      [-0.00541, 2],
      [-0.00648, 2],
      [-0.00963, 0],
      [0.00982, 1],
      [-0.00484, 2],
      [-0.00535, 2],
      [-0.01405, 0],
      [-0.00173, 3],
      [-0.00704, 2],
      [0.0083, 1],
      [-0.00541, 2],
      [-0.00567, 2],
      [-0.00508, 2],
      [-0.00836, 3],
      [-0.00092, 3],
      [-0.00502, 2],
      [-0.00613, 2]
    ],
    "red_o_points": [],
    "y_categories": ["N", "NOT APPLICABLE", "Y", "nan"],
    "blue_o_points": [],
    "blue_x_points": [
      [0.00213, 2],
      [0.01881, 1],
      [0.01206, 1],
      [0.02684, 1],
      [-0.00372, 2],
      [0.01211, 1],
      [-0.00202, 2],
      [0.01155, 1],
      [-0.00145, 2],
      [0.01061, 3]
    ]
  },
  "QA_mulInjOrthesisType[ShoulderSupport]": {
    "red_x_points": [
      [-0.00585, 0],
      [-0.00518, 0],
      [-0.00615, 0],
      [-0.00519, 0],
      [-0.00569, 0],
      [-0.00511, 0],
      [-0.00509, 0],
      [-0.00532, 0],
      [-0.01619, 2],
      [-0.00557, 0],
      [-0.00572, 0],
      [-0.00573, 0],
      [-0.00509, 0],
      [0.01181, 1],
      [-0.00642, 0],
      [-0.00535, 0],
      [-0.00595, 0],
      [-0.01061, 2],
      [0.01385, 1],
      [-0.00502, 0],
      [-0.00537, 0],
      [-0.0159, 2],
      [-0.00305, 3],
      [-0.00661, 0],
      [0.00898, 1],
      [-0.00651, 0],
      [-0.00549, 0],
      [-0.00483, 0],
      [-0.01043, 3],
      [-0.00193, 3],
      [-0.0049, 0],
      [-0.00662, 0]
    ],
    "red_o_points": [],
    "y_categories": ["N", "NOT APPLICABLE", "Y", "nan"],
    "blue_o_points": [],
    "blue_x_points": [
      [0.00172, 0],
      [0.01913, 1],
      [0.0145, 1],
      [0.02407, 1],
      [-0.00309, 0],
      [0.01422, 1],
      [-0.00174, 0],
      [0.01519, 1],
      [-0.00206, 0],
      [0.00949, 3]
    ]
  },
  "QA_yonInjUnconscio": {
    "red_x_points": [
      [-0.00436, 1],
      [-0.00558, 1],
      [-0.0034, 2],
      [-0.00321, 2],
      [-0.0035, 2],
      [0.01696, 0],
      [-0.00633, 1],
      [-0.0033, 2],
      [-0.00403, 2],
      [-0.00425, 2],
      [-0.00415, 2],
      [-0.00878, 1],
      [-0.00631, 1],
      [-0.01516, 1],
      [-0.00617, 2],
      [-0.00358, 2],
      [-0.00431, 2],
      [-0.00535, 1],
      [0.00414, 0],
      [-0.00713, 1],
      [-0.00495, 1],
      [-0.007, 1],
      [-0.00572, 1],
      [-0.00552, 2],
      [-0.00668, 1],
      [-0.00421, 2],
      [-0.00723, 1],
      [-0.0058, 1],
      [-0.00125, 2],
      [-0.00403, 2],
      [-0.00586, 1],
      [-0.00465, 2]
    ],
    "red_o_points": [],
    "y_categories": ["N", "Y", "nan"],
    "blue_o_points": [],
    "blue_x_points": [
      [0.00015, 2],
      [0.00843, 1],
      [0.01466, 0],
      [0.0222, 0],
      [0.02174, 0],
      [0.00035, 2],
      [-0.00197, 1],
      [0.00059, 2],
      [0.0239, 0],
      [-0.00093, 2]
    ]
  },
  "QA_lstInjTpbiSide": {
    "red_x_points": [
      [-0.00304, 1],
      [0.00092, 0],
      [0.0, 0],
      [0.00032, 0],
      [0.00039, 0],
      [-0.00142, 1],
      [-0.0007, 0],
      [-0.00153, 0],
      [-0.00391, 1],
      [-0.00127, 0],
      [-0.00159, 1],
      [-0.00121, 1],
      [-0.00226, 1],
      [-0.01007, 0],
      [-0.00631, 1],
      [-0.00271, 1],
      [0.0006, 0],
      [-0.00205, 1],
      [-0.00672, 1],
      [0.00034, 0],
      [0.00091, 0],
      [-0.00049, 0],
      [5e-5, 0],
      [0.00299, 0],
      [-0.00573, 1],
      [-0.00506, 1],
      [-0.00136, 1],
      [-0.00034, 1],
      [-0.00837, 0],
      [-0.00502, 1],
      [-0.00041, 0],
      [0.00155, 0]
    ],
    "red_o_points": [],
    "y_categories": ["L", "R", "nan"],
    "blue_o_points": [],
    "blue_x_points": [
      [-0.00325, 0],
      [0.00705, 0],
      [0.00565, 1],
      [0.00362, 0],
      [0.00232, 1],
      [0.00605, 1],
      [0.00273, 1],
      [0.00574, 1],
      [0.0048, 0],
      [0.00473, 0]
    ]
  },
  "QA_intPexWristFlex": {
    "red_x_points": [
      [-0.00026, 2],
      [-0.00103, 2],
      [-0.00085, 2],
      [-0.00122, 2],
      [-0.00069, 0],
      [-0.00561, 0],
      [-0.00387, 0],
      [-0.00143, 2],
      [-0.00137, 0],
      [-0.00191, 2],
      [-0.00193, 2],
      [-0.00205, 2],
      [-0.00146, 0],
      [0.00031, 2],
      [-0.00017, 2],
      [-0.00165, 2],
      [-1e-5, 2],
      [-0.00101, 2],
      [-0.00022, 2],
      [-0.00133, 0],
      [-0.00062, 0],
      [-0.00142, 0],
      [-0.00199, 0],
      [-8e-5, 2],
      [-0.00015, 2],
      [-0.00024, 2],
      [-0.00196, 2],
      [-0.00137, 2],
      [-0.01506, 1],
      [-0.00023, 1],
      [-0.00241, 0],
      [-0.00022, 2]
    ],
    "red_o_points": [],
    "y_categories": ["GREATER THAN OR EQUALS TO 60", "LESS THAN 60", "nan"],
    "blue_o_points": [],
    "blue_x_points": [
      [0.00125, 2],
      [7e-5, 2],
      [0.00512, 0],
      [-0.00041, 2],
      [0.02539, 1],
      [0.00167, 2],
      [0.00018, 2],
      [0.00129, 2],
      [0.00109, 0],
      [0.00011, 2]
    ]
  },
  "QA_lstPexArthre[Shoulder]": {
    "red_x_points": [
      [-0.00014, 2],
      [-0.00186, 3],
      [-0.00201, 3],
      [-0.00205, 0],
      [-0.00326, 3],
      [-0.00297, 2],
      [-0.00133, 2],
      [0.00206, 1],
      [-0.00436, 3],
      [-0.0012, 2],
      [-0.00205, 2],
      [-0.00216, 2],
      [-0.00089, 2],
      [-0.00045, 3],
      [-0.00185, 3],
      [-0.00085, 2],
      [-0.00268, 3],
      [-0.00123, 3],
      [-0.00199, 3],
      [-0.00125, 2],
      [-0.00103, 1],
      [-0.00165, 2],
      [-0.00154, 3],
      [-0.00196, 3],
      [-0.00108, 2],
      [-0.00351, 3],
      [-0.00332, 3],
      [-0.0018, 3],
      [-0.00074, 3],
      [-0.00228, 3],
      [7e-5, 1],
      [-0.00271, 3]
    ],
    "red_o_points": [],
    "y_categories": ["NAIA", "NPV", "PV", "nan"],
    "blue_o_points": [],
    "blue_x_points": [
      [-0.00011, 2],
      [-0.00102, 3],
      [-0.00036, 2],
      [0.00153, 2],
      [0.01382, 1],
      [-0.0002, 2],
      [0.01504, 1],
      [-6e-5, 3],
      [0.00255, 2],
      [0.00106, 2]
    ]
  },
  "QS_mulGraftRoot[T2]": {
    "red_x_points": [
      [-6e-5, 0],
      [-0.0001, 0],
      [-0.0001, 0],
      [0.0, 2],
      [-0.0001, 0],
      [-4e-5, 0],
      [-0.0001, 0],
      [2e-5, 2],
      [-6e-5, 0],
      [-0.0001, 0],
      [-0.0001, 0],
      [1e-5, 2],
      [0.00017, 1],
      [2e-5, 2],
      [-0.0001, 0],
      [0.0, 2],
      [-0.0001, 0],
      [2e-5, 2],
      [1e-5, 2],
      [2e-5, 2],
      [-0.0001, 0],
      [2e-5, 2],
      [1e-5, 2],
      [0.0, 2],
      [-0.0001, 0],
      [-0.0001, 0],
      [0.00017, 1],
      [1e-5, 2],
      [-4e-5, 0],
      [0.0, 2]
    ],
    "red_o_points": [],
    "y_categories": ["N", "NOT APPLICABLE", "nan"],
    "blue_o_points": [],
    "blue_x_points": [
      [0.00017, 1],
      [2e-5, 2],
      [0.00017, 1],
      [-4e-5, 0],
      [7e-5, 1],
      [2e-5, 2],
      [0.00017, 1],
      [1e-5, 2]
    ]
  },
  "QS_mulLysisSite[Trunk]": {
    "red_x_points": [
      [-0.00142, 3],
      [-0.00256, 0],
      [-0.00272, 0],
      [-0.00276, 0],
      [-0.00124, 3],
      [-0.00383, 0],
      [-0.00846, 2],
      [-0.00295, 0],
      [-0.00152, 3],
      [-0.00295, 0],
      [-0.00399, 0],
      [-0.00312, 0],
      [-0.00131, 3],
      [0.00702, 1],
      [-0.00097, 3],
      [-0.00334, 0],
      [-0.00134, 3],
      [-0.00696, 2],
      [-0.00112, 3],
      [-0.00148, 3],
      [-0.00111, 3],
      [-0.00165, 3],
      [-0.00281, 0],
      [-0.00109, 3],
      [-0.00136, 3],
      [-0.00104, 3],
      [-0.00261, 0],
      [-0.00266, 0],
      [0.00738, 1],
      [-0.00111, 3],
      [-0.0063, 2],
      [-0.00102, 3]
    ],
    "red_o_points": [],
    "y_categories": ["N", "NOT APPLICABLE", "Y", "nan"],
    "blue_o_points": [],
    "blue_x_points": [
      [0.01052, 1],
      [-9e-5, 3],
      [0.00871, 1],
      [0.00048, 0],
      [-0.00138, 0],
      [0.01049, 1],
      [-0.00063, 3],
      [0.0098, 1],
      [-0.00033, 3],
      [-0.00015, 3]
    ]
  },
  "QA_equInjTbpiAge": {
    "red_x_points": [
      [0.00047, 1],
      [-5e-5, 1],
      [-0.00033, 1],
      [-0.00064, 0],
      [0.00078, 1],
      [-0.00026, 0],
      [-0.00103, 1],
      [-5e-5, 1],
      [-0.00573, 0],
      [-0.00085, 0],
      [-0.00079, 0],
      [-0.00173, 1],
      [-0.00445, 0],
      [-0.01165, 1],
      [0.00094, 1],
      [-1e-5, 1],
      [0.00026, 1],
      [-0.0011, 0],
      [-0.00511, 0],
      [0.00072, 1],
      [-0.00512, 0],
      [0.00088, 1],
      [-2e-5, 1],
      [0.00107, 1],
      [0.00021, 1],
      [-0.00684, 0],
      [-0.0006, 1],
      [-0.00024, 1],
      [-0.01095, 1],
      [0.00079, 1],
      [-0.00048, 0],
      [0.00119, 1]
    ],
    "red_o_points": [],
    "y_categories": ["GREATER THAN OR EQUALS TO 30", "LESS THAN 30", "nan"],
    "blue_o_points": [],
    "blue_x_points": [
      [-0.00433, 1],
      [0.0022, 1],
      [0.00632, 0],
      [0.00157, 1],
      [0.00242, 0],
      [0.00739, 0],
      [0.00248, 1],
      [0.00674, 0],
      [0.00349, 1],
      [0.00284, 1]
    ]
  },
  "QS_mulTransfSite[PhMc]": {
    "red_x_points": [
      [-0.00108, 3],
      [-0.00271, 0],
      [-0.00242, 0],
      [-0.00305, 0],
      [-0.00114, 3],
      [-0.00278, 0],
      [-0.0029, 0],
      [-0.0065, 2],
      [-0.00123, 3],
      [-0.00297, 0],
      [-0.00317, 0],
      [-0.00284, 0],
      [-0.00115, 3],
      [0.00535, 1],
      [-0.00093, 3],
      [-0.00291, 0],
      [-0.0014, 3],
      [-0.00251, 0],
      [-0.00096, 3],
      [-0.0013, 3],
      [-0.00082, 3],
      [-0.00123, 3],
      [-0.0056, 2],
      [-0.00102, 3],
      [-0.00134, 3],
      [-0.0008, 3],
      [-0.0026, 0],
      [-0.00264, 0],
      [0.00623, 1],
      [-0.00077, 3],
      [-0.00246, 0],
      [-0.00117, 3]
    ],
    "red_o_points": [],
    "y_categories": ["N", "NOT APPLICABLE", "Y", "nan"],
    "blue_o_points": [],
    "blue_x_points": [
      [0.01076, 1],
      [-0.00014, 3],
      [0.00791, 1],
      [-7e-5, 0],
      [-0.00145, 0],
      [0.00859, 1],
      [-0.0005, 3],
      [0.0077, 1],
      [-0.00026, 3],
      [-0.00013, 3]
    ]
  },
  "QS_mulLysisSite[Root]": {
    "red_x_points": [
      [-0.00062, 3],
      [-0.00176, 0],
      [-0.00513, 2],
      [-0.00187, 0],
      [-0.00068, 3],
      [-0.00193, 0],
      [-0.00184, 0],
      [-0.00197, 0],
      [-0.00065, 3],
      [-0.00182, 0],
      [-0.00199, 0],
      [-0.00173, 0],
      [-0.00076, 3],
      [0.00416, 1],
      [-0.00068, 3],
      [-0.00201, 0],
      [-0.0005, 3],
      [-0.00184, 0],
      [-0.0005, 3],
      [-0.00083, 3],
      [-0.0005, 3],
      [-0.00072, 3],
      [-0.00181, 0],
      [-0.00052, 3],
      [-0.00076, 3],
      [-0.00064, 3],
      [-0.00184, 0],
      [-0.00188, 0],
      [0.00501, 1],
      [-0.00066, 3],
      [-0.00491, 2],
      [-0.00082, 3]
    ],
    "red_o_points": [],
    "y_categories": ["N", "NOT APPLICABLE", "Y", "nan"],
    "blue_o_points": [],
    "blue_x_points": [
      [0.00659, 1],
      [-0.00017, 3],
      [0.00572, 1],
      [-0.0004, 0],
      [-0.00071, 0],
      [0.00593, 1],
      [-0.00034, 3],
      [0.00569, 1],
      [-0.00031, 3],
      [-0.0003, 3]
    ]
  },
  "QA_yonInjOrtsurg": {
    "red_x_points": [
      [-0.00134, 2],
      [-0.00027, 2],
      [-5e-5, 2],
      [2e-5, 2],
      [-0.00134, 2],
      [7e-5, 2],
      [9e-5, 2],
      [0.00041, 1],
      [-0.00155, 2],
      [-0.00105, 0],
      [0.00042, 1],
      [0.00042, 1],
      [-0.00127, 2],
      [-0.00438, 0],
      [0.00516, 1],
      [-0.00026, 2],
      [-0.00158, 2],
      [-0.00197, 0],
      [-0.01071, 0],
      [-0.00986, 0],
      [0.00287, 1],
      [-0.00152, 2],
      [0.00049, 1],
      [-0.00229, 2],
      [-0.00149, 2],
      [-0.00154, 2],
      [-0.00133, 0],
      [-0.00125, 0],
      [0.00058, 1],
      [-0.00201, 2],
      [0.00035, 1],
      [-0.00159, 2]
    ],
    "red_o_points": [],
    "y_categories": ["N", "Y", "nan"],
    "blue_o_points": [],
    "blue_x_points": [
      [0.00025, 2],
      [0.01057, 1],
      [0.00057, 2],
      [0.00077, 2],
      [0.00017, 2],
      [0.00044, 2],
      [-0.00065, 2],
      [0.00046, 2],
      [0.01142, 1],
      [-0.00095, 2]
    ]
  },
  "QS_mulGraftNerve[other]": {
    "red_x_points": [
      [-5e-5, 2],
      [-0.00057, 0],
      [-0.00046, 0],
      [-0.00043, 0],
      [-0.00017, 2],
      [-0.00053, 0],
      [-0.00037, 0],
      [-0.00059, 0],
      [-0.0003, 2],
      [-0.00048, 0],
      [-0.00076, 0],
      [-0.00054, 0],
      [-0.00023, 2],
      [0.00078, 1],
      [-5e-5, 2],
      [-0.00056, 0],
      [-0.00023, 2],
      [-0.00041, 0],
      [-0.00021, 2],
      [-0.00016, 2],
      [-0.0001, 2],
      [-0.00021, 2],
      [-0.00043, 0],
      [-8e-5, 2],
      [-5e-5, 2],
      [-8e-5, 2],
      [-0.00049, 0],
      [-0.00037, 0],
      [0.00109, 1],
      [-6e-5, 2],
      [-0.0004, 0],
      [-4e-5, 2]
    ],
    "red_o_points": [],
    "y_categories": ["N", "NOT APPLICABLE", "nan"],
    "blue_o_points": [],
    "blue_x_points": [
      [0.00153, 1],
      [3e-5, 2],
      [0.00126, 1],
      [-0.00011, 0],
      [-0.00021, 0],
      [0.00127, 1],
      [-0.0, 2],
      [0.00135, 1],
      [-9e-5, 2],
      [-6e-5, 2]
    ]
  },
  "QS_mulGraftNerve[DS]": {
    "red_x_points": [
      [-4e-5, 2],
      [-4e-5, 2],
      [1e-5, 0],
      [1e-5, 0],
      [1e-5, 0],
      [1e-5, 0],
      [-4e-5, 2],
      [-4e-5, 2],
      [-4e-5, 2],
      [-4e-5, 2],
      [-4e-5, 2],
      [-4e-5, 2],
      [-4e-5, 2]
    ],
    "red_o_points": [],
    "y_categories": ["N", "NOT APPLICABLE", "nan"],
    "blue_o_points": [],
    "blue_x_points": [[1e-5, 0], [0.00014, 1], [-4e-5, 2]]
  },
  "QS_mulGraftNerve[LP]": {
    "red_x_points": [[-6e-5, 0], [-6e-5, 0], [1e-5, 2]],
    "red_o_points": [],
    "y_categories": ["N", "NOT APPLICABLE", "nan"],
    "blue_o_points": [],
    "blue_x_points": [[7e-5, 1], [-6e-5, 0], [1e-5, 2], [1e-5, 2]]
  },
  "QA_lstPexMuscstrength[WristFlex]": {
    "red_x_points": [
      [-0.00169, 1],
      [-0.00069, 2],
      [-0.00284, 1],
      [-0.0017, 1],
      [-0.00122, 0],
      [0.00037, 0],
      [0.00066, 0],
      [-0.00317, 1],
      [-0.00279, 0],
      [0.00078, 0],
      [0.00018, 0],
      [0.00021, 0],
      [-0.00144, 0],
      [-0.00098, 2],
      [-0.00048, 2],
      [-0.00068, 2],
      [-0.0009, 0],
      [-0.00067, 2],
      [-0.00036, 2],
      [-0.00403, 0],
      [-0.00194, 1],
      [-0.00262, 0],
      [-0.00144, 1],
      [-0.00048, 2],
      [-0.00469, 1],
      [-0.00175, 0],
      [0.00068, 0],
      [0.00049, 0],
      [-0.00062, 2],
      [-0.00236, 1],
      [-0.00256, 1],
      [-0.00051, 2]
    ],
    "red_o_points": [],
    "y_categories": ["GREATER THAN OR EQUALS TO 3", "LESS THAN 3", "nan"],
    "blue_o_points": [],
    "blue_x_points": [
      [0.00066, 0],
      [0.00044, 2],
      [0.00125, 0],
      [0.00407, 0],
      [0.00166, 0],
      [0.00095, 0],
      [0.00084, 0],
      [0.00132, 0],
      [0.00782, 1],
      [0.00483, 2]
    ]
  },
  "QS_mulNeuromadSite[C5]": {
    "red_x_points": [
      [-0.00017, 2],
      [-0.00142, 0],
      [-0.00102, 0],
      [-0.00132, 0],
      [-0.00021, 2],
      [-0.00171, 0],
      [-0.00131, 0],
      [-0.00107, 0],
      [-0.00017, 2],
      [-0.00153, 0],
      [-0.00163, 0],
      [-0.00137, 0],
      [-0.00017, 2],
      [0.00169, 1],
      [-0.00023, 2],
      [-0.00151, 0],
      [-0.00022, 2],
      [-0.00132, 0],
      [-0.00021, 2],
      [-7e-5, 2],
      [-5e-5, 2],
      [-5e-5, 2],
      [-0.00089, 0],
      [-0.00014, 2],
      [-0.00016, 2],
      [-8e-5, 2],
      [-0.00122, 0],
      [-0.0011, 0],
      [0.00154, 1],
      [-0.00013, 2],
      [-0.00114, 0],
      [-0.00019, 2]
    ],
    "red_o_points": [],
    "y_categories": ["N", "NOT APPLICABLE", "nan"],
    "blue_o_points": [],
    "blue_x_points": [
      [0.00403, 1],
      [5e-5, 2],
      [0.00274, 1],
      [-0.00039, 0],
      [-0.00048, 0],
      [0.00337, 1],
      [-0.00012, 2],
      [0.00257, 1],
      [-8e-5, 2],
      [0.00022, 2]
    ]
  },
  "QS_mulNeuromadSite[C7]": {
    "red_x_points": [
      [-0.00021, 2],
      [-0.0008, 0],
      [-0.00104, 0],
      [-0.00139, 0],
      [-0.00041, 2],
      [-0.00142, 0],
      [-0.00098, 0],
      [-0.00113, 0],
      [-0.00027, 2],
      [-0.00108, 0],
      [-0.00134, 0],
      [-0.00121, 0],
      [-0.00042, 2],
      [0.00194, 1],
      [-0.00015, 2],
      [-0.00162, 0],
      [-0.00021, 2],
      [-0.0015, 0],
      [-0.00045, 2],
      [-0.00024, 2],
      [-0.0001, 2],
      [-0.00016, 2],
      [-0.00098, 0],
      [-0.00015, 2],
      [-0.00033, 2],
      [-0.00011, 2],
      [-0.00126, 0],
      [-0.00115, 0],
      [0.00139, 1],
      [-0.00014, 2],
      [-0.0009, 0],
      [-0.00016, 2]
    ],
    "red_o_points": [],
    "y_categories": ["N", "NOT APPLICABLE", "nan"],
    "blue_o_points": [],
    "blue_x_points": [
      [0.00323, 1],
      [0.00025, 2],
      [0.00291, 1],
      [-7e-5, 0],
      [-0.00022, 0],
      [0.00289, 1],
      [-0.00016, 2],
      [0.002, 1],
      [-4e-5, 2],
      [-0.00011, 2]
    ]
  },
  "QA_lstPexMuscstrength[WristExte]": {
    "red_x_points": [
      [0.0007, 1],
      [-0.00108, 2],
      [-0.00388, 1],
      [-0.00146, 1],
      [0.00092, 1],
      [0.00063, 0],
      [-0.00303, 1],
      [-0.0023, 1],
      [-0.00881, 0],
      [0.00198, 0],
      [0.00039, 0],
      [-0.00472, 1],
      [-0.00674, 0],
      [-0.00198, 2],
      [-1e-5, 2],
      [-0.0014, 2],
      [-0.00392, 0],
      [-0.00191, 2],
      [0.00017, 2],
      [-0.01004, 0],
      [0.00134, 1],
      [-0.01078, 0],
      [-0.00145, 1],
      [4e-5, 2],
      [-0.00915, 0],
      [0.00141, 1],
      [0.00141, 0],
      [0.00069, 0],
      [-0.00194, 2],
      [0.00088, 1],
      [-0.00322, 1],
      [-0.00021, 2]
    ],
    "red_o_points": [],
    "y_categories": ["GREATER THAN OR EQUALS TO 3", "LESS THAN 3", "nan"],
    "blue_o_points": [],
    "blue_x_points": [
      [0.001, 0],
      [0.0017, 2],
      [0.00054, 0],
      [0.00747, 0],
      [0.00414, 0],
      [0.00091, 1],
      [0.0082, 1],
      [0.00083, 0],
      [0.01009, 1],
      [0.00852, 2]
    ]
  },
  "QS_mulGraftNerve[TD]": {
    "red_x_points": [
      [-3e-5, 2],
      [-0.00049, 0],
      [-0.00052, 0],
      [-0.00048, 0],
      [-0.0, 2],
      [-0.00063, 0],
      [-0.00039, 0],
      [-0.00051, 0],
      [-9e-5, 2],
      [-0.00037, 0],
      [-0.0005, 0],
      [-0.00035, 0],
      [-2e-5, 2],
      [0.00034, 1],
      [-5e-5, 2],
      [-0.0005, 0],
      [-0.0, 2],
      [-0.0004, 0],
      [-3e-5, 2],
      [-6e-5, 2],
      [-3e-5, 2],
      [-5e-5, 2],
      [-0.00038, 0],
      [-3e-5, 2],
      [-3e-5, 2],
      [-2e-5, 2],
      [-0.00038, 0],
      [-0.00024, 0],
      [0.00093, 1],
      [-3e-5, 2],
      [-0.00034, 0],
      [-4e-5, 2]
    ],
    "red_o_points": [],
    "y_categories": ["N", "NOT APPLICABLE", "nan"],
    "blue_o_points": [],
    "blue_x_points": [
      [0.00074, 1],
      [7e-5, 2],
      [0.00086, 1],
      [-0.00012, 0],
      [-0.00021, 0],
      [0.0011, 1],
      [-5e-5, 2],
      [0.00125, 1],
      [3e-5, 2],
      [4e-5, 2]
    ]
  },
  "QS_mulGraftNerve[SS]": {
    "red_x_points": [
      [-6e-5, 2],
      [-0.00016, 0],
      [-0.00014, 0],
      [-0.00012, 0],
      [-3e-5, 2],
      [-0.00017, 0],
      [-0.00011, 0],
      [-0.00015, 0],
      [-3e-5, 2],
      [-0.00019, 0],
      [-0.00018, 0],
      [-0.00013, 0],
      [-5e-5, 2],
      [0.00026, 1],
      [1e-5, 2],
      [-0.00016, 0],
      [-4e-5, 2],
      [-0.00018, 0],
      [-4e-5, 2],
      [-5e-5, 2],
      [-3e-5, 2],
      [-2e-5, 2],
      [-0.00014, 0],
      [-3e-5, 2],
      [-3e-5, 2],
      [-5e-5, 2],
      [-0.00016, 0],
      [-0.00019, 0],
      [0.00035, 1],
      [-3e-5, 2],
      [-0.0001, 0],
      [-3e-5, 2]
    ],
    "red_o_points": [],
    "y_categories": ["N", "NOT APPLICABLE", "nan"],
    "blue_o_points": [],
    "blue_x_points": [
      [0.00068, 1],
      [-1e-5, 2],
      [0.00037, 1],
      [-9e-5, 0],
      [-0.0001, 0],
      [0.00028, 1],
      [-1e-5, 2],
      [0.0004, 1],
      [-3e-5, 2],
      [-2e-5, 2]
    ]
  },
  "QA_yonPreOrtsurg": {
    "red_x_points": [
      [-0.00092, 0],
      [-0.00029, 2],
      [0.00018, 0],
      [5e-5, 0],
      [-0.00094, 0],
      [7e-5, 0],
      [0.00014, 0],
      [4e-5, 0],
      [0.00094, 2],
      [9e-5, 0],
      [-4e-5, 0],
      [-0.00048, 2],
      [-0.00203, 1],
      [0.00014, 0],
      [0.00148, 2],
      [0.0001, 0],
      [-0.00099, 0],
      [-0.00165, 1],
      [-0.00481, 1],
      [-0.00103, 0],
      [-0.00087, 0],
      [-0.00096, 0],
      [2e-5, 0],
      [-0.00221, 0],
      [-0.0012, 0],
      [-0.00173, 0],
      [-0.00025, 2],
      [4e-5, 0],
      [-1e-5, 2],
      [-0.00093, 0],
      [-0.00159, 1],
      [0.00115, 2]
    ],
    "red_o_points": [],
    "y_categories": ["N", "Y", "nan"],
    "blue_o_points": [],
    "blue_x_points": [
      [6e-5, 0],
      [0.00343, 2],
      [0.00038, 0],
      [0.00108, 0],
      [0.00122, 0],
      [9e-5, 0],
      [0.00144, 2],
      [0.00019, 0],
      [0.00149, 2],
      [0.00167, 2]
    ]
  },
  "QA_lstPexArthre[Index]": {
    "red_x_points": [
      [-0.0018, 0],
      [-0.00132, 2],
      [-0.00221, 2],
      [-0.00167, 0],
      [-0.00286, 2],
      [0.00049, 1],
      [0.00179, 1],
      [-0.00313, 0],
      [-0.00502, 2],
      [0.00143, 1],
      [0.00126, 1],
      [-0.00341, 0],
      [0.00031, 1],
      [-0.00081, 2],
      [-0.00219, 2],
      [0.00102, 1],
      [-0.00254, 2],
      [-0.00146, 2],
      [-0.00204, 2],
      [-0.00062, 1],
      [-0.00302, 0],
      [-0.00108, 1],
      [-0.00105, 2],
      [-0.00241, 2],
      [0.00028, 1],
      [-0.00324, 2],
      [-0.00181, 2],
      [-0.00095, 2],
      [-0.00119, 2],
      [-0.00201, 2],
      [-0.00289, 0],
      [-0.00281, 2]
    ],
    "red_o_points": [],
    "y_categories": ["NPV", "PV", "nan"],
    "blue_o_points": [],
    "blue_x_points": [
      [0.00087, 0],
      [-0.00094, 2],
      [0.0006, 1],
      [0.00518, 1],
      [0.00305, 1],
      [0.00057, 1],
      [0.01102, 0],
      [-0.00066, 2],
      [0.00411, 1],
      [0.00423, 1]
    ]
  },
  "QS_mulLysisRoot[C7]": {
    "red_x_points": [
      [-0.00041, 3],
      [-0.00124, 0],
      [-0.00388, 2],
      [-0.00118, 0],
      [-0.00036, 3],
      [-0.00121, 0],
      [-0.00104, 0],
      [-0.00128, 0],
      [-0.00043, 3],
      [-0.00146, 0],
      [-0.00119, 0],
      [-0.00107, 0],
      [-0.0003, 3],
      [0.00319, 1],
      [-0.00031, 3],
      [-0.0013, 0],
      [-0.00045, 3],
      [-0.00114, 0],
      [-0.00031, 3],
      [-0.00027, 3],
      [-0.00035, 3],
      [-0.00022, 3],
      [-0.00127, 0],
      [-0.00027, 3],
      [-0.00032, 3],
      [-0.00038, 3],
      [-0.00126, 0],
      [-0.00115, 0],
      [0.00229, 1],
      [-0.00029, 3],
      [-0.00106, 0],
      [-0.00037, 3]
    ],
    "red_o_points": [],
    "y_categories": ["N", "NOT APPLICABLE", "Y", "nan"],
    "blue_o_points": [],
    "blue_x_points": [
      [0.0041, 1],
      [-2e-5, 3],
      [0.00291, 1],
      [-0.00054, 0],
      [-0.0004, 0],
      [0.00389, 1],
      [-0.00019, 3],
      [0.00365, 1],
      [-0.00023, 3],
      [0.00013, 3]
    ]
  },
  "QA_lstPexPain[T1]": {
    "red_x_points": [
      [-0.00797, 1],
      [-0.00253, 2],
      [-0.00279, 2],
      [-0.00247, 2],
      [-0.00807, 1],
      [-0.00555, 0],
      [0.00105, 1],
      [0.00144, 1],
      [0.00683, 0],
      [0.00242, 1],
      [-0.00302, 0],
      [-0.00423, 0],
      [0.00507, 0],
      [-0.00998, 2],
      [-0.00412, 2],
      [-0.00302, 2],
      [-0.00405, 2],
      [-0.00194, 2],
      [-0.00415, 2],
      [0.00485, 0],
      [-0.00876, 1],
      [0.00594, 0],
      [-0.00319, 2],
      [-0.00457, 2],
      [-0.00885, 1],
      [-0.0046, 2],
      [-0.00307, 2],
      [-0.00268, 2],
      [-0.00436, 1],
      [-0.01031, 1],
      [3e-5, 1],
      [-0.0094, 1]
    ],
    "red_o_points": [],
    "y_categories": ["NORM", "NPV", "nan"],
    "blue_o_points": [],
    "blue_x_points": [
      [0.00028, 1],
      [-0.00054, 2],
      [0.00487, 0],
      [0.00652, 1],
      [0.01013, 1],
      [-0.00017, 1],
      [0.01018, 0],
      [0.00488, 0],
      [0.01128, 0],
      [0.01305, 0]
    ]
  },
  "QA_lstPexKine[Shoulder]": {
    "red_x_points": [
      [-0.00101, 1],
      [-0.00221, 2],
      [-0.00253, 2],
      [-0.0023, 2],
      [-0.00456, 2],
      [-0.00267, 1],
      [-0.00223, 1],
      [0.00484, 0],
      [-0.00643, 2],
      [-0.00229, 1],
      [-0.00181, 1],
      [-0.00295, 1],
      [-0.00206, 1],
      [-0.00114, 2],
      [-0.00383, 2],
      [-0.00123, 1],
      [-0.00449, 2],
      [-0.00186, 2],
      [-0.00331, 2],
      [-0.00228, 1],
      [-0.00123, 1],
      [-0.00202, 1],
      [-0.00163, 2],
      [-0.0042, 2],
      [-0.00149, 1],
      [-0.00496, 2],
      [-0.00295, 2],
      [-0.0026, 2],
      [-0.0014, 2],
      [-0.00424, 2],
      [-0.00103, 1],
      [-0.00442, 2]
    ],
    "red_o_points": [],
    "y_categories": ["NPV", "PV", "nan"],
    "blue_o_points": [],
    "blue_x_points": [
      [3e-5, 1],
      [-0.00168, 2],
      [-0.00014, 1],
      [0.00053, 1],
      [0.01937, 0],
      [-6e-5, 1],
      [0.03141, 0],
      [-0.00054, 2],
      [0.0001, 1],
      [0.00029, 1]
    ]
  },
  "QA_yonInjBpsurg": {
    "red_x_points": [
      [-0.00161, 1],
      [-0.00149, 1],
      [-0.00133, 1],
      [-0.00112, 1],
      [-0.00149, 1],
      [-0.00159, 1],
      [-0.0014, 1],
      [-0.00129, 1],
      [-0.0018, 1],
      [-0.0017, 1],
      [-0.00138, 1],
      [-0.00158, 1],
      [-0.00185, 1],
      [0.00287, 0],
      [-0.00148, 1],
      [-0.0013, 1],
      [-0.00179, 1],
      [-0.00128, 1],
      [-0.00135, 1],
      [-0.002, 1],
      [-0.00146, 1],
      [-0.00155, 1],
      [-0.00106, 1],
      [-0.00147, 1],
      [-0.00146, 1],
      [-0.00176, 1],
      [-0.00137, 1],
      [-0.00146, 1],
      [0.00362, 0],
      [-0.00125, 1],
      [-0.00119, 1],
      [-0.0014, 1]
    ],
    "red_o_points": [],
    "y_categories": ["N", "Y", "nan"],
    "blue_o_points": [],
    "blue_x_points": [
      [0.00658, 0],
      [-0.00035, 1],
      [0.00654, 0],
      [-0.00105, 1],
      [-0.00145, 1],
      [0.00661, 0],
      [-0.00093, 1],
      [0.00687, 0],
      [-0.00069, 1],
      [-0.00071, 1]
    ]
  },
  "QA_equInjTbpiTime": {
    "red_x_points": [
      [-0.00148, 0],
      [-0.00237, 0],
      [0.00507, 3],
      [-0.00307, 0],
      [-0.00305, 1],
      [-0.00516, 0],
      [-0.00478, 1],
      [-0.00321, 0],
      [-0.00118, 3],
      [-0.00503, 0],
      [-0.00473, 0],
      [0.00816, 3],
      [-0.00143, 0],
      [-0.03017, 2],
      [-0.00104, 3],
      [-0.00302, 0],
      [-0.00022, 0],
      [-0.00224, 0],
      [-0.01017, 1],
      [0.00043, 3],
      [-0.00271, 0],
      [-0.00451, 1],
      [-0.00636, 2],
      [3e-5, 3],
      [-0.01069, 1],
      [-0.01145, 2],
      [-0.00423, 0],
      [-0.00543, 2],
      [0.00092, 0],
      [-0.00131, 0],
      [0.00504, 3],
      [-0.00586, 1]
    ],
    "red_o_points": [],
    "y_categories": [
      "0 TO 6 MONTHS",
      "13 TO 24 MONTHS",
      "25 MONTHS OR MORE",
      "7 TO 12 MONTHS",
      "nan"
    ],
    "blue_o_points": [],
    "blue_x_points": [
      [0.00306, 0],
      [0.00752, 0],
      [0.00352, 0],
      [0.01254, 3],
      [0.0125, 3],
      [0.00413, 0],
      [0.0053, 1],
      [0.00883, 3],
      [0.00789, 3],
      [0.00699, 0]
    ]
  },
  "QS_mulBpsurgeryType[Graft]": {
    "red_x_points": [
      [-0.00029, 3],
      [-0.00047, 0],
      [-0.00061, 0],
      [-0.00065, 0],
      [-0.00033, 3],
      [-0.0006, 0],
      [-0.00055, 0],
      [-0.0006, 0],
      [-0.00028, 3],
      [-0.00064, 0],
      [-0.00058, 0],
      [-0.00061, 0],
      [-0.00023, 3],
      [0.00134, 1],
      [-0.00018, 3],
      [-0.0027, 2],
      [-0.00025, 3],
      [-0.00058, 0],
      [-0.00026, 3],
      [-0.00029, 3],
      [-0.00023, 3],
      [-0.00025, 3],
      [-0.00054, 0],
      [-0.00036, 3],
      [-0.00023, 3],
      [-0.0004, 3],
      [-0.0006, 0],
      [-0.0007, 0],
      [0.00165, 1],
      [-0.00028, 3],
      [-0.00043, 0],
      [-0.00021, 3]
    ],
    "red_o_points": [],
    "y_categories": ["N", "NOT APPLICABLE", "Y", "nan"],
    "blue_o_points": [],
    "blue_x_points": [
      [0.00259, 1],
      [-0.00014, 3],
      [0.00137, 1],
      [-0.00021, 0],
      [-0.00053, 0],
      [0.0021, 1],
      [-0.00014, 3],
      [0.00257, 1],
      [-0.00018, 3],
      [-0.00016, 3]
    ]
  },
  "QS_mulLysisRoot[C6]": {
    "red_x_points": [
      [-0.00064, 3],
      [-0.00225, 0],
      [-0.00602, 2],
      [-0.00237, 0],
      [-0.0008, 3],
      [-0.00217, 0],
      [-0.00223, 0],
      [-0.0024, 0],
      [-0.00102, 3],
      [-0.00293, 0],
      [-0.00277, 0],
      [-0.00227, 0],
      [-0.00093, 3],
      [0.00438, 1],
      [-0.00088, 3],
      [-0.00245, 0],
      [-0.001, 3],
      [-0.00206, 0],
      [-0.00121, 3],
      [-0.00091, 3],
      [-0.00067, 3],
      [-0.00093, 3],
      [-0.00225, 0],
      [-0.00095, 3],
      [-0.00094, 3],
      [-0.00083, 3],
      [-0.0022, 0],
      [-0.00222, 0],
      [0.00588, 1],
      [-0.00069, 3],
      [-0.005, 2],
      [-0.00086, 3]
    ],
    "red_o_points": [],
    "y_categories": ["N", "NOT APPLICABLE", "Y", "nan"],
    "blue_o_points": [],
    "blue_x_points": [
      [0.00853, 1],
      [-0.00038, 3],
      [0.00757, 1],
      [-0.0001, 0],
      [-0.0011, 0],
      [0.00712, 1],
      [-8e-5, 3],
      [0.00723, 1],
      [-0.00013, 3],
      [-0.00026, 3]
    ]
  },
  "QA_lstPexPalle[Clavicle]": {
    "red_x_points": [
      [-0.00273, 3],
      [-0.00102, 3],
      [-0.0007, 3],
      [-0.00113, 3],
      [-0.00236, 3],
      [-0.00752, 2],
      [-0.00486, 2],
      [-0.00121, 3],
      [-0.00294, 3],
      [-0.0017, 3],
      [-0.0051, 2],
      [-0.00547, 2],
      [-0.00731, 0],
      [0.0003, 3],
      [-0.00213, 3],
      [-0.00148, 3],
      [-0.00243, 3],
      [-0.00055, 3],
      [-0.00175, 3],
      [-0.00873, 0],
      [-0.00806, 0],
      [-0.00229, 2],
      [-0.00083, 1],
      [-0.00225, 3],
      [-0.00349, 2],
      [-0.00285, 3],
      [-0.00157, 3],
      [-0.00137, 3],
      [-0.01565, 2],
      [-0.002, 3],
      [0.00034, 0],
      [-0.00213, 3]
    ],
    "red_o_points": [],
    "y_categories": ["HYPO", "NAIA", "PT", "nan"],
    "blue_o_points": [],
    "blue_x_points": [
      [0.00137, 3],
      [-0.00075, 3],
      [0.00769, 0],
      [4e-5, 3],
      [0.01794, 0],
      [0.00141, 3],
      [0.03023, 1],
      [0.0016, 3],
      [0.00826, 2],
      [-0.00031, 3]
    ]
  },
  "QA_lstPexMuscstrength[ThumbOppo]": {
    "red_x_points": [
      [-0.0071, 1],
      [0.00072, 2],
      [-0.0059, 1],
      [-0.00441, 1],
      [-0.00706, 1],
      [0.00143, 0],
      [0.00094, 0],
      [-0.00521, 1],
      [0.00126, 0],
      [0.00119, 0],
      [0.00132, 0],
      [0.00163, 0],
      [0.0015, 0],
      [0.00094, 2],
      [0.00095, 2],
      [0.00081, 2],
      [0.00082, 0],
      [0.00067, 2],
      [0.00104, 2],
      [0.00107, 0],
      [-0.00691, 1],
      [0.00102, 0],
      [-0.00515, 1],
      [0.00105, 2],
      [0.00108, 2],
      [0.0012, 2],
      [0.00121, 0],
      [-0.00488, 1],
      [0.00079, 2],
      [-0.00805, 1],
      [-0.00481, 1],
      [0.00098, 2]
    ],
    "red_o_points": [],
    "y_categories": ["GREATER THAN OR EQUALS TO 3", "LESS THAN 3", "nan"],
    "blue_o_points": [],
    "blue_x_points": [
      [0.00055, 2],
      [0.00184, 2],
      [0.00136, 0],
      [0.00348, 2],
      [0.00303, 0],
      [0.00147, 0],
      [0.00408, 0],
      [0.00149, 0],
      [0.00214, 2],
      [0.00275, 2]
    ]
  },
  "QS_mulGraftNerve[LT]": {
    "red_x_points": [
      [-0.0, 2],
      [-3e-5, 0],
      [-3e-5, 0],
      [-6e-5, 0],
      [-1e-5, 2],
      [-3e-5, 0],
      [-3e-5, 0],
      [-0.0, 2],
      [-3e-5, 0],
      [-6e-5, 0],
      [-0.0, 2],
      [9e-5, 1],
      [-1e-5, 2],
      [-3e-5, 0],
      [-1e-5, 2],
      [-3e-5, 0],
      [-0.0, 2],
      [-0.0, 2],
      [-0.0, 2],
      [-0.0, 2],
      [-3e-5, 0],
      [-1e-5, 2],
      [-0.0, 2],
      [-0.0, 2],
      [-3e-5, 0],
      [-1e-5, 2],
      [-3e-5, 0]
    ],
    "red_o_points": [],
    "y_categories": ["N", "NOT APPLICABLE", "nan"],
    "blue_o_points": [],
    "blue_x_points": [
      [0.00017, 1],
      [-0.0, 2],
      [-3e-5, 0],
      [-0.0, 2],
      [9e-5, 1],
      [-0.0, 2],
      [-0.0, 2]
    ]
  },
  "QA_lstPexTouch[T1]": {
    "red_x_points": [
      [-0.00943, 1],
      [-0.00206, 2],
      [0.00062, 1],
      [-0.00204, 2],
      [-0.00866, 1],
      [-0.00737, 0],
      [0.00181, 1],
      [0.00099, 1],
      [-0.01162, 1],
      [-0.00367, 0],
      [-0.00457, 0],
      [-0.00481, 0],
      [0.00626, 0],
      [-0.00777, 2],
      [-0.00422, 2],
      [-0.00346, 2],
      [-0.00964, 1],
      [-0.00184, 2],
      [-0.00456, 2],
      [0.00686, 0],
      [-0.01003, 1],
      [0.00704, 0],
      [-0.00229, 2],
      [-0.00427, 2],
      [-0.00853, 1],
      [0.008, 0],
      [0.00259, 1],
      [-0.0021, 2],
      [-0.00153, 1],
      [-0.00477, 2],
      [-5e-5, 1],
      [-0.01056, 1]
    ],
    "red_o_points": [],
    "y_categories": ["NORM", "NPV", "nan"],
    "blue_o_points": [],
    "blue_x_points": [
      [0.00076, 1],
      [0.00068, 2],
      [0.00115, 1],
      [0.00614, 1],
      [0.01008, 1],
      [0.00053, 1],
      [0.01222, 0],
      [0.00434, 0],
      [0.01078, 0],
      [0.01384, 0]
    ]
  },
  "QS_mulGraftNerve[MC]": {
    "red_x_points": [
      [-2e-5, 2],
      [-0.00024, 0],
      [-0.00013, 0],
      [-0.00021, 0],
      [-1e-5, 2],
      [-0.00016, 0],
      [-0.0002, 0],
      [-0.00015, 0],
      [-7e-5, 2],
      [-0.00018, 0],
      [-0.00018, 0],
      [-0.00021, 0],
      [-8e-5, 2],
      [0.00045, 1],
      [-2e-5, 2],
      [-0.00011, 0],
      [-7e-5, 2],
      [-0.00013, 0],
      [-0.0, 2],
      [-8e-5, 2],
      [-0.0, 2],
      [-7e-5, 2],
      [-0.00013, 0],
      [-3e-5, 2],
      [-2e-5, 2],
      [-1e-5, 2],
      [-0.00013, 0],
      [-0.0002, 0],
      [0.00024, 1],
      [-1e-5, 2],
      [-0.00019, 0],
      [-0.0, 2]
    ],
    "red_o_points": [],
    "y_categories": ["N", "NOT APPLICABLE", "nan"],
    "blue_o_points": [],
    "blue_x_points": [
      [0.00073, 1],
      [-1e-5, 2],
      [0.00045, 1],
      [-0.00012, 0],
      [-8e-5, 0],
      [0.0002, 1],
      [-6e-5, 2],
      [0.00038, 1],
      [0.0, 2],
      [-1e-5, 2]
    ]
  },
  "QA_lstPexKine[Elbow]": {
    "red_x_points": [
      [-0.00172, 0],
      [-0.00099, 2],
      [-0.00134, 2],
      [-0.00089, 2],
      [-0.00244, 2],
      [0.0003, 1],
      [0.00028, 1],
      [-0.0025, 0],
      [-0.00352, 2],
      [0.00079, 1],
      [0.00061, 1],
      [0.00058, 1],
      [-4e-5, 1],
      [-0.00055, 2],
      [-0.00127, 2],
      [0.00076, 1],
      [-0.00196, 2],
      [-0.00084, 2],
      [-0.00122, 2],
      [-0.00078, 1],
      [-0.00234, 0],
      [-0.00226, 1],
      [-0.00064, 2],
      [-0.00116, 2],
      [-0.00023, 1],
      [-0.00292, 2],
      [-0.00129, 2],
      [-0.00059, 2],
      [-0.00059, 2],
      [-0.00163, 2],
      [-0.00146, 0],
      [-0.00181, 2]
    ],
    "red_o_points": [],
    "y_categories": ["NPV", "PV", "nan"],
    "blue_o_points": [],
    "blue_x_points": [
      [0.00063, 1],
      [-0.00045, 2],
      [0.00032, 1],
      [0.0031, 1],
      [0.00142, 1],
      [0.00039, 1],
      [0.01, 0],
      [-0.00016, 2],
      [0.00389, 1],
      [0.00276, 1]
    ]
  },
  "QS_mulLysisNerve[Ssr]": {
    "red_x_points": [
      [-0.00035, 3],
      [-0.00065, 0],
      [-0.00308, 2],
      [-0.00086, 0],
      [-0.00042, 3],
      [-0.00121, 0],
      [-0.00103, 0],
      [-0.00083, 0],
      [-0.00043, 3],
      [-0.0009, 0],
      [-0.0011, 0],
      [-0.00089, 0],
      [-0.0004, 3],
      [0.00235, 1],
      [-0.00041, 3],
      [-0.00102, 0],
      [-0.00044, 3],
      [-0.00071, 0],
      [-0.0005, 3],
      [-0.00044, 3],
      [-0.00036, 3],
      [-0.00037, 3],
      [-0.00109, 0],
      [-0.00055, 3],
      [-0.00052, 3],
      [-0.00049, 3],
      [-0.00093, 0],
      [-0.00096, 0],
      [0.00246, 1],
      [-0.0004, 3],
      [-0.00074, 0],
      [-0.00032, 3]
    ],
    "red_o_points": [],
    "y_categories": ["N", "NOT APPLICABLE", "Y", "nan"],
    "blue_o_points": [],
    "blue_x_points": [
      [0.0033, 1],
      [-0.00019, 3],
      [0.00279, 1],
      [-2e-5, 0],
      [-0.00062, 0],
      [0.00303, 1],
      [-0.00015, 3],
      [0.0034, 1],
      [-0.00021, 3],
      [-0.00023, 3]
    ]
  },
  "QA_lstPexKine[Index]": {
    "red_x_points": [
      [-0.002, 0],
      [-0.0007, 2],
      [-0.00148, 2],
      [-0.00079, 2],
      [-0.00243, 2],
      [0.00044, 1],
      [0.00064, 1],
      [-0.0035, 0],
      [-0.00438, 2],
      [0.00075, 1],
      [0.00031, 1],
      [0.00049, 1],
      [-0.00033, 1],
      [-0.00056, 2],
      [-0.0021, 2],
      [0.00056, 1],
      [-0.00304, 2],
      [-0.00092, 2],
      [-0.00188, 2],
      [-0.00099, 1],
      [-0.00266, 0],
      [-0.00213, 1],
      [-0.00091, 2],
      [-0.00187, 2],
      [-0.00021, 1],
      [-0.00384, 2],
      [-0.0018, 2],
      [-0.00082, 2],
      [-0.00079, 2],
      [-0.00325, 2],
      [-0.00239, 0],
      [-0.00242, 2]
    ],
    "red_o_points": [],
    "y_categories": ["NPV", "PV", "nan"],
    "blue_o_points": [],
    "blue_x_points": [
      [0.00068, 1],
      [-0.00088, 2],
      [0.00076, 1],
      [0.00368, 1],
      [0.00244, 1],
      [0.00081, 1],
      [0.01204, 0],
      [-0.00028, 2],
      [0.00412, 1],
      [0.00431, 1]
    ]
  },
  "QA_lstPexMuscstrength[ElbowFlex]": {
    "red_x_points": [
      [-0.00278, 1],
      [-0.00245, 2],
      [-0.00284, 1],
      [-0.00221, 1],
      [-0.00276, 1],
      [0.00696, 0],
      [-0.00333, 1],
      [-0.00307, 1],
      [-0.00269, 1],
      [-0.00322, 1],
      [-0.00283, 1],
      [-0.00395, 1],
      [-0.00343, 1],
      [-0.00272, 2],
      [-0.00276, 2],
      [-0.00252, 2],
      [-0.00266, 1],
      [-0.00236, 2],
      [-0.00314, 2],
      [-0.00302, 1],
      [-0.00261, 1],
      [-0.00264, 1],
      [-0.00258, 1],
      [-0.00269, 2],
      [0.0026, 0],
      [-0.00212, 1],
      [-0.00273, 1],
      [-0.00272, 1],
      [-0.00287, 2],
      [-0.00237, 1],
      [-0.003, 1],
      [-0.00303, 2]
    ],
    "red_o_points": [],
    "y_categories": ["GREATER THAN OR EQUALS TO 3", "LESS THAN 3", "nan"],
    "blue_o_points": [],
    "blue_x_points": [
      [-0.00035, 2],
      [-0.00122, 2],
      [0.00952, 0],
      [-0.00073, 1],
      [0.01875, 0],
      [0.01039, 0],
      [-0.00118, 1],
      [0.0097, 0],
      [0.00022, 1],
      [-0.00048, 1]
    ]
  },
  "QS_mulGraftRoot[C6]": {
    "red_x_points": [
      [1e-5, 2],
      [-4e-5, 0],
      [-4e-5, 0],
      [-4e-5, 0],
      [1e-5, 2],
      [-4e-5, 0],
      [-4e-5, 0],
      [-4e-5, 0],
      [1e-5, 2],
      [-4e-5, 0],
      [-4e-5, 0],
      [1e-5, 2],
      [1e-5, 2],
      [-4e-5, 0],
      [1e-5, 2],
      [1e-5, 2],
      [1e-5, 2],
      [1e-5, 2],
      [-4e-5, 0],
      [1e-5, 2],
      [1e-5, 2],
      [-4e-5, 0],
      [-4e-5, 0],
      [1e-5, 2]
    ],
    "red_o_points": [],
    "y_categories": ["N", "NOT APPLICABLE", "nan"],
    "blue_o_points": [],
    "blue_x_points": [
      [1e-5, 2],
      [0.00014, 1],
      [-4e-5, 0],
      [0.00014, 1],
      [1e-5, 2],
      [1e-5, 2],
      [1e-5, 2]
    ]
  },
  "QA_lstPexMuscstrength[FingersAddu]": {
    "red_x_points": [
      [0.00109, 0],
      [0.00016, 2],
      [-0.00307, 1],
      [-0.00349, 1],
      [-0.00476, 1],
      [0.00157, 0],
      [0.00114, 0],
      [-0.00436, 1],
      [0.00093, 0],
      [0.00114, 0],
      [0.00015, 2],
      [0.00165, 0],
      [0.00108, 0],
      [3e-5, 2],
      [0.00015, 2],
      [1e-5, 2],
      [0.00087, 0],
      [0.0001, 2],
      [0.0003, 2],
      [0.0009, 0],
      [-0.00462, 1],
      [0.00131, 0],
      [-0.00293, 1],
      [0.00024, 2],
      [0.00022, 2],
      [0.00035, 2],
      [0.00021, 2],
      [-0.00328, 1],
      [0.00011, 2],
      [-0.00495, 1],
      [-0.00332, 1],
      [0.00029, 2]
    ],
    "red_o_points": [],
    "y_categories": ["GREATER THAN OR EQUALS TO 3", "LESS THAN 3", "nan"],
    "blue_o_points": [],
    "blue_x_points": [
      [0.00014, 2],
      [0.00059, 2],
      [0.00107, 0],
      [0.00072, 2],
      [0.00257, 0],
      [0.00119, 0],
      [0.00275, 0],
      [0.00098, 0],
      [0.00154, 2],
      [0.00117, 2]
    ]
  },
  "QA_yonInjFracture": {
    "red_x_points": [
      [-0.00775, 0],
      [-0.00119, 2],
      [0.00066, 0],
      [-0.00159, 1],
      [-0.0083, 0],
      [0.00058, 0],
      [0.00067, 0],
      [-0.0017, 1],
      [0.00546, 2],
      [0.00104, 0],
      [-0.00288, 1],
      [-0.0049, 1],
      [-0.00826, 0],
      [-0.00133, 0],
      [0.00519, 1],
      [-0.00234, 1],
      [-0.00845, 0],
      [-0.00218, 1],
      [-0.01041, 0],
      [-0.00997, 0],
      [0.00539, 1],
      [-0.01047, 0],
      [-0.00114, 1],
      [-0.00916, 0],
      [-0.01047, 0],
      [-0.00998, 0],
      [0.00088, 0],
      [0.0007, 0],
      [-0.00924, 1],
      [0.00513, 2],
      [-0.00251, 1],
      [0.00545, 1]
    ],
    "red_o_points": [],
    "y_categories": ["N", "Y", "nan"],
    "blue_o_points": [],
    "blue_x_points": [
      [0.00299, 0],
      [0.01204, 1],
      [0.00119, 0],
      [0.00431, 0],
      [0.00388, 0],
      [0.00202, 1],
      [0.00884, 2],
      [0.00076, 0],
      [0.01246, 1],
      [0.01014, 2]
    ]
  },
  "QS_mulGraftNerve[Ac]": {
    "red_x_points": [
      [-0.00014, 2],
      [-0.00105, 0],
      [-0.00086, 0],
      [-0.00082, 0],
      [-0.00011, 2],
      [-0.00099, 0],
      [-0.00076, 0],
      [-0.00091, 0],
      [-0.00018, 2],
      [-0.00114, 0],
      [-0.00106, 0],
      [-0.00096, 0],
      [-5e-5, 2],
      [0.00101, 1],
      [-5e-5, 2],
      [-0.00101, 0],
      [-0.00018, 2],
      [-0.00094, 0],
      [-0.00023, 2],
      [-5e-5, 2],
      [-1e-5, 2],
      [-0.00024, 2],
      [-0.00069, 0],
      [-0.00013, 2],
      [0.00012, 2],
      [-0.00013, 2],
      [-0.0006, 0],
      [-0.00063, 0],
      [0.00069, 1],
      [-3e-5, 2],
      [-0.00064, 0],
      [-0.0002, 2]
    ],
    "red_o_points": [],
    "y_categories": ["N", "NOT APPLICABLE", "nan"],
    "blue_o_points": [],
    "blue_x_points": [
      [0.00197, 1],
      [0.00022, 2],
      [0.00191, 1],
      [0.0002, 0],
      [-0.00032, 0],
      [0.00175, 1],
      [0.0, 2],
      [0.00154, 1],
      [6e-5, 2],
      [0.00026, 2]
    ]
  },
  "QS_mulNeuromadSite[C8]": {
    "red_x_points": [
      [-0.00037, 2],
      [-0.00234, 0],
      [-0.00238, 0],
      [-0.00218, 0],
      [-0.00054, 2],
      [-0.0028, 0],
      [-0.00261, 0],
      [-0.00264, 0],
      [-0.00107, 2],
      [-0.00318, 0],
      [-0.0026, 0],
      [-0.00239, 0],
      [-0.00045, 2],
      [0.00324, 1],
      [-0.00046, 2],
      [-0.00257, 0],
      [-0.00064, 2],
      [-0.00207, 0],
      [-0.00049, 2],
      [-0.00059, 2],
      [-0.00024, 2],
      [-0.00069, 2],
      [-0.00215, 0],
      [-0.0005, 2],
      [-0.0009, 2],
      [-0.00053, 2],
      [-0.00258, 0],
      [-0.00234, 0],
      [0.00423, 1],
      [-0.00043, 2],
      [-0.00208, 0],
      [-0.00054, 2]
    ],
    "red_o_points": [],
    "y_categories": ["N", "NOT APPLICABLE", "nan"],
    "blue_o_points": [],
    "blue_x_points": [
      [0.00699, 1],
      [-0.00019, 2],
      [0.00543, 1],
      [0.00048, 0],
      [-0.00075, 0],
      [0.00514, 1],
      [-0.0001, 2],
      [0.00582, 1],
      [6e-5, 2],
      [0.00014, 2]
    ]
  },
  "QS_mulTransfSite[AcSsPA]": {
    "red_x_points": [
      [-0.00055, 3],
      [-0.00188, 0],
      [-0.00218, 0],
      [-0.00199, 0],
      [-0.00046, 3],
      [-0.00214, 0],
      [-0.00176, 0],
      [-0.00181, 0],
      [-0.00078, 3],
      [-0.00191, 0],
      [-0.00198, 0],
      [-0.0017, 0],
      [-0.00071, 3],
      [0.00355, 1],
      [-0.00058, 3],
      [-0.00208, 0],
      [-0.00048, 3],
      [-0.00416, 2],
      [-0.00041, 3],
      [-0.00046, 3],
      [-0.00047, 3],
      [-0.00048, 3],
      [-0.0016, 0],
      [-0.00039, 3],
      [-0.00075, 3],
      [-0.00043, 3],
      [-0.00179, 0],
      [-0.00199, 0],
      [0.00397, 1],
      [-0.00033, 3],
      [-0.00167, 0],
      [-0.00048, 3]
    ],
    "red_o_points": [],
    "y_categories": ["N", "NOT APPLICABLE", "Y", "nan"],
    "blue_o_points": [],
    "blue_x_points": [
      [0.00529, 1],
      [-0.00012, 3],
      [0.00486, 1],
      [-0.00081, 0],
      [-0.00088, 0],
      [0.00528, 1],
      [-0.00013, 3],
      [0.00477, 1],
      [-7e-5, 3],
      [-4e-5, 3]
    ]
  },
  "QA_lstPexMuscstrength[FingersFlex]": {
    "red_x_points": [
      [0.00035, 0],
      [4e-5, 2],
      [-0.00179, 1],
      [-0.00161, 1],
      [8e-5, 0],
      [0.00054, 0],
      [0.00033, 0],
      [-0.00288, 1],
      [-0.00033, 0],
      [0.00025, 0],
      [0.00043, 0],
      [0.00027, 0],
      [-0.00409, 1],
      [6e-5, 2],
      [0.00029, 2],
      [0.0002, 2],
      [8e-5, 0],
      [0.00013, 2],
      [0.00032, 2],
      [0.00026, 0],
      [-0.00343, 1],
      [2e-5, 0],
      [-0.00173, 1],
      [0.00035, 2],
      [0.00022, 2],
      [0.00063, 2],
      [0.0002, 0],
      [0.00041, 0],
      [0.00013, 2],
      [-0.0028, 1],
      [-0.00241, 1],
      [0.00026, 2]
    ],
    "red_o_points": [],
    "y_categories": ["GREATER THAN OR EQUALS TO 3", "LESS THAN 3", "nan"],
    "blue_o_points": [],
    "blue_x_points": [
      [9e-5, 2],
      [0.00055, 2],
      [0.0003, 0],
      [0.0014, 2],
      [0.00153, 0],
      [0.00054, 0],
      [0.00113, 0],
      [0.00029, 0],
      [0.00124, 2],
      [0.00159, 2]
    ]
  },
  "QA_lstPexPalle[Elbow]": {
    "red_x_points": [
      [-0.0021, 4],
      [-0.00073, 4],
      [-0.001, 4],
      [-0.0009, 4],
      [-0.00184, 4],
      [-0.00448, 3],
      [-0.00258, 3],
      [-0.00104, 4],
      [-0.00165, 4],
      [-0.00133, 4],
      [0.00415, 1],
      [-0.00324, 3],
      [-0.00036, 1],
      [0.00015, 4],
      [-0.00143, 4],
      [-0.00106, 4],
      [-0.00114, 4],
      [-0.00074, 4],
      [-0.00105, 4],
      [0.00053, 3],
      [-0.00761, 0],
      [0.00103, 3],
      [-0.00294, 2],
      [-0.00113, 4],
      [-0.00143, 3],
      [-0.00143, 4],
      [-0.00127, 4],
      [-0.00096, 4],
      [-0.01239, 3],
      [-0.00173, 4],
      [-0.00417, 0],
      [-0.00127, 4]
    ],
    "red_o_points": [],
    "y_categories": ["ABS", "HYPO", "NAIA", "PT", "nan"],
    "blue_o_points": [],
    "blue_x_points": [
      [0.00126, 4],
      [-0.00023, 4],
      [0.00869, 1],
      [-0.00022, 4],
      [0.01322, 1],
      [0.00137, 4],
      [0.004, 3],
      [0.00111, 4],
      [0.00531, 3],
      [-0.00057, 4]
    ]
  },
  "QA_lstPexMuscstrength[ScapulaAbducSuprot]": {
    "red_x_points": [
      [-0.00322, 0],
      [0.00043, 2],
      [-0.00185, 1],
      [-0.00121, 1],
      [-0.00296, 0],
      [-4e-5, 0],
      [-0.00293, 1],
      [-0.00224, 1],
      [-0.00019, 1],
      [0.00094, 0],
      [-0.00057, 0],
      [-0.00313, 1],
      [-0.00086, 1],
      [0.00016, 2],
      [0.00077, 2],
      [0.00026, 2],
      [0.00098, 2],
      [0.00042, 2],
      [0.00058, 2],
      [-0.00682, 0],
      [-0.00011, 1],
      [-0.00677, 0],
      [-0.001, 1],
      [0.00064, 2],
      [-0.00652, 0],
      [0.00068, 2],
      [-0.003, 1],
      [0.00041, 0],
      [0.0002, 2],
      [-0.00252, 0],
      [-0.00216, 1],
      [0.00066, 2]
    ],
    "red_o_points": [],
    "y_categories": ["GREATER THAN OR EQUALS TO 3", "LESS THAN 3", "nan"],
    "blue_o_points": [],
    "blue_x_points": [
      [0.00033, 2],
      [0.00105, 2],
      [0.00055, 0],
      [0.00268, 2],
      [0.00419, 0],
      [0.00033, 0],
      [0.00323, 2],
      [0.00027, 2],
      [0.00849, 1],
      [0.00436, 2]
    ]
  },
  "participant_code": {
    "red_x_points": [
      [-0.02076, 1],
      [-0.01929, 2],
      [-0.02123, 3],
      [-0.02035, 4],
      [-0.02047, 5],
      [-0.02029, 6],
      [-0.02047, 7],
      [-0.02076, 8],
      [-0.01906, 9],
      [-0.02029, 10],
      [-0.02035, 11],
      [-0.02135, 12],
      [-0.02088, 13],
      [-0.01976, 15],
      [-0.02088, 17],
      [-0.0207, 18],
      [-0.021, 20],
      [-0.02064, 21],
      [-0.02017, 22],
      [-0.02147, 24],
      [-0.02076, 26],
      [-0.02076, 27],
      [-0.02094, 28],
      [-0.02005, 30],
      [-0.02035, 31],
      [-0.01994, 32],
      [-0.0197, 34],
      [-0.01982, 36],
      [-0.02, 38],
      [-0.02, 39],
      [-0.02088, 40],
      [-0.02017, 41]
    ],
    "red_o_points": [],
    "y_categories": [
      "P16554",
      "P18297",
      "P19283",
      "P19287",
      "P23391",
      "P30595",
      "P31645",
      "P31691",
      "P34778",
      "P35046",
      "P36328",
      "P43633",
      "P4544",
      "P46417",
      "P48965",
      "P53068",
      "P5497",
      "P59529",
      "P62483",
      "P64658",
      "P65202",
      "P66816",
      "P6751",
      "P7408",
      "P75566",
      "P76226",
      "P79971",
      "P82621",
      "P82990",
      "P84549",
      "P84932",
      "P85825",
      "P86989",
      "P8770",
      "P87791",
      "P90550",
      "P93159",
      "P94969",
      "P96710",
      "P97130",
      "P9744",
      "P98500",
      "nan"
    ],
    "blue_o_points": [],
    "blue_x_points": [
      [0.04065, 0],
      [0.04347, 14],
      [0.04249, 16],
      [0.04277, 19],
      [0.04249, 23],
      [0.04164, 25],
      [0.04361, 29],
      [0.04206, 33],
      [0.04249, 35],
      [0.04051, 37]
    ]
  },
  "QA_lstPexMuscstrength[ShoulderExrot]": {
    "red_x_points": [
      [-0.00172, 1],
      [0.00019, 2],
      [0.00083, 0],
      [-0.00139, 1],
      [0.00021, 2],
      [-0.00217, 1],
      [-0.00161, 1],
      [0.00032, 2],
      [-0.00193, 1],
      [-0.00205, 1],
      [-0.00167, 1],
      [0.00028, 2],
      [-0.00217, 1],
      [3e-5, 2],
      [0.00011, 2],
      [5e-5, 2],
      [-2e-5, 2],
      [9e-5, 2],
      [0.00012, 2],
      [-0.00188, 1],
      [-0.00198, 1],
      [-0.00195, 1],
      [0.00018, 2],
      [0.00012, 2],
      [0.00023, 2],
      [0.00014, 2],
      [-0.00156, 1],
      [0.00064, 0],
      [8e-5, 2],
      [0.00028, 2],
      [-0.00158, 1],
      [0.00017, 2]
    ],
    "red_o_points": [],
    "y_categories": ["GREATER THAN OR EQUALS TO 3", "LESS THAN 3", "nan"],
    "blue_o_points": [],
    "blue_x_points": [
      [4e-5, 2],
      [0.00028, 2],
      [0.00567, 0],
      [0.00064, 2],
      [-0.00063, 1],
      [0.00489, 0],
      [0.00057, 2],
      [-0.0001, 1],
      [0.00041, 2],
      [0.00027, 2]
    ]
  },
  "QS_mulGraftNerve[Ul]": {
    "red_x_points": [
      [-0.0, 2],
      [-0.00047, 0],
      [-0.00046, 0],
      [-0.00027, 0],
      [-0.00012, 2],
      [-0.00031, 0],
      [-0.00044, 0],
      [-0.00052, 0],
      [-0.00014, 2],
      [-0.00054, 0],
      [-0.00055, 0],
      [-0.00034, 0],
      [-6e-5, 2],
      [0.00051, 1],
      [-0.00016, 2],
      [-0.00048, 0],
      [-0.00013, 2],
      [-0.00037, 0],
      [-6e-5, 2],
      [-8e-5, 2],
      [-6e-5, 2],
      [-7e-5, 2],
      [-0.00047, 0],
      [-0.00014, 2],
      [-0.0001, 2],
      [-0.0001, 2],
      [-0.00045, 0],
      [-0.00038, 0],
      [0.00099, 1],
      [-6e-5, 2],
      [-0.00041, 0],
      [-0.00012, 2]
    ],
    "red_o_points": [],
    "y_categories": ["N", "NOT APPLICABLE", "nan"],
    "blue_o_points": [],
    "blue_x_points": [
      [0.00131, 1],
      [1e-5, 2],
      [0.00066, 1],
      [-0.00012, 0],
      [-0.00018, 0],
      [0.00104, 1],
      [6e-5, 2],
      [0.00108, 1],
      [-6e-5, 2],
      [-1e-5, 2]
    ]
  },
  "QS_mulGraftNerve[Ssr]": {
    "red_x_points": [
      [-1e-5, 2],
      [-0.0001, 0],
      [-3e-5, 0],
      [-0.00013, 0],
      [-1e-5, 2],
      [-0.00013, 0],
      [-0.00013, 0],
      [-0.00013, 0],
      [-1e-5, 2],
      [-0.00013, 0],
      [-3e-5, 0],
      [-9e-5, 0],
      [-1e-5, 2],
      [0.00019, 1],
      [-1e-5, 2],
      [-0.00013, 0],
      [-0.0, 2],
      [-0.00013, 0],
      [-1e-5, 2],
      [-0.0, 2],
      [-0.0, 2],
      [-1e-5, 2],
      [-0.00013, 0],
      [-1e-5, 2],
      [-1e-5, 2],
      [-0.00013, 0],
      [-8e-5, 0],
      [0.0002, 1],
      [-1e-5, 2],
      [-0.0001, 0],
      [-1e-5, 2]
    ],
    "red_o_points": [],
    "y_categories": ["N", "NOT APPLICABLE", "nan"],
    "blue_o_points": [],
    "blue_x_points": [
      [0.0003, 1],
      [0.0, 2],
      [0.0003, 1],
      [-8e-5, 0],
      [-3e-5, 0],
      [0.0001, 1],
      [-1e-5, 2],
      [0.00011, 1],
      [-1e-5, 2],
      [-1e-5, 2]
    ]
  },
  "QS_mulBpsurgeryType[Lysis]": {
    "red_x_points": [
      [-0.00189, 3],
      [-0.00463, 0],
      [-0.01177, 2],
      [-0.00484, 0],
      [-0.00184, 3],
      [-0.00497, 0],
      [-0.01156, 2],
      [-0.00449, 0],
      [-0.00206, 3],
      [-0.00428, 0],
      [-0.00529, 0],
      [-0.00421, 0],
      [-0.00209, 3],
      [0.01066, 1],
      [-0.00159, 3],
      [-0.00488, 0],
      [-0.00267, 3],
      [-0.01098, 2],
      [-0.00239, 3],
      [-0.00222, 3],
      [-0.00175, 3],
      [-0.00195, 3],
      [-0.00443, 0],
      [-0.00147, 3],
      [-0.00221, 3],
      [-0.00203, 3],
      [-0.00426, 0],
      [-0.00462, 0],
      [0.01183, 1],
      [-0.00167, 3],
      [-0.01195, 2],
      [-0.00167, 3]
    ],
    "red_o_points": [],
    "y_categories": ["N", "NOT APPLICABLE", "Y", "nan"],
    "blue_o_points": [],
    "blue_x_points": [
      [0.01742, 1],
      [-0.00044, 3],
      [0.01593, 1],
      [0.0016, 0],
      [-0.00042, 0],
      [0.01588, 1],
      [-0.00109, 3],
      [0.0156, 1],
      [-0.00081, 3],
      [-0.00043, 3]
    ]
  },
  "QS_mulGraftTrunk[UpperTrunk]": {
    "red_x_points": [
      [-0.00028, 3],
      [-0.0016, 0],
      [-0.00216, 0],
      [-0.00194, 0],
      [-0.00052, 3],
      [-0.00177, 0],
      [-0.00144, 0],
      [-0.00162, 0],
      [-0.00061, 3],
      [-0.00197, 0],
      [-0.00199, 0],
      [-0.00208, 0],
      [-0.00069, 3],
      [0.00305, 1],
      [-0.00046, 3],
      [-0.00511, 2],
      [-0.00065, 3],
      [-0.00112, 0],
      [-0.00042, 3],
      [-0.00033, 3],
      [-0.00038, 3],
      [-0.00051, 3],
      [-0.00128, 0],
      [-0.00067, 3],
      [-0.0003, 3],
      [-0.00064, 3],
      [-0.00175, 0],
      [-0.00163, 0],
      [0.00346, 1],
      [-0.00064, 3],
      [-0.00151, 0],
      [-0.00052, 3]
    ],
    "red_o_points": [],
    "y_categories": ["N", "NOT APPLICABLE", "Y", "nan"],
    "blue_o_points": [],
    "blue_x_points": [
      [0.00602, 1],
      [-0.00015, 3],
      [0.00357, 1],
      [-0.00019, 0],
      [-0.00105, 0],
      [0.00458, 1],
      [-0.00019, 3],
      [0.00483, 1],
      [-0.0, 3],
      [-0.0, 3]
    ]
  },
  "QA_mulInjTbpiCause[Motorcycle]": {
    "red_x_points": [
      [-0.00213, 0],
      [-0.00039, 1],
      [-0.00059, 1],
      [-0.00051, 1],
      [-0.00034, 1],
      [-0.00051, 1],
      [-0.00034, 1],
      [-0.00049, 1],
      [9e-5, 1],
      [-0.00044, 1],
      [-0.00028, 1],
      [-0.00019, 1],
      [-0.00439, 0],
      [-0.02694, 1],
      [-0.00026, 1],
      [-0.00056, 1],
      [-0.00042, 1],
      [-0.00037, 1],
      [-0.00071, 1],
      [-0.00715, 0],
      [0.00016, 1],
      [0.00108, 1],
      [-0.00027, 1],
      [-0.00026, 1],
      [-7e-5, 1],
      [-0.00467, 0],
      [-0.00043, 1],
      [-0.0005, 1],
      [-0.02962, 1],
      [-0.00019, 1],
      [-0.0002, 1],
      [-0.00035, 1]
    ],
    "red_o_points": [],
    "y_categories": ["N", "Y", "nan"],
    "blue_o_points": [],
    "blue_x_points": [
      [0.01182, 0],
      [-0.00013, 1],
      [0.01051, 0],
      [-0.00071, 1],
      [0.00014, 1],
      [0.01261, 0],
      [0.00187, 1],
      [0.01216, 0],
      [0.00271, 1],
      [0.00207, 1]
    ]
  },
  "QS_mulGraftLevel[Trunk]": {
    "red_x_points": [
      [-0.00043, 3],
      [-0.00131, 0],
      [-0.00146, 0],
      [-0.00148, 0],
      [-0.00049, 3],
      [-0.00171, 0],
      [-0.00149, 0],
      [-0.00122, 0],
      [-0.0004, 3],
      [-0.00151, 0],
      [-0.00172, 0],
      [-0.00149, 0],
      [-0.00038, 3],
      [0.00334, 1],
      [-0.00047, 3],
      [-0.00427, 2],
      [-0.00051, 3],
      [-0.00132, 0],
      [-0.00038, 3],
      [-0.0004, 3],
      [-0.00046, 3],
      [-0.00042, 3],
      [-0.0016, 0],
      [-0.00043, 3],
      [-0.00048, 3],
      [-0.00045, 3],
      [-0.0015, 0],
      [-0.00148, 0],
      [0.00314, 1],
      [-0.00049, 3],
      [-0.00146, 0],
      [-0.00056, 3]
    ],
    "red_o_points": [],
    "y_categories": ["N", "NOT APPLICABLE", "Y", "nan"],
    "blue_o_points": [],
    "blue_x_points": [
      [0.00545, 1],
      [-0.00019, 3],
      [0.00371, 1],
      [-0.00039, 0],
      [-0.00098, 0],
      [0.00373, 1],
      [-0.00032, 3],
      [0.00457, 1],
      [-0.00024, 3],
      [-0.00033, 3]
    ]
  },
  "QS_mulGraftNerve[Me]": {
    "red_x_points": [
      [-8e-5, 2],
      [-0.00035, 0],
      [-0.00029, 0],
      [-0.00033, 0],
      [-5e-5, 2],
      [-0.00025, 0],
      [-0.0002, 0],
      [-0.00035, 0],
      [-3e-5, 2],
      [-0.00028, 0],
      [-0.00029, 0],
      [-0.00025, 0],
      [-1e-5, 2],
      [0.00027, 1],
      [-6e-5, 2],
      [-0.0003, 0],
      [-3e-5, 2],
      [-0.0002, 0],
      [0.0, 2],
      [-1e-5, 2],
      [8e-5, 2],
      [1e-5, 2],
      [-0.0003, 0],
      [4e-5, 2],
      [-2e-5, 2],
      [-4e-5, 2],
      [-0.00029, 0],
      [-0.00015, 0],
      [0.0004, 1],
      [-0.00012, 2],
      [-0.00026, 0],
      [-2e-5, 2]
    ],
    "red_o_points": [],
    "y_categories": ["N", "NOT APPLICABLE", "nan"],
    "blue_o_points": [],
    "blue_x_points": [
      [0.00031, 1],
      [6e-5, 2],
      [0.00068, 1],
      [-0.00013, 0],
      [-6e-5, 0],
      [0.00067, 1],
      [3e-5, 2],
      [0.00035, 1],
      [0.00011, 2],
      [8e-5, 2]
    ]
  },
  "QS_mulGraftNerve[MP]": {
    "red_x_points": [
      [-2e-5, 2],
      [-2e-5, 0],
      [-2e-5, 2],
      [-2e-5, 0],
      [-2e-5, 2],
      [-0.00012, 0],
      [-0.00014, 0],
      [-0.0, 2],
      [-2e-5, 2],
      [-2e-5, 0],
      [-2e-5, 2],
      [-2e-5, 0],
      [-2e-5, 2],
      [-2e-5, 2],
      [-2e-5, 2],
      [-0.0, 2],
      [-2e-5, 0],
      [-2e-5, 2],
      [-2e-5, 2],
      [-2e-5, 2],
      [-2e-5, 0],
      [0.0001, 1],
      [-2e-5, 2],
      [-2e-5, 0],
      [-2e-5, 2]
    ],
    "red_o_points": [],
    "y_categories": ["N", "NOT APPLICABLE", "nan"],
    "blue_o_points": [],
    "blue_x_points": [
      [-2e-5, 2],
      [0.00018, 1],
      [-2e-5, 0],
      [0.0001, 1],
      [-0.0, 2],
      [-0.0, 2],
      [-0.0, 2]
    ]
  },
  "QS_mulGraftNerve[Ax]": {
    "red_x_points": [
      [-5e-5, 2],
      [-2e-5, 0],
      [-6e-5, 0],
      [-0.00019, 0],
      [-2e-5, 2],
      [-0.00017, 0],
      [-0.00013, 0],
      [-0.00018, 0],
      [-3e-5, 2],
      [-0.00027, 0],
      [-0.00034, 0],
      [-4e-5, 0],
      [-5e-5, 2],
      [-2e-5, 1],
      [-3e-5, 2],
      [-0.00017, 0],
      [-1e-5, 2],
      [-0.0001, 0],
      [-3e-5, 2],
      [-3e-5, 2],
      [-8e-5, 2],
      [-3e-5, 2],
      [-0.0001, 0],
      [-5e-5, 2],
      [-2e-5, 2],
      [-5e-5, 2],
      [-0.0001, 0],
      [-0.0001, 0],
      [0.00038, 1],
      [-8e-5, 2],
      [-6e-5, 0],
      [-5e-5, 2]
    ],
    "red_o_points": [],
    "y_categories": ["N", "NOT APPLICABLE", "nan"],
    "blue_o_points": [],
    "blue_x_points": [
      [0.00064, 1],
      [3e-5, 2],
      [0.00045, 1],
      [4e-5, 0],
      [-8e-5, 0],
      [0.00055, 1],
      [-2e-5, 2],
      [0.0001, 1],
      [-0.0, 2],
      [-2e-5, 2]
    ]
  },
  "QA_lstPexTouch[C7]": {
    "red_x_points": [
      [-0.00756, 1],
      [-0.00161, 2],
      [-0.00174, 1],
      [-0.00176, 2],
      [-0.00778, 1],
      [0.00199, 0],
      [-0.00275, 1],
      [-0.00311, 1],
      [0.0047, 0],
      [-0.0024, 1],
      [0.00247, 0],
      [-0.00347, 1],
      [-0.00817, 1],
      [-0.00669, 2],
      [-0.00373, 2],
      [-0.00223, 2],
      [-0.0075, 1],
      [-0.00184, 2],
      [-0.00392, 2],
      [0.00541, 0],
      [-0.0084, 1],
      [0.00516, 0],
      [-0.00251, 2],
      [-0.00348, 2],
      [0.00406, 0],
      [0.00478, 0],
      [-0.00231, 1],
      [-0.00172, 2],
      [-0.00216, 1],
      [-0.004, 2],
      [-0.00198, 1],
      [-0.00807, 1]
    ],
    "red_o_points": [],
    "y_categories": ["NORM", "NPV", "nan"],
    "blue_o_points": [],
    "blue_x_points": [
      [0.00045, 1],
      [0.00023, 2],
      [0.00084, 1],
      [0.00137, 1],
      [0.00889, 0],
      [0.0004, 1],
      [0.00907, 0],
      [0.00379, 0],
      [0.00896, 0],
      [0.01053, 0]
    ]
  },
  "QA_lstPexMuscstrength[ElbowExte]": {
    "red_x_points": [
      [-0.00113, 1],
      [-0.00133, 2],
      [0.00027, 1],
      [0.00029, 1],
      [-0.00104, 1],
      [-0.00625, 0],
      [0.00102, 1],
      [0.00015, 1],
      [0.00013, 1],
      [-0.00515, 0],
      [-0.00453, 0],
      [0.00066, 1],
      [0.00012, 1],
      [-0.00082, 2],
      [-0.00188, 2],
      [-0.0027, 2],
      [-0.00047, 1],
      [-0.00112, 2],
      [-0.00161, 2],
      [-0.00451, 0],
      [-0.00088, 1],
      [-0.00407, 0],
      [-0.00018, 1],
      [-0.00245, 2],
      [-0.00572, 0],
      [-0.00371, 0],
      [0.00115, 1],
      [-0.00202, 2],
      [-0.00072, 2],
      [-0.00062, 1],
      [4e-5, 1],
      [-0.00224, 2]
    ],
    "red_o_points": [],
    "y_categories": ["GREATER THAN OR EQUALS TO 3", "LESS THAN 3", "nan"],
    "blue_o_points": [],
    "blue_x_points": [
      [-8e-5, 2],
      [-0.00041, 2],
      [9e-5, 0],
      [0.00572, 1],
      [0.00587, 1],
      [0.00066, 0],
      [0.00532, 0],
      [0.00054, 0],
      [0.00827, 1],
      [0.00536, 1]
    ]
  },
  "QS_mulTransfSite[IAx]": {
    "red_x_points": [
      [-6e-5, 0],
      [-6e-5, 0],
      [-6e-5, 0],
      [-6e-5, 0],
      [-2e-5, 2],
      [-2e-5, 2],
      [-2e-5, 2],
      [-6e-5, 0],
      [-2e-5, 2],
      [-6e-5, 0],
      [-2e-5, 2],
      [-2e-5, 2],
      [-2e-5, 2],
      [-2e-5, 2],
      [-6e-5, 0],
      [-2e-5, 2],
      [-2e-5, 2],
      [-2e-5, 2],
      [-6e-5, 0],
      [-6e-5, 0],
      [0.00012, 1],
      [-2e-5, 2],
      [-6e-5, 0],
      [-2e-5, 2]
    ],
    "red_o_points": [],
    "y_categories": ["N", "NOT APPLICABLE", "nan"],
    "blue_o_points": [],
    "blue_x_points": [
      [0.00012, 1],
      [0.00012, 1],
      [0.00012, 1],
      [-2e-5, 2],
      [-2e-5, 2]
    ]
  },
  "QS_mulGraftNerve[MCF]": {
    "red_x_points": [[-0.00012, 0], [-0.00012, 0], [-0.00012, 2]],
    "red_o_points": [],
    "y_categories": ["N", "NOT APPLICABLE", "nan"],
    "blue_o_points": [],
    "blue_x_points": [[7e-5, 1], [7e-5, 1]]
  },
  "QS_mulLysisSite[Nerve]": {
    "red_x_points": [
      [-0.00034, 3],
      [-0.00075, 0],
      [-0.0021, 2],
      [-0.00077, 0],
      [-0.00031, 3],
      [-0.00088, 0],
      [-0.0008, 0],
      [-0.00067, 0],
      [-0.00026, 3],
      [-0.00077, 0],
      [-0.00073, 0],
      [-0.00075, 0],
      [-0.00049, 3],
      [0.00147, 1],
      [-0.00039, 3],
      [-0.00082, 0],
      [-0.00032, 3],
      [-0.00074, 0],
      [-0.0004, 3],
      [-0.00028, 3],
      [-0.00024, 3],
      [-0.00027, 3],
      [-0.00069, 0],
      [-0.00036, 3],
      [-0.00031, 3],
      [-0.00034, 3],
      [-0.00073, 0],
      [-0.00072, 0],
      [0.00156, 1],
      [-0.0002, 3],
      [-0.00062, 0],
      [-0.0003, 3]
    ],
    "red_o_points": [],
    "y_categories": ["N", "NOT APPLICABLE", "Y", "nan"],
    "blue_o_points": [],
    "blue_x_points": [
      [0.00359, 1],
      [-0.00013, 3],
      [0.00222, 1],
      [-0.00029, 0],
      [-0.00033, 0],
      [0.0026, 1],
      [-0.00013, 3],
      [0.00214, 1],
      [-0.00014, 3],
      [-0.00015, 3]
    ]
  },
  "QS_mulTransfSite[IMc]": {
    "red_x_points": [
      [-0.00113, 3],
      [-0.00941, 2],
      [-0.00418, 0],
      [-0.00409, 0],
      [-0.0014, 3],
      [-0.00427, 0],
      [-0.00404, 0],
      [-0.00428, 0],
      [-0.00159, 3],
      [-0.00454, 0],
      [-0.0044, 0],
      [-0.00429, 0],
      [-0.00164, 3],
      [0.01071, 1],
      [-0.00118, 3],
      [-0.00448, 0],
      [-0.00177, 3],
      [-0.00978, 2],
      [-0.00142, 3],
      [-0.00146, 3],
      [-0.001, 3],
      [-0.00157, 3],
      [-0.00417, 0],
      [-0.00148, 3],
      [-0.00163, 3],
      [-0.00137, 3],
      [-0.00364, 0],
      [-0.00899, 2],
      [0.01022, 1],
      [-0.00125, 3],
      [-0.0088, 2],
      [-0.00137, 3]
    ],
    "red_o_points": [],
    "y_categories": ["N", "NOT APPLICABLE", "Y", "nan"],
    "blue_o_points": [],
    "blue_x_points": [
      [0.0153, 1],
      [-0.00024, 3],
      [0.01277, 1],
      [-0.00037, 0],
      [-0.00118, 0],
      [0.01344, 1],
      [-0.00053, 3],
      [0.01378, 1],
      [-0.00065, 3],
      [0.00017, 3]
    ]
  },
  "QS_mulGraftLevel[other]": {
    "red_x_points": [[3e-5, 0], [0.0, 2], [-0.0001, 1], [0.0, 2]],
    "red_o_points": [],
    "y_categories": ["N", "NOT APPLICABLE", "nan"],
    "blue_o_points": [],
    "blue_x_points": [[0.0, 2], [3e-5, 0]]
  },
  "QS_lstBpsurgSide": {
    "red_x_points": [
      [-0.00132, 3],
      [-0.00577, 0],
      [-0.00614, 0],
      [-0.00588, 0],
      [-0.00141, 3],
      [-0.00592, 2],
      [-0.00633, 0],
      [-0.00622, 0],
      [-0.00194, 3],
      [-0.00655, 0],
      [-0.00585, 2],
      [-0.00681, 2],
      [-0.00161, 3],
      [0.00977, 1],
      [-0.00141, 3],
      [-0.00755, 2],
      [-0.00159, 3],
      [-0.00689, 2],
      [-0.00156, 3],
      [-0.00153, 3],
      [-0.00119, 3],
      [-0.00142, 3],
      [-0.00596, 0],
      [-0.00134, 3],
      [-0.00216, 3],
      [-0.00116, 3],
      [-0.006, 2],
      [-0.00613, 2],
      [0.01127, 1],
      [-0.00133, 3],
      [-0.00602, 0],
      [-0.00139, 3]
    ],
    "red_o_points": [],
    "y_categories": ["L", "NOT APPLICABLE", "R", "nan"],
    "blue_o_points": [],
    "blue_x_points": [
      [0.01461, 1],
      [-0.00043, 3],
      [0.01297, 1],
      [0.00267, 0],
      [0.00021, 2],
      [0.01401, 1],
      [-0.00045, 3],
      [0.0137, 1],
      [-0.00057, 3],
      [-0.00053, 3]
    ]
  },
  "QS_mulTransfSite[AcMc]": {
    "red_x_points": [
      [-8e-5, 3],
      [-0.00121, 0],
      [-0.00111, 0],
      [-0.00117, 0],
      [-0.00014, 3],
      [-0.00131, 0],
      [-0.00109, 0],
      [-0.00111, 0],
      [-0.00024, 3],
      [-0.00124, 0],
      [-0.00121, 0],
      [-0.00499, 2],
      [-0.00016, 3],
      [0.0021, 1],
      [3e-5, 3],
      [-0.0011, 0],
      [-6e-5, 3],
      [-0.00095, 0],
      [-6e-5, 3],
      [-0.00016, 3],
      [-6e-5, 3],
      [-9e-5, 3],
      [-0.00107, 0],
      [-4e-5, 3],
      [-8e-5, 3],
      [-0.00018, 3],
      [-0.00109, 0],
      [-0.0011, 0],
      [0.00209, 1],
      [-1e-5, 3],
      [-0.00083, 0],
      [-1e-5, 3]
    ],
    "red_o_points": [],
    "y_categories": ["N", "NOT APPLICABLE", "Y", "nan"],
    "blue_o_points": [],
    "blue_x_points": [
      [0.00337, 1],
      [0.00031, 3],
      [0.00258, 1],
      [-7e-5, 0],
      [-0.00027, 0],
      [0.00242, 1],
      [1e-5, 3],
      [0.00239, 1],
      [7e-5, 3],
      [8e-5, 3]
    ]
  },
  "QS_mulTransfSite[Other]": {
    "red_x_points": [
      [-0.00168, 3],
      [-0.01064, 0],
      [-0.01058, 0],
      [-0.01035, 0],
      [-0.00169, 3],
      [-0.01091, 0],
      [-0.01048, 0],
      [-0.01036, 0],
      [-0.00181, 3],
      [-0.01106, 0],
      [-0.01125, 0],
      [-0.01123, 0],
      [-0.00179, 3],
      [0.01535, 1],
      [-0.00153, 3],
      [-0.01071, 0],
      [-0.00186, 3],
      [-0.01041, 0],
      [-0.00217, 3],
      [-0.00192, 3],
      [-0.00162, 3],
      [-0.00178, 3],
      [-0.01085, 0],
      [-0.00155, 3],
      [-0.00224, 3],
      [-0.00143, 3],
      [-0.01098, 0],
      [-0.01098, 0],
      [0.01706, 1],
      [-0.00144, 3],
      [-0.01097, 0],
      [-0.0015, 3]
    ],
    "red_o_points": [],
    "y_categories": ["N", "NOT APPLICABLE", "Y", "nan"],
    "blue_o_points": [],
    "blue_x_points": [
      [0.01824, 1],
      [-0.00082, 3],
      [0.01638, 1],
      [-0.00495, 0],
      [0.03672, 2],
      [0.01695, 1],
      [-0.00094, 3],
      [0.0172, 1],
      [-0.00084, 3],
      [-0.00076, 3]
    ]
  },
  "QA_lstPexTouch[C8]": {
    "red_x_points": [
      [-0.00765, 1],
      [-0.00258, 2],
      [-0.00212, 1],
      [-0.00216, 2],
      [-0.00804, 1],
      [0.00217, 0],
      [-0.00224, 1],
      [-0.0028, 1],
      [0.00503, 0],
      [-0.00288, 1],
      [0.00182, 0],
      [0.00211, 0],
      [-0.008, 1],
      [-0.01051, 2],
      [-0.00413, 2],
      [-0.00328, 2],
      [-0.00739, 1],
      [-0.00253, 2],
      [-0.00343, 2],
      [0.00584, 0],
      [-0.00744, 1],
      [0.0051, 0],
      [-0.00295, 2],
      [-0.00378, 2],
      [0.00466, 0],
      [0.00647, 0],
      [-0.0028, 1],
      [-0.00232, 2],
      [-0.00674, 1],
      [-0.00378, 2],
      [-0.00251, 1],
      [-0.00734, 1]
    ],
    "red_o_points": [],
    "y_categories": ["NORM", "NPV", "nan"],
    "blue_o_points": [],
    "blue_x_points": [
      [0.00917, 0],
      [-0.00038, 2],
      [-0.00014, 1],
      [0.00135, 1],
      [0.00646, 0],
      [-3e-5, 1],
      [0.00867, 0],
      [0.0046, 0],
      [0.00787, 0],
      [0.00965, 0]
    ]
  },
  "QA_lstPexMuscstrength[FingersAbdu]": {
    "red_x_points": [
      [0.00032, 2],
      [0.00014, 2],
      [-0.00274, 1],
      [-0.00235, 1],
      [-0.00037, 1],
      [0.0012, 0],
      [0.00087, 0],
      [-0.00259, 1],
      [-0.00509, 0],
      [0.0016, 0],
      [0.00011, 2],
      [-0.00318, 1],
      [-0.00386, 0],
      [0.00012, 2],
      [0.00013, 2],
      [0.00017, 2],
      [-0.00252, 0],
      [0.00012, 2],
      [0.00029, 2],
      [-0.00647, 0],
      [-0.00057, 1],
      [-0.00667, 0],
      [-0.00198, 1],
      [0.00032, 2],
      [0.00071, 2],
      [0.00035, 2],
      [-0.00369, 1],
      [-0.00235, 1],
      [6e-5, 2],
      [-0.00107, 1],
      [-0.00244, 1],
      [-0.0, 2]
    ],
    "red_o_points": [],
    "y_categories": ["GREATER THAN OR EQUALS TO 3", "LESS THAN 3", "nan"],
    "blue_o_points": [],
    "blue_x_points": [
      [0.00011, 2],
      [0.00053, 2],
      [0.00102, 0],
      [0.00227, 2],
      [0.00409, 0],
      [0.00106, 0],
      [0.01019, 1],
      [0.00097, 0],
      [0.00319, 2],
      [0.00266, 2]
    ]
  },
  "QS_mulTransfSite[AcSsAA]": {
    "red_x_points": [
      [-0.00192, 3],
      [-0.01326, 2],
      [-0.00342, 0],
      [-0.0124, 2],
      [-0.00175, 3],
      [-0.01654, 2],
      [-0.00288, 0],
      [-0.00343, 0],
      [-0.00202, 3],
      [-0.00349, 0],
      [-0.01393, 2],
      [-0.00302, 0],
      [-0.00239, 3],
      [0.01564, 1],
      [-0.00164, 3],
      [-0.01299, 2],
      [-0.00201, 3],
      [-0.00279, 0],
      [-0.00249, 3],
      [-0.00218, 3],
      [-0.00146, 3],
      [-0.00186, 3],
      [-0.01207, 2],
      [-0.00171, 3],
      [-0.00286, 3],
      [-0.00186, 3],
      [-0.00315, 0],
      [-0.0125, 2],
      [0.01469, 1],
      [-0.00154, 3],
      [-0.00291, 0],
      [-0.0015, 3]
    ],
    "red_o_points": [],
    "y_categories": ["N", "NOT APPLICABLE", "Y", "nan"],
    "blue_o_points": [],
    "blue_x_points": [
      [0.01917, 1],
      [-0.0007, 3],
      [0.01755, 1],
      [0.00109, 0],
      [0.00174, 0],
      [0.01737, 1],
      [-0.00091, 3],
      [0.01756, 1],
      [-0.0004, 3],
      [2e-5, 3]
    ]
  },
  "QS_mulLysisRoot[C5]": {
    "red_x_points": [
      [-0.00122, 3],
      [-0.0031, 0],
      [-0.00731, 2],
      [-0.0033, 0],
      [-0.00121, 3],
      [-0.00341, 0],
      [-0.00284, 0],
      [-0.00298, 0],
      [-0.00141, 3],
      [-0.00349, 0],
      [-0.0034, 0],
      [-0.00323, 0],
      [-0.00115, 3],
      [0.00734, 1],
      [-0.00091, 3],
      [-0.00347, 0],
      [-0.00137, 3],
      [-0.00277, 0],
      [-0.00087, 3],
      [-0.00129, 3],
      [-0.00089, 3],
      [-0.001, 3],
      [-0.00312, 0],
      [-0.00097, 3],
      [-0.00159, 3],
      [-0.00092, 3],
      [-0.00305, 0],
      [-0.00345, 0],
      [0.00687, 1],
      [-0.00085, 3],
      [-0.00635, 2],
      [-0.00109, 3]
    ],
    "red_o_points": [],
    "y_categories": ["N", "NOT APPLICABLE", "Y", "nan"],
    "blue_o_points": [],
    "blue_x_points": [
      [0.01015, 1],
      [-0.00023, 3],
      [0.00785, 1],
      [-0.00076, 0],
      [-0.001, 0],
      [0.00938, 1],
      [-0.00039, 3],
      [0.00962, 1],
      [-0.00042, 3],
      [1e-5, 3]
    ]
  },
  "QS_mulNeuromadSite[C6]": {
    "red_x_points": [
      [-0.00041, 2],
      [-0.00106, 0],
      [-0.00076, 0],
      [-0.00092, 0],
      [-0.00026, 2],
      [-0.00102, 0],
      [-0.00088, 0],
      [-0.00072, 0],
      [-0.00029, 2],
      [-0.00112, 0],
      [-0.00138, 0],
      [-0.00071, 0],
      [-0.0001, 2],
      [0.00116, 1],
      [-6e-5, 2],
      [-0.00129, 0],
      [-0.00019, 2],
      [-0.00096, 0],
      [-8e-5, 2],
      [-0.00032, 2],
      [-0.00012, 2],
      [-0.00025, 2],
      [-0.00102, 0],
      [-3e-5, 2],
      [-0.00072, 2],
      [-0.00034, 2],
      [-0.00094, 0],
      [-0.0008, 0],
      [0.00119, 1],
      [-0.00017, 2],
      [-0.00066, 0],
      [-0.00027, 2]
    ],
    "red_o_points": [],
    "y_categories": ["N", "NOT APPLICABLE", "nan"],
    "blue_o_points": [],
    "blue_x_points": [
      [0.00196, 1],
      [0.00031, 2],
      [0.00223, 1],
      [0.00025, 0],
      [-0.00034, 0],
      [0.00243, 1],
      [-4e-5, 2],
      [0.0024, 1],
      [-6e-5, 2],
      [0.00018, 2]
    ]
  },
  "QS_mulNeuromadSite[T1]": {
    "red_x_points": [
      [-0.0003, 2],
      [-0.00142, 0],
      [-0.00131, 0],
      [-0.00143, 0],
      [-0.00015, 2],
      [-0.0017, 0],
      [-0.00163, 0],
      [-0.00124, 0],
      [-0.00038, 2],
      [-0.00179, 0],
      [-0.00171, 0],
      [-0.00143, 0],
      [-0.00057, 2],
      [0.00219, 1],
      [-0.00017, 2],
      [-0.00133, 0],
      [-0.00041, 2],
      [-0.00129, 0],
      [-0.00045, 2],
      [-0.00061, 2],
      [-0.00015, 2],
      [-0.00031, 2],
      [-0.00144, 0],
      [4e-5, 2],
      [-0.00049, 2],
      [-0.00032, 2],
      [-0.00136, 0],
      [-0.00142, 0],
      [0.0012, 1],
      [-0.00019, 2],
      [-0.00113, 0],
      [-0.00021, 2]
    ],
    "red_o_points": [],
    "y_categories": ["N", "NOT APPLICABLE", "nan"],
    "blue_o_points": [],
    "blue_x_points": [
      [0.00391, 1],
      [0.00013, 2],
      [0.00327, 1],
      [0.0, 0],
      [-0.00052, 0],
      [0.0031, 1],
      [-5e-5, 2],
      [0.00394, 1],
      [8e-5, 2],
      [0.00031, 2]
    ]
  },
  "QA_lstPexMuscstrength[ShoulderAbduc]": {
    "red_x_points": [
      [-0.00308, 1],
      [-0.00249, 1],
      [-0.00242, 1],
      [-0.00258, 1],
      [-0.00265, 1],
      [-0.00315, 1],
      [-0.00326, 1],
      [-0.00306, 1],
      [-0.00282, 1],
      [-0.00304, 1],
      [-0.00289, 1],
      [-0.00257, 1],
      [-0.00297, 1],
      [0.00073, 2],
      [0.00115, 2],
      [0.0011, 2],
      [0.00115, 2],
      [0.00113, 2],
      [0.0008, 2],
      [-0.0027, 1],
      [-0.00291, 1],
      [-0.00293, 1],
      [-0.00261, 1],
      [0.001, 2],
      [-0.00312, 1],
      [-0.00273, 1],
      [-0.00267, 1],
      [-0.00261, 1],
      [0.0009, 2],
      [-0.0029, 1],
      [-0.00278, 1],
      [0.00124, 2]
    ],
    "red_o_points": [],
    "y_categories": ["GREATER THAN OR EQUALS TO 3", "LESS THAN 3", "nan"],
    "blue_o_points": [],
    "blue_x_points": [
      [0.00087, 2],
      [0.00144, 2],
      [0.01674, 0],
      [0.00185, 2],
      [-0.00253, 1],
      [0.01598, 0],
      [0.00166, 2],
      [-0.0012, 1],
      [-0.00215, 1],
      [-0.00178, 1]
    ]
  },
  "QS_mulNeuromadSite[T2]": {
    "red_x_points": [
      [-0.00026, 2],
      [-0.00214, 0],
      [-0.00238, 0],
      [-0.00221, 0],
      [-0.00028, 2],
      [-0.00253, 0],
      [-0.00201, 0],
      [-0.00201, 0],
      [-0.0004, 2],
      [-0.00183, 0],
      [-0.0028, 0],
      [-0.00247, 0],
      [-0.00071, 2],
      [0.00348, 1],
      [-0.00042, 2],
      [-0.00256, 0],
      [-0.001, 2],
      [-0.00181, 0],
      [-0.00055, 2],
      [-0.00053, 2],
      [-0.00013, 2],
      [-0.00044, 2],
      [-0.00205, 0],
      [-0.00044, 2],
      [-0.00081, 2],
      [-0.00054, 2],
      [-0.00237, 0],
      [-0.00184, 0],
      [0.00224, 1],
      [-0.00023, 2],
      [-0.00156, 0],
      [-0.00056, 2]
    ],
    "red_o_points": [],
    "y_categories": ["N", "NOT APPLICABLE", "nan"],
    "blue_o_points": [],
    "blue_x_points": [
      [0.00547, 1],
      [0.00015, 2],
      [0.00423, 1],
      [0.00074, 0],
      [-0.00098, 0],
      [0.00504, 1],
      [-0.00025, 2],
      [0.00581, 1],
      [9e-5, 2],
      [0.00062, 2]
    ]
  },
  "QS_mulNeuromadSite[C4]": {
    "red_x_points": [
      [-0.00035, 2],
      [-0.00146, 0],
      [-0.00139, 0],
      [-0.00142, 0],
      [-0.0004, 2],
      [-0.00169, 0],
      [-0.00127, 0],
      [-0.0016, 0],
      [-0.0004, 2],
      [-0.00161, 0],
      [-0.00192, 0],
      [-0.00139, 0],
      [-0.00046, 2],
      [0.00129, 1],
      [-0.00013, 2],
      [-0.00168, 0],
      [-0.00058, 2],
      [-0.00132, 0],
      [-0.00029, 2],
      [-0.0005, 2],
      [-0.00026, 2],
      [-0.00068, 2],
      [-0.00147, 0],
      [-0.0002, 2],
      [-0.00065, 2],
      [-0.00018, 2],
      [-0.00147, 0],
      [-0.00094, 0],
      [0.0024, 1],
      [-0.00019, 2],
      [-0.00105, 0],
      [-0.00019, 2]
    ],
    "red_o_points": [],
    "y_categories": ["N", "NOT APPLICABLE", "nan"],
    "blue_o_points": [],
    "blue_x_points": [
      [0.004, 1],
      [0.00025, 2],
      [0.00396, 1],
      [-9e-5, 0],
      [-0.00067, 0],
      [0.00386, 1],
      [-0.00026, 2],
      [0.00326, 1],
      [-7e-5, 2],
      [-4e-5, 2]
    ]
  },
  "QS_mulGraftNerve[Ra]": {
    "red_x_points": [
      [-0.0, 2],
      [-0.00016, 0],
      [-0.00016, 0],
      [-0.00012, 0],
      [1e-5, 2],
      [-0.00012, 0],
      [-2e-5, 0],
      [-0.00016, 0],
      [1e-5, 2],
      [-6e-5, 0],
      [-0.0001, 0],
      [-0.00014, 0],
      [-0.0, 2],
      [0.00015, 1],
      [1e-5, 2],
      [-8e-5, 0],
      [1e-5, 2],
      [-0.00016, 0],
      [1e-5, 2],
      [1e-5, 2],
      [1e-5, 2],
      [-0.0, 2],
      [-6e-5, 0],
      [-0.0, 2],
      [1e-5, 2],
      [1e-5, 2],
      [-0.00016, 0],
      [-0.00012, 0],
      [0.00017, 1],
      [1e-5, 2],
      [-0.00014, 0],
      [-6e-5, 2]
    ],
    "red_o_points": [],
    "y_categories": ["N", "NOT APPLICABLE", "nan"],
    "blue_o_points": [],
    "blue_x_points": [
      [0.00029, 1],
      [1e-5, 2],
      [0.00017, 1],
      [0.00011, 0],
      [-0.0001, 0],
      [0.00023, 1],
      [1e-5, 2],
      [0.00024, 1],
      [1e-5, 2],
      [-0.0, 2]
    ]
  },
  "QS_mulTransfSite[Oberlin]": {
    "red_x_points": [
      [-0.00176, 3],
      [-0.01408, 0],
      [-0.01525, 0],
      [-0.01423, 0],
      [-0.00185, 3],
      [-0.00359, 2],
      [-0.00238, 2],
      [-0.01541, 0],
      [-0.00202, 3],
      [-0.00307, 2],
      [-0.00322, 2],
      [-0.0028, 2],
      [-0.00177, 3],
      [0.01708, 1],
      [-0.00167, 3],
      [-0.00313, 2],
      [-0.00157, 3],
      [-0.01466, 0],
      [-0.00229, 3],
      [-0.00203, 3],
      [-0.00167, 3],
      [-0.00156, 3],
      [-0.01406, 0],
      [-0.00195, 3],
      [-0.00206, 3],
      [-0.00176, 3],
      [-0.00326, 2],
      [-0.0136, 0],
      [0.01765, 1],
      [-0.00149, 3],
      [-0.01513, 0],
      [-0.00184, 3]
    ],
    "red_o_points": [],
    "y_categories": ["N", "NOT APPLICABLE", "Y", "nan"],
    "blue_o_points": [],
    "blue_x_points": [
      [0.0216, 1],
      [-0.00028, 3],
      [0.01828, 1],
      [0.00211, 2],
      [0.00128, 2],
      [0.01859, 1],
      [-0.00062, 3],
      [0.01966, 1],
      [-0.00057, 3],
      [-0.00053, 3]
    ]
  },
  "QS_mulGraftNerve[FI]": {
    "red_x_points": [
      [-0.0001, 2],
      [-0.00054, 0],
      [-0.00059, 0],
      [-0.00078, 0],
      [-0.00021, 2],
      [-0.00094, 0],
      [-0.00083, 0],
      [-0.00083, 0],
      [-0.00049, 2],
      [-0.00072, 0],
      [-0.0008, 0],
      [-0.0008, 0],
      [-0.00031, 2],
      [0.00064, 1],
      [-0.00021, 2],
      [-0.00071, 0],
      [-0.00029, 2],
      [-0.00051, 0],
      [-0.00039, 2],
      [-0.00032, 2],
      [-8e-5, 2],
      [-0.00028, 2],
      [-0.00066, 0],
      [-0.00022, 2],
      [-0.00038, 2],
      [-0.00026, 2],
      [-0.00089, 0],
      [-0.00081, 0],
      [0.00139, 1],
      [-0.00021, 2],
      [-0.00077, 0],
      [-0.00013, 2]
    ],
    "red_o_points": [],
    "y_categories": ["N", "NOT APPLICABLE", "nan"],
    "blue_o_points": [],
    "blue_x_points": [
      [0.00204, 1],
      [-7e-5, 2],
      [0.00171, 1],
      [0.00043, 0],
      [-0.00047, 0],
      [0.00232, 1],
      [-0.00015, 2],
      [0.0024, 1],
      [-2e-5, 2],
      [-5e-5, 2]
    ]
  }
}
