{
  "QA_lstPexMuscstrength[ElbowFlex]": {
    "red_x_points": [
      [-0.01086, 1],
      [-0.0001, 2],
      [-0.00985, 1],
      [-0.00987, 1],
      [-0.01027, 1],
      [-0.00995, 1],
      [-0.01036, 1],
      [-0.01001, 1],
      [-0.01013, 1],
      [-0.01058, 1],
      [-0.01072, 1],
      [-0.00989, 1],
      [-0.00011, 2],
      [-0.00069, 2],
      [0.00055, 2],
      [-0.01112, 1],
      [-0.01099, 1],
      [-0.00968, 1],
      [-0.01006, 1],
      [-0.01002, 1],
      [-0.00011, 2],
      [-0.01046, 1],
      [-0.01043, 1],
      [-0.00995, 1],
      [-0.00999, 1],
      [0.0005, 2],
      [-0.00987, 1],
      [-0.01037, 1],
      [-9e-5, 2]
    ],
    "red_o_points": [],
    "y_categories": ["GREATER THAN OR EQUALS TO 3", "LESS THAN 3", "nan"],
    "blue_o_points": [],
    "blue_x_points": [
      [0.00125, 2],
      [-0.00952, 1],
      [0.05178, 0],
      [-0.00968, 1],
      [0.0023, 2],
      [0.00181, 2],
      [0.0385, 0],
      [-0.00841, 1],
      [-0.01054, 1],
      [0.00216, 2],
      [0.04868, 0],
      [0.04079, 0],
      [0.04769, 0],
      [0.03812, 0],
      [-0.00945, 1]
    ]
  },
  "QS_mulGraftNerve[other]": {
    "red_x_points": [
      [-1e-5, 2],
      [-0.00033, 0],
      [-0.00023, 0],
      [-0.00021, 0],
      [-0.00034, 0],
      [-0.00018, 0],
      [-0.00029, 0],
      [-7e-5, 2],
      [-0.00019, 0],
      [-7e-5, 0],
      [-1e-5, 2],
      [-0.00023, 0],
      [5e-5, 2],
      [-0.00032, 0],
      [-0.00014, 0],
      [-1e-5, 2],
      [-1e-5, 2],
      [-6e-5, 2],
      [-0.00013, 0],
      [-1e-5, 2],
      [-1e-5, 2],
      [-3e-5, 2],
      [-0.0002, 0],
      [-0.00021, 0],
      [-4e-5, 2],
      [0.00035, 1],
      [0.0, 2],
      [-5e-5, 0],
      [1e-5, 2]
    ],
    "red_o_points": [],
    "y_categories": ["N", "NOT APPLICABLE", "nan"],
    "blue_o_points": [],
    "blue_x_points": [
      [0.00099, 1],
      [5e-5, 2],
      [-7e-5, 0],
      [-0.00011, 0],
      [-0.0, 2],
      [0.00075, 1],
      [0.00045, 1],
      [-5e-5, 0],
      [4e-5, 2],
      [-1e-5, 2],
      [-5e-5, 0],
      [0.00061, 1],
      [-4e-5, 2],
      [0.00047, 1],
      [-5e-5, 2]
    ]
  },
  "QS_mulLysisTrunk[Upper]": {
    "red_x_points": [
      [-0.00057, 3],
      [-0.00514, 0],
      [-0.00376, 0],
      [-0.00311, 0],
      [-0.0035, 0],
      [-0.01485, 2],
      [-0.00342, 0],
      [-0.00085, 3],
      [-0.00303, 0],
      [-0.00311, 0],
      [-0.00127, 3],
      [-0.0036, 0],
      [-0.00091, 3],
      [-0.00456, 0],
      [-0.01221, 2],
      [-0.00122, 3],
      [-0.00106, 3],
      [-0.00085, 3],
      [-0.00351, 0],
      [-0.00071, 3],
      [-0.00092, 3],
      [-0.00098, 3],
      [-0.00403, 0],
      [-0.00408, 0],
      [-0.00125, 3],
      [0.01305, 1],
      [-0.00081, 3],
      [-0.01211, 2],
      [-0.001, 3]
    ],
    "red_o_points": [],
    "y_categories": ["N", "NOT APPLICABLE", "Y", "nan"],
    "blue_o_points": [],
    "blue_x_points": [
      [0.02386, 1],
      [-0.00052, 3],
      [-0.00099, 0],
      [-0.00103, 0],
      [-7e-5, 3],
      [0.02098, 1],
      [0.01416, 1],
      [-0.00181, 0],
      [-0.0004, 3],
      [-0.00034, 3],
      [-0.0009, 0],
      [0.01505, 1],
      [-0.00054, 3],
      [0.01657, 1],
      [-0.00065, 3]
    ]
  },
  "QS_mulBpsurgeryType[Transf]": {
    "red_x_points": [
      [-5e-5, 3],
      [-0.00055, 2],
      [-0.00245, 0],
      [-0.00049, 2],
      [-0.00048, 2],
      [-0.00043, 2],
      [-0.00062, 2],
      [-0.00021, 3],
      [-0.00062, 2],
      [-0.00047, 2],
      [-8e-5, 3],
      [-0.0005, 2],
      [-0.00016, 3],
      [-0.00068, 2],
      [-0.00044, 2],
      [-4e-5, 3],
      [-4e-5, 3],
      [-4e-5, 3],
      [-0.00048, 2],
      [-3e-5, 3],
      [-0.00018, 3],
      [-0.00017, 3],
      [-0.00046, 2],
      [-0.00041, 2],
      [-0.00016, 3],
      [0.00164, 1],
      [-0.00015, 3],
      [-0.00047, 2],
      [-0.0002, 3]
    ],
    "red_o_points": [],
    "y_categories": ["N", "NOT APPLICABLE", "Y", "nan"],
    "blue_o_points": [],
    "blue_x_points": [
      [0.00323, 1],
      [-0.00013, 3],
      [-0.00013, 2],
      [-0.0004, 2],
      [-1e-5, 3],
      [0.00216, 1],
      [0.00126, 1],
      [-0.00029, 2],
      [-0.0002, 3],
      [-3e-5, 3],
      [-7e-5, 2],
      [0.00202, 1],
      [-3e-5, 3],
      [0.00209, 1],
      [-2e-5, 3]
    ]
  },
  "QS_mulGraftNerve[Ac]": {
    "red_x_points": [
      [1e-5, 2],
      [-4e-5, 0],
      [-4e-5, 0],
      [-7e-5, 0],
      [-0.00011, 0],
      [-4e-5, 0],
      [-0.00011, 0],
      [-5e-5, 2],
      [-9e-5, 0],
      [-2e-5, 0],
      [2e-5, 2],
      [-2e-5, 0],
      [-1e-5, 2],
      [-0.00011, 0],
      [2e-5, 2],
      [2e-5, 2],
      [2e-5, 2],
      [1e-5, 2],
      [-4e-5, 2],
      [-2e-5, 0],
      [-4e-5, 0],
      [-5e-5, 2],
      [0.0001, 1],
      [-3e-5, 2],
      [-4e-5, 0],
      [-4e-5, 2]
    ],
    "red_o_points": [],
    "y_categories": ["N", "NOT APPLICABLE", "nan"],
    "blue_o_points": [],
    "blue_x_points": [
      [0.00053, 1],
      [0.0, 2],
      [-3e-5, 0],
      [-6e-5, 0],
      [0.0, 2],
      [-2e-5, 0],
      [0.00023, 1],
      [0.00012, 1],
      [1e-5, 2]
    ]
  },
  "QS_mulNeuromadSite[C8]": {
    "red_x_points": [
      [-6e-5, 2],
      [-0.00076, 0],
      [-0.00054, 0],
      [-0.00042, 0],
      [-0.00055, 0],
      [-0.0003, 0],
      [-0.00053, 0],
      [-0.0001, 2],
      [-0.00057, 0],
      [-0.00025, 0],
      [-2e-5, 2],
      [-0.00063, 0],
      [2e-5, 2],
      [-0.0007, 0],
      [-0.00061, 0],
      [-0.00023, 2],
      [-5e-5, 2],
      [-0.00013, 2],
      [-0.00024, 0],
      [-0.00011, 2],
      [-1e-5, 2],
      [4e-5, 2],
      [-0.00064, 0],
      [-0.00053, 0],
      [-6e-5, 2],
      [0.00069, 1],
      [-0.00024, 2],
      [-0.00027, 0],
      [-8e-5, 2]
    ],
    "red_o_points": [],
    "y_categories": ["N", "NOT APPLICABLE", "nan"],
    "blue_o_points": [],
    "blue_x_points": [
      [0.00297, 1],
      [1e-5, 2],
      [-3e-5, 0],
      [3e-5, 0],
      [5e-5, 2],
      [0.00175, 1],
      [0.00076, 1],
      [-0.00035, 0],
      [4e-5, 2],
      [6e-5, 2],
      [-0.00011, 0],
      [0.00158, 1],
      [-9e-5, 2],
      [0.00133, 1],
      [-0.0001, 2]
    ]
  },
  "QS_mulGraftNerve[Ph]": {
    "red_x_points": [
      [1e-5, 2],
      [-7e-5, 0],
      [-0.00015, 0],
      [-8e-5, 0],
      [-0.00013, 0],
      [-7e-5, 0],
      [-0.00015, 0],
      [-4e-5, 2],
      [-8e-5, 0],
      [-7e-5, 0],
      [-1e-5, 2],
      [-7e-5, 0],
      [-3e-5, 2],
      [-5e-5, 0],
      [-1e-5, 0],
      [-1e-5, 2],
      [-1e-5, 2],
      [-5e-5, 2],
      [-5e-5, 0],
      [-2e-5, 2],
      [-5e-5, 2],
      [-4e-5, 2],
      [-7e-5, 0],
      [-5e-5, 0],
      [-5e-5, 2],
      [0.00023, 1],
      [-8e-5, 2],
      [-7e-5, 0],
      [-2e-5, 2]
    ],
    "red_o_points": [],
    "y_categories": ["N", "NOT APPLICABLE", "nan"],
    "blue_o_points": [],
    "blue_x_points": [
      [0.00053, 1],
      [-7e-5, 2],
      [-3e-5, 0],
      [-3e-5, 0],
      [-2e-5, 2],
      [0.00026, 1],
      [0.00024, 1],
      [-4e-5, 0],
      [-1e-5, 2],
      [-1e-5, 2],
      [-3e-5, 0],
      [0.00039, 1],
      [-5e-5, 2],
      [0.00024, 1],
      [-2e-5, 2]
    ]
  },
  "QS_mulTransfSite[AcSsPA]": {
    "red_x_points": [
      [-0.0003, 3],
      [-0.0018, 0],
      [-0.00117, 0],
      [-0.00125, 0],
      [-0.00137, 0],
      [-0.00088, 0],
      [-0.00093, 0],
      [-0.00027, 3],
      [-0.00132, 0],
      [-0.00095, 0],
      [-0.00022, 3],
      [-0.00143, 0],
      [-0.00026, 3],
      [-0.00167, 0],
      [-0.00385, 2],
      [-0.00018, 3],
      [-0.00021, 3],
      [-0.00028, 3],
      [-0.00091, 0],
      [-0.0002, 3],
      [-0.00026, 3],
      [-0.0003, 3],
      [-0.00092, 0],
      [-0.00105, 0],
      [-0.00028, 3],
      [0.00317, 1],
      [-0.00026, 3],
      [-0.0008, 0],
      [-0.00031, 3]
    ],
    "red_o_points": [],
    "y_categories": ["N", "NOT APPLICABLE", "Y", "nan"],
    "blue_o_points": [],
    "blue_x_points": [
      [0.00598, 1],
      [-7e-5, 3],
      [-0.00065, 0],
      [-0.00067, 0],
      [-3e-5, 3],
      [0.00454, 1],
      [0.0039, 1],
      [-0.00088, 0],
      [-0.0002, 3],
      [-0.0001, 3],
      [-0.00067, 0],
      [0.00482, 1],
      [-0.00012, 3],
      [0.00477, 1],
      [-0.00017, 3]
    ]
  },
  "QA_lstPexPalle[Elbow]": {
    "red_x_points": [
      [-0.00044, 4],
      [-0.00234, 4],
      [-0.00188, 4],
      [-0.00258, 3],
      [-0.00272, 4],
      [-0.00162, 3],
      [-0.00273, 4],
      [-0.00041, 4],
      [-0.00427, 4],
      [-0.00214, 3],
      [-0.00407, 1],
      [-0.0036, 4],
      [-0.0005, 4],
      [-0.00399, 4],
      [-0.00125, 4],
      [1e-5, 3],
      [-0.00969, 0],
      [0.00024, 3],
      [-0.00678, 2],
      [0.00022, 3],
      [-0.00035, 4],
      [-0.00044, 4],
      [-0.00372, 4],
      [-0.00344, 4],
      [-0.00031, 4],
      [-0.02727, 3],
      [-0.00025, 4],
      [-0.00588, 0],
      [-0.00034, 4]
    ],
    "red_o_points": [],
    "y_categories": ["ABS", "HYPO", "NAIA", "PT", "nan"],
    "blue_o_points": [],
    "blue_x_points": [
      [0.00448, 4],
      [0.00062, 4],
      [0.00233, 3],
      [0.03302, 1],
      [9e-5, 4],
      [0.00492, 4],
      [0.00997, 1],
      [-0.00237, 4],
      [0.00031, 4],
      [0.0005, 4],
      [0.02322, 1],
      [0.00452, 4],
      [0.00145, 3],
      [0.00479, 4],
      [0.00469, 3]
    ]
  },
  "QA_lstPexMuscstrength[ScapulaAbducSuprot]": {
    "red_x_points": [
      [0.00271, 0],
      [-0.00147, 2],
      [-0.00862, 1],
      [-0.00073, 2],
      [-0.01102, 1],
      [-0.01127, 1],
      [-0.01071, 1],
      [-0.00626, 1],
      [0.01291, 0],
      [-0.01314, 1],
      [-0.00713, 1],
      [-0.0021, 2],
      [-0.00088, 2],
      [-0.002, 2],
      [-0.00086, 2],
      [0.00265, 0],
      [-0.00729, 1],
      [0.0013, 0],
      [-0.00821, 1],
      [-0.00264, 2],
      [-0.00089, 2],
      [-0.00095, 2],
      [-0.01296, 1],
      [0.00944, 0],
      [8e-5, 2],
      [0.00017, 2],
      [0.00259, 0],
      [-0.00632, 1],
      [-0.00076, 2]
    ],
    "red_o_points": [],
    "y_categories": ["GREATER THAN OR EQUALS TO 3", "LESS THAN 3", "nan"],
    "blue_o_points": [],
    "blue_x_points": [
      [-0.00014, 2],
      [0.00924, 0],
      [0.01606, 0],
      [0.01867, 0],
      [0.00032, 2],
      [0.00032, 2],
      [0.00312, 0],
      [0.00189, 2],
      [0.00276, 2],
      [0.0009, 2],
      [0.01655, 0],
      [0.00364, 0],
      [0.00359, 0],
      [0.00038, 2],
      [0.00709, 1]
    ]
  },
  "participant_code": {
    "red_x_points": [
      [-0.02825, 1],
      [-0.02893, 2],
      [-0.02934, 3],
      [-0.02886, 4],
      [-0.02866, 5],
      [-0.02914, 8],
      [-0.02783, 9],
      [-0.02996, 10],
      [-0.02927, 11],
      [-0.02893, 13],
      [-0.02838, 14],
      [-0.02838, 18],
      [-0.02948, 19],
      [-0.02845, 20],
      [-0.02866, 23],
      [-0.029, 26],
      [-0.02879, 28],
      [-0.02934, 29],
      [-0.02941, 30],
      [-0.02879, 31],
      [-0.02825, 32],
      [-0.02886, 34],
      [-0.02948, 36],
      [-0.02811, 38],
      [-0.02879, 39],
      [-0.02845, 40],
      [-0.02921, 41],
      [-0.02831, 42],
      [-0.02838, 43]
    ],
    "red_o_points": [],
    "y_categories": [
      "P16554",
      "P18297",
      "P19283",
      "P19287",
      "P23172",
      "P23391",
      "P30595",
      "P31645",
      "P31691",
      "P34778",
      "P35046",
      "P36328",
      "P43633",
      "P4544",
      "P46417",
      "P48965",
      "P53068",
      "P5497",
      "P58556",
      "P59529",
      "P62483",
      "P64658",
      "P65202",
      "P66816",
      "P6751",
      "P7408",
      "P75566",
      "P76226",
      "P79971",
      "P82621",
      "P82990",
      "P84549",
      "P84932",
      "P85825",
      "P86989",
      "P8770",
      "P87791",
      "P90550",
      "P93159",
      "P94969",
      "P96710",
      "P97130",
      "P9744",
      "P98500",
      "nan"
    ],
    "blue_o_points": [],
    "blue_x_points": [
      [0.05532, 0],
      [0.05532, 6],
      [0.05611, 7],
      [0.05637, 12],
      [0.05479, 15],
      [0.05677, 16],
      [0.0565, 17],
      [0.05585, 21],
      [0.05637, 22],
      [0.05571, 24],
      [0.05663, 25],
      [0.05387, 27],
      [0.05479, 33],
      [0.05716, 35],
      [0.05414, 37]
    ]
  },
  "QA_yonInjTbi": {
    "red_x_points": [
      [0.00713, 0],
      [-0.00246, 2],
      [-0.00219, 0],
      [-0.00208, 0],
      [-0.00262, 2],
      [0.00038, 1],
      [-0.00321, 0],
      [-0.00995, 2],
      [-0.00528, 2],
      [0.0014, 1],
      [-0.00503, 1],
      [-0.00481, 0],
      [0.00759, 0],
      [0.00123, 1],
      [9e-5, 1],
      [-0.00634, 1],
      [-0.00455, 1],
      [-0.00537, 1],
      [0.0012, 1],
      [-0.00592, 1],
      [0.00698, 0],
      [-0.00652, 1],
      [0.0017, 1],
      [0.00148, 1],
      [-0.00498, 1],
      [-0.0009, 2],
      [-0.01042, 2],
      [0.00021, 1],
      [-0.00724, 1]
    ],
    "red_o_points": [],
    "y_categories": ["N", "Y", "nan"],
    "blue_o_points": [],
    "blue_x_points": [
      [0.00057, 0],
      [-0.00245, 1],
      [0.00275, 1],
      [0.00353, 1],
      [0.01201, 0],
      [-5e-5, 1],
      [4e-5, 1],
      [0.00428, 1],
      [0.014, 0],
      [0.01189, 0],
      [0.00258, 1],
      [-0.0001, 2],
      [-0.00344, 1],
      [0.01487, 0]
    ]
  },
  "QA_mulInjOrthesisType[ArmSling]": {
    "red_x_points": [
      [-0.00786, 2],
      [-0.00794, 2],
      [-0.00766, 2],
      [-0.00766, 2],
      [-0.00778, 2],
      [-0.00769, 2],
      [-0.00763, 2],
      [-0.00767, 2],
      [-0.00735, 2],
      [-0.00708, 2],
      [-0.00781, 2],
      [-0.00812, 2],
      [-0.00837, 2],
      [-0.00787, 2],
      [-0.02437, 0],
      [-0.00798, 2],
      [-0.00777, 2],
      [-0.02475, 0],
      [-0.02473, 3],
      [-0.0075, 2],
      [-0.00795, 2],
      [-0.00748, 2],
      [-0.00777, 2],
      [-0.00794, 2],
      [-0.02476, 3],
      [-0.02544, 3],
      [-0.02521, 3],
      [-0.00765, 2],
      [-0.0079, 2]
    ],
    "red_o_points": [],
    "y_categories": ["N", "NOT APPLICABLE", "Y", "nan"],
    "blue_o_points": [],
    "blue_x_points": [
      [-0.00719, 2],
      [-0.00769, 2],
      [-0.00752, 2],
      [-0.00736, 2],
      [0.0472, 1],
      [0.04799, 1],
      [0.04796, 1],
      [0.04717, 1],
      [-0.00732, 2],
      [0.04757, 1],
      [-0.00757, 2],
      [0.04665, 1],
      [0.04783, 1],
      [0.04721, 1],
      [-0.00721, 2]
    ]
  },
  "QS_mulGraftNerve[Ul]": {
    "red_x_points": [
      [-2e-5, 2],
      [-2e-5, 0],
      [-2e-5, 0],
      [-2e-5, 0],
      [-2e-5, 0],
      [-2e-5, 0],
      [-2e-5, 2],
      [-2e-5, 0],
      [-2e-5, 2],
      [-2e-5, 2]
    ],
    "red_o_points": [],
    "y_categories": ["N", "NOT APPLICABLE", "nan"],
    "blue_o_points": [],
    "blue_x_points": [[0.00018, 1]]
  },
  "QA_mulInjOrthesisType[ShoulderSupport]": {
    "red_x_points": [
      [-0.0076, 0],
      [-0.00715, 0],
      [-0.00692, 0],
      [-0.02667, 2],
      [-0.00676, 0],
      [-0.00728, 0],
      [-0.00696, 0],
      [-0.02765, 2],
      [-0.00708, 0],
      [-0.00711, 0],
      [-0.00708, 0],
      [-0.00718, 0],
      [-0.00722, 0],
      [-0.0069, 0],
      [-0.02624, 2],
      [-0.00734, 0],
      [-0.00735, 0],
      [-0.02706, 2],
      [-0.02511, 3],
      [-0.00712, 0],
      [-0.00689, 0],
      [-0.00705, 0],
      [-0.00711, 0],
      [-0.00747, 0],
      [-0.02664, 3],
      [-0.02576, 3],
      [-0.02695, 3],
      [-0.00715, 0],
      [-0.00721, 0]
    ],
    "red_o_points": [],
    "y_categories": ["N", "NOT APPLICABLE", "Y", "nan"],
    "blue_o_points": [],
    "blue_x_points": [
      [-0.00733, 0],
      [-0.00675, 0],
      [-0.00682, 0],
      [-0.0068, 0],
      [0.05361, 1],
      [0.0508, 1],
      [0.04967, 1],
      [0.05138, 1],
      [-0.0065, 0],
      [0.05071, 1],
      [-0.00666, 0],
      [0.0506, 1],
      [0.05305, 1],
      [0.04984, 1],
      [-0.00679, 0]
    ]
  },
  "QA_yonInjUnconscio": {
    "red_x_points": [
      [-0.01504, 1],
      [-0.01494, 1],
      [-0.00225, 2],
      [-0.00247, 2],
      [-0.00231, 2],
      [-0.01642, 1],
      [-0.00205, 2],
      [-0.00282, 2],
      [-0.00256, 2],
      [-0.01667, 1],
      [-0.01547, 1],
      [-0.01662, 1],
      [-0.0038, 2],
      [-0.00262, 2],
      [-0.01173, 1],
      [-0.01526, 1],
      [-0.01575, 1],
      [-0.0124, 1],
      [-0.01313, 1],
      [-0.015, 1],
      [-0.00345, 2],
      [-0.00232, 2],
      [-0.01655, 1],
      [-0.01637, 1],
      [-0.00304, 2],
      [-0.00302, 2],
      [-0.00284, 2],
      [-0.01493, 1],
      [-0.00383, 2]
    ],
    "red_o_points": [],
    "y_categories": ["N", "Y", "nan"],
    "blue_o_points": [],
    "blue_x_points": [
      [-0.0018, 2],
      [-0.00168, 2],
      [0.05543, 0],
      [-0.00094, 2],
      [-0.00886, 1],
      [-0.00955, 1],
      [0.03995, 0],
      [0.05044, 0],
      [-0.00146, 2],
      [0.04752, 0],
      [0.05426, 0],
      [-0.00222, 2],
      [-0.0104, 1],
      [-0.0021, 2],
      [0.05707, 0]
    ]
  },
  "QS_mulGraftNerve[MCA]": {
    "red_x_points": [
      [2e-5, 2],
      [-5e-5, 0],
      [2e-5, 2],
      [-5e-5, 0],
      [2e-5, 2],
      [-5e-5, 0],
      [2e-5, 2],
      [-5e-5, 0],
      [-5e-5, 0]
    ],
    "red_o_points": [],
    "y_categories": ["N", "NOT APPLICABLE", "nan"],
    "blue_o_points": [],
    "blue_x_points": [[0.00015, 1], [2e-5, 2], [2e-5, 2]]
  },
  "QA_lstPexInspectio[SurgicalScar]": {
    "red_x_points": [
      [-0.0042, 1],
      [-0.0047, 1],
      [-0.00744, 0],
      [-0.00446, 1],
      [-0.00738, 1],
      [-0.01145, 0],
      [-0.00661, 1],
      [-0.0034, 1],
      [-0.01037, 1],
      [-0.00963, 1],
      [-0.00931, 0],
      [-0.00844, 1],
      [-0.0015, 2],
      [-0.00907, 1],
      [-0.00443, 0],
      [0.00712, 2],
      [0.00511, 2],
      [-0.00773, 1],
      [-0.00424, 1],
      [-0.00495, 1],
      [-0.00258, 2],
      [-0.00346, 1],
      [-0.00835, 1],
      [0.014, 2],
      [-0.00305, 1],
      [-0.00308, 1],
      [-0.00274, 1],
      [0.005, 2],
      [-0.00357, 1]
    ],
    "red_o_points": [],
    "y_categories": ["ABS", "NAIA", "PT", "nan"],
    "blue_o_points": [],
    "blue_x_points": [
      [-0.00054, 1],
      [0.01151, 2],
      [0.02453, 2],
      [0.03059, 2],
      [0.00194, 1],
      [0.00031, 1],
      [0.00132, 0],
      [-0.00515, 1],
      [0.00101, 1],
      [0.00258, 1],
      [0.02288, 2],
      [-0.00072, 1],
      [0.00951, 2],
      [0.00287, 0],
      [0.01228, 2]
    ]
  },
  "QA_intPexWristFlex": {
    "red_x_points": [
      [-0.00034, 2],
      [-0.00067, 2],
      [-0.00047, 2],
      [-0.00038, 2],
      [-0.00077, 2],
      [-0.001, 0],
      [-0.00078, 2],
      [0.00073, 0],
      [-0.00091, 2],
      [-0.00088, 2],
      [-0.00018, 0],
      [-0.00096, 2],
      [-0.0004, 2],
      [-0.00084, 2],
      [-0.00027, 2],
      [-0.00013, 0],
      [-1e-5, 0],
      [-0.00027, 0],
      [-0.00011, 0],
      [-0.00027, 2],
      [-9e-5, 2],
      [-0.00033, 2],
      [-0.00089, 2],
      [-0.00056, 2],
      [-0.00025, 2],
      [-0.02321, 1],
      [-0.00339, 1],
      [-0.00042, 0],
      [-0.00027, 2]
    ],
    "red_o_points": [],
    "y_categories": ["GREATER THAN OR EQUALS TO 60", "LESS THAN 60", "nan"],
    "blue_o_points": [],
    "blue_x_points": [
      [0.00417, 2],
      [0.00321, 0],
      [0.00085, 0],
      [-0.0007, 2],
      [-0.00014, 2],
      [0.00441, 2],
      [0.00565, 0],
      [-0.00054, 2],
      [1e-5, 2],
      [0.00014, 2],
      [0.01105, 1],
      [0.00392, 2],
      [0.0003, 2],
      [0.00453, 2],
      [0.00147, 0]
    ]
  },
  "QS_mulGraftNerve[Me]": {
    "red_x_points": [
      [0.0, 2],
      [-5e-5, 0],
      [-5e-5, 0],
      [-4e-5, 0],
      [-5e-5, 0],
      [-5e-5, 0],
      [-5e-5, 0],
      [-2e-5, 0],
      [-4e-5, 0],
      [1e-5, 2],
      [-5e-5, 0],
      [1e-5, 2],
      [-5e-5, 0],
      [1e-5, 2],
      [1e-5, 2],
      [0.0, 2],
      [1e-5, 2],
      [1e-5, 2],
      [0.0, 2],
      [-2e-5, 0],
      [-4e-5, 0],
      [0.0, 2],
      [9e-5, 1],
      [0.0, 2],
      [-5e-5, 0],
      [1e-5, 2]
    ],
    "red_o_points": [],
    "y_categories": ["N", "NOT APPLICABLE", "nan"],
    "blue_o_points": [],
    "blue_x_points": [
      [0.00015, 1],
      [1e-5, 2],
      [-4e-5, 0],
      [-2e-5, 0],
      [0.0, 2],
      [9e-5, 1],
      [9e-5, 1],
      [1e-5, 2],
      [0.0, 2],
      [-5e-5, 0],
      [9e-5, 1],
      [0.0, 2],
      [9e-5, 1],
      [1e-5, 2]
    ]
  },
  "QS_mulBpsurgeryType[Lysis]": {
    "red_x_points": [
      [-0.00094, 3],
      [-0.00559, 0],
      [-0.01752, 2],
      [-0.01726, 2],
      [-0.00365, 0],
      [-0.01797, 2],
      [-0.00386, 0],
      [-0.0017, 3],
      [-0.0035, 0],
      [-0.00319, 0],
      [-0.00127, 3],
      [-0.00351, 0],
      [-0.0018, 3],
      [-0.00514, 0],
      [-0.01711, 2],
      [-0.00104, 3],
      [-0.00098, 3],
      [-0.00106, 3],
      [-0.00309, 0],
      [-0.00092, 3],
      [-0.00155, 3],
      [-0.00153, 3],
      [-0.00336, 0],
      [-0.00359, 0],
      [-0.0016, 3],
      [0.02082, 1],
      [-0.00153, 3],
      [-0.01634, 2],
      [-0.00179, 3]
    ],
    "red_o_points": [],
    "y_categories": ["N", "NOT APPLICABLE", "Y", "nan"],
    "blue_o_points": [],
    "blue_x_points": [
      [0.03418, 1],
      [-0.00098, 3],
      [-0.00105, 0],
      [-0.00107, 0],
      [-0.00023, 3],
      [0.02729, 1],
      [0.0207, 1],
      [-0.00178, 0],
      [-0.00055, 3],
      [-0.00058, 3],
      [-0.00112, 0],
      [0.02451, 1],
      [-0.00059, 3],
      [0.02373, 1],
      [-0.00088, 3]
    ]
  },
  "QS_mulLysisSite[Trunk]": {
    "red_x_points": [
      [-0.00048, 3],
      [-0.00429, 0],
      [-0.00343, 0],
      [-0.00283, 0],
      [-0.00307, 0],
      [-0.0108, 2],
      [-0.00335, 0],
      [-0.00072, 3],
      [-0.00283, 0],
      [-0.00288, 0],
      [-0.00084, 3],
      [-0.00312, 0],
      [-0.00088, 3],
      [-0.00439, 0],
      [-0.01028, 2],
      [-0.00098, 3],
      [-0.00065, 3],
      [-0.00085, 3],
      [-0.00265, 0],
      [-0.00066, 3],
      [-0.00087, 3],
      [-0.0008, 3],
      [-0.00341, 0],
      [-0.003, 0],
      [-0.00098, 3],
      [0.01126, 1],
      [-0.0008, 3],
      [-0.01027, 2],
      [-0.00079, 3]
    ],
    "red_o_points": [],
    "y_categories": ["N", "NOT APPLICABLE", "Y", "nan"],
    "blue_o_points": [],
    "blue_x_points": [
      [0.02042, 1],
      [-0.0005, 3],
      [-0.00086, 0],
      [-0.00097, 0],
      [6e-5, 3],
      [0.01679, 1],
      [0.01217, 1],
      [-0.00129, 0],
      [-0.00049, 3],
      [-0.0001, 3],
      [-0.00159, 0],
      [0.01345, 1],
      [-0.00036, 3],
      [0.01358, 1],
      [-0.00065, 3]
    ]
  },
  "QS_mulGraftTrunk[UpperTrunk]": {
    "red_x_points": [
      [-0.0002, 3],
      [-0.00205, 0],
      [-0.00153, 0],
      [-0.00141, 0],
      [-0.0016, 0],
      [-0.00132, 0],
      [-0.00157, 0],
      [-0.00037, 3],
      [-0.00137, 0],
      [-0.00136, 0],
      [-0.00026, 3],
      [-0.00168, 0],
      [-0.00066, 3],
      [-0.00808, 2],
      [-0.00205, 0],
      [-0.00032, 3],
      [-6e-5, 3],
      [-0.00017, 3],
      [-0.00141, 0],
      [-0.00022, 3],
      [-0.00055, 3],
      [-0.00056, 3],
      [-0.00164, 0],
      [-0.00175, 0],
      [-0.0006, 3],
      [0.00515, 1],
      [-0.00032, 3],
      [-0.00132, 0],
      [-0.00069, 3]
    ],
    "red_o_points": [],
    "y_categories": ["N", "NOT APPLICABLE", "Y", "nan"],
    "blue_o_points": [],
    "blue_x_points": [
      [0.00936, 1],
      [-0.00022, 3],
      [-0.00045, 0],
      [-1e-5, 0],
      [0.00021, 3],
      [0.00674, 1],
      [0.00417, 1],
      [-0.00033, 0],
      [-0.00023, 3],
      [-6e-5, 3],
      [-0.00047, 0],
      [0.00592, 1],
      [-8e-5, 3],
      [0.00561, 1],
      [-0.0002, 3]
    ]
  },
  "QS_mulTransfSite[PhMc]": {
    "red_x_points": [
      [-0.0002, 3],
      [-0.00318, 0],
      [-0.00226, 0],
      [-0.00171, 0],
      [-0.0023, 0],
      [-0.00147, 0],
      [-0.00698, 2],
      [-0.00046, 3],
      [-0.00236, 0],
      [-0.0016, 0],
      [-0.00034, 3],
      [-0.00249, 0],
      [-0.00044, 3],
      [-0.00327, 0],
      [-0.00291, 0],
      [-0.00029, 3],
      [-0.00026, 3],
      [-0.00033, 3],
      [-0.0073, 2],
      [-0.00031, 3],
      [-0.00055, 3],
      [-0.00062, 3],
      [-0.00256, 0],
      [-0.00231, 0],
      [-0.00051, 3],
      [0.00588, 1],
      [-0.0006, 3],
      [-0.00167, 0],
      [-0.0004, 3]
    ],
    "red_o_points": [],
    "y_categories": ["N", "NOT APPLICABLE", "Y", "nan"],
    "blue_o_points": [],
    "blue_x_points": [
      [0.01305, 1],
      [-0.00023, 3],
      [-0.00061, 0],
      [-0.00107, 0],
      [0.0, 3],
      [0.01002, 1],
      [0.00697, 1],
      [-0.00174, 0],
      [-0.00025, 3],
      [-0.0002, 3],
      [-0.0005, 0],
      [0.00862, 1],
      [-0.00016, 3],
      [0.01017, 1],
      [-0.00029, 3]
    ]
  },
  "QS_mulLysisSite[Root]": {
    "red_x_points": [
      [-0.0002, 3],
      [-0.00203, 0],
      [-0.00601, 2],
      [-0.00151, 0],
      [-0.00169, 0],
      [-0.00127, 0],
      [-0.00181, 0],
      [-0.00038, 3],
      [-0.00191, 0],
      [-0.00124, 0],
      [-0.0004, 3],
      [-0.00166, 0],
      [-0.00032, 3],
      [-0.00218, 0],
      [-0.00192, 0],
      [-0.00044, 3],
      [-0.00042, 3],
      [-0.00037, 3],
      [-0.00128, 0],
      [-0.0003, 3],
      [-0.00045, 3],
      [-0.00033, 3],
      [-0.0016, 0],
      [-0.00166, 0],
      [-0.00034, 3],
      [0.00537, 1],
      [-0.00033, 3],
      [-0.00523, 2],
      [-0.00023, 3]
    ],
    "red_o_points": [],
    "y_categories": ["N", "NOT APPLICABLE", "Y", "nan"],
    "blue_o_points": [],
    "blue_x_points": [
      [0.00934, 1],
      [-0.0002, 3],
      [-0.00065, 0],
      [-0.00095, 0],
      [-0.00011, 3],
      [0.00734, 1],
      [0.00495, 1],
      [-0.00115, 0],
      [1e-5, 3],
      [-9e-5, 3],
      [-0.00028, 0],
      [0.00705, 1],
      [-0.00032, 3],
      [0.00748, 1],
      [-0.00033, 3]
    ]
  },
  "QA_lstPexInspectio[ShoulderSubdisloc]": {
    "red_x_points": [
      [-0.00389, 1],
      [-0.00425, 1],
      [0.00248, 0],
      [-0.0031, 1],
      [-0.00565, 1],
      [-0.00288, 2],
      [-0.00479, 1],
      [-0.00292, 1],
      [-0.00833, 1],
      [-0.0077, 1],
      [-0.00121, 2],
      [-0.00651, 1],
      [-0.00214, 1],
      [-0.00788, 1],
      [-0.00235, 1],
      [-0.00415, 2],
      [-0.00078, 2],
      [1e-5, 1],
      [-0.00385, 1],
      [-0.0015, 1],
      [-0.01233, 0],
      [0.00379, 2],
      [-0.00162, 2],
      [-0.00051, 2],
      [-0.00205, 1],
      [-0.01279, 2],
      [-0.00243, 1],
      [-0.0009, 2],
      [-0.00371, 1]
    ],
    "red_o_points": [],
    "y_categories": ["ABS", "NAIA", "PT", "nan"],
    "blue_o_points": [],
    "blue_x_points": [
      [0.00431, 1],
      [0.00986, 2],
      [0.0303, 0],
      [0.0063, 2],
      [0.00107, 1],
      [0.00462, 1],
      [0.00459, 0],
      [-0.00279, 1],
      [0.0143, 2],
      [0.00055, 1],
      [0.0266, 0],
      [0.00273, 1],
      [0.00199, 1],
      [-0.00198, 2],
      [0.00152, 1]
    ]
  },
  "QS_mulGraftLevel[Trunk]": {
    "red_x_points": [
      [-0.00019, 3],
      [-0.00181, 0],
      [-0.00135, 0],
      [-0.00111, 0],
      [-0.00141, 0],
      [-0.00106, 0],
      [-0.00137, 0],
      [-0.00024, 3],
      [-0.00129, 0],
      [-0.0012, 0],
      [-0.00019, 3],
      [-0.00136, 0],
      [-0.00048, 3],
      [-0.00788, 2],
      [-0.00189, 0],
      [-0.00026, 3],
      [-0.00018, 3],
      [-0.00017, 3],
      [-0.00084, 0],
      [-0.0002, 3],
      [-0.0004, 3],
      [-0.00035, 3],
      [-0.00125, 0],
      [-0.00125, 0],
      [-0.00035, 3],
      [0.00338, 1],
      [-0.00029, 3],
      [-0.0011, 0],
      [-0.00039, 3]
    ],
    "red_o_points": [],
    "y_categories": ["N", "NOT APPLICABLE", "Y", "nan"],
    "blue_o_points": [],
    "blue_x_points": [
      [0.00887, 1],
      [-0.00011, 3],
      [-0.00026, 0],
      [0.00011, 0],
      [1e-5, 3],
      [0.00602, 1],
      [0.00387, 1],
      [-0.00052, 0],
      [-0.00016, 3],
      [-0.00011, 3],
      [-0.00018, 0],
      [0.005, 1],
      [-0.00017, 3],
      [0.00424, 1],
      [-0.00014, 3]
    ]
  },
  "QA_lstPexPain[C7]": {
    "red_x_points": [
      [-0.00127, 1],
      [-0.00352, 2],
      [-0.00264, 2],
      [-0.00118, 1],
      [-0.00454, 2],
      [-0.00297, 1],
      [-0.0024, 1],
      [-0.00573, 0],
      [-0.00498, 1],
      [0.00686, 0],
      [-0.00128, 1],
      [-0.00673, 2],
      [0.00193, 2],
      [-0.00569, 2],
      [-0.0017, 2],
      [-0.00622, 0],
      [-0.00068, 1],
      [-0.005, 0],
      [-0.00391, 2],
      [-0.00573, 0],
      [0.00172, 2],
      [0.00127, 2],
      [-0.00769, 2],
      [-0.00638, 2],
      [-0.00341, 0],
      [-0.00217, 1],
      [-0.00132, 1],
      [-0.00143, 1],
      [-0.00087, 1]
    ],
    "red_o_points": [],
    "y_categories": ["NORM", "NPV", "nan"],
    "blue_o_points": [],
    "blue_x_points": [
      [-5e-5, 1],
      [0.00564, 1],
      [0.01528, 0],
      [0.01896, 0],
      [0.00496, 2],
      [0.00019, 2],
      [0.00181, 1],
      [0.00603, 2],
      [0.0052, 2],
      [0.01294, 0],
      [-0.0, 1],
      [-0.00173, 0],
      [0.0022, 0],
      [0.00622, 1]
    ]
  },
  "QS_mulTransfSite[AcSsAA]": {
    "red_x_points": [
      [-0.0002, 3],
      [-0.00177, 2],
      [-0.00553, 0],
      [-0.00532, 0],
      [-0.00019, 2],
      [-0.00537, 0],
      [-0.00557, 0],
      [-0.00075, 3],
      [-0.00778, 0],
      [-0.00656, 0],
      [-0.00034, 3],
      [-0.00514, 0],
      [-0.00081, 3],
      [-0.00076, 2],
      [-0.0034, 0],
      [-0.00063, 3],
      [-0.00012, 3],
      [-0.00067, 3],
      [-0.00073, 2],
      [-0.00034, 3],
      [-0.0009, 3],
      [-0.00063, 3],
      [-0.00512, 0],
      [-0.00024, 2],
      [-0.00082, 3],
      [0.00773, 1],
      [-0.00086, 3],
      [-0.00335, 0],
      [-0.00091, 3]
    ],
    "red_o_points": [],
    "y_categories": ["N", "NOT APPLICABLE", "Y", "nan"],
    "blue_o_points": [],
    "blue_x_points": [
      [0.01588, 1],
      [-0.00047, 3],
      [0.00616, 2],
      [0.00853, 2],
      [-4e-5, 3],
      [0.0087, 1],
      [0.00578, 1],
      [-0.00215, 0],
      [-0.00024, 3],
      [-0.00016, 3],
      [-0.00295, 0],
      [0.0098, 1],
      [-0.00028, 3],
      [0.00877, 1],
      [-0.00023, 3]
    ]
  },
  "QS_mulLysisSite[Nerve]": {
    "red_x_points": [
      [-0.00049, 3],
      [-0.00318, 0],
      [-0.00802, 2],
      [-0.00696, 2],
      [-0.00205, 0],
      [-0.00184, 0],
      [-0.00223, 0],
      [-0.00055, 3],
      [-0.00247, 0],
      [-0.00185, 0],
      [-0.00057, 3],
      [-0.00193, 0],
      [-0.00077, 3],
      [-0.00327, 0],
      [-0.00269, 0],
      [-0.00058, 3],
      [-0.00036, 3],
      [-0.00048, 3],
      [-0.00174, 0],
      [-0.00053, 3],
      [-0.00055, 3],
      [-0.00055, 3],
      [-0.00201, 0],
      [-0.00208, 0],
      [-0.00052, 3],
      [0.00731, 1],
      [-0.00056, 3],
      [-0.00165, 0],
      [-0.00064, 3]
    ],
    "red_o_points": [],
    "y_categories": ["N", "NOT APPLICABLE", "Y", "nan"],
    "blue_o_points": [],
    "blue_x_points": [
      [0.01564, 1],
      [-0.00031, 3],
      [-0.00083, 0],
      [-0.00162, 0],
      [-4e-5, 3],
      [0.0089, 1],
      [0.00771, 1],
      [-0.00133, 0],
      [-0.00028, 3],
      [1e-5, 3],
      [-0.00109, 0],
      [0.00886, 1],
      [-0.00026, 3],
      [0.00861, 1],
      [-0.00018, 3]
    ]
  },
  "QS_mulGraftNerve[Ax]": {
    "red_x_points": [
      [1e-5, 2],
      [-8e-5, 0],
      [-0.00013, 0],
      [-0.0001, 0],
      [-0.00013, 0],
      [-8e-5, 0],
      [-0.00013, 0],
      [2e-5, 2],
      [-0.00013, 0],
      [-4e-5, 0],
      [3e-5, 2],
      [-8e-5, 0],
      [4e-5, 2],
      [-0.00013, 0],
      [3e-5, 2],
      [4e-5, 2],
      [-8e-5, 0],
      [4e-5, 2],
      [1e-5, 2],
      [2e-5, 2],
      [-8e-5, 0],
      [-8e-5, 0],
      [2e-5, 2],
      [0.00017, 1],
      [2e-5, 2],
      [-8e-5, 0],
      [1e-5, 2]
    ],
    "red_o_points": [],
    "y_categories": ["N", "NOT APPLICABLE", "nan"],
    "blue_o_points": [],
    "blue_x_points": [
      [0.0003, 1],
      [4e-5, 2],
      [-4e-5, 0],
      [-8e-5, 0],
      [4e-5, 2],
      [0.00025, 1],
      [4e-5, 2],
      [1e-5, 2],
      [0.00017, 1],
      [4e-5, 2],
      [9e-5, 1],
      [1e-5, 2]
    ]
  },
  "QS_mulNeuromadSite[C5]": {
    "red_x_points": [
      [-6e-5, 2],
      [-0.00073, 0],
      [-0.00054, 0],
      [-0.00058, 0],
      [-0.00071, 0],
      [-0.00045, 0],
      [-0.00054, 0],
      [-0.0001, 2],
      [-0.00062, 0],
      [-0.00057, 0],
      [-1e-5, 2],
      [-0.00072, 0],
      [-0.00021, 2],
      [-0.00089, 0],
      [-0.00078, 0],
      [-5e-5, 2],
      [3e-5, 2],
      [-3e-5, 2],
      [-0.00057, 0],
      [-0.0001, 2],
      [-0.00024, 2],
      [-0.00019, 2],
      [-0.00067, 0],
      [-0.00059, 0],
      [-0.00014, 2],
      [0.00141, 1],
      [-0.0001, 2],
      [-0.00044, 0],
      [-0.00024, 2]
    ],
    "red_o_points": [],
    "y_categories": ["N", "NOT APPLICABLE", "nan"],
    "blue_o_points": [],
    "blue_x_points": [
      [0.00332, 1],
      [-5e-5, 2],
      [-0.00024, 0],
      [-0.0003, 0],
      [3e-5, 2],
      [0.00304, 1],
      [0.00092, 1],
      [-0.00052, 0],
      [-8e-5, 2],
      [-6e-5, 2],
      [-5e-5, 0],
      [0.00196, 1],
      [-2e-5, 2],
      [0.00159, 1],
      [-0.0001, 2]
    ]
  },
  "QS_mulNeuromadSite[C7]": {
    "red_x_points": [
      [4e-5, 2],
      [-0.00036, 0],
      [-0.00019, 0],
      [-9e-5, 0],
      [-0.00022, 0],
      [-0.00011, 0],
      [-0.00023, 0],
      [-0.0, 2],
      [-0.00017, 0],
      [-0.00018, 0],
      [2e-5, 2],
      [-0.00035, 0],
      [-3e-5, 2],
      [-0.00017, 0],
      [-0.00015, 0],
      [2e-5, 2],
      [2e-5, 2],
      [-0.0, 2],
      [-0.00017, 0],
      [1e-5, 2],
      [2e-5, 2],
      [1e-5, 2],
      [-0.00023, 0],
      [-0.00019, 0],
      [-0.00013, 2],
      [0.00034, 1],
      [-1e-5, 2],
      [-0.00011, 0],
      [2e-5, 2]
    ],
    "red_o_points": [],
    "y_categories": ["N", "NOT APPLICABLE", "nan"],
    "blue_o_points": [],
    "blue_x_points": [
      [0.00109, 1],
      [4e-5, 2],
      [-7e-5, 0],
      [-4e-5, 0],
      [-0.0, 2],
      [0.00077, 1],
      [9e-5, 1],
      [-7e-5, 0],
      [3e-5, 2],
      [-1e-5, 2],
      [-9e-5, 0],
      [0.0005, 1],
      [-1e-5, 2],
      [0.00034, 1],
      [2e-5, 2]
    ]
  },
  "QA_lstPexMuscstrength[WristExte]": {
    "red_x_points": [
      [-0.00482, 1],
      [-0.00345, 2],
      [-0.00385, 1],
      [-0.0044, 1],
      [-0.00584, 1],
      [-0.00465, 1],
      [-0.00513, 1],
      [-0.00038, 0],
      [0.00593, 0],
      [-0.00802, 1],
      [0.0007, 0],
      [0.00511, 0],
      [-0.00301, 2],
      [-0.00605, 2],
      [-0.00227, 2],
      [-0.00106, 0],
      [-0.00197, 1],
      [-0.00071, 0],
      [-0.00445, 1],
      [-0.00595, 1],
      [-0.00233, 2],
      [-0.00608, 1],
      [0.00477, 0],
      [0.0049, 0],
      [-0.00162, 2],
      [-0.00112, 2],
      [-0.00409, 1],
      [-0.00287, 1],
      [-0.00336, 2]
    ],
    "red_o_points": [],
    "y_categories": ["GREATER THAN OR EQUALS TO 3", "LESS THAN 3", "nan"],
    "blue_o_points": [],
    "blue_x_points": [
      [0.00293, 0],
      [0.00314, 1],
      [0.00832, 0],
      [0.00907, 0],
      [0.00131, 2],
      [-0.00023, 2],
      [0.00094, 0],
      [0.00733, 0],
      [0.01475, 0],
      [0.00107, 2],
      [0.00638, 0],
      [-0.00014, 1],
      [0.00556, 0],
      [0.00206, 0],
      [0.00359, 1]
    ]
  },
  "QS_mulTransfSite[IMc]": {
    "red_x_points": [
      [-0.00102, 3],
      [-0.01765, 2],
      [-0.00304, 0],
      [-0.01445, 2],
      [-0.00319, 0],
      [-0.00316, 0],
      [-0.00309, 0],
      [-0.00143, 3],
      [-0.00306, 0],
      [-0.00276, 0],
      [-0.00082, 3],
      [-0.00315, 0],
      [-0.00163, 3],
      [-0.00465, 0],
      [-0.01554, 2],
      [-0.00118, 3],
      [-0.00079, 3],
      [-0.00084, 3],
      [-0.00288, 0],
      [-0.0009, 3],
      [-0.00139, 3],
      [-0.00152, 3],
      [-0.00315, 0],
      [-0.01815, 2],
      [-0.00169, 3],
      [0.01877, 1],
      [-0.00129, 3],
      [-0.01562, 2],
      [-0.00131, 3]
    ],
    "red_o_points": [],
    "y_categories": ["N", "NOT APPLICABLE", "Y", "nan"],
    "blue_o_points": [],
    "blue_x_points": [
      [0.0314, 1],
      [-0.00067, 3],
      [-0.00037, 0],
      [-0.00039, 0],
      [1e-5, 3],
      [0.02628, 1],
      [0.01729, 1],
      [-0.00183, 0],
      [-0.00073, 3],
      [-0.00031, 3],
      [-0.00031, 0],
      [0.01985, 1],
      [-0.00052, 3],
      [0.02165, 1],
      [-0.00073, 3]
    ]
  },
  "QA_intPexForearmSupin": {
    "red_x_points": [
      [-0.00083, 2],
      [-0.00413, 0],
      [-0.00071, 2],
      [-0.00053, 2],
      [-0.00104, 2],
      [0.00377, 1],
      [-0.00088, 2],
      [0.0028, 1],
      [-0.00135, 2],
      [-0.00143, 2],
      [-0.0076, 0],
      [-0.0076, 0],
      [-0.00066, 2],
      [-0.00155, 2],
      [-0.00044, 2],
      [0.00421, 1],
      [-0.00794, 0],
      [0.00096, 1],
      [0.00192, 1],
      [-0.00073, 2],
      [-0.00054, 2],
      [-0.00068, 2],
      [-0.00185, 2],
      [-0.00154, 2],
      [9e-5, 2],
      [-0.0174, 1],
      [-3e-5, 2],
      [-0.00349, 0],
      [-0.00075, 2]
    ],
    "red_o_points": [],
    "y_categories": ["GREATER THAN OR EQUALS TO 80", "LESS THAN 80", "nan"],
    "blue_o_points": [],
    "blue_x_points": [
      [0.00306, 2],
      [0.00647, 1],
      [0.01076, 1],
      [-0.00139, 2],
      [0.00029, 2],
      [0.00296, 2],
      [0.00439, 0],
      [-0.0006, 2],
      [-0.00029, 2],
      [0.00019, 2],
      [0.00981, 1],
      [0.00343, 2],
      [0.00039, 2],
      [0.0036, 2],
      [0.00683, 1]
    ]
  },
  "QS_mulGraftNerve[SS]": {
    "red_x_points": [
      [-1e-5, 2],
      [-4e-5, 0],
      [-3e-5, 0],
      [-6e-5, 0],
      [-6e-5, 0],
      [-4e-5, 0],
      [-3e-5, 0],
      [-0.0001, 0],
      [-4e-5, 0],
      [-4e-5, 0],
      [-4e-5, 0],
      [2e-5, 2],
      [-1e-5, 2],
      [2e-5, 2],
      [-4e-5, 0],
      [-1e-5, 2],
      [-3e-5, 2],
      [-4e-5, 0],
      [-3e-5, 2],
      [-7e-5, 0]
    ],
    "red_o_points": [],
    "y_categories": ["N", "NOT APPLICABLE", "nan"],
    "blue_o_points": [],
    "blue_x_points": [
      [0.00027, 1],
      [2e-5, 2],
      [0.00016, 1],
      [0.00017, 1],
      [2e-5, 2]
    ]
  },
  "QA_lstPexArthre[Index]": {
    "red_x_points": [
      [-0.01036, 0],
      [-0.00489, 2],
      [-0.00328, 2],
      [-0.00683, 0],
      [-0.00922, 0],
      [0.00825, 1],
      [-0.00872, 0],
      [0.00036, 2],
      [0.00933, 1],
      [-0.01255, 0],
      [0.0026, 1],
      [-0.00661, 2],
      [0.00015, 2],
      [0.00841, 1],
      [-0.00326, 2],
      [0.00346, 1],
      [-0.00898, 0],
      [0.00251, 1],
      [-0.00456, 2],
      [-0.01128, 0],
      [0.00034, 2],
      [0.00051, 2],
      [-0.00708, 2],
      [-0.00572, 2],
      [0.00242, 1],
      [-0.00059, 2],
      [0.00034, 2],
      [-0.00634, 0],
      [0.0004, 2]
    ],
    "red_o_points": [],
    "y_categories": ["NPV", "PV", "nan"],
    "blue_o_points": [],
    "blue_x_points": [
      [0.00053, 0],
      [0.00142, 2],
      [0.01288, 1],
      [0.01412, 1],
      [0.00188, 2],
      [-0.00028, 2],
      [0.00178, 1],
      [0.01255, 1],
      [0.00176, 2],
      [0.00145, 2],
      [0.01177, 1],
      [0.00195, 1],
      [0.00362, 1],
      [-0.00022, 2],
      [0.00598, 1]
    ]
  },
  "QS_mulLysisRoot[C7]": {
    "red_x_points": [
      [-0.00017, 3],
      [-0.00079, 0],
      [-0.00321, 2],
      [-0.0007, 0],
      [-0.00077, 0],
      [-0.0006, 0],
      [-0.00085, 0],
      [-0.00022, 3],
      [-0.00074, 0],
      [-0.00068, 0],
      [-0.00021, 3],
      [-0.00054, 0],
      [-0.0003, 3],
      [-0.00074, 0],
      [-0.00077, 0],
      [-0.00017, 3],
      [-0.00015, 3],
      [-0.00013, 3],
      [-0.00066, 0],
      [-0.00017, 3],
      [-0.00027, 3],
      [-0.0002, 3],
      [-0.00068, 0],
      [-0.00065, 0],
      [-0.00015, 3],
      [0.00215, 1],
      [-0.00014, 3],
      [-0.00062, 0],
      [-0.00018, 3]
    ],
    "red_o_points": [],
    "y_categories": ["N", "NOT APPLICABLE", "Y", "nan"],
    "blue_o_points": [],
    "blue_x_points": [
      [0.00453, 1],
      [-0.0001, 3],
      [-0.00022, 0],
      [-0.00036, 0],
      [-0.00012, 3],
      [0.00265, 1],
      [0.00241, 1],
      [-0.0005, 0],
      [-0.00014, 3],
      [-5e-5, 3],
      [-8e-5, 0],
      [0.00293, 1],
      [-8e-5, 3],
      [0.00255, 1],
      [-0.00013, 3]
    ]
  },
  "QS_lstBpsurgSide": {
    "red_x_points": [
      [-0.00117, 3],
      [-0.01183, 0],
      [-0.0118, 0],
      [-0.01087, 0],
      [-0.01164, 0],
      [-0.01127, 0],
      [-0.01188, 0],
      [-0.00115, 3],
      [-0.01406, 0],
      [0.00146, 2],
      [-0.00082, 3],
      [-0.00011, 2],
      [-0.00136, 3],
      [-0.0006, 2],
      [-0.00237, 2],
      [-0.00102, 3],
      [-0.0008, 3],
      [-0.00098, 3],
      [-0.00816, 0],
      [-0.0011, 3],
      [-0.00129, 3],
      [-0.00133, 3],
      [0.00072, 2],
      [0.00078, 2],
      [-0.0011, 3],
      [0.01492, 1],
      [-0.00119, 3],
      [-0.01104, 0],
      [-0.00125, 3]
    ],
    "red_o_points": [],
    "y_categories": ["L", "NOT APPLICABLE", "R", "nan"],
    "blue_o_points": [],
    "blue_x_points": [
      [0.02901, 1],
      [-0.00122, 3],
      [0.00487, 2],
      [0.00588, 2],
      [-0.00016, 3],
      [0.01757, 1],
      [0.01367, 1],
      [-0.00267, 0],
      [-0.00075, 3],
      [-0.00024, 3],
      [0.00388, 2],
      [0.01734, 1],
      [-0.00078, 3],
      [0.01655, 1],
      [-0.00062, 3]
    ]
  },
  "QS_mulLysisRoot[C6]": {
    "red_x_points": [
      [-0.00045, 3],
      [-0.0052, 0],
      [-0.01177, 2],
      [-0.00311, 0],
      [-0.0037, 0],
      [-0.00341, 0],
      [-0.0039, 0],
      [-0.00088, 3],
      [-0.00345, 0],
      [-0.0029, 0],
      [-0.00085, 3],
      [-0.00375, 0],
      [-0.00087, 3],
      [-0.00425, 0],
      [-0.00465, 0],
      [-0.00077, 3],
      [-0.00052, 3],
      [-0.00088, 3],
      [-0.00351, 0],
      [-0.00051, 3],
      [-0.00104, 3],
      [-0.00074, 3],
      [-0.00384, 0],
      [-0.00351, 0],
      [-0.001, 3],
      [0.01218, 1],
      [-0.00083, 3],
      [-0.0099, 2],
      [-0.00085, 3]
    ],
    "red_o_points": [],
    "y_categories": ["N", "NOT APPLICABLE", "Y", "nan"],
    "blue_o_points": [],
    "blue_x_points": [
      [0.02148, 1],
      [-0.00016, 3],
      [-0.00195, 0],
      [-0.00226, 0],
      [7e-5, 3],
      [0.01677, 1],
      [0.01288, 1],
      [-0.00196, 0],
      [-0.00044, 3],
      [-0.0003, 3],
      [-0.00173, 0],
      [0.01358, 1],
      [-0.00042, 3],
      [0.01385, 1],
      [-0.00057, 3]
    ]
  },
  "QS_mulTransfSite[AcMc]": {
    "red_x_points": [
      [-0.00012, 3],
      [-0.00144, 0],
      [-0.0012, 0],
      [-0.00083, 0],
      [-0.00117, 0],
      [-0.00069, 0],
      [-0.00111, 0],
      [-0.0002, 3],
      [-0.00109, 0],
      [-0.00991, 2],
      [-0.00022, 3],
      [-0.00104, 0],
      [-0.00021, 3],
      [-0.00141, 0],
      [-0.00142, 0],
      [-0.00048, 3],
      [-0.00024, 3],
      [-0.00037, 3],
      [-0.00107, 0],
      [-0.00035, 3],
      [-0.00018, 3],
      [-0.00029, 3],
      [-0.00122, 0],
      [-0.00121, 0],
      [-0.00027, 3],
      [0.00315, 1],
      [-0.00016, 3],
      [-0.00095, 0],
      [-0.00025, 3]
    ],
    "red_o_points": [],
    "y_categories": ["N", "NOT APPLICABLE", "Y", "nan"],
    "blue_o_points": [],
    "blue_x_points": [
      [0.00659, 1],
      [-8e-5, 3],
      [0.00205, 0],
      [0.00166, 0],
      [-1e-5, 3],
      [0.00418, 1],
      [0.00356, 1],
      [-0.00064, 0],
      [-3e-5, 3],
      [-2e-5, 3],
      [0.00111, 0],
      [0.00388, 1],
      [-0.00028, 3],
      [0.00427, 1],
      [-0.0003, 3]
    ]
  },
  "QS_mulTransfSite[Other]": {
    "red_x_points": [
      [-0.00138, 3],
      [-0.00984, 0],
      [-0.00816, 0],
      [-0.00761, 0],
      [-0.00835, 0],
      [-0.00813, 0],
      [-0.00797, 0],
      [-0.00143, 3],
      [-0.00904, 0],
      [-0.00829, 0],
      [-0.00126, 3],
      [-0.0085, 0],
      [-0.00178, 3],
      [-0.01013, 0],
      [-0.00809, 0],
      [-0.00132, 3],
      [-0.00126, 3],
      [-0.00095, 3],
      [-0.00758, 0],
      [-0.00107, 3],
      [-0.0016, 3],
      [-0.0013, 3],
      [-0.00828, 0],
      [-0.00828, 0],
      [-0.00137, 3],
      [0.01676, 1],
      [-0.00149, 3],
      [-0.00796, 0],
      [-0.00155, 3]
    ],
    "red_o_points": [],
    "y_categories": ["N", "NOT APPLICABLE", "Y", "nan"],
    "blue_o_points": [],
    "blue_x_points": [
      [0.02894, 1],
      [-0.0009, 3],
      [-0.00664, 0],
      [-0.00718, 0],
      [-0.00038, 3],
      [0.02378, 1],
      [0.01873, 1],
      [-0.00657, 0],
      [-0.00099, 3],
      [-0.00069, 3],
      [0.03927, 2],
      [0.02068, 1],
      [-0.0007, 3],
      [0.02056, 1],
      [-0.00071, 3]
    ]
  },
  "QA_yonInjBpsurg": {
    "red_x_points": [
      [-0.00055, 1],
      [-0.00053, 1],
      [-0.0004, 1],
      [-0.00065, 1],
      [-0.00068, 1],
      [-0.00029, 1],
      [-0.00077, 1],
      [-0.00068, 1],
      [-0.00067, 1],
      [-0.00035, 1],
      [-0.00036, 1],
      [-0.00036, 1],
      [-0.00088, 1],
      [-0.0009, 1],
      [-0.00025, 1],
      [-0.00049, 1],
      [-0.00042, 1],
      [-0.0005, 1],
      [-0.00025, 1],
      [-0.00051, 1],
      [-0.00086, 1],
      [-0.00066, 1],
      [-0.00041, 1],
      [-0.00049, 1],
      [-0.00067, 1],
      [0.00185, 0],
      [-0.00076, 1],
      [-0.00034, 1],
      [-0.00083, 1]
    ],
    "red_o_points": [],
    "y_categories": ["N", "Y", "nan"],
    "blue_o_points": [],
    "blue_x_points": [
      [0.00583, 0],
      [-0.00042, 1],
      [-0.00046, 1],
      [-0.00074, 1],
      [-0.00033, 1],
      [0.0025, 0],
      [0.00283, 0],
      [-0.00053, 1],
      [-0.00049, 1],
      [-0.00036, 1],
      [-0.00042, 1],
      [0.00383, 0],
      [-0.00036, 1],
      [0.00306, 0],
      [-0.00026, 1]
    ]
  },
  "QA_lstPexTouch[C8]": {
    "red_x_points": [
      [-0.00184, 1],
      [-0.00487, 2],
      [-0.00207, 1],
      [-0.00185, 1],
      [-0.00651, 2],
      [-0.00423, 1],
      [-0.00298, 1],
      [-0.0043, 0],
      [-0.00651, 1],
      [0.00852, 0],
      [-0.00262, 1],
      [-0.00874, 2],
      [-0.00243, 2],
      [-0.0087, 2],
      [-0.00243, 2],
      [-0.00123, 0],
      [-0.00146, 1],
      [-0.00259, 0],
      [-0.00388, 2],
      [-0.00126, 0],
      [-0.00231, 2],
      [-0.00544, 0],
      [-0.00513, 1],
      [-0.00847, 2],
      [-0.00378, 0],
      [-0.00905, 1],
      [-0.00138, 2],
      [-0.00144, 1],
      [5e-5, 1]
    ],
    "red_o_points": [],
    "y_categories": ["NORM", "NPV", "nan"],
    "blue_o_points": [],
    "blue_x_points": [
      [0.00663, 0],
      [0.00765, 1],
      [0.0182, 0],
      [0.02376, 0],
      [0.00513, 2],
      [0.00189, 2],
      [-0.00032, 1],
      [-0.00119, 1],
      [0.00929, 1],
      [0.00385, 2],
      [0.01645, 0],
      [-0.00038, 1],
      [-0.00042, 0],
      [0.00398, 0],
      [0.00441, 0]
    ]
  },
  "QA_lstPexPalle[Clavicle]": {
    "red_x_points": [
      [-0.00026, 3],
      [-0.00183, 3],
      [-0.00107, 3],
      [0.00175, 2],
      [-0.00235, 3],
      [0.00218, 2],
      [-0.00187, 3],
      [-6e-5, 3],
      [-0.00222, 3],
      [0.00352, 2],
      [-0.01489, 0],
      [-0.00294, 3],
      [-0.00043, 3],
      [-0.00269, 3],
      [-0.00097, 3],
      [-0.018, 0],
      [-0.01469, 0],
      [0.0118, 2],
      [-0.00414, 1],
      [-0.0184, 1],
      [-0.0002, 3],
      [-0.00026, 3],
      [-0.00272, 3],
      [-0.00312, 3],
      [-0.00027, 3],
      [-0.03033, 2],
      [-0.00013, 3],
      [-0.00168, 0],
      [-0.00031, 3]
    ],
    "red_o_points": [],
    "y_categories": ["HYPO", "NAIA", "PT", "nan"],
    "blue_o_points": [],
    "blue_x_points": [
      [0.00535, 3],
      [0.00124, 3],
      [0.00712, 2],
      [0.0086, 2],
      [0.00097, 3],
      [0.00553, 3],
      [0.00766, 0],
      [-0.00195, 3],
      [0.0007, 3],
      [0.00081, 3],
      [0.01111, 0],
      [0.0055, 3],
      [0.02115, 2],
      [0.00633, 3],
      [0.02647, 2]
    ]
  },
  "QS_mulBpsurgeryType[Graft]": {
    "red_x_points": [
      [-6e-5, 3],
      [-0.00064, 0],
      [-0.00054, 0],
      [-0.00064, 0],
      [-0.00061, 0],
      [-0.00047, 0],
      [-0.00068, 0],
      [-0.00024, 3],
      [-0.00052, 0],
      [-0.0005, 0],
      [-8e-5, 3],
      [-0.00059, 0],
      [-0.00021, 3],
      [-0.00538, 2],
      [-0.00052, 0],
      [-0.00018, 3],
      [-9e-5, 3],
      [-0.00018, 3],
      [-0.00052, 0],
      [-0.00015, 3],
      [-0.00031, 3],
      [-0.00027, 3],
      [-0.00064, 0],
      [-0.00054, 0],
      [-0.00039, 3],
      [0.00227, 1],
      [-0.00015, 3],
      [-0.00052, 0],
      [-0.00037, 3]
    ],
    "red_o_points": [],
    "y_categories": ["N", "NOT APPLICABLE", "Y", "nan"],
    "blue_o_points": [],
    "blue_x_points": [
      [0.00391, 1],
      [-0.00013, 3],
      [-2e-5, 0],
      [0.00078, 0],
      [-3e-5, 3],
      [0.00296, 1],
      [0.0021, 1],
      [-0.00014, 0],
      [-0.00017, 3],
      [-7e-5, 3],
      [-0.0001, 0],
      [0.00236, 1],
      [-0.0001, 3],
      [0.00251, 1],
      [-0.00013, 3]
    ]
  },
  "QS_mulLysisRoot[C5]": {
    "red_x_points": [
      [-0.00041, 3],
      [-0.00251, 0],
      [-0.00658, 2],
      [-0.00146, 0],
      [-0.00226, 0],
      [-0.00151, 0],
      [-0.00203, 0],
      [-0.00066, 3],
      [-0.00195, 0],
      [-0.0016, 0],
      [-0.0004, 3],
      [-0.00202, 0],
      [-0.00063, 3],
      [-0.00278, 0],
      [-0.00226, 0],
      [-0.00047, 3],
      [-0.00041, 3],
      [-0.00042, 3],
      [-0.00153, 0],
      [-0.0005, 3],
      [-0.00066, 3],
      [-0.00048, 3],
      [-0.00239, 0],
      [-0.00201, 0],
      [-0.00058, 3],
      [0.00606, 1],
      [-0.00047, 3],
      [-0.00596, 2],
      [-0.00071, 3]
    ],
    "red_o_points": [],
    "y_categories": ["N", "NOT APPLICABLE", "Y", "nan"],
    "blue_o_points": [],
    "blue_x_points": [
      [0.01326, 1],
      [-0.00028, 3],
      [-0.0004, 0],
      [-0.0011, 0],
      [-0.00014, 3],
      [0.00922, 1],
      [0.0065, 1],
      [-0.0014, 0],
      [-0.0002, 3],
      [-0.00034, 3],
      [-0.00039, 0],
      [0.00818, 1],
      [-0.00028, 3],
      [0.00736, 1],
      [-0.00037, 3]
    ]
  },
  "QS_mulNeuromadSite[C6]": {
    "red_x_points": [
      [-1e-5, 2],
      [-0.00042, 0],
      [-0.00039, 0],
      [-0.00035, 0],
      [-0.00025, 0],
      [-0.00023, 0],
      [-0.00033, 0],
      [-0.00014, 2],
      [-0.00026, 0],
      [-0.00024, 0],
      [-5e-5, 2],
      [-0.00034, 0],
      [-7e-5, 2],
      [-0.00059, 0],
      [-0.00041, 0],
      [-6e-5, 2],
      [-6e-5, 2],
      [-5e-5, 2],
      [-0.00022, 0],
      [-4e-5, 2],
      [-0.00013, 2],
      [-8e-5, 2],
      [-0.00026, 0],
      [-0.00036, 0],
      [-0.0001, 2],
      [0.00098, 1],
      [-0.00014, 2],
      [-0.00028, 0],
      [-0.00013, 2]
    ],
    "red_o_points": [],
    "y_categories": ["N", "NOT APPLICABLE", "nan"],
    "blue_o_points": [],
    "blue_x_points": [
      [0.00144, 1],
      [-0.0, 2],
      [-0.00023, 0],
      [-0.00024, 0],
      [-7e-5, 2],
      [0.00165, 1],
      [0.00093, 1],
      [-0.0002, 0],
      [-8e-5, 2],
      [-3e-5, 2],
      [-0.00018, 0],
      [0.00086, 1],
      [-4e-5, 2],
      [0.00121, 1],
      [-2e-5, 2]
    ]
  },
  "QS_mulNeuromadSite[T1]": {
    "red_x_points": [
      [0.0, 2],
      [-0.00034, 0],
      [-0.00032, 0],
      [-0.00024, 0],
      [-0.00028, 0],
      [-0.00036, 0],
      [-0.00044, 0],
      [-3e-5, 2],
      [-0.00041, 0],
      [-0.00037, 0],
      [2e-5, 2],
      [-0.00036, 0],
      [-0.00012, 2],
      [-0.00047, 0],
      [-0.00042, 0],
      [1e-5, 2],
      [-2e-5, 2],
      [2e-5, 2],
      [-0.00024, 0],
      [3e-5, 2],
      [-0.0001, 2],
      [-7e-5, 2],
      [-0.0004, 0],
      [-0.00043, 0],
      [-0.0001, 2],
      [0.00087, 1],
      [-6e-5, 2],
      [-0.00035, 0],
      [-0.0001, 2]
    ],
    "red_o_points": [],
    "y_categories": ["N", "NOT APPLICABLE", "nan"],
    "blue_o_points": [],
    "blue_x_points": [
      [0.00175, 1],
      [-7e-5, 2],
      [-0.0002, 0],
      [-0.00022, 0],
      [3e-5, 2],
      [0.00134, 1],
      [0.00079, 1],
      [-0.0003, 0],
      [-5e-5, 2],
      [-1e-5, 2],
      [-0.00019, 0],
      [0.00093, 1],
      [7e-5, 2],
      [0.00121, 1],
      [0.0, 2]
    ]
  },
  "QA_lstPexTouch[C7]": {
    "red_x_points": [
      [-0.00156, 1],
      [-0.00845, 2],
      [-0.00329, 1],
      [-0.00279, 1],
      [-0.01054, 2],
      [-0.00524, 1],
      [-0.00525, 1],
      [-0.00461, 0],
      [-0.00786, 1],
      [-0.00813, 1],
      [-0.00242, 1],
      [-0.01274, 2],
      [-0.0022, 2],
      [-0.01332, 2],
      [-0.00477, 2],
      [-0.00257, 0],
      [-0.00175, 1],
      [-0.00258, 0],
      [-0.00743, 2],
      [-0.00296, 0],
      [-0.00308, 2],
      [-0.00787, 0],
      [-0.00776, 1],
      [-0.01072, 2],
      [-0.00435, 0],
      [-0.00411, 1],
      [-0.00123, 2],
      [-0.00232, 1],
      [0.00147, 1]
    ],
    "red_o_points": [],
    "y_categories": ["NORM", "NPV", "nan"],
    "blue_o_points": [],
    "blue_x_points": [
      [8e-5, 1],
      [0.01027, 1],
      [0.03831, 0],
      [0.04204, 0],
      [0.0059, 2],
      [0.0002, 2],
      [-7e-5, 1],
      [-0.00347, 1],
      [0.01031, 1],
      [0.00554, 2],
      [0.03264, 0],
      [-2e-5, 1],
      [2e-5, 0],
      [0.00406, 0],
      [0.00465, 0]
    ]
  },
  "QA_yonInjPhysio": {
    "red_x_points": [
      [-0.00686, 0],
      [0.0007, 0],
      [0.00027, 0],
      [9e-5, 0],
      [-0.00186, 2],
      [0.0007, 0],
      [0.00028, 0],
      [-0.00556, 0],
      [0.00123, 0],
      [-0.00591, 1],
      [-0.00531, 0],
      [0.0008, 0],
      [-0.00817, 0],
      [-0.00552, 1],
      [-0.00136, 1],
      [0.00275, 1],
      [-0.00559, 0],
      [0.00359, 1],
      [0.00061, 0],
      [-0.00522, 0],
      [0.00388, 1],
      [0.0035, 1],
      [0.00119, 0],
      [-0.0084, 1],
      [-0.008, 2],
      [-0.01295, 1],
      [-0.00846, 2],
      [0.00032, 0],
      [0.0043, 1]
    ],
    "red_o_points": [],
    "y_categories": ["N", "Y", "nan"],
    "blue_o_points": [],
    "blue_x_points": [
      [0.00501, 0],
      [0.00689, 1],
      [0.00555, 0],
      [0.00731, 0],
      [0.00799, 1],
      [0.0045, 0],
      [0.00285, 0],
      [0.00166, 0],
      [-0.00125, 0],
      [0.00655, 1],
      [0.00436, 0],
      [0.00384, 0],
      [0.00563, 1],
      [-0.00249, 1],
      [0.00657, 1]
    ]
  },
  "QS_mulNeuromadSite[T2]": {
    "red_x_points": [
      [-3e-5, 2],
      [-0.00181, 0],
      [-0.00115, 0],
      [-0.00093, 0],
      [-0.00134, 0],
      [-0.00073, 0],
      [-0.00119, 0],
      [-0.00017, 2],
      [-0.00131, 0],
      [-0.00095, 0],
      [-1e-5, 2],
      [-0.00118, 0],
      [-0.00014, 2],
      [-0.002, 0],
      [-0.00141, 0],
      [-8e-5, 2],
      [-5e-5, 2],
      [-2e-5, 2],
      [-0.00081, 0],
      [-0.0002, 2],
      [-0.00013, 2],
      [-0.00014, 2],
      [-0.00103, 0],
      [-0.0011, 0],
      [-0.00014, 2],
      [0.00232, 1],
      [-0.00014, 2],
      [-0.00086, 0],
      [-0.00011, 2]
    ],
    "red_o_points": [],
    "y_categories": ["N", "NOT APPLICABLE", "nan"],
    "blue_o_points": [],
    "blue_x_points": [
      [0.00651, 1],
      [2e-5, 2],
      [-0.00064, 0],
      [-0.00051, 0],
      [0.0001, 2],
      [0.00412, 1],
      [0.00211, 1],
      [-0.00081, 0],
      [0.0001, 2],
      [1e-5, 2],
      [-0.0005, 0],
      [0.00308, 1],
      [6e-5, 2],
      [0.0032, 1],
      [-2e-5, 2]
    ]
  },
  "QS_mulGraftNerve[MC]": {
    "red_x_points": [
      [-5e-5, 2],
      [-0.0001, 0],
      [-0.0001, 0],
      [-9e-5, 0],
      [-0.00014, 0],
      [-0.0001, 0],
      [-0.00011, 0],
      [-5e-5, 2],
      [-0.00014, 0],
      [-0.0001, 0],
      [1e-5, 2],
      [-0.00014, 0],
      [-4e-5, 2],
      [-0.00011, 0],
      [-8e-5, 0],
      [1e-5, 2],
      [-1e-5, 2],
      [-0.0, 2],
      [-0.0001, 0],
      [-5e-5, 2],
      [-4e-5, 2],
      [-5e-5, 2],
      [-8e-5, 0],
      [-0.0001, 0],
      [-7e-5, 2],
      [0.00028, 1],
      [-6e-5, 2],
      [-0.00011, 0],
      [-8e-5, 2]
    ],
    "red_o_points": [],
    "y_categories": ["N", "NOT APPLICABLE", "nan"],
    "blue_o_points": [],
    "blue_x_points": [
      [0.0008, 1],
      [1e-5, 2],
      [-7e-5, 0],
      [-7e-5, 0],
      [-0.0, 2],
      [0.00043, 1],
      [0.0002, 1],
      [-4e-5, 0],
      [-2e-5, 2],
      [-1e-5, 2],
      [-7e-5, 0],
      [0.00044, 1],
      [1e-5, 2],
      [0.0002, 1],
      [-1e-5, 2]
    ]
  },
  "QS_mulLysisNerve[Ssr]": {
    "red_x_points": [
      [-0.00061, 3],
      [-0.00358, 0],
      [-0.00982, 2],
      [-0.0094, 2],
      [-0.00276, 0],
      [-0.00274, 0],
      [-0.00278, 0],
      [-0.00069, 3],
      [-0.0029, 0],
      [-0.0026, 0],
      [-0.00037, 3],
      [-0.00296, 0],
      [-0.00099, 3],
      [-0.00409, 0],
      [-0.00354, 0],
      [-0.0006, 3],
      [-0.00033, 3],
      [-0.00022, 3],
      [-0.0026, 0],
      [-0.00047, 3],
      [-0.00102, 3],
      [-0.00078, 3],
      [-0.00278, 0],
      [-0.0027, 0],
      [-0.00078, 3],
      [0.01034, 1],
      [-0.00085, 3],
      [-0.00261, 0],
      [-0.00099, 3]
    ],
    "red_o_points": [],
    "y_categories": ["N", "NOT APPLICABLE", "Y", "nan"],
    "blue_o_points": [],
    "blue_x_points": [
      [0.0178, 1],
      [-0.00046, 3],
      [-0.00184, 0],
      [-0.00234, 0],
      [-1e-5, 3],
      [0.01371, 1],
      [0.0097, 1],
      [-0.00165, 0],
      [-0.00021, 3],
      [-0.00022, 3],
      [-0.00136, 0],
      [0.01171, 1],
      [-0.00022, 3],
      [0.01196, 1],
      [-0.00037, 3]
    ]
  },
  "QS_mulNeuromadSite[C4]": {
    "red_x_points": [
      [1e-5, 2],
      [-0.0002, 0],
      [-0.0001, 0],
      [-7e-5, 0],
      [-0.00017, 0],
      [-3e-5, 0],
      [-0.00014, 0],
      [2e-5, 2],
      [-0.00017, 0],
      [3e-5, 0],
      [-1e-5, 2],
      [-0.00016, 0],
      [-1e-5, 2],
      [-8e-5, 0],
      [-0.00018, 0],
      [-4e-5, 2],
      [-1e-5, 2],
      [-4e-5, 2],
      [-4e-5, 0],
      [-6e-5, 2],
      [-2e-5, 2],
      [1e-5, 2],
      [-0.00013, 0],
      [-0.00015, 0],
      [-1e-5, 2],
      [3e-5, 1],
      [1e-5, 2],
      [-3e-5, 0],
      [-1e-5, 2]
    ],
    "red_o_points": [],
    "y_categories": ["N", "NOT APPLICABLE", "nan"],
    "blue_o_points": [],
    "blue_x_points": [
      [0.0007, 1],
      [2e-5, 2],
      [1e-5, 0],
      [3e-5, 0],
      [2e-5, 2],
      [0.00029, 1],
      [0.00021, 1],
      [-0.00012, 0],
      [2e-5, 2],
      [-1e-5, 2],
      [-1e-5, 0],
      [0.00036, 1],
      [-4e-5, 2],
      [0.00023, 1],
      [4e-5, 2]
    ]
  },
  "QS_mulGraftNerve[Ra]": {
    "red_x_points": [
      [-2e-5, 2],
      [-9e-5, 0],
      [-2e-5, 0],
      [-2e-5, 0],
      [-2e-5, 0],
      [-2e-5, 0],
      [-2e-5, 2],
      [-2e-5, 0],
      [-2e-5, 0],
      [-2e-5, 0],
      [1e-5, 2],
      [-7e-5, 0],
      [-9e-5, 0],
      [-2e-5, 2],
      [-2e-5, 2],
      [-2e-5, 2],
      [1e-5, 2],
      [-2e-5, 2],
      [-2e-5, 0],
      [-2e-5, 0],
      [-2e-5, 2],
      [9e-5, 1],
      [-2e-5, 2],
      [-2e-5, 2]
    ],
    "red_o_points": [],
    "y_categories": ["N", "NOT APPLICABLE", "nan"],
    "blue_o_points": [],
    "blue_x_points": [
      [9e-5, 1],
      [-2e-5, 0],
      [-2e-5, 0],
      [1e-5, 2],
      [0.00022, 1],
      [9e-5, 1],
      [-2e-5, 0],
      [-2e-5, 2],
      [1e-5, 2],
      [-2e-5, 0],
      [9e-5, 1],
      [-2e-5, 2]
    ]
  },
  "QS_mulTransfSite[Oberlin]": {
    "red_x_points": [
      [-0.00142, 3],
      [-0.02395, 0],
      [-0.023, 0],
      [-0.02151, 0],
      [-0.02302, 0],
      [0.00316, 2],
      [-0.02304, 0],
      [-0.00181, 3],
      [0.00403, 2],
      [0.00362, 2],
      [-0.00157, 3],
      [0.00299, 2],
      [-0.00214, 3],
      [0.00222, 2],
      [-0.02168, 0],
      [-0.00133, 3],
      [-0.00161, 3],
      [-0.00128, 3],
      [-0.02004, 0],
      [-0.00156, 3],
      [-0.00193, 3],
      [-0.00193, 3],
      [0.00323, 2],
      [-0.02285, 0],
      [-0.00182, 3],
      [0.02624, 1],
      [-0.00169, 3],
      [-0.0229, 0],
      [-0.00185, 3]
    ],
    "red_o_points": [],
    "y_categories": ["N", "NOT APPLICABLE", "Y", "nan"],
    "blue_o_points": [],
    "blue_x_points": [
      [0.04288, 1],
      [-0.00113, 3],
      [0.00519, 2],
      [0.00648, 2],
      [-0.00067, 3],
      [0.03237, 1],
      [0.02764, 1],
      [0.00399, 2],
      [-0.00094, 3],
      [-0.00081, 3],
      [0.00533, 2],
      [0.03024, 1],
      [-0.00085, 3],
      [0.02969, 1],
      [-0.00097, 3]
    ]
  },
  "QA_intPexForearmProna": {
    "red_x_points": [
      [-0.00034, 2],
      [-0.00075, 0],
      [-0.0007, 2],
      [-0.00032, 2],
      [-0.00059, 2],
      [-0.00198, 0],
      [-0.00066, 2],
      [-0.01679, 0],
      [-0.00075, 2],
      [-0.00071, 2],
      [-0.01604, 0],
      [-0.00176, 0],
      [-0.0007, 2],
      [-0.00047, 2],
      [-5e-5, 2],
      [-0.01692, 0],
      [-0.01598, 0],
      [-0.01662, 0],
      [-0.00121, 0],
      [-0.00038, 2],
      [-0.00056, 2],
      [-0.00054, 2],
      [-0.00061, 2],
      [-0.0007, 2],
      [0.00022, 2],
      [0.00033, 1],
      [-5e-5, 2],
      [-0.00167, 0],
      [-0.0006, 2]
    ],
    "red_o_points": [],
    "y_categories": ["GREATER THAN OR EQUALS TO 80", "LESS THAN 80", "nan"],
    "blue_o_points": [],
    "blue_x_points": [
      [-0.00048, 2],
      [0.04999, 1],
      [-0.0006, 0],
      [-0.0005, 2],
      [0.00098, 2],
      [3e-5, 2],
      [0.00109, 1],
      [6e-5, 2],
      [0.00039, 2],
      [0.00084, 2],
      [-0.00058, 0],
      [4e-5, 2],
      [0.00125, 2],
      [3e-5, 2],
      [0.04535, 1]
    ]
  },
  "QA_yonInjChesttube": {
    "red_x_points": [
      [-0.00312, 2],
      [-0.00245, 2],
      [0.00161, 0],
      [-0.00171, 2],
      [-0.00285, 2],
      [0.00155, 0],
      [-0.00404, 1],
      [-0.00188, 2],
      [-0.00303, 2],
      [-0.00284, 2],
      [0.00125, 0],
      [0.00306, 0],
      [-0.00394, 2],
      [-0.00282, 2],
      [0.00058, 0],
      [0.00122, 0],
      [0.00141, 0],
      [0.00132, 0],
      [-0.00368, 1],
      [-0.00197, 2],
      [-0.01904, 1],
      [-0.00345, 2],
      [-0.00316, 2],
      [0.0025, 0],
      [-0.00335, 2],
      [-0.00014, 2],
      [-0.00314, 2],
      [0.00079, 0],
      [-0.00372, 2]
    ],
    "red_o_points": [],
    "y_categories": ["N", "Y", "nan"],
    "blue_o_points": [],
    "blue_x_points": [
      [0.00016, 1],
      [-0.00102, 2],
      [0.00367, 0],
      [0.00469, 0],
      [-0.00206, 2],
      [0.00588, 0],
      [0.01995, 0],
      [0.01616, 0],
      [0.00279, 0],
      [-9e-5, 2],
      [0.00468, 0],
      [-3e-5, 2],
      [0.00028, 2]
    ]
  },
  "QA_yonPexPain": {
    "red_x_points": [
      [-0.00783, 1],
      [-0.00102, 1],
      [-0.00056, 1],
      [-0.00052, 1],
      [-0.00044, 1],
      [-0.00235, 0],
      [-0.00033, 1],
      [-0.00787, 1],
      [-0.00309, 0],
      [-0.00085, 1],
      [-0.00445, 1],
      [-0.00084, 0],
      [-0.01073, 1],
      [-0.00074, 1],
      [-0.00051, 1],
      [0.0051, 0],
      [-0.00489, 1],
      [0.00489, 0],
      [-0.00064, 1],
      [0.00914, 0],
      [-0.01985, 2],
      [-0.00922, 1],
      [-0.00047, 1],
      [-0.001, 1],
      [-0.01494, 2],
      [-0.00136, 1],
      [-0.00782, 1],
      [-0.00021, 1],
      [-0.01005, 1]
    ],
    "red_o_points": [],
    "y_categories": ["N", "Y", "nan"],
    "blue_o_points": [],
    "blue_x_points": [
      [-0.00018, 1],
      [0.02542, 0],
      [0.0036, 0],
      [0.00153, 1],
      [-0.00568, 1],
      [0.00115, 2],
      [9e-5, 1],
      [0.0043, 1],
      [0.02758, 0],
      [0.02223, 0],
      [0.00107, 1],
      [0.00135, 0],
      [0.00995, 0],
      [-0.00012, 1],
      [0.00118, 1]
    ]
  },
  "QS_mulGraftNerve[FI]": {
    "red_x_points": [
      [0.0, 2],
      [-9e-5, 0],
      [-0.00014, 0],
      [-0.0001, 0],
      [-0.00015, 0],
      [-0.0001, 0],
      [-0.00012, 0],
      [-4e-5, 2],
      [-0.00016, 0],
      [-0.00017, 0],
      [1e-5, 2],
      [-0.00018, 0],
      [-4e-5, 2],
      [-0.00015, 0],
      [-9e-5, 0],
      [-2e-5, 2],
      [1e-5, 2],
      [1e-5, 2],
      [-0.00014, 0],
      [1e-5, 2],
      [-4e-5, 2],
      [-2e-5, 2],
      [-0.00015, 0],
      [-0.00015, 0],
      [-3e-5, 2],
      [9e-5, 1],
      [-3e-5, 2],
      [-8e-5, 0],
      [-2e-5, 2]
    ],
    "red_o_points": [],
    "y_categories": ["N", "NOT APPLICABLE", "nan"],
    "blue_o_points": [],
    "blue_x_points": [
      [0.00061, 1],
      [-2e-5, 2],
      [-0.0001, 0],
      [-5e-5, 0],
      [1e-5, 2],
      [0.0005, 1],
      [0.00035, 1],
      [-5e-5, 0],
      [0.0, 2],
      [-0.0, 2],
      [-7e-5, 0],
      [0.00051, 1],
      [1e-5, 2],
      [0.00035, 1],
      [-2e-5, 2]
    ]
  },
  "QA_lstPexPalle[Ulna]": {
    "red_x_points": [
      [-0.00095, 4],
      [-0.00253, 4],
      [-0.00193, 4],
      [-0.00665, 2],
      [-0.00279, 4],
      [-0.01137, 1],
      [-0.00241, 4],
      [-0.00062, 4],
      [-0.00371, 4],
      [0.01008, 3],
      [-0.01062, 1],
      [-0.00367, 4],
      [-0.00104, 4],
      [-0.00408, 4],
      [-0.00117, 4],
      [0.00569, 3],
      [-0.00996, 0],
      [0.00259, 3],
      [-0.00698, 0],
      [0.00495, 3],
      [-0.00083, 4],
      [-0.00084, 4],
      [-0.00376, 4],
      [-0.00268, 4],
      [-0.00036, 4],
      [0.00251, 3],
      [-0.00032, 4],
      [-0.00723, 0],
      [-0.00077, 4]
    ],
    "red_o_points": [],
    "y_categories": ["ABS", "HYPO", "NAIA", "PT", "nan"],
    "blue_o_points": [],
    "blue_x_points": [
      [-0.00047, 4],
      [-0.0003, 4],
      [0.01611, 3],
      [0.01802, 3],
      [0.0001, 4],
      [-9e-5, 4],
      [0.00223, 3],
      [-0.00245, 4],
      [-0.0, 4],
      [0.00022, 4],
      [0.01431, 3],
      [-0.00017, 4],
      [0.00438, 3],
      [-0.00013, 4],
      [0.00974, 3]
    ]
  }
}
