{
  "QA_lstPexMuscstrength[ElbowFlex]": {
    "red_x_points": [
      [-0.00531, 1],
      [0.00039, 2],
      [-0.00183, 1],
      [-0.00187, 1],
      [0.00069, 0],
      [-0.00171, 1],
      [-0.00212, 1],
      [-0.00548, 1],
      [-0.00202, 1],
      [-0.00193, 1],
      [-0.00164, 1],
      [-0.00549, 1],
      [0.0007, 2],
      [0.00566, 2],
      [8e-5, 2],
      [-0.00551, 1],
      [0.00037, 2],
      [0.00133, 0],
      [-0.00606, 1],
      [-0.0059, 1],
      [-0.00496, 1],
      [-0.0016, 1],
      [0.0055, 2],
      [-0.00143, 0],
      [-0.00615, 1],
      [-0.00176, 1],
      [-0.00501, 1],
      [-0.00189, 1],
      [-0.00548, 1],
      [0.0006, 2],
      [-0.00175, 1]
    ],
    "red_o_points": [],
    "y_categories": ["GREATER THAN OR EQUALS TO 3", "LESS THAN 3", "nan"],
    "blue_o_points": [],
    "blue_x_points": [
      [0.00062, 2],
      [0.00871, 2],
      [0.00557, 0],
      [0.0009, 1],
      [0.00986, 2],
      [0.00528, 0],
      [0.00591, 0]
    ]
  },
  "QS_mulLysisSite[Root]": {
    "red_x_points": [
      [-0.00065, 3],
      [-0.00066, 0],
      [-0.00168, 2],
      [-0.00071, 0],
      [-0.00065, 0],
      [-0.00065, 0],
      [-0.00074, 0],
      [-0.00056, 3],
      [-0.00052, 0],
      [-0.00072, 0],
      [-0.00061, 0],
      [-0.00063, 3],
      [0.00226, 1],
      [-0.00056, 3],
      [-0.00058, 0],
      [-0.00049, 3],
      [-0.00063, 0],
      [-0.00069, 0],
      [-0.00061, 3],
      [-0.00058, 3],
      [-0.00043, 3],
      [-0.00073, 0],
      [-0.00062, 3],
      [-0.00058, 3],
      [-0.00066, 3],
      [-0.00069, 0],
      [-0.00052, 3],
      [-0.00071, 0],
      [-0.00045, 3],
      [0.00263, 1],
      [-0.00186, 2]
    ],
    "red_o_points": [],
    "y_categories": ["N", "NOT APPLICABLE", "Y", "nan"],
    "blue_o_points": [],
    "blue_x_points": [
      [0.0032, 1],
      [-0.00028, 3],
      [0.0024, 1],
      [-0.00084, 0],
      [-0.00027, 3],
      [0.00308, 1],
      [0.0024, 1]
    ]
  },
  "QS_mulLysisTrunk[Upper]": {
    "red_x_points": [
      [-0.00181, 3],
      [-0.00295, 0],
      [-0.00283, 0],
      [-0.00285, 0],
      [-0.0029, 0],
      [-0.00559, 2],
      [-0.00296, 0],
      [-0.00214, 3],
      [-0.00287, 0],
      [-0.00272, 0],
      [-0.0026, 0],
      [-0.00159, 3],
      [0.00824, 1],
      [-0.00166, 3],
      [-0.00277, 0],
      [-0.00202, 3],
      [-0.00603, 2],
      [-0.00287, 0],
      [-0.00176, 3],
      [-0.00156, 3],
      [-0.00166, 3],
      [-0.00267, 0],
      [-0.00184, 3],
      [-0.00195, 3],
      [-0.00185, 3],
      [-0.0026, 0],
      [-0.0017, 3],
      [-0.00281, 0],
      [-0.00158, 3],
      [0.00863, 1],
      [-0.00515, 2]
    ],
    "red_o_points": [],
    "y_categories": ["N", "NOT APPLICABLE", "Y", "nan"],
    "blue_o_points": [],
    "blue_x_points": [
      [0.01297, 1],
      [-0.00058, 3],
      [0.00877, 1],
      [-0.00151, 0],
      [-0.00053, 3],
      [0.01026, 1],
      [0.00938, 1]
    ]
  },
  "QS_mulBpsurgeryType[Transf]": {
    "red_x_points": [
      [-0.00011, 3],
      [-0.00035, 2],
      [-0.00065, 0],
      [-0.00027, 2],
      [-0.00027, 2],
      [-0.00026, 2],
      [-0.00032, 2],
      [-6e-5, 3],
      [-0.00023, 2],
      [-0.00019, 2],
      [-0.00033, 2],
      [-0.00011, 3],
      [0.00076, 1],
      [-5e-5, 3],
      [-0.00028, 2],
      [-0.00013, 3],
      [-0.00033, 2],
      [-0.00027, 2],
      [-9e-5, 3],
      [-0.0001, 3],
      [-0.0001, 3],
      [-0.00026, 2],
      [-0.00011, 3],
      [-1e-5, 3],
      [-0.00015, 3],
      [-0.00032, 2],
      [-7e-5, 3],
      [-0.00027, 2],
      [-0.00011, 3],
      [0.00119, 1],
      [-0.00023, 2]
    ],
    "red_o_points": [],
    "y_categories": ["N", "NOT APPLICABLE", "Y", "nan"],
    "blue_o_points": [],
    "blue_x_points": [
      [0.00086, 1],
      [-0.00012, 3],
      [0.00044, 1],
      [-0.00038, 2],
      [-3e-5, 3],
      [0.00086, 1],
      [0.0008, 1]
    ]
  },
  "QS_mulGraftNerve[Ac]": {
    "red_x_points": [
      [-0.00034, 2],
      [-0.00074, 0],
      [-0.00075, 0],
      [-0.0009, 0],
      [-0.00083, 0],
      [-0.00066, 0],
      [-0.00076, 0],
      [-0.00039, 2],
      [-0.00068, 0],
      [-0.00079, 0],
      [-0.0008, 0],
      [-0.00029, 2],
      [0.00125, 1],
      [-0.00041, 2],
      [-0.00063, 0],
      [-0.00035, 2],
      [-0.00069, 0],
      [-0.00064, 0],
      [-0.00024, 2],
      [-0.00025, 2],
      [-0.00024, 2],
      [-0.00065, 0],
      [-0.00039, 2],
      [-0.0002, 2],
      [-0.00035, 2],
      [-0.00064, 0],
      [-0.00036, 2],
      [-0.00069, 0],
      [-0.00019, 2],
      [0.00139, 1],
      [-0.00072, 0]
    ],
    "red_o_points": [],
    "y_categories": ["N", "NOT APPLICABLE", "nan"],
    "blue_o_points": [],
    "blue_x_points": [
      [0.00284, 1],
      [-7e-5, 2],
      [0.00112, 1],
      [7e-5, 0],
      [5e-5, 2],
      [0.00166, 1],
      [0.00242, 1]
    ]
  },
  "QS_mulNeuromadSite[C8]": {
    "red_x_points": [
      [-0.00095, 2],
      [-0.00343, 0],
      [-0.00302, 0],
      [-0.00338, 0],
      [-0.00385, 0],
      [-0.00325, 0],
      [-0.00325, 0],
      [-0.00103, 2],
      [-0.0035, 0],
      [-0.00339, 0],
      [-0.00292, 0],
      [-0.00115, 2],
      [0.00445, 1],
      [-0.00079, 2],
      [-0.00336, 0],
      [-0.00126, 2],
      [-0.00271, 0],
      [-0.00345, 0],
      [-0.00125, 2],
      [-0.00095, 2],
      [-0.00078, 2],
      [-0.00293, 0],
      [-0.00088, 2],
      [-0.00149, 2],
      [-0.00125, 2],
      [-0.0031, 0],
      [-0.00093, 2],
      [-0.00336, 0],
      [-0.00071, 2],
      [0.00541, 1],
      [-0.00296, 0]
    ],
    "red_o_points": [],
    "y_categories": ["N", "NOT APPLICABLE", "nan"],
    "blue_o_points": [],
    "blue_x_points": [
      [0.01484, 1],
      [-5e-5, 2],
      [0.00663, 1],
      [6e-5, 0],
      [0.00021, 2],
      [0.00589, 1],
      [0.008, 1]
    ]
  },
  "QS_mulGraftNerve[Ph]": {
    "red_x_points": [
      [-0.00014, 2],
      [-0.00034, 0],
      [-0.00042, 0],
      [-0.00047, 0],
      [-0.00024, 0],
      [-0.00038, 0],
      [-0.0005, 0],
      [-0.0001, 2],
      [-0.00029, 0],
      [-0.0005, 0],
      [-0.00042, 0],
      [-0.00018, 2],
      [0.00037, 1],
      [-0.00011, 2],
      [-0.00033, 0],
      [-0.00015, 2],
      [-0.00033, 0],
      [-0.00043, 0],
      [-0.00012, 2],
      [-0.00014, 2],
      [-0.0002, 2],
      [-0.00037, 0],
      [-0.00015, 2],
      [-0.00032, 2],
      [-0.00014, 2],
      [-0.00047, 0],
      [-9e-5, 2],
      [-0.00023, 0],
      [-0.00016, 2],
      [0.00117, 1],
      [-0.00052, 0]
    ],
    "red_o_points": [],
    "y_categories": ["N", "NOT APPLICABLE", "nan"],
    "blue_o_points": [],
    "blue_x_points": [
      [0.0014, 1],
      [-7e-5, 2],
      [0.00103, 1],
      [9e-5, 0],
      [-0.0001, 2],
      [0.00093, 1],
      [0.00128, 1]
    ]
  },
  "QS_mulTransfSite[AcSsPA]": {
    "red_x_points": [
      [-0.00055, 3],
      [-0.00092, 0],
      [-0.00085, 0],
      [-0.0009, 0],
      [-0.00095, 0],
      [-0.00089, 0],
      [-0.00083, 0],
      [-0.00051, 3],
      [-0.00086, 0],
      [-0.0009, 0],
      [-0.00085, 0],
      [-0.00061, 3],
      [0.00271, 1],
      [-0.00068, 3],
      [-0.00086, 0],
      [-0.00057, 3],
      [-0.00258, 2],
      [-0.00093, 0],
      [-0.00057, 3],
      [-0.00056, 3],
      [-0.00048, 3],
      [-0.00067, 0],
      [-0.00058, 3],
      [-0.00057, 3],
      [-0.00052, 3],
      [-0.00077, 0],
      [-0.00052, 3],
      [-0.00073, 0],
      [-0.00056, 3],
      [0.00245, 1],
      [-0.00087, 0]
    ],
    "red_o_points": [],
    "y_categories": ["N", "NOT APPLICABLE", "Y", "nan"],
    "blue_o_points": [],
    "blue_x_points": [
      [0.00352, 1],
      [-0.0003, 3],
      [0.00282, 1],
      [-0.00043, 0],
      [-0.00022, 3],
      [0.00237, 1],
      [0.00293, 1]
    ]
  },
  "participant_code": {
    "red_x_points": [
      [-0.02011, 1],
      [-0.02025, 2],
      [-0.02011, 3],
      [-0.02053, 4],
      [-0.02081, 5],
      [-0.02002, 6],
      [-0.01992, 7],
      [-0.01904, 8],
      [-0.01969, 9],
      [-0.02016, 10],
      [-0.0202, 11],
      [-0.0203, 12],
      [-0.01983, 14],
      [-0.02006, 16],
      [-0.02034, 17],
      [-0.01927, 19],
      [-0.02002, 20],
      [-0.0203, 22],
      [-0.02062, 23],
      [-0.02011, 25],
      [-0.01983, 26],
      [-0.02002, 27],
      [-0.02081, 28],
      [-0.01969, 29],
      [-0.01969, 30],
      [-0.02044, 32],
      [-0.02081, 33],
      [-0.02034, 34],
      [-0.02086, 35],
      [-0.01955, 36],
      [-0.02086, 37]
    ],
    "red_o_points": [],
    "y_categories": [
      "P16554",
      "P18297",
      "P19283",
      "P19287",
      "P23391",
      "P31645",
      "P31691",
      "P34778",
      "P35046",
      "P36328",
      "P43633",
      "P4544",
      "P46417",
      "P48965",
      "P53068",
      "P5497",
      "P59529",
      "P62483",
      "P64658",
      "P65202",
      "P66816",
      "P6751",
      "P7408",
      "P75566",
      "P76226",
      "P79971",
      "P82621",
      "P82990",
      "P84932",
      "P85825",
      "P86989",
      "P8770",
      "P87791",
      "P90550",
      "P93159",
      "P94969",
      "P96710",
      "P9744",
      "nan"
    ],
    "blue_o_points": [],
    "blue_x_points": [
      [0.05871, 0],
      [0.05902, 13],
      [0.06025, 15],
      [0.05458, 18],
      [0.05841, 21],
      [0.05887, 24],
      [0.06009, 31]
    ]
  },
  "QS_mulNeuromadSite[T2]": {
    "red_x_points": [
      [-0.00241, 2],
      [-0.00585, 0],
      [-0.00547, 0],
      [-0.00561, 0],
      [-0.00608, 0],
      [-0.00553, 0],
      [-0.00573, 0],
      [-0.00202, 2],
      [-0.00585, 0],
      [-0.006, 0],
      [-0.00523, 0],
      [-0.00204, 2],
      [0.00817, 1],
      [-0.00227, 2],
      [-0.00694, 0],
      [-0.0021, 2],
      [-0.00563, 0],
      [-0.007, 0],
      [-0.00239, 2],
      [-0.00215, 2],
      [-0.00162, 2],
      [-0.00537, 0],
      [-0.00211, 2],
      [-0.00408, 2],
      [-0.00234, 2],
      [-0.00584, 0],
      [-0.00216, 2],
      [-0.00585, 0],
      [-0.00177, 2],
      [0.01096, 1],
      [-0.00522, 0]
    ],
    "red_o_points": [],
    "y_categories": ["N", "NOT APPLICABLE", "nan"],
    "blue_o_points": [],
    "blue_x_points": [
      [0.02391, 1],
      [-0.00017, 2],
      [0.01233, 1],
      [0.0013, 0],
      [-0.00031, 2],
      [0.01297, 1],
      [0.01473, 1]
    ]
  },
  "QA_mulInjOrthesisType[ArmSling]": {
    "red_x_points": [
      [-0.01368, 2],
      [-0.01191, 2],
      [-0.01191, 2],
      [-0.01171, 2],
      [-0.01185, 2],
      [-0.01222, 2],
      [-0.01111, 2],
      [-0.01275, 2],
      [-0.01259, 2],
      [-0.01183, 2],
      [-0.01199, 2],
      [-0.01213, 2],
      [0.03555, 1],
      [-0.01317, 2],
      [-0.01212, 2],
      [-0.01332, 2],
      [-0.0144, 0],
      [-0.01234, 2],
      [-0.01284, 2],
      [-0.01273, 2],
      [-0.01536, 0],
      [-0.01433, 3],
      [-0.01329, 2],
      [0.03547, 1],
      [-0.01317, 2],
      [-0.01151, 2],
      [-0.01286, 2],
      [-0.01158, 2],
      [-0.01488, 3],
      [-0.02344, 3],
      [-0.01147, 2]
    ],
    "red_o_points": [],
    "y_categories": ["N", "NOT APPLICABLE", "Y", "nan"],
    "blue_o_points": [],
    "blue_x_points": [
      [-0.00545, 2],
      [0.03645, 1],
      [0.03157, 1],
      [0.04018, 1],
      [0.03809, 1],
      [0.03138, 1],
      [0.03032, 1]
    ]
  },
  "QS_mulGraftNerve[Ul]": {
    "red_x_points": [
      [-9e-5, 2],
      [-0.0002, 0],
      [-0.0002, 0],
      [-0.00022, 0],
      [-0.00024, 0],
      [-0.00031, 0],
      [-0.0002, 0],
      [-4e-5, 2],
      [-0.00019, 0],
      [-0.00026, 0],
      [-0.00026, 0],
      [-0.00012, 2],
      [0.00051, 1],
      [-0.00014, 2],
      [-0.00024, 0],
      [-0.00012, 2],
      [-0.0003, 0],
      [-0.00022, 0],
      [-0.0001, 2],
      [-0.00011, 2],
      [-0.0001, 2],
      [-0.0002, 0],
      [-0.00011, 2],
      [-8e-5, 2],
      [-0.0001, 2],
      [-0.00031, 0],
      [-7e-5, 2],
      [-0.00022, 0],
      [-7e-5, 2],
      [0.00063, 1],
      [-0.00022, 0]
    ],
    "red_o_points": [],
    "y_categories": ["N", "NOT APPLICABLE", "nan"],
    "blue_o_points": [],
    "blue_x_points": [
      [0.00094, 1],
      [-1e-5, 2],
      [0.00032, 1],
      [-2e-5, 0],
      [-8e-5, 2],
      [0.00055, 1],
      [0.00063, 1]
    ]
  },
  "QA_mulInjOrthesisType[ShoulderSupport]": {
    "red_x_points": [
      [-0.0145, 0],
      [-0.01316, 0],
      [-0.01338, 0],
      [-0.01396, 0],
      [-0.01389, 0],
      [-0.01363, 0],
      [-0.01405, 0],
      [-0.01687, 2],
      [-0.01346, 0],
      [-0.01315, 0],
      [-0.01386, 0],
      [-0.01416, 0],
      [0.03745, 1],
      [-0.01493, 0],
      [-0.01363, 0],
      [-0.01394, 0],
      [-0.01693, 2],
      [-0.01324, 0],
      [-0.01451, 0],
      [-0.01433, 0],
      [-0.01734, 2],
      [-0.01622, 3],
      [-0.01446, 0],
      [0.04217, 1],
      [-0.01501, 0],
      [-0.0136, 0],
      [-0.01424, 0],
      [-0.01351, 0],
      [-0.01729, 3],
      [-0.02499, 3],
      [-0.01268, 0]
    ],
    "red_o_points": [],
    "y_categories": ["N", "NOT APPLICABLE", "Y", "nan"],
    "blue_o_points": [],
    "blue_x_points": [
      [-0.00662, 0],
      [0.04413, 1],
      [0.0355, 1],
      [0.0429, 1],
      [0.03886, 1],
      [0.03506, 1],
      [0.03588, 1]
    ]
  },
  "QA_yonInjUnconscio": {
    "red_x_points": [
      [-0.00363, 1],
      [-0.00381, 1],
      [-0.00162, 2],
      [-0.00188, 2],
      [0.00647, 0],
      [-0.00415, 1],
      [-0.00184, 2],
      [-0.00403, 2],
      [-0.00215, 2],
      [-0.00169, 2],
      [-0.00371, 1],
      [-0.00414, 1],
      [-0.02647, 1],
      [-0.00477, 2],
      [-0.00193, 2],
      [-0.0043, 2],
      [-0.00388, 1],
      [0.00774, 0],
      [-0.00365, 1],
      [-0.00399, 1],
      [-0.00402, 1],
      [-0.00402, 1],
      [-0.00448, 2],
      [-0.00852, 1],
      [-0.0035, 2],
      [-0.00373, 1],
      [0.00929, 0],
      [-0.00297, 1],
      [-0.00365, 2],
      [-0.00055, 2],
      [-0.00338, 1]
    ],
    "red_o_points": [],
    "y_categories": ["N", "Y", "nan"],
    "blue_o_points": [],
    "blue_x_points": [
      [0.00097, 2],
      [-0.00246, 1],
      [0.01403, 0],
      [0.0186, 0],
      [0.02235, 0],
      [0.00259, 2],
      [0.00288, 2]
    ]
  },
  "QS_mulGraftNerve[Me]": {
    "red_x_points": [
      [-2e-5, 2],
      [-0.00023, 0],
      [-0.00027, 0],
      [-0.00028, 0],
      [-0.00022, 0],
      [-0.00024, 0],
      [-0.00018, 0],
      [-5e-5, 2],
      [-0.00014, 0],
      [-0.00016, 0],
      [-8e-5, 0],
      [-5e-5, 2],
      [0.00011, 1],
      [-5e-5, 2],
      [-0.00025, 0],
      [-8e-5, 2],
      [-0.00017, 0],
      [-0.00019, 0],
      [-5e-5, 2],
      [-5e-5, 2],
      [-0.0, 2],
      [-0.00022, 0],
      [-4e-5, 2],
      [-2e-5, 2],
      [-2e-5, 2],
      [-0.0002, 0],
      [-4e-5, 2],
      [-0.00022, 0],
      [-2e-5, 2],
      [0.0003, 1],
      [-0.00023, 0]
    ],
    "red_o_points": [],
    "y_categories": ["N", "NOT APPLICABLE", "nan"],
    "blue_o_points": [],
    "blue_x_points": [
      [0.00136, 1],
      [1e-5, 2],
      [0.00022, 1],
      [0.00021, 0],
      [2e-5, 2],
      [0.00039, 1],
      [0.00049, 1]
    ]
  },
  "QS_mulBpsurgeryType[Lysis]": {
    "red_x_points": [
      [-0.00239, 3],
      [-0.00462, 0],
      [-0.00736, 2],
      [-0.00468, 0],
      [-0.00448, 0],
      [-0.00761, 2],
      [-0.00471, 0],
      [-0.00226, 3],
      [-0.00483, 0],
      [-0.00408, 0],
      [-0.00475, 0],
      [-0.00257, 3],
      [0.01107, 1],
      [-0.00233, 3],
      [-0.00477, 0],
      [-0.0021, 3],
      [-0.0073, 2],
      [-0.0049, 0],
      [-0.00238, 3],
      [-0.00237, 3],
      [-0.00214, 3],
      [-0.00442, 0],
      [-0.00223, 3],
      [-0.0021, 3],
      [-0.00249, 3],
      [-0.00456, 0],
      [-0.00236, 3],
      [-0.00461, 0],
      [-0.00178, 3],
      [0.0124, 1],
      [-0.00712, 2]
    ],
    "red_o_points": [],
    "y_categories": ["N", "NOT APPLICABLE", "Y", "nan"],
    "blue_o_points": [],
    "blue_x_points": [
      [0.01929, 1],
      [-0.0009, 3],
      [0.01271, 1],
      [-0.00113, 0],
      [-0.00076, 3],
      [0.01416, 1],
      [0.01444, 1]
    ]
  },
  "QS_mulLysisSite[Trunk]": {
    "red_x_points": [
      [-0.00122, 3],
      [-0.00219, 0],
      [-0.00214, 0],
      [-0.00221, 0],
      [-0.00275, 0],
      [-0.00438, 2],
      [-0.00231, 0],
      [-0.0016, 3],
      [-0.00232, 0],
      [-0.00222, 0],
      [-0.00202, 0],
      [-0.00162, 3],
      [0.00727, 1],
      [-0.00144, 3],
      [-0.00234, 0],
      [-0.00149, 3],
      [-0.0049, 2],
      [-0.0025, 0],
      [-0.00146, 3],
      [-0.00146, 3],
      [-0.00166, 3],
      [-0.00233, 0],
      [-0.00156, 3],
      [-0.00141, 3],
      [-0.00148, 3],
      [-0.00197, 0],
      [-0.00133, 3],
      [-0.00245, 0],
      [-0.00137, 3],
      [0.00703, 1],
      [-0.00421, 2]
    ],
    "red_o_points": [],
    "y_categories": ["N", "NOT APPLICABLE", "Y", "nan"],
    "blue_o_points": [],
    "blue_x_points": [
      [0.00909, 1],
      [-0.00072, 3],
      [0.00741, 1],
      [-0.00093, 0],
      [-0.00074, 3],
      [0.0086, 1],
      [0.0078, 1]
    ]
  },
  "QS_mulGraftTrunk[UpperTrunk]": {
    "red_x_points": [
      [-0.00074, 3],
      [-0.00108, 0],
      [-0.00116, 0],
      [-0.00125, 0],
      [-0.00123, 0],
      [-0.00109, 0],
      [-0.00106, 0],
      [-0.00077, 3],
      [-0.00127, 0],
      [-0.00098, 0],
      [-0.00116, 0],
      [-0.00066, 3],
      [0.00274, 1],
      [-0.0007, 3],
      [-0.00342, 2],
      [-0.00057, 3],
      [-0.00116, 0],
      [-0.00134, 0],
      [-0.00072, 3],
      [-0.00085, 3],
      [-0.00077, 3],
      [-0.00095, 0],
      [-0.0009, 3],
      [-0.00069, 3],
      [-0.00072, 3],
      [-0.00108, 0],
      [-0.00069, 3],
      [-0.00132, 0],
      [-0.00075, 3],
      [0.00281, 1],
      [-0.00087, 0]
    ],
    "red_o_points": [],
    "y_categories": ["N", "NOT APPLICABLE", "Y", "nan"],
    "blue_o_points": [],
    "blue_x_points": [
      [0.00504, 1],
      [-0.00031, 3],
      [0.00316, 1],
      [-0.00045, 0],
      [-0.00015, 3],
      [0.00308, 1],
      [0.00396, 1]
    ]
  },
  "QS_mulTransfSite[PhMc]": {
    "red_x_points": [
      [-0.00112, 3],
      [-0.00184, 0],
      [-0.00157, 0],
      [-0.00178, 0],
      [-0.00185, 0],
      [-0.00171, 0],
      [-0.00362, 2],
      [-0.0011, 3],
      [-0.00182, 0],
      [-0.0019, 0],
      [-0.00173, 0],
      [-0.00112, 3],
      [0.00493, 1],
      [-0.00129, 3],
      [-0.00197, 0],
      [-0.00113, 3],
      [-0.00152, 0],
      [-0.00157, 0],
      [-0.00102, 3],
      [-0.00115, 3],
      [-0.00091, 3],
      [-0.0031, 2],
      [-0.00113, 3],
      [-0.00112, 3],
      [-0.00136, 3],
      [-0.0016, 0],
      [-0.00133, 3],
      [-0.00146, 0],
      [-0.00111, 3],
      [0.00483, 1],
      [-0.00176, 0]
    ],
    "red_o_points": [],
    "y_categories": ["N", "NOT APPLICABLE", "Y", "nan"],
    "blue_o_points": [],
    "blue_x_points": [
      [0.00792, 1],
      [-0.00046, 3],
      [0.0057, 1],
      [-0.00126, 0],
      [-0.00037, 3],
      [0.00506, 1],
      [0.00606, 1]
    ]
  },
  "QA_mulInjTbpiCause[Motorcycle]": {
    "red_x_points": [
      [0.00168, 0],
      [-0.00115, 1],
      [-0.00127, 1],
      [-0.00138, 1],
      [-0.00144, 1],
      [-0.00109, 1],
      [-0.00115, 1],
      [-0.00134, 1],
      [-0.00156, 1],
      [-0.00146, 1],
      [-0.00109, 1],
      [0.00181, 0],
      [-0.04004, 1],
      [-0.00143, 1],
      [-0.00151, 1],
      [-0.00135, 1],
      [-0.00125, 1],
      [-0.00202, 1],
      [0.00194, 0],
      [-0.00119, 1],
      [-0.0009, 1],
      [-0.00101, 1],
      [-0.00156, 1],
      [-0.00284, 1],
      [0.00224, 0],
      [-0.00117, 1],
      [-0.00113, 1],
      [-0.0009, 1],
      [-0.00145, 1],
      [-0.0391, 1],
      [-0.00112, 1]
    ],
    "red_o_points": [],
    "y_categories": ["N", "Y", "nan"],
    "blue_o_points": [],
    "blue_x_points": [
      [0.01933, 0],
      [-0.00109, 1],
      [0.01641, 0],
      [-0.00236, 1],
      [-0.00073, 1],
      [0.01766, 0],
      [0.01953, 0]
    ]
  },
  "QS_mulLysisRoot[C6]": {
    "red_x_points": [
      [-0.00106, 3],
      [-0.00197, 0],
      [-0.00328, 2],
      [-0.00159, 0],
      [-0.00182, 0],
      [-0.00174, 0],
      [-0.00164, 0],
      [-0.00112, 3],
      [-0.0017, 0],
      [-0.00185, 0],
      [-0.00173, 0],
      [-0.00096, 3],
      [0.0062, 1],
      [-0.00086, 3],
      [-0.00191, 0],
      [-0.00102, 3],
      [-0.00178, 0],
      [-0.00195, 0],
      [-0.00107, 3],
      [-0.0009, 3],
      [-0.00085, 3],
      [-0.00164, 0],
      [-0.00105, 3],
      [-0.00123, 3],
      [-0.00105, 3],
      [-0.00187, 0],
      [-0.00117, 3],
      [-0.00169, 0],
      [-0.00119, 3],
      [0.00475, 1],
      [-0.00328, 2]
    ],
    "red_o_points": [],
    "y_categories": ["N", "NOT APPLICABLE", "Y", "nan"],
    "blue_o_points": [],
    "blue_x_points": [
      [0.00657, 1],
      [-0.00034, 3],
      [0.00537, 1],
      [-0.00192, 0],
      [-0.00049, 3],
      [0.00655, 1],
      [0.00591, 1]
    ]
  },
  "QS_mulGraftLevel[Trunk]": {
    "red_x_points": [
      [-0.00025, 3],
      [-0.00047, 0],
      [-0.00048, 0],
      [-0.00041, 0],
      [-0.00037, 0],
      [-0.00044, 0],
      [-0.00045, 0],
      [-0.00024, 3],
      [-0.0005, 0],
      [-0.00054, 0],
      [-0.00041, 0],
      [-0.00034, 3],
      [0.00115, 1],
      [-0.00043, 3],
      [-0.00188, 2],
      [-0.00021, 3],
      [-0.00038, 0],
      [-0.00044, 0],
      [-0.00036, 3],
      [-0.00032, 3],
      [-0.00028, 3],
      [-0.00041, 0],
      [-0.00035, 3],
      [-0.00023, 3],
      [-0.00037, 3],
      [-0.00037, 0],
      [-0.00034, 3],
      [-0.00045, 0],
      [-0.00033, 3],
      [0.00156, 1],
      [-0.00036, 0]
    ],
    "red_o_points": [],
    "y_categories": ["N", "NOT APPLICABLE", "Y", "nan"],
    "blue_o_points": [],
    "blue_x_points": [
      [0.00157, 1],
      [-7e-5, 3],
      [0.00144, 1],
      [0.0001, 0],
      [-0.00012, 3],
      [0.00173, 1],
      [0.00159, 1]
    ]
  },
  "QS_mulGraftNerve[other]": {
    "red_x_points": [
      [-0.00054, 2],
      [-0.00108, 0],
      [-0.0011, 0],
      [-0.00118, 0],
      [-0.0013, 0],
      [-0.00134, 0],
      [-0.00116, 0],
      [-0.00051, 2],
      [-0.00132, 0],
      [-0.00131, 0],
      [-0.00125, 0],
      [-0.00045, 2],
      [0.00127, 1],
      [-0.00041, 2],
      [-0.0013, 0],
      [-0.00041, 2],
      [-0.00122, 0],
      [-0.00164, 0],
      [-0.00055, 2],
      [-0.00046, 2],
      [-0.00029, 2],
      [-0.00108, 0],
      [-0.00046, 2],
      [-0.00032, 2],
      [-0.00057, 2],
      [-0.00118, 0],
      [-0.00055, 2],
      [-0.00136, 0],
      [-0.00035, 2],
      [0.00261, 1],
      [-0.00113, 0]
    ],
    "red_o_points": [],
    "y_categories": ["N", "NOT APPLICABLE", "nan"],
    "blue_o_points": [],
    "blue_x_points": [
      [0.00563, 1],
      [-0.0002, 2],
      [0.00268, 1],
      [0.0002, 0],
      [-8e-5, 2],
      [0.00223, 1],
      [0.00335, 1]
    ]
  },
  "QS_mulTransfSite[AcSsAA]": {
    "red_x_points": [
      [-0.00362, 3],
      [-0.00899, 2],
      [-0.00357, 0],
      [-0.00833, 2],
      [-0.01019, 2],
      [-0.00362, 0],
      [-0.00355, 0],
      [-0.00353, 3],
      [-0.00365, 0],
      [-0.00945, 2],
      [-0.00365, 0],
      [-0.00337, 3],
      [0.01493, 1],
      [-0.00332, 3],
      [-0.01007, 2],
      [-0.00381, 3],
      [-0.00305, 0],
      [-0.0036, 0],
      [-0.0037, 3],
      [-0.00319, 3],
      [-0.00368, 3],
      [-0.00896, 2],
      [-0.00361, 3],
      [-0.00353, 3],
      [-0.00368, 3],
      [-0.00336, 0],
      [-0.0033, 3],
      [-0.0092, 2],
      [-0.00327, 3],
      [0.01661, 1],
      [-0.00337, 0]
    ],
    "red_o_points": [],
    "y_categories": ["N", "NOT APPLICABLE", "Y", "nan"],
    "blue_o_points": [],
    "blue_x_points": [
      [0.01978, 1],
      [-0.00152, 3],
      [0.01881, 1],
      [-0.00022, 0],
      [-0.00154, 3],
      [0.01684, 1],
      [0.01869, 1]
    ]
  },
  "QS_mulGraftNerve[Ax]": {
    "red_x_points": [
      [-7e-5, 2],
      [-3e-5, 0],
      [-7e-5, 0],
      [-8e-5, 0],
      [-6e-5, 0],
      [-3e-5, 0],
      [-2e-5, 0],
      [-5e-5, 0],
      [-3e-5, 0],
      [-8e-5, 0],
      [-0.0001, 2],
      [-8e-5, 2],
      [-8e-5, 0],
      [-0.00013, 2],
      [-5e-5, 0],
      [-7e-5, 0],
      [-0.00014, 2],
      [-8e-5, 2],
      [-0.00012, 2],
      [-5e-5, 0],
      [-8e-5, 2],
      [-0.00012, 2],
      [-6e-5, 2],
      [-8e-5, 0],
      [-3e-5, 2],
      [-6e-5, 0],
      [-5e-5, 2],
      [-5e-5, 0]
    ],
    "red_o_points": [],
    "y_categories": ["N", "NOT APPLICABLE", "nan"],
    "blue_o_points": [],
    "blue_x_points": [
      [0.00065, 1],
      [0.00015, 1],
      [3e-5, 0],
      [0.00015, 1],
      [0.00015, 1]
    ]
  },
  "QA_lstPexMuscstrength[WristFlex]": {
    "red_x_points": [
      [-0.00434, 1],
      [-0.00018, 2],
      [-0.00153, 1],
      [-0.00135, 1],
      [0.0003, 0],
      [0.00069, 0],
      [-0.00145, 1],
      [-0.00288, 0],
      [0.00073, 0],
      [0.00029, 0],
      [0.0003, 0],
      [-0.00248, 0],
      [-0.00088, 2],
      [0.00406, 2],
      [0.00014, 2],
      [-0.00275, 0],
      [9e-5, 2],
      [0.00039, 0],
      [-0.00274, 0],
      [-0.00432, 1],
      [-0.00253, 0],
      [-0.00142, 1],
      [0.00303, 2],
      [-0.01627, 1],
      [-0.00283, 0],
      [0.00039, 0],
      [-0.00541, 1],
      [0.00043, 0],
      [0.00361, 2],
      [0.00023, 2],
      [-0.00144, 1]
    ],
    "red_o_points": [],
    "y_categories": ["GREATER THAN OR EQUALS TO 3", "LESS THAN 3", "nan"],
    "blue_o_points": [],
    "blue_x_points": [
      [0.00029, 0],
      [0.00606, 2],
      [0.00226, 0],
      [0.00408, 0],
      [0.00642, 2],
      [0.00244, 0],
      [0.00224, 0]
    ]
  },
  "QS_mulNeuromadSite[C5]": {
    "red_x_points": [
      [-0.001, 2],
      [-0.00373, 0],
      [-0.00291, 0],
      [-0.00342, 0],
      [-0.00347, 0],
      [-0.00283, 0],
      [-0.00336, 0],
      [-0.00111, 2],
      [-0.00341, 0],
      [-0.00338, 0],
      [-0.00311, 0],
      [-0.00112, 2],
      [0.006, 1],
      [-0.00137, 2],
      [-0.00355, 0],
      [-0.00157, 2],
      [-0.0032, 0],
      [-0.00341, 0],
      [-0.0012, 2],
      [-0.00123, 2],
      [-0.00111, 2],
      [-0.00292, 0],
      [-0.00114, 2],
      [-0.00117, 2],
      [-0.00126, 2],
      [-0.00297, 0],
      [-0.00117, 2],
      [-0.0032, 0],
      [-0.00094, 2],
      [0.00646, 1],
      [-0.003, 0]
    ],
    "red_o_points": [],
    "y_categories": ["N", "NOT APPLICABLE", "nan"],
    "blue_o_points": [],
    "blue_x_points": [
      [0.01354, 1],
      [-6e-5, 2],
      [0.00745, 1],
      [9e-5, 0],
      [-5e-5, 2],
      [0.00688, 1],
      [0.00843, 1]
    ]
  },
  "QS_mulNeuromadSite[C7]": {
    "red_x_points": [
      [-0.00055, 2],
      [-0.00227, 0],
      [-0.00248, 0],
      [-0.00197, 0],
      [-0.00251, 0],
      [-0.00224, 0],
      [-0.00235, 0],
      [-0.00049, 2],
      [-0.00213, 0],
      [-0.00212, 0],
      [-0.00233, 0],
      [-0.0006, 2],
      [0.00359, 1],
      [-0.0006, 2],
      [-0.00248, 0],
      [-0.00066, 2],
      [-0.00183, 0],
      [-0.00265, 0],
      [-0.00078, 2],
      [-0.00056, 2],
      [-0.00041, 2],
      [-0.00208, 0],
      [-0.00068, 2],
      [-0.00068, 2],
      [-0.00069, 2],
      [-0.00258, 0],
      [-0.00061, 2],
      [-0.00221, 0],
      [-0.00039, 2],
      [0.00383, 1],
      [-0.00221, 0]
    ],
    "red_o_points": [],
    "y_categories": ["N", "NOT APPLICABLE", "nan"],
    "blue_o_points": [],
    "blue_x_points": [
      [0.00962, 1],
      [-0.0001, 2],
      [0.00442, 1],
      [0.00025, 0],
      [-5e-5, 2],
      [0.00393, 1],
      [0.0062, 1]
    ]
  },
  "QA_lstPexMuscstrength[WristExte]": {
    "red_x_points": [
      [-0.00283, 1],
      [-0.0004, 2],
      [-0.00167, 1],
      [-0.00163, 1],
      [0.00047, 0],
      [-0.0021, 1],
      [-0.00215, 1],
      [-0.00152, 0],
      [0.00148, 0],
      [0.0007, 0],
      [-0.00133, 1],
      [-0.00161, 0],
      [-0.00299, 2],
      [0.0026, 2],
      [2e-5, 2],
      [-0.00116, 0],
      [-0.00014, 2],
      [0.00064, 0],
      [-0.00153, 0],
      [-0.00326, 1],
      [-0.00134, 0],
      [-0.00173, 1],
      [0.0024, 2],
      [-0.00165, 0],
      [-0.00292, 1],
      [0.00089, 0],
      [-0.00431, 1],
      [0.00059, 0],
      [0.00218, 2],
      [-0.00304, 2],
      [-0.00198, 1]
    ],
    "red_o_points": [],
    "y_categories": ["GREATER THAN OR EQUALS TO 3", "LESS THAN 3", "nan"],
    "blue_o_points": [],
    "blue_x_points": [
      [0.00129, 0],
      [0.00366, 2],
      [0.00157, 0],
      [0.0033, 0],
      [0.00416, 2],
      [0.00138, 1],
      [0.00132, 0]
    ]
  },
  "QA_lstPexMuscstrength[ElbowExte]": {
    "red_x_points": [
      [-0.00409, 1],
      [-9e-5, 2],
      [0.00011, 1],
      [3e-5, 1],
      [-0.00113, 0],
      [0.00011, 1],
      [5e-5, 1],
      [-0.00355, 1],
      [-0.0022, 0],
      [-0.00066, 0],
      [2e-5, 1],
      [-0.00426, 1],
      [3e-5, 2],
      [0.0056, 2],
      [-4e-5, 2],
      [-0.00357, 1],
      [3e-5, 2],
      [0.00017, 1],
      [-0.00331, 0],
      [-0.00376, 1],
      [-0.00341, 0],
      [8e-5, 1],
      [0.00461, 2],
      [-0.0035, 0],
      [-0.00374, 0],
      [0.00049, 1],
      [-0.00355, 1],
      [-0.00055, 2],
      [-0.00315, 1],
      [3e-5, 2],
      [-1e-5, 1]
    ],
    "red_o_points": [],
    "y_categories": ["GREATER THAN OR EQUALS TO 3", "LESS THAN 3", "nan"],
    "blue_o_points": [],
    "blue_x_points": [
      [0.00037, 2],
      [0.00855, 2],
      [0.0, 0],
      [0.00189, 1],
      [0.0089, 2],
      [0.00015, 0],
      [0.00015, 0]
    ]
  },
  "QS_mulGraftNerve[SS]": {
    "red_x_points": [
      [-5e-5, 2],
      [-3e-5, 0],
      [-1e-5, 0],
      [-1e-5, 0],
      [-3e-5, 0],
      [-1e-5, 0],
      [-2e-5, 0],
      [-6e-5, 2],
      [-3e-5, 0],
      [-2e-5, 0],
      [-3e-5, 0],
      [-6e-5, 2],
      [-1e-5, 2],
      [-3e-5, 0],
      [-6e-5, 2],
      [-2e-5, 0],
      [-6e-5, 2],
      [-6e-5, 2],
      [-5e-5, 2],
      [-2e-5, 0],
      [-6e-5, 2],
      [-5e-5, 2],
      [-3e-5, 0],
      [-1e-5, 2],
      [-3e-5, 0],
      [-5e-5, 2],
      [0.00012, 1],
      [-3e-5, 0]
    ],
    "red_o_points": [],
    "y_categories": ["N", "NOT APPLICABLE", "nan"],
    "blue_o_points": [],
    "blue_x_points": [[0.00031, 1], [-2e-5, 0], [0.00012, 1], [0.00012, 1]]
  },
  "QS_mulLysisSite[Nerve]": {
    "red_x_points": [
      [-0.00011, 3],
      [-0.00028, 0],
      [-0.00069, 2],
      [-0.0002, 0],
      [-0.00026, 0],
      [-0.00026, 0],
      [-0.0002, 0],
      [-0.0001, 3],
      [-0.00029, 0],
      [-0.0002, 0],
      [-0.00026, 0],
      [-0.00012, 3],
      [0.0009, 1],
      [-8e-5, 3],
      [-0.00016, 0],
      [-0.0001, 3],
      [-0.00032, 0],
      [-0.0002, 0],
      [-0.00013, 3],
      [-0.00012, 3],
      [-0.00015, 3],
      [-0.00017, 0],
      [-0.0001, 3],
      [-0.00014, 3],
      [-0.00012, 3],
      [-0.00026, 0],
      [-0.0001, 3],
      [-0.00027, 0],
      [-0.00012, 3],
      [0.00069, 1],
      [-0.00025, 0]
    ],
    "red_o_points": [],
    "y_categories": ["N", "NOT APPLICABLE", "Y", "nan"],
    "blue_o_points": [],
    "blue_x_points": [
      [0.00099, 1],
      [-0.0001, 3],
      [0.00099, 1],
      [-0.00025, 0],
      [-8e-5, 3],
      [0.00067, 1],
      [0.00056, 1]
    ]
  },
  "QS_mulTransfSite[IMc]": {
    "red_x_points": [
      [-0.00252, 3],
      [-0.00752, 2],
      [-0.00434, 0],
      [-0.0047, 0],
      [-0.00495, 0],
      [-0.00424, 0],
      [-0.00463, 0],
      [-0.00256, 3],
      [-0.00467, 0],
      [-0.00465, 0],
      [-0.0045, 0],
      [-0.0029, 3],
      [0.01165, 1],
      [-0.00218, 3],
      [-0.00485, 0],
      [-0.00276, 3],
      [-0.00802, 2],
      [-0.00454, 0],
      [-0.00295, 3],
      [-0.00262, 3],
      [-0.00234, 3],
      [-0.00449, 0],
      [-0.00233, 3],
      [-0.00251, 3],
      [-0.00286, 3],
      [-0.00464, 0],
      [-0.00235, 3],
      [-0.00757, 2],
      [-0.00199, 3],
      [0.01323, 1],
      [-0.0071, 2]
    ],
    "red_o_points": [],
    "y_categories": ["N", "NOT APPLICABLE", "Y", "nan"],
    "blue_o_points": [],
    "blue_x_points": [
      [0.01858, 1],
      [-0.00065, 3],
      [0.01439, 1],
      [-0.00219, 0],
      [-0.00078, 3],
      [0.01492, 1],
      [0.01626, 1]
    ]
  },
  "QS_mulLysisRoot[C7]": {
    "red_x_points": [
      [-0.00033, 3],
      [-0.00037, 0],
      [-0.00124, 2],
      [-0.00042, 0],
      [-0.0005, 0],
      [-0.00047, 0],
      [-0.00042, 0],
      [-0.00039, 3],
      [-0.00037, 0],
      [-0.00043, 0],
      [-0.00042, 0],
      [-0.00033, 3],
      [0.00136, 1],
      [-0.00036, 3],
      [-0.00037, 0],
      [-0.00037, 3],
      [-0.00041, 0],
      [-0.00037, 0],
      [-0.0005, 3],
      [-0.0003, 3],
      [-0.00048, 3],
      [-0.00041, 0],
      [-0.00038, 3],
      [-0.00041, 3],
      [-0.00042, 3],
      [-0.00043, 0],
      [-0.00039, 3],
      [-0.00045, 0],
      [-0.00039, 3],
      [0.0015, 1],
      [-0.00038, 0]
    ],
    "red_o_points": [],
    "y_categories": ["N", "NOT APPLICABLE", "Y", "nan"],
    "blue_o_points": [],
    "blue_x_points": [
      [0.00204, 1],
      [-0.00018, 3],
      [0.00172, 1],
      [-0.0005, 0],
      [-3e-5, 3],
      [0.00172, 1],
      [0.00169, 1]
    ]
  },
  "QS_lstBpsurgSide": {
    "red_x_points": [
      [-0.00428, 3],
      [-0.00713, 0],
      [-0.00719, 0],
      [-0.0071, 0],
      [-0.0157, 2],
      [-0.00682, 0],
      [-0.00692, 0],
      [-0.00444, 3],
      [-0.00684, 0],
      [-0.01391, 2],
      [-0.01401, 2],
      [-0.00445, 3],
      [0.02291, 1],
      [-0.00461, 3],
      [-0.01556, 2],
      [-0.00475, 3],
      [-0.0142, 2],
      [-0.01567, 2],
      [-0.00454, 3],
      [-0.00425, 3],
      [-0.0043, 3],
      [-0.00739, 0],
      [-0.00496, 3],
      [-0.00433, 3],
      [-0.00487, 3],
      [-0.01459, 2],
      [-0.0042, 3],
      [-0.0132, 2],
      [-0.00408, 3],
      [0.0261, 1],
      [-0.00695, 0]
    ],
    "red_o_points": [],
    "y_categories": ["L", "NOT APPLICABLE", "R", "nan"],
    "blue_o_points": [],
    "blue_x_points": [
      [0.03654, 1],
      [-0.00131, 3],
      [0.02486, 1],
      [0.00175, 0],
      [-0.00118, 3],
      [0.02666, 1],
      [0.03073, 1]
    ]
  },
  "QS_mulTransfSite[AcMc]": {
    "red_x_points": [
      [-0.00041, 3],
      [-0.00076, 0],
      [-0.00066, 0],
      [-0.00067, 0],
      [-0.00079, 0],
      [-0.00068, 0],
      [-0.00069, 0],
      [-0.0004, 3],
      [-0.00075, 0],
      [-0.00074, 0],
      [-0.00167, 2],
      [-0.00039, 3],
      [0.00225, 1],
      [-0.00036, 3],
      [-0.0007, 0],
      [-0.00046, 3],
      [-0.00064, 0],
      [-0.00069, 0],
      [-0.00032, 3],
      [-0.00036, 3],
      [-0.00042, 3],
      [-0.0006, 0],
      [-0.00039, 3],
      [-0.0004, 3],
      [-0.00045, 3],
      [-0.00063, 0],
      [-0.00024, 3],
      [-0.00065, 0],
      [-0.00035, 3],
      [0.00262, 1],
      [-0.00049, 0]
    ],
    "red_o_points": [],
    "y_categories": ["N", "NOT APPLICABLE", "Y", "nan"],
    "blue_o_points": [],
    "blue_x_points": [
      [0.00237, 1],
      [-0.00025, 3],
      [0.00224, 1],
      [-0.00075, 0],
      [-0.00024, 3],
      [0.00229, 1],
      [0.0026, 1]
    ]
  },
  "QS_mulTransfSite[Other]": {
    "red_x_points": [
      [-0.00027, 3],
      [-0.00056, 0],
      [-0.00055, 0],
      [-0.00053, 0],
      [-0.00044, 0],
      [-0.00049, 0],
      [-0.00055, 0],
      [-0.00051, 3],
      [-0.00048, 0],
      [-0.00056, 0],
      [-0.00051, 0],
      [-0.00035, 3],
      [0.00123, 1],
      [-0.00021, 3],
      [-0.00059, 0],
      [-0.0004, 3],
      [-0.00059, 0],
      [-0.0037, 2],
      [-0.0002, 3],
      [-0.00026, 3],
      [-0.00043, 3],
      [-0.00055, 0],
      [-0.00027, 3],
      [-0.00039, 3],
      [-0.00047, 3],
      [-0.00035, 0],
      [-0.00033, 3],
      [-0.0005, 0],
      [-0.0004, 3],
      [0.00194, 1],
      [-0.00048, 0]
    ],
    "red_o_points": [],
    "y_categories": ["N", "NOT APPLICABLE", "Y", "nan"],
    "blue_o_points": [],
    "blue_x_points": [
      [0.00187, 1],
      [-0.00012, 3],
      [0.00224, 1],
      [0.00053, 0],
      [-0.0, 3],
      [0.00204, 1],
      [0.00216, 1]
    ]
  },
  "QA_yonInjBpsurg": {
    "red_x_points": [
      [-0.00362, 1],
      [-0.00304, 1],
      [-0.00369, 1],
      [-0.00345, 1],
      [-0.00379, 1],
      [-0.0032, 1],
      [-0.00344, 1],
      [-0.00347, 1],
      [-0.00373, 1],
      [-0.0034, 1],
      [-0.00322, 1],
      [-0.0037, 1],
      [0.00649, 0],
      [-0.00332, 1],
      [-0.00329, 1],
      [-0.00345, 1],
      [-0.00266, 1],
      [-0.00345, 1],
      [-0.00393, 1],
      [-0.00314, 1],
      [-0.00286, 1],
      [-0.00299, 1],
      [-0.00373, 1],
      [-0.00377, 1],
      [-0.00402, 1],
      [-0.00329, 1],
      [-0.00351, 1],
      [-0.0032, 1],
      [-0.00345, 1],
      [0.00934, 0],
      [-0.00315, 1]
    ],
    "red_o_points": [],
    "y_categories": ["N", "Y", "nan"],
    "blue_o_points": [],
    "blue_x_points": [
      [0.02093, 0],
      [-0.00058, 1],
      [0.01102, 0],
      [-0.00262, 1],
      [-0.00074, 1],
      [0.01133, 0],
      [0.01324, 0]
    ]
  },
  "QS_mulLysisNerve[Ssr]": {
    "red_x_points": [
      [-0.00023, 3],
      [-0.00047, 0],
      [-0.00103, 2],
      [-0.0004, 0],
      [-0.00043, 0],
      [-0.00037, 0],
      [-0.00046, 0],
      [-0.00026, 3],
      [-0.00041, 0],
      [-0.00044, 0],
      [-0.00035, 0],
      [-0.00016, 3],
      [0.00104, 1],
      [-0.00018, 3],
      [-0.00045, 0],
      [-0.00027, 3],
      [-0.00042, 0],
      [-0.00042, 0],
      [-0.00024, 3],
      [-0.00021, 3],
      [-0.00017, 3],
      [-0.00042, 0],
      [-0.00019, 3],
      [-0.00028, 3],
      [-0.00018, 3],
      [-0.00054, 0],
      [-0.00019, 3],
      [-0.00047, 0],
      [-0.00022, 3],
      [0.00143, 1],
      [-0.00043, 0]
    ],
    "red_o_points": [],
    "y_categories": ["N", "NOT APPLICABLE", "Y", "nan"],
    "blue_o_points": [],
    "blue_x_points": [
      [0.00117, 1],
      [-0.0001, 3],
      [0.00141, 1],
      [-0.00055, 0],
      [-0.00013, 3],
      [0.00181, 1],
      [0.0012, 1]
    ]
  },
  "QS_mulBpsurgeryType[Graft]": {
    "red_x_points": [
      [-6e-5, 3],
      [-0.00027, 0],
      [-0.00019, 0],
      [-0.00027, 0],
      [-0.00019, 0],
      [-0.00024, 0],
      [-0.00024, 0],
      [-0.00017, 3],
      [-0.00026, 0],
      [-0.00021, 0],
      [-0.00021, 0],
      [-0.00015, 3],
      [0.00041, 1],
      [-0.00011, 3],
      [-0.00145, 2],
      [-0.00014, 3],
      [-0.00022, 0],
      [-0.00021, 0],
      [-0.00016, 3],
      [-0.0001, 3],
      [-0.00013, 3],
      [-0.0003, 0],
      [-0.00011, 3],
      [-0.00011, 3],
      [-0.00015, 3],
      [-0.00023, 0],
      [-0.00013, 3],
      [-0.00026, 0],
      [-0.00015, 3],
      [0.00031, 1],
      [-0.00024, 0]
    ],
    "red_o_points": [],
    "y_categories": ["N", "NOT APPLICABLE", "Y", "nan"],
    "blue_o_points": [],
    "blue_x_points": [
      [0.00079, 1],
      [7e-5, 3],
      [0.00066, 1],
      [0.00036, 0],
      [2e-5, 3],
      [0.00097, 1],
      [0.00068, 1]
    ]
  },
  "QS_mulLysisRoot[C5]": {
    "red_x_points": [
      [-0.00093, 3],
      [-0.00175, 0],
      [-0.00307, 2],
      [-0.0017, 0],
      [-0.00166, 0],
      [-0.00188, 0],
      [-0.00171, 0],
      [-0.00087, 3],
      [-0.00171, 0],
      [-0.00155, 0],
      [-0.00173, 0],
      [-0.00086, 3],
      [0.00455, 1],
      [-0.00093, 3],
      [-0.00193, 0],
      [-0.00106, 3],
      [-0.00177, 0],
      [-0.00186, 0],
      [-0.00105, 3],
      [-0.00102, 3],
      [-0.00099, 3],
      [-0.00162, 0],
      [-0.00097, 3],
      [-0.00085, 3],
      [-0.00088, 3],
      [-0.00162, 0],
      [-0.00099, 3],
      [-0.00161, 0],
      [-0.0008, 3],
      [0.00542, 1],
      [-0.00312, 2]
    ],
    "red_o_points": [],
    "y_categories": ["N", "NOT APPLICABLE", "Y", "nan"],
    "blue_o_points": [],
    "blue_x_points": [
      [0.00798, 1],
      [-0.00041, 3],
      [0.00526, 1],
      [-0.00155, 0],
      [-0.0004, 3],
      [0.0049, 1],
      [0.00483, 1]
    ]
  },
  "QS_mulNeuromadSite[C6]": {
    "red_x_points": [
      [-0.00079, 2],
      [-0.0019, 0],
      [-0.00229, 0],
      [-0.0021, 0],
      [-0.00229, 0],
      [-0.00205, 0],
      [-0.00224, 0],
      [-0.0005, 2],
      [-0.00223, 0],
      [-0.00184, 0],
      [-0.0021, 0],
      [-0.00075, 2],
      [0.00345, 1],
      [-0.00066, 2],
      [-0.00214, 0],
      [-0.00109, 2],
      [-0.00194, 0],
      [-0.00184, 0],
      [-0.00107, 2],
      [-0.00077, 2],
      [-0.00085, 2],
      [-0.00166, 0],
      [-0.0008, 2],
      [-0.00119, 2],
      [-0.00085, 2],
      [-0.00186, 0],
      [-0.00064, 2],
      [-0.00213, 0],
      [-0.00035, 2],
      [0.00306, 1],
      [-0.00165, 0]
    ],
    "red_o_points": [],
    "y_categories": ["N", "NOT APPLICABLE", "nan"],
    "blue_o_points": [],
    "blue_x_points": [
      [0.00919, 1],
      [0.00022, 2],
      [0.00444, 1],
      [0.00029, 0],
      [-2e-5, 2],
      [0.00363, 1],
      [0.00492, 1]
    ]
  },
  "QS_mulNeuromadSite[T1]": {
    "red_x_points": [
      [-0.00144, 2],
      [-0.00482, 0],
      [-0.00455, 0],
      [-0.00461, 0],
      [-0.00434, 0],
      [-0.00445, 0],
      [-0.00451, 0],
      [-0.00155, 2],
      [-0.0038, 0],
      [-0.0047, 0],
      [-0.00442, 0],
      [-0.00167, 2],
      [0.00709, 1],
      [-0.00119, 2],
      [-0.00416, 0],
      [-0.00157, 2],
      [-0.00409, 0],
      [-0.00494, 0],
      [-0.00159, 2],
      [-0.00139, 2],
      [-0.00123, 2],
      [-0.00376, 0],
      [-0.00153, 2],
      [-0.00152, 2],
      [-0.00172, 2],
      [-0.00441, 0],
      [-0.00141, 2],
      [-0.00375, 0],
      [-0.00114, 2],
      [0.00772, 1],
      [-0.00465, 0]
    ],
    "red_o_points": [],
    "y_categories": ["N", "NOT APPLICABLE", "nan"],
    "blue_o_points": [],
    "blue_x_points": [
      [0.01647, 1],
      [0.0001, 2],
      [0.01027, 1],
      [-8e-5, 0],
      [-0.00021, 2],
      [0.01015, 1],
      [0.01229, 1]
    ]
  },
  "QA_lstPexMuscstrength[ShoulderAbduc]": {
    "red_x_points": [
      [-0.00742, 1],
      [-0.0074, 1],
      [-0.00715, 1],
      [-0.00695, 1],
      [-0.0078, 1],
      [-0.00739, 1],
      [-0.00713, 1],
      [-0.00703, 1],
      [-0.00718, 1],
      [-0.00699, 1],
      [-0.00689, 1],
      [-0.00721, 1],
      [0.00244, 2],
      [0.00646, 2],
      [0.00586, 2],
      [0.00648, 2],
      [0.00586, 2],
      [-0.00682, 1],
      [-0.00755, 1],
      [-0.00727, 1],
      [-0.00679, 1],
      [-0.00698, 1],
      [0.00597, 2],
      [-0.0103, 1],
      [-0.00689, 1],
      [-0.00717, 1],
      [-0.0075, 1],
      [-0.00701, 1],
      [-0.00735, 1],
      [0.00209, 2],
      [-0.00689, 1]
    ],
    "red_o_points": [],
    "y_categories": ["GREATER THAN OR EQUALS TO 3", "LESS THAN 3", "nan"],
    "blue_o_points": [],
    "blue_x_points": [
      [0.00451, 2],
      [0.00649, 2],
      [0.03018, 0],
      [0.00728, 2],
      [0.00636, 2],
      [0.03081, 0],
      [-0.00067, 1]
    ]
  },
  "QS_mulGraftNerve[IS]": {
    "red_x_points": [
      [-2e-5, 2],
      [-0.00015, 0],
      [-6e-5, 0],
      [-0.00014, 0],
      [-6e-5, 0],
      [-0.0001, 0],
      [-9e-5, 0],
      [-3e-5, 2],
      [-0.0001, 0],
      [-6e-5, 0],
      [-9e-5, 0],
      [-6e-5, 2],
      [-5e-5, 1],
      [-6e-5, 2],
      [-0.00015, 0],
      [-6e-5, 2],
      [-5e-5, 0],
      [-6e-5, 0],
      [-6e-5, 2],
      [-5e-5, 2],
      [-5e-5, 2],
      [-0.00014, 0],
      [-6e-5, 2],
      [-4e-5, 2],
      [-6e-5, 2],
      [-9e-5, 0],
      [-5e-5, 2],
      [-0.00015, 0],
      [-5e-5, 2],
      [0.00033, 1],
      [-0.00014, 0]
    ],
    "red_o_points": [],
    "y_categories": ["N", "NOT APPLICABLE", "nan"],
    "blue_o_points": [],
    "blue_x_points": [
      [0.00052, 1],
      [-5e-5, 2],
      [0.00022, 1],
      [5e-5, 0],
      [-0.0, 2],
      [0.00033, 1],
      [0.00024, 1]
    ]
  },
  "QS_mulGraftNerve[MC]": {
    "red_x_points": [
      [-1e-5, 2],
      [-1e-5, 0],
      [-2e-5, 0],
      [-2e-5, 0],
      [-1e-5, 0],
      [-2e-5, 0],
      [-2e-5, 0],
      [-9e-5, 2],
      [-2e-5, 0],
      [-0.0, 0],
      [-1e-5, 0],
      [-1e-5, 2],
      [-1e-5, 2],
      [-1e-5, 0],
      [-9e-5, 2],
      [-2e-5, 0],
      [-1e-5, 2],
      [-2e-5, 2],
      [-9e-5, 2],
      [-1e-5, 0],
      [-1e-5, 2],
      [-1e-5, 2],
      [-1e-5, 2],
      [-1e-5, 0],
      [-2e-5, 2],
      [-1e-5, 0],
      [-1e-5, 2],
      [-1e-5, 0]
    ],
    "red_o_points": [],
    "y_categories": ["N", "NOT APPLICABLE", "nan"],
    "blue_o_points": [],
    "blue_x_points": [[0.00031, 1], [-0.0, 0], [0.00031, 1]]
  },
  "QS_mulNeuromadSite[C4]": {
    "red_x_points": [
      [-0.00056, 2],
      [-0.0017, 0],
      [-0.0017, 0],
      [-0.00133, 0],
      [-0.00155, 0],
      [-0.00168, 0],
      [-0.00143, 0],
      [-0.00053, 2],
      [-0.00168, 0],
      [-0.00141, 0],
      [-0.00131, 0],
      [-0.00056, 2],
      [0.00211, 1],
      [-0.00057, 2],
      [-0.00144, 0],
      [-0.00043, 2],
      [-0.00135, 0],
      [-0.00173, 0],
      [-0.00056, 2],
      [-0.00047, 2],
      [-0.00045, 2],
      [-0.00113, 0],
      [-0.00048, 2],
      [-0.00069, 2],
      [-0.00065, 2],
      [-0.00184, 0],
      [-0.00048, 2],
      [-0.00155, 0],
      [-0.00035, 2],
      [0.00309, 1],
      [-0.00142, 0]
    ],
    "red_o_points": [],
    "y_categories": ["N", "NOT APPLICABLE", "nan"],
    "blue_o_points": [],
    "blue_x_points": [
      [0.00662, 1],
      [-9e-5, 2],
      [0.00374, 1],
      [0.00029, 0],
      [-4e-5, 2],
      [0.00279, 1],
      [0.00304, 1]
    ]
  },
  "QS_mulGraftNerve[Ra]": {
    "red_x_points": [
      [-9e-5, 2],
      [-0.00019, 0],
      [-0.00025, 0],
      [-0.00022, 0],
      [-0.00022, 0],
      [-0.00029, 0],
      [-0.0003, 0],
      [-4e-5, 2],
      [-0.00027, 0],
      [-0.00029, 0],
      [-0.0003, 0],
      [-9e-5, 2],
      [0.00018, 1],
      [-8e-5, 2],
      [-0.00026, 0],
      [-8e-5, 2],
      [-0.00019, 0],
      [-0.00015, 0],
      [-7e-5, 2],
      [-9e-5, 2],
      [2e-5, 2],
      [-9e-5, 0],
      [-9e-5, 2],
      [-2e-5, 2],
      [-4e-5, 2],
      [-0.00021, 0],
      [-0.00012, 2],
      [-0.0002, 0],
      [-6e-5, 2],
      [0.00028, 1],
      [-0.00021, 0]
    ],
    "red_o_points": [],
    "y_categories": ["N", "NOT APPLICABLE", "nan"],
    "blue_o_points": [],
    "blue_x_points": [
      [0.00147, 1],
      [6e-5, 2],
      [0.00027, 1],
      [5e-5, 0],
      [2e-5, 2],
      [0.00032, 1],
      [0.00062, 1]
    ]
  },
  "QS_mulTransfSite[Oberlin]": {
    "red_x_points": [
      [-0.00407, 3],
      [-0.01158, 0],
      [-0.01244, 0],
      [-0.01246, 0],
      [-0.00642, 2],
      [-0.0058, 2],
      [-0.0124, 0],
      [-0.00365, 3],
      [-0.00557, 2],
      [-0.00656, 2],
      [-0.00543, 2],
      [-0.00384, 3],
      [0.02158, 1],
      [-0.00436, 3],
      [-0.00605, 2],
      [-0.0043, 3],
      [-0.01209, 0],
      [-0.00628, 2],
      [-0.00376, 3],
      [-0.00389, 3],
      [-0.00395, 3],
      [-0.01156, 0],
      [-0.00447, 3],
      [-0.00334, 3],
      [-0.00393, 3],
      [-0.00587, 2],
      [-0.00391, 3],
      [-0.01208, 0],
      [-0.00381, 3],
      [0.02097, 1],
      [-0.01203, 0]
    ],
    "red_o_points": [],
    "y_categories": ["N", "NOT APPLICABLE", "Y", "nan"],
    "blue_o_points": [],
    "blue_x_points": [
      [0.02941, 1],
      [-0.00213, 3],
      [0.02315, 1],
      [-0.00011, 2],
      [-0.00156, 3],
      [0.02258, 1],
      [0.02555, 1]
    ]
  },
  "QS_mulGraftNerve[FI]": {
    "red_x_points": [
      [-0.00034, 2],
      [-0.0007, 0],
      [-0.00078, 0],
      [-0.00067, 0],
      [-0.00079, 0],
      [-0.00063, 0],
      [-0.00069, 0],
      [-0.00039, 2],
      [-0.00078, 0],
      [-0.00086, 0],
      [-0.00064, 0],
      [-0.00045, 2],
      [0.00057, 1],
      [-0.00029, 2],
      [-0.00075, 0],
      [-0.00043, 2],
      [-0.00071, 0],
      [-0.00084, 0],
      [-0.00033, 2],
      [-0.00033, 2],
      [-0.00013, 2],
      [-0.00056, 0],
      [-0.00048, 2],
      [-0.00043, 2],
      [-0.00046, 2],
      [-0.00073, 0],
      [-0.0003, 2],
      [-0.00077, 0],
      [-0.00016, 2],
      [0.0011, 1],
      [-0.00047, 0]
    ],
    "red_o_points": [],
    "y_categories": ["N", "NOT APPLICABLE", "nan"],
    "blue_o_points": [],
    "blue_x_points": [
      [0.00418, 1],
      [-2e-5, 2],
      [0.00158, 1],
      [0.00019, 0],
      [-1e-5, 2],
      [0.00141, 1],
      [0.00157, 1]
    ]
  }
}
