{
  "QA_lstPexPain[C8]": {
    "red_x_points": [
      [0.00734, 0],
      [-0.00485, 2],
      [-0.0054, 2],
      [0.00635, 0],
      [-0.00497, 2],
      [-0.00632, 1],
      [-0.00847, 1],
      [-0.00924, 1],
      [-0.00761, 2],
      [-0.00678, 2],
      [-0.00888, 2],
      [-0.00518, 2],
      [-0.01006, 1],
      [0.00637, 0],
      [-0.00849, 1],
      [-0.00742, 1],
      [-0.0048, 2],
      [-0.00706, 2],
      [-0.00706, 2],
      [-0.00543, 2],
      [-0.01017, 1],
      [-0.00554, 1],
      [-0.01069, 1]
    ],
    "red_o_points": [],
    "y_categories": ["NORM", "NPV", "nan"],
    "blue_o_points": [],
    "blue_x_points": [
      [-0.00682, 1],
      [-0.00572, 1],
      [0.00961, 0],
      [-0.00061, 1],
      [0.01468, 0],
      [0.01416, 0],
      [0.01263, 0],
      [0.01117, 0],
      [-0.00503, 2],
      [-0.0007, 2],
      [-0.00364, 2],
      [-0.00252, 1],
      [-0.00434, 2],
      [0.01201, 0],
      [0.01258, 0],
      [0.01222, 0],
      [-0.0048, 2],
      [0.01153, 0],
      [0.01325, 0],
      [0.01777, 0],
      [0.01696, 0]
    ]
  },
  "QA_lstPexPain[C7]": {
    "red_x_points": [
      [-0.00983, 1],
      [-0.00843, 2],
      [-0.00802, 2],
      [-0.00941, 1],
      [-0.00831, 2],
      [-0.00693, 1],
      [-0.00793, 1],
      [-0.009, 1],
      [-0.01005, 2],
      [-0.00971, 2],
      [-0.01111, 2],
      [-0.00862, 2],
      [-0.00858, 1],
      [0.01521, 0],
      [-0.00906, 1],
      [-0.00741, 1],
      [-0.0076, 2],
      [-0.01056, 2],
      [-0.01035, 2],
      [-0.009, 2],
      [-0.01048, 1],
      [-0.00657, 1],
      [-0.00914, 1]
    ],
    "red_o_points": [],
    "y_categories": ["NORM", "NPV", "nan"],
    "blue_o_points": [],
    "blue_x_points": [
      [-0.00718, 1],
      [-0.00626, 1],
      [0.02262, 0],
      [-0.0046, 1],
      [0.0292, 0],
      [-0.00549, 1],
      [0.02653, 0],
      [0.02516, 0],
      [-0.00908, 2],
      [-0.00543, 2],
      [-0.00753, 2],
      [-0.00539, 1],
      [-0.00723, 2],
      [0.02234, 0],
      [0.0229, 0],
      [0.02247, 0],
      [-0.00741, 2],
      [0.02399, 0],
      [0.02842, 0],
      [-0.00646, 1],
      [0.02931, 0]
    ]
  },
  "QS_mulTransfSite[TrAx]": {
    "red_x_points": [
      [-7e-5, 1],
      [-9e-5, 0],
      [3e-5, 0],
      [5e-5, 2],
      [-0.0001, 0],
      [-9e-5, 0],
      [-0.0001, 1],
      [0.0, 2],
      [-9e-5, 0],
      [-0.00015, 1],
      [0.0, 2]
    ],
    "red_o_points": [],
    "y_categories": ["N", "NOT APPLICABLE", "nan"],
    "blue_o_points": [],
    "blue_x_points": [
      [5e-5, 2],
      [5e-5, 0],
      [5e-5, 2],
      [0.00021, 1],
      [0.00013, 0],
      [0.0, 2],
      [5e-5, 2],
      [5e-5, 2],
      [0.0, 2]
    ]
  },
  "QA_lstPexKine[Index]": {
    "red_x_points": [
      [-0.00018, 1],
      [-0.00076, 2],
      [-0.00262, 2],
      [0.00146, 1],
      [-0.0019, 2],
      [-0.01031, 0],
      [-0.00035, 1],
      [8e-5, 1],
      [-0.00059, 2],
      [0.00077, 1],
      [-0.00143, 2],
      [-0.00102, 2],
      [-0.00154, 2],
      [0.00127, 1],
      [0.00035, 1],
      [-0.00218, 0],
      [-0.00097, 2],
      [-0.00148, 2],
      [-0.00351, 2],
      [-0.00071, 2],
      [-0.00052, 2],
      [-0.00702, 0],
      [-0.002, 2]
    ],
    "red_o_points": [],
    "y_categories": ["NPV", "PV", "nan"],
    "blue_o_points": [],
    "blue_x_points": [
      [0.00493, 0],
      [-0.0008, 2],
      [0.00089, 1],
      [0.00486, 1],
      [-0.00019, 2],
      [0.00625, 1],
      [0.00215, 1],
      [0.00337, 1],
      [-0.00014, 2],
      [-2e-5, 2],
      [-0.00066, 2],
      [0.00657, 1],
      [-8e-5, 2],
      [0.00103, 1],
      [0.00058, 1],
      [0.00206, 0],
      [-0.00029, 2],
      [0.00041, 1],
      [0.00012, 2],
      [0.00274, 1],
      [0.00136, 1]
    ]
  },
  "QA_yonInjDisloc": {
    "red_x_points": [
      [-2e-5, 2],
      [-2e-5, 2],
      [-6e-5, 2],
      [0.0, 2],
      [-2e-5, 2],
      [-5e-5, 2],
      [-8e-5, 2],
      [-9e-5, 2],
      [-3e-5, 2],
      [-3e-5, 2],
      [1e-5, 2],
      [-4e-5, 2],
      [-2e-5, 2],
      [-4e-5, 2],
      [-0.00929, 1],
      [-7e-5, 2],
      [-4e-5, 2],
      [-6e-5, 2],
      [0.0, 2],
      [-0.0, 2],
      [-4e-5, 2],
      [-0.00541, 1],
      [-2e-5, 2]
    ],
    "red_o_points": [],
    "y_categories": ["N", "Y", "nan"],
    "blue_o_points": [],
    "blue_x_points": [
      [3e-5, 2],
      [-3e-5, 2],
      [2e-5, 2],
      [2e-5, 2],
      [3e-5, 2],
      [5e-5, 2],
      [-0.0, 2],
      [3e-5, 2],
      [0.00024, 2],
      [0.00024, 2],
      [-3e-5, 2],
      [0.00021, 2],
      [0.00689, 0],
      [0.00736, 0],
      [5e-5, 2],
      [4e-5, 2],
      [-3e-5, 2],
      [-0.0, 2],
      [0.00032, 2],
      [-1e-5, 2],
      [-2e-5, 2]
    ]
  },
  "QA_lstPexTouch[C7]": {
    "red_x_points": [
      [-0.01119, 1],
      [-0.0035, 2],
      [-0.00736, 1],
      [-0.00827, 1],
      [-0.00312, 2],
      [-0.00666, 1],
      [-0.00978, 1],
      [-0.0106, 1],
      [-0.00359, 2],
      [-0.00457, 2],
      [-0.01234, 1],
      [-0.00332, 2],
      [-0.01095, 1],
      [0.00599, 0],
      [-0.01016, 1],
      [-0.00871, 1],
      [-0.00259, 2],
      [0.00792, 0],
      [-0.0076, 1],
      [-0.00396, 2],
      [-0.01195, 1],
      [-0.00645, 1],
      [-0.0122, 1]
    ],
    "red_o_points": [],
    "y_categories": ["NORM", "NPV", "nan"],
    "blue_o_points": [],
    "blue_x_points": [
      [-0.00722, 1],
      [-0.00827, 1],
      [0.01596, 0],
      [-0.00507, 1],
      [0.01826, 0],
      [-0.00546, 1],
      [0.01859, 0],
      [-0.00508, 1],
      [0.00062, 2],
      [0.00269, 2],
      [-0.00127, 2],
      [-0.00535, 1],
      [0.00174, 2],
      [0.01514, 0],
      [0.01396, 0],
      [0.01609, 0],
      [0.00178, 2],
      [0.01398, 0],
      [0.02249, 0],
      [0.02047, 0],
      [0.02093, 0]
    ]
  },
  "QA_lstPexTouch[C6]": {
    "red_x_points": [
      [-0.00598, 1],
      [-0.00289, 2],
      [-0.00374, 1],
      [-0.00319, 1],
      [-0.00211, 2],
      [-0.00293, 1],
      [-0.00276, 1],
      [-0.00453, 1],
      [-0.00232, 2],
      [-0.00224, 2],
      [-0.00487, 1],
      [-0.00151, 2],
      [-0.0044, 1],
      [-0.00376, 1],
      [-0.00534, 1],
      [-0.00238, 1],
      [-0.00167, 2],
      [-0.00591, 1],
      [-0.00357, 1],
      [-0.00398, 2],
      [-0.00514, 1],
      [-0.00211, 1],
      [-0.00504, 1]
    ],
    "red_o_points": [],
    "y_categories": ["NORM", "NPV", "nan"],
    "blue_o_points": [],
    "blue_x_points": [
      [-0.00354, 1],
      [-0.00376, 1],
      [0.01723, 0],
      [-0.00228, 1],
      [0.02737, 0],
      [-0.00264, 1],
      [-0.00215, 1],
      [-0.00293, 1],
      [5e-5, 2],
      [0.00274, 2],
      [-0.00029, 2],
      [-0.00306, 1],
      [0.00044, 2],
      [-0.00262, 1],
      [-0.00249, 1],
      [0.01935, 0],
      [0.00041, 2],
      [0.01956, 0],
      [0.02673, 0],
      [-0.00301, 1],
      [-0.00274, 1]
    ]
  },
  "QS_equBpsurgTime": {
    "red_x_points": [
      [0.00137, 3],
      [-0.01368, 0],
      [-0.00139, 2],
      [-0.01539, 0],
      [-0.00918, 0],
      [-0.00352, 1],
      [-0.00033, 3],
      [-0.00055, 3],
      [0.00262, 3],
      [-0.01149, 1],
      [0.00077, 3],
      [0.00073, 2],
      [0.00081, 3],
      [-0.01226, 2],
      [0.00105, 3],
      [3e-5, 3],
      [-0.00671, 0],
      [0.00204, 3],
      [-0.01471, 0],
      [-0.00927, 0],
      [0.00042, 3],
      [-0.00263, 2],
      [0.00117, 3]
    ],
    "red_o_points": [],
    "y_categories": [
      "0 TO 6 MONTHS",
      "13 TO 24 MONTHS",
      "7 TO 12 MONTHS",
      "nan"
    ],
    "blue_o_points": [],
    "blue_x_points": [
      [0.00273, 3],
      [0.00222, 3],
      [0.00071, 0],
      [0.01292, 1],
      [0.00311, 3],
      [0.00611, 1],
      [0.00294, 0],
      [0.00824, 2],
      [0.00287, 3],
      [0.00265, 3],
      [0.0147, 2],
      [0.01119, 2],
      [0.00303, 3],
      [0.00156, 3],
      [0.00187, 3],
      [0.00156, 3],
      [0.00385, 3],
      [0.00152, 3],
      [0.00229, 3],
      [0.00209, 3],
      [0.00198, 3]
    ]
  },
  "QA_lstPexPain[T1]": {
    "red_x_points": [
      [-0.00755, 1],
      [-0.0035, 2],
      [-0.00411, 2],
      [0.00201, 0],
      [-0.0034, 2],
      [-0.00187, 1],
      [0.00017, 0],
      [0.00207, 0],
      [-0.00521, 2],
      [-0.00492, 2],
      [-0.00689, 2],
      [-0.00343, 2],
      [-0.00669, 1],
      [-0.0134, 1],
      [-0.00298, 1],
      [-0.00195, 1],
      [-0.00347, 2],
      [-0.00767, 2],
      [-0.00717, 2],
      [-0.00307, 2],
      [-0.00769, 1],
      [-0.0025, 1],
      [-0.00719, 1]
    ],
    "red_o_points": [],
    "y_categories": ["NORM", "NPV", "nan"],
    "blue_o_points": [],
    "blue_x_points": [
      [0.00027, 1],
      [-0.00065, 1],
      [0.00637, 0],
      [0.00162, 1],
      [0.01501, 0],
      [0.00018, 1],
      [0.01198, 0],
      [0.01248, 0],
      [-0.0024, 2],
      [0.00064, 2],
      [-0.00272, 2],
      [-0.00026, 1],
      [-0.00191, 2],
      [0.00681, 0],
      [0.00681, 0],
      [0.00799, 0],
      [-0.00237, 2],
      [-0.00433, 1],
      [0.01265, 0],
      [0.01532, 0],
      [0.0169, 0]
    ]
  },
  "QA_lstPexInspectio[ScapulaAlata]": {
    "red_x_points": [
      [-0.00147, 1],
      [-0.00019, 1],
      [-0.00028, 1],
      [-0.00032, 1],
      [-0.00018, 1],
      [-0.00018, 1],
      [-0.00144, 1],
      [-0.00252, 1],
      [-0.00043, 1],
      [-0.00015, 1],
      [-0.00072, 1],
      [-0.00013, 1],
      [-0.0005, 1],
      [-0.00135, 1],
      [-0.0018, 1],
      [-0.0009, 1],
      [-0.00012, 1],
      [-0.00125, 1],
      [-0.00031, 1],
      [-0.00037, 1],
      [-0.00091, 1],
      [-0.00052, 1],
      [-0.00034, 1]
    ],
    "red_o_points": [],
    "y_categories": ["ABS", "NAIA", "PT", "nan"],
    "blue_o_points": [],
    "blue_x_points": [
      [-0.00048, 1],
      [-0.00035, 1],
      [-0.00027, 1],
      [-0.00032, 1],
      [-0.00042, 1],
      [-0.00026, 1],
      [-0.00034, 1],
      [-0.00045, 1],
      [-0.00021, 1],
      [-0.0007, 1],
      [-0.00015, 1],
      [-0.00029, 1],
      [-0.00011, 1],
      [0.00944, 0],
      [-0.00027, 1],
      [-0.00026, 1],
      [-0.00031, 1],
      [-0.00011, 1],
      [0.01294, 2],
      [-0.00047, 1],
      [-0.00022, 1]
    ]
  },
  "QS_mulGraftRoot[T1]": {
    "red_x_points": [[-0.00013, 1]],
    "red_o_points": [],
    "y_categories": ["N", "NOT APPLICABLE", "nan"],
    "blue_o_points": [],
    "blue_x_points": [[7e-5, 0], [7e-5, 0]]
  },
  "QA_yonInjFracture": {
    "red_x_points": [
      [0.00485, 0],
      [-0.00352, 2],
      [0.00329, 0],
      [-0.00389, 2],
      [-0.01097, 1],
      [-0.01358, 1],
      [0.00305, 0],
      [0.00274, 0],
      [-0.01461, 1],
      [-0.01252, 1],
      [0.00359, 0],
      [-0.01162, 1],
      [-0.01369, 1],
      [-0.00219, 0],
      [-0.0148, 1],
      [-0.01007, 1],
      [-0.00793, 1],
      [0.00351, 0],
      [0.00393, 0],
      [0.00494, 0],
      [-0.00935, 1],
      [-0.00697, 1],
      [-0.01919, 1]
    ],
    "red_o_points": [],
    "y_categories": ["N", "Y", "nan"],
    "blue_o_points": [],
    "blue_x_points": [
      [0.01117, 0],
      [0.01279, 0],
      [0.0026, 0],
      [0.00667, 0],
      [0.00717, 2],
      [0.00886, 0],
      [0.00306, 1],
      [-4e-5, 1],
      [-0.00617, 1],
      [0.00903, 0],
      [0.0116, 0],
      [0.01237, 0],
      [0.01002, 0],
      [0.0026, 0],
      [0.00402, 0],
      [0.00443, 2],
      [0.01073, 0],
      [0.00515, 0],
      [0.00545, 0],
      [-0.00437, 1],
      [0.00786, 2]
    ]
  },
  "QS_mulGraftTrunk[MiddleTrunk]": {
    "red_x_points": [
      [-0.00029, 1],
      [-0.00015, 0],
      [-0.00015, 0],
      [0.0, 0],
      [-9e-5, 0],
      [3e-5, 0],
      [5e-5, 2],
      [-0.00014, 1],
      [6e-5, 2],
      [-3e-5, 0],
      [-0.0, 2],
      [-0.00013, 0],
      [7e-5, 2],
      [1e-5, 0],
      [-0.00064, 1],
      [4e-5, 2],
      [-7e-5, 0],
      [7e-5, 2],
      [-0.00015, 0],
      [-7e-5, 0],
      [-0.00029, 1],
      [2e-5, 0],
      [7e-5, 2]
    ],
    "red_o_points": [],
    "y_categories": ["N", "NOT APPLICABLE", "nan"],
    "blue_o_points": [],
    "blue_x_points": [
      [5e-5, 2],
      [6e-5, 2],
      [8e-5, 0],
      [2e-5, 0],
      [2e-5, 2],
      [0.00027, 0],
      [5e-5, 0],
      [2e-5, 0],
      [8e-5, 2],
      [0.00027, 1],
      [-7e-5, 0],
      [0.00014, 0],
      [9e-5, 2],
      [6e-5, 2],
      [9e-5, 2],
      [5e-5, 2],
      [9e-5, 2],
      [6e-5, 2],
      [0.00019, 1],
      [0.0001, 2],
      [5e-5, 2]
    ]
  },
  "QS_mulGraftNerve[Ac]": {
    "red_x_points": [
      [-0.00012, 1],
      [-0.00038, 0],
      [-0.00014, 0],
      [6e-5, 0],
      [-7e-5, 0],
      [9e-5, 0],
      [-0.00021, 2],
      [-0.00079, 1],
      [4e-5, 2],
      [-0.00023, 0],
      [4e-5, 2],
      [-0.00035, 0],
      [-2e-5, 2],
      [1e-5, 0],
      [-0.0007, 1],
      [4e-5, 2],
      [-0.0002, 0],
      [-2e-5, 2],
      [-0.0001, 0],
      [-0.00022, 0],
      [-0.00031, 1],
      [7e-5, 0],
      [-0.0, 2]
    ],
    "red_o_points": [],
    "y_categories": ["N", "NOT APPLICABLE", "nan"],
    "blue_o_points": [],
    "blue_x_points": [
      [7e-5, 2],
      [8e-5, 2],
      [7e-5, 0],
      [0.00029, 0],
      [-1e-5, 2],
      [0.00027, 0],
      [0.00035, 0],
      [8e-5, 0],
      [0.00035, 2],
      [0.00102, 1],
      [-0.00031, 0],
      [9e-5, 0],
      [0.0002, 2],
      [0.00014, 2],
      [0.00013, 2],
      [2e-5, 2],
      [0.00038, 2],
      [8e-5, 2],
      [0.0002, 1],
      [0.0, 2]
    ]
  },
  "QA_lstPexArthre[Shoulder]": {
    "red_x_points": [
      [0.00528, 2],
      [-0.00229, 3],
      [-0.00372, 3],
      [0.00561, 2],
      [-0.01549, 0],
      [-0.02127, 1],
      [0.00654, 2],
      [0.00667, 2],
      [-0.00229, 3],
      [0.00525, 2],
      [-0.00295, 3],
      [-0.00186, 3],
      [-0.0041, 3],
      [-0.03014, 1],
      [0.00635, 2],
      [-0.01826, 1],
      [-0.00196, 3],
      [-0.00375, 3],
      [-0.00648, 3],
      [-0.00234, 3],
      [-0.00348, 3],
      [-0.01307, 1],
      [-0.00411, 3]
    ],
    "red_o_points": [],
    "y_categories": ["NAIA", "NPV", "PV", "nan"],
    "blue_o_points": [],
    "blue_x_points": [
      [0.01255, 2],
      [-0.00247, 3],
      [0.008, 2],
      [0.01132, 2],
      [-0.00161, 3],
      [0.01199, 2],
      [0.01071, 2],
      [0.01015, 2],
      [-0.00135, 3],
      [-0.00117, 3],
      [-0.00211, 3],
      [0.01381, 2],
      [-0.00109, 3],
      [0.00739, 2],
      [0.00622, 2],
      [-0.00076, 1],
      [-0.00107, 3],
      [0.00643, 2],
      [-0.00047, 3],
      [0.00875, 2],
      [0.00662, 2]
    ]
  },
  "QS_mulNeuromadSite[C8]": {
    "red_x_points": [
      [-0.00404, 1],
      [-0.00201, 0],
      [-0.00026, 0],
      [0.00019, 0],
      [-0.00082, 0],
      [0.00046, 0],
      [0.0, 2],
      [-0.00449, 1],
      [0.00068, 2],
      [-0.00149, 0],
      [6e-5, 2],
      [-0.00171, 0],
      [7e-5, 2],
      [0.00017, 0],
      [-0.00584, 1],
      [8e-5, 2],
      [-0.00112, 0],
      [-6e-5, 2],
      [-0.00047, 0],
      [-0.00189, 0],
      [-0.00344, 1],
      [0.00029, 0],
      [-2e-5, 2]
    ],
    "red_o_points": [],
    "y_categories": ["N", "NOT APPLICABLE", "nan"],
    "blue_o_points": [],
    "blue_x_points": [
      [0.00119, 2],
      [0.00095, 2],
      [0.0008, 0],
      [0.00225, 0],
      [0.00025, 2],
      [0.00196, 0],
      [0.00116, 0],
      [0.00087, 0],
      [0.00144, 2],
      [0.0051, 1],
      [-0.00049, 0],
      [0.00238, 0],
      [0.00173, 2],
      [0.00056, 2],
      [0.00079, 2],
      [0.0004, 2],
      [0.00162, 2],
      [0.0008, 2],
      [0.00014, 1],
      [0.00107, 2],
      [0.0007, 2]
    ]
  },
  "QS_mulGraftNerve[Ph]": {
    "red_x_points": [
      [-0.0014, 1],
      [-0.00079, 0],
      [-0.00017, 0],
      [-4e-5, 0],
      [-0.00048, 0],
      [0.00013, 0],
      [3e-5, 2],
      [-0.00146, 1],
      [0.00028, 2],
      [-0.00038, 0],
      [0.00012, 2],
      [-0.00075, 0],
      [5e-5, 2],
      [4e-5, 0],
      [-0.002, 1],
      [3e-5, 2],
      [-0.0005, 0],
      [0.00016, 2],
      [-0.00036, 0],
      [-0.00059, 0],
      [-0.0012, 1],
      [-9e-5, 2]
    ],
    "red_o_points": [],
    "y_categories": ["N", "NOT APPLICABLE", "nan"],
    "blue_o_points": [],
    "blue_x_points": [
      [0.00045, 2],
      [0.00026, 2],
      [0.00038, 0],
      [0.0004, 0],
      [0.00016, 2],
      [0.00071, 0],
      [0.00033, 0],
      [0.00051, 0],
      [0.00061, 2],
      [0.00181, 1],
      [-0.00019, 0],
      [0.00098, 0],
      [0.00056, 2],
      [0.0003, 2],
      [0.00044, 2],
      [0.00022, 2],
      [0.00052, 2],
      [0.00024, 2],
      [0.00012, 1],
      [0.00034, 2],
      [0.00024, 2]
    ]
  },
  "QA_lstPexMuscstrength[FingersFlex]": {
    "red_x_points": [
      [0.00252, 2],
      [0.00255, 2],
      [-0.03124, 1],
      [0.00967, 0],
      [-0.02992, 1],
      [-0.03103, 1],
      [-0.03269, 1],
      [0.00983, 0],
      [0.00277, 2],
      [0.0025, 2],
      [0.00947, 0],
      [0.00256, 2],
      [-0.03334, 1],
      [0.00877, 0],
      [0.00941, 0],
      [-0.03167, 1],
      [-0.02803, 1],
      [0.00303, 2],
      [0.00885, 0],
      [0.00866, 0],
      [0.00245, 2],
      [-0.0309, 1],
      [0.00229, 2]
    ],
    "red_o_points": [],
    "y_categories": ["GREATER THAN OR EQUALS TO 3", "LESS THAN 3", "nan"],
    "blue_o_points": [],
    "blue_x_points": [
      [0.01287, 0],
      [0.01141, 0],
      [0.00976, 0],
      [0.01064, 0],
      [0.0115, 0],
      [0.01072, 0],
      [0.01009, 0],
      [0.01036, 0],
      [0.0037, 2],
      [0.00343, 2],
      [0.00381, 2],
      [0.00471, 2],
      [0.00363, 2],
      [0.01037, 0],
      [0.01029, 0],
      [0.01066, 0],
      [0.0043, 2],
      [0.0036, 2],
      [0.0104, 0],
      [0.00364, 2],
      [0.0036, 2]
    ]
  },
  "QA_lstPexPalle[Elbow]": {
    "red_x_points": [
      [-0.0016, 4],
      [-0.00143, 4],
      [-0.00146, 4],
      [0.01175, 3],
      [-0.00144, 4],
      [-0.00157, 4],
      [-0.01832, 1],
      [-0.01526, 1],
      [-0.00152, 4],
      [-0.00153, 4],
      [-0.00181, 4],
      [-0.00133, 4],
      [-0.0015, 4],
      [-0.01845, 1],
      [-0.00149, 4],
      [-0.023, 0],
      [-0.02121, 2],
      [-0.00191, 4],
      [-0.00208, 4],
      [-0.00152, 4],
      [0.01149, 3],
      [-0.02155, 0],
      [-0.00146, 4]
    ],
    "red_o_points": [],
    "y_categories": ["ABS", "HYPO", "NAIA", "PT", "nan"],
    "blue_o_points": [],
    "blue_x_points": [
      [-0.001, 4],
      [-0.00153, 4],
      [0.01642, 3],
      [0.01956, 3],
      [-0.00124, 4],
      [-0.00121, 4],
      [-0.00719, 1],
      [0.01717, 3],
      [-0.00129, 4],
      [-0.00121, 4],
      [-0.00123, 4],
      [-0.00134, 4],
      [-0.00117, 4],
      [0.01882, 3],
      [0.01692, 3],
      [0.0167, 3],
      [-0.00132, 4],
      [0.01618, 3],
      [-0.00102, 4],
      [0.01831, 3],
      [-0.00115, 4]
    ]
  },
  "QS_mulGraftRoot[C5]": {
    "red_x_points": [
      [-0.00025, 1],
      [-0.00021, 0],
      [-0.00014, 0],
      [-7e-5, 0],
      [3e-5, 0],
      [9e-5, 2],
      [-7e-5, 0],
      [6e-5, 2],
      [-7e-5, 0],
      [6e-5, 2],
      [-0.00037, 1],
      [-0.00014, 0],
      [3e-5, 2],
      [-0.00018, 0],
      [-0.00014, 0],
      [-8e-5, 1],
      [-3e-5, 2]
    ],
    "red_o_points": [],
    "y_categories": ["N", "NOT APPLICABLE", "nan"],
    "blue_o_points": [],
    "blue_x_points": [
      [3e-5, 2],
      [5e-5, 2],
      [2e-5, 0],
      [2e-5, 0],
      [3e-5, 2],
      [7e-5, 0],
      [3e-5, 0],
      [2e-5, 0],
      [9e-5, 2],
      [0.00022, 1],
      [0.00025, 0],
      [0.00027, 0],
      [9e-5, 2],
      [2e-5, 2],
      [2e-5, 2],
      [7e-5, 2],
      [2e-5, 2],
      [6e-5, 1],
      [2e-5, 2]
    ]
  },
  "QA_lstPexPalle[Ulna]": {
    "red_x_points": [
      [-0.00122, 4],
      [-0.00126, 4],
      [-0.00132, 4],
      [-0.03004, 2],
      [-0.00131, 4],
      [-0.0013, 4],
      [-0.01019, 1],
      [0.00644, 3],
      [-0.00153, 4],
      [-0.00131, 4],
      [-0.00158, 4],
      [-0.00128, 4],
      [-0.0016, 4],
      [0.00669, 3],
      [-0.00112, 4],
      [-0.02365, 0],
      [-0.01966, 0],
      [-0.00162, 4],
      [-0.00174, 4],
      [-0.00128, 4],
      [0.00744, 3],
      [-0.01923, 0],
      [-0.00138, 4]
    ],
    "red_o_points": [],
    "y_categories": ["ABS", "HYPO", "NAIA", "PT", "nan"],
    "blue_o_points": [],
    "blue_x_points": [
      [-0.00076, 4],
      [-0.0007, 4],
      [0.00937, 3],
      [0.01294, 1],
      [-0.00075, 4],
      [-0.00052, 4],
      [0.01138, 3],
      [0.01319, 3],
      [-0.00122, 4],
      [-0.0011, 4],
      [-0.00114, 4],
      [-0.00061, 4],
      [-0.00124, 4],
      [0.01175, 3],
      [0.01285, 3],
      [0.01394, 3],
      [-0.00093, 4],
      [0.01191, 3],
      [-0.00077, 4],
      [0.01656, 3],
      [-0.00112, 4]
    ]
  },
  "QA_lstPexMuscstrength[ScapulaAbducSuprot]": {
    "red_x_points": [
      [-0.00125, 2],
      [-0.0004, 2],
      [-0.00566, 1],
      [-0.00192, 2],
      [-0.00689, 1],
      [-0.00914, 1],
      [-0.00945, 1],
      [0.00305, 0],
      [-0.00081, 2],
      [-0.00133, 2],
      [-0.0038, 2],
      [-0.00021, 2],
      [-0.01102, 1],
      [-0.00325, 0],
      [0.00385, 0],
      [-0.00883, 1],
      [-0.00285, 1],
      [-0.00187, 2],
      [-0.00923, 1],
      [0.00116, 0],
      [-0.00142, 2],
      [-0.00217, 1],
      [-0.00624, 2]
    ],
    "red_o_points": [],
    "y_categories": ["GREATER THAN OR EQUALS TO 3", "LESS THAN 3", "nan"],
    "blue_o_points": [],
    "blue_x_points": [
      [0.02173, 0],
      [0.01891, 0],
      [0.00377, 0],
      [-0.00036, 1],
      [-0.002, 1],
      [0.01108, 0],
      [0.00687, 0],
      [0.00111, 1],
      [-0.00049, 2],
      [0.00057, 2],
      [0.00142, 2],
      [0.00242, 2],
      [0.00031, 2],
      [0.00517, 0],
      [0.00595, 0],
      [-0.00054, 2],
      [0.00067, 2],
      [0.00488, 0],
      [0.0013, 2],
      [-0.00216, 1],
      [-0.00094, 2]
    ]
  },
  "participant_code": {
    "red_x_points": [
      [-0.04167, 0],
      [-0.04176, 2],
      [-0.04079, 3],
      [-0.04225, 4],
      [-0.04001, 5],
      [-0.04089, 9],
      [-0.04099, 14],
      [-0.04031, 17],
      [-0.04021, 19],
      [-0.03895, 20],
      [-0.04176, 22],
      [-0.04147, 23],
      [-0.04021, 24],
      [-0.04031, 26],
      [-0.04079, 28],
      [-0.04089, 29],
      [-0.04118, 31],
      [-0.04137, 35],
      [-0.03963, 37],
      [-0.0405, 39],
      [-0.04089, 41],
      [-0.03963, 42],
      [-0.0406, 43]
    ],
    "red_o_points": [],
    "y_categories": [
      "P16554",
      "P18297",
      "P19283",
      "P19287",
      "P23172",
      "P23391",
      "P30595",
      "P31645",
      "P31691",
      "P34778",
      "P35046",
      "P36328",
      "P43633",
      "P4544",
      "P46417",
      "P48965",
      "P53068",
      "P5497",
      "P58556",
      "P59529",
      "P62483",
      "P64658",
      "P65202",
      "P66816",
      "P67052",
      "P6751",
      "P7408",
      "P75566",
      "P76226",
      "P79971",
      "P82621",
      "P82990",
      "P84549",
      "P84932",
      "P85825",
      "P86989",
      "P8770",
      "P87791",
      "P90550",
      "P93159",
      "P94969",
      "P96710",
      "P9744",
      "P98500",
      "nan"
    ],
    "blue_o_points": [],
    "blue_x_points": [
      [0.04453, 1],
      [0.04535, 6],
      [0.04504, 7],
      [0.0436, 8],
      [0.04401, 10],
      [0.04545, 11],
      [0.04587, 12],
      [0.04185, 13],
      [0.04494, 15],
      [0.04556, 16],
      [0.04566, 18],
      [0.04494, 21],
      [0.04525, 25],
      [0.04432, 27],
      [0.04329, 30],
      [0.04401, 32],
      [0.04412, 33],
      [0.04545, 34],
      [0.04576, 36],
      [0.04412, 38],
      [0.04391, 40]
    ]
  },
  "QS_mulGraftNerve[IS]": {
    "red_x_points": [
      [-0.00019, 1],
      [-0.00011, 0],
      [-3e-5, 0],
      [-6e-5, 0],
      [7e-5, 0],
      [2e-5, 2],
      [-0.0002, 1],
      [9e-5, 2],
      [-1e-5, 2],
      [-6e-5, 0],
      [2e-5, 2],
      [-0.00025, 1],
      [-0.00011, 0],
      [-3e-5, 0],
      [-0.00011, 0],
      [-6e-5, 1],
      [3e-5, 0],
      [2e-5, 2]
    ],
    "red_o_points": [],
    "y_categories": ["N", "NOT APPLICABLE", "nan"],
    "blue_o_points": [],
    "blue_x_points": [
      [2e-5, 2],
      [2e-5, 2],
      [0.00016, 0],
      [0.00011, 0],
      [3e-5, 0],
      [9e-5, 2],
      [0.00024, 1],
      [-5e-5, 0],
      [0.00015, 0],
      [9e-5, 2],
      [6e-5, 2],
      [8e-5, 2]
    ]
  },
  "QA_mulInjOrthesisType[ArmSling]": {
    "red_x_points": [
      [-0.00682, 2],
      [-0.00736, 2],
      [-0.00349, 2],
      [-0.00266, 2],
      [-0.00433, 2],
      [-0.00285, 2],
      [-0.00138, 2],
      [-0.0026, 1],
      [-0.00876, 2],
      [-0.00711, 2],
      [-0.00437, 2],
      [-0.02136, 0],
      [-0.00806, 3],
      [-0.00108, 2],
      [0.00038, 1],
      [-0.00111, 2],
      [-0.01122, 3],
      [-0.0082, 2],
      [-0.0039, 2],
      [-0.00511, 2],
      [-0.00621, 3],
      [-0.0012, 2],
      [-0.00584, 2]
    ],
    "red_o_points": [],
    "y_categories": ["N", "NOT APPLICABLE", "Y", "nan"],
    "blue_o_points": [],
    "blue_x_points": [
      [-0.00117, 2],
      [-0.00193, 2],
      [0.00029, 2],
      [-7e-5, 2],
      [-0.00202, 2],
      [-0.00061, 2],
      [-0.0002, 2],
      [-0.00084, 2],
      [0.03809, 1],
      [0.03126, 1],
      [-0.00599, 2],
      [0.02201, 1],
      [0.02746, 1],
      [-0.00032, 2],
      [0.00552, 0],
      [-0.00094, 2],
      [-0.00705, 2],
      [0.011, 1],
      [0.01017, 1],
      [-0.00295, 2],
      [0.00291, 3]
    ]
  },
  "QS_mulGraftNerve[Ul]": {
    "red_x_points": [
      [-0.00038, 1],
      [-0.00011, 0],
      [-5e-5, 0],
      [-0.0001, 0],
      [9e-5, 0],
      [-7e-5, 1],
      [3e-5, 2],
      [-7e-5, 0],
      [-0.00011, 0],
      [1e-5, 2],
      [-0.00035, 1],
      [1e-5, 2],
      [-3e-5, 0],
      [-1e-5, 2],
      [-0.00015, 0],
      [-0.00021, 1],
      [5e-5, 2]
    ],
    "red_o_points": [],
    "y_categories": ["N", "NOT APPLICABLE", "nan"],
    "blue_o_points": [],
    "blue_x_points": [
      [5e-5, 2],
      [9e-5, 2],
      [4e-5, 0],
      [0.00015, 0],
      [5e-5, 0],
      [2e-5, 0],
      [2e-5, 0],
      [0.00012, 2],
      [0.00038, 1],
      [-0.00011, 0],
      [0.0001, 0],
      [0.00016, 2],
      [4e-5, 2],
      [4e-5, 2],
      [0.00012, 2],
      [4e-5, 2],
      [2e-5, 2],
      [7e-5, 2]
    ]
  },
  "QS_mulGraftNerve[Ssr]": {
    "red_x_points": [
      [-0.00056, 1],
      [-0.00023, 0],
      [4e-5, 0],
      [7e-5, 0],
      [-0.00013, 0],
      [0.00013, 0],
      [-0.0001, 2],
      [-0.00056, 1],
      [6e-5, 2],
      [-0.00043, 0],
      [-7e-5, 2],
      [-0.00058, 0],
      [-5e-5, 2],
      [-0.00011, 0],
      [-0.00072, 1],
      [-1e-5, 2],
      [-0.00023, 0],
      [-0.0001, 2],
      [-0.00012, 0],
      [-0.00026, 0],
      [-0.00093, 1],
      [7e-5, 0],
      [0.00013, 2]
    ],
    "red_o_points": [],
    "y_categories": ["N", "NOT APPLICABLE", "nan"],
    "blue_o_points": [],
    "blue_x_points": [
      [0.00025, 2],
      [2e-5, 2],
      [0.00023, 0],
      [0.0004, 0],
      [6e-5, 2],
      [0.00052, 0],
      [0.00012, 0],
      [0.00016, 0],
      [0.00026, 2],
      [0.00119, 1],
      [1e-5, 0],
      [0.00022, 0],
      [0.00019, 2],
      [0.0, 2],
      [0.00017, 2],
      [3e-5, 2],
      [0.00033, 2],
      [0.0001, 2],
      [0.00013, 1],
      [0.00025, 2],
      [3e-5, 2]
    ]
  },
  "QA_lstPexKine[Shoulder]": {
    "red_x_points": [
      [0.00101, 1],
      [-0.0007, 2],
      [-0.00202, 2],
      [0.00155, 1],
      [-0.00205, 2],
      [-0.01201, 0],
      [0.0008, 1],
      [0.00081, 1],
      [-0.00098, 2],
      [0.00176, 1],
      [-0.0012, 2],
      [-0.00136, 2],
      [-0.00115, 2],
      [-0.02375, 0],
      [0.00113, 1],
      [0.00067, 1],
      [-0.00104, 2],
      [-0.00201, 2],
      [-0.00557, 2],
      [-0.00115, 2],
      [-0.00111, 2],
      [0.00153, 1],
      [-0.00154, 2]
    ],
    "red_o_points": [],
    "y_categories": ["NPV", "PV", "nan"],
    "blue_o_points": [],
    "blue_x_points": [
      [0.00274, 1],
      [-0.00067, 2],
      [0.00372, 1],
      [0.00604, 1],
      [7e-5, 2],
      [0.00739, 1],
      [0.00561, 1],
      [0.00571, 1],
      [-0.00047, 2],
      [-0.00029, 2],
      [-0.00127, 2],
      [0.00751, 1],
      [-0.00028, 2],
      [0.00291, 1],
      [0.00175, 1],
      [0.0021, 0],
      [-0.00051, 2],
      [0.00168, 1],
      [0.00027, 2],
      [0.00264, 1],
      [0.00171, 1]
    ]
  },
  "QS_mulGraftNerve[MCA]": {
    "red_x_points": [
      [-6e-5, 1],
      [-6e-5, 0],
      [2e-5, 0],
      [0.0, 2],
      [7e-5, 2],
      [-8e-5, 0],
      [0.0, 2],
      [-8e-5, 0],
      [-6e-5, 1],
      [0.0, 2],
      [-6e-5, 0],
      [-8e-5, 0],
      [-6e-5, 1],
      [2e-5, 0],
      [0.0, 2]
    ],
    "red_o_points": [],
    "y_categories": ["N", "NOT APPLICABLE", "nan"],
    "blue_o_points": [],
    "blue_x_points": [
      [0.0, 2],
      [0.0, 2],
      [2e-5, 0],
      [2e-5, 0],
      [7e-5, 2],
      [0.00012, 1],
      [2e-5, 0],
      [7e-5, 2],
      [7e-5, 2]
    ]
  },
  "QA_lstPexInspectio[Swelling]": {
    "red_x_points": [
      [0.00113, 1],
      [0.00148, 1],
      [-0.00227, 0],
      [0.00152, 1],
      [-0.01416, 2],
      [0.00258, 1],
      [-0.02082, 2],
      [-0.00159, 0],
      [-0.00781, 0],
      [0.00083, 1],
      [-0.00869, 0],
      [0.00157, 1],
      [0.0032, 1],
      [-0.03268, 2],
      [0.00123, 1],
      [-0.01715, 2],
      [0.00168, 1],
      [0.00275, 1],
      [0.00079, 1],
      [-0.00199, 0],
      [-0.00617, 0],
      [-0.00136, 0],
      [0.0036, 1]
    ],
    "red_o_points": [],
    "y_categories": ["ABS", "NAIA", "PT", "nan"],
    "blue_o_points": [],
    "blue_x_points": [
      [0.00733, 1],
      [0.00582, 1],
      [0.00381, 0],
      [0.00343, 0],
      [0.00539, 1],
      [0.00355, 1],
      [0.0088, 0],
      [0.00426, 1],
      [0.00524, 1],
      [0.00274, 1],
      [0.00296, 1],
      [0.00392, 1],
      [0.00446, 1],
      [0.00198, 0],
      [0.00453, 1],
      [0.00457, 1],
      [0.00036, 0],
      [0.00394, 1],
      [0.00443, 0],
      [0.00517, 1],
      [0.00562, 1]
    ]
  },
  "QA_mulInjOrthesisType[ShoulderSupport]": {
    "red_x_points": [
      [-0.00654, 0],
      [-0.00802, 0],
      [-0.00389, 0],
      [-0.01611, 2],
      [-0.00551, 0],
      [-0.00305, 0],
      [-0.00192, 0],
      [-0.00144, 1],
      [-0.00942, 0],
      [-0.0082, 0],
      [-0.00493, 0],
      [-0.01746, 2],
      [-0.00866, 3],
      [-0.00176, 0],
      [-0.00031, 1],
      [-0.00165, 0],
      [-0.01164, 3],
      [-0.00857, 0],
      [-0.00413, 0],
      [-0.00616, 0],
      [-0.00829, 3],
      [-0.00124, 0],
      [-0.00628, 0]
    ],
    "red_o_points": [],
    "y_categories": ["N", "NOT APPLICABLE", "Y", "nan"],
    "blue_o_points": [],
    "blue_x_points": [
      [-0.00162, 0],
      [-0.002, 0],
      [0.00068, 0],
      [0.001, 0],
      [0.01069, 2],
      [0.00029, 0],
      [0.00027, 0],
      [0.0013, 0],
      [0.0376, 1],
      [0.03019, 1],
      [-0.00608, 0],
      [0.02668, 1],
      [0.02766, 1],
      [0.00011, 0],
      [0.00438, 2],
      [-0.0008, 0],
      [-0.00728, 0],
      [0.01104, 1],
      [0.01059, 1],
      [-0.00241, 0],
      [0.00289, 3]
    ]
  },
  "QA_lstPexPain[C6]": {
    "red_x_points": [
      [-0.00075, 1],
      [-0.00325, 2],
      [-0.0029, 2],
      [-0.00133, 1],
      [-0.00258, 2],
      [-0.00034, 1],
      [-0.00114, 1],
      [-0.00115, 1],
      [-0.00474, 2],
      [-0.00357, 2],
      [-0.00623, 2],
      [-0.00279, 2],
      [-0.00164, 1],
      [-0.00277, 1],
      [-0.00058, 1],
      [-0.00138, 1],
      [-0.00282, 2],
      [-0.00527, 2],
      [-0.00447, 2],
      [-0.00329, 2],
      [-0.00114, 1],
      [-0.00056, 1],
      [-0.00148, 1]
    ],
    "red_o_points": [],
    "y_categories": ["NORM", "NPV", "nan"],
    "blue_o_points": [],
    "blue_x_points": [
      [-0.00028, 1],
      [-0.00017, 1],
      [0.01022, 0],
      [-0.00029, 1],
      [0.01866, 0],
      [-6e-5, 1],
      [-2e-5, 1],
      [-0.00052, 1],
      [-0.00306, 2],
      [-0.00269, 2],
      [-0.00304, 2],
      [-0.00014, 1],
      [-0.00283, 2],
      [0.0163, 0],
      [-0.00062, 1],
      [0.01465, 0],
      [-0.00245, 2],
      [0.01429, 0],
      [-0.0006, 1],
      [-0.00083, 1],
      [-0.00033, 1]
    ]
  },
  "QS_mulGraftTrunk[LowerTrunk]": {
    "red_x_points": [
      [-0.00035, 1],
      [-0.0001, 0],
      [4e-5, 0],
      [-4e-5, 0],
      [7e-5, 0],
      [-0.0, 2],
      [-0.0002, 1],
      [9e-5, 2],
      [-0.00016, 0],
      [-5e-5, 2],
      [-0.0002, 0],
      [2e-5, 2],
      [-0.00071, 1],
      [1e-5, 2],
      [-4e-5, 0],
      [7e-5, 2],
      [-2e-5, 0],
      [-4e-5, 0],
      [-6e-5, 1],
      [4e-5, 2]
    ],
    "red_o_points": [],
    "y_categories": ["N", "NOT APPLICABLE", "nan"],
    "blue_o_points": [],
    "blue_x_points": [
      [0.00013, 2],
      [6e-5, 2],
      [0.0001, 0],
      [0.00016, 0],
      [1e-5, 2],
      [0.00028, 0],
      [4e-5, 0],
      [5e-5, 0],
      [9e-5, 2],
      [0.00022, 1],
      [0.0, 0],
      [0.00015, 0],
      [7e-5, 2],
      [1e-5, 2],
      [1e-5, 2],
      [6e-5, 2],
      [6e-5, 2],
      [4e-5, 2],
      [4e-5, 2],
      [6e-5, 2]
    ]
  },
  "QS_mulGraftRoot[T2]": {
    "red_x_points": [
      [-0.00029, 1],
      [-0.00015, 0],
      [-1e-5, 0],
      [-0.00018, 0],
      [2e-5, 0],
      [0.00011, 2],
      [-0.00023, 0],
      [5e-5, 2],
      [-0.0002, 0],
      [1e-5, 2],
      [-0.00024, 1],
      [-0.00014, 0],
      [8e-5, 2],
      [-3e-5, 0],
      [-0.00024, 0],
      [-0.0003, 1],
      [-6e-5, 2]
    ],
    "red_o_points": [],
    "y_categories": ["N", "NOT APPLICABLE", "nan"],
    "blue_o_points": [],
    "blue_x_points": [
      [1e-5, 2],
      [0.0001, 2],
      [2e-5, 0],
      [0.0001, 0],
      [0.0002, 0],
      [2e-5, 0],
      [2e-5, 0],
      [0.00024, 2],
      [0.00057, 1],
      [-0.0002, 0],
      [0.00016, 0],
      [0.00028, 2],
      [3e-5, 2],
      [6e-5, 2],
      [0.0, 2],
      [0.00011, 2],
      [2e-5, 2],
      [6e-5, 2],
      [2e-5, 2]
    ]
  },
  "QS_mulGraftNerve[MC]": {
    "red_x_points": [
      [-6e-5, 0],
      [5e-5, 2],
      [-6e-5, 0],
      [0.0, 2],
      [-6e-5, 0],
      [-0.00016, 1],
      [-6e-5, 0]
    ],
    "red_o_points": [],
    "y_categories": ["N", "NOT APPLICABLE", "nan"],
    "blue_o_points": [],
    "blue_x_points": [
      [0.0, 2],
      [4e-5, 0],
      [4e-5, 0],
      [4e-5, 0],
      [5e-5, 2],
      [0.0001, 1],
      [-6e-5, 0],
      [5e-5, 2],
      [0.0, 2],
      [0.0, 2],
      [5e-5, 2]
    ]
  },
  "QS_mulGraftTrunk[UpperTrunk]": {
    "red_x_points": [
      [-0.00714, 1],
      [-0.0034, 0],
      [-0.00138, 0],
      [0.00058, 0],
      [-0.00209, 0],
      [0.00069, 0],
      [0.00041, 3],
      [-0.00749, 1],
      [0.00253, 3],
      [-0.01878, 2],
      [0.0012, 3],
      [-0.00252, 0],
      [0.00059, 3],
      [0.00028, 0],
      [-0.0096, 1],
      [0.00054, 3],
      [-0.0029, 0],
      [0.00102, 3],
      [-0.00089, 0],
      [-0.00414, 0],
      [-0.00702, 1],
      [0.0004, 0],
      [0.00069, 3]
    ],
    "red_o_points": [],
    "y_categories": ["N", "NOT APPLICABLE", "Y", "nan"],
    "blue_o_points": [],
    "blue_x_points": [
      [0.00243, 3],
      [0.00165, 3],
      [0.00268, 0],
      [0.00318, 0],
      [0.00117, 3],
      [0.00425, 0],
      [0.00274, 0],
      [0.00245, 0],
      [0.00433, 3],
      [0.01124, 1],
      [-0.00075, 0],
      [0.00435, 0],
      [0.00331, 3],
      [0.00148, 3],
      [0.0015, 3],
      [0.00103, 3],
      [0.00406, 3],
      [0.00184, 3],
      [0.00073, 1],
      [0.00231, 3],
      [0.00242, 3]
    ]
  },
  "QS_mulTransfSite[PhMc]": {
    "red_x_points": [
      [-0.00698, 1],
      [-0.00355, 0],
      [-0.00092, 0],
      [0.00111, 0],
      [-0.00228, 0],
      [-0.00923, 2],
      [0.0004, 3],
      [-0.00679, 1],
      [0.00231, 3],
      [-0.00241, 0],
      [0.00207, 3],
      [-0.00339, 0],
      [0.00137, 3],
      [0.0002, 0],
      [-0.01011, 1],
      [0.00077, 3],
      [-0.00856, 2],
      [0.00147, 3],
      [-0.00189, 0],
      [-0.00402, 0],
      [-0.00765, 1],
      [0.00198, 0],
      [0.00138, 3]
    ],
    "red_o_points": [],
    "y_categories": ["N", "NOT APPLICABLE", "Y", "nan"],
    "blue_o_points": [],
    "blue_x_points": [
      [0.00308, 3],
      [0.00226, 3],
      [0.00082, 0],
      [0.0036, 0],
      [0.00164, 3],
      [0.00381, 0],
      [0.00137, 0],
      [0.00149, 0],
      [0.00449, 3],
      [0.00996, 1],
      [-0.00154, 0],
      [0.00471, 0],
      [0.00368, 3],
      [0.00145, 3],
      [0.00192, 3],
      [0.0009, 3],
      [0.00433, 3],
      [0.00183, 3],
      [0.00076, 1],
      [0.0025, 3],
      [0.00167, 3]
    ]
  },
  "QA_yonPexPain": {
    "red_x_points": [
      [-0.01292, 1],
      [-0.0148, 1],
      [-0.01238, 1],
      [-0.01248, 1],
      [-0.01284, 1],
      [-0.01312, 1],
      [-0.01302, 1],
      [-0.01229, 1],
      [-0.01545, 1],
      [-0.01476, 1],
      [0.0141, 0],
      [-0.01432, 1],
      [-0.01339, 1],
      [-0.01406, 1],
      [0.01686, 0],
      [-0.01208, 1],
      [-0.01261, 1],
      [-0.01487, 1],
      [-0.0148, 1],
      [-0.01333, 1],
      [-0.01322, 1],
      [-0.01182, 1],
      [-0.01637, 1]
    ],
    "red_o_points": [],
    "y_categories": ["N", "Y", "nan"],
    "blue_o_points": [],
    "blue_x_points": [
      [-0.01162, 1],
      [0.02624, 0],
      [0.02093, 0],
      [0.02488, 0],
      [-0.01188, 1],
      [0.02581, 0],
      [-0.01312, 1],
      [-0.01235, 1],
      [-0.0139, 1],
      [0.0343, 2],
      [0.03078, 0],
      [-0.01394, 1],
      [0.02653, 0],
      [0.02332, 0],
      [0.0223, 0],
      [0.02263, 0],
      [0.03938, 2],
      [0.02394, 0],
      [-0.01049, 1],
      [-0.01283, 1],
      [0.03305, 2]
    ]
  },
  "QS_mulLysisRoot[C6]": {
    "red_x_points": [
      [-0.00255, 1],
      [-0.00044, 0],
      [-0.00964, 2],
      [0.00159, 0],
      [-0.00046, 0],
      [0.0014, 0],
      [0.00043, 3],
      [-0.00404, 1],
      [0.00045, 3],
      [-0.00038, 0],
      [0.00054, 3],
      [-0.00024, 0],
      [0.00046, 3],
      [0.00047, 0],
      [-0.00348, 1],
      [0.00063, 3],
      [-0.00038, 0],
      [0.00078, 3],
      [0.00074, 0],
      [-0.00028, 0],
      [-0.00283, 1],
      [-0.00712, 2],
      [0.0006, 3]
    ],
    "red_o_points": [],
    "y_categories": ["N", "NOT APPLICABLE", "Y", "nan"],
    "blue_o_points": [],
    "blue_x_points": [
      [0.00135, 3],
      [0.00125, 3],
      [0.00052, 0],
      [0.00337, 0],
      [0.00072, 3],
      [0.00212, 0],
      [0.00095, 0],
      [0.00095, 0],
      [0.00061, 3],
      [0.00185, 1],
      [0.00037, 0],
      [0.00331, 0],
      [0.00074, 3],
      [0.00064, 3],
      [0.00054, 3],
      [0.00019, 3],
      [0.00125, 3],
      [0.00031, 3],
      [0.00152, 1],
      [0.00067, 3],
      [0.00051, 3]
    ]
  },
  "QS_mulGraftLevel[Trunk]": {
    "red_x_points": [
      [-0.0072, 1],
      [-0.00345, 0],
      [-0.00154, 0],
      [-8e-5, 0],
      [-0.0033, 0],
      [0.0008, 0],
      [0.00056, 3],
      [-0.00585, 1],
      [0.0031, 3],
      [-0.019, 2],
      [0.00117, 3],
      [-0.00315, 0],
      [0.00064, 3],
      [0.00032, 0],
      [-0.01001, 1],
      [0.00027, 3],
      [-0.00273, 0],
      [0.00154, 3],
      [-0.00066, 0],
      [-0.00359, 0],
      [-0.00667, 1],
      [0.00049, 0],
      [0.00082, 3]
    ],
    "red_o_points": [],
    "y_categories": ["N", "NOT APPLICABLE", "Y", "nan"],
    "blue_o_points": [],
    "blue_x_points": [
      [0.00226, 3],
      [0.00117, 3],
      [0.00209, 0],
      [0.00279, 0],
      [0.00092, 3],
      [0.00464, 0],
      [0.00256, 0],
      [0.00222, 0],
      [0.00389, 3],
      [0.01083, 1],
      [-0.00176, 0],
      [0.00472, 0],
      [0.00414, 3],
      [0.00146, 3],
      [0.00201, 3],
      [0.00133, 3],
      [0.00479, 3],
      [0.00202, 3],
      [0.00105, 1],
      [0.0025, 3],
      [0.00191, 3]
    ]
  },
  "QS_mulNeuromadSite[C4]": {
    "red_x_points": [
      [-0.00587, 1],
      [-0.0036, 0],
      [-0.00093, 0],
      [0.00026, 0],
      [-0.00151, 0],
      [0.00103, 0],
      [-0.00038, 2],
      [-0.00618, 1],
      [0.00151, 2],
      [-0.00265, 0],
      [0.00032, 2],
      [-0.00325, 0],
      [0.00038, 2],
      [0.00033, 0],
      [-0.00868, 1],
      [0.0002, 2],
      [-0.00254, 0],
      [0.00027, 2],
      [-0.00113, 0],
      [-0.0037, 0],
      [-0.00619, 1],
      [0.00058, 0],
      [0.00067, 2]
    ],
    "red_o_points": [],
    "y_categories": ["N", "NOT APPLICABLE", "nan"],
    "blue_o_points": [],
    "blue_x_points": [
      [0.00189, 2],
      [0.00145, 2],
      [0.00132, 0],
      [0.00236, 0],
      [0.00041, 2],
      [0.00296, 0],
      [0.00145, 0],
      [0.00138, 0],
      [0.00307, 2],
      [0.00865, 1],
      [-0.00123, 0],
      [0.00205, 0],
      [0.00335, 2],
      [0.00145, 2],
      [0.00154, 2],
      [0.00121, 2],
      [0.00305, 2],
      [0.0014, 2],
      [0.00029, 1],
      [0.00183, 2],
      [0.00119, 2]
    ]
  },
  "QS_mulGraftNerve[other]": {
    "red_x_points": [
      [-0.00246, 1],
      [-0.00189, 0],
      [-0.0007, 0],
      [-0.00015, 0],
      [-0.00133, 0],
      [-1e-5, 0],
      [-8e-5, 2],
      [-0.00243, 1],
      [0.00117, 2],
      [-0.00201, 0],
      [0.00038, 2],
      [-0.0019, 0],
      [0.00037, 2],
      [-3e-5, 0],
      [-0.00404, 1],
      [0.00018, 2],
      [-0.00142, 0],
      [0.00034, 2],
      [-0.00073, 0],
      [-0.00157, 0],
      [-0.00284, 1],
      [0.0001, 0],
      [0.00031, 2]
    ],
    "red_o_points": [],
    "y_categories": ["N", "NOT APPLICABLE", "nan"],
    "blue_o_points": [],
    "blue_x_points": [
      [0.00129, 2],
      [0.00097, 2],
      [0.00056, 0],
      [0.00093, 0],
      [0.00037, 2],
      [0.00117, 0],
      [0.00085, 0],
      [0.00025, 0],
      [0.00199, 2],
      [0.00472, 1],
      [-0.00097, 0],
      [0.0016, 0],
      [0.00169, 2],
      [0.0004, 2],
      [0.00032, 2],
      [0.00019, 2],
      [0.00211, 2],
      [0.00058, 2],
      [0.00056, 1],
      [0.0006, 2],
      [0.00056, 2]
    ]
  },
  "QS_mulTransfSite[AcSsAA]": {
    "red_x_points": [
      [-0.01072, 1],
      [-0.01654, 2],
      [-0.00144, 0],
      [-0.00148, 0],
      [-0.01072, 2],
      [0.00049, 0],
      [0.00013, 3],
      [-0.0137, 1],
      [0.00561, 3],
      [-0.01777, 2],
      [0.00237, 3],
      [-0.00159, 0],
      [0.00173, 3],
      [-0.0054, 0],
      [-0.01604, 1],
      [0.00058, 3],
      [-0.01067, 2],
      [0.00313, 3],
      [-0.00217, 0],
      [-0.01378, 2],
      [-0.01053, 1],
      [0.00054, 0],
      [0.00251, 3]
    ],
    "red_o_points": [],
    "y_categories": ["N", "NOT APPLICABLE", "Y", "nan"],
    "blue_o_points": [],
    "blue_x_points": [
      [0.00516, 3],
      [0.00392, 3],
      [0.00555, 2],
      [0.00411, 0],
      [0.00307, 3],
      [0.00409, 0],
      [0.01085, 2],
      [0.00114, 0],
      [0.0088, 3],
      [0.01716, 1],
      [0.00672, 0],
      [0.00562, 0],
      [0.00737, 3],
      [0.00316, 3],
      [0.00352, 3],
      [0.00251, 3],
      [0.00813, 3],
      [0.00315, 3],
      [0.00204, 1],
      [0.00478, 3],
      [0.00463, 3]
    ]
  },
  "QS_mulGraftNerve[Ax]": {
    "red_x_points": [
      [-0.00109, 1],
      [-0.00109, 0],
      [-0.00042, 0],
      [-0.00021, 0],
      [-0.00025, 0],
      [0.00013, 0],
      [3e-5, 2],
      [-0.00118, 1],
      [0.00038, 2],
      [-0.00083, 0],
      [2e-5, 2],
      [-0.0009, 0],
      [-3e-5, 2],
      [-0.00031, 0],
      [-0.00165, 1],
      [2e-5, 2],
      [-0.00068, 0],
      [2e-5, 2],
      [-0.0005, 0],
      [-0.00073, 0],
      [-0.0012, 1],
      [3e-5, 0],
      [4e-5, 2]
    ],
    "red_o_points": [],
    "y_categories": ["N", "NOT APPLICABLE", "nan"],
    "blue_o_points": [],
    "blue_x_points": [
      [0.0005, 2],
      [0.00025, 2],
      [0.00019, 0],
      [0.00051, 0],
      [0.00028, 2],
      [0.00049, 0],
      [0.00017, 0],
      [0.00033, 0],
      [0.00092, 2],
      [0.00248, 1],
      [-0.00029, 0],
      [0.00075, 0],
      [0.0007, 2],
      [0.00038, 2],
      [0.00032, 2],
      [0.00016, 2],
      [0.00071, 2],
      [0.00027, 2],
      [0.00036, 1],
      [0.00073, 2],
      [0.00019, 2]
    ]
  },
  "QA_lstPexMuscstrength[WristFlex]": {
    "red_x_points": [
      [-0.00105, 0],
      [-0.00264, 2],
      [-0.00841, 1],
      [0.00117, 0],
      [-0.00624, 1],
      [-0.01172, 1],
      [-0.00242, 0],
      [0.00011, 0],
      [-0.00205, 2],
      [-0.00421, 2],
      [-6e-5, 0],
      [-0.00289, 2],
      [-0.00783, 1],
      [0.00127, 0],
      [0.00092, 0],
      [-0.0028, 1],
      [-0.00641, 1],
      [-0.00375, 0],
      [0.00244, 0],
      [0.00163, 0],
      [-0.00162, 2],
      [-0.00726, 1],
      [-0.00476, 2]
    ],
    "red_o_points": [],
    "y_categories": ["GREATER THAN OR EQUALS TO 3", "LESS THAN 3", "nan"],
    "blue_o_points": [],
    "blue_x_points": [
      [0.00424, 1],
      [0.00675, 0],
      [0.00182, 0],
      [0.00437, 0],
      [0.00392, 0],
      [0.00654, 0],
      [0.00355, 0],
      [0.00394, 0],
      [0.00115, 2],
      [0.00086, 2],
      [0.00633, 0],
      [0.0062, 0],
      [0.00119, 2],
      [0.00063, 0],
      [0.00085, 0],
      [0.00205, 0],
      [0.00212, 2],
      [0.00312, 1],
      [0.00092, 0],
      [0.00681, 1],
      [0.0012, 2]
    ]
  },
  "QS_mulNeuromadSite[C5]": {
    "red_x_points": [
      [-0.0028, 1],
      [-0.00164, 0],
      [-0.00067, 0],
      [4e-5, 0],
      [-0.00095, 0],
      [0.0003, 0],
      [0.00022, 2],
      [-0.0032, 1],
      [0.00068, 2],
      [-0.00105, 0],
      [0.00037, 2],
      [-0.00144, 0],
      [0.00011, 2],
      [0.00024, 0],
      [-0.00365, 1],
      [0.0001, 2],
      [-0.0007, 0],
      [0.00012, 2],
      [-0.00079, 0],
      [-0.00166, 0],
      [-0.00244, 1],
      [8e-5, 0],
      [-2e-5, 2]
    ],
    "red_o_points": [],
    "y_categories": ["N", "NOT APPLICABLE", "nan"],
    "blue_o_points": [],
    "blue_x_points": [
      [0.00098, 2],
      [0.00042, 2],
      [0.00066, 0],
      [0.00109, 0],
      [0.00023, 2],
      [0.00114, 0],
      [0.00043, 0],
      [0.00059, 0],
      [0.00125, 2],
      [0.00441, 1],
      [-0.00032, 0],
      [0.00137, 0],
      [0.00127, 2],
      [0.00064, 2],
      [0.0007, 2],
      [0.00049, 2],
      [0.00153, 2],
      [0.00061, 2],
      [-4e-5, 1],
      [0.00089, 2],
      [0.00042, 2]
    ]
  },
  "QS_mulNeuromadSite[C7]": {
    "red_x_points": [
      [-0.00831, 1],
      [-0.00544, 0],
      [-0.00165, 0],
      [0.00048, 0],
      [-0.00347, 0],
      [0.00093, 0],
      [0.00011, 2],
      [-0.00821, 1],
      [0.00278, 2],
      [-0.00453, 0],
      [0.00087, 2],
      [-0.00512, 0],
      [0.00089, 2],
      [0.00016, 0],
      [-0.01328, 1],
      [0.00042, 2],
      [-0.00404, 0],
      [0.00055, 2],
      [-0.00224, 0],
      [-0.00527, 0],
      [-0.00911, 1],
      [0.00066, 0],
      [0.00091, 2]
    ],
    "red_o_points": [],
    "y_categories": ["N", "NOT APPLICABLE", "nan"],
    "blue_o_points": [],
    "blue_x_points": [
      [0.00304, 2],
      [0.00183, 2],
      [0.00211, 0],
      [0.00402, 0],
      [0.00084, 2],
      [0.00397, 0],
      [0.00217, 0],
      [0.00124, 0],
      [0.00497, 2],
      [0.01512, 1],
      [-0.00228, 0],
      [0.0042, 0],
      [0.00434, 2],
      [0.00126, 2],
      [0.00187, 2],
      [0.00084, 2],
      [0.00491, 2],
      [0.00213, 2],
      [0.00116, 1],
      [0.00263, 2],
      [0.00155, 2]
    ]
  },
  "QS_mulGraftNerve[TD]": {
    "red_x_points": [
      [-0.00026, 1],
      [-0.00028, 0],
      [-0.00014, 0],
      [5e-5, 0],
      [-0.00023, 0],
      [0.00012, 0],
      [1e-5, 2],
      [-0.00065, 1],
      [9e-5, 2],
      [-0.0001, 0],
      [0.00016, 2],
      [-0.00013, 0],
      [0.00012, 2],
      [-3e-5, 0],
      [-0.00093, 1],
      [1e-5, 2],
      [-0.00019, 0],
      [0.00012, 2],
      [-0.00037, 0],
      [-0.00034, 0],
      [-0.00056, 1],
      [0.0001, 0],
      [7e-5, 2]
    ],
    "red_o_points": [],
    "y_categories": ["N", "NOT APPLICABLE", "nan"],
    "blue_o_points": [],
    "blue_x_points": [
      [0.00026, 2],
      [9e-5, 2],
      [0.00015, 0],
      [0.00034, 0],
      [0.00014, 2],
      [0.00015, 0],
      [1e-5, 0],
      [9e-5, 0],
      [0.00013, 2],
      [0.00064, 1],
      [6e-5, 0],
      [0.00027, 0],
      [0.00016, 2],
      [0.0001, 2],
      [0.00014, 2],
      [0.00014, 2],
      [0.00016, 2],
      [0.00013, 2],
      [-2e-5, 1],
      [0.00016, 2],
      [4e-5, 2]
    ]
  },
  "QA_intPexForearmSupin": {
    "red_x_points": [
      [-0.00058, 2],
      [-0.00708, 0],
      [-0.00066, 2],
      [-0.00065, 2],
      [-0.00059, 2],
      [-0.00067, 2],
      [-0.02256, 0],
      [-0.01626, 0],
      [-0.00091, 2],
      [-0.00068, 2],
      [-0.00097, 2],
      [-0.00023, 2],
      [-0.00147, 2],
      [0.00396, 1],
      [-0.00058, 2],
      [-0.01592, 0],
      [-0.00017, 1],
      [-0.00075, 2],
      [-0.00056, 2],
      [-0.00084, 2],
      [0.00471, 1],
      [-0.01059, 0],
      [-0.00131, 2]
    ],
    "red_o_points": [],
    "y_categories": ["GREATER THAN OR EQUALS TO 80", "LESS THAN 80", "nan"],
    "blue_o_points": [],
    "blue_x_points": [
      [-0.00018, 2],
      [0.01598, 1],
      [0.00674, 1],
      [0.01246, 1],
      [0.01003, 1],
      [-0.00017, 2],
      [-2e-5, 2],
      [-0.00019, 2],
      [-0.00026, 2],
      [-0.00015, 2],
      [0.00269, 0],
      [0.00011, 2],
      [-0.00026, 2],
      [0.00988, 1],
      [0.00819, 1],
      [-0.00021, 2],
      [-0.00031, 2],
      [-0.00014, 2],
      [-0.00014, 2],
      [0.01148, 1],
      [-0.00018, 2]
    ]
  },
  "QS_mulGraftNerve[SS]": {
    "red_x_points": [
      [-0.00022, 1],
      [-9e-5, 0],
      [2e-5, 0],
      [8e-5, 0],
      [-9e-5, 0],
      [6e-5, 0],
      [2e-5, 2],
      [-0.00035, 1],
      [0.00012, 2],
      [-5e-5, 0],
      [2e-5, 2],
      [-0.00016, 0],
      [-0.0, 2],
      [5e-5, 0],
      [-0.00056, 1],
      [2e-5, 2],
      [-9e-5, 0],
      [2e-5, 2],
      [4e-5, 0],
      [-0.00019, 0],
      [-0.00026, 1],
      [3e-5, 0],
      [2e-5, 2]
    ],
    "red_o_points": [],
    "y_categories": ["N", "NOT APPLICABLE", "nan"],
    "blue_o_points": [],
    "blue_x_points": [
      [2e-5, 2],
      [2e-5, 2],
      [8e-5, 0],
      [0.00015, 0],
      [0.00018, 0],
      [9e-5, 0],
      [9e-5, 0],
      [0.00012, 2],
      [0.00034, 1],
      [-5e-5, 0],
      [0.0001, 0],
      [0.00012, 2],
      [1e-5, 2],
      [1e-5, 2],
      [1e-5, 2],
      [0.00013, 2],
      [1e-5, 2],
      [0.00012, 2],
      [-0.0, 2]
    ]
  },
  "QA_lstPexTouch[C5]": {
    "red_x_points": [
      [-0.00233, 0],
      [-0.00039, 2],
      [-0.00208, 1],
      [-0.00101, 1],
      [-0.00087, 2],
      [-0.00076, 1],
      [-0.00157, 1],
      [-0.00375, 1],
      [-0.00061, 2],
      [-0.00089, 2],
      [-0.00323, 1],
      [-0.00038, 2],
      [-0.00301, 1],
      [-0.00182, 1],
      [-0.00287, 1],
      [-0.00121, 1],
      [-0.00059, 2],
      [-0.00373, 1],
      [-0.00166, 1],
      [-0.00111, 2],
      [-0.00205, 1],
      [-0.00039, 1],
      [-0.00308, 1]
    ],
    "red_o_points": [],
    "y_categories": ["NORM", "NPV", "nan"],
    "blue_o_points": [],
    "blue_x_points": [
      [-0.00184, 1],
      [-0.00209, 1],
      [-0.00039, 1],
      [-0.00068, 1],
      [0.01517, 0],
      [-0.00041, 1],
      [-0.00042, 1],
      [-0.00058, 1],
      [0.00148, 2],
      [0.00288, 2],
      [0.00062, 2],
      [-0.00082, 1],
      [0.00192, 2],
      [-0.00121, 1],
      [0.00714, 0],
      [-0.00095, 1],
      [0.00188, 2],
      [0.00617, 0],
      [0.01289, 0],
      [-0.00099, 1],
      [-0.00036, 1]
    ]
  },
  "QS_mulLysisSite[Nerve]": {
    "red_x_points": [
      [-0.00635, 1],
      [-0.00198, 0],
      [-0.01292, 2],
      [-0.02336, 2],
      [-0.00113, 0],
      [0.00187, 0],
      [0.00096, 3],
      [-0.00744, 1],
      [0.00196, 3],
      [-0.00096, 0],
      [0.00165, 3],
      [-0.00161, 0],
      [0.00144, 3],
      [0.0007, 0],
      [-0.00639, 1],
      [0.00073, 3],
      [-0.00112, 0],
      [0.00185, 3],
      [9e-5, 0],
      [-0.00183, 0],
      [-0.00922, 1],
      [0.00182, 0],
      [0.00143, 3]
    ],
    "red_o_points": [],
    "y_categories": ["N", "NOT APPLICABLE", "Y", "nan"],
    "blue_o_points": [],
    "blue_x_points": [
      [0.00262, 3],
      [0.00172, 3],
      [0.00171, 0],
      [0.00545, 0],
      [0.00194, 3],
      [0.00381, 0],
      [0.00209, 0],
      [0.00575, 0],
      [0.00248, 3],
      [0.00501, 1],
      [-0.00068, 0],
      [0.0048, 0],
      [0.00209, 3],
      [0.00287, 3],
      [0.00272, 3],
      [0.00228, 3],
      [0.00282, 3],
      [0.00233, 3],
      [0.00186, 1],
      [0.00412, 3],
      [0.00208, 3]
    ]
  },
  "QA_lstPexMuscstrength[ElbowExte]": {
    "red_x_points": [
      [-0.0031, 2],
      [-0.00448, 2],
      [-0.00368, 1],
      [-0.0029, 1],
      [-0.00583, 1],
      [-0.00338, 1],
      [-0.00277, 1],
      [0.00104, 0],
      [-0.00207, 2],
      [-0.00724, 2],
      [-0.00557, 1],
      [-0.0038, 2],
      [-0.00067, 1],
      [-0.00782, 1],
      [0.00024, 0],
      [-0.00183, 1],
      [-0.00534, 1],
      [-0.0069, 0],
      [-0.0065, 1],
      [-0.00476, 2],
      [-0.00223, 2],
      [-0.00188, 1],
      [-0.00469, 2]
    ],
    "red_o_points": [],
    "y_categories": ["GREATER THAN OR EQUALS TO 3", "LESS THAN 3", "nan"],
    "blue_o_points": [],
    "blue_x_points": [
      [0.00064, 1],
      [0.00016, 1],
      [0.00781, 0],
      [-0.00243, 1],
      [0.00011, 1],
      [0.01546, 0],
      [0.01309, 0],
      [-0.00188, 1],
      [0.00049, 2],
      [-0.00061, 2],
      [0.01828, 0],
      [0.00096, 1],
      [0.00072, 2],
      [0.00686, 0],
      [0.00561, 0],
      [0.00664, 0],
      [0.00098, 2],
      [0.00379, 0],
      [0.00522, 0],
      [0.00234, 1],
      [0.0019, 1]
    ]
  },
  "QA_lstPexMuscstrength[FingersAddu]": {
    "red_x_points": [
      [0.00022, 2],
      [-8e-5, 2],
      [-0.01702, 1],
      [-8e-5, 2],
      [-0.0154, 1],
      [-0.01918, 1],
      [0.00532, 0],
      [0.00604, 0],
      [0.00024, 2],
      [0.00014, 2],
      [0.00381, 0],
      [0.0004, 2],
      [-0.0179, 1],
      [0.00717, 0],
      [0.00535, 0],
      [-0.01355, 1],
      [-0.01409, 1],
      [0.00047, 2],
      [-0.00038, 2],
      [-0.01395, 1],
      [-8e-5, 2],
      [-0.01408, 1],
      [-0.00159, 2]
    ],
    "red_o_points": [],
    "y_categories": ["GREATER THAN OR EQUALS TO 3", "LESS THAN 3", "nan"],
    "blue_o_points": [],
    "blue_x_points": [
      [0.01271, 0],
      [-0.00445, 1],
      [0.00591, 0],
      [0.00933, 0],
      [0.01006, 0],
      [0.01124, 0],
      [0.00155, 2],
      [0.01037, 0],
      [0.00067, 2],
      [0.00125, 2],
      [0.00114, 2],
      [0.00228, 2],
      [0.00117, 2],
      [0.00635, 0],
      [0.00645, 0],
      [0.00789, 0],
      [0.00164, 2],
      [0.00104, 2],
      [0.00956, 0],
      [0.00122, 2],
      [0.00083, 2]
    ]
  },
  "QA_equInjTbpiTime": {
    "red_x_points": [
      [-0.01282, 0],
      [-0.01169, 0],
      [0.00258, 3],
      [0.00226, 3],
      [-0.01049, 0],
      [-0.00918, 0],
      [-0.01044, 0],
      [-0.0112, 0],
      [0.00294, 3],
      [-0.01178, 0],
      [-0.01221, 0],
      [-0.01134, 0],
      [0.00095, 3],
      [0.00139, 3],
      [-0.01132, 0],
      [-0.00873, 0],
      [-0.01429, 2],
      [-0.02376, 2],
      [-0.01089, 0],
      [-0.0183, 2],
      [-0.01267, 0],
      [0.00212, 3],
      [0.0109, 1]
    ],
    "red_o_points": [],
    "y_categories": [
      "0 TO 6 MONTHS",
      "13 TO 24 MONTHS",
      "25 MONTHS OR MORE",
      "7 TO 12 MONTHS",
      "nan"
    ],
    "blue_o_points": [],
    "blue_x_points": [
      [-0.00738, 0],
      [0.0249, 1],
      [-0.00785, 0],
      [0.02694, 1],
      [0.00564, 3],
      [-0.00848, 0],
      [-0.00691, 0],
      [0.00496, 3],
      [-0.0078, 0],
      [-0.00283, 2],
      [0.03077, 1],
      [0.00712, 3],
      [0.02662, 1],
      [0.00477, 3],
      [0.02402, 1],
      [0.02359, 1],
      [0.00787, 3],
      [0.02215, 1],
      [0.00884, 3],
      [0.00644, 3],
      [-0.00541, 0]
    ]
  },
  "QS_mulTransfSite[IMc]": {
    "red_x_points": [
      [-0.01272, 1],
      [-0.02277, 2],
      [0.00028, 0],
      [-0.02765, 2],
      [-0.00222, 0],
      [0.00428, 0],
      [0.00293, 3],
      [-0.01425, 1],
      [0.00725, 3],
      [-0.0014, 0],
      [0.00392, 3],
      [-0.02177, 2],
      [0.00388, 3],
      [0.00103, 0],
      [-0.01673, 1],
      [0.00247, 3],
      [-0.00273, 0],
      [0.00442, 3],
      [0.0005, 0],
      [-0.02135, 2],
      [-0.0168, 1],
      [-0.01302, 2],
      [0.0044, 3]
    ],
    "red_o_points": [],
    "y_categories": ["N", "NOT APPLICABLE", "Y", "nan"],
    "blue_o_points": [],
    "blue_x_points": [
      [0.00735, 3],
      [0.00588, 3],
      [0.00434, 0],
      [0.00895, 0],
      [0.00548, 3],
      [0.00781, 0],
      [0.00517, 0],
      [0.00751, 0],
      [0.00952, 3],
      [0.01376, 1],
      [0.00157, 0],
      [0.00847, 0],
      [0.0085, 3],
      [0.00548, 3],
      [0.00547, 3],
      [0.00512, 3],
      [0.00861, 3],
      [0.00519, 3],
      [0.00072, 1],
      [0.00706, 3],
      [0.00612, 3]
    ]
  },
  "QA_lstPexTouch[T1]": {
    "red_x_points": [
      [-0.00882, 1],
      [-0.00183, 2],
      [-0.00562, 1],
      [0.00371, 0],
      [-0.00204, 2],
      [-0.00624, 1],
      [0.00387, 0],
      [-0.00906, 1],
      [-0.00255, 2],
      [-0.00432, 2],
      [-0.00968, 1],
      [-0.00254, 2],
      [-0.00695, 1],
      [-0.01159, 1],
      [-0.00908, 1],
      [-0.00511, 1],
      [-0.00227, 2],
      [0.00091, 0],
      [-0.009, 1],
      [-0.00324, 2],
      [-0.00996, 1],
      [-0.00461, 1],
      [-0.00746, 1]
    ],
    "red_o_points": [],
    "y_categories": ["NORM", "NPV", "nan"],
    "blue_o_points": [],
    "blue_x_points": [
      [-0.00425, 1],
      [-0.00443, 1],
      [0.01155, 0],
      [-0.0044, 1],
      [-0.00422, 1],
      [0.01672, 0],
      [0.01657, 0],
      [0.01328, 0],
      [0.00181, 2],
      [0.00276, 2],
      [-0.00084, 2],
      [-0.00362, 1],
      [0.00197, 2],
      [0.01021, 0],
      [0.00934, 0],
      [0.01111, 0],
      [0.00235, 2],
      [-0.00499, 1],
      [0.01555, 0],
      [0.01297, 0],
      [0.01404, 0]
    ]
  },
  "QA_lstPexArthre[Elbow]": {
    "red_x_points": [
      [-0.00013, 2],
      [-0.00074, 3],
      [-0.0014, 3],
      [-0.00017, 2],
      [-0.00525, 0],
      [-0.00801, 1],
      [-0.00128, 2],
      [-0.00041, 2],
      [-0.0006, 3],
      [0.00099, 2],
      [-0.00182, 3],
      [-0.00076, 3],
      [-0.00188, 3],
      [0.00051, 2],
      [-0.00064, 2],
      [-0.00286, 2],
      [-0.00069, 3],
      [-0.00143, 3],
      [-0.00292, 3],
      [-0.00073, 3],
      [-0.00044, 3],
      [0.00038, 2],
      [-0.00206, 3]
    ],
    "red_o_points": [],
    "y_categories": ["NAIA", "NPV", "PV", "nan"],
    "blue_o_points": [],
    "blue_x_points": [
      [0.01456, 1],
      [-0.00087, 3],
      [0.00112, 2],
      [0.00172, 2],
      [-8e-5, 3],
      [0.00412, 2],
      [0.00184, 2],
      [0.0017, 2],
      [-0.00056, 3],
      [-0.00012, 3],
      [-0.00057, 3],
      [0.00457, 2],
      [-0.0003, 3],
      [0.00024, 2],
      [0.00038, 2],
      [0.00337, 1],
      [-0.00038, 3],
      [0.00028, 2],
      [7e-5, 3],
      [0.00069, 2],
      [0.00054, 2]
    ]
  },
  "QS_mulTransfSite[AcMc]": {
    "red_x_points": [
      [-0.00772, 1],
      [-0.00668, 0],
      [-0.00253, 0],
      [-0.00641, 0],
      [-0.00393, 0],
      [-0.00088, 0],
      [0.00056, 3],
      [-0.00862, 1],
      [0.00301, 3],
      [-0.00388, 0],
      [0.00117, 3],
      [-0.00396, 0],
      [0.00152, 3],
      [-0.00495, 0],
      [-0.01186, 1],
      [0.00069, 3],
      [-0.00355, 0],
      [0.00154, 3],
      [-0.00298, 0],
      [-0.00512, 0],
      [-0.01, 1],
      [-0.00098, 0],
      [0.00126, 3]
    ],
    "red_o_points": [],
    "y_categories": ["N", "NOT APPLICABLE", "Y", "nan"],
    "blue_o_points": [],
    "blue_x_points": [
      [0.00292, 3],
      [0.00239, 3],
      [0.00021, 0],
      [0.00148, 0],
      [0.00306, 3],
      [0.00201, 0],
      [0.00037, 0],
      [0.02195, 2],
      [0.00439, 3],
      [0.00863, 1],
      [-0.0022, 0],
      [0.00163, 0],
      [0.00369, 3],
      [0.00267, 3],
      [0.0034, 3],
      [0.0029, 3],
      [0.00381, 3],
      [0.00238, 3],
      [0.00184, 1],
      [0.00453, 3],
      [0.00226, 3]
    ]
  },
  "QS_mulTransfSite[Other]": {
    "red_x_points": [
      [-0.00431, 1],
      [-0.00097, 0],
      [-0.00033, 0],
      [0.00034, 0],
      [-0.00075, 0],
      [0.00053, 0],
      [-0.00037, 3],
      [-0.008, 1],
      [0.00088, 3],
      [-0.00124, 0],
      [0.00062, 3],
      [-0.00157, 0],
      [0.00038, 3],
      [-0.02828, 2],
      [-0.00626, 1],
      [0.00034, 3],
      [-0.00092, 0],
      [0.00061, 3],
      [0.00058, 0],
      [-0.00124, 0],
      [-0.00446, 1],
      [0.00031, 0],
      [0.00037, 3]
    ],
    "red_o_points": [],
    "y_categories": ["N", "NOT APPLICABLE", "Y", "nan"],
    "blue_o_points": [],
    "blue_x_points": [
      [0.00183, 3],
      [0.00143, 3],
      [0.00433, 0],
      [0.00336, 0],
      [0.00223, 3],
      [0.00298, 0],
      [0.00675, 0],
      [0.00429, 0],
      [0.00122, 3],
      [0.00346, 1],
      [0.00026, 0],
      [0.00253, 0],
      [0.00142, 3],
      [0.00355, 3],
      [0.0033, 3],
      [0.00209, 3],
      [0.0015, 3],
      [0.00201, 3],
      [0.00076, 1],
      [0.00271, 3],
      [0.00174, 3]
    ]
  },
  "QA_yonInjBpsurg": {
    "red_x_points": [
      [-0.00679, 0],
      [0.00018, 1],
      [0.00012, 1],
      [0.00084, 1],
      [4e-5, 1],
      [0.00062, 1],
      [0.00042, 1],
      [-0.0076, 0],
      [9e-5, 1],
      [0.00039, 1],
      [0.00036, 1],
      [0.0002, 1],
      [0.00048, 1],
      [0.00103, 1],
      [-0.00932, 0],
      [0.00028, 1],
      [-0.00096, 1],
      [-0.00086, 1],
      [0.00044, 1],
      [-0.00073, 1],
      [-0.00909, 0],
      [0.00021, 1],
      [0.00057, 1]
    ],
    "red_o_points": [],
    "y_categories": ["N", "Y", "nan"],
    "blue_o_points": [],
    "blue_x_points": [
      [0.00189, 1],
      [0.00141, 1],
      [0.00182, 1],
      [0.0014, 1],
      [0.00067, 1],
      [0.002, 1],
      [0.0021, 1],
      [0.0014, 1],
      [0.00079, 1],
      [0.00297, 0],
      [0.00036, 1],
      [0.00161, 1],
      [0.00051, 1],
      [0.00186, 1],
      [0.00184, 1],
      [0.00104, 1],
      [0.00019, 1],
      [0.002, 1],
      [-0.00069, 0],
      [0.00237, 1],
      [0.00155, 1]
    ]
  },
  "QA_lstPexTouch[C8]": {
    "red_x_points": [
      [0.00991, 0],
      [-0.00394, 2],
      [-0.00907, 1],
      [-0.01435, 1],
      [-0.00274, 2],
      [-0.00842, 1],
      [-0.011, 1],
      [-0.01269, 1],
      [-0.00306, 2],
      [-0.00354, 2],
      [-0.01237, 1],
      [-0.00294, 2],
      [-0.01284, 1],
      [0.01022, 0],
      [-0.01112, 1],
      [-0.00979, 1],
      [-0.00291, 2],
      [0.00854, 0],
      [-0.01058, 1],
      [-0.00473, 2],
      [-0.01373, 1],
      [-0.00915, 1],
      [-0.0137, 1]
    ],
    "red_o_points": [],
    "y_categories": ["NORM", "NPV", "nan"],
    "blue_o_points": [],
    "blue_x_points": [
      [-0.00891, 1],
      [-0.00901, 1],
      [0.01489, 0],
      [-0.00809, 1],
      [0.01965, 0],
      [-0.00736, 1],
      [0.01776, 0],
      [0.01765, 0],
      [0.00035, 2],
      [0.0014, 2],
      [-0.00048, 2],
      [-0.00797, 1],
      [0.00079, 2],
      [0.0149, 0],
      [0.0142, 0],
      [0.01576, 0],
      [0.00107, 2],
      [0.01384, 0],
      [0.01729, 0],
      [0.01844, 0],
      [0.01782, 0]
    ]
  },
  "QS_mulLysisNerve[Ssr]": {
    "red_x_points": [
      [-0.00499, 1],
      [-0.00087, 0],
      [-0.0096, 2],
      [-0.01964, 2],
      [-0.00085, 0],
      [0.00232, 0],
      [0.00065, 3],
      [-0.00536, 1],
      [0.00117, 3],
      [-0.0007, 0],
      [0.00107, 3],
      [-0.00084, 0],
      [0.00126, 3],
      [0.00054, 0],
      [-0.00572, 1],
      [0.00055, 3],
      [-0.00082, 0],
      [0.00101, 3],
      [0.00111, 0],
      [-0.00112, 0],
      [-0.00823, 1],
      [0.00177, 0],
      [0.00108, 3]
    ],
    "red_o_points": [],
    "y_categories": ["N", "NOT APPLICABLE", "Y", "nan"],
    "blue_o_points": [],
    "blue_x_points": [
      [0.00218, 3],
      [0.00191, 3],
      [0.00139, 0],
      [0.00479, 0],
      [0.00169, 3],
      [0.00413, 0],
      [0.00172, 0],
      [0.00476, 0],
      [0.00134, 3],
      [0.00281, 1],
      [-0.00058, 0],
      [0.00499, 0],
      [0.00101, 3],
      [0.00193, 3],
      [0.00235, 3],
      [0.00136, 3],
      [0.00172, 3],
      [0.00167, 3],
      [0.00089, 1],
      [0.00284, 3],
      [0.00132, 3]
    ]
  },
  "QS_mulBpsurgeryType[Graft]": {
    "red_x_points": [
      [-0.00349, 1],
      [-0.00178, 0],
      [-0.00078, 0],
      [0.00037, 0],
      [-0.00156, 0],
      [0.00016, 0],
      [0.00024, 3],
      [-0.00319, 1],
      [0.00165, 3],
      [-0.01399, 2],
      [0.00077, 3],
      [-0.0014, 0],
      [0.00031, 3],
      [0.00024, 0],
      [-0.00421, 1],
      [0.00023, 3],
      [-0.00165, 0],
      [0.00092, 3],
      [-0.00064, 0],
      [-0.00176, 0],
      [-0.00234, 1],
      [0.00024, 0],
      [0.00059, 3]
    ],
    "red_o_points": [],
    "y_categories": ["N", "NOT APPLICABLE", "Y", "nan"],
    "blue_o_points": [],
    "blue_x_points": [
      [0.0013, 3],
      [0.00054, 3],
      [0.00088, 0],
      [0.00141, 0],
      [0.0005, 3],
      [0.00235, 0],
      [0.00211, 0],
      [0.00151, 0],
      [0.00237, 3],
      [0.00502, 1],
      [-0.00012, 0],
      [0.00338, 0],
      [0.00205, 3],
      [0.00051, 3],
      [0.00057, 3],
      [0.00027, 3],
      [0.00211, 3],
      [0.00077, 3],
      [0.00105, 1],
      [0.00116, 3],
      [0.00131, 3]
    ]
  },
  "QA_lstPexTinel[TinelSign]": {
    "red_x_points": [
      [0.00141, 1],
      [7e-5, 1],
      [-0.00938, 2],
      [0.00135, 1],
      [0.00045, 1],
      [0.00106, 1],
      [-0.01249, 2],
      [-0.0123, 2],
      [-0.00461, 1],
      [0.00078, 1],
      [-0.01558, 2],
      [-0.00844, 2],
      [-0.00059, 1],
      [-0.01613, 2],
      [0.00228, 1],
      [-0.0095, 2],
      [0.0008, 1],
      [-0.0018, 1],
      [-0.0139, 2],
      [-0.00933, 2],
      [0.00042, 1],
      [-0.00811, 2],
      [-0.00119, 1]
    ],
    "red_o_points": [],
    "y_categories": ["ABS", "NAIA", "PT", "nan"],
    "blue_o_points": [],
    "blue_x_points": [
      [0.00542, 1],
      [0.0351, 0],
      [0.01794, 0],
      [-0.00851, 2],
      [0.00397, 1],
      [0.00517, 1],
      [-0.00683, 2],
      [0.00523, 1],
      [0.00373, 2],
      [0.00169, 1],
      [0.00604, 1],
      [0.00517, 1],
      [0.00092, 1],
      [0.0205, 0],
      [0.00406, 1],
      [0.00332, 1],
      [0.00035, 2],
      [0.0028, 1],
      [0.00471, 1],
      [0.00209, 1],
      [0.00186, 1]
    ]
  },
  "QS_mulLysisRoot[C5]": {
    "red_x_points": [
      [-0.004, 1],
      [-0.00102, 0],
      [-0.01126, 2],
      [0.00139, 0],
      [-0.00046, 0],
      [0.00199, 0],
      [0.00067, 3],
      [-0.00466, 1],
      [0.00099, 3],
      [-0.00037, 0],
      [0.00078, 3],
      [-0.00086, 0],
      [0.00098, 3],
      [0.00068, 0],
      [-0.00421, 1],
      [0.00078, 3],
      [-0.00081, 0],
      [0.00106, 3],
      [0.00051, 0],
      [-0.00099, 0],
      [-0.00361, 1],
      [-0.00768, 2],
      [0.00079, 3]
    ],
    "red_o_points": [],
    "y_categories": ["N", "NOT APPLICABLE", "Y", "nan"],
    "blue_o_points": [],
    "blue_x_points": [
      [0.00135, 3],
      [0.00119, 3],
      [0.00085, 0],
      [0.00357, 0],
      [0.00088, 3],
      [0.00252, 0],
      [0.00145, 0],
      [0.00131, 0],
      [0.00093, 3],
      [0.00404, 1],
      [-0.00062, 0],
      [0.00326, 0],
      [0.00101, 3],
      [0.00071, 3],
      [0.00048, 3],
      [0.00025, 3],
      [0.00162, 3],
      [0.00036, 3],
      [0.00245, 1],
      [0.00111, 3],
      [0.00058, 3]
    ]
  },
  "QS_mulNeuromadSite[C6]": {
    "red_x_points": [
      [-0.00298, 1],
      [-0.00202, 0],
      [-0.00043, 0],
      [0.00039, 0],
      [-0.00116, 0],
      [0.0003, 0],
      [-0.00028, 2],
      [-0.00392, 1],
      [0.00101, 2],
      [-0.00178, 0],
      [0.00059, 2],
      [-0.00202, 0],
      [0.00011, 2],
      [7e-5, 0],
      [-0.00682, 1],
      [-1e-5, 2],
      [-0.00161, 0],
      [1e-5, 2],
      [-0.00036, 0],
      [-0.00194, 0],
      [-0.00303, 1],
      [0.00035, 0],
      [0.00029, 2]
    ],
    "red_o_points": [],
    "y_categories": ["N", "NOT APPLICABLE", "nan"],
    "blue_o_points": [],
    "blue_x_points": [
      [0.00127, 2],
      [0.00087, 2],
      [0.00068, 0],
      [0.00184, 0],
      [0.00047, 2],
      [0.00145, 0],
      [0.00078, 0],
      [0.00081, 0],
      [0.00157, 2],
      [0.00549, 1],
      [-0.00054, 0],
      [0.00143, 0],
      [0.00155, 2],
      [0.00082, 2],
      [0.00107, 2],
      [0.00063, 2],
      [0.00172, 2],
      [0.00073, 2],
      [0.00074, 1],
      [0.00112, 2],
      [0.00073, 2]
    ]
  },
  "QS_mulNeuromadSite[T1]": {
    "red_x_points": [
      [-0.00141, 1],
      [-0.00106, 0],
      [-0.00012, 0],
      [0.00024, 0],
      [-0.00036, 0],
      [0.00025, 0],
      [-0.00015, 2],
      [-0.00272, 1],
      [0.00047, 2],
      [-0.00071, 0],
      [-0.00016, 2],
      [-0.00066, 0],
      [3e-5, 2],
      [5e-5, 0],
      [-0.00341, 1],
      [2e-5, 2],
      [-0.00068, 0],
      [1e-5, 2],
      [-1e-5, 0],
      [-0.00089, 0],
      [-0.00182, 1],
      [0.00015, 0],
      [8e-5, 2]
    ],
    "red_o_points": [],
    "y_categories": ["N", "NOT APPLICABLE", "nan"],
    "blue_o_points": [],
    "blue_x_points": [
      [0.00048, 2],
      [0.0002, 2],
      [0.00077, 0],
      [0.00124, 0],
      [0.00023, 2],
      [0.00096, 0],
      [0.00082, 0],
      [0.00063, 0],
      [0.00081, 2],
      [0.002, 1],
      [-0.00047, 0],
      [0.00081, 0],
      [0.00089, 2],
      [0.00045, 2],
      [0.00038, 2],
      [0.00042, 2],
      [0.00089, 2],
      [0.00048, 2],
      [0.00018, 1],
      [0.00042, 2],
      [0.00028, 2]
    ]
  },
  "QS_mulGraftNerve[LT]": {
    "red_x_points": [
      [-0.00018, 1],
      [-0.00013, 0],
      [-5e-5, 0],
      [5e-5, 0],
      [0.0, 2],
      [-8e-5, 0],
      [-2e-5, 2],
      [-4e-5, 0],
      [0.0, 2],
      [-0.00018, 1],
      [-2e-5, 2],
      [-5e-5, 0],
      [-0.00023, 1],
      [2e-5, 2]
    ],
    "red_o_points": [],
    "y_categories": ["N", "NOT APPLICABLE", "nan"],
    "blue_o_points": [],
    "blue_x_points": [
      [0.0001, 2],
      [-2e-5, 2],
      [-0.0, 0],
      [5e-5, 0],
      [0.0, 2],
      [0.00031, 1],
      [-4e-5, 0],
      [0.00015, 0],
      [2e-5, 2],
      [5e-5, 2],
      [8e-5, 1],
      [7e-5, 2],
      [0.0001, 2]
    ]
  },
  "QA_lstPexMuscstrength[ShoulderAbduc]": {
    "red_x_points": [
      [-0.00109, 2],
      [0.00018, 1],
      [0.0001, 1],
      [0.00069, 1],
      [0.00017, 1],
      [0.00077, 1],
      [0.0006, 1],
      [-0.01635, 0],
      [-0.0007, 2],
      [-0.00106, 2],
      [-0.00354, 2],
      [-0.00064, 2],
      [0.00016, 1],
      [0.00121, 1],
      [-0.02204, 0],
      [0.00016, 1],
      [0.00026, 1],
      [0.00034, 1],
      [0.00071, 1],
      [0.00047, 1],
      [-0.00104, 2],
      [0.0004, 1],
      [-0.00078, 2]
    ],
    "red_o_points": [],
    "y_categories": ["GREATER THAN OR EQUALS TO 3", "LESS THAN 3", "nan"],
    "blue_o_points": [],
    "blue_x_points": [
      [0.00261, 1],
      [0.00264, 1],
      [0.00251, 1],
      [0.0023, 1],
      [0.00225, 1],
      [0.00437, 1],
      [0.00214, 1],
      [0.00145, 1],
      [0.00038, 2],
      [0.00093, 2],
      [0.001, 1],
      [0.00099, 2],
      [0.00073, 2],
      [0.00221, 1],
      [0.00277, 1],
      [-0.00054, 2],
      [0.00053, 2],
      [0.00169, 1],
      [0.00777, 1],
      [0.00077, 1],
      [0.00149, 1]
    ]
  },
  "QA_lstPexMuscstrength[ThumbOppo]": {
    "red_x_points": [
      [0.0006, 2],
      [0.00037, 2],
      [-0.01065, 1],
      [-0.02353, 1],
      [-0.00793, 1],
      [-0.01403, 1],
      [-0.00067, 0],
      [0.00255, 0],
      [0.00018, 2],
      [0.0002, 2],
      [-0.00338, 0],
      [0.00054, 2],
      [-0.00768, 1],
      [0.00367, 0],
      [0.00206, 0],
      [-0.00587, 1],
      [-0.00828, 1],
      [0.00045, 2],
      [0.00298, 0],
      [-0.00816, 1],
      [-0.00031, 2],
      [-0.00967, 1],
      [-0.00157, 2]
    ],
    "red_o_points": [],
    "y_categories": ["GREATER THAN OR EQUALS TO 3", "LESS THAN 3", "nan"],
    "blue_o_points": [],
    "blue_x_points": [
      [-0.00023, 1],
      [0.00147, 1],
      [0.00447, 0],
      [0.0074, 0],
      [0.007, 0],
      [0.01018, 0],
      [0.00597, 0],
      [0.0097, 0],
      [0.00171, 2],
      [0.00139, 2],
      [0.00207, 2],
      [0.00816, 2],
      [0.0013, 2],
      [0.00434, 0],
      [0.00439, 0],
      [0.0058, 0],
      [0.00296, 2],
      [0.00128, 2],
      [0.00528, 0],
      [0.00211, 2],
      [0.0014, 2]
    ]
  },
  "QA_lstPexMuscstrength[ShoulderExrot]": {
    "red_x_points": [
      [-0.00089, 2],
      [-0.00038, 2],
      [-0.0139, 0],
      [-0.00084, 2],
      [0.0032, 1],
      [-0.00059, 2],
      [0.00215, 1],
      [-0.0212, 0],
      [-0.00075, 2],
      [-0.00057, 2],
      [-0.00113, 2],
      [-0.00037, 2],
      [-0.00064, 2],
      [0.00352, 1],
      [-0.02669, 0],
      [0.00215, 1],
      [-9e-5, 2],
      [-0.00021, 2],
      [0.00439, 1],
      [-0.01661, 0],
      [-0.00047, 2],
      [0.00216, 1],
      [-0.00083, 2]
    ],
    "red_o_points": [],
    "y_categories": ["GREATER THAN OR EQUALS TO 3", "LESS THAN 3", "nan"],
    "blue_o_points": [],
    "blue_x_points": [
      [0.0103, 1],
      [-0.00011, 2],
      [0.00551, 1],
      [0.00609, 1],
      [0.00671, 1],
      [0.00946, 1],
      [0.00543, 1],
      [5e-5, 2],
      [0.00035, 2],
      [0.00043, 2],
      [0.00049, 2],
      [0.00046, 2],
      [0.00062, 2],
      [0.00604, 1],
      [0.00602, 1],
      [0.0003, 2],
      [0.00016, 2],
      [0.00059, 2],
      [0.01002, 1],
      [-6e-5, 2],
      [-0.00031, 2]
    ]
  },
  "QS_mulNeuromadSite[T2]": {
    "red_x_points": [
      [-0.00226, 1],
      [-0.00148, 0],
      [-0.00024, 0],
      [0.00042, 0],
      [-0.00084, 0],
      [0.00028, 0],
      [6e-5, 2],
      [-0.00228, 1],
      [0.00086, 2],
      [-0.00063, 0],
      [0.00029, 2],
      [-0.00118, 0],
      [0.00013, 2],
      [1e-5, 0],
      [-0.00323, 1],
      [-1e-5, 2],
      [-0.00088, 0],
      [-0.00015, 2],
      [-0.00032, 0],
      [-0.00145, 0],
      [-0.00183, 1],
      [0.00011, 0],
      [0.00012, 2]
    ],
    "red_o_points": [],
    "y_categories": ["N", "NOT APPLICABLE", "nan"],
    "blue_o_points": [],
    "blue_x_points": [
      [0.00074, 2],
      [0.00034, 2],
      [0.0004, 0],
      [0.00086, 0],
      [9e-5, 2],
      [0.00104, 0],
      [0.00055, 0],
      [0.00038, 0],
      [0.00127, 2],
      [0.00358, 1],
      [-0.00056, 0],
      [0.00119, 0],
      [0.00093, 2],
      [0.00036, 2],
      [0.00028, 2],
      [0.00017, 2],
      [0.00107, 2],
      [0.00043, 2],
      [0.00039, 1],
      [0.00048, 2],
      [0.00052, 2]
    ]
  },
  "QA_txtInjMedicatioListNer": {
    "red_x_points": [
      [-0.00756, 1],
      [-0.00733, 1],
      [-0.00631, 1],
      [-0.00509, 1],
      [-0.00685, 1],
      [-0.00049, 2],
      [-0.00708, 1],
      [0.00397, 0],
      [-0.00723, 2],
      [-0.00313, 2],
      [-0.00315, 2],
      [-0.00328, 2],
      [-0.00992, 1],
      [-0.00618, 1],
      [-0.00068, 2],
      [-0.00617, 1],
      [-0.00278, 2],
      [-0.00751, 1],
      [-0.00871, 1],
      [-0.00765, 1],
      [-0.00468, 1],
      [-0.00016, 2],
      [-0.00271, 2]
    ],
    "red_o_points": [],
    "y_categories": ["N", "Y", "nan"],
    "blue_o_points": [],
    "blue_x_points": [
      [0.03267, 0],
      [0.00094, 2],
      [0.0099, 0],
      [-0.00326, 1],
      [0.0009, 2],
      [0.00128, 2],
      [0.00149, 2],
      [-0.00381, 1],
      [-0.00372, 1],
      [-0.00518, 1],
      [0.03055, 0],
      [0.00035, 2],
      [0.02481, 0],
      [-0.00379, 1],
      [0.00134, 2],
      [0.00024, 2],
      [-0.00429, 1],
      [0.01499, 0],
      [0.01916, 0],
      [-0.00409, 1],
      [0.00021, 2]
    ]
  },
  "QA_lstPexKine[Elbow]": {
    "red_x_points": [
      [-0.00049, 1],
      [-0.00059, 2],
      [-0.0015, 2],
      [0.00083, 1],
      [-0.00086, 2],
      [-0.00734, 0],
      [-0.00023, 1],
      [0.00028, 1],
      [-0.00059, 2],
      [0.00072, 1],
      [-0.0009, 2],
      [-0.00031, 2],
      [-0.00162, 2],
      [0.00102, 1],
      [0.00028, 1],
      [-0.00216, 0],
      [-0.00082, 2],
      [-0.00088, 2],
      [-0.00295, 2],
      [-0.00039, 2],
      [-0.00048, 2],
      [-0.00542, 0],
      [-0.00144, 2]
    ],
    "red_o_points": [],
    "y_categories": ["NPV", "PV", "nan"],
    "blue_o_points": [],
    "blue_x_points": [
      [0.00331, 0],
      [-0.00065, 2],
      [0.00094, 1],
      [0.00351, 1],
      [-0.0003, 2],
      [0.0031, 1],
      [0.00244, 1],
      [0.00224, 1],
      [-0.00025, 2],
      [-8e-5, 2],
      [-0.00035, 2],
      [0.00486, 1],
      [-0.00014, 2],
      [0.00078, 1],
      [0.00085, 1],
      [0.00199, 0],
      [-0.00041, 2],
      [0.00088, 1],
      [-0.00012, 2],
      [0.00197, 1],
      [0.00129, 1]
    ]
  },
  "QS_mulTransfSite[MeMc]": {
    "red_x_points": [
      [-0.00017, 1],
      [-7e-5, 0],
      [-0.00014, 0],
      [-6e-5, 0],
      [-7e-5, 0],
      [6e-5, 0],
      [4e-5, 2],
      [-0.00017, 1],
      [-3e-5, 2],
      [-7e-5, 0],
      [-3e-5, 1],
      [4e-5, 2],
      [-0.00012, 0],
      [-5e-5, 2],
      [0.0, 0],
      [-0.00012, 0],
      [-0.00014, 1],
      [-6e-5, 0],
      [3e-5, 2]
    ],
    "red_o_points": [],
    "y_categories": ["N", "NOT APPLICABLE", "nan"],
    "blue_o_points": [],
    "blue_x_points": [
      [4e-5, 2],
      [3e-5, 2],
      [1e-5, 0],
      [0.00013, 0],
      [1e-5, 0],
      [7e-5, 2],
      [0.00042, 1],
      [-7e-5, 0],
      [9e-5, 2],
      [3e-5, 2],
      [0.00016, 2],
      [9e-5, 1],
      [9e-5, 2],
      [3e-5, 2]
    ]
  },
  "QS_mulGraftNerve[Ra]": {
    "red_x_points": [
      [-4e-5, 1],
      [-0.00012, 0],
      [-6e-5, 0],
      [-7e-5, 2],
      [-7e-5, 1],
      [6e-5, 2],
      [-4e-5, 2],
      [-0.00012, 0],
      [-4e-5, 2],
      [-4e-5, 2]
    ],
    "red_o_points": [],
    "y_categories": ["N", "NOT APPLICABLE", "nan"],
    "blue_o_points": [],
    "blue_x_points": [
      [0.00013, 0],
      [6e-5, 2],
      [0.00016, 1],
      [-0.00012, 0],
      [0.00016, 0],
      [6e-5, 2],
      [6e-5, 2]
    ]
  },
  "QS_mulTransfSite[Oberlin]": {
    "red_x_points": [
      [-0.01283, 1],
      [-0.03467, 0],
      [-0.03124, 0],
      [-0.03436, 0],
      [-0.03158, 0],
      [-0.03367, 0],
      [0.00928, 3],
      [-0.01337, 1],
      [0.01032, 3],
      [0.01354, 2],
      [0.00998, 3],
      [-0.03233, 0],
      [0.00938, 3],
      [0.01297, 2],
      [-0.01453, 1],
      [0.00896, 3],
      [-0.032, 0],
      [0.0101, 3],
      [0.01404, 2],
      [-0.03334, 0],
      [-0.01541, 1],
      [-0.03062, 0],
      [0.00953, 3]
    ],
    "red_o_points": [],
    "y_categories": ["N", "NOT APPLICABLE", "Y", "nan"],
    "blue_o_points": [],
    "blue_x_points": [
      [0.01119, 3],
      [0.01099, 3],
      [0.01615, 2],
      [0.01743, 2],
      [0.0104, 3],
      [0.01804, 2],
      [0.01636, 2],
      [0.01755, 2],
      [0.01232, 3],
      [-0.00359, 1],
      [0.0166, 2],
      [0.01811, 2],
      [0.01104, 3],
      [0.01034, 3],
      [0.01063, 3],
      [0.01047, 3],
      [0.01155, 3],
      [0.01037, 3],
      [-0.00641, 1],
      [0.01117, 3],
      [0.01115, 3]
    ]
  },
  "QA_lstPexArthre[Index]": {
    "red_x_points": [
      [-0.00797, 0],
      [-0.00147, 2],
      [-0.00302, 2],
      [-0.00895, 0],
      [-0.00353, 0],
      [-0.0106, 0],
      [0.00047, 1],
      [0.00111, 1],
      [-0.00147, 2],
      [0.00236, 1],
      [-0.00159, 2],
      [-0.00169, 2],
      [-0.00226, 2],
      [0.00022, 1],
      [0.00056, 1],
      [-0.00364, 0],
      [-0.00128, 2],
      [-0.00252, 2],
      [-0.00644, 2],
      [-0.00184, 2],
      [-0.00185, 2],
      [-0.00566, 0],
      [-0.00334, 2]
    ],
    "red_o_points": [],
    "y_categories": ["NPV", "PV", "nan"],
    "blue_o_points": [],
    "blue_x_points": [
      [0.00273, 0],
      [-0.00135, 2],
      [0.00279, 1],
      [0.0082, 1],
      [-0.00012, 2],
      [0.01015, 1],
      [0.00575, 1],
      [0.00153, 0],
      [-0.00091, 2],
      [-0.00032, 2],
      [-0.00094, 2],
      [0.01371, 1],
      [-0.00075, 2],
      [0.00286, 1],
      [0.00307, 1],
      [0.00175, 0],
      [-0.00058, 2],
      [0.00324, 1],
      [-0.0006, 2],
      [0.00773, 1],
      [0.00645, 1]
    ]
  },
  "QA_yonPreFracture": {
    "red_x_points": [
      [-0.02949, 1],
      [0.00148, 2],
      [0.00537, 0],
      [0.0021, 2],
      [0.00482, 0],
      [0.00546, 0],
      [-0.02491, 1],
      [0.00518, 0],
      [0.00197, 2],
      [-0.03158, 1],
      [-0.03175, 1],
      [-0.02716, 1],
      [0.00207, 2],
      [0.00502, 0],
      [0.00544, 0],
      [0.00437, 0],
      [0.00424, 0],
      [0.00694, 0],
      [-0.03133, 1],
      [0.00544, 0],
      [0.00147, 2],
      [-0.02059, 1],
      [0.00159, 2]
    ],
    "red_o_points": [],
    "y_categories": ["N", "Y", "nan"],
    "blue_o_points": [],
    "blue_x_points": [
      [0.00774, 0],
      [0.00478, 2],
      [0.00594, 0],
      [0.00718, 0],
      [0.00482, 2],
      [0.00754, 0],
      [0.0066, 0],
      [0.00538, 2],
      [0.00438, 2],
      [0.00834, 0],
      [0.00895, 0],
      [0.0096, 0],
      [0.00846, 0],
      [0.00605, 0],
      [0.00545, 0],
      [0.00405, 2],
      [0.00877, 0],
      [0.00693, 0],
      [0.00643, 0],
      [0.003, 2],
      [0.00345, 2]
    ]
  },
  "QS_mulGraftNerve[FI]": {
    "red_x_points": [
      [-0.00118, 1],
      [-0.00046, 0],
      [-2e-5, 0],
      [-4e-5, 0],
      [-0.00037, 0],
      [0.00011, 0],
      [1e-5, 2],
      [-0.00056, 1],
      [0.00035, 2],
      [-0.00056, 0],
      [-3e-5, 2],
      [-0.00054, 0],
      [9e-5, 2],
      [-5e-5, 0],
      [-0.00147, 1],
      [-2e-5, 2],
      [-0.00031, 0],
      [7e-5, 2],
      [-9e-5, 0],
      [-0.0006, 0],
      [-0.00042, 1],
      [3e-5, 0],
      [0.0001, 2]
    ],
    "red_o_points": [],
    "y_categories": ["N", "NOT APPLICABLE", "nan"],
    "blue_o_points": [],
    "blue_x_points": [
      [0.0002, 2],
      [0.00021, 2],
      [0.00033, 0],
      [0.00018, 0],
      [4e-5, 2],
      [0.00069, 0],
      [0.00033, 0],
      [6e-5, 0],
      [0.00042, 2],
      [0.00114, 1],
      [-0.00013, 0],
      [0.00046, 0],
      [0.00057, 2],
      [0.00017, 2],
      [6e-5, 2],
      [0.00011, 2],
      [0.0005, 2],
      [0.00011, 2],
      [0.00021, 1],
      [0.00012, 2],
      [0.0002, 2]
    ]
  },
  "QA_lstPexPalle[Clavicle]": {
    "red_x_points": [
      [-0.0007, 3],
      [-0.0007, 3],
      [-0.00083, 3],
      [0.0061, 2],
      [-0.00084, 3],
      [-0.00059, 3],
      [-0.01437, 0],
      [-0.01504, 0],
      [-0.00087, 3],
      [-0.00136, 3],
      [-0.00123, 3],
      [-0.0007, 3],
      [-0.00061, 3],
      [-0.02177, 0],
      [-0.00076, 3],
      [-0.01299, 0],
      [-0.00557, 1],
      [-0.00103, 3],
      [-0.00166, 3],
      [-0.00099, 3],
      [0.00597, 2],
      [-0.01156, 0],
      [-0.00085, 3]
    ],
    "red_o_points": [],
    "y_categories": ["HYPO", "NAIA", "PT", "nan"],
    "blue_o_points": [],
    "blue_x_points": [
      [-0.00024, 3],
      [-0.00034, 3],
      [0.01134, 2],
      [0.01527, 2],
      [-0.0006, 3],
      [-0.0008, 3],
      [0.0183, 2],
      [0.01369, 2],
      [-0.00063, 3],
      [-0.00053, 3],
      [-0.00096, 3],
      [-0.00054, 3],
      [-0.0005, 3],
      [-0.00801, 0],
      [0.01041, 2],
      [0.00679, 1],
      [-0.0007, 3],
      [0.00995, 2],
      [-0.00046, 3],
      [0.012, 2],
      [-0.00051, 3]
    ]
  }
}
