{
  "QA_lstPexPain[C8]": {
    "red_x_points": [
      [0.008, 0],
      [-0.00548, 2],
      [-0.00592, 2],
      [0.00549, 0],
      [-0.00516, 2],
      [-0.00717, 1],
      [-0.00929, 1],
      [-0.0088, 1],
      [-0.00737, 2],
      [-0.00679, 2],
      [-0.01017, 2],
      [-0.00564, 2],
      [-0.00972, 1],
      [0.00741, 0],
      [-0.00933, 1],
      [-0.00811, 1],
      [-0.00504, 2],
      [-0.00736, 2],
      [-0.0093, 2],
      [-0.00512, 2],
      [-0.01092, 1],
      [-0.00518, 1],
      [-0.0119, 1]
    ],
    "red_o_points": [],
    "y_categories": ["NORM", "NPV", "nan"],
    "blue_o_points": [],
    "blue_x_points": [
      [-0.00644, 1],
      [-0.00628, 1],
      [0.01022, 0],
      [-0.00117, 1],
      [0.01521, 0],
      [0.01562, 0],
      [0.01412, 0],
      [0.01131, 0],
      [-0.00475, 2],
      [-0.00094, 2],
      [-0.00458, 2],
      [-0.00115, 1],
      [-0.00451, 2],
      [0.01249, 0],
      [0.01207, 0],
      [0.0132, 0],
      [-0.00514, 2],
      [0.01321, 0],
      [0.01335, 0],
      [0.01773, 0],
      [0.0193, 0]
    ]
  },
  "QA_lstPexTouch[C6]": {
    "red_x_points": [
      [-0.00477, 1],
      [-0.00243, 2],
      [-0.00299, 1],
      [-0.00276, 1],
      [-0.00194, 2],
      [-0.00241, 1],
      [-0.00262, 1],
      [-0.00419, 1],
      [-0.00217, 2],
      [-0.00243, 2],
      [-0.00395, 1],
      [-0.00173, 2],
      [-0.0035, 1],
      [-0.00428, 1],
      [-0.0053, 1],
      [-0.00227, 1],
      [-0.00165, 2],
      [-0.00487, 1],
      [-0.00315, 1],
      [-0.00273, 2],
      [-0.00387, 1],
      [-0.00206, 1],
      [-0.00414, 1]
    ],
    "red_o_points": [],
    "y_categories": ["NORM", "NPV", "nan"],
    "blue_o_points": [],
    "blue_x_points": [
      [-0.00342, 1],
      [-0.00333, 1],
      [0.01569, 0],
      [-0.00207, 1],
      [0.02463, 0],
      [-0.00244, 1],
      [-0.00221, 1],
      [-0.00261, 1],
      [-0.00069, 2],
      [0.00172, 2],
      [-0.00068, 2],
      [-0.00255, 1],
      [-0.00011, 2],
      [-0.00272, 1],
      [-0.00249, 1],
      [0.01737, 0],
      [-0.00024, 2],
      [0.01715, 0],
      [0.02632, 0],
      [-0.0025, 1],
      [-0.00262, 1]
    ]
  },
  "QS_equBpsurgTime": {
    "red_x_points": [
      [0.00128, 3],
      [-0.01355, 0],
      [-0.00045, 2],
      [-0.01485, 0],
      [-0.00877, 0],
      [-0.00348, 1],
      [-0.00047, 3],
      [-0.00059, 3],
      [0.00204, 3],
      [-0.00893, 1],
      [0.00101, 3],
      [0.00139, 2],
      [0.00124, 3],
      [-0.01167, 2],
      [0.0008, 3],
      [0.00028, 3],
      [-0.00644, 0],
      [0.00219, 3],
      [-0.01429, 0],
      [-0.00971, 0],
      [0.00085, 3],
      [-0.00202, 2],
      [0.00134, 3]
    ],
    "red_o_points": [],
    "y_categories": [
      "0 TO 6 MONTHS",
      "13 TO 24 MONTHS",
      "7 TO 12 MONTHS",
      "nan"
    ],
    "blue_o_points": [],
    "blue_x_points": [
      [0.00251, 3],
      [0.00216, 3],
      [-7e-5, 0],
      [0.01148, 1],
      [0.00316, 3],
      [0.00831, 1],
      [0.00331, 0],
      [0.00714, 2],
      [0.00282, 3],
      [0.0025, 3],
      [0.0118, 2],
      [0.00895, 2],
      [0.00285, 3],
      [0.0016, 3],
      [0.00172, 3],
      [0.00147, 3],
      [0.0031, 3],
      [0.00141, 3],
      [0.00232, 3],
      [0.00219, 3],
      [0.00209, 3]
    ]
  },
  "QS_mulNeuromadSite[T2]": {
    "red_x_points": [
      [-0.0027, 1],
      [-0.00208, 0],
      [-0.00076, 0],
      [-0.0001, 0],
      [-0.00118, 0],
      [0.00022, 0],
      [-0.00018, 2],
      [-0.00268, 1],
      [0.00119, 2],
      [-0.00128, 0],
      [0.00044, 2],
      [-0.00176, 0],
      [0.00017, 2],
      [-7e-5, 0],
      [-0.00429, 1],
      [-4e-5, 2],
      [-0.00115, 0],
      [0.00024, 2],
      [-0.00079, 0],
      [-0.00202, 0],
      [-0.00147, 1],
      [5e-5, 0],
      [0.00034, 2]
    ],
    "red_o_points": [],
    "y_categories": ["N", "NOT APPLICABLE", "nan"],
    "blue_o_points": [],
    "blue_x_points": [
      [0.00069, 2],
      [0.00034, 2],
      [0.00057, 0],
      [0.00099, 0],
      [0.00049, 2],
      [0.00135, 0],
      [0.00079, 0],
      [8e-5, 0],
      [0.00159, 2],
      [0.00476, 1],
      [-0.0007, 0],
      [0.00113, 0],
      [0.00136, 2],
      [0.00073, 2],
      [0.00091, 2],
      [0.00041, 2],
      [0.00156, 2],
      [0.00056, 2],
      [0.00085, 1],
      [0.00092, 2],
      [0.00051, 2]
    ]
  },
  "QS_mulGraftRoot[T1]": {
    "red_x_points": [
      [-7e-5, 1],
      [2e-5, 0],
      [0.0, 0],
      [-0.00011, 0],
      [2e-5, 0],
      [-0.0002, 1],
      [2e-5, 2],
      [1e-5, 2],
      [1e-5, 2],
      [-0.00048, 1],
      [-0.00018, 0],
      [2e-5, 2],
      [2e-5, 0],
      [-4e-5, 0],
      [-0.00019, 1],
      [2e-5, 0],
      [4e-5, 2]
    ],
    "red_o_points": [],
    "y_categories": ["N", "NOT APPLICABLE", "nan"],
    "blue_o_points": [],
    "blue_x_points": [
      [8e-5, 2],
      [6e-5, 2],
      [5e-5, 0],
      [5e-5, 0],
      [2e-5, 2],
      [7e-5, 0],
      [3e-5, 0],
      [0.0, 0],
      [0.00022, 1],
      [2e-5, 0],
      [0.00012, 0],
      [4e-5, 2],
      [2e-5, 2],
      [9e-5, 2],
      [2e-5, 2],
      [2e-5, 2],
      [2e-5, 2],
      [9e-5, 1],
      [2e-5, 2],
      [2e-5, 2]
    ]
  },
  "QS_mulGraftTrunk[MiddleTrunk]": {
    "red_x_points": [
      [-0.00028, 1],
      [-7e-5, 0],
      [1e-5, 0],
      [-1e-5, 0],
      [-6e-5, 0],
      [3e-5, 0],
      [-3e-5, 2],
      [-0.00024, 1],
      [0.00014, 2],
      [-0.00012, 0],
      [2e-5, 2],
      [-0.0001, 0],
      [8e-5, 2],
      [1e-5, 0],
      [-0.00042, 1],
      [-7e-5, 2],
      [-0.00012, 0],
      [6e-5, 2],
      [3e-5, 0],
      [-0.0001, 0],
      [-0.00036, 1],
      [0.0001, 0],
      [9e-5, 2]
    ],
    "red_o_points": [],
    "y_categories": ["N", "NOT APPLICABLE", "nan"],
    "blue_o_points": [],
    "blue_x_points": [
      [9e-5, 2],
      [3e-5, 2],
      [0.0001, 0],
      [6e-5, 2],
      [0.00019, 0],
      [8e-5, 0],
      [1e-5, 0],
      [0.00011, 2],
      [0.00023, 1],
      [-0.00013, 0],
      [1e-5, 0],
      [0.00019, 2],
      [2e-5, 2],
      [9e-5, 2],
      [5e-5, 2],
      [7e-5, 2],
      [5e-5, 2],
      [8e-5, 2],
      [9e-5, 2]
    ]
  },
  "QS_mulGraftTrunk[LowerTrunk]": {
    "red_x_points": [
      [-0.0007, 1],
      [-0.00019, 0],
      [-7e-5, 0],
      [0.0, 0],
      [-0.00023, 0],
      [0.0, 0],
      [-3e-5, 2],
      [-0.00054, 1],
      [0.00032, 2],
      [-0.00045, 0],
      [-2e-5, 2],
      [-0.0004, 0],
      [2e-5, 2],
      [3e-5, 0],
      [-0.0012, 1],
      [0.0, 2],
      [-5e-5, 0],
      [8e-5, 2],
      [-0.00027, 0],
      [-0.0006, 0],
      [-0.00121, 1],
      [8e-5, 0],
      [3e-5, 2]
    ],
    "red_o_points": [],
    "y_categories": ["N", "NOT APPLICABLE", "nan"],
    "blue_o_points": [],
    "blue_x_points": [
      [0.00045, 2],
      [0.0002, 2],
      [8e-5, 0],
      [0.00021, 0],
      [0.00016, 2],
      [0.00042, 0],
      [0.0002, 0],
      [0.00036, 0],
      [0.00029, 2],
      [0.00085, 1],
      [-0.00015, 0],
      [0.00027, 0],
      [0.00041, 2],
      [0.0002, 2],
      [0.0002, 2],
      [0.0002, 2],
      [0.00039, 2],
      [0.00017, 2],
      [0.00023, 1],
      [0.00022, 2],
      [5e-5, 2]
    ]
  },
  "QS_mulGraftNerve[Ph]": {
    "red_x_points": [
      [-0.00222, 1],
      [-0.00091, 0],
      [-0.00039, 0],
      [0.00027, 0],
      [-0.00061, 0],
      [0.00022, 0],
      [0.00015, 2],
      [-0.00234, 1],
      [0.00056, 2],
      [-0.00086, 0],
      [7e-5, 2],
      [-0.00109, 0],
      [5e-5, 2],
      [-0.00013, 0],
      [-0.00331, 1],
      [0.0001, 2],
      [-0.00063, 0],
      [0.00029, 2],
      [-0.00043, 0],
      [-0.0011, 0],
      [-0.00262, 1],
      [0.00017, 0],
      [-4e-5, 2]
    ],
    "red_o_points": [],
    "y_categories": ["N", "NOT APPLICABLE", "nan"],
    "blue_o_points": [],
    "blue_x_points": [
      [0.00095, 2],
      [0.00037, 2],
      [0.00016, 0],
      [0.00073, 0],
      [0.00028, 2],
      [0.00138, 0],
      [0.00017, 0],
      [0.00037, 0],
      [0.00087, 2],
      [0.00271, 1],
      [-0.00045, 0],
      [0.00164, 0],
      [0.00073, 2],
      [0.00043, 2],
      [0.0009, 2],
      [0.00028, 2],
      [0.00083, 2],
      [0.00067, 2],
      [0.00033, 1],
      [0.00081, 2],
      [0.00064, 2]
    ]
  },
  "QA_lstPexArthre[Elbow]": {
    "red_x_points": [
      [5e-5, 2],
      [-0.00129, 3],
      [-0.0011, 3],
      [0.00076, 2],
      [-0.0073, 0],
      [-0.00531, 1],
      [-0.00224, 2],
      [-0.00012, 2],
      [-0.00073, 3],
      [0.00102, 2],
      [-0.00151, 3],
      [-0.00084, 3],
      [-0.00188, 3],
      [0.00076, 2],
      [-0.0002, 2],
      [-0.0025, 2],
      [-0.00101, 3],
      [-0.00149, 3],
      [-0.00237, 3],
      [-0.00127, 3],
      [-0.00063, 3],
      [0.00026, 2],
      [-0.00133, 3]
    ],
    "red_o_points": [],
    "y_categories": ["NAIA", "NPV", "PV", "nan"],
    "blue_o_points": [],
    "blue_x_points": [
      [0.0135, 1],
      [-0.0009, 3],
      [0.00132, 2],
      [0.00176, 2],
      [-0.00042, 3],
      [0.00319, 2],
      [0.00212, 2],
      [0.0018, 2],
      [-0.00031, 3],
      [-0.00037, 3],
      [-0.00093, 3],
      [0.00329, 2],
      [-0.00034, 3],
      [0.00028, 2],
      [0.00052, 2],
      [0.00387, 1],
      [-0.00031, 3],
      [0.00061, 2],
      [-0.00012, 3],
      [0.00086, 2],
      [0.00085, 2]
    ]
  },
  "QA_mulInjOrthesisType[ArmSling]": {
    "red_x_points": [
      [-0.00572, 2],
      [-0.00655, 2],
      [-0.00322, 2],
      [-0.00205, 2],
      [-0.00417, 2],
      [-0.00252, 2],
      [-0.00131, 2],
      [-0.00186, 1],
      [-0.00811, 2],
      [-0.00663, 2],
      [-0.00375, 2],
      [-0.01984, 0],
      [-0.00779, 3],
      [-0.00122, 2],
      [-0.00189, 1],
      [-0.00096, 2],
      [-0.01111, 3],
      [-0.00687, 2],
      [-0.00386, 2],
      [-0.00476, 2],
      [-0.00618, 3],
      [-0.00118, 2],
      [-0.0057, 2]
    ],
    "red_o_points": [],
    "y_categories": ["N", "NOT APPLICABLE", "Y", "nan"],
    "blue_o_points": [],
    "blue_x_points": [
      [-0.00095, 2],
      [-0.0013, 2],
      [-0.00014, 2],
      [-0.00017, 2],
      [-0.00149, 2],
      [-0.00091, 2],
      [-0.00042, 2],
      [-0.00076, 2],
      [0.03514, 1],
      [0.02771, 1],
      [-0.00479, 2],
      [0.02152, 1],
      [0.02533, 1],
      [0.00015, 2],
      [0.00572, 0],
      [-0.00106, 2],
      [-0.00627, 2],
      [0.01079, 1],
      [0.00983, 1],
      [-0.00294, 2],
      [0.00226, 3]
    ]
  },
  "QA_mulInjOrthesisType[ShoulderSupport]": {
    "red_x_points": [
      [-0.00656, 0],
      [-0.0071, 0],
      [-0.00346, 0],
      [-0.01628, 2],
      [-0.00428, 0],
      [-0.00201, 0],
      [-0.00161, 0],
      [-0.00166, 1],
      [-0.00827, 0],
      [-0.00592, 0],
      [-0.00514, 0],
      [-0.01492, 2],
      [-0.00921, 3],
      [-0.00191, 0],
      [-0.00087, 1],
      [-0.00203, 0],
      [-0.01082, 3],
      [-0.00861, 0],
      [-0.00425, 0],
      [-0.00515, 0],
      [-0.00866, 3],
      [-0.00125, 0],
      [-0.00538, 0]
    ],
    "red_o_points": [],
    "y_categories": ["N", "NOT APPLICABLE", "Y", "nan"],
    "blue_o_points": [],
    "blue_x_points": [
      [-0.00165, 0],
      [-0.00164, 0],
      [0.00076, 0],
      [0.00131, 0],
      [0.01048, 2],
      [0.00059, 0],
      [0.00044, 0],
      [0.00143, 0],
      [0.03373, 1],
      [0.02673, 1],
      [-0.00479, 0],
      [0.02157, 1],
      [0.02507, 1],
      [-0.00013, 0],
      [0.00457, 2],
      [-0.00105, 0],
      [-0.0068, 0],
      [0.01148, 1],
      [0.01149, 1],
      [-0.00147, 0],
      [0.00322, 3]
    ]
  },
  "QA_lstPexArthre[Shoulder]": {
    "red_x_points": [
      [0.00507, 2],
      [-0.00263, 3],
      [-0.00346, 3],
      [0.00575, 2],
      [-0.01631, 0],
      [-0.01725, 1],
      [0.00609, 2],
      [0.00577, 2],
      [-0.00207, 3],
      [0.00596, 2],
      [-0.0037, 3],
      [-0.00221, 3],
      [-0.00345, 3],
      [-0.02703, 1],
      [0.00525, 2],
      [-0.0162, 1],
      [-0.00197, 3],
      [-0.00371, 3],
      [-0.00709, 3],
      [-0.00258, 3],
      [-0.00223, 3],
      [-0.01228, 1],
      [-0.0037, 3]
    ],
    "red_o_points": [],
    "y_categories": ["NAIA", "NPV", "PV", "nan"],
    "blue_o_points": [],
    "blue_x_points": [
      [0.0113, 2],
      [-0.00266, 3],
      [0.00831, 2],
      [0.01186, 2],
      [-0.00099, 3],
      [0.0112, 2],
      [0.01059, 2],
      [0.00869, 2],
      [-0.0014, 3],
      [-0.00124, 3],
      [-0.00193, 3],
      [0.01215, 2],
      [-0.00139, 3],
      [0.00751, 2],
      [0.00635, 2],
      [-0.00205, 1],
      [-0.00145, 3],
      [0.0055, 2],
      [-0.00089, 3],
      [0.00776, 2],
      [0.00675, 2]
    ]
  },
  "QS_mulGraftRoot[T2]": {
    "red_x_points": [
      [-0.00024, 1],
      [-0.00015, 0],
      [-4e-5, 0],
      [3e-5, 0],
      [-8e-5, 0],
      [6e-5, 0],
      [1e-5, 2],
      [-0.00017, 1],
      [0.00011, 2],
      [-0.00013, 0],
      [3e-5, 2],
      [-0.0002, 0],
      [1e-5, 2],
      [-1e-5, 0],
      [-0.00021, 1],
      [1e-5, 2],
      [-0.00013, 0],
      [9e-5, 2],
      [-7e-5, 0],
      [-4e-5, 0],
      [-0.00048, 1]
    ],
    "red_o_points": [],
    "y_categories": ["N", "NOT APPLICABLE", "nan"],
    "blue_o_points": [],
    "blue_x_points": [
      [3e-5, 2],
      [1e-5, 2],
      [0.00014, 0],
      [0.00014, 0],
      [2e-5, 0],
      [0.00012, 0],
      [2e-5, 0],
      [0.00012, 2],
      [0.00051, 1],
      [-0.00013, 0],
      [9e-5, 0],
      [8e-5, 2],
      [8e-5, 2],
      [3e-5, 2],
      [8e-5, 2],
      [0.00014, 2],
      [5e-5, 2],
      [8e-5, 2]
    ]
  },
  "QS_mulTransfSite[PhMc]": {
    "red_x_points": [
      [-0.00675, 1],
      [-0.0038, 0],
      [-0.00041, 0],
      [0.00074, 0],
      [-0.00245, 0],
      [-0.01237, 2],
      [0.00061, 3],
      [-0.00791, 1],
      [0.00322, 3],
      [-0.00256, 0],
      [0.00119, 3],
      [-0.0031, 0],
      [0.0012, 3],
      [0.00032, 0],
      [-0.01109, 1],
      [0.00087, 3],
      [-0.00918, 2],
      [0.00159, 3],
      [-0.00084, 0],
      [-0.0034, 0],
      [-0.00686, 1],
      [0.0016, 0],
      [0.0018, 3]
    ],
    "red_o_points": [],
    "y_categories": ["N", "NOT APPLICABLE", "Y", "nan"],
    "blue_o_points": [],
    "blue_x_points": [
      [0.00322, 3],
      [0.00252, 3],
      [0.00148, 0],
      [0.00423, 0],
      [0.00202, 3],
      [0.00472, 0],
      [0.00145, 0],
      [0.00187, 0],
      [0.00475, 3],
      [0.00807, 1],
      [-0.00195, 0],
      [0.00439, 0],
      [0.00475, 3],
      [0.00156, 3],
      [0.00217, 3],
      [0.00136, 3],
      [0.00404, 3],
      [0.00228, 3],
      [0.00035, 1],
      [0.0025, 3],
      [0.00179, 3]
    ]
  },
  "QS_mulLysisRoot[C6]": {
    "red_x_points": [
      [-0.00335, 1],
      [-0.00079, 0],
      [-0.00893, 2],
      [0.00122, 0],
      [-0.00071, 0],
      [0.0016, 0],
      [0.00059, 3],
      [-0.0042, 1],
      [0.00086, 3],
      [-0.00051, 0],
      [0.00092, 3],
      [-0.00058, 0],
      [0.00092, 3],
      [0.00037, 0],
      [-0.00379, 1],
      [0.00065, 3],
      [-0.00072, 0],
      [0.00107, 3],
      [0.00037, 0],
      [-0.0007, 0],
      [-0.00376, 1],
      [-0.00736, 2],
      [0.00103, 3]
    ],
    "red_o_points": [],
    "y_categories": ["N", "NOT APPLICABLE", "Y", "nan"],
    "blue_o_points": [],
    "blue_x_points": [
      [0.00154, 3],
      [0.00127, 3],
      [0.00033, 0],
      [0.00311, 0],
      [0.00098, 3],
      [0.00198, 0],
      [0.001, 0],
      [0.00112, 0],
      [0.00102, 3],
      [0.00238, 1],
      [-4e-5, 0],
      [0.00337, 0],
      [0.00098, 3],
      [0.00084, 3],
      [0.00062, 3],
      [0.00038, 3],
      [0.00165, 3],
      [0.00048, 3],
      [0.00118, 1],
      [0.00105, 3],
      [0.00055, 3]
    ]
  },
  "QS_mulGraftNerve[other]": {
    "red_x_points": [
      [-0.00305, 1],
      [-0.00175, 0],
      [-0.00057, 0],
      [0.00022, 0],
      [-0.00129, 0],
      [0.00026, 0],
      [-0.00022, 2],
      [-0.00238, 1],
      [0.00106, 2],
      [-0.00117, 0],
      [0.00023, 2],
      [-0.0018, 0],
      [0.00016, 2],
      [-0.00027, 0],
      [-0.00385, 1],
      [0.00012, 2],
      [-0.00162, 0],
      [0.00016, 2],
      [-0.0007, 0],
      [-0.00201, 0],
      [-0.00304, 1],
      [0.00015, 0],
      [8e-5, 2]
    ],
    "red_o_points": [],
    "y_categories": ["N", "NOT APPLICABLE", "nan"],
    "blue_o_points": [],
    "blue_x_points": [
      [0.0006, 2],
      [0.00042, 2],
      [0.00072, 0],
      [0.00125, 0],
      [0.00039, 2],
      [0.00165, 0],
      [0.00061, 0],
      [0.00078, 0],
      [0.00127, 2],
      [0.00512, 1],
      [-0.00067, 0],
      [0.00169, 0],
      [0.00153, 2],
      [0.00039, 2],
      [0.00045, 2],
      [0.00038, 2],
      [0.00153, 2],
      [0.00061, 2],
      [0.00094, 1],
      [0.00099, 2],
      [0.00063, 2]
    ]
  },
  "QA_txtInjMedicatioListNer": {
    "red_x_points": [
      [-0.00583, 1],
      [-0.00531, 1],
      [-0.00514, 1],
      [-0.00429, 1],
      [-0.00623, 1],
      [-0.00054, 2],
      [-0.00661, 1],
      [0.00442, 0],
      [-0.00904, 2],
      [-0.00364, 2],
      [-0.00258, 2],
      [-0.00345, 2],
      [-0.0077, 1],
      [-0.00601, 1],
      [-0.00067, 2],
      [-0.00654, 1],
      [-0.00284, 2],
      [-0.00656, 1],
      [-0.00781, 1],
      [-0.00642, 1],
      [-0.00373, 1],
      [-0.00045, 2],
      [-0.00204, 2]
    ],
    "red_o_points": [],
    "y_categories": ["N", "Y", "nan"],
    "blue_o_points": [],
    "blue_x_points": [
      [0.02857, 0],
      [0.00099, 2],
      [0.011, 0],
      [-0.00379, 1],
      [0.00109, 2],
      [0.00129, 2],
      [0.00142, 2],
      [-0.00444, 1],
      [-0.00286, 1],
      [-0.00405, 1],
      [0.02775, 0],
      [-0.00028, 2],
      [0.02197, 0],
      [-0.00414, 1],
      [0.00107, 2],
      [0.00062, 2],
      [-0.00275, 1],
      [0.01416, 0],
      [0.01515, 0],
      [-0.00367, 1],
      [-0.0001, 2]
    ]
  },
  "QS_mulGraftNerve[DS]": {
    "red_x_points": [
      [-5e-5, 2],
      [-5e-5, 1],
      [0.0, 2],
      [0.0, 2],
      [-0.0001, 0],
      [5e-5, 0],
      [-0.00015, 1],
      [0.0, 2],
      [0.0, 2]
    ],
    "red_o_points": [],
    "y_categories": ["N", "NOT APPLICABLE", "nan"],
    "blue_o_points": [],
    "blue_x_points": [
      [5e-5, 2],
      [5e-5, 2],
      [5e-5, 0],
      [5e-5, 0],
      [0.0, 2],
      [0.0001, 1],
      [0.0, 2],
      [0.0, 2],
      [0.0, 2]
    ]
  },
  "QA_lstPexMuscstrength[WristFlex]": {
    "red_x_points": [
      [-0.00042, 0],
      [-0.00224, 2],
      [-0.00777, 1],
      [0.00106, 0],
      [-0.00666, 1],
      [-0.01099, 1],
      [-0.00168, 0],
      [0.00023, 0],
      [-0.00184, 2],
      [-0.00316, 2],
      [-0.00128, 0],
      [-0.00171, 2],
      [-0.00714, 1],
      [0.00169, 0],
      [0.00104, 0],
      [-0.00298, 1],
      [-0.00751, 1],
      [-0.0033, 0],
      [0.00216, 0],
      [0.00128, 0],
      [-0.00189, 2],
      [-0.00649, 1],
      [-0.00456, 2]
    ],
    "red_o_points": [],
    "y_categories": ["GREATER THAN OR EQUALS TO 3", "LESS THAN 3", "nan"],
    "blue_o_points": [],
    "blue_x_points": [
      [0.00303, 1],
      [0.00653, 0],
      [0.00209, 0],
      [0.00382, 0],
      [0.00414, 0],
      [0.00504, 0],
      [0.00343, 0],
      [0.00419, 0],
      [0.00068, 2],
      [0.00066, 2],
      [0.00543, 0],
      [0.00685, 0],
      [0.0015, 2],
      [0.00075, 0],
      [0.00119, 0],
      [0.00215, 0],
      [0.00202, 2],
      [0.00279, 1],
      [0.00142, 0],
      [0.00588, 1],
      [0.00056, 2]
    ]
  },
  "QS_mulNeuromadSite[C5]": {
    "red_x_points": [
      [-0.00183, 1],
      [-0.00111, 0],
      [-0.00032, 0],
      [0.00013, 0],
      [-0.0006, 0],
      [0.0002, 0],
      [4e-5, 2],
      [-0.00234, 1],
      [0.00046, 2],
      [-0.00051, 0],
      [0.00014, 2],
      [-0.00091, 0],
      [0.00022, 2],
      [0.00016, 0],
      [-0.0032, 1],
      [5e-5, 2],
      [-0.00098, 0],
      [0.00041, 2],
      [-0.00067, 0],
      [-0.0012, 0],
      [-0.00212, 1],
      [0.00026, 0],
      [0.00013, 2]
    ],
    "red_o_points": [],
    "y_categories": ["N", "NOT APPLICABLE", "nan"],
    "blue_o_points": [],
    "blue_x_points": [
      [0.00049, 2],
      [0.0002, 2],
      [0.00062, 0],
      [0.0007, 0],
      [0.00013, 2],
      [0.00091, 0],
      [0.00038, 0],
      [0.00054, 0],
      [0.00089, 2],
      [0.00316, 1],
      [-0.00048, 0],
      [0.00077, 0],
      [0.00067, 2],
      [0.00052, 2],
      [0.00076, 2],
      [0.00032, 2],
      [0.00105, 2],
      [0.00055, 2],
      [0.00036, 1],
      [0.00059, 2],
      [0.00047, 2]
    ]
  },
  "QS_mulNeuromadSite[C7]": {
    "red_x_points": [
      [-0.00677, 1],
      [-0.00469, 0],
      [-0.00156, 0],
      [0.00058, 0],
      [-0.00294, 0],
      [0.00067, 0],
      [0.00031, 2],
      [-0.0075, 1],
      [0.00275, 2],
      [-0.00372, 0],
      [0.0013, 2],
      [-0.00424, 0],
      [0.00054, 2],
      [-0.00031, 0],
      [-0.01037, 1],
      [0.00019, 2],
      [-0.00328, 0],
      [0.00134, 2],
      [-0.00207, 0],
      [-0.00452, 0],
      [-0.00615, 1],
      [0.00073, 0],
      [0.00082, 2]
    ],
    "red_o_points": [],
    "y_categories": ["N", "NOT APPLICABLE", "nan"],
    "blue_o_points": [],
    "blue_x_points": [
      [0.00235, 2],
      [0.00166, 2],
      [0.00143, 0],
      [0.00302, 0],
      [0.00124, 2],
      [0.00271, 0],
      [0.00125, 0],
      [0.00116, 0],
      [0.00399, 2],
      [0.01064, 1],
      [-0.00171, 0],
      [0.00256, 0],
      [0.00363, 2],
      [0.00142, 2],
      [0.00164, 2],
      [0.00106, 2],
      [0.00388, 2],
      [0.00166, 2],
      [0.00172, 1],
      [0.00197, 2],
      [0.0016, 2]
    ]
  },
  "QS_mulGraftNerve[TD]": {
    "red_x_points": [
      [-0.0008, 1],
      [-0.00052, 0],
      [-0.00034, 0],
      [2e-5, 0],
      [-0.00036, 0],
      [0.00018, 0],
      [5e-5, 2],
      [-0.00108, 1],
      [0.00027, 2],
      [-0.00051, 0],
      [9e-5, 2],
      [-0.00062, 0],
      [0.00022, 2],
      [-9e-5, 0],
      [-0.00146, 1],
      [7e-5, 2],
      [-0.00034, 0],
      [0.0, 2],
      [-0.00026, 0],
      [-0.00065, 0],
      [-0.00095, 1],
      [6e-5, 0],
      [9e-5, 2]
    ],
    "red_o_points": [],
    "y_categories": ["N", "NOT APPLICABLE", "nan"],
    "blue_o_points": [],
    "blue_x_points": [
      [0.00026, 2],
      [0.00042, 2],
      [0.00027, 0],
      [0.00026, 0],
      [0.0001, 2],
      [0.00031, 0],
      [0.00023, 0],
      [0.0001, 0],
      [0.00048, 2],
      [0.0014, 1],
      [3e-5, 0],
      [0.00038, 0],
      [0.00042, 2],
      [0.00018, 2],
      [0.00025, 2],
      [9e-5, 2],
      [0.00054, 2],
      [0.00021, 2],
      [0.00052, 1],
      [0.00036, 2],
      [0.0001, 2]
    ]
  },
  "QS_mulGraftNerve[SS]": {
    "red_x_points": [
      [-0.00071, 1],
      [-0.00015, 0],
      [-0.00026, 0],
      [-1e-5, 0],
      [-7e-5, 0],
      [3e-5, 0],
      [-0.00021, 2],
      [-0.00088, 1],
      [1e-5, 2],
      [-0.00024, 0],
      [3e-5, 2],
      [-0.00026, 0],
      [9e-5, 2],
      [4e-5, 0],
      [-0.00077, 1],
      [4e-5, 2],
      [-8e-5, 0],
      [8e-5, 2],
      [-0.00015, 0],
      [-0.00042, 0],
      [-0.00029, 1],
      [2e-5, 0],
      [8e-5, 2]
    ],
    "red_o_points": [],
    "y_categories": ["N", "NOT APPLICABLE", "nan"],
    "blue_o_points": [],
    "blue_x_points": [
      [0.00041, 2],
      [9e-5, 2],
      [0.00022, 0],
      [0.00041, 0],
      [7e-5, 2],
      [0.00025, 0],
      [0.00016, 0],
      [3e-5, 0],
      [0.00019, 2],
      [0.00082, 1],
      [0.0, 0],
      [0.00023, 0],
      [0.00021, 2],
      [3e-5, 2],
      [0.0002, 2],
      [7e-5, 2],
      [0.00018, 2],
      [0.00014, 2],
      [0.00011, 1],
      [0.00015, 2],
      [0.00014, 2]
    ]
  },
  "QA_lstPexArthre[Index]": {
    "red_x_points": [
      [-0.00808, 0],
      [-0.00168, 2],
      [-0.00394, 2],
      [-0.01035, 0],
      [-0.0039, 0],
      [-0.00918, 0],
      [0.00015, 1],
      [0.00092, 1],
      [-0.0017, 2],
      [0.00285, 1],
      [-0.00252, 2],
      [-0.00172, 2],
      [-0.00292, 2],
      [-0.00023, 1],
      [0.00086, 1],
      [-0.00384, 0],
      [-0.00116, 2],
      [-0.00249, 2],
      [-0.00584, 2],
      [-0.00152, 2],
      [-0.00218, 2],
      [-0.00604, 0],
      [-0.00324, 2]
    ],
    "red_o_points": [],
    "y_categories": ["NPV", "PV", "nan"],
    "blue_o_points": [],
    "blue_x_points": [
      [0.00317, 0],
      [-0.00098, 2],
      [0.00296, 1],
      [0.00843, 1],
      [-3e-5, 2],
      [0.00996, 1],
      [0.00653, 1],
      [0.00055, 0],
      [-0.00115, 2],
      [-7e-5, 2],
      [-0.00082, 2],
      [0.01485, 1],
      [-0.00064, 2],
      [0.00217, 1],
      [0.00256, 1],
      [0.00112, 0],
      [-0.00085, 2],
      [0.00454, 1],
      [0.00024, 2],
      [0.00883, 1],
      [0.0064, 1]
    ]
  },
  "QA_lstPexMuscstrength[FingersAddu]": {
    "red_x_points": [
      [0.00011, 2],
      [-0.00016, 2],
      [-0.01777, 1],
      [-0.00037, 2],
      [-0.01756, 1],
      [-0.01974, 1],
      [0.00643, 0],
      [0.00578, 0],
      [4e-5, 2],
      [0.0002, 2],
      [0.00397, 0],
      [0.00042, 2],
      [-0.01547, 1],
      [0.0069, 0],
      [0.00588, 0],
      [-0.01564, 1],
      [-0.0139, 1],
      [0.00039, 2],
      [-0.00118, 2],
      [-0.0161, 1],
      [0.00037, 2],
      [-0.0164, 1],
      [-0.00119, 2]
    ],
    "red_o_points": [],
    "y_categories": ["GREATER THAN OR EQUALS TO 3", "LESS THAN 3", "nan"],
    "blue_o_points": [],
    "blue_x_points": [
      [0.01147, 0],
      [-0.0038, 1],
      [0.00749, 0],
      [0.0109, 0],
      [0.01003, 0],
      [0.01285, 0],
      [0.00148, 2],
      [0.01091, 0],
      [0.00083, 2],
      [0.00144, 2],
      [0.0014, 2],
      [0.00227, 2],
      [0.00156, 2],
      [0.00726, 0],
      [0.00673, 0],
      [0.00796, 0],
      [0.00196, 2],
      [0.00142, 2],
      [0.009, 0],
      [0.00105, 2],
      [0.00078, 2]
    ]
  },
  "QA_lstPexPain[T1]": {
    "red_x_points": [
      [-0.00613, 1],
      [-0.00366, 2],
      [-0.00327, 2],
      [0.00261, 0],
      [-0.00434, 2],
      [-0.00172, 1],
      [0.00078, 0],
      [0.00118, 0],
      [-0.0053, 2],
      [-0.00425, 2],
      [-0.0053, 2],
      [-0.00246, 2],
      [-0.00614, 1],
      [-0.00884, 1],
      [-0.00295, 1],
      [-0.00266, 1],
      [-0.00329, 2],
      [-0.00801, 2],
      [-0.00687, 2],
      [-0.00279, 2],
      [-0.00652, 1],
      [-0.00168, 1],
      [-0.00643, 1]
    ],
    "red_o_points": [],
    "y_categories": ["NORM", "NPV", "nan"],
    "blue_o_points": [],
    "blue_x_points": [
      [-0.00045, 1],
      [-0.001, 1],
      [0.00565, 0],
      [0.00156, 1],
      [0.01177, 0],
      [0.00021, 1],
      [0.01024, 0],
      [0.01028, 0],
      [-0.00216, 2],
      [0.00076, 2],
      [-0.0029, 2],
      [-0.00012, 1],
      [-0.00189, 2],
      [0.00607, 0],
      [0.00711, 0],
      [0.00799, 0],
      [-0.00215, 2],
      [-0.00297, 1],
      [0.01029, 0],
      [0.01393, 0],
      [0.01584, 0]
    ]
  },
  "QA_lstPexKine[Shoulder]": {
    "red_x_points": [
      [0.00125, 1],
      [-0.00143, 2],
      [-0.00287, 2],
      [0.00189, 1],
      [-0.00192, 2],
      [-0.01319, 0],
      [0.00112, 1],
      [0.00124, 1],
      [-0.00076, 2],
      [0.00184, 1],
      [-0.00157, 2],
      [-0.00119, 2],
      [-0.00138, 2],
      [-0.02297, 0],
      [0.00132, 1],
      [0.00107, 1],
      [-0.0013, 2],
      [-0.00178, 2],
      [-0.00517, 2],
      [-0.00197, 2],
      [-0.00064, 2],
      [0.00178, 1],
      [-0.00146, 2]
    ],
    "red_o_points": [],
    "y_categories": ["NPV", "PV", "nan"],
    "blue_o_points": [],
    "blue_x_points": [
      [0.00384, 1],
      [-0.00115, 2],
      [0.00389, 1],
      [0.00706, 1],
      [-0.00044, 2],
      [0.0071, 1],
      [0.00612, 1],
      [0.00506, 1],
      [-0.00047, 2],
      [-0.00037, 2],
      [-0.00084, 2],
      [0.00675, 1],
      [-0.00039, 2],
      [0.0025, 1],
      [0.00237, 1],
      [0.00128, 0],
      [-0.00065, 2],
      [0.00213, 1],
      [-5e-5, 2],
      [0.00241, 1],
      [0.00193, 1]
    ]
  },
  "QA_yonInjBpsurg": {
    "red_x_points": [
      [-0.00723, 0],
      [0.00012, 1],
      [0.00019, 1],
      [0.00071, 1],
      [7e-5, 1],
      [0.00084, 1],
      [0.00069, 1],
      [-0.00785, 0],
      [-6e-5, 1],
      [0.0005, 1],
      [0.00032, 1],
      [0.00024, 1],
      [0.00051, 1],
      [0.00103, 1],
      [-0.01021, 0],
      [0.00057, 1],
      [-0.00068, 1],
      [-0.00107, 1],
      [0.00054, 1],
      [-0.00072, 1],
      [-0.00946, 0],
      [0.00053, 1],
      [0.00064, 1]
    ],
    "red_o_points": [],
    "y_categories": ["N", "Y", "nan"],
    "blue_o_points": [],
    "blue_x_points": [
      [0.00247, 1],
      [0.00164, 1],
      [0.00162, 1],
      [0.00158, 1],
      [0.00049, 1],
      [0.00245, 1],
      [0.00183, 1],
      [0.00139, 1],
      [0.00069, 1],
      [0.00275, 0],
      [0.00028, 1],
      [0.00144, 1],
      [0.00037, 1],
      [0.00154, 1],
      [0.00177, 1],
      [0.00121, 1],
      [0.00025, 1],
      [0.00209, 1],
      [-0.00074, 0],
      [0.00232, 1],
      [0.00236, 1]
    ]
  },
  "QS_mulNeuromadSite[T1]": {
    "red_x_points": [
      [-0.00227, 1],
      [-0.00138, 0],
      [-0.00041, 0],
      [1e-5, 0],
      [-0.00072, 0],
      [4e-5, 0],
      [-2e-5, 2],
      [-0.00211, 1],
      [0.00073, 2],
      [-0.00125, 0],
      [0.00013, 2],
      [-0.00165, 0],
      [0.00019, 2],
      [-3e-5, 0],
      [-0.00308, 1],
      [0.00011, 2],
      [-0.00105, 0],
      [5e-5, 2],
      [-0.00091, 0],
      [-0.00142, 0],
      [-0.00323, 1],
      [0.0001, 0],
      [0.0001, 2]
    ],
    "red_o_points": [],
    "y_categories": ["N", "NOT APPLICABLE", "nan"],
    "blue_o_points": [],
    "blue_x_points": [
      [0.00077, 2],
      [0.00059, 2],
      [0.00059, 0],
      [0.00084, 0],
      [0.00042, 2],
      [0.00082, 0],
      [0.00068, 0],
      [0.00045, 0],
      [0.00131, 2],
      [0.00378, 1],
      [-0.00068, 0],
      [0.00107, 0],
      [0.00125, 2],
      [0.00062, 2],
      [0.00078, 2],
      [0.00039, 2],
      [0.00122, 2],
      [0.00079, 2],
      [0.00088, 1],
      [0.00071, 2],
      [0.0008, 2]
    ]
  },
  "QS_mulBpsurgeryType[Graft]": {
    "red_x_points": [
      [-0.00337, 1],
      [-0.00236, 0],
      [-0.00117, 0],
      [0.00011, 0],
      [-0.00162, 0],
      [-1e-5, 0],
      [0.00026, 3],
      [-0.00273, 1],
      [0.00208, 3],
      [-0.01539, 2],
      [0.00109, 3],
      [-0.00191, 0],
      [0.00074, 3],
      [0.00031, 0],
      [-0.00369, 1],
      [0.0002, 3],
      [-0.00129, 0],
      [0.00123, 3],
      [-0.00096, 0],
      [-0.00235, 0],
      [-0.00287, 1],
      [-2e-5, 0],
      [0.00116, 3]
    ],
    "red_o_points": [],
    "y_categories": ["N", "NOT APPLICABLE", "Y", "nan"],
    "blue_o_points": [],
    "blue_x_points": [
      [0.00163, 3],
      [0.00071, 3],
      [0.00085, 0],
      [0.00133, 0],
      [0.00057, 3],
      [0.00206, 0],
      [0.00151, 0],
      [0.00088, 0],
      [0.00285, 3],
      [0.00634, 1],
      [-0.00102, 0],
      [0.00199, 0],
      [0.0027, 3],
      [0.00053, 3],
      [0.00061, 3],
      [0.00058, 3],
      [0.00291, 3],
      [0.00135, 3],
      [0.00068, 1],
      [0.00159, 3],
      [0.0019, 3]
    ]
  },
  "QA_lstPexTouch[C5]": {
    "red_x_points": [
      [-0.00154, 0],
      [-0.00103, 2],
      [-0.0016, 1],
      [-0.00066, 1],
      [-0.00095, 2],
      [-0.00035, 1],
      [-0.00105, 1],
      [-0.00352, 1],
      [-0.00108, 2],
      [-0.00101, 2],
      [-0.00315, 1],
      [-0.00062, 2],
      [-0.00238, 1],
      [-0.00101, 1],
      [-0.00302, 1],
      [-0.00071, 1],
      [-0.0006, 2],
      [-0.00344, 1],
      [-0.00177, 1],
      [-0.00102, 2],
      [-0.00283, 1],
      [-0.00024, 1],
      [-0.00317, 1]
    ],
    "red_o_points": [],
    "y_categories": ["NORM", "NPV", "nan"],
    "blue_o_points": [],
    "blue_x_points": [
      [-0.00148, 1],
      [-0.00201, 1],
      [-0.00038, 1],
      [-0.00051, 1],
      [0.01404, 0],
      [-0.00049, 1],
      [-0.0003, 1],
      [-0.00043, 1],
      [0.00192, 2],
      [0.00362, 2],
      [0.00044, 2],
      [-0.0002, 1],
      [0.0023, 2],
      [-0.00105, 1],
      [0.0056, 0],
      [-0.00067, 1],
      [0.00215, 2],
      [0.00488, 0],
      [0.01048, 0],
      [-0.00044, 1],
      [-0.00073, 1]
    ]
  },
  "QA_lstPexTouch[C7]": {
    "red_x_points": [
      [-0.01127, 1],
      [-0.00427, 2],
      [-0.0086, 1],
      [-0.01058, 1],
      [-0.00327, 2],
      [-0.008, 1],
      [-0.00981, 1],
      [-0.01085, 1],
      [-0.00337, 2],
      [-0.00455, 2],
      [-0.01221, 1],
      [-0.00353, 2],
      [-0.01218, 1],
      [0.00904, 0],
      [-0.01117, 1],
      [-0.00906, 1],
      [-0.00299, 2],
      [0.01242, 0],
      [-0.00847, 1],
      [-0.00343, 2],
      [-0.01235, 1],
      [-0.00824, 1],
      [-0.01244, 1]
    ],
    "red_o_points": [],
    "y_categories": ["NORM", "NPV", "nan"],
    "blue_o_points": [],
    "blue_x_points": [
      [-0.00983, 1],
      [-0.00969, 1],
      [0.0174, 0],
      [-0.00609, 1],
      [0.02136, 0],
      [-0.0071, 1],
      [0.02015, 0],
      [-0.00688, 1],
      [-0.00073, 2],
      [0.00063, 2],
      [-0.00099, 2],
      [-0.00756, 1],
      [0.00038, 2],
      [0.01841, 0],
      [0.01793, 0],
      [0.01824, 0],
      [0.00092, 2],
      [0.01701, 0],
      [0.02153, 0],
      [0.02054, 0],
      [0.02357, 0]
    ]
  },
  "QS_mulGraftNerve[LT]": {
    "red_x_points": [
      [-0.00047, 1],
      [-0.00013, 0],
      [-3e-5, 0],
      [4e-5, 0],
      [-0.00012, 0],
      [3e-5, 0],
      [4e-5, 2],
      [-0.00057, 1],
      [0.00013, 2],
      [-0.00013, 0],
      [0.0001, 2],
      [-0.00018, 0],
      [2e-5, 2],
      [1e-5, 0],
      [-0.00069, 1],
      [4e-5, 2],
      [-4e-5, 0],
      [6e-5, 2],
      [-0.00011, 0],
      [-0.00024, 0],
      [-0.00018, 1],
      [3e-5, 0],
      [4e-5, 2]
    ],
    "red_o_points": [],
    "y_categories": ["N", "NOT APPLICABLE", "nan"],
    "blue_o_points": [],
    "blue_x_points": [
      [0.00019, 2],
      [3e-5, 2],
      [5e-5, 0],
      [0.00022, 0],
      [4e-5, 2],
      [0.0001, 0],
      [3e-5, 0],
      [2e-5, 0],
      [8e-5, 2],
      [0.00057, 1],
      [-0.00022, 0],
      [0.00026, 0],
      [0.00013, 2],
      [9e-5, 2],
      [0.00019, 2],
      [4e-5, 2],
      [0.00012, 2],
      [7e-5, 2],
      [8e-5, 1],
      [8e-5, 2],
      [0.00019, 2]
    ]
  },
  "QS_mulGraftNerve[IS]": {
    "red_x_points": [
      [-0.00024, 1],
      [-1e-5, 0],
      [-1e-5, 0],
      [4e-5, 0],
      [5e-5, 2],
      [-0.00024, 1],
      [0.0, 2],
      [-4e-5, 0],
      [4e-5, 2],
      [-4e-5, 0],
      [5e-5, 0],
      [-0.00059, 1],
      [6e-5, 2],
      [0.0, 2],
      [-0.00014, 1],
      [4e-5, 0],
      [0.0, 2]
    ],
    "red_o_points": [],
    "y_categories": ["N", "NOT APPLICABLE", "nan"],
    "blue_o_points": [],
    "blue_x_points": [
      [4e-5, 2],
      [3e-5, 2],
      [6e-5, 0],
      [0.00011, 0],
      [0.00015, 0],
      [4e-5, 0],
      [5e-5, 0],
      [9e-5, 2],
      [0.0001, 1],
      [3e-5, 0],
      [0.00019, 0],
      [3e-5, 2],
      [2e-5, 2],
      [3e-5, 2],
      [3e-5, 2],
      [2e-5, 2],
      [-5e-5, 1],
      [2e-5, 2],
      [4e-5, 2]
    ]
  },
  "QS_mulGraftNerve[MC]": {
    "red_x_points": [[-0.00015, 1], [-5e-5, 0], [-5e-5, 2], [-5e-5, 0]],
    "red_o_points": [],
    "y_categories": ["N", "NOT APPLICABLE", "nan"],
    "blue_o_points": [],
    "blue_x_points": [[5e-5, 2], [5e-5, 2], [5e-5, 0], [0.00015, 1]]
  },
  "QA_lstPexKine[Elbow]": {
    "red_x_points": [
      [-0.00022, 1],
      [-0.00094, 2],
      [-0.00232, 2],
      [0.00093, 1],
      [-0.00151, 2],
      [-0.00911, 0],
      [0.00031, 1],
      [-7e-5, 1],
      [-0.00069, 2],
      [0.0015, 1],
      [-0.00154, 2],
      [-0.00094, 2],
      [-0.00147, 2],
      [0.00142, 1],
      [0.00019, 1],
      [-0.00267, 0],
      [-0.00097, 2],
      [-0.00098, 2],
      [-0.00364, 2],
      [-0.00122, 2],
      [-0.00033, 2],
      [-0.00512, 0],
      [-0.00132, 2]
    ],
    "red_o_points": [],
    "y_categories": ["NPV", "PV", "nan"],
    "blue_o_points": [],
    "blue_x_points": [
      [0.0048, 0],
      [-0.00078, 2],
      [0.0011, 1],
      [0.00372, 1],
      [-0.00018, 2],
      [0.00475, 1],
      [0.00278, 1],
      [0.00274, 1],
      [-0.00041, 2],
      [-8e-5, 2],
      [-0.00063, 2],
      [0.00611, 1],
      [-0.00017, 2],
      [0.00102, 1],
      [0.00072, 1],
      [0.00173, 0],
      [-0.00044, 2],
      [0.00097, 1],
      [-0.0002, 2],
      [0.00207, 1],
      [0.00108, 1]
    ]
  },
  "QS_mulGraftLevel[Trunk]": {
    "red_x_points": [
      [-0.00817, 1],
      [-0.00456, 0],
      [-0.00215, 0],
      [0.00041, 0],
      [-0.00331, 0],
      [1e-5, 0],
      [0.00034, 3],
      [-0.00772, 1],
      [0.00412, 3],
      [-0.02175, 2],
      [0.00237, 3],
      [-0.00419, 0],
      [0.00092, 3],
      [0.00024, 0],
      [-0.00944, 1],
      [0.00046, 3],
      [-0.00358, 0],
      [0.00186, 3],
      [-0.00159, 0],
      [-0.00524, 0],
      [-0.00526, 1],
      [0.00028, 0],
      [0.00145, 3]
    ],
    "red_o_points": [],
    "y_categories": ["N", "NOT APPLICABLE", "Y", "nan"],
    "blue_o_points": [],
    "blue_x_points": [
      [0.00284, 3],
      [0.00175, 3],
      [0.00188, 0],
      [0.00306, 0],
      [0.00152, 3],
      [0.00308, 0],
      [0.00298, 0],
      [0.00181, 0],
      [0.00582, 3],
      [0.01232, 1],
      [-0.00166, 0],
      [0.00449, 0],
      [0.00488, 3],
      [0.0018, 3],
      [0.00217, 3],
      [0.00116, 3],
      [0.00514, 3],
      [0.00224, 3],
      [0.00199, 1],
      [0.00268, 3],
      [0.00254, 3]
    ]
  },
  "QS_mulLysisNerve[Ssr]": {
    "red_x_points": [
      [-0.0053, 1],
      [-0.00111, 0],
      [-0.00928, 2],
      [-0.02028, 2],
      [-0.00085, 0],
      [0.00136, 0],
      [0.00067, 3],
      [-0.00503, 1],
      [0.00142, 3],
      [-0.00059, 0],
      [0.00104, 3],
      [-0.00107, 0],
      [0.00113, 3],
      [0.00018, 0],
      [-0.00557, 1],
      [0.00078, 3],
      [-0.00082, 0],
      [0.00151, 3],
      [-3e-5, 0],
      [-0.00061, 0],
      [-0.00619, 1],
      [0.00112, 0],
      [0.00111, 3]
    ],
    "red_o_points": [],
    "y_categories": ["N", "NOT APPLICABLE", "Y", "nan"],
    "blue_o_points": [],
    "blue_x_points": [
      [0.00292, 3],
      [0.002, 3],
      [0.00157, 0],
      [0.0043, 0],
      [0.00211, 3],
      [0.00418, 0],
      [0.0018, 0],
      [0.00408, 0],
      [0.00147, 3],
      [0.00241, 1],
      [-0.00058, 0],
      [0.00379, 0],
      [0.00137, 3],
      [0.00212, 3],
      [0.00209, 3],
      [0.00174, 3],
      [0.00168, 3],
      [0.00172, 3],
      [0.00116, 1],
      [0.00274, 3],
      [0.00173, 3]
    ]
  },
  "QA_lstPexKine[Index]": {
    "red_x_points": [
      [-0.00045, 1],
      [-0.00089, 2],
      [-0.00333, 2],
      [0.0013, 1],
      [-0.00139, 2],
      [-0.00908, 0],
      [-0.0007, 1],
      [0.00018, 1],
      [-0.00079, 2],
      [0.00086, 1],
      [-0.00133, 2],
      [-0.00063, 2],
      [-0.00145, 2],
      [0.00075, 1],
      [0.00025, 1],
      [-0.00218, 0],
      [-0.00106, 2],
      [-0.00175, 2],
      [-0.00465, 2],
      [-0.00108, 2],
      [-0.00044, 2],
      [-0.00519, 0],
      [-0.00159, 2]
    ],
    "red_o_points": [],
    "y_categories": ["NPV", "PV", "nan"],
    "blue_o_points": [],
    "blue_x_points": [
      [0.00458, 0],
      [-0.00082, 2],
      [0.00105, 1],
      [0.00468, 1],
      [-6e-5, 2],
      [0.00491, 1],
      [0.00246, 1],
      [0.00365, 1],
      [0.0, 2],
      [-0.00014, 2],
      [-0.00068, 2],
      [0.00564, 1],
      [-0.00025, 2],
      [0.00125, 1],
      [0.0008, 1],
      [0.00337, 0],
      [-0.00043, 2],
      [0.00088, 1],
      [5e-5, 2],
      [0.00194, 1],
      [0.00177, 1]
    ]
  },
  "QA_yonInjDisloc": {
    "red_x_points": [
      [-2e-5, 2],
      [-1e-5, 2],
      [-1e-5, 2],
      [3e-5, 2],
      [-0.0, 2],
      [1e-5, 2],
      [-2e-5, 2],
      [-3e-5, 2],
      [1e-5, 2],
      [-1e-5, 2],
      [3e-5, 2],
      [-0.0, 2],
      [0.0, 2],
      [-1e-5, 2],
      [-0.01171, 1],
      [-7e-5, 2],
      [-0.0, 2],
      [1e-5, 2],
      [1e-5, 2],
      [2e-5, 2],
      [-0.0, 2],
      [-0.006, 1],
      [0.0, 2]
    ],
    "red_o_points": [],
    "y_categories": ["N", "Y", "nan"],
    "blue_o_points": [],
    "blue_x_points": [
      [5e-5, 2],
      [5e-5, 2],
      [6e-5, 2],
      [4e-5, 2],
      [5e-5, 2],
      [8e-5, 2],
      [8e-5, 2],
      [7e-5, 2],
      [0.0001, 2],
      [9e-5, 2],
      [3e-5, 2],
      [0.00011, 2],
      [0.00841, 0],
      [0.00812, 0],
      [0.0001, 2],
      [7e-5, 2],
      [1e-5, 2],
      [6e-5, 2],
      [0.00015, 2],
      [3e-5, 2],
      [-0.0, 2]
    ]
  },
  "QA_lstPexInspectio[ScapulaAlata]": {
    "red_x_points": [
      [-0.00194, 1],
      [-0.00017, 1],
      [-0.00033, 1],
      [-0.00019, 1],
      [-0.00016, 1],
      [-0.00017, 1],
      [-0.00092, 1],
      [-0.00297, 1],
      [-0.00043, 1],
      [-0.00017, 1],
      [-0.00093, 1],
      [-0.00015, 1],
      [-0.00034, 1],
      [-0.00131, 1],
      [-0.00205, 1],
      [-0.00063, 1],
      [-0.00015, 1],
      [-0.00071, 1],
      [-0.00028, 1],
      [-0.00044, 1],
      [-0.00099, 1],
      [-0.00046, 1],
      [-0.00026, 1]
    ],
    "red_o_points": [],
    "y_categories": ["ABS", "NAIA", "PT", "nan"],
    "blue_o_points": [],
    "blue_x_points": [
      [-0.00034, 1],
      [-0.00027, 1],
      [-0.00036, 1],
      [-0.00037, 1],
      [-0.0003, 1],
      [-0.00027, 1],
      [-0.00026, 1],
      [-0.00025, 1],
      [-0.00029, 1],
      [-0.00073, 1],
      [-0.00014, 1],
      [-0.00024, 1],
      [-0.00018, 1],
      [0.00818, 0],
      [-0.00022, 1],
      [-0.00018, 1],
      [-0.00043, 1],
      [-0.00015, 1],
      [0.01354, 2],
      [-0.00033, 1],
      [-0.00023, 1]
    ]
  },
  "QA_yonInjFracture": {
    "red_x_points": [
      [0.0048, 0],
      [-0.00229, 2],
      [0.00408, 0],
      [-0.00387, 2],
      [-0.0099, 1],
      [-0.01306, 1],
      [0.00208, 0],
      [0.00329, 0],
      [-0.01339, 1],
      [-0.01179, 1],
      [0.00397, 0],
      [-0.00923, 1],
      [-0.01352, 1],
      [-0.0017, 0],
      [-0.01428, 1],
      [-0.00993, 1],
      [-0.00771, 1],
      [0.00362, 0],
      [0.00331, 0],
      [0.00472, 0],
      [-0.01032, 1],
      [-0.00782, 1],
      [-0.01817, 1]
    ],
    "red_o_points": [],
    "y_categories": ["N", "Y", "nan"],
    "blue_o_points": [],
    "blue_x_points": [
      [0.00992, 0],
      [0.01187, 0],
      [0.00359, 0],
      [0.0069, 0],
      [0.00939, 2],
      [0.00793, 0],
      [0.00145, 1],
      [0.00043, 1],
      [-0.00672, 1],
      [0.0086, 0],
      [0.01023, 0],
      [0.01053, 0],
      [0.00859, 0],
      [0.00272, 0],
      [0.00454, 0],
      [0.00512, 2],
      [0.00859, 0],
      [0.00491, 0],
      [0.0051, 0],
      [-0.00476, 1],
      [0.00816, 2]
    ]
  },
  "QS_mulGraftNerve[Ac]": {
    "red_x_points": [
      [-0.00069, 1],
      [-0.00034, 0],
      [1e-5, 0],
      [0.00013, 0],
      [-0.00021, 0],
      [2e-5, 0],
      [5e-5, 2],
      [-0.00096, 1],
      [0.00026, 2],
      [-0.00022, 0],
      [0.0001, 2],
      [-0.00014, 0],
      [0.00011, 2],
      [-0.00014, 0],
      [-0.00092, 1],
      [2e-5, 2],
      [-0.00035, 0],
      [0.00013, 2],
      [-3e-5, 0],
      [-0.00035, 0],
      [-0.00107, 1],
      [7e-5, 0],
      [-1e-5, 2]
    ],
    "red_o_points": [],
    "y_categories": ["N", "NOT APPLICABLE", "nan"],
    "blue_o_points": [],
    "blue_x_points": [
      [0.00018, 2],
      [9e-5, 2],
      [0.00018, 0],
      [0.00025, 0],
      [0.0, 2],
      [0.00024, 0],
      [6e-5, 0],
      [8e-5, 0],
      [0.00036, 2],
      [0.00099, 1],
      [-0.00013, 0],
      [0.00052, 0],
      [0.0003, 2],
      [0.00018, 2],
      [0.00014, 2],
      [0.00016, 2],
      [0.00018, 2],
      [0.00015, 2],
      [0.00015, 1],
      [0.00029, 2],
      [0.00014, 2]
    ]
  },
  "QS_mulNeuromadSite[C8]": {
    "red_x_points": [
      [-0.00325, 1],
      [-0.00227, 0],
      [-0.00081, 0],
      [-0.00018, 0],
      [-0.00147, 0],
      [9e-5, 0],
      [-0.00021, 2],
      [-0.00517, 1],
      [0.0012, 2],
      [-0.0015, 0],
      [0.00053, 2],
      [-0.00211, 0],
      [0.0003, 2],
      [0.0001, 0],
      [-0.00459, 1],
      [9e-5, 2],
      [-0.00126, 0],
      [0.00046, 2],
      [-0.00131, 0],
      [-0.00192, 0],
      [-0.00445, 1],
      [0.00011, 0],
      [0.00046, 2]
    ],
    "red_o_points": [],
    "y_categories": ["N", "NOT APPLICABLE", "nan"],
    "blue_o_points": [],
    "blue_x_points": [
      [0.00142, 2],
      [0.00063, 2],
      [0.00091, 0],
      [0.00191, 0],
      [0.00066, 2],
      [0.00126, 0],
      [0.00114, 0],
      [0.00061, 0],
      [0.00225, 2],
      [0.00485, 1],
      [-0.00112, 0],
      [0.00181, 0],
      [0.00138, 2],
      [0.00079, 2],
      [0.00123, 2],
      [0.00058, 2],
      [0.00185, 2],
      [0.00125, 2],
      [0.00135, 1],
      [0.00142, 2],
      [0.00097, 2]
    ]
  },
  "QA_lstPexMuscstrength[FingersFlex]": {
    "red_x_points": [
      [0.00216, 2],
      [0.00185, 2],
      [-0.02814, 1],
      [0.00817, 0],
      [-0.02592, 1],
      [-0.02842, 1],
      [-0.02986, 1],
      [0.00846, 0],
      [0.00253, 2],
      [0.00227, 2],
      [0.00891, 0],
      [0.002, 2],
      [-0.03058, 1],
      [0.00786, 0],
      [0.00891, 0],
      [-0.02725, 1],
      [-0.02759, 1],
      [0.00264, 2],
      [0.0086, 0],
      [0.00792, 0],
      [0.00222, 2],
      [-0.02626, 1],
      [0.00179, 2]
    ],
    "red_o_points": [],
    "y_categories": ["GREATER THAN OR EQUALS TO 3", "LESS THAN 3", "nan"],
    "blue_o_points": [],
    "blue_x_points": [
      [0.01199, 0],
      [0.01086, 0],
      [0.00884, 0],
      [0.01007, 0],
      [0.01081, 0],
      [0.00958, 0],
      [0.00902, 0],
      [0.00876, 0],
      [0.00312, 2],
      [0.00349, 2],
      [0.00328, 2],
      [0.00389, 2],
      [0.00352, 2],
      [0.00947, 0],
      [0.00934, 0],
      [0.00942, 0],
      [0.00382, 2],
      [0.00321, 2],
      [0.00912, 0],
      [0.00313, 2],
      [0.00299, 2]
    ]
  },
  "QA_lstPexPalle[Elbow]": {
    "red_x_points": [
      [-0.00147, 4],
      [-0.00159, 4],
      [-0.00156, 4],
      [0.01128, 3],
      [-0.00147, 4],
      [-0.00115, 4],
      [-0.01733, 1],
      [-0.01427, 1],
      [-0.00164, 4],
      [-0.00163, 4],
      [-0.00182, 4],
      [-0.00122, 4],
      [-0.00169, 4],
      [-0.01728, 1],
      [-0.00155, 4],
      [-0.02754, 0],
      [-0.02134, 2],
      [-0.00194, 4],
      [-0.0021, 4],
      [-0.00161, 4],
      [0.01068, 3],
      [-0.0218, 0],
      [-0.00181, 4]
    ],
    "red_o_points": [],
    "y_categories": ["ABS", "HYPO", "NAIA", "PT", "nan"],
    "blue_o_points": [],
    "blue_x_points": [
      [-0.00135, 4],
      [-0.0012, 4],
      [0.0161, 3],
      [0.01852, 3],
      [-0.00107, 4],
      [-0.00102, 4],
      [-0.0066, 1],
      [0.01733, 3],
      [-0.00145, 4],
      [-0.00118, 4],
      [-0.00123, 4],
      [-0.00055, 4],
      [-0.00144, 4],
      [0.01972, 3],
      [0.01846, 3],
      [0.01802, 3],
      [-0.00147, 4],
      [0.01694, 3],
      [-0.00098, 4],
      [0.01776, 3],
      [-0.00145, 4]
    ]
  },
  "QS_mulGraftRoot[C5]": {
    "red_x_points": [
      [-0.00075, 1],
      [-0.00051, 0],
      [-0.00017, 0],
      [0.00013, 0],
      [-0.00042, 0],
      [0.0002, 0],
      [6e-5, 2],
      [-0.00095, 1],
      [0.00019, 2],
      [-0.00026, 0],
      [-7e-5, 2],
      [-0.00048, 0],
      [3e-5, 2],
      [0.00011, 0],
      [-0.00074, 1],
      [2e-5, 2],
      [-0.00031, 0],
      [6e-5, 2],
      [-0.00014, 0],
      [-0.00049, 0],
      [-0.0004, 1],
      [0.0001, 0],
      [-1e-5, 2]
    ],
    "red_o_points": [],
    "y_categories": ["N", "NOT APPLICABLE", "nan"],
    "blue_o_points": [],
    "blue_x_points": [
      [0.00019, 2],
      [6e-5, 2],
      [4e-5, 0],
      [0.0003, 0],
      [6e-5, 2],
      [0.00035, 0],
      [0.00024, 0],
      [0.00021, 0],
      [0.00038, 2],
      [0.0011, 1],
      [-0.00014, 0],
      [0.0003, 0],
      [0.00041, 2],
      [9e-5, 2],
      [0.0002, 2],
      [3e-5, 2],
      [0.00036, 2],
      [3e-5, 2],
      [0.00024, 1],
      [0.00011, 2],
      [0.00018, 2]
    ]
  },
  "QA_lstPexMuscstrength[ScapulaAbducSuprot]": {
    "red_x_points": [
      [-0.00066, 2],
      [-0.00053, 2],
      [-0.00632, 1],
      [-0.00276, 2],
      [-0.00594, 1],
      [-0.00757, 1],
      [-0.00888, 1],
      [0.002, 0],
      [-0.00114, 2],
      [-0.00141, 2],
      [-0.00401, 2],
      [-0.00047, 2],
      [-0.01067, 1],
      [-0.00187, 0],
      [0.00359, 0],
      [-0.00894, 1],
      [-0.00241, 1],
      [-0.00172, 2],
      [-0.00775, 1],
      [0.00186, 0],
      [-0.00109, 2],
      [-0.00315, 1],
      [-0.00652, 2]
    ],
    "red_o_points": [],
    "y_categories": ["GREATER THAN OR EQUALS TO 3", "LESS THAN 3", "nan"],
    "blue_o_points": [],
    "blue_x_points": [
      [0.02099, 0],
      [0.01906, 0],
      [0.0034, 0],
      [-0.00065, 1],
      [-0.00239, 1],
      [0.00965, 0],
      [0.00771, 0],
      [0.00158, 1],
      [-0.00053, 2],
      [0.00065, 2],
      [0.00113, 2],
      [0.00175, 2],
      [0.00029, 2],
      [0.0052, 0],
      [0.00532, 0],
      [-0.00082, 2],
      [8e-5, 2],
      [0.00587, 0],
      [0.00153, 2],
      [-0.00266, 1],
      [-0.00077, 2]
    ]
  },
  "participant_code": {
    "red_x_points": [
      [-0.03788, 0],
      [-0.03564, 2],
      [-0.03691, 3],
      [-0.03671, 4],
      [-0.03827, 5],
      [-0.03691, 9],
      [-0.03623, 14],
      [-0.0371, 17],
      [-0.03798, 19],
      [-0.03477, 20],
      [-0.03632, 22],
      [-0.03632, 23],
      [-0.03642, 24],
      [-0.03691, 26],
      [-0.03836, 28],
      [-0.03788, 29],
      [-0.0373, 31],
      [-0.03545, 35],
      [-0.03778, 37],
      [-0.03846, 39],
      [-0.03827, 41],
      [-0.03652, 42],
      [-0.037, 43]
    ],
    "red_o_points": [],
    "y_categories": [
      "P16554",
      "P18297",
      "P19283",
      "P19287",
      "P23172",
      "P23391",
      "P30595",
      "P31645",
      "P31691",
      "P34778",
      "P35046",
      "P36328",
      "P43633",
      "P4544",
      "P46417",
      "P48965",
      "P53068",
      "P5497",
      "P58556",
      "P59529",
      "P62483",
      "P64658",
      "P65202",
      "P66816",
      "P67052",
      "P6751",
      "P7408",
      "P75566",
      "P76226",
      "P79971",
      "P82621",
      "P82990",
      "P84549",
      "P84932",
      "P85825",
      "P86989",
      "P8770",
      "P87791",
      "P90550",
      "P93159",
      "P94969",
      "P96710",
      "P9744",
      "P98500",
      "nan"
    ],
    "blue_o_points": [],
    "blue_x_points": [
      [0.04103, 1],
      [0.04124, 6],
      [0.04021, 7],
      [0.04124, 8],
      [0.04124, 10],
      [0.04155, 11],
      [0.04011, 12],
      [0.04052, 13],
      [0.04041, 15],
      [0.03959, 16],
      [0.04113, 18],
      [0.04093, 21],
      [0.04083, 25],
      [0.04062, 27],
      [0.04052, 30],
      [0.03836, 32],
      [0.04103, 33],
      [0.04103, 34],
      [0.04031, 36],
      [0.04, 38],
      [0.03949, 40]
    ]
  },
  "QA_lstPexTouch[T1]": {
    "red_x_points": [
      [-0.00868, 1],
      [-0.0019, 2],
      [-0.00539, 1],
      [0.00518, 0],
      [-0.00264, 2],
      [-0.00637, 1],
      [0.00349, 0],
      [-0.00919, 1],
      [-0.0021, 2],
      [-0.00423, 2],
      [-0.00952, 1],
      [-0.00243, 2],
      [-0.00636, 1],
      [-0.01181, 1],
      [-0.00808, 1],
      [-0.00501, 1],
      [-0.00222, 2],
      [0.00085, 0],
      [-0.00843, 1],
      [-0.00454, 2],
      [-0.00983, 1],
      [-0.00466, 1],
      [-0.00763, 1]
    ],
    "red_o_points": [],
    "y_categories": ["NORM", "NPV", "nan"],
    "blue_o_points": [],
    "blue_x_points": [
      [-0.00435, 1],
      [-0.00424, 1],
      [0.01243, 0],
      [-0.00436, 1],
      [-0.00455, 1],
      [0.01698, 0],
      [0.01531, 0],
      [0.01349, 0],
      [0.00132, 2],
      [0.00258, 2],
      [-0.00083, 2],
      [-0.0034, 1],
      [0.00194, 2],
      [0.01078, 0],
      [0.0087, 0],
      [0.01108, 0],
      [0.00209, 2],
      [-0.00429, 1],
      [0.01584, 0],
      [0.0119, 0],
      [0.01309, 0]
    ]
  },
  "QS_mulGraftNerve[Ul]": {
    "red_x_points": [
      [-0.00023, 1],
      [-0.00028, 0],
      [-4e-5, 0],
      [0.00016, 0],
      [-0.00028, 0],
      [0.00016, 0],
      [-0.00018, 2],
      [-0.00054, 1],
      [0.00019, 2],
      [-4e-5, 0],
      [2e-5, 2],
      [-8e-5, 0],
      [1e-5, 2],
      [2e-5, 0],
      [-0.00044, 1],
      [-1e-5, 2],
      [-0.00013, 0],
      [5e-5, 2],
      [2e-5, 0],
      [-0.00028, 0],
      [-0.0005, 1],
      [4e-5, 0],
      [5e-5, 2]
    ],
    "red_o_points": [],
    "y_categories": ["N", "NOT APPLICABLE", "nan"],
    "blue_o_points": [],
    "blue_x_points": [
      [0.00014, 2],
      [-1e-5, 2],
      [2e-5, 0],
      [0.0003, 0],
      [0.0002, 0],
      [5e-5, 0],
      [0.00012, 0],
      [0.00013, 2],
      [0.00062, 1],
      [-7e-5, 0],
      [0.00027, 0],
      [0.00015, 2],
      [8e-5, 2],
      [0.00019, 2],
      [7e-5, 2],
      [8e-5, 2],
      [1e-5, 2]
    ]
  },
  "QS_mulGraftNerve[Ssr]": {
    "red_x_points": [
      [-0.00104, 1],
      [-0.00033, 0],
      [-0.00013, 0],
      [-9e-5, 0],
      [-0.00042, 0],
      [0.00011, 0],
      [3e-5, 2],
      [-0.00074, 1],
      [0.00036, 2],
      [-0.00034, 0],
      [1e-5, 2],
      [-0.0003, 0],
      [4e-5, 2],
      [-0.00016, 0],
      [-0.00117, 1],
      [-0.0, 2],
      [-0.00044, 0],
      [0.0001, 2],
      [-0.00012, 0],
      [-0.00048, 0],
      [-0.00019, 1],
      [5e-5, 2]
    ],
    "red_o_points": [],
    "y_categories": ["N", "NOT APPLICABLE", "nan"],
    "blue_o_points": [],
    "blue_x_points": [
      [0.00031, 2],
      [6e-5, 2],
      [6e-5, 0],
      [0.00029, 0],
      [0.00017, 2],
      [0.00039, 0],
      [-2e-5, 0],
      [-9e-5, 0],
      [0.00039, 2],
      [0.00124, 1],
      [-0.00025, 0],
      [0.00049, 0],
      [0.00041, 2],
      [0.00014, 2],
      [0.00021, 2],
      [0.00014, 2],
      [0.00044, 2],
      [0.00014, 2],
      [0.00023, 1],
      [0.0003, 2],
      [0.0002, 2]
    ]
  },
  "QS_mulGraftNerve[MCA]": {
    "red_x_points": [
      [-0.0001, 1],
      [-0.00011, 0],
      [-5e-5, 0],
      [0.0, 0],
      [-0.00017, 0],
      [0.0, 0],
      [-0.00025, 1],
      [0.00018, 2],
      [-0.00017, 0],
      [7e-5, 2],
      [-0.00012, 0],
      [3e-5, 2],
      [4e-5, 0],
      [-0.00022, 1],
      [-0.00024, 0],
      [3e-5, 2],
      [-5e-5, 0],
      [-0.00018, 0],
      [-0.00024, 1],
      [0.0, 0],
      [3e-5, 2]
    ],
    "red_o_points": [],
    "y_categories": ["N", "NOT APPLICABLE", "nan"],
    "blue_o_points": [],
    "blue_x_points": [
      [3e-5, 2],
      [8e-5, 2],
      [4e-5, 0],
      [5e-5, 0],
      [0.0, 2],
      [0.00011, 0],
      [8e-5, 0],
      [4e-5, 0],
      [0.00013, 2],
      [0.00053, 1],
      [-6e-5, 0],
      [7e-5, 0],
      [0.0001, 2],
      [3e-5, 2],
      [4e-5, 2],
      [0.00018, 2],
      [8e-5, 2],
      [3e-5, 2]
    ]
  },
  "QA_lstPexInspectio[Swelling]": {
    "red_x_points": [
      [0.00104, 1],
      [0.00182, 1],
      [-0.00159, 0],
      [0.0015, 1],
      [-0.01313, 2],
      [0.00147, 1],
      [-0.01923, 2],
      [-0.00082, 0],
      [-0.00762, 0],
      [0.0009, 1],
      [-0.00734, 0],
      [0.00137, 1],
      [0.00323, 1],
      [-0.03398, 2],
      [0.00108, 1],
      [-0.01511, 2],
      [0.00176, 1],
      [0.00306, 1],
      [0.00097, 1],
      [-0.0015, 0],
      [-0.00421, 0],
      [-0.00097, 0],
      [0.00336, 1]
    ],
    "red_o_points": [],
    "y_categories": ["ABS", "NAIA", "PT", "nan"],
    "blue_o_points": [],
    "blue_x_points": [
      [0.00691, 1],
      [0.00548, 1],
      [0.00428, 0],
      [0.00368, 0],
      [0.00451, 1],
      [0.00322, 1],
      [0.00692, 0],
      [0.0046, 1],
      [0.00497, 1],
      [0.00284, 1],
      [0.0023, 1],
      [0.00372, 1],
      [0.00417, 1],
      [0.00256, 0],
      [0.00375, 1],
      [0.00381, 1],
      [-0.00078, 0],
      [0.00317, 1],
      [0.00412, 0],
      [0.00512, 1],
      [0.00459, 1]
    ]
  },
  "QS_mulLysisNerve[FI]": {
    "red_x_points": [
      [-0.00019, 1],
      [-0.0001, 1],
      [3e-5, 0],
      [1e-5, 2],
      [-0.00019, 1],
      [1e-5, 2]
    ],
    "red_o_points": [],
    "y_categories": ["N", "NOT APPLICABLE", "nan"],
    "blue_o_points": [],
    "blue_x_points": [
      [0.00011, 2],
      [1e-5, 2],
      [3e-5, 0],
      [3e-5, 0],
      [0.00011, 0],
      [0.0001, 2]
    ]
  },
  "QS_mulGraftNerve[Ax]": {
    "red_x_points": [
      [-0.00186, 1],
      [-0.00102, 0],
      [-0.00025, 0],
      [0.00013, 0],
      [-0.00057, 0],
      [0.00019, 0],
      [6e-5, 2],
      [-0.00211, 1],
      [0.00037, 2],
      [-0.00092, 0],
      [0.00015, 2],
      [-0.00077, 0],
      [0.00012, 2],
      [4e-5, 0],
      [-0.00263, 1],
      [6e-5, 2],
      [-0.00079, 0],
      [0.00033, 2],
      [-0.00041, 0],
      [-0.00128, 0],
      [-0.00179, 1],
      [0.00015, 0],
      [0.0001, 2]
    ],
    "red_o_points": [],
    "y_categories": ["N", "NOT APPLICABLE", "nan"],
    "blue_o_points": [],
    "blue_x_points": [
      [0.00076, 2],
      [0.00024, 2],
      [0.00041, 0],
      [0.00055, 0],
      [0.00019, 2],
      [0.00075, 0],
      [0.0004, 0],
      [0.00036, 0],
      [0.00099, 2],
      [0.00216, 1],
      [-0.00047, 0],
      [0.00084, 0],
      [0.00094, 2],
      [0.00062, 2],
      [0.00057, 2],
      [0.00016, 2],
      [0.00098, 2],
      [0.00051, 2],
      [0.00028, 1],
      [0.00065, 2],
      [0.0008, 2]
    ]
  },
  "QS_mulGraftTrunk[UpperTrunk]": {
    "red_x_points": [
      [-0.0078, 1],
      [-0.00484, 0],
      [-0.00135, 0],
      [0.00075, 0],
      [-0.00287, 0],
      [-1e-5, 0],
      [0.00061, 3],
      [-0.0073, 1],
      [0.00406, 3],
      [-0.02004, 2],
      [0.00127, 3],
      [-0.0042, 0],
      [0.00081, 3],
      [0.00043, 0],
      [-0.00977, 1],
      [0.00057, 3],
      [-0.0024, 0],
      [0.00152, 3],
      [-0.00136, 0],
      [-0.00423, 0],
      [-0.0067, 1],
      [0.00037, 0],
      [0.00132, 3]
    ],
    "red_o_points": [],
    "y_categories": ["N", "NOT APPLICABLE", "Y", "nan"],
    "blue_o_points": [],
    "blue_x_points": [
      [0.00286, 3],
      [0.00118, 3],
      [0.00185, 0],
      [0.00336, 0],
      [0.00096, 3],
      [0.00419, 0],
      [0.00287, 0],
      [0.00242, 0],
      [0.00527, 3],
      [0.01019, 1],
      [-0.00085, 0],
      [0.00434, 0],
      [0.00441, 3],
      [0.00122, 3],
      [0.00175, 3],
      [0.0011, 3],
      [0.00539, 3],
      [0.00214, 3],
      [0.00134, 1],
      [0.00257, 3],
      [0.0026, 3]
    ]
  },
  "QA_yonPreFracture": {
    "red_x_points": [
      [-0.03013, 1],
      [0.00181, 2],
      [0.00573, 0],
      [0.00234, 2],
      [0.00572, 0],
      [0.00581, 0],
      [-0.02728, 1],
      [0.0054, 0],
      [0.00162, 2],
      [-0.03222, 1],
      [-0.0323, 1],
      [-0.02878, 1],
      [0.00205, 2],
      [0.00566, 0],
      [0.00584, 0],
      [0.00505, 0],
      [0.00514, 0],
      [0.00794, 0],
      [-0.03219, 1],
      [0.00555, 0],
      [0.00154, 2],
      [-0.02289, 1],
      [0.00165, 2]
    ],
    "red_o_points": [],
    "y_categories": ["N", "Y", "nan"],
    "blue_o_points": [],
    "blue_x_points": [
      [0.00766, 0],
      [0.00482, 2],
      [0.0065, 0],
      [0.00699, 0],
      [0.00509, 2],
      [0.00751, 0],
      [0.00736, 0],
      [0.00526, 2],
      [0.00391, 2],
      [0.00852, 0],
      [0.00861, 0],
      [0.00986, 0],
      [0.0088, 0],
      [0.00613, 0],
      [0.00587, 0],
      [0.00412, 2],
      [0.00969, 0],
      [0.00742, 0],
      [0.00647, 0],
      [0.00298, 2],
      [0.00334, 2]
    ]
  },
  "QS_mulTransfSite[MeMc]": {
    "red_x_points": [
      [-7e-5, 0],
      [-7e-5, 0],
      [-7e-5, 0],
      [3e-5, 0],
      [-7e-5, 1],
      [0.0, 2],
      [1e-5, 2],
      [-0.00017, 1],
      [1e-5, 2],
      [6e-5, 2],
      [-7e-5, 0],
      [-0.0002, 1],
      [3e-5, 0],
      [1e-5, 2]
    ],
    "red_o_points": [],
    "y_categories": ["N", "NOT APPLICABLE", "nan"],
    "blue_o_points": [],
    "blue_x_points": [
      [1e-5, 2],
      [1e-5, 2],
      [0.0001, 0],
      [0.0001, 0],
      [6e-5, 2],
      [0.00012, 1],
      [3e-5, 0],
      [6e-5, 2],
      [7e-5, 2]
    ]
  },
  "QA_lstPexPain[C7]": {
    "red_x_points": [
      [-0.00867, 1],
      [-0.00852, 2],
      [-0.00729, 2],
      [-0.00814, 1],
      [-0.00743, 2],
      [-0.00643, 1],
      [-0.00749, 1],
      [-0.00874, 1],
      [-0.00898, 2],
      [-0.00871, 2],
      [-0.00944, 2],
      [-0.00778, 2],
      [-0.00797, 1],
      [0.01237, 0],
      [-0.00844, 1],
      [-0.00668, 1],
      [-0.00774, 2],
      [-0.00991, 2],
      [-0.01014, 2],
      [-0.00771, 2],
      [-0.00909, 1],
      [-0.00584, 1],
      [-0.00787, 1]
    ],
    "red_o_points": [],
    "y_categories": ["NORM", "NPV", "nan"],
    "blue_o_points": [],
    "blue_x_points": [
      [-0.00567, 1],
      [-0.00653, 1],
      [0.02117, 0],
      [-0.00299, 1],
      [0.02481, 0],
      [-0.0047, 1],
      [0.0232, 0],
      [0.02394, 0],
      [-0.00742, 2],
      [-0.00483, 2],
      [-0.00723, 2],
      [-0.00516, 1],
      [-0.00695, 2],
      [0.02079, 0],
      [0.02104, 0],
      [0.02166, 0],
      [-0.00711, 2],
      [0.02158, 0],
      [0.02661, 0],
      [-0.00636, 1],
      [0.02679, 0]
    ]
  },
  "QS_mulTransfSite[C7ipsi]": {
    "red_x_points": [[-4e-5, 0], [-4e-5, 0], [-4e-5, 2], [-4e-5, 0]],
    "red_o_points": [],
    "y_categories": ["N", "NOT APPLICABLE", "nan"],
    "blue_o_points": [],
    "blue_x_points": [[0.00016, 1]]
  },
  "QS_mulLysisNerve[Ph]": {
    "red_x_points": [
      [-4e-5, 0],
      [-4e-5, 0],
      [3e-5, 2],
      [-4e-5, 0],
      [-4e-5, 0],
      [3e-5, 2],
      [-4e-5, 0],
      [-4e-5, 0]
    ],
    "red_o_points": [],
    "y_categories": ["N", "NOT APPLICABLE", "nan"],
    "blue_o_points": [],
    "blue_x_points": [[3e-5, 2], [0.00013, 1], [-4e-5, 0], [3e-5, 2]]
  },
  "QA_lstPexMuscstrength[ThumbOppo]": {
    "red_x_points": [
      [0.00065, 2],
      [0.00012, 2],
      [-0.01122, 1],
      [-0.02075, 1],
      [-0.00932, 1],
      [-0.01174, 1],
      [-0.00078, 0],
      [0.00257, 0],
      [-6e-5, 2],
      [0.00024, 2],
      [-0.00192, 0],
      [0.00051, 2],
      [-0.00837, 1],
      [0.00408, 0],
      [0.00195, 0],
      [-0.00686, 1],
      [-0.00867, 1],
      [0.00071, 2],
      [0.0037, 0],
      [-0.01004, 1],
      [-0.00053, 2],
      [-0.00903, 1],
      [-0.002, 2]
    ],
    "red_o_points": [],
    "y_categories": ["GREATER THAN OR EQUALS TO 3", "LESS THAN 3", "nan"],
    "blue_o_points": [],
    "blue_x_points": [
      [-0.00109, 1],
      [0.00048, 1],
      [0.00469, 0],
      [0.00712, 0],
      [0.00726, 0],
      [0.00767, 0],
      [0.00684, 0],
      [0.01038, 0],
      [0.00126, 2],
      [0.00193, 2],
      [0.00245, 2],
      [0.00754, 2],
      [0.00177, 2],
      [0.00426, 0],
      [0.00437, 0],
      [0.0064, 0],
      [0.00295, 2],
      [0.00149, 2],
      [0.00553, 0],
      [0.00248, 2],
      [0.00096, 2]
    ]
  },
  "QA_lstPexMuscstrength[ElbowExte]": {
    "red_x_points": [
      [-0.0027, 2],
      [-0.00544, 2],
      [-0.00322, 1],
      [-0.00252, 1],
      [-0.00641, 1],
      [-0.00377, 1],
      [-0.00344, 1],
      [0.00175, 0],
      [-0.00229, 2],
      [-0.00894, 2],
      [-0.00456, 1],
      [-0.00524, 2],
      [-0.00098, 1],
      [-0.00646, 1],
      [0.00073, 0],
      [-0.00195, 1],
      [-0.00456, 1],
      [-0.00468, 0],
      [-0.00569, 1],
      [-0.00476, 2],
      [-0.00189, 2],
      [-0.00199, 1],
      [-0.00502, 2]
    ],
    "red_o_points": [],
    "y_categories": ["GREATER THAN OR EQUALS TO 3", "LESS THAN 3", "nan"],
    "blue_o_points": [],
    "blue_x_points": [
      [-0.00044, 1],
      [0.00015, 1],
      [0.00886, 0],
      [-0.00232, 1],
      [-0.00045, 1],
      [0.01579, 0],
      [0.01185, 0],
      [-0.00233, 1],
      [0.00017, 2],
      [-0.00092, 2],
      [0.02043, 0],
      [0.00146, 1],
      [0.00072, 2],
      [0.00635, 0],
      [0.00515, 0],
      [0.00629, 0],
      [0.00063, 2],
      [0.0039, 0],
      [0.00496, 0],
      [0.00226, 1],
      [0.0015, 1]
    ]
  },
  "QA_intPexForearmSupin": {
    "red_x_points": [
      [-0.00047, 2],
      [-0.00751, 0],
      [-0.00081, 2],
      [-0.00058, 2],
      [-0.00069, 2],
      [-0.00062, 2],
      [-0.01869, 0],
      [-0.01233, 0],
      [-0.00076, 2],
      [-0.0005, 2],
      [-0.00124, 2],
      [-0.00029, 2],
      [-0.00134, 2],
      [0.00326, 1],
      [-0.0006, 2],
      [-0.01322, 0],
      [-1e-5, 1],
      [-0.00084, 2],
      [-0.0009, 2],
      [-0.00091, 2],
      [0.00464, 1],
      [-0.00835, 0],
      [-0.00147, 2]
    ],
    "red_o_points": [],
    "y_categories": ["GREATER THAN OR EQUALS TO 80", "LESS THAN 80", "nan"],
    "blue_o_points": [],
    "blue_x_points": [
      [-0.00037, 2],
      [0.01538, 1],
      [0.00508, 1],
      [0.00999, 1],
      [0.00933, 1],
      [-0.00019, 2],
      [4e-5, 2],
      [0.00015, 2],
      [-0.00024, 2],
      [-0.00021, 2],
      [0.00176, 0],
      [-9e-5, 2],
      [-0.0003, 2],
      [0.00708, 1],
      [0.0075, 1],
      [-9e-5, 2],
      [-0.00037, 2],
      [2e-5, 2],
      [-8e-5, 2],
      [0.00982, 1],
      [2e-5, 2]
    ]
  },
  "QA_lstPexTinel[TinelSign]": {
    "red_x_points": [
      [0.00097, 1],
      [-0.00032, 1],
      [-0.00823, 2],
      [0.00099, 1],
      [0.00081, 1],
      [0.00084, 1],
      [-0.01171, 2],
      [-0.01031, 2],
      [-0.00358, 1],
      [0.00049, 1],
      [-0.01358, 2],
      [-0.00784, 2],
      [-0.00058, 1],
      [-0.01423, 2],
      [0.00205, 1],
      [-0.00884, 2],
      [0.00081, 1],
      [-0.00109, 1],
      [-0.01164, 2],
      [-0.00798, 2],
      [2e-5, 1],
      [-0.00692, 2],
      [-0.00074, 1]
    ],
    "red_o_points": [],
    "y_categories": ["ABS", "NAIA", "PT", "nan"],
    "blue_o_points": [],
    "blue_x_points": [
      [0.00516, 1],
      [0.03049, 0],
      [0.01691, 0],
      [-0.00745, 2],
      [0.00351, 1],
      [0.00403, 1],
      [-0.00647, 2],
      [0.00462, 1],
      [0.00237, 2],
      [0.00172, 1],
      [0.00403, 1],
      [0.00385, 1],
      [0.00111, 1],
      [0.019, 0],
      [0.00412, 1],
      [0.0035, 1],
      [0.00049, 2],
      [0.00246, 1],
      [0.00338, 1],
      [0.00189, 1],
      [0.00192, 1]
    ]
  },
  "QS_mulGraftNerve[MCF]": {
    "red_x_points": [
      [-0.00023, 1],
      [-4e-5, 0],
      [-4e-5, 0],
      [2e-5, 0],
      [2e-5, 0],
      [2e-5, 2],
      [-7e-5, 1],
      [3e-5, 2],
      [-4e-5, 0],
      [-4e-5, 0],
      [-0.00022, 1],
      [2e-5, 2],
      [3e-5, 2],
      [-4e-5, 0],
      [-0.00034, 1],
      [2e-5, 0],
      [2e-5, 2]
    ],
    "red_o_points": [],
    "y_categories": ["N", "NOT APPLICABLE", "nan"],
    "blue_o_points": [],
    "blue_x_points": [
      [8e-5, 2],
      [3e-5, 2],
      [6e-5, 0],
      [0.00011, 0],
      [0.0001, 0],
      [3e-5, 0],
      [0.00013, 1],
      [0.0, 0],
      [0.00011, 0],
      [3e-5, 2],
      [4e-5, 2],
      [3e-5, 2],
      [4e-5, 2],
      [6e-5, 2]
    ]
  },
  "QS_mulLysisSite[Nerve]": {
    "red_x_points": [
      [-0.00555, 1],
      [-0.00186, 0],
      [-0.01253, 2],
      [-0.02071, 2],
      [-0.00119, 0],
      [0.00172, 0],
      [0.00079, 3],
      [-0.00651, 1],
      [0.00168, 3],
      [-0.00118, 0],
      [0.00174, 3],
      [-0.00124, 0],
      [0.00127, 3],
      [0.0008, 0],
      [-0.00611, 1],
      [0.00084, 3],
      [-0.00099, 0],
      [0.00144, 3],
      [0.00057, 0],
      [-0.00124, 0],
      [-0.0082, 1],
      [0.00144, 0],
      [0.00136, 3]
    ],
    "red_o_points": [],
    "y_categories": ["N", "NOT APPLICABLE", "Y", "nan"],
    "blue_o_points": [],
    "blue_x_points": [
      [0.00268, 3],
      [0.00174, 3],
      [0.00218, 0],
      [0.00465, 0],
      [0.00161, 3],
      [0.00356, 0],
      [0.00204, 0],
      [0.00468, 0],
      [0.00203, 3],
      [0.00434, 1],
      [-0.00103, 0],
      [0.00465, 0],
      [0.00195, 3],
      [0.00261, 3],
      [0.00211, 3],
      [0.00184, 3],
      [0.00285, 3],
      [0.00213, 3],
      [0.0019, 1],
      [0.00339, 3],
      [0.00176, 3]
    ]
  },
  "QS_mulTransfSite[IMc]": {
    "red_x_points": [
      [-0.01153, 1],
      [-0.02049, 2],
      [0.00026, 0],
      [-0.02526, 2],
      [-0.00223, 0],
      [0.00395, 0],
      [0.00252, 3],
      [-0.01236, 1],
      [0.00708, 3],
      [-0.00215, 0],
      [0.00387, 3],
      [-0.01835, 2],
      [0.00402, 3],
      [0.00094, 0],
      [-0.01504, 1],
      [0.0022, 3],
      [-0.00321, 0],
      [0.00386, 3],
      [0.00028, 0],
      [-0.01866, 2],
      [-0.01654, 1],
      [-0.01298, 2],
      [0.00457, 3]
    ],
    "red_o_points": [],
    "y_categories": ["N", "NOT APPLICABLE", "Y", "nan"],
    "blue_o_points": [],
    "blue_x_points": [
      [0.00632, 3],
      [0.00531, 3],
      [0.00475, 0],
      [0.00759, 0],
      [0.00471, 3],
      [0.00657, 0],
      [0.00503, 0],
      [0.00639, 0],
      [0.0094, 3],
      [0.0111, 1],
      [0.00066, 0],
      [0.00697, 0],
      [0.00746, 3],
      [0.00501, 3],
      [0.0052, 3],
      [0.00503, 3],
      [0.00864, 3],
      [0.00503, 3],
      [0.00036, 1],
      [0.00771, 3],
      [0.00599, 3]
    ]
  },
  "QS_mulTransfSite[AcMc]": {
    "red_x_points": [
      [-0.00733, 1],
      [-0.00727, 0],
      [-0.00238, 0],
      [-0.00462, 0],
      [-0.00413, 0],
      [-0.00084, 0],
      [0.00111, 3],
      [-0.00812, 1],
      [0.00305, 3],
      [-0.00456, 0],
      [0.00147, 3],
      [-0.00448, 0],
      [0.00172, 3],
      [-0.00338, 0],
      [-0.01091, 1],
      [0.00101, 3],
      [-0.00382, 0],
      [0.00135, 3],
      [-0.00348, 0],
      [-0.00544, 0],
      [-0.00983, 1],
      [-0.00086, 0],
      [0.0013, 3]
    ],
    "red_o_points": [],
    "y_categories": ["N", "NOT APPLICABLE", "Y", "nan"],
    "blue_o_points": [],
    "blue_x_points": [
      [0.00349, 3],
      [0.0025, 3],
      [0.00053, 0],
      [0.0016, 0],
      [0.00243, 3],
      [0.00262, 0],
      [0.00055, 0],
      [0.01791, 2],
      [0.00454, 3],
      [0.0096, 1],
      [-0.00237, 0],
      [0.00221, 0],
      [0.00413, 3],
      [0.0022, 3],
      [0.00259, 3],
      [0.00243, 3],
      [0.00482, 3],
      [0.00207, 3],
      [0.00061, 1],
      [0.0037, 3],
      [0.00228, 3]
    ]
  },
  "QS_mulTransfSite[Other]": {
    "red_x_points": [
      [-0.00481, 1],
      [-0.00153, 0],
      [-0.00039, 0],
      [-8e-5, 0],
      [-0.00084, 0],
      [0.00039, 0],
      [-0.00016, 3],
      [-0.00684, 1],
      [0.00095, 3],
      [-0.00085, 0],
      [0.00077, 3],
      [-0.0014, 0],
      [0.00061, 3],
      [-0.02971, 2],
      [-0.00565, 1],
      [0.00048, 3],
      [-0.00109, 0],
      [0.00106, 3],
      [0.00014, 0],
      [-0.0019, 0],
      [-0.00505, 1],
      [0.00034, 0],
      [0.00053, 3]
    ],
    "red_o_points": [],
    "y_categories": ["N", "NOT APPLICABLE", "Y", "nan"],
    "blue_o_points": [],
    "blue_x_points": [
      [0.00195, 3],
      [0.00165, 3],
      [0.00393, 0],
      [0.00362, 0],
      [0.00268, 3],
      [0.00306, 0],
      [0.00535, 0],
      [0.0041, 0],
      [0.00152, 3],
      [0.004, 1],
      [-0.00023, 0],
      [0.00278, 0],
      [0.00134, 3],
      [0.00425, 3],
      [0.00372, 3],
      [0.00237, 3],
      [0.00192, 3],
      [0.00245, 3],
      [8e-5, 1],
      [0.0028, 3],
      [0.00168, 3]
    ]
  },
  "QA_lstPexTouch[C8]": {
    "red_x_points": [
      [0.00886, 0],
      [-0.00325, 2],
      [-0.00865, 1],
      [-0.01202, 1],
      [-0.00274, 2],
      [-0.0082, 1],
      [-0.01036, 1],
      [-0.01167, 1],
      [-0.00341, 2],
      [-0.00383, 2],
      [-0.01204, 1],
      [-0.00277, 2],
      [-0.01209, 1],
      [0.00985, 0],
      [-0.01084, 1],
      [-0.00961, 1],
      [-0.00339, 2],
      [0.00785, 0],
      [-0.00901, 1],
      [-0.0038, 2],
      [-0.01366, 1],
      [-0.00887, 1],
      [-0.01322, 1]
    ],
    "red_o_points": [],
    "y_categories": ["NORM", "NPV", "nan"],
    "blue_o_points": [],
    "blue_x_points": [
      [-0.0084, 1],
      [-0.00961, 1],
      [0.01318, 0],
      [-0.00804, 1],
      [0.01779, 0],
      [-0.00663, 1],
      [0.01668, 0],
      [0.01629, 0],
      [0.00046, 2],
      [0.00235, 2],
      [-0.001, 2],
      [-0.00658, 1],
      [0.00086, 2],
      [0.01486, 0],
      [0.01359, 0],
      [0.0154, 0],
      [0.00102, 2],
      [0.0138, 0],
      [0.01544, 0],
      [0.01915, 0],
      [0.01624, 0]
    ]
  },
  "QA_lstPexPain[C6]": {
    "red_x_points": [
      [-0.0007, 1],
      [-0.00346, 2],
      [-0.00336, 2],
      [-0.00041, 1],
      [-0.00279, 2],
      [-0.0002, 1],
      [-0.00062, 1],
      [-0.00083, 1],
      [-0.00435, 2],
      [-0.00308, 2],
      [-0.00466, 2],
      [-0.00259, 2],
      [-0.00117, 1],
      [-0.00196, 1],
      [-0.0002, 1],
      [-0.00073, 1],
      [-0.00242, 2],
      [-0.00531, 2],
      [-0.00488, 2],
      [-0.00365, 2],
      [-0.00103, 1],
      [-0.00051, 1],
      [-0.00101, 1]
    ],
    "red_o_points": [],
    "y_categories": ["NORM", "NPV", "nan"],
    "blue_o_points": [],
    "blue_x_points": [
      [2e-5, 1],
      [8e-5, 1],
      [0.00967, 0],
      [-6e-5, 1],
      [0.01628, 0],
      [0.00011, 1],
      [0.0001, 1],
      [-0.00028, 1],
      [-0.00288, 2],
      [-0.00238, 2],
      [-0.00245, 2],
      [-0.0, 1],
      [-0.0022, 2],
      [0.0141, 0],
      [-0.00018, 1],
      [0.01223, 0],
      [-0.00262, 2],
      [0.01116, 0],
      [-0.00027, 1],
      [-0.00048, 1],
      [-2e-5, 1]
    ]
  },
  "QS_mulTransfSite[AcSsAA]": {
    "red_x_points": [
      [-0.00946, 1],
      [-0.0151, 2],
      [-0.00151, 0],
      [-0.00065, 0],
      [-0.01111, 2],
      [0.00058, 0],
      [0.00016, 3],
      [-0.01148, 1],
      [0.00491, 3],
      [-0.01558, 2],
      [0.00246, 3],
      [-0.00174, 0],
      [0.00169, 3],
      [-0.0057, 0],
      [-0.01241, 1],
      [0.00121, 3],
      [-0.01124, 2],
      [0.00332, 3],
      [-0.00256, 0],
      [-0.01248, 2],
      [-0.01005, 1],
      [0.00012, 0],
      [0.00191, 3]
    ],
    "red_o_points": [],
    "y_categories": ["N", "NOT APPLICABLE", "Y", "nan"],
    "blue_o_points": [],
    "blue_x_points": [
      [0.00415, 3],
      [0.00288, 3],
      [0.00433, 2],
      [0.00238, 0],
      [0.00273, 3],
      [0.00405, 0],
      [0.01037, 2],
      [0.00104, 0],
      [0.00788, 3],
      [0.01545, 1],
      [0.0073, 0],
      [0.00499, 0],
      [0.00664, 3],
      [0.00276, 3],
      [0.00316, 3],
      [0.00283, 3],
      [0.00803, 3],
      [0.00319, 3],
      [0.00212, 1],
      [0.00427, 3],
      [0.00415, 3]
    ]
  },
  "QS_mulLysisRoot[C5]": {
    "red_x_points": [
      [-0.00422, 1],
      [-0.00132, 0],
      [-0.01166, 2],
      [0.0015, 0],
      [-0.00107, 0],
      [0.00247, 0],
      [0.00078, 3],
      [-0.00534, 1],
      [0.00125, 3],
      [-0.00064, 0],
      [0.00096, 3],
      [-0.00088, 0],
      [0.00082, 3],
      [0.00023, 0],
      [-0.00525, 1],
      [0.0005, 3],
      [-0.00088, 0],
      [0.00143, 3],
      [0.00072, 0],
      [-0.00101, 0],
      [-0.00519, 1],
      [-0.00848, 2],
      [0.00086, 3]
    ],
    "red_o_points": [],
    "y_categories": ["N", "NOT APPLICABLE", "Y", "nan"],
    "blue_o_points": [],
    "blue_x_points": [
      [0.00144, 3],
      [0.00116, 3],
      [0.00075, 0],
      [0.00485, 0],
      [0.00093, 3],
      [0.00308, 0],
      [0.00131, 0],
      [0.00152, 0],
      [0.00129, 3],
      [0.00388, 1],
      [-0.00048, 0],
      [0.00382, 0],
      [0.00138, 3],
      [0.0013, 3],
      [0.00061, 3],
      [0.00035, 3],
      [0.00221, 3],
      [0.00077, 3],
      [0.00206, 1],
      [0.00133, 3],
      [0.00086, 3]
    ]
  },
  "QS_mulNeuromadSite[C6]": {
    "red_x_points": [
      [-0.00467, 1],
      [-0.00235, 0],
      [-0.00044, 0],
      [0.00043, 0],
      [-0.00161, 0],
      [0.00046, 0],
      [-9e-5, 2],
      [-0.00437, 1],
      [0.00136, 2],
      [-0.00171, 0],
      [0.00042, 2],
      [-0.00216, 0],
      [0.0005, 2],
      [0.00014, 0],
      [-0.00619, 1],
      [0.00035, 2],
      [-0.00167, 0],
      [0.00023, 2],
      [-0.00104, 0],
      [-0.0027, 0],
      [-0.00478, 1],
      [8e-5, 0],
      [0.00039, 2]
    ],
    "red_o_points": [],
    "y_categories": ["N", "NOT APPLICABLE", "nan"],
    "blue_o_points": [],
    "blue_x_points": [
      [0.00132, 2],
      [0.00098, 2],
      [0.00123, 0],
      [0.00137, 0],
      [0.00056, 2],
      [0.00187, 0],
      [0.00105, 0],
      [0.00076, 0],
      [0.00173, 2],
      [0.00653, 1],
      [-0.00104, 0],
      [0.00216, 0],
      [0.00201, 2],
      [0.00092, 2],
      [0.00099, 2],
      [0.00059, 2],
      [0.00186, 2],
      [0.00127, 2],
      [0.00086, 1],
      [0.00148, 2],
      [0.00089, 2]
    ]
  },
  "QA_equInjTbpiTime": {
    "red_x_points": [
      [-0.01066, 0],
      [-0.01023, 0],
      [0.00239, 3],
      [0.00117, 3],
      [-0.00863, 0],
      [-0.00833, 0],
      [-0.00877, 0],
      [-0.00877, 0],
      [0.00205, 3],
      [-0.01069, 0],
      [-0.00931, 0],
      [-0.01033, 0],
      [-0.00011, 3],
      [0.00068, 3],
      [-0.01048, 0],
      [-0.0078, 0],
      [-0.01343, 2],
      [-0.01937, 2],
      [-0.00982, 0],
      [-0.01413, 2],
      [-0.01071, 0],
      [0.00208, 3],
      [0.01162, 1]
    ],
    "red_o_points": [],
    "y_categories": [
      "0 TO 6 MONTHS",
      "13 TO 24 MONTHS",
      "25 MONTHS OR MORE",
      "7 TO 12 MONTHS",
      "nan"
    ],
    "blue_o_points": [],
    "blue_x_points": [
      [-0.00511, 0],
      [0.02063, 1],
      [-0.00617, 0],
      [0.02162, 1],
      [0.00473, 3],
      [-0.00715, 0],
      [-0.00516, 0],
      [0.00436, 3],
      [-0.00703, 0],
      [-0.00274, 2],
      [0.02808, 1],
      [0.00654, 3],
      [0.0226, 1],
      [0.00373, 3],
      [0.01903, 1],
      [0.01899, 1],
      [0.00582, 3],
      [0.01901, 1],
      [0.00867, 3],
      [0.00576, 3],
      [-0.00462, 0]
    ]
  },
  "QA_lstPexPalle[Clavicle]": {
    "red_x_points": [
      [-0.00101, 3],
      [-0.00085, 3],
      [-0.00128, 3],
      [0.00636, 2],
      [-0.00114, 3],
      [-0.00145, 3],
      [-0.01426, 0],
      [-0.01407, 0],
      [-0.00101, 3],
      [-0.00138, 3],
      [-0.00145, 3],
      [-0.00081, 3],
      [-0.00085, 3],
      [-0.0214, 0],
      [-0.00087, 3],
      [-0.01287, 0],
      [-0.00774, 1],
      [-0.00132, 3],
      [-0.00225, 3],
      [-0.00108, 3],
      [0.00641, 2],
      [-0.01212, 0],
      [-0.00092, 3]
    ],
    "red_o_points": [],
    "y_categories": ["HYPO", "NAIA", "PT", "nan"],
    "blue_o_points": [],
    "blue_x_points": [
      [-0.00072, 3],
      [-0.00053, 3],
      [0.01286, 2],
      [0.01783, 2],
      [-0.00075, 3],
      [-0.00095, 3],
      [0.01845, 2],
      [0.01374, 2],
      [-0.00072, 3],
      [-0.00068, 3],
      [-0.00097, 3],
      [-0.0006, 3],
      [-0.0007, 3],
      [-0.00874, 0],
      [0.01163, 2],
      [0.00694, 1],
      [-0.00068, 3],
      [0.00985, 2],
      [-0.00046, 3],
      [0.01309, 2],
      [-0.00053, 3]
    ]
  },
  "QA_lstPexMuscstrength[ShoulderAbduc]": {
    "red_x_points": [
      [-0.00113, 2],
      [0.00025, 1],
      [0.00024, 1],
      [0.00077, 1],
      [0.00018, 1],
      [0.00063, 1],
      [0.0006, 1],
      [-0.01448, 0],
      [-0.00024, 2],
      [-0.00057, 2],
      [-0.00271, 2],
      [-0.00017, 2],
      [0.00043, 1],
      [0.00094, 1],
      [-0.0196, 0],
      [0.00025, 1],
      [0.00013, 1],
      [0.00034, 1],
      [0.00076, 1],
      [0.00049, 1],
      [-0.00057, 2],
      [0.00031, 1],
      [-0.00054, 2]
    ],
    "red_o_points": [],
    "y_categories": ["GREATER THAN OR EQUALS TO 3", "LESS THAN 3", "nan"],
    "blue_o_points": [],
    "blue_x_points": [
      [0.00283, 1],
      [0.00208, 1],
      [0.00213, 1],
      [0.00198, 1],
      [0.00142, 1],
      [0.00299, 1],
      [0.00176, 1],
      [0.00128, 1],
      [0.00022, 2],
      [0.00102, 2],
      [0.00114, 1],
      [0.00052, 2],
      [0.00055, 2],
      [0.0019, 1],
      [0.00208, 1],
      [-0.00062, 2],
      [0.00038, 2],
      [0.00155, 1],
      [0.00698, 1],
      [0.00056, 1],
      [0.00099, 1]
    ]
  },
  "QA_lstPexMuscstrength[ShoulderExrot]": {
    "red_x_points": [
      [-0.00047, 2],
      [-0.0003, 2],
      [-0.01491, 0],
      [-0.00067, 2],
      [0.00381, 1],
      [-0.00037, 2],
      [0.00216, 1],
      [-0.01924, 0],
      [-0.00052, 2],
      [-0.00036, 2],
      [-0.00128, 2],
      [-0.00031, 2],
      [-0.00044, 2],
      [0.00385, 1],
      [-0.02625, 0],
      [0.00253, 1],
      [-0.00011, 2],
      [1e-5, 2],
      [0.00447, 1],
      [-0.01705, 0],
      [-0.00063, 2],
      [0.00267, 1],
      [-0.0005, 2]
    ],
    "red_o_points": [],
    "y_categories": ["GREATER THAN OR EQUALS TO 3", "LESS THAN 3", "nan"],
    "blue_o_points": [],
    "blue_x_points": [
      [0.00805, 1],
      [-8e-5, 2],
      [0.00511, 1],
      [0.00565, 1],
      [0.00708, 1],
      [0.00831, 1],
      [0.00573, 1],
      [-7e-5, 2],
      [0.00031, 2],
      [0.00071, 2],
      [0.00073, 2],
      [0.00064, 2],
      [0.00071, 2],
      [0.00454, 1],
      [0.00505, 1],
      [-5e-5, 2],
      [0.00075, 2],
      [0.00066, 2],
      [0.0105, 1],
      [-0.0001, 2],
      [-0.00029, 2]
    ]
  },
  "QS_mulNeuromadSite[C4]": {
    "red_x_points": [
      [-0.00617, 1],
      [-0.00387, 0],
      [-0.00084, 0],
      [0.00091, 0],
      [-0.00276, 0],
      [0.00074, 0],
      [-3e-5, 2],
      [-0.00794, 1],
      [0.00213, 2],
      [-0.00256, 0],
      [0.00106, 2],
      [-0.00374, 0],
      [0.00061, 2],
      [-0.00015, 0],
      [-0.01014, 1],
      [6e-5, 2],
      [-0.00302, 0],
      [0.00068, 2],
      [-0.00179, 0],
      [-0.00384, 0],
      [-0.00564, 1],
      [0.00055, 0],
      [0.00028, 2]
    ],
    "red_o_points": [],
    "y_categories": ["N", "NOT APPLICABLE", "nan"],
    "blue_o_points": [],
    "blue_x_points": [
      [0.00203, 2],
      [0.0019, 2],
      [0.00122, 0],
      [0.00288, 0],
      [0.00127, 2],
      [0.00255, 0],
      [0.00175, 0],
      [0.00134, 0],
      [0.00373, 2],
      [0.00946, 1],
      [-0.00229, 0],
      [0.00341, 0],
      [0.00307, 2],
      [0.00155, 2],
      [0.00177, 2],
      [0.00091, 2],
      [0.00326, 2],
      [0.00128, 2],
      [0.00131, 1],
      [0.00183, 2],
      [0.00122, 2]
    ]
  },
  "QS_mulGraftNerve[Ra]": {
    "red_x_points": [
      [-9e-5, 0],
      [-4e-5, 0],
      [2e-5, 0],
      [-4e-5, 0],
      [1e-5, 2],
      [-0.00012, 1],
      [9e-5, 2],
      [-0.00013, 0],
      [-4e-5, 2],
      [-0.00013, 0],
      [-0.00021, 1],
      [-2e-5, 2],
      [0.0, 0],
      [-4e-5, 0],
      [-8e-5, 1],
      [5e-5, 2]
    ],
    "red_o_points": [],
    "y_categories": ["N", "NOT APPLICABLE", "nan"],
    "blue_o_points": [],
    "blue_x_points": [
      [-1e-5, 2],
      [-1e-5, 2],
      [8e-5, 0],
      [0.00013, 0],
      [8e-5, 0],
      [9e-5, 2],
      [0.00024, 1],
      [-4e-5, 0],
      [7e-5, 0],
      [3e-5, 2],
      [6e-5, 2],
      [2e-5, 2],
      [3e-5, 2]
    ]
  },
  "QS_mulTransfSite[Oberlin]": {
    "red_x_points": [
      [-0.01177, 1],
      [-0.03177, 0],
      [-0.03187, 0],
      [-0.03324, 0],
      [-0.0314, 0],
      [-0.03219, 0],
      [0.00905, 3],
      [-0.01192, 1],
      [0.00968, 3],
      [0.01247, 2],
      [0.00952, 3],
      [-0.03195, 0],
      [0.00921, 3],
      [0.01278, 2],
      [-0.01345, 1],
      [0.00916, 3],
      [-0.03078, 0],
      [0.00922, 3],
      [0.01403, 2],
      [-0.03263, 0],
      [-0.01159, 1],
      [-0.03125, 0],
      [0.01015, 3]
    ],
    "red_o_points": [],
    "y_categories": ["N", "NOT APPLICABLE", "Y", "nan"],
    "blue_o_points": [],
    "blue_x_points": [
      [0.01128, 3],
      [0.01024, 3],
      [0.01579, 2],
      [0.01612, 2],
      [0.01007, 3],
      [0.01705, 2],
      [0.01544, 2],
      [0.0161, 2],
      [0.0117, 3],
      [-0.00524, 1],
      [0.01608, 2],
      [0.01787, 2],
      [0.01101, 3],
      [0.0104, 3],
      [0.00956, 3],
      [0.01009, 3],
      [0.01142, 3],
      [0.01021, 3],
      [-0.0059, 1],
      [0.0106, 3],
      [0.01064, 3]
    ]
  },
  "QA_yonPexPain": {
    "red_x_points": [
      [-0.01044, 1],
      [-0.01228, 1],
      [-0.01027, 1],
      [-0.01069, 1],
      [-0.01129, 1],
      [-0.01007, 1],
      [-0.01006, 1],
      [-0.01024, 1],
      [-0.01167, 1],
      [-0.01211, 1],
      [0.01317, 0],
      [-0.01077, 1],
      [-0.01056, 1],
      [-0.01139, 1],
      [0.01418, 0],
      [-0.01057, 1],
      [-0.0099, 1],
      [-0.01253, 1],
      [-0.01123, 1],
      [-0.01194, 1],
      [-0.01057, 1],
      [-0.00984, 1],
      [-0.01214, 1]
    ],
    "red_o_points": [],
    "y_categories": ["N", "Y", "nan"],
    "blue_o_points": [],
    "blue_x_points": [
      [-0.00998, 1],
      [0.02093, 0],
      [0.01874, 0],
      [0.0207, 0],
      [-0.00956, 1],
      [0.02123, 0],
      [-0.01044, 1],
      [-0.00975, 1],
      [-0.01102, 1],
      [0.02904, 2],
      [0.0245, 0],
      [-0.01137, 1],
      [0.02122, 0],
      [0.01945, 0],
      [0.01814, 0],
      [0.01878, 0],
      [0.02881, 2],
      [0.0195, 0],
      [-0.0098, 1],
      [-0.01118, 1],
      [0.02527, 2]
    ]
  },
  "QS_mulGraftNerve[FI]": {
    "red_x_points": [
      [-0.00066, 1],
      [-0.00084, 0],
      [-0.0, 0],
      [6e-5, 0],
      [-0.00059, 0],
      [0.00011, 0],
      [-0.00013, 2],
      [-0.00065, 1],
      [0.00039, 2],
      [-0.00071, 0],
      [0.00013, 2],
      [-0.00054, 0],
      [-6e-5, 2],
      [-0.00013, 0],
      [-0.00166, 1],
      [-3e-5, 2],
      [-0.00045, 0],
      [0.00011, 2],
      [-2e-5, 0],
      [-0.00083, 0],
      [-0.00104, 1],
      [3e-5, 0],
      [9e-5, 2]
    ],
    "red_o_points": [],
    "y_categories": ["N", "NOT APPLICABLE", "nan"],
    "blue_o_points": [],
    "blue_x_points": [
      [0.00023, 2],
      [0.00023, 2],
      [0.00032, 0],
      [0.0002, 0],
      [0.00015, 2],
      [0.00031, 0],
      [0.00035, 0],
      [5e-5, 0],
      [0.0009, 2],
      [0.00181, 1],
      [-0.00041, 0],
      [0.00046, 0],
      [0.00064, 2],
      [0.00033, 2],
      [0.00039, 2],
      [0.00018, 2],
      [0.00069, 2],
      [0.00013, 2],
      [0.00012, 1],
      [0.00019, 2],
      [0.00016, 2]
    ]
  },
  "QA_lstPexPalle[Ulna]": {
    "red_x_points": [
      [-0.00117, 4],
      [-0.00124, 4],
      [-0.00116, 4],
      [-0.02679, 2],
      [-0.00106, 4],
      [-0.0007, 4],
      [-0.0107, 1],
      [0.00532, 3],
      [-0.00127, 4],
      [-0.00126, 4],
      [-0.00138, 4],
      [-0.00101, 4],
      [-0.00118, 4],
      [0.00579, 3],
      [-0.00089, 4],
      [-0.02241, 0],
      [-0.01701, 0],
      [-0.00155, 4],
      [-0.0015, 4],
      [-0.00137, 4],
      [0.00595, 3],
      [-0.01664, 0],
      [-0.00134, 4]
    ],
    "red_o_points": [],
    "y_categories": ["ABS", "HYPO", "NAIA", "PT", "nan"],
    "blue_o_points": [],
    "blue_x_points": [
      [-0.00087, 4],
      [-0.00077, 4],
      [0.00898, 3],
      [0.01193, 1],
      [-0.00063, 4],
      [-0.00021, 4],
      [0.01002, 3],
      [0.0112, 3],
      [-0.00124, 4],
      [-0.00081, 4],
      [-0.00099, 4],
      [-0.00038, 4],
      [-0.00112, 4],
      [0.01247, 3],
      [0.01196, 3],
      [0.01259, 3],
      [-0.00096, 4],
      [0.01074, 3],
      [-0.00059, 4],
      [0.01441, 3],
      [-0.00112, 4]
    ]
  }
}
