{
  "QA_lstPexMuscstrength[ElbowFlex]": {
    "red_x_points": [
      [-0.00376, 1],
      [-0.00246, 2],
      [-0.00438, 1],
      [-0.00365, 1],
      [-0.00286, 1],
      [0.00971, 0],
      [-0.0045, 1],
      [-0.00439, 1],
      [-0.00323, 1],
      [-0.0054, 1],
      [-0.00451, 1],
      [-0.00647, 1],
      [-0.00393, 1],
      [-0.00283, 2],
      [-0.00421, 2],
      [-0.00436, 2],
      [-0.00335, 1],
      [-0.00294, 2],
      [-0.00483, 2],
      [-0.00402, 1],
      [-0.003, 1],
      [-0.00295, 1],
      [-0.00317, 1],
      [-0.00381, 2],
      [0.00298, 0],
      [-0.00283, 1],
      [-0.00539, 1],
      [-0.00311, 1],
      [-0.00261, 2],
      [-0.00311, 1],
      [-0.00366, 1],
      [-0.0043, 2]
    ],
    "red_o_points": [],
    "y_categories": ["GREATER THAN OR EQUALS TO 3", "LESS THAN 3", "nan"],
    "blue_o_points": [],
    "blue_x_points": [
      [-0.00059, 2],
      [-0.00056, 2],
      [0.01043, 0],
      [0.00019, 1],
      [0.02643, 0],
      [0.01158, 0],
      [-0.00082, 1],
      [0.01136, 0],
      [0.0004, 1],
      [-0.0004, 1]
    ]
  },
  "participant_code": {
    "red_x_points": [
      [-0.04029, 1],
      [-0.04229, 2],
      [-0.04211, 3],
      [-0.04064, 4],
      [-0.04193, 5],
      [-0.04246, 6],
      [-0.04146, 7],
      [-0.04158, 8],
      [-0.04017, 9],
      [-0.04099, 10],
      [-0.04176, 11],
      [-0.04264, 12],
      [-0.04158, 13],
      [-0.04034, 15],
      [-0.04152, 17],
      [-0.04129, 18],
      [-0.04187, 20],
      [-0.04099, 21],
      [-0.04058, 22],
      [-0.0407, 24],
      [-0.04117, 26],
      [-0.04034, 27],
      [-0.0417, 28],
      [-0.04176, 30],
      [-0.04087, 31],
      [-0.04064, 32],
      [-0.04176, 34],
      [-0.04105, 36],
      [-0.03999, 38],
      [-0.03935, 39],
      [-0.03935, 40],
      [-0.04034, 41]
    ],
    "red_o_points": [],
    "y_categories": [
      "P16554",
      "P18297",
      "P19283",
      "P19287",
      "P23391",
      "P30595",
      "P31645",
      "P31691",
      "P34778",
      "P35046",
      "P36328",
      "P43633",
      "P4544",
      "P46417",
      "P48965",
      "P53068",
      "P5497",
      "P59529",
      "P62483",
      "P64658",
      "P65202",
      "P66816",
      "P6751",
      "P7408",
      "P75566",
      "P76226",
      "P79971",
      "P82621",
      "P82990",
      "P84549",
      "P84932",
      "P85825",
      "P86989",
      "P8770",
      "P87791",
      "P90550",
      "P93159",
      "P94969",
      "P96710",
      "P97130",
      "P9744",
      "P98500",
      "nan"
    ],
    "blue_o_points": [],
    "blue_x_points": [
      [0.08554, 0],
      [0.08892, 14],
      [0.08215, 16],
      [0.08497, 19],
      [0.08822, 23],
      [0.08314, 25],
      [0.08568, 29],
      [0.08384, 33],
      [0.08328, 35],
      [0.08709, 37]
    ]
  },
  "QS_mulLysisTrunk[Upper]": {
    "red_x_points": [
      [-0.00067, 3],
      [-0.00429, 0],
      [-0.00413, 0],
      [-0.00435, 0],
      [-0.00095, 3],
      [-0.00517, 0],
      [-0.00944, 2],
      [-0.00461, 0],
      [-0.00142, 3],
      [-0.0049, 0],
      [-0.00522, 0],
      [-0.00367, 0],
      [-0.00081, 3],
      [0.00825, 1],
      [-0.00145, 3],
      [-0.00512, 0],
      [-0.00077, 3],
      [-0.00835, 2],
      [-0.00108, 3],
      [-0.00121, 3],
      [-0.00062, 3],
      [-0.00078, 3],
      [-0.00428, 0],
      [-0.00131, 3],
      [-0.00211, 3],
      [-0.00068, 3],
      [-0.00437, 0],
      [-0.00389, 0],
      [0.00859, 1],
      [-0.00087, 3],
      [-0.00843, 2],
      [-0.00095, 3]
    ],
    "red_o_points": [],
    "y_categories": ["N", "NOT APPLICABLE", "Y", "nan"],
    "blue_o_points": [],
    "blue_x_points": [
      [0.01471, 1],
      [3e-5, 3],
      [0.01075, 1],
      [0.00135, 0],
      [-0.00085, 0],
      [0.01216, 1],
      [-0.00045, 3],
      [0.01145, 1],
      [-0.00048, 3],
      [0.00022, 3]
    ]
  },
  "QS_mulTransfSite[Oberlin]": {
    "red_x_points": [
      [-0.00324, 3],
      [-0.02477, 0],
      [-0.02542, 0],
      [-0.02464, 0],
      [-0.00364, 3],
      [-0.00419, 2],
      [-0.00394, 2],
      [-0.02532, 0],
      [-0.00387, 3],
      [-0.00551, 2],
      [-0.00526, 2],
      [-0.00403, 2],
      [-0.00328, 3],
      [0.02696, 1],
      [-0.00379, 3],
      [-0.0049, 2],
      [-0.00328, 3],
      [-0.02459, 0],
      [-0.0044, 3],
      [-0.00358, 3],
      [-0.00308, 3],
      [-0.00318, 3],
      [-0.02315, 0],
      [-0.00373, 3],
      [-0.00587, 3],
      [-0.00351, 3],
      [-0.00404, 2],
      [-0.02322, 0],
      [0.03085, 1],
      [-0.00323, 3],
      [-0.02599, 0],
      [-0.00354, 3]
    ],
    "red_o_points": [],
    "y_categories": ["N", "NOT APPLICABLE", "Y", "nan"],
    "blue_o_points": [],
    "blue_x_points": [
      [0.03931, 1],
      [-0.00105, 3],
      [0.03097, 1],
      [0.00456, 2],
      [0.00186, 2],
      [0.0312, 1],
      [-0.00193, 3],
      [0.0342, 1],
      [-0.00154, 3],
      [-0.00095, 3]
    ]
  },
  "QS_mulNeuromadSite[C7]": {
    "red_x_points": [
      [2e-5, 2],
      [-0.00044, 0],
      [-0.00018, 0],
      [-0.00032, 0],
      [1e-5, 2],
      [-0.00034, 0],
      [-0.00026, 0],
      [-0.00025, 0],
      [-1e-5, 2],
      [-0.00026, 0],
      [-0.00025, 0],
      [-0.00026, 0],
      [0.0, 2],
      [0.00024, 1],
      [-6e-5, 2],
      [-0.00035, 0],
      [-1e-5, 2],
      [-0.00028, 0],
      [-0.00026, 2],
      [-2e-5, 2],
      [-1e-5, 2],
      [-0.0, 2],
      [-0.00025, 0],
      [-6e-5, 2],
      [-0.00018, 2],
      [1e-5, 2],
      [-0.00018, 0],
      [-0.00023, 0],
      [0.00032, 1],
      [0.0, 2],
      [-0.0002, 0],
      [-6e-5, 2]
    ],
    "red_o_points": [],
    "y_categories": ["N", "NOT APPLICABLE", "nan"],
    "blue_o_points": [],
    "blue_x_points": [
      [0.00129, 1],
      [8e-5, 2],
      [0.00037, 1],
      [0.00025, 0],
      [-9e-5, 0],
      [0.00041, 1],
      [4e-5, 2],
      [0.00034, 1],
      [3e-5, 2],
      [0.0, 2]
    ]
  },
  "QS_mulTransfSite[IMc]": {
    "red_x_points": [
      [-0.00132, 3],
      [-0.01041, 2],
      [-0.00373, 0],
      [-0.00499, 0],
      [-0.00154, 3],
      [-0.00488, 0],
      [-0.00409, 0],
      [-0.00448, 0],
      [-0.00181, 3],
      [-0.0048, 0],
      [-0.00426, 0],
      [-0.0039, 0],
      [-0.00134, 3],
      [0.00996, 1],
      [-0.00166, 3],
      [-0.00495, 0],
      [-0.00129, 3],
      [-0.01001, 2],
      [-0.00146, 3],
      [-0.00128, 3],
      [-0.00108, 3],
      [-0.00145, 3],
      [-0.00409, 0],
      [-0.00192, 3],
      [-0.0021, 3],
      [-0.00112, 3],
      [-0.00435, 0],
      [-0.00956, 2],
      [0.0102, 1],
      [-0.00132, 3],
      [-0.01037, 2],
      [-0.00136, 3]
    ],
    "red_o_points": [],
    "y_categories": ["N", "NOT APPLICABLE", "Y", "nan"],
    "blue_o_points": [],
    "blue_x_points": [
      [0.01705, 1],
      [-0.00046, 3],
      [0.01246, 1],
      [7e-5, 0],
      [-0.00176, 0],
      [0.01391, 1],
      [-0.00057, 3],
      [0.01474, 1],
      [-0.00066, 3],
      [-0.00011, 3]
    ]
  },
  "QA_mulInjOrthesisType[ShoulderSupport]": {
    "red_x_points": [
      [-0.00868, 0],
      [-0.00753, 0],
      [-0.0081, 0],
      [-0.008, 0],
      [-0.00741, 0],
      [-0.00836, 0],
      [-0.00758, 0],
      [-0.00787, 0],
      [-0.02094, 2],
      [-0.00881, 0],
      [-0.00798, 0],
      [-0.00838, 0],
      [-0.00762, 0],
      [0.01693, 1],
      [-0.00822, 0],
      [-0.00836, 0],
      [-0.00859, 0],
      [-0.01532, 2],
      [0.01319, 1],
      [-0.00774, 0],
      [-0.00857, 0],
      [-0.02268, 2],
      [-0.00395, 3],
      [-0.00826, 0],
      [0.01661, 1],
      [-0.00777, 0],
      [-0.0082, 0],
      [-0.00684, 0],
      [-0.01353, 3],
      [0.00094, 3],
      [-0.00731, 0],
      [-0.00769, 0]
    ],
    "red_o_points": [],
    "y_categories": ["N", "NOT APPLICABLE", "Y", "nan"],
    "blue_o_points": [],
    "blue_x_points": [
      [0.00186, 0],
      [0.02525, 1],
      [0.01969, 1],
      [0.04141, 1],
      [-0.00526, 0],
      [0.02061, 1],
      [-0.00376, 0],
      [0.0201, 1],
      [-0.00409, 0],
      [0.01604, 3]
    ]
  },
  "QA_mulInjOrthesisType[ArmSling]": {
    "red_x_points": [
      [-0.00911, 2],
      [-0.00791, 2],
      [-0.0093, 2],
      [-0.00881, 2],
      [-0.00786, 2],
      [-0.00954, 2],
      [-0.00885, 2],
      [-0.00925, 2],
      [-0.00895, 2],
      [-0.00968, 2],
      [-0.00921, 2],
      [-0.00905, 2],
      [-0.00927, 2],
      [0.01749, 1],
      [-0.00999, 2],
      [-0.01017, 2],
      [-0.01002, 2],
      [-0.01427, 0],
      [0.01647, 1],
      [-0.00797, 2],
      [-0.0089, 2],
      [-0.02121, 0],
      [-0.00442, 3],
      [-0.00961, 2],
      [0.01397, 1],
      [-0.00913, 2],
      [-0.00911, 2],
      [-0.00775, 2],
      [-0.02313, 3],
      [-0.00028, 3],
      [-0.00829, 2],
      [-0.00902, 2]
    ],
    "red_o_points": [],
    "y_categories": ["N", "NOT APPLICABLE", "Y", "nan"],
    "blue_o_points": [],
    "blue_x_points": [
      [0.00512, 2],
      [0.02777, 1],
      [0.01858, 1],
      [0.04852, 1],
      [-0.00594, 2],
      [0.0213, 1],
      [-0.00521, 2],
      [0.01933, 1],
      [-0.00533, 2],
      [0.01549, 3]
    ]
  },
  "QA_lstPexPain[C5]": {
    "red_x_points": [
      [-0.00406, 1],
      [-0.00616, 2],
      [-0.00699, 2],
      [-0.00659, 2],
      [-0.00438, 1],
      [-0.00144, 1],
      [-0.00126, 1],
      [-0.00226, 1],
      [-0.00392, 1],
      [-0.00212, 1],
      [-0.00242, 1],
      [-0.00113, 1],
      [-0.00406, 1],
      [-0.02744, 2],
      [-0.01013, 2],
      [-0.00703, 2],
      [-0.01014, 2],
      [-0.00549, 2],
      [-0.00935, 2],
      [-0.00306, 1],
      [-0.00375, 1],
      [-0.00323, 1],
      [-0.00815, 2],
      [-0.01042, 2],
      [-0.00329, 1],
      [-0.01186, 2],
      [-0.00584, 2],
      [-0.00617, 2],
      [-0.00849, 1],
      [-0.00837, 1],
      [-0.00119, 1],
      [-0.0043, 1]
    ],
    "red_o_points": [],
    "y_categories": ["NORM", "NPV", "nan"],
    "blue_o_points": [],
    "blue_x_points": [
      [0.03414, 0],
      [-0.00481, 2],
      [0.00056, 1],
      [-0.00056, 1],
      [-0.00072, 1],
      [0.00012, 1],
      [-0.00161, 1],
      [0.03131, 0],
      [-0.00158, 1],
      [0.06768, 0]
    ]
  },
  "QS_mulNeuromadSite[C8]": {
    "red_x_points": [
      [-0.00023, 2],
      [-0.00226, 0],
      [-0.00278, 0],
      [-0.0028, 0],
      [-0.0003, 2],
      [-0.00321, 0],
      [-0.00196, 0],
      [-0.00285, 0],
      [-0.00064, 2],
      [-0.00338, 0],
      [-0.00318, 0],
      [-0.00263, 0],
      [-0.00052, 2],
      [0.0018, 1],
      [-0.00059, 2],
      [-0.00315, 0],
      [-0.00047, 2],
      [-0.00271, 0],
      [-0.00079, 2],
      [-0.00052, 2],
      [-0.00018, 2],
      [-0.00042, 2],
      [-0.00185, 0],
      [-0.00054, 2],
      [-0.00171, 2],
      [-0.00034, 2],
      [-0.00242, 0],
      [-0.00186, 0],
      [0.00413, 1],
      [-0.00043, 2],
      [-0.00202, 0],
      [-0.00073, 2]
    ],
    "red_o_points": [],
    "y_categories": ["N", "NOT APPLICABLE", "nan"],
    "blue_o_points": [],
    "blue_x_points": [
      [0.00844, 1],
      [-5e-5, 2],
      [0.00571, 1],
      [0.00155, 0],
      [-0.00064, 0],
      [0.00692, 1],
      [2e-5, 2],
      [0.00536, 1],
      [-2e-5, 2],
      [0.00018, 2]
    ]
  },
  "QS_mulTransfSite[Other]": {
    "red_x_points": [
      [-0.00263, 3],
      [-0.01749, 0],
      [-0.01821, 0],
      [-0.01753, 0],
      [-0.00278, 3],
      [-0.01983, 0],
      [-0.01664, 0],
      [-0.01789, 0],
      [-0.00318, 3],
      [-0.01759, 0],
      [-0.01892, 0],
      [-0.01762, 0],
      [-0.00286, 3],
      [0.02537, 1],
      [-0.00292, 3],
      [-0.0177, 0],
      [-0.00287, 3],
      [-0.01641, 0],
      [-0.00399, 3],
      [-0.00292, 3],
      [-0.00292, 3],
      [-0.00274, 3],
      [-0.01772, 0],
      [-0.00278, 3],
      [-0.0045, 3],
      [-0.00278, 3],
      [-0.01783, 0],
      [-0.01795, 0],
      [0.02583, 1],
      [-0.00245, 3],
      [-0.01788, 0],
      [-0.00279, 3]
    ],
    "red_o_points": [],
    "y_categories": ["N", "NOT APPLICABLE", "Y", "nan"],
    "blue_o_points": [],
    "blue_x_points": [
      [0.03132, 1],
      [-0.00097, 3],
      [0.02564, 1],
      [-0.00693, 0],
      [0.05874, 2],
      [0.02498, 1],
      [-0.00096, 3],
      [0.02726, 1],
      [-0.00112, 3],
      [-0.00045, 3]
    ]
  },
  "QA_yonInjBpsurg": {
    "red_x_points": [
      [-0.00216, 1],
      [-0.00175, 1],
      [-0.00208, 1],
      [-0.00171, 1],
      [-0.0021, 1],
      [-0.00216, 1],
      [-0.0017, 1],
      [-0.00213, 1],
      [-0.00257, 1],
      [-0.00212, 1],
      [-0.0023, 1],
      [-0.00212, 1],
      [-0.00215, 1],
      [0.00303, 0],
      [-0.0025, 1],
      [-0.00224, 1],
      [-0.00262, 1],
      [-0.00145, 1],
      [-0.00168, 1],
      [-0.0021, 1],
      [-0.00189, 1],
      [-0.0018, 1],
      [-0.00104, 1],
      [-0.00223, 1],
      [-0.00305, 1],
      [-0.00248, 1],
      [-0.00187, 1],
      [-0.00161, 1],
      [0.00347, 0],
      [-0.00172, 1],
      [-0.00164, 1],
      [-0.00227, 1]
    ],
    "red_o_points": [],
    "y_categories": ["N", "Y", "nan"],
    "blue_o_points": [],
    "blue_x_points": [
      [0.01133, 0],
      [0.00041, 1],
      [0.00744, 0],
      [-0.00119, 1],
      [-0.00218, 1],
      [0.00783, 0],
      [-0.00118, 1],
      [0.00932, 0],
      [-0.00084, 1],
      [-0.0001, 1]
    ]
  },
  "QS_mulBpsurgeryType[Lysis]": {
    "red_x_points": [
      [-0.00159, 3],
      [-0.00659, 0],
      [-0.01689, 2],
      [-0.00732, 0],
      [-0.00203, 3],
      [-0.00744, 0],
      [-0.01577, 2],
      [-0.00708, 0],
      [-0.00259, 3],
      [-0.00786, 0],
      [-0.00858, 0],
      [-0.00556, 0],
      [-0.00181, 3],
      [0.01372, 1],
      [-0.00234, 3],
      [-0.0081, 0],
      [-0.00208, 3],
      [-0.01395, 2],
      [-0.00308, 3],
      [-0.00214, 3],
      [-0.00174, 3],
      [-0.00173, 3],
      [-0.00709, 0],
      [-0.00226, 3],
      [-0.00352, 3],
      [-0.0017, 3],
      [-0.00673, 0],
      [-0.00637, 0],
      [0.01652, 1],
      [-0.00184, 3],
      [-0.01508, 2],
      [-0.00202, 3]
    ],
    "red_o_points": [],
    "y_categories": ["N", "NOT APPLICABLE", "Y", "nan"],
    "blue_o_points": [],
    "blue_x_points": [
      [0.02443, 1],
      [-0.00025, 3],
      [0.01923, 1],
      [0.00284, 0],
      [-0.00074, 0],
      [0.02093, 1],
      [-0.00078, 3],
      [0.02173, 1],
      [-0.00129, 3],
      [-0.00021, 3]
    ]
  },
  "QS_mulTransfSite[AcSsAA]": {
    "red_x_points": [
      [-0.00241, 3],
      [-0.01747, 2],
      [-0.00426, 0],
      [-0.01814, 2],
      [-0.0024, 3],
      [-0.02603, 2],
      [-0.00364, 0],
      [-0.00428, 0],
      [-0.00229, 3],
      [-0.00439, 0],
      [-0.019, 2],
      [-0.00405, 0],
      [-0.00234, 3],
      [0.01982, 1],
      [-0.00273, 3],
      [-0.01953, 2],
      [-0.00263, 3],
      [-0.00346, 0],
      [-0.00439, 3],
      [-0.00259, 3],
      [-0.00203, 3],
      [-0.00246, 3],
      [-0.01629, 2],
      [-0.0029, 3],
      [-0.00419, 3],
      [-0.00266, 3],
      [-0.00359, 0],
      [-0.01627, 2],
      [0.02084, 1],
      [-0.00243, 3],
      [-0.00362, 0],
      [-0.00276, 3]
    ],
    "red_o_points": [],
    "y_categories": ["N", "NOT APPLICABLE", "Y", "nan"],
    "blue_o_points": [],
    "blue_x_points": [
      [0.02983, 1],
      [-0.00135, 3],
      [0.02319, 1],
      [0.00421, 0],
      [0.00307, 0],
      [0.02285, 1],
      [-0.00104, 3],
      [0.02354, 1],
      [-0.00108, 3],
      [-0.00077, 3]
    ]
  },
  "QA_lstPexTouch[T1]": {
    "red_x_points": [
      [-0.01332, 1],
      [-0.00221, 2],
      [0.00068, 1],
      [-0.00294, 2],
      [-0.01347, 1],
      [-0.01072, 0],
      [0.0018, 1],
      [0.00207, 1],
      [-0.01388, 1],
      [-0.00508, 0],
      [-0.00451, 0],
      [-0.01019, 0],
      [0.0107, 0],
      [-0.01354, 2],
      [-0.00709, 2],
      [-0.00614, 2],
      [-0.01415, 1],
      [-0.00153, 2],
      [-0.00881, 2],
      [0.01005, 0],
      [-0.01333, 1],
      [0.01143, 0],
      [-0.00545, 2],
      [-0.00728, 2],
      [-0.01355, 1],
      [0.01224, 0],
      [0.0041, 1],
      [-0.00236, 2],
      [-0.00514, 1],
      [-0.00897, 2],
      [0.00013, 1],
      [-0.01489, 1]
    ],
    "red_o_points": [],
    "y_categories": ["NORM", "NPV", "nan"],
    "blue_o_points": [],
    "blue_x_points": [
      [0.00039, 1],
      [3e-5, 2],
      [0.00121, 1],
      [0.00906, 1],
      [0.01315, 1],
      [0.00087, 1],
      [0.01691, 0],
      [0.00797, 0],
      [0.01557, 0],
      [0.02205, 0]
    ]
  },
  "QS_mulLysisRoot[C5]": {
    "red_x_points": [
      [-0.00047, 3],
      [-0.00197, 0],
      [-0.00666, 2],
      [-0.00174, 0],
      [-0.00034, 3],
      [-0.0019, 0],
      [-0.0016, 0],
      [-0.00145, 0],
      [-0.001, 3],
      [-0.00157, 0],
      [-0.00202, 0],
      [-0.00083, 0],
      [-0.00034, 3],
      [0.00341, 1],
      [-0.00077, 3],
      [-0.00202, 0],
      [-0.00037, 3],
      [-0.00131, 0],
      [-0.00057, 3],
      [-0.0011, 3],
      [-0.00035, 3],
      [-0.00048, 3],
      [-0.00138, 0],
      [-0.00108, 3],
      [-0.00062, 3],
      [-0.00045, 3],
      [-0.00158, 0],
      [-0.00124, 0],
      [0.00354, 1],
      [-0.00045, 3],
      [-0.00583, 2],
      [-0.00044, 3]
    ],
    "red_o_points": [],
    "y_categories": ["N", "NOT APPLICABLE", "Y", "nan"],
    "blue_o_points": [],
    "blue_x_points": [
      [0.00581, 1],
      [4e-5, 3],
      [0.00447, 1],
      [0.00139, 0],
      [0.00042, 0],
      [0.0039, 1],
      [-0.00017, 3],
      [0.00551, 1],
      [-0.00033, 3],
      [-0.00023, 3]
    ]
  },
  "QS_mulNeuromadSite[C6]": {
    "red_x_points": [
      [-3e-5, 2],
      [-0.00031, 0],
      [-0.00037, 0],
      [-0.00044, 0],
      [-0.0001, 2],
      [-0.00036, 0],
      [-0.00043, 0],
      [-0.00046, 0],
      [-6e-5, 2],
      [-0.00048, 0],
      [-0.00038, 0],
      [-0.00043, 0],
      [-3e-5, 2],
      [0.00048, 1],
      [-7e-5, 2],
      [-0.00042, 0],
      [-4e-5, 2],
      [-0.00038, 0],
      [-9e-5, 2],
      [-5e-5, 2],
      [-1e-5, 2],
      [-1e-5, 2],
      [-0.00044, 0],
      [-7e-5, 2],
      [-7e-5, 2],
      [-0.00012, 2],
      [-0.00036, 0],
      [-0.00037, 0],
      [0.0006, 1],
      [-4e-5, 2],
      [-0.00044, 0],
      [-4e-5, 2]
    ],
    "red_o_points": [],
    "y_categories": ["N", "NOT APPLICABLE", "nan"],
    "blue_o_points": [],
    "blue_x_points": [
      [0.00103, 1],
      [1e-5, 2],
      [0.00068, 1],
      [-0.0001, 0],
      [-0.0001, 0],
      [0.00092, 1],
      [-2e-5, 2],
      [0.00062, 1],
      [-3e-5, 2],
      [3e-5, 2]
    ]
  },
  "QS_lstBpsurgSide": {
    "red_x_points": [
      [-0.00112, 3],
      [-0.00868, 0],
      [-0.00953, 0],
      [-0.00911, 0],
      [-0.00152, 3],
      [-0.0079, 2],
      [-0.00952, 0],
      [-0.0094, 0],
      [-0.00187, 3],
      [-0.00979, 0],
      [-0.00664, 2],
      [-0.00731, 2],
      [-0.00156, 3],
      [0.01269, 1],
      [-0.00185, 3],
      [-0.00914, 2],
      [-0.00191, 3],
      [-0.00822, 2],
      [-0.00283, 3],
      [-0.00153, 3],
      [-0.00126, 3],
      [-0.00137, 3],
      [-0.00822, 0],
      [-0.00178, 3],
      [-0.00217, 3],
      [-0.00135, 3],
      [-0.00739, 2],
      [-0.00621, 2],
      [0.01334, 1],
      [-0.00112, 3],
      [-0.00873, 0],
      [-0.00167, 3]
    ],
    "red_o_points": [],
    "y_categories": ["L", "NOT APPLICABLE", "R", "nan"],
    "blue_o_points": [],
    "blue_x_points": [
      [0.02333, 1],
      [-0.00052, 3],
      [0.01616, 1],
      [0.00375, 0],
      [0.00031, 2],
      [0.01509, 1],
      [-0.0004, 3],
      [0.01642, 1],
      [-0.00052, 3],
      [0.00018, 3]
    ]
  },
  "QS_mulNeuromadSite[T1]": {
    "red_x_points": [
      [-5e-5, 2],
      [-0.00028, 0],
      [-0.00032, 0],
      [-0.00044, 0],
      [-3e-5, 2],
      [-0.00041, 0],
      [-0.00025, 0],
      [-0.00036, 0],
      [-4e-5, 2],
      [-0.00042, 0],
      [-0.00024, 0],
      [-0.00037, 0],
      [-5e-5, 2],
      [0.00014, 1],
      [-5e-5, 2],
      [-0.00054, 0],
      [-0.0, 2],
      [-0.00038, 0],
      [-0.00028, 2],
      [-6e-5, 2],
      [-3e-5, 2],
      [-2e-5, 2],
      [-0.00022, 0],
      [-7e-5, 2],
      [-5e-5, 2],
      [-9e-5, 2],
      [-0.00039, 0],
      [-0.00029, 0],
      [0.00077, 1],
      [-7e-5, 2],
      [-0.00025, 0],
      [-0.00011, 2]
    ],
    "red_o_points": [],
    "y_categories": ["N", "NOT APPLICABLE", "nan"],
    "blue_o_points": [],
    "blue_x_points": [
      [0.00108, 1],
      [4e-5, 2],
      [0.00044, 1],
      [0.0003, 0],
      [-0.00016, 0],
      [0.00065, 1],
      [0.0, 2],
      [0.00109, 1],
      [-1e-5, 2],
      [-7e-5, 2]
    ]
  },
  "QA_yonInjUnconscio": {
    "red_x_points": [
      [-0.0088, 1],
      [-0.00904, 1],
      [-0.00639, 2],
      [-0.00484, 2],
      [-0.00917, 2],
      [0.02644, 0],
      [-0.01233, 1],
      [-0.00687, 2],
      [-0.00824, 2],
      [-0.00811, 2],
      [-0.00704, 2],
      [-0.01484, 1],
      [-0.0092, 1],
      [-0.02819, 1],
      [-0.01068, 2],
      [-0.00706, 2],
      [-0.00863, 2],
      [-0.00951, 1],
      [0.00887, 0],
      [-0.01024, 1],
      [-0.00758, 1],
      [-0.00886, 1],
      [-0.00857, 1],
      [-0.01058, 2],
      [-0.0095, 1],
      [-0.00802, 2],
      [-0.01272, 1],
      [-0.00954, 1],
      [-0.00288, 2],
      [-0.00799, 2],
      [-0.0109, 1],
      [-0.01004, 2]
    ],
    "red_o_points": [],
    "y_categories": ["N", "Y", "nan"],
    "blue_o_points": [],
    "blue_x_points": [
      [-0.00016, 2],
      [0.00715, 1],
      [0.02231, 0],
      [0.04023, 0],
      [0.03852, 0],
      [0.00146, 2],
      [-0.00078, 1],
      [0.00088, 2],
      [0.04625, 0],
      [-0.00312, 2]
    ]
  },
  "QA_lstPexMuscstrength[ThumbOppo]": {
    "red_x_points": [
      [-0.00876, 1],
      [0.00079, 2],
      [-0.00744, 1],
      [-0.00468, 1],
      [-0.01015, 1],
      [0.00159, 0],
      [0.00159, 0],
      [-0.00715, 1],
      [0.00123, 0],
      [0.00151, 0],
      [0.00196, 0],
      [0.00208, 0],
      [0.00146, 0],
      [0.00068, 2],
      [0.0017, 2],
      [0.00066, 2],
      [0.00113, 0],
      [0.00056, 2],
      [0.00132, 2],
      [0.00131, 0],
      [-0.00983, 1],
      [0.00121, 0],
      [-0.00496, 1],
      [0.0017, 2],
      [0.00154, 2],
      [0.00167, 2],
      [0.00167, 0],
      [-0.00507, 1],
      [0.00104, 2],
      [-0.00876, 1],
      [-0.00728, 1],
      [0.00159, 2]
    ],
    "red_o_points": [],
    "y_categories": ["GREATER THAN OR EQUALS TO 3", "LESS THAN 3", "nan"],
    "blue_o_points": [],
    "blue_x_points": [
      [0.00056, 2],
      [0.00209, 2],
      [0.00145, 0],
      [0.00405, 2],
      [0.00323, 0],
      [0.00172, 0],
      [0.00384, 0],
      [0.00177, 0],
      [0.00386, 2],
      [0.00293, 2]
    ]
  },
  "QA_lstPexMuscstrength[ShoulderAbduc]": {
    "red_x_points": [
      [-0.00465, 1],
      [-0.00367, 1],
      [-0.00382, 1],
      [-0.00428, 1],
      [-0.0043, 1],
      [-0.00441, 1],
      [-0.00422, 1],
      [-0.00413, 1],
      [-0.00417, 1],
      [-0.00425, 1],
      [-0.00405, 1],
      [-0.00415, 1],
      [-0.00428, 1],
      [0.00145, 2],
      [0.00181, 2],
      [0.00158, 2],
      [0.00194, 2],
      [0.0016, 2],
      [0.00125, 2],
      [-0.00409, 1],
      [-0.00395, 1],
      [-0.00413, 1],
      [-0.00364, 1],
      [0.00151, 2],
      [-0.00635, 1],
      [-0.00365, 1],
      [-0.00387, 1],
      [-0.00351, 1],
      [0.0019, 2],
      [-0.00448, 1],
      [-0.00421, 1],
      [0.00211, 2]
    ],
    "red_o_points": [],
    "y_categories": ["GREATER THAN OR EQUALS TO 3", "LESS THAN 3", "nan"],
    "blue_o_points": [],
    "blue_x_points": [
      [0.00179, 2],
      [0.00207, 2],
      [0.02273, 0],
      [0.00283, 2],
      [-0.00301, 1],
      [0.0229, 0],
      [0.00258, 2],
      [-0.00176, 1],
      [-0.00221, 1],
      [-0.00256, 1]
    ]
  },
  "QS_mulNeuromadSite[T2]": {
    "red_x_points": [
      [-7e-5, 2],
      [-0.00147, 0],
      [-0.00154, 0],
      [-0.00158, 0],
      [-0.00012, 2],
      [-0.00156, 0],
      [-0.00128, 0],
      [-0.00159, 0],
      [-0.0002, 2],
      [-0.00171, 0],
      [-0.00196, 0],
      [-0.0015, 0],
      [-0.00011, 2],
      [0.00107, 1],
      [-0.00015, 2],
      [-0.00165, 0],
      [-0.00021, 2],
      [-0.00129, 0],
      [-0.00011, 2],
      [-0.00021, 2],
      [-3e-5, 2],
      [-0.00012, 2],
      [-0.00123, 0],
      [-0.00025, 2],
      [-0.00031, 2],
      [-9e-5, 2],
      [-0.00142, 0],
      [-0.0011, 0],
      [0.00147, 1],
      [-0.00016, 2],
      [-0.00104, 0],
      [-0.00014, 2]
    ],
    "red_o_points": [],
    "y_categories": ["N", "NOT APPLICABLE", "nan"],
    "blue_o_points": [],
    "blue_x_points": [
      [0.00379, 1],
      [5e-5, 2],
      [0.00294, 1],
      [0.00026, 0],
      [-0.00049, 0],
      [0.00322, 1],
      [-8e-5, 2],
      [0.00354, 1],
      [5e-5, 2],
      [0.00017, 2]
    ]
  },
  "QA_equInjTbpiTime": {
    "red_x_points": [
      [-0.00205, 0],
      [-0.00257, 0],
      [0.00707, 3],
      [-0.00404, 0],
      [-0.00431, 1],
      [-0.01186, 0],
      [-0.00879, 1],
      [-0.006, 0],
      [0.00231, 3],
      [-0.00835, 0],
      [-0.00818, 0],
      [0.015, 3],
      [-0.00361, 0],
      [-0.05465, 2],
      [0.0012, 3],
      [-0.00655, 0],
      [-0.00215, 0],
      [-0.00229, 0],
      [-0.02068, 1],
      [0.00201, 3],
      [-0.00207, 0],
      [-0.00491, 1],
      [-0.00928, 2],
      [0.00082, 3],
      [-0.01624, 1],
      [-0.01593, 2],
      [-0.00934, 0],
      [-0.00844, 2],
      [0.00116, 0],
      [0.00055, 0],
      [0.00595, 3],
      [-0.00689, 1]
    ],
    "red_o_points": [],
    "y_categories": [
      "0 TO 6 MONTHS",
      "13 TO 24 MONTHS",
      "25 MONTHS OR MORE",
      "7 TO 12 MONTHS",
      "nan"
    ],
    "blue_o_points": [],
    "blue_x_points": [
      [0.00472, 0],
      [0.0104, 0],
      [0.00626, 0],
      [0.02325, 3],
      [0.02334, 3],
      [0.00654, 0],
      [0.00469, 1],
      [0.01649, 3],
      [0.01013, 3],
      [0.00492, 0]
    ]
  },
  "QS_mulLysisSite[Trunk]": {
    "red_x_points": [
      [-0.00077, 3],
      [-0.00258, 0],
      [-0.00228, 0],
      [-0.00287, 0],
      [-0.00093, 3],
      [-0.00248, 0],
      [-0.00859, 2],
      [-0.00203, 0],
      [-0.00153, 3],
      [-0.00238, 0],
      [-0.003, 0],
      [-0.00211, 0],
      [-0.00095, 3],
      [0.0051, 1],
      [-0.00088, 3],
      [-0.00245, 0],
      [-0.00078, 3],
      [-0.00635, 2],
      [-0.0012, 3],
      [-0.00118, 3],
      [-0.00084, 3],
      [-0.00062, 3],
      [-0.00231, 0],
      [-0.00085, 3],
      [-0.00156, 3],
      [-0.00069, 3],
      [-0.00261, 0],
      [-0.00258, 0],
      [0.00586, 1],
      [-0.00077, 3],
      [-0.00745, 2],
      [-0.00132, 3]
    ],
    "red_o_points": [],
    "y_categories": ["N", "NOT APPLICABLE", "Y", "nan"],
    "blue_o_points": [],
    "blue_x_points": [
      [0.0106, 1],
      [-0.00034, 3],
      [0.00746, 1],
      [0.00195, 0],
      [-0.00018, 0],
      [0.00762, 1],
      [-0.00031, 3],
      [0.00819, 1],
      [-0.00059, 3],
      [-0.00024, 3]
    ]
  },
  "QS_mulNeuromadSite[C4]": {
    "red_x_points": [
      [-1e-5, 2],
      [-0.00064, 0],
      [-0.00073, 0],
      [-0.00085, 0],
      [-0.00011, 2],
      [-0.00094, 0],
      [-0.00073, 0],
      [-0.00079, 0],
      [-0.00019, 2],
      [-0.00111, 0],
      [-0.00083, 0],
      [-0.00065, 0],
      [1e-5, 2],
      [-0.00011, 1],
      [-0.00015, 2],
      [-0.00075, 0],
      [-0.00012, 2],
      [-0.00052, 0],
      [-0.00041, 2],
      [-2e-5, 2],
      [-5e-5, 2],
      [-2e-5, 2],
      [-0.00052, 0],
      [-0.00014, 2],
      [-0.00022, 2],
      [-0.00015, 2],
      [-0.00065, 0],
      [-0.00051, 0],
      [0.00133, 1],
      [-0.00011, 2],
      [-0.00061, 0],
      [-0.00023, 2]
    ],
    "red_o_points": [],
    "y_categories": ["N", "NOT APPLICABLE", "nan"],
    "blue_o_points": [],
    "blue_x_points": [
      [0.0026, 1],
      [7e-5, 2],
      [0.00143, 1],
      [0.00069, 0],
      [-0.00016, 0],
      [0.00144, 1],
      [1e-5, 2],
      [0.00168, 1],
      [6e-5, 2],
      [-0.0, 2]
    ]
  },
  "QS_mulTransfSite[PhMc]": {
    "red_x_points": [
      [-0.00046, 3],
      [-0.0021, 0],
      [-0.00202, 0],
      [-0.00223, 0],
      [-0.00048, 3],
      [-0.00225, 0],
      [-0.00217, 0],
      [-0.00596, 2],
      [-0.00045, 3],
      [-0.002, 0],
      [-0.00207, 0],
      [-0.00205, 0],
      [-0.0004, 3],
      [0.00375, 1],
      [-0.00053, 3],
      [-0.00204, 0],
      [-0.00035, 3],
      [-0.00176, 0],
      [-0.00087, 3],
      [-0.00047, 3],
      [-0.00039, 3],
      [-0.00047, 3],
      [-0.00411, 2],
      [-0.00029, 3],
      [-0.00073, 3],
      [-0.00046, 3],
      [-0.00171, 0],
      [-0.00193, 0],
      [0.0044, 1],
      [-0.00049, 3],
      [-0.00212, 0],
      [-0.00047, 3]
    ],
    "red_o_points": [],
    "y_categories": ["N", "NOT APPLICABLE", "Y", "nan"],
    "blue_o_points": [],
    "blue_x_points": [
      [0.00772, 1],
      [-0.00029, 3],
      [0.00545, 1],
      [0.00016, 0],
      [-0.00095, 0],
      [0.00515, 1],
      [-0.0002, 3],
      [0.00562, 1],
      [-0.00018, 3],
      [-0.00014, 3]
    ]
  },
  "QA_mulInjTbpiCause[Motorcycle]": {
    "red_x_points": [
      [-0.00562, 0],
      [-0.00068, 1],
      [-0.00071, 1],
      [-0.00048, 1],
      [0.00016, 1],
      [-0.00112, 1],
      [-0.00026, 1],
      [-0.00038, 1],
      [0.00024, 1],
      [-0.00059, 1],
      [-0.00076, 1],
      [-0.00015, 1],
      [-0.01129, 0],
      [-0.05473, 1],
      [-0.00024, 1],
      [-0.00122, 1],
      [0.00028, 1],
      [-0.0007, 1],
      [-0.00105, 1],
      [-0.0114, 0],
      [0.00094, 1],
      [0.00333, 1],
      [-0.00031, 1],
      [-0.00052, 1],
      [-0.00153, 1],
      [-0.00897, 0],
      [-0.00031, 1],
      [-0.0003, 1],
      [-0.05653, 1],
      [0.00054, 1],
      [-0.00028, 1],
      [-6e-5, 1]
    ],
    "red_o_points": [],
    "y_categories": ["N", "Y", "nan"],
    "blue_o_points": [],
    "blue_x_points": [
      [0.02548, 0],
      [-0.00035, 1],
      [0.02088, 0],
      [-0.00224, 1],
      [-0.00055, 1],
      [0.02252, 0],
      [0.00421, 1],
      [0.02214, 0],
      [0.00561, 1],
      [0.00392, 1]
    ]
  }
}
