{
  "participant_code": {
    "red_x_points": [
      [-0.06089, 1],
      [-0.06112, 2],
      [-0.0614, 3],
      [-0.06023, 4],
      [-0.06037, 5],
      [-0.0614, 6],
      [-0.06033, 7],
      [-0.06023, 8],
      [-0.05911, 9],
      [-0.05902, 10],
      [-0.05935, 11],
      [-0.05823, 12],
      [-0.05902, 14],
      [-0.05939, 16],
      [-0.05935, 17],
      [-0.06112, 19],
      [-0.06014, 20],
      [-0.05967, 22],
      [-0.06075, 23],
      [-0.05949, 25],
      [-0.05865, 26],
      [-0.06005, 27],
      [-0.05916, 28],
      [-0.0593, 29],
      [-0.06065, 30],
      [-0.05786, 32],
      [-0.05939, 33],
      [-0.05944, 34],
      [-0.06051, 35],
      [-0.05804, 36],
      [-0.05851, 37]
    ],
    "red_o_points": [],
    "y_categories": [
      "P16554",
      "P18297",
      "P19283",
      "P19287",
      "P23391",
      "P31645",
      "P31691",
      "P34778",
      "P35046",
      "P36328",
      "P43633",
      "P4544",
      "P46417",
      "P48965",
      "P53068",
      "P5497",
      "P59529",
      "P62483",
      "P64658",
      "P65202",
      "P66816",
      "P6751",
      "P7408",
      "P75566",
      "P76226",
      "P79971",
      "P82621",
      "P82990",
      "P84932",
      "P85825",
      "P86989",
      "P8770",
      "P87791",
      "P90550",
      "P93159",
      "P94969",
      "P96710",
      "P9744",
      "nan"
    ],
    "blue_o_points": [],
    "blue_x_points": [
      [0.17431, 0],
      [0.17752, 13],
      [0.17737, 15],
      [0.1766, 18],
      [0.17599, 21],
      [0.17277, 24],
      [0.17676, 31]
    ]
  },
  "QA_mulInjOrthesisType[ArmSling]": {
    "red_x_points": [
      [-0.0432, 2],
      [-0.04256, 2],
      [-0.04341, 2],
      [-0.04313, 2],
      [-0.04279, 2],
      [-0.04322, 2],
      [-0.04393, 2],
      [-0.04294, 2],
      [-0.04411, 2],
      [-0.04278, 2],
      [-0.04367, 2],
      [-0.04401, 2],
      [0.12791, 1],
      [-0.04343, 2],
      [-0.04358, 2],
      [-0.04257, 2],
      [-0.05585, 0],
      [-0.04256, 2],
      [-0.04279, 2],
      [-0.04292, 2],
      [-0.05678, 0],
      [-0.05613, 3],
      [-0.04298, 2],
      [0.12987, 1],
      [-0.04334, 2],
      [-0.04189, 2],
      [-0.04297, 2],
      [-0.04413, 2],
      [-0.05534, 3],
      [-0.05478, 3],
      [-0.04248, 2]
    ],
    "red_o_points": [],
    "y_categories": ["N", "NOT APPLICABLE", "Y", "nan"],
    "blue_o_points": [],
    "blue_x_points": [
      [-0.03403, 2],
      [0.12205, 1],
      [0.12498, 1],
      [0.12158, 1],
      [0.12095, 1],
      [0.12133, 1],
      [0.12187, 1]
    ]
  },
  "QA_mulInjOrthesisType[ShoulderSupport]": {
    "red_x_points": [
      [-0.04498, 0],
      [-0.04425, 0],
      [-0.04489, 0],
      [-0.04396, 0],
      [-0.04477, 0],
      [-0.04565, 0],
      [-0.04554, 0],
      [-0.05445, 2],
      [-0.04432, 0],
      [-0.0431, 0],
      [-0.04506, 0],
      [-0.04502, 0],
      [0.12898, 1],
      [-0.04481, 0],
      [-0.04542, 0],
      [-0.04383, 0],
      [-0.05753, 2],
      [-0.04447, 0],
      [-0.04457, 0],
      [-0.04435, 0],
      [-0.05772, 2],
      [-0.05772, 3],
      [-0.04466, 0],
      [0.13502, 1],
      [-0.04471, 0],
      [-0.04509, 0],
      [-0.04473, 0],
      [-0.04459, 0],
      [-0.05762, 3],
      [-0.05772, 3],
      [-0.04448, 0]
    ],
    "red_o_points": [],
    "y_categories": ["N", "NOT APPLICABLE", "Y", "nan"],
    "blue_o_points": [],
    "blue_x_points": [
      [-0.03311, 0],
      [0.12328, 1],
      [0.12676, 1],
      [0.1227, 1],
      [0.12397, 1],
      [0.1272, 1],
      [0.1262, 1]
    ]
  }
}
