{
  "QA_lstPexMuscstrength[ElbowFlex]": {
    "red_x_points": [
      [-0.00984, 1],
      [-0.00017, 2],
      [-0.0092, 1],
      [-0.00874, 1],
      [-0.00897, 1],
      [-0.00952, 1],
      [-0.00966, 1],
      [-0.00888, 1],
      [-0.00954, 1],
      [-0.00988, 1],
      [-0.00972, 1],
      [-0.00934, 1],
      [0.00021, 2],
      [-0.00204, 2],
      [0.00066, 2],
      [-0.01012, 1],
      [-0.00951, 1],
      [-0.00894, 1],
      [-0.00897, 1],
      [-0.00891, 1],
      [-0.00014, 2],
      [-0.00919, 1],
      [-0.00976, 1],
      [-0.00905, 1],
      [-0.00922, 1],
      [0.00061, 2],
      [-0.00934, 1],
      [-0.0093, 1],
      [1e-5, 2]
    ],
    "red_o_points": [],
    "y_categories": ["GREATER THAN OR EQUALS TO 3", "LESS THAN 3", "nan"],
    "blue_o_points": [],
    "blue_x_points": [
      [0.00145, 2],
      [-0.00879, 1],
      [0.04784, 0],
      [-0.00889, 1],
      [0.00224, 2],
      [0.00165, 2],
      [0.03567, 0],
      [-0.00821, 1],
      [-0.00908, 1],
      [0.00215, 2],
      [0.04744, 0],
      [0.03607, 0],
      [0.0422, 0],
      [0.03351, 0],
      [-0.00881, 1]
    ]
  },
  "QS_mulLysisRoot[C6]": {
    "red_x_points": [
      [-0.00037, 3],
      [-0.00439, 0],
      [-0.00932, 2],
      [-0.00233, 0],
      [-0.00282, 0],
      [-0.0024, 0],
      [-0.00283, 0],
      [-0.00071, 3],
      [-0.00319, 0],
      [-0.00249, 0],
      [-0.00038, 3],
      [-0.00296, 0],
      [-0.00069, 3],
      [-0.00459, 0],
      [-0.00423, 0],
      [-0.00068, 3],
      [-0.00036, 3],
      [-0.00047, 3],
      [-0.00252, 0],
      [-0.00039, 3],
      [-0.00054, 3],
      [-0.00054, 3],
      [-0.00287, 0],
      [-0.00296, 0],
      [-0.00072, 3],
      [0.00947, 1],
      [-0.00078, 3],
      [-0.00809, 2],
      [-0.00068, 3]
    ],
    "red_o_points": [],
    "y_categories": ["N", "NOT APPLICABLE", "Y", "nan"],
    "blue_o_points": [],
    "blue_x_points": [
      [0.01811, 1],
      [-0.00032, 3],
      [-0.00142, 0],
      [-0.00161, 0],
      [8e-5, 3],
      [0.01342, 1],
      [0.00935, 1],
      [-0.00152, 0],
      [-0.00019, 3],
      [1e-5, 3],
      [-0.00096, 0],
      [0.01048, 1],
      [-0.00019, 3],
      [0.011, 1],
      [-0.00041, 3]
    ]
  },
  "QS_mulLysisTrunk[Upper]": {
    "red_x_points": [
      [-0.0008, 3],
      [-0.00432, 0],
      [-0.0026, 0],
      [-0.00256, 0],
      [-0.00313, 0],
      [-0.01133, 2],
      [-0.00286, 0],
      [-0.00071, 3],
      [-0.00244, 0],
      [-0.00238, 0],
      [-0.0007, 3],
      [-0.00299, 0],
      [-0.00098, 3],
      [-0.00431, 0],
      [-0.01069, 2],
      [-0.00084, 3],
      [-0.00057, 3],
      [-0.00081, 3],
      [-0.00263, 0],
      [-0.00063, 3],
      [-0.0012, 3],
      [-0.00076, 3],
      [-0.0032, 0],
      [-0.00254, 0],
      [-0.00088, 3],
      [0.01124, 1],
      [-0.00094, 3],
      [-0.01017, 2],
      [-0.0009, 3]
    ],
    "red_o_points": [],
    "y_categories": ["N", "NOT APPLICABLE", "Y", "nan"],
    "blue_o_points": [],
    "blue_x_points": [
      [0.02099, 1],
      [-0.00049, 3],
      [-0.00097, 0],
      [-0.00141, 0],
      [0.00014, 3],
      [0.01549, 1],
      [0.01177, 1],
      [-0.0017, 0],
      [-0.00051, 3],
      [6e-5, 3],
      [-0.00115, 0],
      [0.01344, 1],
      [-0.00051, 3],
      [0.01311, 1],
      [-0.00066, 3]
    ]
  },
  "QS_mulBpsurgeryType[Transf]": {
    "red_x_points": [
      [-3e-5, 3],
      [-0.00054, 2],
      [-0.00273, 0],
      [-0.00043, 2],
      [-0.00059, 2],
      [-0.00023, 2],
      [-0.00079, 2],
      [-0.00012, 3],
      [-0.00062, 2],
      [-0.00046, 2],
      [-4e-5, 3],
      [-0.00054, 2],
      [-0.00016, 3],
      [-0.00067, 2],
      [-0.00038, 2],
      [-1e-5, 3],
      [-5e-5, 3],
      [-1e-5, 3],
      [-0.00038, 2],
      [-0.0001, 3],
      [-0.00023, 3],
      [-3e-5, 3],
      [-0.00052, 2],
      [-0.00063, 2],
      [-0.00017, 3],
      [0.00147, 1],
      [-0.00017, 3],
      [-0.00042, 2],
      [-0.0002, 3]
    ],
    "red_o_points": [],
    "y_categories": ["N", "NOT APPLICABLE", "Y", "nan"],
    "blue_o_points": [],
    "blue_x_points": [
      [0.00414, 1],
      [-0.0, 3],
      [-8e-5, 2],
      [-0.00034, 2],
      [-4e-5, 3],
      [0.00141, 1],
      [0.00124, 1],
      [-0.00017, 2],
      [-9e-5, 3],
      [-3e-5, 3],
      [2e-5, 2],
      [0.00159, 1],
      [-3e-5, 3],
      [0.00214, 1],
      [-1e-5, 3]
    ]
  },
  "QS_mulGraftNerve[Ac]": {
    "red_x_points": [
      [-2e-5, 2],
      [-0.00032, 0],
      [-0.00015, 0],
      [-0.00014, 0],
      [-0.00018, 0],
      [-0.00011, 0],
      [-0.00022, 0],
      [-1e-5, 2],
      [-0.00015, 0],
      [-0.00017, 0],
      [-1e-5, 2],
      [-0.00011, 0],
      [-7e-5, 2],
      [-0.00015, 0],
      [-0.00023, 0],
      [0.0, 2],
      [-3e-5, 2],
      [0.0, 2],
      [-0.0001, 0],
      [-4e-5, 2],
      [-6e-5, 2],
      [-3e-5, 2],
      [-0.00023, 0],
      [-0.0002, 0],
      [-2e-5, 2],
      [0.00019, 1],
      [-2e-5, 2],
      [-0.00013, 0],
      [-2e-5, 2]
    ],
    "red_o_points": [],
    "y_categories": ["N", "NOT APPLICABLE", "nan"],
    "blue_o_points": [],
    "blue_x_points": [
      [0.00087, 1],
      [-2e-5, 2],
      [-3e-5, 0],
      [-7e-5, 0],
      [-0.0, 2],
      [0.00075, 1],
      [0.00045, 1],
      [-0.0001, 0],
      [-2e-5, 2],
      [-1e-5, 2],
      [-0.00014, 0],
      [0.0006, 1],
      [1e-5, 2],
      [0.00045, 1],
      [-2e-5, 2]
    ]
  },
  "QS_mulNeuromadSite[C8]": {
    "red_x_points": [
      [-0.00024, 2],
      [-0.00084, 0],
      [-0.00066, 0],
      [-0.00069, 0],
      [-0.00079, 0],
      [-0.00057, 0],
      [-0.00076, 0],
      [-8e-5, 2],
      [-0.00072, 0],
      [-0.0007, 0],
      [-2e-5, 2],
      [-0.00075, 0],
      [-0.00012, 2],
      [-0.00088, 0],
      [-0.00086, 0],
      [-4e-5, 2],
      [-1e-5, 2],
      [-1e-5, 2],
      [-0.0006, 0],
      [-3e-5, 2],
      [-0.00012, 2],
      [-0.00021, 2],
      [-0.00063, 0],
      [-0.00078, 0],
      [-0.00015, 2],
      [0.00176, 1],
      [-9e-5, 2],
      [-0.00055, 0],
      [-0.00014, 2]
    ],
    "red_o_points": [],
    "y_categories": ["N", "NOT APPLICABLE", "nan"],
    "blue_o_points": [],
    "blue_x_points": [
      [0.00392, 1],
      [-2e-5, 2],
      [-0.00038, 0],
      [-0.00046, 0],
      [6e-5, 2],
      [0.00227, 1],
      [0.00166, 1],
      [-0.00055, 0],
      [-4e-5, 2],
      [-2e-5, 2],
      [-0.00028, 0],
      [0.0023, 1],
      [6e-5, 2],
      [0.00182, 1],
      [-8e-5, 2]
    ]
  },
  "QS_mulGraftNerve[Ph]": {
    "red_x_points": [
      [-2e-5, 2],
      [-0.0001, 0],
      [-6e-5, 0],
      [-6e-5, 0],
      [-0.00011, 0],
      [-3e-5, 0],
      [-0.00011, 0],
      [-5e-5, 2],
      [-8e-5, 0],
      [-6e-5, 0],
      [-0.00011, 0],
      [-0.0, 2],
      [-0.00017, 0],
      [-0.00017, 0],
      [-4e-5, 2],
      [-0.0, 2],
      [-4e-5, 2],
      [-3e-5, 0],
      [-0.0, 2],
      [-2e-5, 2],
      [-2e-5, 2],
      [-0.00011, 0],
      [-7e-5, 0],
      [-2e-5, 2],
      [0.00016, 1],
      [-2e-5, 2],
      [-3e-5, 0],
      [-2e-5, 2]
    ],
    "red_o_points": [],
    "y_categories": ["N", "NOT APPLICABLE", "nan"],
    "blue_o_points": [],
    "blue_x_points": [
      [0.00041, 1],
      [-2e-5, 2],
      [-7e-5, 0],
      [-1e-5, 0],
      [-2e-5, 2],
      [0.00042, 1],
      [0.0003, 1],
      [-0.00011, 0],
      [-4e-5, 2],
      [-2e-5, 2],
      [-7e-5, 0],
      [0.00022, 1],
      [-4e-5, 2],
      [0.00043, 1],
      [-0.0, 2]
    ]
  },
  "QS_mulTransfSite[AcSsPA]": {
    "red_x_points": [
      [-4e-5, 3],
      [-0.00119, 0],
      [-0.00086, 0],
      [-0.00086, 0],
      [-0.00094, 0],
      [-0.00077, 0],
      [-0.00088, 0],
      [-7e-5, 3],
      [-0.00099, 0],
      [-0.00066, 0],
      [-0.00013, 3],
      [-0.00086, 0],
      [-7e-5, 3],
      [-0.00107, 0],
      [-0.00312, 2],
      [-0.00011, 3],
      [-9e-5, 3],
      [-0.0001, 3],
      [-0.00065, 0],
      [-0.00012, 3],
      [-0.00013, 3],
      [-9e-5, 3],
      [-0.00094, 0],
      [-0.00084, 0],
      [-6e-5, 3],
      [0.00255, 1],
      [-0.00013, 3],
      [-0.00065, 0],
      [-0.00011, 3]
    ],
    "red_o_points": [],
    "y_categories": ["N", "NOT APPLICABLE", "Y", "nan"],
    "blue_o_points": [],
    "blue_x_points": [
      [0.0034, 1],
      [-7e-5, 3],
      [-0.0007, 0],
      [-0.00053, 0],
      [3e-5, 3],
      [0.00336, 1],
      [0.00258, 1],
      [-0.00057, 0],
      [-7e-5, 3],
      [5e-5, 3],
      [-0.00045, 0],
      [0.00329, 1],
      [-1e-5, 3],
      [0.00369, 1],
      [-4e-5, 3]
    ]
  },
  "QA_lstPexPalle[Elbow]": {
    "red_x_points": [
      [-0.00083, 4],
      [-0.00307, 4],
      [-0.00229, 4],
      [-0.002, 3],
      [-0.00379, 4],
      [-0.00157, 3],
      [-0.00307, 4],
      [-0.00064, 4],
      [-0.00443, 4],
      [-0.00192, 3],
      [-0.00357, 1],
      [-0.00459, 4],
      [-0.00074, 4],
      [-0.00477, 4],
      [-0.0014, 4],
      [0.00056, 3],
      [-0.0091, 0],
      [0.00038, 3],
      [-0.00663, 2],
      [-0.00013, 3],
      [-0.00068, 4],
      [-0.00064, 4],
      [-0.00477, 4],
      [-0.00405, 4],
      [-0.00057, 4],
      [-0.02494, 3],
      [-0.00041, 4],
      [-0.00604, 0],
      [-0.00063, 4]
    ],
    "red_o_points": [],
    "y_categories": ["ABS", "HYPO", "NAIA", "PT", "nan"],
    "blue_o_points": [],
    "blue_x_points": [
      [0.0041, 4],
      [-0.00015, 4],
      [0.00302, 3],
      [0.03353, 1],
      [0.0001, 4],
      [0.00461, 4],
      [0.01063, 1],
      [-0.0026, 4],
      [0.00023, 4],
      [0.00014, 4],
      [0.02841, 1],
      [0.00379, 4],
      [0.00182, 3],
      [0.0046, 4],
      [0.0041, 3]
    ]
  },
  "QA_lstPexMuscstrength[ScapulaAbducSuprot]": {
    "red_x_points": [
      [0.00247, 0],
      [-0.00114, 2],
      [-0.00807, 1],
      [-0.00035, 2],
      [-0.00952, 1],
      [-0.00952, 1],
      [-0.00958, 1],
      [-0.00692, 1],
      [0.00944, 0],
      [-0.01041, 1],
      [-0.00647, 1],
      [-0.00188, 2],
      [-0.00085, 2],
      [-0.00218, 2],
      [-0.00035, 2],
      [0.00337, 0],
      [-0.00615, 1],
      [0.00237, 0],
      [-0.00743, 1],
      [-0.00149, 2],
      [-0.00085, 2],
      [-0.00069, 2],
      [-0.011, 1],
      [0.00858, 0],
      [-0.0005, 2],
      [4e-5, 2],
      [0.00371, 0],
      [-0.00593, 1],
      [-0.00049, 2]
    ],
    "red_o_points": [],
    "y_categories": ["GREATER THAN OR EQUALS TO 3", "LESS THAN 3", "nan"],
    "blue_o_points": [],
    "blue_x_points": [
      [3e-5, 2],
      [0.00942, 0],
      [0.01353, 0],
      [0.01629, 0],
      [0.00083, 2],
      [0.00024, 2],
      [0.00287, 0],
      [0.00132, 2],
      [0.00107, 2],
      [0.00043, 2],
      [0.01296, 0],
      [0.00373, 0],
      [0.00433, 0],
      [0.00036, 2],
      [0.00436, 1]
    ]
  },
  "participant_code": {
    "red_x_points": [
      [-0.03188, 1],
      [-0.0327, 2],
      [-0.0338, 3],
      [-0.03243, 4],
      [-0.03325, 5],
      [-0.03318, 8],
      [-0.03222, 9],
      [-0.03325, 10],
      [-0.03243, 11],
      [-0.0325, 13],
      [-0.03243, 14],
      [-0.03222, 18],
      [-0.03373, 19],
      [-0.03256, 20],
      [-0.03188, 23],
      [-0.03181, 26],
      [-0.03215, 28],
      [-0.03311, 29],
      [-0.03284, 30],
      [-0.0325, 31],
      [-0.03243, 32],
      [-0.03284, 34],
      [-0.03263, 36],
      [-0.03106, 38],
      [-0.03215, 39],
      [-0.03284, 40],
      [-0.03209, 41],
      [-0.03119, 42],
      [-0.03284, 43]
    ],
    "red_o_points": [],
    "y_categories": [
      "P16554",
      "P18297",
      "P19283",
      "P19287",
      "P23172",
      "P23391",
      "P30595",
      "P31645",
      "P31691",
      "P34778",
      "P35046",
      "P36328",
      "P43633",
      "P4544",
      "P46417",
      "P48965",
      "P53068",
      "P5497",
      "P58556",
      "P59529",
      "P62483",
      "P64658",
      "P65202",
      "P66816",
      "P6751",
      "P7408",
      "P75566",
      "P76226",
      "P79971",
      "P82621",
      "P82990",
      "P84549",
      "P84932",
      "P85825",
      "P86989",
      "P8770",
      "P87791",
      "P90550",
      "P93159",
      "P94969",
      "P96710",
      "P97130",
      "P9744",
      "P98500",
      "nan"
    ],
    "blue_o_points": [],
    "blue_x_points": [
      [0.06439, 0],
      [0.06307, 6],
      [0.06242, 7],
      [0.06373, 12],
      [0.06307, 15],
      [0.06255, 16],
      [0.06255, 17],
      [0.06294, 21],
      [0.06307, 22],
      [0.06228, 24],
      [0.06268, 25],
      [0.06189, 27],
      [0.06189, 33],
      [0.06334, 35],
      [0.06307, 37]
    ]
  },
  "QA_yonInjTbi": {
    "red_x_points": [
      [0.00691, 0],
      [-0.00195, 2],
      [-0.00256, 0],
      [-0.00218, 0],
      [-0.00203, 2],
      [0.00054, 1],
      [-0.00266, 0],
      [-0.00905, 2],
      [-0.00507, 2],
      [0.00095, 1],
      [-0.00451, 1],
      [-0.00477, 0],
      [0.00653, 0],
      [0.00086, 1],
      [0.00029, 1],
      [-0.00637, 1],
      [-0.00442, 1],
      [-0.00568, 1],
      [0.00071, 1],
      [-0.0064, 1],
      [0.00678, 0],
      [-0.00632, 1],
      [0.00126, 1],
      [0.00165, 1],
      [-0.00558, 1],
      [-0.00066, 2],
      [-0.00992, 2],
      [0.00022, 1],
      [-0.00712, 1]
    ],
    "red_o_points": [],
    "y_categories": ["N", "Y", "nan"],
    "blue_o_points": [],
    "blue_x_points": [
      [0.00076, 0],
      [-0.00233, 1],
      [0.00246, 1],
      [0.00294, 1],
      [0.01314, 0],
      [-2e-5, 1],
      [0.00015, 1],
      [0.00445, 1],
      [0.01385, 0],
      [0.01228, 0],
      [0.00216, 1],
      [-0.00018, 2],
      [-0.00393, 1],
      [1e-5, 2],
      [0.01482, 0]
    ]
  },
  "QA_mulInjOrthesisType[ArmSling]": {
    "red_x_points": [
      [-0.00809, 2],
      [-0.00781, 2],
      [-0.0079, 2],
      [-0.00795, 2],
      [-0.00792, 2],
      [-0.00773, 2],
      [-0.00758, 2],
      [-0.00772, 2],
      [-0.0078, 2],
      [-0.00761, 2],
      [-0.00779, 2],
      [-0.00791, 2],
      [-0.00839, 2],
      [-0.00824, 2],
      [-0.02505, 0],
      [-0.0082, 2],
      [-0.00834, 2],
      [-0.02462, 0],
      [-0.02495, 3],
      [-0.00802, 2],
      [-0.00811, 2],
      [-0.00777, 2],
      [-0.00753, 2],
      [-0.00813, 2],
      [-0.02548, 3],
      [-0.02589, 3],
      [-0.02596, 3],
      [-0.00782, 2],
      [-0.00805, 2]
    ],
    "red_o_points": [],
    "y_categories": ["N", "NOT APPLICABLE", "Y", "nan"],
    "blue_o_points": [],
    "blue_x_points": [
      [-0.00754, 2],
      [-0.00795, 2],
      [-0.00776, 2],
      [-0.00765, 2],
      [0.04784, 1],
      [0.04962, 1],
      [0.04704, 1],
      [0.04903, 1],
      [-0.00768, 2],
      [0.04927, 1],
      [-0.00765, 2],
      [0.04573, 1],
      [0.04955, 1],
      [0.0498, 1],
      [-0.00729, 2]
    ]
  },
  "QS_mulGraftNerve[Ul]": {
    "red_x_points": [
      [2e-5, 2],
      [-1e-5, 0],
      [-4e-5, 0],
      [-4e-5, 0],
      [-7e-5, 0],
      [-4e-5, 0],
      [-7e-5, 0],
      [-3e-5, 2],
      [-4e-5, 0],
      [-3e-5, 2],
      [-1e-5, 0],
      [-1e-5, 2],
      [-4e-5, 0],
      [-1e-5, 0],
      [2e-5, 2],
      [-4e-5, 0],
      [0.0, 2],
      [2e-5, 2],
      [-1e-5, 0],
      [-1e-5, 2],
      [2e-5, 2],
      [-4e-5, 0],
      [-1e-5, 2]
    ],
    "red_o_points": [],
    "y_categories": ["N", "NOT APPLICABLE", "nan"],
    "blue_o_points": [],
    "blue_x_points": [
      [0.0002, 1],
      [2e-5, 2],
      [-4e-5, 0],
      [0.00015, 1],
      [7e-5, 1],
      [-3e-5, 0],
      [-3e-5, 2],
      [-1e-5, 2],
      [-1e-5, 0],
      [0.00016, 1],
      [-3e-5, 2],
      [7e-5, 1],
      [2e-5, 2]
    ]
  },
  "QA_mulInjOrthesisType[ShoulderSupport]": {
    "red_x_points": [
      [-0.00845, 0],
      [-0.00836, 0],
      [-0.00785, 0],
      [-0.02957, 2],
      [-0.00775, 0],
      [-0.00828, 0],
      [-0.00794, 0],
      [-0.02953, 2],
      [-0.0081, 0],
      [-0.00789, 0],
      [-0.00814, 0],
      [-0.00817, 0],
      [-0.00779, 0],
      [-0.00788, 0],
      [-0.02902, 2],
      [-0.0081, 0],
      [-0.00818, 0],
      [-0.03011, 2],
      [-0.02715, 3],
      [-0.00801, 0],
      [-0.00777, 0],
      [-0.00789, 0],
      [-0.00805, 0],
      [-0.00837, 0],
      [-0.02918, 3],
      [-0.02818, 3],
      [-0.02926, 3],
      [-0.00784, 0],
      [-0.0083, 0]
    ],
    "red_o_points": [],
    "y_categories": ["N", "NOT APPLICABLE", "Y", "nan"],
    "blue_o_points": [],
    "blue_x_points": [
      [-0.00789, 0],
      [-0.00736, 0],
      [-0.00771, 0],
      [-0.00767, 0],
      [0.05935, 1],
      [0.05626, 1],
      [0.05506, 1],
      [0.05729, 1],
      [-0.00736, 0],
      [0.05557, 1],
      [-0.00733, 0],
      [0.05533, 1],
      [0.0583, 1],
      [0.05691, 1],
      [-0.00765, 0]
    ]
  },
  "QA_yonInjUnconscio": {
    "red_x_points": [
      [-0.01516, 1],
      [-0.01479, 1],
      [-0.00177, 2],
      [-0.00231, 2],
      [-0.00202, 2],
      [-0.01532, 1],
      [-0.00166, 2],
      [-0.00274, 2],
      [-0.00225, 2],
      [-0.01616, 1],
      [-0.01477, 1],
      [-0.01583, 1],
      [-0.0031, 2],
      [-0.002, 2],
      [-0.01111, 1],
      [-0.01492, 1],
      [-0.01572, 1],
      [-0.0103, 1],
      [-0.01105, 1],
      [-0.01456, 1],
      [-0.00298, 2],
      [-0.0024, 2],
      [-0.01653, 1],
      [-0.016, 1],
      [-0.00295, 2],
      [-0.00276, 2],
      [-0.00291, 2],
      [-0.01437, 1],
      [-0.00336, 2]
    ],
    "red_o_points": [],
    "y_categories": ["N", "Y", "nan"],
    "blue_o_points": [],
    "blue_x_points": [
      [-0.00124, 2],
      [-0.00144, 2],
      [0.05463, 0],
      [-0.00063, 2],
      [-0.00904, 1],
      [-0.00844, 1],
      [0.03542, 0],
      [0.04633, 0],
      [-0.00157, 2],
      [0.04267, 0],
      [0.05264, 0],
      [-0.00195, 2],
      [-0.00943, 1],
      [-0.00199, 2],
      [0.05581, 0]
    ]
  },
  "QS_mulGraftNerve[MCA]": {
    "red_x_points": [
      [0.0, 2],
      [-6e-5, 0],
      [-4e-5, 0],
      [-4e-5, 0],
      [-4e-5, 0],
      [-4e-5, 0],
      [0.0, 2],
      [-4e-5, 0],
      [-4e-5, 0],
      [0.0, 2],
      [-2e-5, 0],
      [-2e-5, 2],
      [-6e-5, 0],
      [-4e-5, 0],
      [0.0, 2],
      [0.0, 2],
      [0.0, 2],
      [-2e-5, 2],
      [-2e-5, 2],
      [-2e-5, 2],
      [-4e-5, 0],
      [0.0, 2],
      [9e-5, 1],
      [-4e-5, 0],
      [-2e-5, 2]
    ],
    "red_o_points": [],
    "y_categories": ["N", "NOT APPLICABLE", "nan"],
    "blue_o_points": [],
    "blue_x_points": [
      [0.00018, 1],
      [0.0, 2],
      [-4e-5, 0],
      [0.0, 2],
      [9e-5, 1],
      [9e-5, 1],
      [0.0, 2],
      [0.0, 2],
      [-4e-5, 0],
      [9e-5, 1],
      [0.0, 2],
      [9e-5, 1],
      [0.0, 2]
    ]
  },
  "QA_lstPexInspectio[SurgicalScar]": {
    "red_x_points": [
      [-0.00435, 1],
      [-0.00432, 1],
      [-0.00744, 0],
      [-0.0043, 1],
      [-0.00706, 1],
      [-0.0103, 0],
      [-0.00645, 1],
      [-0.00354, 1],
      [-0.00899, 1],
      [-0.00994, 1],
      [-0.0091, 0],
      [-0.00892, 1],
      [-0.00234, 2],
      [-0.00982, 1],
      [-0.00525, 0],
      [0.00672, 2],
      [0.00548, 2],
      [-0.00856, 1],
      [-0.00454, 1],
      [-0.00518, 1],
      [-0.00209, 2],
      [-0.00378, 1],
      [-0.00833, 1],
      [0.0136, 2],
      [-0.00275, 1],
      [-0.0042, 1],
      [-0.00281, 1],
      [0.00495, 2],
      [-0.00292, 1]
    ],
    "red_o_points": [],
    "y_categories": ["ABS", "NAIA", "PT", "nan"],
    "blue_o_points": [],
    "blue_x_points": [
      [-0.0002, 1],
      [0.01245, 2],
      [0.02441, 2],
      [0.0304, 2],
      [0.00251, 1],
      [0.00047, 1],
      [0.00116, 0],
      [-0.0047, 1],
      [0.00032, 1],
      [0.00282, 1],
      [0.02275, 2],
      [-0.00043, 1],
      [0.00901, 2],
      [0.00374, 0],
      [0.01181, 2]
    ]
  },
  "QA_intPexWristFlex": {
    "red_x_points": [
      [-0.00056, 2],
      [-0.00049, 2],
      [-0.00029, 2],
      [-0.00026, 2],
      [-0.00055, 2],
      [-0.00063, 0],
      [-0.00057, 2],
      [0.00072, 0],
      [-0.00107, 2],
      [-0.00084, 2],
      [-0.00039, 0],
      [-0.00056, 2],
      [-0.00039, 2],
      [-0.0007, 2],
      [-0.00013, 2],
      [-0.0001, 0],
      [0.00013, 0],
      [1e-5, 0],
      [-0.00017, 0],
      [-0.00018, 2],
      [-0.00017, 2],
      [-0.00028, 2],
      [-0.00086, 2],
      [-0.0007, 2],
      [-0.00014, 2],
      [-0.01901, 1],
      [-0.00397, 1],
      [-0.00017, 0],
      [-0.00035, 2]
    ],
    "red_o_points": [],
    "y_categories": ["GREATER THAN OR EQUALS TO 60", "LESS THAN 60", "nan"],
    "blue_o_points": [],
    "blue_x_points": [
      [0.00359, 2],
      [0.00423, 0],
      [0.00056, 0],
      [-0.00062, 2],
      [-2e-5, 2],
      [0.00346, 2],
      [0.00468, 0],
      [-0.00043, 2],
      [-0.0001, 2],
      [2e-5, 2],
      [0.00935, 1],
      [0.00358, 2],
      [0.00021, 2],
      [0.0035, 2],
      [0.00068, 0]
    ]
  },
  "QS_mulGraftNerve[Me]": {
    "red_x_points": [
      [0.0, 2],
      [-2e-5, 0],
      [-3e-5, 0],
      [-2e-5, 0],
      [-5e-5, 0],
      [-2e-5, 0],
      [-1e-5, 2],
      [-2e-5, 0],
      [-1e-5, 2],
      [-5e-5, 0],
      [0.0, 2],
      [-5e-5, 0],
      [-2e-5, 0],
      [-1e-5, 2],
      [-1e-5, 2],
      [-2e-5, 0],
      [-1e-5, 2],
      [0.0, 2],
      [0.0, 2],
      [-5e-5, 0],
      [-5e-5, 0],
      [-1e-5, 2],
      [-2e-5, 0],
      [-1e-5, 2]
    ],
    "red_o_points": [],
    "y_categories": ["N", "NOT APPLICABLE", "nan"],
    "blue_o_points": [],
    "blue_x_points": [
      [0.0003, 1],
      [-1e-5, 2],
      [-2e-5, 0],
      [-2e-5, 0],
      [-1e-5, 2],
      [-2e-5, 0],
      [0.0, 2],
      [-1e-5, 2],
      [-2e-5, 0],
      [0.00013, 1],
      [-1e-5, 2],
      [0.00013, 1]
    ]
  },
  "QS_mulBpsurgeryType[Lysis]": {
    "red_x_points": [
      [-0.00113, 3],
      [-0.0046, 0],
      [-0.01767, 2],
      [-0.01681, 2],
      [-0.00304, 0],
      [-0.01853, 2],
      [-0.00318, 0],
      [-0.0017, 3],
      [-0.00303, 0],
      [-0.00241, 0],
      [-0.00138, 3],
      [-0.00328, 0],
      [-0.00165, 3],
      [-0.00404, 0],
      [-0.01582, 2],
      [-0.00129, 3],
      [-0.00111, 3],
      [-0.0014, 3],
      [-0.00295, 0],
      [-0.00117, 3],
      [-0.00141, 3],
      [-0.00171, 3],
      [-0.00298, 0],
      [-0.0032, 0],
      [-0.00177, 3],
      [0.02066, 1],
      [-0.00158, 3],
      [-0.01614, 2],
      [-0.00145, 3]
    ],
    "red_o_points": [],
    "y_categories": ["N", "NOT APPLICABLE", "Y", "nan"],
    "blue_o_points": [],
    "blue_x_points": [
      [0.03297, 1],
      [-0.00094, 3],
      [-0.00079, 0],
      [-0.00111, 0],
      [-0.00032, 3],
      [0.02608, 1],
      [0.02003, 1],
      [-0.00171, 0],
      [-0.0007, 3],
      [-0.00059, 3],
      [-0.00095, 0],
      [0.02246, 1],
      [-0.00076, 3],
      [0.02303, 1],
      [-0.0009, 3]
    ]
  },
  "QS_mulLysisSite[Trunk]": {
    "red_x_points": [
      [-0.00069, 3],
      [-0.00504, 0],
      [-0.00355, 0],
      [-0.00365, 0],
      [-0.00395, 0],
      [-0.01355, 2],
      [-0.00413, 0],
      [-0.00103, 3],
      [-0.00376, 0],
      [-0.00349, 0],
      [-0.00078, 3],
      [-0.00368, 0],
      [-0.00113, 3],
      [-0.00445, 0],
      [-0.01233, 2],
      [-0.00109, 3],
      [-0.00069, 3],
      [-0.00098, 3],
      [-0.00341, 0],
      [-0.00073, 3],
      [-0.00094, 3],
      [-0.00104, 3],
      [-0.00346, 0],
      [-0.00363, 0],
      [-0.00111, 3],
      [0.01425, 1],
      [-0.0011, 3],
      [-0.01141, 2],
      [-0.00142, 3]
    ],
    "red_o_points": [],
    "y_categories": ["N", "NOT APPLICABLE", "Y", "nan"],
    "blue_o_points": [],
    "blue_x_points": [
      [0.02412, 1],
      [-0.00059, 3],
      [-0.00165, 0],
      [-0.00157, 0],
      [-5e-5, 3],
      [0.01833, 1],
      [0.01559, 1],
      [-0.00216, 0],
      [-0.00068, 3],
      [-0.00037, 3],
      [-0.0016, 0],
      [0.01734, 1],
      [-0.00069, 3],
      [0.01665, 1],
      [-0.00071, 3]
    ]
  },
  "QS_mulGraftTrunk[UpperTrunk]": {
    "red_x_points": [
      [-0.00022, 3],
      [-0.00237, 0],
      [-0.00186, 0],
      [-0.00132, 0],
      [-0.00165, 0],
      [-0.00111, 0],
      [-0.00201, 0],
      [-0.00038, 3],
      [-0.00144, 0],
      [-0.00119, 0],
      [-0.00045, 3],
      [-0.00134, 0],
      [-0.00048, 3],
      [-0.00932, 2],
      [-0.00252, 0],
      [-0.00038, 3],
      [-0.00016, 3],
      [-0.00034, 3],
      [-0.00123, 0],
      [-0.00021, 3],
      [-0.00044, 3],
      [-0.00036, 3],
      [-0.00158, 0],
      [-0.00158, 0],
      [-0.00047, 3],
      [0.00403, 1],
      [-0.00027, 3],
      [-0.00105, 0],
      [-0.00047, 3]
    ],
    "red_o_points": [],
    "y_categories": ["N", "NOT APPLICABLE", "Y", "nan"],
    "blue_o_points": [],
    "blue_x_points": [
      [0.01028, 1],
      [-0.00014, 3],
      [0.00015, 0],
      [-0.0001, 0],
      [1e-5, 3],
      [0.00723, 1],
      [0.0039, 1],
      [-0.00039, 0],
      [-0.00014, 3],
      [-8e-5, 3],
      [-0.00022, 0],
      [0.00643, 1],
      [-0.00012, 3],
      [0.00557, 1],
      [-0.0002, 3]
    ]
  },
  "QS_mulTransfSite[PhMc]": {
    "red_x_points": [
      [-0.00021, 3],
      [-0.00254, 0],
      [-0.00199, 0],
      [-0.00145, 0],
      [-0.00193, 0],
      [-0.00147, 0],
      [-0.00617, 2],
      [-0.00047, 3],
      [-0.00207, 0],
      [-0.00162, 0],
      [-0.00034, 3],
      [-0.00156, 0],
      [-0.00055, 3],
      [-0.0024, 0],
      [-0.00207, 0],
      [-0.00024, 3],
      [-0.00018, 3],
      [-0.00026, 3],
      [-0.00569, 2],
      [-0.00024, 3],
      [-0.00048, 3],
      [-0.00017, 3],
      [-0.002, 0],
      [-0.00183, 0],
      [-0.00045, 3],
      [0.00517, 1],
      [-0.00037, 3],
      [-0.00147, 0],
      [-0.00044, 3]
    ],
    "red_o_points": [],
    "y_categories": ["N", "NOT APPLICABLE", "Y", "nan"],
    "blue_o_points": [],
    "blue_x_points": [
      [0.01236, 1],
      [-0.00024, 3],
      [-0.00081, 0],
      [-0.00121, 0],
      [0.00011, 3],
      [0.00819, 1],
      [0.00538, 1],
      [-0.00098, 0],
      [-0.00019, 3],
      [-0.0001, 3],
      [-0.00086, 0],
      [0.00687, 1],
      [-0.00011, 3],
      [0.00714, 1],
      [-8e-5, 3]
    ]
  },
  "QS_mulLysisSite[Root]": {
    "red_x_points": [
      [-0.00035, 3],
      [-0.00194, 0],
      [-0.00551, 2],
      [-0.00132, 0],
      [-0.00158, 0],
      [-0.00118, 0],
      [-0.00125, 0],
      [-0.00029, 3],
      [-0.00151, 0],
      [-0.0013, 0],
      [-0.00024, 3],
      [-0.00169, 0],
      [-0.00036, 3],
      [-0.00195, 0],
      [-0.00184, 0],
      [-0.00014, 3],
      [-0.00021, 3],
      [-0.0002, 3],
      [-0.00117, 0],
      [-0.00014, 3],
      [-0.00031, 3],
      [-0.00043, 3],
      [-0.00139, 0],
      [-0.00154, 0],
      [-0.00043, 3],
      [0.00476, 1],
      [-0.00037, 3],
      [-0.00453, 2],
      [-0.00026, 3]
    ],
    "red_o_points": [],
    "y_categories": ["N", "NOT APPLICABLE", "Y", "nan"],
    "blue_o_points": [],
    "blue_x_points": [
      [0.00944, 1],
      [-0.00013, 3],
      [-0.00043, 0],
      [-0.00095, 0],
      [0.0, 3],
      [0.00616, 1],
      [0.0045, 1],
      [-0.00118, 0],
      [-0.00016, 3],
      [-7e-5, 3],
      [-0.00049, 0],
      [0.00642, 1],
      [-2e-5, 3],
      [0.00581, 1],
      [-0.00023, 3]
    ]
  },
  "QA_lstPexInspectio[ShoulderSubdisloc]": {
    "red_x_points": [
      [-0.00318, 1],
      [-0.00477, 1],
      [0.00197, 0],
      [-0.0029, 1],
      [-0.00664, 1],
      [-0.0024, 2],
      [-0.00583, 1],
      [-0.00296, 1],
      [-0.00863, 1],
      [-0.00812, 1],
      [-0.00118, 2],
      [-0.00785, 1],
      [-0.00273, 1],
      [-0.00904, 1],
      [-0.0028, 1],
      [-0.00417, 2],
      [-0.00122, 2],
      [0.00023, 1],
      [-0.00378, 1],
      [-0.00138, 1],
      [-0.01238, 0],
      [0.00502, 2],
      [-0.0019, 2],
      [-0.00123, 2],
      [-0.00191, 1],
      [-0.0127, 2],
      [-0.00228, 1],
      [-0.00122, 2],
      [-0.00404, 1]
    ],
    "red_o_points": [],
    "y_categories": ["ABS", "NAIA", "PT", "nan"],
    "blue_o_points": [],
    "blue_x_points": [
      [0.00442, 1],
      [0.00864, 2],
      [0.03425, 0],
      [0.00675, 2],
      [0.0012, 1],
      [0.00496, 1],
      [0.00416, 0],
      [-0.00306, 1],
      [0.01361, 2],
      [0.00085, 1],
      [0.02828, 0],
      [0.0029, 1],
      [0.00241, 1],
      [-0.00148, 2],
      [0.00212, 1]
    ]
  },
  "QS_mulGraftLevel[Trunk]": {
    "red_x_points": [
      [-7e-5, 3],
      [-0.00163, 0],
      [-0.00109, 0],
      [-0.00107, 0],
      [-0.00145, 0],
      [-0.00098, 0],
      [-0.00134, 0],
      [-0.00041, 3],
      [-0.00101, 0],
      [-0.00084, 0],
      [-0.00016, 3],
      [-0.00121, 0],
      [-0.00055, 3],
      [-0.008, 2],
      [-0.0014, 0],
      [-0.00017, 3],
      [-0.0001, 3],
      [-0.0002, 3],
      [-0.00094, 0],
      [-0.0001, 3],
      [-0.00042, 3],
      [-0.00023, 3],
      [-0.00107, 0],
      [-0.00125, 0],
      [-0.00038, 3],
      [0.00331, 1],
      [-0.00048, 3],
      [-0.00086, 0],
      [-0.00054, 3]
    ],
    "red_o_points": [],
    "y_categories": ["N", "NOT APPLICABLE", "Y", "nan"],
    "blue_o_points": [],
    "blue_x_points": [
      [0.00838, 1],
      [-0.00023, 3],
      [2e-5, 0],
      [0.00032, 0],
      [-4e-5, 3],
      [0.00471, 1],
      [0.00313, 1],
      [-0.00043, 0],
      [-0.0001, 3],
      [-5e-5, 3],
      [-0.00026, 0],
      [0.00517, 1],
      [-0.0002, 3],
      [0.00437, 1],
      [-0.00014, 3]
    ]
  },
  "QS_mulGraftNerve[other]": {
    "red_x_points": [
      [3e-5, 2],
      [-0.00041, 0],
      [-0.00036, 0],
      [-0.00024, 0],
      [-0.00038, 0],
      [-0.00018, 0],
      [-0.00048, 0],
      [-0.0, 2],
      [-0.00039, 0],
      [-0.00017, 0],
      [-3e-5, 2],
      [-0.00033, 0],
      [0.0, 2],
      [-0.00044, 0],
      [-0.00025, 0],
      [-0.00014, 2],
      [0.0, 2],
      [-6e-5, 2],
      [-0.00014, 0],
      [-0.0001, 2],
      [3e-5, 2],
      [4e-5, 2],
      [-0.00037, 0],
      [-0.00037, 0],
      [4e-5, 2],
      [0.0004, 1],
      [1e-5, 2],
      [-0.00015, 0],
      [2e-5, 2]
    ],
    "red_o_points": [],
    "y_categories": ["N", "NOT APPLICABLE", "nan"],
    "blue_o_points": [],
    "blue_x_points": [
      [0.00164, 1],
      [0.0001, 2],
      [-0.0001, 0],
      [8e-5, 0],
      [3e-5, 2],
      [0.00087, 1],
      [0.00037, 1],
      [-0.00023, 0],
      [7e-5, 2],
      [5e-5, 2],
      [-0.00012, 0],
      [0.001, 1],
      [-6e-5, 2],
      [0.00073, 1],
      [-2e-5, 2]
    ]
  },
  "QS_mulTransfSite[AcSsAA]": {
    "red_x_points": [
      [-0.0006, 3],
      [-0.00115, 2],
      [-0.00565, 0],
      [-0.00549, 0],
      [9e-5, 2],
      [-0.00552, 0],
      [-0.00517, 0],
      [-0.00085, 3],
      [-0.00648, 0],
      [-0.00711, 0],
      [-0.00044, 3],
      [-0.00495, 0],
      [-0.00084, 3],
      [-0.00082, 2],
      [-0.00265, 0],
      [-0.0006, 3],
      [-0.00028, 3],
      [-0.00045, 3],
      [-0.00054, 2],
      [-0.00048, 3],
      [-0.00078, 3],
      [-0.0007, 3],
      [-0.00521, 0],
      [0.00032, 2],
      [-0.00091, 3],
      [0.00624, 1],
      [-0.00079, 3],
      [-0.0038, 0],
      [-0.00072, 3]
    ],
    "red_o_points": [],
    "y_categories": ["N", "NOT APPLICABLE", "Y", "nan"],
    "blue_o_points": [],
    "blue_x_points": [
      [0.01639, 1],
      [-0.00053, 3],
      [0.00815, 2],
      [0.00768, 2],
      [-0.00011, 3],
      [0.00805, 1],
      [0.00546, 1],
      [-0.00186, 0],
      [-0.00036, 3],
      [-0.00018, 3],
      [-0.00278, 0],
      [0.00847, 1],
      [-0.0005, 3],
      [0.00864, 1],
      [-0.0002, 3]
    ]
  },
  "QS_mulLysisSite[Nerve]": {
    "red_x_points": [
      [-0.00019, 3],
      [-0.0029, 0],
      [-0.00842, 2],
      [-0.00788, 2],
      [-0.00222, 0],
      [-0.00201, 0],
      [-0.00253, 0],
      [-0.00066, 3],
      [-0.00266, 0],
      [-0.0019, 0],
      [-0.00027, 3],
      [-0.00243, 0],
      [-0.00085, 3],
      [-0.00318, 0],
      [-0.00282, 0],
      [-0.00029, 3],
      [-0.00021, 3],
      [-0.0003, 3],
      [-0.00221, 0],
      [-0.00025, 3],
      [-0.00083, 3],
      [-0.00065, 3],
      [-0.0026, 0],
      [-0.0024, 0],
      [-0.00054, 3],
      [0.00831, 1],
      [-0.00069, 3],
      [-0.00209, 0],
      [-0.00079, 3]
    ],
    "red_o_points": [],
    "y_categories": ["N", "NOT APPLICABLE", "Y", "nan"],
    "blue_o_points": [],
    "blue_x_points": [
      [0.01542, 1],
      [-0.00031, 3],
      [-0.00112, 0],
      [-0.00138, 0],
      [-7e-5, 3],
      [0.01089, 1],
      [0.00757, 1],
      [-0.00149, 0],
      [-9e-5, 3],
      [-0.0001, 3],
      [-0.00134, 0],
      [0.00937, 1],
      [-0.00017, 3],
      [0.00952, 1],
      [-0.00023, 3]
    ]
  },
  "QS_mulGraftNerve[Ax]": {
    "red_x_points": [
      [2e-5, 2],
      [-0.00012, 0],
      [-6e-5, 0],
      [-3e-5, 0],
      [-3e-5, 0],
      [-5e-5, 0],
      [-4e-5, 0],
      [-7e-5, 2],
      [-4e-5, 0],
      [-5e-5, 0],
      [2e-5, 2],
      [-5e-5, 0],
      [0.0, 2],
      [-0.00022, 0],
      [-0.00021, 0],
      [2e-5, 2],
      [-1e-5, 2],
      [2e-5, 2],
      [-4e-5, 0],
      [2e-5, 2],
      [0.0, 2],
      [-8e-5, 2],
      [-5e-5, 0],
      [-5e-5, 0],
      [-1e-5, 2],
      [0.00027, 1],
      [-7e-5, 2],
      [-5e-5, 0],
      [-0.0, 2]
    ],
    "red_o_points": [],
    "y_categories": ["N", "NOT APPLICABLE", "nan"],
    "blue_o_points": [],
    "blue_x_points": [
      [0.00042, 1],
      [-2e-5, 2],
      [-2e-5, 0],
      [-6e-5, 0],
      [3e-5, 2],
      [0.00027, 1],
      [8e-5, 1],
      [-2e-5, 0],
      [-1e-5, 2],
      [1e-5, 2],
      [-2e-5, 0],
      [9e-5, 1],
      [2e-5, 2],
      [0.00017, 1]
    ]
  },
  "QS_mulNeuromadSite[C5]": {
    "red_x_points": [
      [4e-5, 2],
      [-0.00076, 0],
      [-0.00031, 0],
      [-0.00028, 0],
      [-0.00047, 0],
      [-0.0004, 0],
      [-0.00061, 0],
      [-1e-5, 2],
      [-0.00045, 0],
      [-0.00051, 0],
      [2e-5, 2],
      [-0.00039, 0],
      [2e-5, 2],
      [-0.00077, 0],
      [-0.00057, 0],
      [-3e-5, 2],
      [3e-5, 2],
      [-3e-5, 2],
      [-0.00031, 0],
      [-0.00012, 2],
      [-0.0002, 2],
      [-0.00012, 2],
      [-0.00049, 0],
      [-0.0005, 0],
      [0.0, 2],
      [0.00091, 1],
      [-1e-5, 2],
      [-0.00035, 0],
      [2e-5, 2]
    ],
    "red_o_points": [],
    "y_categories": ["N", "NOT APPLICABLE", "nan"],
    "blue_o_points": [],
    "blue_x_points": [
      [0.00266, 1],
      [-0.0, 2],
      [-6e-5, 0],
      [-0.00014, 0],
      [0.0001, 2],
      [0.00154, 1],
      [0.00077, 1],
      [-0.00025, 0],
      [1e-5, 2],
      [7e-5, 2],
      [-4e-5, 0],
      [0.00126, 1],
      [-0.0, 2],
      [0.00077, 1],
      [-4e-5, 2]
    ]
  },
  "QS_mulNeuromadSite[C7]": {
    "red_x_points": [
      [0.0, 2],
      [-0.00036, 0],
      [-0.0003, 0],
      [-0.00021, 0],
      [-0.00025, 0],
      [-0.00017, 0],
      [-0.0002, 0],
      [-0.0, 2],
      [-0.00022, 0],
      [-0.00013, 0],
      [2e-5, 2],
      [-0.00028, 0],
      [-0.0, 2],
      [-0.00032, 0],
      [-0.00054, 0],
      [-6e-5, 2],
      [-0.0, 2],
      [0.0, 2],
      [-0.0002, 0],
      [1e-5, 2],
      [4e-5, 2],
      [1e-5, 2],
      [-0.0003, 0],
      [-0.0003, 0],
      [-2e-5, 2],
      [0.00035, 1],
      [-0.0, 2],
      [-0.00019, 0],
      [0.0, 2]
    ],
    "red_o_points": [],
    "y_categories": ["N", "NOT APPLICABLE", "nan"],
    "blue_o_points": [],
    "blue_x_points": [
      [0.00099, 1],
      [1e-5, 2],
      [-3e-5, 0],
      [7e-5, 0],
      [5e-5, 2],
      [0.00107, 1],
      [0.00018, 1],
      [-0.00016, 0],
      [0.0, 2],
      [4e-5, 2],
      [-7e-5, 0],
      [0.00086, 1],
      [-1e-5, 2],
      [0.0006, 1],
      [-0.0, 2]
    ]
  },
  "QA_lstPexMuscstrength[WristExte]": {
    "red_x_points": [
      [-0.00502, 1],
      [-0.00381, 2],
      [-0.00418, 1],
      [-0.00374, 1],
      [-0.00477, 1],
      [-0.00484, 1],
      [-0.00507, 1],
      [0.00034, 0],
      [0.00582, 0],
      [-0.00712, 1],
      [0.00068, 0],
      [0.00532, 0],
      [-0.00291, 2],
      [-0.006, 2],
      [-0.00186, 2],
      [-0.00154, 0],
      [-0.00142, 1],
      [-0.00216, 0],
      [-0.00411, 1],
      [-0.00471, 1],
      [-0.00296, 2],
      [-0.0061, 1],
      [0.00547, 0],
      [0.00432, 0],
      [-0.00184, 2],
      [-0.00084, 2],
      [-0.00339, 1],
      [-0.00264, 1],
      [-0.00308, 2]
    ],
    "red_o_points": [],
    "y_categories": ["GREATER THAN OR EQUALS TO 3", "LESS THAN 3", "nan"],
    "blue_o_points": [],
    "blue_x_points": [
      [0.00236, 0],
      [0.00292, 1],
      [0.00678, 0],
      [0.0082, 0],
      [0.001, 2],
      [-0.0003, 2],
      [0.0009, 0],
      [0.00803, 0],
      [0.01399, 0],
      [0.00056, 2],
      [0.00574, 0],
      [-0.00016, 1],
      [0.00624, 0],
      [0.00177, 0],
      [0.00413, 1]
    ]
  },
  "QS_mulGraftNerve[TD]": {
    "red_x_points": [
      [-8e-5, 0],
      [0.0, 2],
      [-8e-5, 0],
      [0.0, 2],
      [5e-5, 1],
      [0.0, 2]
    ],
    "red_o_points": [],
    "y_categories": ["N", "NOT APPLICABLE", "nan"],
    "blue_o_points": [],
    "blue_x_points": [[5e-5, 1], [0.0, 2], [5e-5, 1], [0.0, 2]]
  },
  "QA_intPexForearmSupin": {
    "red_x_points": [
      [-0.00085, 2],
      [-0.00416, 0],
      [-0.00109, 2],
      [-0.00063, 2],
      [-0.00124, 2],
      [0.00401, 1],
      [-0.00109, 2],
      [0.00236, 1],
      [-0.00149, 2],
      [-0.00157, 2],
      [-0.00796, 0],
      [-0.00758, 0],
      [-0.00075, 2],
      [-0.00144, 2],
      [-0.0004, 2],
      [0.00498, 1],
      [-0.00738, 0],
      [0.00075, 1],
      [0.00182, 1],
      [-0.00077, 2],
      [-0.00078, 2],
      [-0.00071, 2],
      [-0.00156, 2],
      [-0.00158, 2],
      [0.00022, 2],
      [-0.02231, 1],
      [-9e-5, 2],
      [-0.00333, 0],
      [-0.0009, 2]
    ],
    "red_o_points": [],
    "y_categories": ["GREATER THAN OR EQUALS TO 80", "LESS THAN 80", "nan"],
    "blue_o_points": [],
    "blue_x_points": [
      [0.00365, 2],
      [0.00714, 1],
      [0.01039, 1],
      [-0.00102, 2],
      [0.00033, 2],
      [0.00414, 2],
      [0.00569, 0],
      [-0.00051, 2],
      [-4e-5, 2],
      [0.0002, 2],
      [0.00966, 1],
      [0.00412, 2],
      [0.00055, 2],
      [0.00449, 2],
      [0.00675, 1]
    ]
  },
  "QS_mulGraftNerve[SS]": {
    "red_x_points": [
      [3e-5, 2],
      [-5e-5, 0],
      [-5e-5, 0],
      [-5e-5, 0],
      [-5e-5, 0],
      [-5e-5, 0],
      [3e-5, 2],
      [-5e-5, 0],
      [-5e-5, 0],
      [3e-5, 2]
    ],
    "red_o_points": [],
    "y_categories": ["N", "NOT APPLICABLE", "nan"],
    "blue_o_points": [],
    "blue_x_points": [[0.00015, 1], [3e-5, 2], [3e-5, 2]]
  },
  "QA_lstPexPain[C7]": {
    "red_x_points": [
      [-0.00158, 1],
      [-0.00275, 2],
      [-0.00251, 2],
      [-0.00104, 1],
      [-0.00467, 2],
      [-0.00234, 1],
      [-0.002, 1],
      [-0.00541, 0],
      [-0.00404, 1],
      [0.00448, 0],
      [-0.00071, 1],
      [-0.00547, 2],
      [0.00161, 2],
      [-0.0056, 2],
      [-0.00169, 2],
      [-0.00671, 0],
      [-0.00033, 1],
      [-0.00533, 0],
      [-0.00314, 2],
      [-0.00461, 0],
      [0.00122, 2],
      [0.00123, 2],
      [-0.00587, 2],
      [-0.00501, 2],
      [-0.00365, 0],
      [-0.0022, 1],
      [-0.001, 1],
      [-0.00111, 1],
      [-0.00118, 1]
    ],
    "red_o_points": [],
    "y_categories": ["NORM", "NPV", "nan"],
    "blue_o_points": [],
    "blue_x_points": [
      [0.00539, 1],
      [0.01268, 0],
      [0.01699, 0],
      [0.00438, 2],
      [0.0002, 2],
      [-2e-5, 1],
      [0.00178, 1],
      [0.00529, 2],
      [0.00336, 2],
      [0.01103, 0],
      [-3e-5, 1],
      [-0.00173, 0],
      [0.002, 0],
      [0.01008, 1]
    ]
  },
  "QA_lstPexArthre[Index]": {
    "red_x_points": [
      [-0.01151, 0],
      [-0.00435, 2],
      [-0.00304, 2],
      [-0.00607, 0],
      [-0.00907, 0],
      [0.00613, 1],
      [-0.00816, 0],
      [0.0005, 2],
      [0.00856, 1],
      [-0.01248, 0],
      [0.00269, 1],
      [-0.00594, 2],
      [0.0003, 2],
      [0.00848, 1],
      [-0.00255, 2],
      [0.00369, 1],
      [-0.00975, 0],
      [0.00212, 1],
      [-0.00368, 2],
      [-0.01213, 0],
      [0.00028, 2],
      [0.00035, 2],
      [-0.00634, 2],
      [-0.00537, 2],
      [0.00243, 1],
      [-0.00105, 2],
      [0.00013, 2],
      [-0.00633, 0],
      [0.00046, 2]
    ],
    "red_o_points": [],
    "y_categories": ["NPV", "PV", "nan"],
    "blue_o_points": [],
    "blue_x_points": [
      [4e-5, 0],
      [0.00109, 2],
      [0.01264, 1],
      [0.01412, 1],
      [0.00325, 2],
      [-0.00025, 2],
      [0.00203, 1],
      [0.01137, 1],
      [0.00199, 2],
      [0.00184, 2],
      [0.01061, 1],
      [0.00212, 1],
      [0.004, 1],
      [-0.00024, 2],
      [0.00706, 1]
    ]
  },
  "QS_mulTransfSite[IMc]": {
    "red_x_points": [
      [-0.00147, 3],
      [-0.01726, 2],
      [-0.00247, 0],
      [-0.0148, 2],
      [-0.00229, 0],
      [-0.00211, 0],
      [-0.00238, 0],
      [-0.00145, 3],
      [-0.00216, 0],
      [-0.00204, 0],
      [-0.0014, 3],
      [-0.00233, 0],
      [-0.00161, 3],
      [-0.00336, 0],
      [-0.0156, 2],
      [-0.00165, 3],
      [-0.00126, 3],
      [-0.00135, 3],
      [-0.0025, 0],
      [-0.00148, 3],
      [-0.00152, 3],
      [-0.00167, 3],
      [-0.00255, 0],
      [-0.0199, 2],
      [-0.00162, 3],
      [0.01723, 1],
      [-0.00143, 3],
      [-0.0151, 2],
      [-0.00157, 3]
    ],
    "red_o_points": [],
    "y_categories": ["N", "NOT APPLICABLE", "Y", "nan"],
    "blue_o_points": [],
    "blue_x_points": [
      [0.032, 1],
      [-0.00103, 3],
      [-0.00053, 0],
      [0.00075, 0],
      [-0.00064, 3],
      [0.02334, 1],
      [0.01987, 1],
      [-0.00099, 0],
      [-0.00093, 3],
      [-0.00073, 3],
      [-0.0006, 0],
      [0.02075, 1],
      [-0.00114, 3],
      [0.02001, 1],
      [-0.00102, 3]
    ]
  },
  "QS_mulLysisRoot[C7]": {
    "red_x_points": [
      [-0.00015, 3],
      [-0.00108, 0],
      [-0.00403, 2],
      [-0.00106, 0],
      [-0.00095, 0],
      [-0.00079, 0],
      [-0.00096, 0],
      [-0.00042, 3],
      [-0.00094, 0],
      [-0.00076, 0],
      [-0.00014, 3],
      [-0.00072, 0],
      [-0.00038, 3],
      [-0.00086, 0],
      [-0.00102, 0],
      [-0.00018, 3],
      [-0.00022, 3],
      [-0.00019, 3],
      [-0.00074, 0],
      [-0.00016, 3],
      [-0.00042, 3],
      [-0.00038, 3],
      [-0.00093, 0],
      [-0.00098, 0],
      [-0.00041, 3],
      [0.00324, 1],
      [-0.00035, 3],
      [-0.00076, 0],
      [-0.00043, 3]
    ],
    "red_o_points": [],
    "y_categories": ["N", "NOT APPLICABLE", "Y", "nan"],
    "blue_o_points": [],
    "blue_x_points": [
      [0.00541, 1],
      [-0.00021, 3],
      [-0.0004, 0],
      [-0.00063, 0],
      [-0.00015, 3],
      [0.0041, 1],
      [0.00297, 1],
      [-0.00072, 0],
      [-0.00025, 3],
      [-0.00017, 3],
      [-0.00042, 0],
      [0.00385, 1],
      [-0.00012, 3],
      [0.00409, 1],
      [-0.00018, 3]
    ]
  },
  "QS_lstBpsurgSide": {
    "red_x_points": [
      [-0.00081, 3],
      [-0.01194, 0],
      [-0.01268, 0],
      [-0.01065, 0],
      [-0.01231, 0],
      [-0.01247, 0],
      [-0.0127, 0],
      [-0.00119, 3],
      [-0.01452, 0],
      [0.00121, 2],
      [-0.00122, 3],
      [-0.00053, 2],
      [-0.00119, 3],
      [-2e-5, 2],
      [-0.00175, 2],
      [-0.00116, 3],
      [-0.00065, 3],
      [-0.00084, 3],
      [-0.00839, 0],
      [-0.00071, 3],
      [-0.00117, 3],
      [-0.00107, 3],
      [0.00063, 2],
      [0.00099, 2],
      [-0.00124, 3],
      [0.01305, 1],
      [-0.00092, 3],
      [-0.0107, 0],
      [-0.00107, 3]
    ],
    "red_o_points": [],
    "y_categories": ["L", "NOT APPLICABLE", "R", "nan"],
    "blue_o_points": [],
    "blue_x_points": [
      [0.03026, 1],
      [-0.00069, 3],
      [0.00491, 2],
      [0.00605, 2],
      [-0.00011, 3],
      [0.01757, 1],
      [0.01417, 1],
      [-0.00194, 0],
      [-0.00061, 3],
      [-0.00031, 3],
      [0.0041, 2],
      [0.01635, 1],
      [-0.00056, 3],
      [0.01731, 1],
      [-0.00047, 3]
    ]
  },
  "QS_mulTransfSite[AcMc]": {
    "red_x_points": [
      [-6e-5, 3],
      [-0.00214, 0],
      [-0.00126, 0],
      [-0.00095, 0],
      [-0.00141, 0],
      [-0.00068, 0],
      [-0.00114, 0],
      [-0.00034, 3],
      [-0.00126, 0],
      [-0.00954, 2],
      [-0.00028, 3],
      [-0.00133, 0],
      [-0.00025, 3],
      [-0.00189, 0],
      [-0.00205, 0],
      [-0.00059, 3],
      [-0.00019, 3],
      [-0.00032, 3],
      [-0.00089, 0],
      [-0.00045, 3],
      [-0.00028, 3],
      [-0.00044, 3],
      [-0.00104, 0],
      [-0.00103, 0],
      [-0.00033, 3],
      [0.00311, 1],
      [-0.00023, 3],
      [-0.00085, 0],
      [-0.00012, 3]
    ],
    "red_o_points": [],
    "y_categories": ["N", "NOT APPLICABLE", "Y", "nan"],
    "blue_o_points": [],
    "blue_x_points": [
      [0.00874, 1],
      [0.0, 3],
      [0.00216, 0],
      [0.00193, 0],
      [0.00014, 3],
      [0.00492, 1],
      [0.00259, 1],
      [-0.00056, 0],
      [7e-5, 3],
      [3e-5, 3],
      [0.00161, 0],
      [0.00346, 1],
      [-9e-5, 3],
      [0.00374, 1],
      [-0.00054, 3]
    ]
  },
  "QS_mulTransfSite[Other]": {
    "red_x_points": [
      [-0.00117, 3],
      [-0.00918, 0],
      [-0.00839, 0],
      [-0.00833, 0],
      [-0.00912, 0],
      [-0.00918, 0],
      [-0.00874, 0],
      [-0.00142, 3],
      [-0.00971, 0],
      [-0.00937, 0],
      [-0.00129, 3],
      [-0.00896, 0],
      [-0.00159, 3],
      [-0.00977, 0],
      [-0.00878, 0],
      [-0.00138, 3],
      [-0.0013, 3],
      [-0.00139, 3],
      [-0.00786, 0],
      [-0.00113, 3],
      [-0.00152, 3],
      [-0.00146, 3],
      [-0.00916, 0],
      [-0.00858, 0],
      [-0.00146, 3],
      [0.01885, 1],
      [-0.00163, 3],
      [-0.0083, 0],
      [-0.00151, 3]
    ],
    "red_o_points": [],
    "y_categories": ["N", "NOT APPLICABLE", "Y", "nan"],
    "blue_o_points": [],
    "blue_x_points": [
      [0.03042, 1],
      [-0.00128, 3],
      [-0.00737, 0],
      [-0.00724, 0],
      [-0.00047, 3],
      [0.02319, 1],
      [0.01835, 1],
      [-0.00686, 0],
      [-0.00089, 3],
      [-0.00079, 3],
      [0.04307, 2],
      [0.02323, 1],
      [-0.00098, 3],
      [0.02149, 1],
      [-0.00105, 3]
    ]
  },
  "QA_yonInjBpsurg": {
    "red_x_points": [
      [-0.00036, 1],
      [-0.0005, 1],
      [-0.00054, 1],
      [-0.00068, 1],
      [-0.00052, 1],
      [-0.00021, 1],
      [-0.00052, 1],
      [-0.00062, 1],
      [-0.00068, 1],
      [-0.00033, 1],
      [-0.00035, 1],
      [-0.00049, 1],
      [-0.00082, 1],
      [-0.0009, 1],
      [-0.00043, 1],
      [-0.0004, 1],
      [-0.00026, 1],
      [-0.0003, 1],
      [-0.00026, 1],
      [-0.00046, 1],
      [-0.00064, 1],
      [-0.00075, 1],
      [-0.0003, 1],
      [-0.00034, 1],
      [-0.00069, 1],
      [0.00207, 0],
      [-0.00057, 1],
      [-0.00027, 1],
      [-0.00079, 1]
    ],
    "red_o_points": [],
    "y_categories": ["N", "Y", "nan"],
    "blue_o_points": [],
    "blue_x_points": [
      [0.00516, 0],
      [-0.00044, 1],
      [-0.00037, 1],
      [-0.00068, 1],
      [-0.00029, 1],
      [0.00226, 0],
      [0.00206, 0],
      [-0.00051, 1],
      [-0.00047, 1],
      [-0.00017, 1],
      [-0.0003, 1],
      [0.00319, 0],
      [-0.00024, 1],
      [0.00287, 0],
      [-0.00019, 1]
    ]
  },
  "QA_lstPexTouch[C8]": {
    "red_x_points": [
      [-0.00175, 1],
      [-0.0057, 2],
      [-0.00231, 1],
      [-0.00194, 1],
      [-0.00705, 2],
      [-0.00422, 1],
      [-0.00367, 1],
      [-0.00501, 0],
      [-0.00648, 1],
      [0.01012, 0],
      [-0.00207, 1],
      [-0.01005, 2],
      [-0.00285, 2],
      [-0.00819, 2],
      [-0.0028, 2],
      [-0.0008, 0],
      [-0.0015, 1],
      [-0.00173, 0],
      [-0.00461, 2],
      [-0.00093, 0],
      [-0.00225, 2],
      [-0.00644, 0],
      [-0.00572, 1],
      [-0.00913, 2],
      [-0.00394, 0],
      [-0.00653, 1],
      [-0.00146, 2],
      [-0.00282, 1],
      [-0.00049, 1]
    ],
    "red_o_points": [],
    "y_categories": ["NORM", "NPV", "nan"],
    "blue_o_points": [],
    "blue_x_points": [
      [0.00505, 0],
      [0.00963, 1],
      [0.01994, 0],
      [0.0268, 0],
      [0.00516, 2],
      [0.00103, 2],
      [-0.00014, 1],
      [-0.00178, 1],
      [0.00965, 1],
      [0.00328, 2],
      [0.01733, 0],
      [-0.00042, 1],
      [-0.00029, 0],
      [0.0033, 0],
      [0.00377, 0]
    ]
  },
  "QA_lstPexPalle[Clavicle]": {
    "red_x_points": [
      [7e-5, 3],
      [-0.00121, 3],
      [-0.0009, 3],
      [0.00155, 2],
      [-0.00156, 3],
      [0.00169, 2],
      [-0.00139, 3],
      [0.00015, 3],
      [-0.00226, 3],
      [0.00252, 2],
      [-0.01549, 0],
      [-0.00213, 3],
      [-3e-5, 3],
      [-0.00226, 3],
      [-0.00064, 3],
      [-0.01698, 0],
      [-0.01428, 0],
      [0.01156, 2],
      [-0.00333, 1],
      [-0.01617, 1],
      [0.0001, 3],
      [-5e-5, 3],
      [-0.00258, 3],
      [-0.00199, 3],
      [0.0001, 3],
      [-0.02849, 2],
      [-4e-5, 3],
      [-0.00091, 0],
      [0.00014, 3]
    ],
    "red_o_points": [],
    "y_categories": ["HYPO", "NAIA", "PT", "nan"],
    "blue_o_points": [],
    "blue_x_points": [
      [0.00525, 3],
      [0.00071, 3],
      [0.00444, 2],
      [0.00561, 2],
      [0.00092, 3],
      [0.00528, 3],
      [0.00694, 0],
      [-0.00162, 3],
      [0.0008, 3],
      [0.00087, 3],
      [0.01016, 0],
      [0.00535, 3],
      [0.02062, 2],
      [0.00568, 3],
      [0.02379, 2]
    ]
  },
  "QS_mulBpsurgeryType[Graft]": {
    "red_x_points": [
      [-0.0001, 3],
      [-0.00081, 0],
      [-0.00056, 0],
      [-0.00069, 0],
      [-0.00054, 0],
      [-0.00065, 0],
      [-0.00077, 0],
      [-0.00024, 3],
      [-0.00049, 0],
      [-0.00049, 0],
      [-8e-5, 3],
      [-0.00069, 0],
      [-0.0003, 3],
      [-0.00512, 2],
      [-0.00067, 0],
      [-4e-5, 3],
      [-6e-5, 3],
      [-0.00013, 3],
      [-0.00063, 0],
      [-4e-5, 3],
      [-0.00024, 3],
      [-0.00023, 3],
      [-0.00061, 0],
      [-0.00059, 0],
      [-0.00025, 3],
      [0.00264, 1],
      [-0.00031, 3],
      [-0.00063, 0],
      [-0.00033, 3]
    ],
    "red_o_points": [],
    "y_categories": ["N", "NOT APPLICABLE", "Y", "nan"],
    "blue_o_points": [],
    "blue_x_points": [
      [0.00334, 1],
      [-7e-5, 3],
      [-2e-5, 0],
      [0.00047, 0],
      [-3e-5, 3],
      [0.00282, 1],
      [0.00236, 1],
      [-0.00021, 0],
      [-0.00012, 3],
      [-5e-5, 3],
      [-0.00015, 0],
      [0.00291, 1],
      [-0.0001, 3],
      [0.00259, 1],
      [-6e-5, 3]
    ]
  },
  "QS_mulLysisRoot[C5]": {
    "red_x_points": [
      [-0.00025, 3],
      [-0.00288, 0],
      [-0.00757, 2],
      [-0.0017, 0],
      [-0.00212, 0],
      [-0.00171, 0],
      [-0.00202, 0],
      [-0.00056, 3],
      [-0.0022, 0],
      [-0.0019, 0],
      [-0.00048, 3],
      [-0.00235, 0],
      [-0.00076, 3],
      [-0.00268, 0],
      [-0.00244, 0],
      [-0.00037, 3],
      [-0.00025, 3],
      [-0.00018, 3],
      [-0.00177, 0],
      [-0.00021, 3],
      [-0.00078, 3],
      [-0.00058, 3],
      [-0.002, 0],
      [-0.002, 0],
      [-0.00063, 3],
      [0.00684, 1],
      [-0.00041, 3],
      [-0.00573, 2],
      [-0.00059, 3]
    ],
    "red_o_points": [],
    "y_categories": ["N", "NOT APPLICABLE", "Y", "nan"],
    "blue_o_points": [],
    "blue_x_points": [
      [0.01439, 1],
      [-0.00042, 3],
      [-0.00073, 0],
      [-0.00117, 0],
      [0.00011, 3],
      [0.00924, 1],
      [0.00662, 1],
      [-0.00136, 0],
      [-0.00036, 3],
      [-7e-5, 3],
      [-0.00081, 0],
      [0.00737, 1],
      [-9e-5, 3],
      [0.00783, 1],
      [-0.00027, 3]
    ]
  },
  "QS_mulNeuromadSite[C6]": {
    "red_x_points": [
      [-2e-5, 2],
      [-0.00049, 0],
      [-0.00017, 0],
      [-6e-5, 0],
      [-0.00017, 0],
      [-0.00017, 0],
      [-0.00017, 0],
      [-3e-5, 2],
      [-0.00014, 0],
      [-0.00019, 0],
      [0.0, 2],
      [-0.00017, 0],
      [-1e-5, 2],
      [-0.00021, 0],
      [-0.00028, 0],
      [0.0, 2],
      [1e-5, 2],
      [-0.0, 2],
      [-0.00016, 0],
      [-2e-5, 2],
      [-1e-5, 2],
      [-2e-5, 2],
      [-0.00015, 0],
      [-0.00018, 0],
      [-2e-5, 2],
      [0.00029, 1],
      [-2e-5, 2],
      [-0.00011, 0],
      [-3e-5, 2]
    ],
    "red_o_points": [],
    "y_categories": ["N", "NOT APPLICABLE", "nan"],
    "blue_o_points": [],
    "blue_x_points": [
      [0.00074, 1],
      [-3e-5, 2],
      [-0.00011, 0],
      [-0.00013, 0],
      [8e-5, 2],
      [0.001, 1],
      [0.00042, 1],
      [-7e-5, 0],
      [-1e-5, 2],
      [7e-5, 2],
      [-0.00011, 0],
      [0.00046, 1],
      [1e-5, 2],
      [0.00042, 1],
      [-3e-5, 2]
    ]
  },
  "QS_mulNeuromadSite[T1]": {
    "red_x_points": [
      [-4e-5, 2],
      [-0.00043, 0],
      [-0.00038, 0],
      [-0.00037, 0],
      [-0.00037, 0],
      [-0.00024, 0],
      [-0.00047, 0],
      [-8e-5, 2],
      [-0.00046, 0],
      [-0.00033, 0],
      [-1e-5, 2],
      [-0.00038, 0],
      [-4e-5, 2],
      [-0.00065, 0],
      [-0.00033, 0],
      [-3e-5, 2],
      [-5e-5, 2],
      [-2e-5, 2],
      [-0.00033, 0],
      [-3e-5, 2],
      [-8e-5, 2],
      [-7e-5, 2],
      [-0.00052, 0],
      [-0.00045, 0],
      [-9e-5, 2],
      [0.00069, 1],
      [-9e-5, 2],
      [-0.00035, 0],
      [-6e-5, 2]
    ],
    "red_o_points": [],
    "y_categories": ["N", "NOT APPLICABLE", "nan"],
    "blue_o_points": [],
    "blue_x_points": [
      [0.00238, 1],
      [0.0, 2],
      [-0.00017, 0],
      [-0.00042, 0],
      [1e-5, 2],
      [0.00151, 1],
      [0.00094, 1],
      [-0.00024, 0],
      [5e-5, 2],
      [4e-5, 2],
      [-0.00024, 0],
      [0.00123, 1],
      [-3e-5, 2],
      [0.00106, 1],
      [-3e-5, 2]
    ]
  },
  "QA_lstPexTouch[C7]": {
    "red_x_points": [
      [-0.00192, 1],
      [-0.00745, 2],
      [-0.00299, 1],
      [-0.00303, 1],
      [-0.00973, 2],
      [-0.00629, 1],
      [-0.00503, 1],
      [-0.00434, 0],
      [-0.00805, 1],
      [-0.00926, 1],
      [-0.00216, 1],
      [-0.01443, 2],
      [-0.00192, 2],
      [-0.0142, 2],
      [-0.00572, 2],
      [-0.00239, 0],
      [-0.00108, 1],
      [-0.00258, 0],
      [-0.00716, 2],
      [-0.00291, 0],
      [-0.00167, 2],
      [-0.00778, 0],
      [-0.00846, 1],
      [-0.01118, 2],
      [-0.00415, 0],
      [-0.00402, 1],
      [-0.0007, 2],
      [-0.00257, 1],
      [0.00066, 1]
    ],
    "red_o_points": [],
    "y_categories": ["NORM", "NPV", "nan"],
    "blue_o_points": [],
    "blue_x_points": [
      [3e-5, 1],
      [0.00851, 1],
      [0.0394, 0],
      [0.04551, 0],
      [0.00557, 2],
      [0.00027, 2],
      [2e-5, 1],
      [-0.00327, 1],
      [0.01027, 1],
      [0.00536, 2],
      [0.03222, 0],
      [-3e-5, 1],
      [-0.00092, 0],
      [0.0038, 0],
      [0.00577, 0]
    ]
  },
  "QA_yonInjPhysio": {
    "red_x_points": [
      [-0.00744, 0],
      [0.00022, 0],
      [0.00011, 0],
      [2e-5, 0],
      [-0.00176, 2],
      [3e-5, 0],
      [5e-5, 0],
      [-0.00575, 0],
      [0.00076, 0],
      [-0.00724, 1],
      [-0.00553, 0],
      [0.00081, 0],
      [-0.00801, 0],
      [-0.00568, 1],
      [-0.0012, 1],
      [0.00267, 1],
      [-0.00577, 0],
      [0.00459, 1],
      [8e-5, 0],
      [-0.00586, 0],
      [0.00349, 1],
      [0.00297, 1],
      [0.00153, 0],
      [-0.00704, 1],
      [-0.00873, 2],
      [-0.01395, 1],
      [-0.00941, 2],
      [-9e-5, 0],
      [0.0045, 1]
    ],
    "red_o_points": [],
    "y_categories": ["N", "Y", "nan"],
    "blue_o_points": [],
    "blue_x_points": [
      [0.00549, 0],
      [0.00774, 1],
      [0.00599, 0],
      [0.00763, 0],
      [0.00842, 1],
      [0.00532, 0],
      [0.00361, 0],
      [0.00208, 0],
      [-0.00082, 0],
      [0.00718, 1],
      [0.00477, 0],
      [0.00365, 0],
      [0.00556, 1],
      [-0.00268, 1],
      [0.00772, 1]
    ]
  },
  "QS_mulGraftNerve[LT]": {
    "red_x_points": [
      [2e-5, 2],
      [-3e-5, 0],
      [-3e-5, 0],
      [2e-5, 2],
      [-3e-5, 0],
      [-3e-5, 0],
      [2e-5, 2],
      [-3e-5, 0],
      [-3e-5, 0],
      [-3e-5, 0],
      [-3e-5, 0]
    ],
    "red_o_points": [],
    "y_categories": ["N", "NOT APPLICABLE", "nan"],
    "blue_o_points": [],
    "blue_x_points": [[0.00017, 1], [2e-5, 2]]
  },
  "QS_mulNeuromadSite[T2]": {
    "red_x_points": [
      [7e-5, 2],
      [-0.00119, 0],
      [-0.00064, 0],
      [-0.00065, 0],
      [-0.00085, 0],
      [-0.0009, 0],
      [-0.00079, 0],
      [-0.00027, 2],
      [-0.00078, 0],
      [-0.00095, 0],
      [-6e-5, 2],
      [-0.00118, 0],
      [-0.00015, 2],
      [-0.00123, 0],
      [-0.00104, 0],
      [0.0, 2],
      [0.0001, 2],
      [2e-5, 2],
      [-0.00082, 0],
      [0.00013, 2],
      [-0.00018, 2],
      [-0.00013, 2],
      [-0.00116, 0],
      [-0.00095, 0],
      [-0.00025, 2],
      [0.00164, 1],
      [-0.00025, 2],
      [-0.00086, 0],
      [-7e-5, 2]
    ],
    "red_o_points": [],
    "y_categories": ["N", "NOT APPLICABLE", "nan"],
    "blue_o_points": [],
    "blue_x_points": [
      [0.00427, 1],
      [-4e-5, 2],
      [-0.00034, 0],
      [-0.00032, 0],
      [0.00026, 2],
      [0.00405, 1],
      [0.00181, 1],
      [-0.00049, 0],
      [-0.00012, 2],
      [3e-5, 2],
      [-0.00019, 0],
      [0.002, 1],
      [0.0001, 2],
      [0.0024, 1],
      [-5e-5, 2]
    ]
  },
  "QS_mulLysisNerve[Ssr]": {
    "red_x_points": [
      [-0.00065, 3],
      [-0.0041, 0],
      [-0.00998, 2],
      [-0.00971, 2],
      [-0.00304, 0],
      [-0.00263, 0],
      [-0.00304, 0],
      [-0.00089, 3],
      [-0.00349, 0],
      [-0.00257, 0],
      [-0.00072, 3],
      [-0.00294, 0],
      [-0.00089, 3],
      [-0.00417, 0],
      [-0.00358, 0],
      [-0.00067, 3],
      [-0.00046, 3],
      [-0.0006, 3],
      [-0.00272, 0],
      [-0.00067, 3],
      [-0.0011, 3],
      [-0.00087, 3],
      [-0.00306, 0],
      [-0.00317, 0],
      [-0.00083, 3],
      [0.01045, 1],
      [-0.00083, 3],
      [-0.00264, 0],
      [-0.00093, 3]
    ],
    "red_o_points": [],
    "y_categories": ["N", "NOT APPLICABLE", "Y", "nan"],
    "blue_o_points": [],
    "blue_x_points": [
      [0.01809, 1],
      [-0.00079, 3],
      [-0.00131, 0],
      [-0.00167, 0],
      [-0.00017, 3],
      [0.01515, 1],
      [0.01056, 1],
      [-0.00186, 0],
      [-0.00056, 3],
      [-0.0004, 3],
      [-0.00162, 0],
      [0.01222, 1],
      [-0.00023, 3],
      [0.0134, 1],
      [-0.00035, 3]
    ]
  },
  "QS_mulNeuromadSite[C4]": {
    "red_x_points": [
      [4e-5, 2],
      [-0.00032, 0],
      [-8e-5, 0],
      [-0.00018, 0],
      [-9e-5, 0],
      [-0.00013, 0],
      [-0.00012, 0],
      [-7e-5, 2],
      [-0.0002, 0],
      [-0.00016, 0],
      [5e-5, 2],
      [-0.00025, 0],
      [-7e-5, 2],
      [-0.00018, 0],
      [-0.00024, 0],
      [8e-5, 2],
      [1e-5, 2],
      [9e-5, 2],
      [-8e-5, 0],
      [6e-5, 2],
      [-5e-5, 2],
      [-4e-5, 2],
      [-0.00012, 0],
      [-0.00016, 0],
      [-7e-5, 2],
      [0.00024, 1],
      [-7e-5, 2],
      [-0.00019, 0],
      [-5e-5, 2]
    ],
    "red_o_points": [],
    "y_categories": ["N", "NOT APPLICABLE", "nan"],
    "blue_o_points": [],
    "blue_x_points": [
      [0.00084, 1],
      [5e-5, 2],
      [-1e-5, 0],
      [0.0001, 2],
      [0.00085, 1],
      [-4e-5, 2],
      [1e-5, 2],
      [0.00029, 1],
      [9e-5, 2],
      [0.00017, 1]
    ]
  },
  "QS_mulGraftNerve[Ra]": {
    "red_x_points": [
      [-8e-5, 0],
      [-4e-5, 0],
      [-3e-5, 0],
      [-4e-5, 0],
      [-4e-5, 0],
      [-2e-5, 2],
      [-8e-5, 0],
      [-4e-5, 2],
      [-3e-5, 0],
      [-2e-5, 2],
      [-2e-5, 2],
      [-4e-5, 2],
      [-4e-5, 0],
      [-4e-5, 0],
      [-4e-5, 2],
      [-2e-5, 2],
      [-4e-5, 2]
    ],
    "red_o_points": [],
    "y_categories": ["N", "NOT APPLICABLE", "nan"],
    "blue_o_points": [],
    "blue_x_points": [
      [0.00025, 1],
      [0.00025, 1],
      [-8e-5, 0],
      [-4e-5, 2],
      [-4e-5, 2],
      [0.00013, 1],
      [0.00025, 1]
    ]
  },
  "QS_mulTransfSite[Oberlin]": {
    "red_x_points": [
      [-0.00163, 3],
      [-0.02398, 0],
      [-0.02278, 0],
      [-0.0214, 0],
      [-0.02386, 0],
      [0.00346, 2],
      [-0.02244, 0],
      [-0.00216, 3],
      [0.0039, 2],
      [0.00335, 2],
      [-0.0015, 3],
      [0.0032, 2],
      [-0.00254, 3],
      [0.00297, 2],
      [-0.01997, 0],
      [-0.00163, 3],
      [-0.00163, 3],
      [-0.0015, 3],
      [-0.02031, 0],
      [-0.0018, 3],
      [-0.00216, 3],
      [-0.00205, 3],
      [0.00356, 2],
      [-0.0227, 0],
      [-0.00195, 3],
      [0.02576, 1],
      [-0.00206, 3],
      [-0.02281, 0],
      [-0.00201, 3]
    ],
    "red_o_points": [],
    "y_categories": ["N", "NOT APPLICABLE", "Y", "nan"],
    "blue_o_points": [],
    "blue_x_points": [
      [0.04203, 1],
      [-0.00142, 3],
      [0.00604, 2],
      [0.00722, 2],
      [-0.0005, 3],
      [0.03342, 1],
      [0.02657, 1],
      [0.00472, 2],
      [-0.00141, 3],
      [-0.00097, 3],
      [0.00589, 2],
      [0.02993, 1],
      [-0.00107, 3],
      [0.02946, 1],
      [-0.00124, 3]
    ]
  },
  "QA_intPexForearmProna": {
    "red_x_points": [
      [-0.00048, 2],
      [-0.00096, 0],
      [-0.00055, 2],
      [-0.00018, 2],
      [-0.00055, 2],
      [-0.00175, 0],
      [-0.00048, 2],
      [-0.01805, 0],
      [-0.0004, 2],
      [-0.00057, 2],
      [-0.01761, 0],
      [-0.00178, 0],
      [-0.0004, 2],
      [-0.00043, 2],
      [-0.0, 2],
      [-0.01819, 0],
      [-0.01758, 0],
      [-0.01685, 0],
      [-0.00121, 0],
      [-0.00024, 2],
      [-0.00046, 2],
      [-0.00043, 2],
      [-0.00046, 2],
      [-0.00047, 2],
      [0.00052, 2],
      [0.0005, 1],
      [0.00046, 2],
      [-0.00166, 0],
      [-0.00049, 2]
    ],
    "red_o_points": [],
    "y_categories": ["GREATER THAN OR EQUALS TO 80", "LESS THAN 80", "nan"],
    "blue_o_points": [],
    "blue_x_points": [
      [-0.00034, 2],
      [0.05009, 1],
      [-0.0005, 0],
      [-0.00032, 2],
      [0.00107, 2],
      [2e-5, 2],
      [0.00097, 1],
      [8e-5, 2],
      [0.00024, 2],
      [0.00111, 2],
      [-0.00035, 0],
      [2e-5, 2],
      [0.0012, 2],
      [4e-5, 2],
      [0.04742, 1]
    ]
  },
  "QA_yonInjChesttube": {
    "red_x_points": [
      [-0.0028, 2],
      [-0.00266, 2],
      [0.00162, 0],
      [-0.00146, 2],
      [-0.00394, 2],
      [0.00152, 0],
      [-0.00513, 1],
      [-0.00199, 2],
      [-0.00422, 2],
      [-0.00398, 2],
      [0.00128, 0],
      [0.00356, 0],
      [-0.00372, 2],
      [-0.00358, 2],
      [0.00064, 0],
      [0.00127, 0],
      [0.00124, 0],
      [0.00144, 0],
      [-0.00488, 1],
      [-0.00207, 2],
      [-0.01773, 1],
      [-0.00318, 2],
      [-0.00402, 2],
      [0.00336, 0],
      [-0.00259, 2],
      [-0.00015, 2],
      [-0.00251, 2],
      [0.00051, 0],
      [-0.00323, 2]
    ],
    "red_o_points": [],
    "y_categories": ["N", "Y", "nan"],
    "blue_o_points": [],
    "blue_x_points": [
      [0.00016, 1],
      [-0.00134, 2],
      [0.00477, 0],
      [0.0069, 0],
      [-0.00198, 2],
      [-5e-5, 2],
      [0.00731, 0],
      [0.01737, 0],
      [0.01552, 0],
      [0.00426, 0],
      [-7e-5, 2],
      [0.00481, 0],
      [-8e-5, 2],
      [-0.00017, 2]
    ]
  },
  "QA_yonPexPain": {
    "red_x_points": [
      [-0.00729, 1],
      [-0.00085, 1],
      [-0.00121, 1],
      [-0.00066, 1],
      [-0.00097, 1],
      [-0.00211, 0],
      [-0.00041, 1],
      [-0.00714, 1],
      [-0.00304, 0],
      [-0.00118, 1],
      [-0.00396, 1],
      [-0.00117, 0],
      [-0.00921, 1],
      [-0.00093, 1],
      [-0.00057, 1],
      [0.00606, 0],
      [-0.00434, 1],
      [0.00405, 0],
      [-0.00058, 1],
      [0.00883, 0],
      [-0.02068, 2],
      [-0.00882, 1],
      [-0.00011, 1],
      [-0.00124, 1],
      [-0.01453, 2],
      [-0.00145, 1],
      [-0.00769, 1],
      [-0.00033, 1],
      [-0.00904, 1]
    ],
    "red_o_points": [],
    "y_categories": ["N", "Y", "nan"],
    "blue_o_points": [],
    "blue_x_points": [
      [-0.00031, 1],
      [0.02364, 0],
      [0.0051, 0],
      [0.00124, 1],
      [-0.00495, 1],
      [0.00063, 2],
      [0.00428, 1],
      [0.02813, 0],
      [0.02007, 0],
      [0.00114, 1],
      [0.00207, 0],
      [0.00945, 0],
      [-0.00034, 1],
      [0.00042, 1]
    ]
  },
  "QS_mulGraftNerve[FI]": {
    "red_x_points": [
      [-2e-5, 2],
      [-0.00013, 0],
      [-0.00023, 0],
      [-7e-5, 0],
      [-0.00013, 0],
      [-0.0001, 0],
      [-0.00015, 0],
      [-3e-5, 2],
      [-0.00027, 0],
      [-6e-5, 0],
      [-1e-5, 2],
      [-0.00025, 0],
      [-3e-5, 2],
      [-0.00033, 0],
      [-0.00017, 0],
      [-1e-5, 2],
      [-1e-5, 2],
      [-2e-5, 2],
      [-6e-5, 0],
      [-3e-5, 2],
      [-3e-5, 2],
      [-4e-5, 2],
      [-0.00013, 0],
      [-0.0002, 0],
      [-1e-5, 2],
      [0.0001, 1],
      [-4e-5, 2],
      [-0.0001, 0],
      [-4e-5, 2]
    ],
    "red_o_points": [],
    "y_categories": ["N", "NOT APPLICABLE", "nan"],
    "blue_o_points": [],
    "blue_x_points": [
      [0.00071, 1],
      [-2e-5, 2],
      [0.00013, 0],
      [-6e-5, 0],
      [0.0, 2],
      [0.00039, 1],
      [0.00032, 1],
      [-0.00014, 0],
      [1e-5, 2],
      [-1e-5, 2],
      [-6e-5, 0],
      [0.00069, 1],
      [-3e-5, 2],
      [0.00066, 1],
      [-3e-5, 2]
    ]
  },
  "QA_lstPexPalle[Ulna]": {
    "red_x_points": [
      [-0.00078, 4],
      [-0.00247, 4],
      [-0.00224, 4],
      [-0.00674, 2],
      [-0.00326, 4],
      [-0.01148, 1],
      [-0.00283, 4],
      [-0.00044, 4],
      [-0.00385, 4],
      [0.01059, 3],
      [-0.00994, 1],
      [-0.00325, 4],
      [-0.00086, 4],
      [-0.00367, 4],
      [-0.00109, 4],
      [0.00567, 3],
      [-0.01088, 0],
      [0.00335, 3],
      [-0.00725, 0],
      [0.00496, 3],
      [-0.00074, 4],
      [-0.00079, 4],
      [-0.00358, 4],
      [-0.00282, 4],
      [-0.00043, 4],
      [0.0025, 3],
      [-0.00023, 4],
      [-0.0071, 0],
      [-0.00074, 4]
    ],
    "red_o_points": [],
    "y_categories": ["ABS", "HYPO", "NAIA", "PT", "nan"],
    "blue_o_points": [],
    "blue_x_points": [
      [-0.00057, 4],
      [-4e-5, 4],
      [0.01633, 3],
      [0.0173, 3],
      [0.00021, 4],
      [-0.0001, 4],
      [0.0022, 3],
      [-0.00248, 4],
      [-0.00015, 4],
      [0.00029, 4],
      [0.01421, 3],
      [-0.00024, 4],
      [0.0041, 3],
      [-0.00012, 4],
      [0.00948, 3]
    ]
  }
}
