{
  "QS_mulTransfSite[TrAx]": {
    "red_x_points": [
      [-1e-5, 2],
      [-1e-5, 0],
      [-1e-5, 0],
      [-1e-5, 0],
      [-1e-5, 0],
      [-1e-5, 0],
      [-1e-5, 2],
      [-1e-5, 0],
      [-1e-5, 0],
      [-1e-5, 0],
      [-1e-5, 2],
      [-1e-5, 0],
      [-1e-5, 2],
      [-1e-5, 2],
      [-1e-5, 2],
      [-1e-5, 2],
      [-1e-5, 2],
      [-1e-5, 0],
      [-1e-5, 0]
    ],
    "red_o_points": [],
    "y_categories": ["N", "NOT APPLICABLE", "nan"],
    "blue_o_points": [],
    "blue_x_points": [[0.00019, 1]]
  },
  "QS_mulLysisTrunk[Upper]": {
    "red_x_points": [
      [-0.00159, 3],
      [-0.00349, 0],
      [-0.00354, 0],
      [-0.00355, 0],
      [-0.0034, 0],
      [-0.00612, 2],
      [-0.00346, 0],
      [-0.00194, 3],
      [-0.00383, 0],
      [-0.00357, 0],
      [-0.00341, 0],
      [-0.00177, 3],
      [0.00965, 1],
      [-0.00197, 3],
      [-0.00399, 0],
      [-0.00228, 3],
      [-0.00585, 2],
      [-0.00368, 0],
      [-0.00155, 3],
      [-0.00171, 3],
      [-0.00172, 3],
      [-0.00314, 0],
      [-0.00186, 3],
      [-0.00206, 3],
      [-0.00205, 3],
      [-0.00314, 0],
      [-0.00184, 3],
      [-0.00397, 0],
      [-0.00143, 3],
      [0.00893, 1],
      [-0.00539, 2]
    ],
    "red_o_points": [],
    "y_categories": ["N", "NOT APPLICABLE", "Y", "nan"],
    "blue_o_points": [],
    "blue_x_points": [
      [0.01415, 1],
      [-0.00041, 3],
      [0.01082, 1],
      [-0.00176, 0],
      [-0.00051, 3],
      [0.01045, 1],
      [0.01078, 1]
    ]
  },
  "QS_mulBpsurgeryType[Transf]": {
    "red_x_points": [
      [-0.00049, 3],
      [-0.00055, 2],
      [-0.0015, 0],
      [-0.00051, 2],
      [-0.00053, 2],
      [-0.00057, 2],
      [-0.00051, 2],
      [-0.00049, 3],
      [-0.00063, 2],
      [-0.00047, 2],
      [-0.00054, 2],
      [-0.00049, 3],
      [0.00194, 1],
      [-0.00042, 3],
      [-0.00039, 2],
      [-0.00055, 3],
      [-0.00059, 2],
      [-0.00047, 2],
      [-0.00044, 3],
      [-0.00061, 3],
      [-0.00034, 3],
      [-0.00053, 2],
      [-0.00045, 3],
      [-0.00053, 3],
      [-0.0004, 3],
      [-0.0005, 2],
      [-0.00038, 3],
      [-0.00051, 2],
      [-0.00038, 3],
      [0.00162, 1],
      [-0.00059, 2]
    ],
    "red_o_points": [],
    "y_categories": ["N", "NOT APPLICABLE", "Y", "nan"],
    "blue_o_points": [],
    "blue_x_points": [
      [0.0022, 1],
      [-0.0002, 3],
      [0.00215, 1],
      [-0.00057, 2],
      [-0.00023, 3],
      [0.00222, 1],
      [0.00214, 1]
    ]
  },
  "QS_mulTransfSite[MPAx]": {
    "red_x_points": [
      [-1e-5, 2],
      [-5e-5, 0],
      [-5e-5, 0],
      [-5e-5, 0],
      [-5e-5, 0],
      [-5e-5, 0],
      [-5e-5, 0],
      [-5e-5, 0],
      [0.0001, 1],
      [-1e-5, 2],
      [-5e-5, 0],
      [-1e-5, 2],
      [-1e-5, 2],
      [-5e-5, 0],
      [-1e-5, 2],
      [-1e-5, 2],
      [-1e-5, 2],
      [-5e-5, 0],
      [-1e-5, 2],
      [-5e-5, 0],
      [-1e-5, 2],
      [0.0001, 1],
      [-5e-5, 0]
    ],
    "red_o_points": [],
    "y_categories": ["N", "NOT APPLICABLE", "nan"],
    "blue_o_points": [],
    "blue_x_points": [[0.0001, 1], [-1e-5, 2], [-1e-5, 2], [0.0001, 1]]
  },
  "QS_mulTransfSite[Double]": {
    "red_x_points": [
      [-1e-5, 2],
      [-5e-5, 0],
      [-5e-5, 0],
      [-5e-5, 0],
      [-5e-5, 0],
      [-5e-5, 0],
      [-5e-5, 0],
      [-5e-5, 0],
      [-1e-5, 2],
      [0.0001, 1],
      [-1e-5, 2],
      [-1e-5, 2],
      [-5e-5, 0],
      [-1e-5, 2],
      [-1e-5, 2],
      [-1e-5, 2],
      [-5e-5, 0],
      [-1e-5, 2],
      [-1e-5, 2],
      [-5e-5, 0],
      [-1e-5, 2],
      [0.0001, 1],
      [-5e-5, 0]
    ],
    "red_o_points": [],
    "y_categories": ["N", "NOT APPLICABLE", "nan"],
    "blue_o_points": [],
    "blue_x_points": [[0.0001, 1], [-1e-5, 2], [0.0001, 1], [0.0001, 1]]
  },
  "QS_mulGraftRoot[T1]": {
    "red_x_points": [
      [-9e-5, 2],
      [-2e-5, 0],
      [-4e-5, 0],
      [-4e-5, 0],
      [-8e-5, 0],
      [-2e-5, 0],
      [-4e-5, 0],
      [-2e-5, 2],
      [-2e-5, 0],
      [-0.0001, 0],
      [-2e-5, 0],
      [-2e-5, 2],
      [-0.00021, 1],
      [-1e-5, 2],
      [-2e-5, 0],
      [-1e-5, 2],
      [0.0, 0],
      [-2e-5, 0],
      [-2e-5, 2],
      [-2e-5, 2],
      [-7e-5, 2],
      [-2e-5, 0],
      [-1e-5, 2],
      [-7e-5, 2],
      [-1e-5, 2],
      [-2e-5, 0],
      [-2e-5, 2],
      [-8e-5, 0],
      [-0.0, 2],
      [3e-5, 1]
    ],
    "red_o_points": [],
    "y_categories": ["N", "NOT APPLICABLE", "nan"],
    "blue_o_points": [],
    "blue_x_points": [
      [0.00027, 1],
      [6e-5, 2],
      [0.00022, 1],
      [5e-5, 0],
      [0.0, 2]
    ]
  },
  "QS_mulGraftTrunk[MiddleTrunk]": {
    "red_x_points": [
      [-1e-5, 2],
      [-0.00018, 0],
      [-0.00014, 0],
      [-0.00014, 0],
      [-0.00014, 0],
      [-0.00013, 0],
      [-0.00018, 0],
      [2e-5, 2],
      [-0.00018, 0],
      [-5e-5, 0],
      [-0.00017, 0],
      [-0.0, 2],
      [0.00019, 1],
      [1e-5, 2],
      [-8e-5, 0],
      [1e-5, 2],
      [-0.00013, 0],
      [-0.00014, 0],
      [-1e-5, 2],
      [-1e-5, 2],
      [0.0, 2],
      [-0.00014, 0],
      [1e-5, 2],
      [-0.0, 2],
      [-0.0, 2],
      [-0.00013, 0],
      [-1e-5, 2],
      [-0.00013, 0],
      [0.0, 2],
      [0.00029, 1],
      [-9e-5, 0]
    ],
    "red_o_points": [],
    "y_categories": ["N", "NOT APPLICABLE", "nan"],
    "blue_o_points": [],
    "blue_x_points": [
      [0.00019, 1],
      [1e-5, 2],
      [0.00023, 1],
      [-3e-5, 0],
      [1e-5, 2],
      [0.00018, 1],
      [0.00059, 1]
    ]
  },
  "QS_mulGraftNerve[Me]": {
    "red_x_points": [
      [-0.00034, 2],
      [-0.00097, 0],
      [-0.00092, 0],
      [-0.00108, 0],
      [-0.00126, 0],
      [-0.00088, 0],
      [-0.00101, 0],
      [-0.00035, 2],
      [-0.00107, 0],
      [-0.00102, 0],
      [-0.00099, 0],
      [-0.00027, 2],
      [0.00164, 1],
      [-0.00021, 2],
      [-0.00116, 0],
      [-0.0001, 2],
      [-0.00086, 0],
      [-0.00089, 0],
      [-0.00037, 2],
      [-0.00021, 2],
      [-0.00017, 2],
      [-0.00106, 0],
      [-0.00015, 2],
      [-0.00019, 2],
      [-0.0003, 2],
      [-0.00092, 0],
      [-0.00025, 2],
      [-0.00108, 0],
      [-0.00027, 2],
      [0.00195, 1],
      [-0.00098, 0]
    ],
    "red_o_points": [],
    "y_categories": ["N", "NOT APPLICABLE", "nan"],
    "blue_o_points": [],
    "blue_x_points": [
      [0.00338, 1],
      [-5e-5, 2],
      [0.00223, 1],
      [-0.00018, 0],
      [-5e-5, 2],
      [0.00231, 1],
      [0.00276, 1]
    ]
  },
  "QS_mulGraftNerve[Ph]": {
    "red_x_points": [
      [-0.00055, 2],
      [-0.00106, 0],
      [-0.00136, 0],
      [-0.00116, 0],
      [-0.00138, 0],
      [-0.00099, 0],
      [-0.00113, 0],
      [-0.00049, 2],
      [-0.00122, 0],
      [-0.0012, 0],
      [-0.00112, 0],
      [-0.00055, 2],
      [0.00226, 1],
      [-0.00048, 2],
      [-0.00145, 0],
      [-0.00052, 2],
      [-0.00105, 0],
      [-0.00144, 0],
      [-0.00065, 2],
      [-0.00044, 2],
      [-0.00051, 2],
      [-0.00118, 0],
      [-0.00046, 2],
      [-0.00085, 2],
      [-0.00047, 2],
      [-0.00129, 0],
      [-0.00051, 2],
      [-0.00128, 0],
      [-0.00041, 2],
      [0.00257, 1],
      [-0.00111, 0]
    ],
    "red_o_points": [],
    "y_categories": ["N", "NOT APPLICABLE", "nan"],
    "blue_o_points": [],
    "blue_x_points": [
      [0.00426, 1],
      [-0.0002, 2],
      [0.00397, 1],
      [-0.00015, 0],
      [-0.0002, 2],
      [0.00324, 1],
      [0.00361, 1]
    ]
  },
  "QS_mulLysisDivision[ADivisionMTrunk]": {
    "red_x_points": [
      [-1e-5, 2],
      [-1e-5, 0],
      [-1e-5, 0],
      [-1e-5, 0],
      [-1e-5, 0],
      [-1e-5, 0],
      [-1e-5, 2],
      [-1e-5, 0],
      [-1e-5, 2],
      [-1e-5, 2],
      [-1e-5, 2],
      [-1e-5, 2],
      [-1e-5, 2],
      [-1e-5, 0],
      [-1e-5, 0]
    ],
    "red_o_points": [],
    "y_categories": ["N", "NOT APPLICABLE", "nan"],
    "blue_o_points": [],
    "blue_x_points": [[0.00019, 1]]
  },
  "QA_mulInjOrthesisType[ArmSling]": {
    "red_x_points": [
      [-0.00882, 2],
      [-0.00766, 2],
      [-0.00786, 2],
      [-0.0079, 2],
      [-0.00769, 2],
      [-0.00819, 2],
      [-0.00791, 2],
      [-0.00844, 2],
      [-0.00802, 2],
      [-0.00723, 2],
      [-0.00801, 2],
      [-0.0082, 2],
      [0.02107, 1],
      [-0.00905, 2],
      [-0.0079, 2],
      [-0.00805, 2],
      [-0.00897, 0],
      [-0.00804, 2],
      [-0.00861, 2],
      [-0.00817, 2],
      [-0.01047, 0],
      [-0.00925, 3],
      [-0.00869, 2],
      [0.02472, 1],
      [-0.00848, 2],
      [-0.00788, 2],
      [-0.00822, 2],
      [-0.00783, 2],
      [-0.01011, 3],
      [-0.01354, 3],
      [-0.00715, 2]
    ],
    "red_o_points": [],
    "y_categories": ["N", "NOT APPLICABLE", "Y", "nan"],
    "blue_o_points": [],
    "blue_x_points": [
      [-0.00318, 2],
      [0.02446, 1],
      [0.01999, 1],
      [0.02488, 1],
      [0.02348, 1],
      [0.02043, 1],
      [0.02086, 1]
    ]
  },
  "QS_mulGraftRoot[C4]": {
    "red_x_points": [
      [-5e-5, 2],
      [-8e-5, 0],
      [-8e-5, 0],
      [-8e-5, 0],
      [-3e-5, 0],
      [-3e-5, 0],
      [-8e-5, 0],
      [-5e-5, 2],
      [-8e-5, 0],
      [-8e-5, 0],
      [-8e-5, 0],
      [-9e-5, 2],
      [0.00021, 1],
      [-9e-5, 2],
      [-8e-5, 0],
      [-9e-5, 2],
      [-5e-5, 0],
      [-9e-5, 2],
      [-5e-5, 2],
      [-8e-5, 0],
      [-5e-5, 2],
      [-9e-5, 2],
      [-9e-5, 2],
      [-5e-5, 2],
      [-3e-5, 0],
      [-9e-5, 2],
      [0.00021, 1],
      [-5e-5, 0]
    ],
    "red_o_points": [],
    "y_categories": ["N", "NOT APPLICABLE", "nan"],
    "blue_o_points": [],
    "blue_x_points": [
      [0.00021, 1],
      [0.0001, 1],
      [-3e-5, 0],
      [0.00011, 1],
      [0.00021, 1]
    ]
  },
  "QA_lstPexPain[C6]": {
    "red_x_points": [
      [-0.00013, 1],
      [-0.00011, 2],
      [-0.00013, 2],
      [-9e-5, 2],
      [-0.00082, 0],
      [0.00016, 1],
      [0.00014, 1],
      [-0.00057, 0],
      [0.00014, 1],
      [0.00023, 1],
      [8e-5, 1],
      [-0.00021, 1],
      [-0.0005, 2],
      [0.00012, 2],
      [-0.0001, 2],
      [-7e-5, 2],
      [-0.0001, 2],
      [0.00019, 1],
      [-0.00078, 0],
      [-0.00017, 1],
      [-0.00015, 1],
      [-0.00011, 2],
      [0.00023, 2],
      [-0.00503, 0],
      [0.00013, 2],
      [-0.00027, 2],
      [-0.00042, 1],
      [-0.00023, 2],
      [-0.00027, 1],
      [5e-5, 1],
      [8e-5, 1]
    ],
    "red_o_points": [],
    "y_categories": ["NORM", "NPV", "nan"],
    "blue_o_points": [],
    "blue_x_points": [
      [0.00015, 1],
      [0.0005, 2],
      [0.00085, 1],
      [0.00145, 1],
      [0.00045, 2],
      [0.00093, 1],
      [0.00094, 1]
    ]
  },
  "QS_mulGraftLevel[Nerve]": {
    "red_x_points": [
      [0.0, 2],
      [-9e-5, 0],
      [-9e-5, 0],
      [-9e-5, 0],
      [-0.0001, 0],
      [-6e-5, 0],
      [-9e-5, 0],
      [-4e-5, 2],
      [-0.0001, 0],
      [-9e-5, 0],
      [-9e-5, 0],
      [-2e-5, 2],
      [-4e-5, 1],
      [8e-5, 2],
      [-1e-5, 0],
      [-5e-5, 2],
      [-0.0001, 0],
      [-8e-5, 0],
      [-1e-5, 2],
      [0.0, 2],
      [1e-5, 2],
      [-8e-5, 0],
      [-1e-5, 2],
      [-4e-5, 2],
      [-1e-5, 2],
      [-0.0001, 0],
      [0.0, 2],
      [-1e-5, 0],
      [-1e-5, 2],
      [9e-5, 1],
      [-4e-5, 0]
    ],
    "red_o_points": [],
    "y_categories": ["N", "NOT APPLICABLE", "nan"],
    "blue_o_points": [],
    "blue_x_points": [
      [0.00029, 1],
      [8e-5, 2],
      [0.00026, 1],
      [3e-5, 0],
      [7e-5, 2],
      [0.00015, 1],
      [0.00015, 1]
    ]
  },
  "QA_lstPexInspectio[SurgicalScar]": {
    "red_x_points": [
      [0.00164, 1],
      [0.001, 1],
      [0.00029, 0],
      [0.00099, 1],
      [-0.00313, 2],
      [-0.00033, 0],
      [0.00083, 1],
      [0.00161, 1],
      [0.00103, 1],
      [-0.00273, 2],
      [0.00107, 1],
      [-0.00107, 0],
      [-0.00087, 1],
      [-0.00471, 2],
      [0.00114, 1],
      [0.00195, 1],
      [-0.00074, 0],
      [-0.00364, 2],
      [-0.00398, 2],
      [-0.00328, 2],
      [0.00167, 1],
      [0.00088, 1],
      [-0.00472, 2],
      [-0.00941, 2],
      [0.00158, 1],
      [0.00111, 1],
      [-0.00417, 2],
      [-0.00265, 2],
      [0.00162, 1],
      [-0.00121, 1],
      [-0.00258, 2]
    ],
    "red_o_points": [],
    "y_categories": ["ABS", "NAIA", "PT", "nan"],
    "blue_o_points": [],
    "blue_x_points": [
      [3e-5, 1],
      [0.00319, 1],
      [0.00381, 0],
      [0.00359, 1],
      [0.00372, 1],
      [0.00045, 1],
      [0.00373, 0]
    ]
  },
  "QA_intPexWristFlex": {
    "red_x_points": [[0.00072, 2], [-0.01229, 1]],
    "red_o_points": [],
    "y_categories": ["GREATER THAN OR EQUALS TO 60", "LESS THAN 60", "nan"],
    "blue_o_points": [],
    "blue_x_points": [[0.00133, 2], [0.0049, 0], [0.00091, 2], [0.00118, 2]]
  },
  "QA_lstPexArthre[Shoulder]": {
    "red_x_points": [
      [0.00015, 2],
      [-0.00017, 3],
      [-0.00033, 3],
      [-0.00033, 0],
      [0.00014, 2],
      [0.00022, 2],
      [-0.00076, 1],
      [-6e-5, 3],
      [0.00039, 2],
      [0.00015, 2],
      [9e-5, 2],
      [4e-5, 2],
      [-6e-5, 3],
      [-0.0, 3],
      [0.00016, 2],
      [-0.00019, 3],
      [-0.00016, 3],
      [-0.00134, 1],
      [2e-5, 2],
      [-9e-5, 1],
      [0.0001, 2],
      [-0.00033, 3],
      [-0.0, 3],
      [9e-5, 2],
      [-0.0, 3],
      [-0.00041, 3],
      [6e-5, 2],
      [-0.0001, 3],
      [4e-5, 2],
      [-0.0, 3],
      [-0.0004, 1]
    ],
    "red_o_points": [],
    "y_categories": ["NAIA", "NPV", "PV", "nan"],
    "blue_o_points": [],
    "blue_x_points": [
      [0.00014, 2],
      [-0.0, 3],
      [0.00011, 2],
      [0.0016, 2],
      [0.00012, 3],
      [3e-5, 2],
      [-0.0, 3]
    ]
  },
  "QS_mulGraftRoot[C7]": {
    "red_x_points": [
      [-2e-5, 2],
      [-5e-5, 0],
      [-5e-5, 0],
      [-5e-5, 0],
      [-5e-5, 0],
      [-2e-5, 2],
      [-5e-5, 0],
      [-5e-5, 0],
      [0.00012, 1],
      [-2e-5, 2],
      [-5e-5, 0],
      [-2e-5, 2],
      [-5e-5, 0],
      [-5e-5, 0],
      [-2e-5, 2],
      [-2e-5, 2],
      [-2e-5, 2],
      [-2e-5, 2],
      [-2e-5, 2],
      [-5e-5, 0],
      [-2e-5, 2],
      [-2e-5, 2],
      [-5e-5, 0]
    ],
    "red_o_points": [],
    "y_categories": ["N", "NOT APPLICABLE", "nan"],
    "blue_o_points": [],
    "blue_x_points": [[0.00012, 1], [-2e-5, 2], [0.00012, 1], [0.00012, 1]]
  },
  "QS_mulLysisNerve[other]": {
    "red_x_points": [
      [-1e-5, 0],
      [-1e-5, 0],
      [-1e-5, 0],
      [-1e-5, 2],
      [-1e-5, 0],
      [-1e-5, 0],
      [-1e-5, 2],
      [-1e-5, 0],
      [-1e-5, 2],
      [-1e-5, 2],
      [-1e-5, 0],
      [-1e-5, 2],
      [-1e-5, 2],
      [-1e-5, 0],
      [-1e-5, 2],
      [-1e-5, 2]
    ],
    "red_o_points": [],
    "y_categories": ["N", "NOT APPLICABLE", "nan"],
    "blue_o_points": [],
    "blue_x_points": [[0.00019, 1]]
  },
  "QS_mulLysisSite[Trunk]": {
    "red_x_points": [
      [-0.0019, 3],
      [-0.00359, 0],
      [-0.00378, 0],
      [-0.00332, 0],
      [-0.00384, 0],
      [-0.00593, 2],
      [-0.00343, 0],
      [-0.00201, 3],
      [-0.00349, 0],
      [-0.00321, 0],
      [-0.0033, 0],
      [-0.00239, 3],
      [0.00926, 1],
      [-0.00206, 3],
      [-0.00363, 0],
      [-0.00205, 3],
      [-0.00561, 2],
      [-0.00324, 0],
      [-0.00181, 3],
      [-0.00176, 3],
      [-0.00238, 3],
      [-0.00348, 0],
      [-0.00186, 3],
      [-0.00204, 3],
      [-0.00191, 3],
      [-0.00321, 0],
      [-0.00203, 3],
      [-0.00341, 0],
      [-0.00176, 3],
      [0.00877, 1],
      [-0.00534, 2]
    ],
    "red_o_points": [],
    "y_categories": ["N", "NOT APPLICABLE", "Y", "nan"],
    "blue_o_points": [],
    "blue_x_points": [
      [0.01285, 1],
      [-0.00063, 3],
      [0.01084, 1],
      [-0.00225, 0],
      [-0.00056, 3],
      [0.01083, 1],
      [0.0121, 1]
    ]
  },
  "QS_mulTransfSite[PhMc]": {
    "red_x_points": [
      [-0.0011, 3],
      [-0.00266, 0],
      [-0.00267, 0],
      [-0.00271, 0],
      [-0.00232, 0],
      [-0.00247, 0],
      [-0.00471, 2],
      [-0.00132, 3],
      [-0.00267, 0],
      [-0.00248, 0],
      [-0.00251, 0],
      [-0.00143, 3],
      [0.00672, 1],
      [-0.00151, 3],
      [-0.00245, 0],
      [-0.0018, 3],
      [-0.00237, 0],
      [-0.0024, 0],
      [-0.00141, 3],
      [-0.00139, 3],
      [-0.00138, 3],
      [-0.0048, 2],
      [-0.00152, 3],
      [-0.00119, 3],
      [-0.00159, 3],
      [-0.00231, 0],
      [-0.00129, 3],
      [-0.00251, 0],
      [-0.00114, 3],
      [0.00667, 1],
      [-0.00232, 0]
    ],
    "red_o_points": [],
    "y_categories": ["N", "NOT APPLICABLE", "Y", "nan"],
    "blue_o_points": [],
    "blue_x_points": [
      [0.00919, 1],
      [-0.00024, 3],
      [0.00808, 1],
      [-0.00094, 0],
      [-0.00028, 3],
      [0.00827, 1],
      [0.00794, 1]
    ]
  },
  "QS_mulLysisRoot[C6]": {
    "red_x_points": [
      [-0.00114, 3],
      [-0.00246, 0],
      [-0.00393, 2],
      [-0.00212, 0],
      [-0.00236, 0],
      [-0.00229, 0],
      [-0.0025, 0],
      [-0.00083, 3],
      [-0.00239, 0],
      [-0.00196, 0],
      [-0.00226, 0],
      [-0.00121, 3],
      [0.00641, 1],
      [-0.00098, 3],
      [-0.00207, 0],
      [-0.00111, 3],
      [-0.00226, 0],
      [-0.00246, 0],
      [-0.00121, 3],
      [-0.00126, 3],
      [-0.00119, 3],
      [-0.0022, 0],
      [-0.00104, 3],
      [-0.0013, 3],
      [-0.00102, 3],
      [-0.00235, 0],
      [-0.00103, 3],
      [-0.00244, 0],
      [-0.00125, 3],
      [0.0064, 1],
      [-0.00315, 2]
    ],
    "red_o_points": [],
    "y_categories": ["N", "NOT APPLICABLE", "Y", "nan"],
    "blue_o_points": [],
    "blue_x_points": [
      [0.00806, 1],
      [-0.00053, 3],
      [0.00707, 1],
      [-0.00165, 0],
      [-0.00035, 3],
      [0.00601, 1],
      [0.00747, 1]
    ]
  },
  "QA_yonInjOrtsurg": {
    "red_x_points": [
      [-0.00305, 2],
      [-0.00038, 2],
      [-3e-5, 2],
      [-5e-5, 2],
      [-1e-5, 2],
      [-1e-5, 2],
      [-0.00017, 1],
      [-0.00369, 2],
      [0.00015, 0],
      [-0.00022, 1],
      [-0.00026, 1],
      [-0.00352, 2],
      [-0.00261, 0],
      [0.00067, 1],
      [-0.00023, 2],
      [-0.00377, 2],
      [-0.00014, 0],
      [-1e-5, 2],
      [0.00444, 0],
      [0.00019, 1],
      [-0.00361, 2],
      [-0.00019, 1],
      [-0.00427, 2],
      [-0.00367, 2],
      [-0.00373, 2],
      [2e-5, 0],
      [-0.00032, 1],
      [0.00015, 0],
      [-0.00369, 2],
      [-0.00181, 1],
      [-0.00012, 1]
    ],
    "red_o_points": [],
    "y_categories": ["N", "Y", "nan"],
    "blue_o_points": [],
    "blue_x_points": [
      [0.00059, 2],
      [0.00382, 1],
      [0.00048, 2],
      [0.00014, 2],
      [0.01409, 0],
      [0.00063, 2],
      [0.00047, 2]
    ]
  },
  "QS_mulGraftNerve[other]": {
    "red_x_points": [
      [-0.0008, 2],
      [-0.00231, 0],
      [-0.00204, 0],
      [-0.00226, 0],
      [-0.00195, 0],
      [-0.00195, 0],
      [-0.00211, 0],
      [-0.00075, 2],
      [-0.00229, 0],
      [-0.00227, 0],
      [-0.00199, 0],
      [-0.00134, 2],
      [0.00322, 1],
      [-0.0007, 2],
      [-0.00277, 0],
      [-0.00104, 2],
      [-0.00221, 0],
      [-0.002, 0],
      [-0.00115, 2],
      [-0.00089, 2],
      [-0.00087, 2],
      [-0.00212, 0],
      [-0.00095, 2],
      [-0.00092, 2],
      [-0.00086, 2],
      [-0.00185, 0],
      [-0.00082, 2],
      [-0.00195, 0],
      [-0.00069, 2],
      [0.00411, 1],
      [-0.00216, 0]
    ],
    "red_o_points": [],
    "y_categories": ["N", "NOT APPLICABLE", "nan"],
    "blue_o_points": [],
    "blue_x_points": [
      [0.00796, 1],
      [-2e-5, 2],
      [0.00627, 1],
      [-0.00043, 0],
      [3e-5, 2],
      [0.00505, 1],
      [0.00693, 1]
    ]
  },
  "QS_mulGraftNerve[DS]": {
    "red_x_points": [
      [-1e-5, 2],
      [-0.0001, 0],
      [-0.00015, 0],
      [-5e-5, 0],
      [-0.00015, 0],
      [-0.00015, 0],
      [-7e-5, 0],
      [-4e-5, 2],
      [-0.00015, 0],
      [-7e-5, 0],
      [-0.00012, 0],
      [-2e-5, 2],
      [0.00029, 1],
      [-3e-5, 2],
      [-0.00012, 0],
      [-4e-5, 2],
      [-9e-5, 0],
      [-0.00015, 0],
      [-2e-5, 2],
      [-4e-5, 2],
      [-1e-5, 2],
      [-8e-5, 0],
      [-3e-5, 2],
      [-2e-5, 2],
      [-4e-5, 2],
      [-8e-5, 0],
      [-2e-5, 2],
      [-0.0001, 0],
      [-2e-5, 2],
      [0.00017, 1],
      [-8e-5, 0]
    ],
    "red_o_points": [],
    "y_categories": ["N", "NOT APPLICABLE", "nan"],
    "blue_o_points": [],
    "blue_x_points": [
      [0.00039, 1],
      [-2e-5, 2],
      [0.00017, 1],
      [-3e-5, 0],
      [-2e-5, 2],
      [0.00021, 1],
      [0.00029, 1]
    ]
  },
  "QS_mulGraftNerve[LP]": {
    "red_x_points": [
      [-3e-5, 2],
      [-0.0001, 0],
      [-3e-5, 0],
      [-0.00017, 0],
      [-9e-5, 0],
      [-9e-5, 0],
      [-0.00017, 0],
      [-0.00015, 2],
      [-9e-5, 0],
      [-0.00017, 0],
      [-0.00014, 0],
      [-0.00015, 2],
      [0.00017, 1],
      [-0.0001, 2],
      [-0.00018, 0],
      [-0.00014, 2],
      [-0.00013, 0],
      [-0.00017, 0],
      [-0.00015, 2],
      [-7e-5, 2],
      [-0.0001, 2],
      [-0.00016, 0],
      [-0.0001, 2],
      [-5e-5, 2],
      [-0.00014, 2],
      [-8e-5, 0],
      [-4e-5, 2],
      [-0.00012, 0],
      [-6e-5, 2],
      [0.0002, 1],
      [-0.00014, 0]
    ],
    "red_o_points": [],
    "y_categories": ["N", "NOT APPLICABLE", "nan"],
    "blue_o_points": [],
    "blue_x_points": [
      [0.00089, 1],
      [0.0, 2],
      [0.00047, 1],
      [-6e-5, 0],
      [-3e-5, 2],
      [0.00047, 1],
      [0.00023, 1]
    ]
  },
  "QA_lstPexMuscstrength[WristFlex]": {
    "red_x_points": [
      [-0.00291, 1],
      [-0.00029, 2],
      [-0.0013, 1],
      [-0.00118, 1],
      [0.00055, 0],
      [0.0007, 0],
      [-0.00159, 1],
      [-0.00116, 0],
      [0.00055, 0],
      [0.00045, 0],
      [0.00052, 0],
      [-0.0008, 0],
      [-0.00062, 2],
      [0.00155, 2],
      [-0.00013, 2],
      [-0.0008, 0],
      [-0.00031, 2],
      [0.00047, 0],
      [-0.00084, 0],
      [-0.00231, 1],
      [-0.00123, 0],
      [-0.00141, 1],
      [0.00122, 2],
      [-0.00628, 1],
      [-0.00091, 0],
      [0.00067, 0],
      [-0.00277, 1],
      [0.00057, 0],
      [0.00141, 2],
      [-0.00018, 2],
      [-0.00122, 1]
    ],
    "red_o_points": [],
    "y_categories": ["GREATER THAN OR EQUALS TO 3", "LESS THAN 3", "nan"],
    "blue_o_points": [],
    "blue_x_points": [
      [0.00044, 0],
      [0.00302, 2],
      [0.00093, 0],
      [0.00213, 0],
      [0.0028, 2],
      [0.00117, 0],
      [0.00117, 0]
    ]
  },
  "QS_mulNeuromadSite[C5]": {
    "red_x_points": [
      [-0.00136, 2],
      [-0.00315, 0],
      [-0.00311, 0],
      [-0.00349, 0],
      [-0.00345, 0],
      [-0.00305, 0],
      [-0.00324, 0],
      [-0.00118, 2],
      [-0.00367, 0],
      [-0.00338, 0],
      [-0.00292, 0],
      [-0.00137, 2],
      [0.0051, 1],
      [-0.001, 2],
      [-0.00329, 0],
      [-0.0016, 2],
      [-0.00325, 0],
      [-0.00349, 0],
      [-0.00125, 2],
      [-0.00119, 2],
      [-0.00127, 2],
      [-0.00306, 0],
      [-0.00107, 2],
      [-0.00158, 2],
      [-0.00167, 2],
      [-0.0032, 0],
      [-0.00132, 2],
      [-0.0036, 0],
      [-0.00103, 2],
      [0.00664, 1],
      [-0.00317, 0]
    ],
    "red_o_points": [],
    "y_categories": ["N", "NOT APPLICABLE", "nan"],
    "blue_o_points": [],
    "blue_x_points": [
      [0.01155, 1],
      [-0.00045, 2],
      [0.00904, 1],
      [-0.00026, 0],
      [-0.0002, 2],
      [0.00829, 1],
      [0.00924, 1]
    ]
  },
  "QS_mulNeuromadSite[C7]": {
    "red_x_points": [
      [-0.00088, 2],
      [-0.00264, 0],
      [-0.00329, 0],
      [-0.00289, 0],
      [-0.00293, 0],
      [-0.0033, 0],
      [-0.00303, 0],
      [-0.00098, 2],
      [-0.0029, 0],
      [-0.00295, 0],
      [-0.00267, 0],
      [-0.0012, 2],
      [0.00578, 1],
      [-0.00092, 2],
      [-0.0029, 0],
      [-0.00102, 2],
      [-0.00263, 0],
      [-0.00302, 0],
      [-0.00108, 2],
      [-0.00098, 2],
      [-0.00089, 2],
      [-0.00269, 0],
      [-0.00108, 2],
      [-0.00092, 2],
      [-0.00111, 2],
      [-0.00292, 0],
      [-0.00084, 2],
      [-0.00317, 0],
      [-0.00092, 2],
      [0.00632, 1],
      [-0.00285, 0]
    ],
    "red_o_points": [],
    "y_categories": ["N", "NOT APPLICABLE", "nan"],
    "blue_o_points": [],
    "blue_x_points": [
      [0.00847, 1],
      [-0.00026, 2],
      [0.00768, 1],
      [-0.00031, 0],
      [-0.00017, 2],
      [0.00578, 1],
      [0.00819, 1]
    ]
  },
  "QA_lstPexMuscstrength[ShoulderInrot]": {
    "red_x_points": [
      [-0.00054, 1],
      [0.0001, 2],
      [0.0003, 0],
      [-0.00057, 1],
      [0.00027, 0],
      [-0.00052, 1],
      [4e-5, 2],
      [-0.00037, 1],
      [0.0001, 0],
      [5e-5, 2],
      [0.0, 2],
      [-0.00069, 1],
      [5e-5, 2],
      [5e-5, 2],
      [1e-5, 2],
      [4e-5, 2],
      [2e-5, 2],
      [-0.00047, 1],
      [0.00048, 0],
      [-0.00047, 1],
      [0.00015, 0],
      [4e-5, 2],
      [5e-5, 2],
      [-0.0, 2],
      [3e-5, 2],
      [-0.00051, 1],
      [5e-5, 2],
      [-0.00037, 1],
      [5e-5, 2],
      [5e-5, 2],
      [7e-5, 0]
    ],
    "red_o_points": [],
    "y_categories": ["GREATER THAN OR EQUALS TO 3", "LESS THAN 3", "nan"],
    "blue_o_points": [],
    "blue_x_points": [
      [8e-5, 2],
      [5e-5, 2],
      [0.00051, 0],
      [0.00013, 2],
      [5e-5, 2],
      [0.00045, 0],
      [0.00045, 0]
    ]
  },
  "QS_mulTransfSite[IMc]": {
    "red_x_points": [
      [-0.00173, 3],
      [-0.00574, 2],
      [-0.0037, 0],
      [-0.00364, 0],
      [-0.00377, 0],
      [-0.0034, 0],
      [-0.00384, 0],
      [-0.00158, 3],
      [-0.0036, 0],
      [-0.00337, 0],
      [-0.0037, 0],
      [-0.00169, 3],
      [0.01021, 1],
      [-0.00154, 3],
      [-0.00334, 0],
      [-0.00152, 3],
      [-0.00587, 2],
      [-0.0038, 0],
      [-0.00159, 3],
      [-0.00181, 3],
      [-0.00144, 3],
      [-0.00346, 0],
      [-0.00152, 3],
      [-0.00179, 3],
      [-0.00156, 3],
      [-0.00354, 0],
      [-0.00179, 3],
      [-0.00565, 2],
      [-0.00151, 3],
      [0.01, 1],
      [-0.00549, 2]
    ],
    "red_o_points": [],
    "y_categories": ["N", "NOT APPLICABLE", "Y", "nan"],
    "blue_o_points": [],
    "blue_x_points": [
      [0.01244, 1],
      [-0.00064, 3],
      [0.01057, 1],
      [-0.00159, 0],
      [-0.00056, 3],
      [0.01105, 1],
      [0.0118, 1]
    ]
  },
  "QS_mulGraftNerve[SS]": {
    "red_x_points": [
      [-3e-5, 2],
      [-0.00037, 0],
      [-0.00019, 0],
      [-0.0001, 0],
      [-0.00016, 0],
      [-0.00024, 0],
      [-0.00024, 0],
      [-3e-5, 2],
      [-0.00025, 0],
      [-0.00019, 0],
      [-0.00017, 0],
      [-1e-5, 2],
      [0.00018, 1],
      [2e-5, 2],
      [-0.00037, 0],
      [-2e-5, 2],
      [-0.00019, 0],
      [-0.00034, 0],
      [-4e-5, 2],
      [-2e-5, 2],
      [-1e-5, 2],
      [-0.00025, 0],
      [4e-5, 2],
      [-2e-5, 2],
      [-6e-5, 2],
      [-0.00014, 0],
      [-4e-5, 2],
      [-0.00028, 0],
      [-1e-5, 2],
      [0.00042, 1],
      [-0.00019, 0]
    ],
    "red_o_points": [],
    "y_categories": ["N", "NOT APPLICABLE", "nan"],
    "blue_o_points": [],
    "blue_x_points": [
      [0.00062, 1],
      [9e-5, 2],
      [0.00055, 1],
      [-5e-5, 0],
      [2e-5, 2],
      [0.00032, 1],
      [0.00033, 1]
    ]
  },
  "QS_mulNeuromadSite[C6]": {
    "red_x_points": [
      [-0.0009, 2],
      [-0.00227, 0],
      [-0.00198, 0],
      [-0.00197, 0],
      [-0.00211, 0],
      [-0.00219, 0],
      [-0.00185, 0],
      [-0.00107, 2],
      [-0.00217, 0],
      [-0.00206, 0],
      [-0.00183, 0],
      [-0.00121, 2],
      [0.00401, 1],
      [-0.0009, 2],
      [-0.00208, 0],
      [-0.00133, 2],
      [-0.0022, 0],
      [-0.00191, 0],
      [-0.00075, 2],
      [-0.0009, 2],
      [-0.001, 2],
      [-0.00188, 0],
      [-0.00097, 2],
      [-0.00083, 2],
      [-0.00104, 2],
      [-0.00204, 0],
      [-0.0009, 2],
      [-0.00209, 0],
      [-0.00064, 2],
      [0.0044, 1],
      [-0.00199, 0]
    ],
    "red_o_points": [],
    "y_categories": ["N", "NOT APPLICABLE", "nan"],
    "blue_o_points": [],
    "blue_x_points": [
      [0.00679, 1],
      [6e-5, 2],
      [0.00566, 1],
      [-0.00033, 0],
      [0.0, 2],
      [0.00556, 1],
      [0.00689, 1]
    ]
  },
  "QA_lstPexArthre[Index]": {
    "red_x_points": [
      [-0.00047, 0],
      [-0.00061, 2],
      [-0.00057, 2],
      [-0.00078, 0],
      [0.00032, 1],
      [0.00029, 1],
      [-0.00079, 0],
      [-9e-5, 2],
      [0.00085, 1],
      [0.0002, 1],
      [-0.00082, 0],
      [4e-5, 1],
      [-0.00022, 2],
      [-0.00018, 2],
      [0.00045, 1],
      [-0.00011, 2],
      [-0.00031, 2],
      [0.00018, 1],
      [4e-5, 1],
      [-9e-5, 0],
      [0.00011, 1],
      [-0.00055, 2],
      [-0.00012, 2],
      [-2e-5, 1],
      [-0.00019, 2],
      [-0.00074, 2],
      [0.00012, 1],
      [-0.00037, 2],
      [-0.0002, 1],
      [-0.00024, 2],
      [-0.00039, 0]
    ],
    "red_o_points": [],
    "y_categories": ["NPV", "PV", "nan"],
    "blue_o_points": [],
    "blue_x_points": [
      [0.00034, 0],
      [7e-5, 2],
      [7e-5, 1],
      [0.00184, 1],
      [2e-5, 2],
      [0.00018, 1]
    ]
  },
  "QA_lstPexMuscstrength[FingersAddu]": {
    "red_x_points": [
      [4e-5, 0],
      [6e-5, 2],
      [-0.00024, 1],
      [-0.00019, 1],
      [-7e-5, 0],
      [-7e-5, 0],
      [-0.00032, 1],
      [-0.00011, 0],
      [-5e-5, 0],
      [6e-5, 2],
      [-5e-5, 0],
      [-2e-5, 0],
      [8e-5, 2],
      [5e-5, 2],
      [-0.0, 2],
      [-5e-5, 0],
      [1e-5, 2],
      [-0.00014, 0],
      [-0.00025, 1],
      [-1e-5, 0],
      [-8e-5, 1],
      [1e-5, 2],
      [6e-5, 2],
      [8e-5, 2],
      [0.00012, 2],
      [4e-5, 2],
      [-0.00024, 1],
      [4e-5, 2],
      [-0.0, 2],
      [-0.00013, 1]
    ],
    "red_o_points": [],
    "y_categories": ["GREATER THAN OR EQUALS TO 3", "LESS THAN 3", "nan"],
    "blue_o_points": [],
    "blue_x_points": [
      [9e-5, 2],
      [5e-5, 0],
      [0.00023, 2],
      [0.0001, 2],
      [0.00022, 0],
      [-1e-5, 0]
    ]
  },
  "QS_mulLysisRoot[C7]": {
    "red_x_points": [
      [-0.00028, 3],
      [-0.00078, 0],
      [-0.0015, 2],
      [-0.00086, 0],
      [-0.00064, 0],
      [-0.00084, 0],
      [-0.00079, 0],
      [-0.00025, 3],
      [-0.00071, 0],
      [-0.00072, 0],
      [-0.00068, 0],
      [-0.00021, 3],
      [0.00179, 1],
      [-0.00025, 3],
      [-0.00069, 0],
      [-0.00036, 3],
      [-0.00066, 0],
      [-0.00084, 0],
      [-0.0003, 3],
      [-0.00028, 3],
      [-0.00025, 3],
      [-0.00099, 0],
      [-0.0002, 3],
      [-0.00021, 3],
      [-0.00031, 3],
      [-0.00087, 0],
      [-0.00039, 3],
      [-0.00083, 0],
      [-0.0002, 3],
      [0.00206, 1],
      [-0.00073, 0]
    ],
    "red_o_points": [],
    "y_categories": ["N", "NOT APPLICABLE", "Y", "nan"],
    "blue_o_points": [],
    "blue_x_points": [
      [0.00251, 1],
      [-8e-5, 3],
      [0.00192, 1],
      [-0.00055, 0],
      [-5e-5, 3],
      [0.00242, 1],
      [0.00232, 1]
    ]
  },
  "QA_yonInjBpsurg": {
    "red_x_points": [
      [-0.00293, 1],
      [-0.00276, 1],
      [-0.0034, 1],
      [-0.00259, 1],
      [-0.00304, 1],
      [-0.00301, 1],
      [-0.00302, 1],
      [-0.00281, 1],
      [-0.00308, 1],
      [-0.00278, 1],
      [-0.00286, 1],
      [-0.00322, 1],
      [0.00723, 0],
      [-0.00293, 1],
      [-0.00291, 1],
      [-0.0031, 1],
      [-0.00287, 1],
      [-0.00269, 1],
      [-0.00276, 1],
      [-0.00287, 1],
      [-0.00265, 1],
      [-0.00256, 1],
      [-0.00264, 1],
      [-0.00297, 1],
      [-0.00296, 1],
      [-0.00274, 1],
      [-0.00256, 1],
      [-0.00287, 1],
      [-0.00247, 1],
      [0.00884, 0],
      [-0.00243, 1]
    ],
    "red_o_points": [],
    "y_categories": ["N", "Y", "nan"],
    "blue_o_points": [],
    "blue_x_points": [
      [0.01376, 0],
      [-0.00078, 1],
      [0.00951, 0],
      [-0.00268, 1],
      [-0.0009, 1],
      [0.0104, 0],
      [0.01215, 0]
    ]
  },
  "QS_mulBpsurgeryType[Lysis]": {
    "red_x_points": [
      [-0.00212, 3],
      [-0.00372, 0],
      [-0.00687, 2],
      [-0.0038, 0],
      [-0.00405, 0],
      [-0.00675, 2],
      [-0.0038, 0],
      [-0.00243, 3],
      [-0.00435, 0],
      [-0.0041, 0],
      [-0.00368, 0],
      [-0.00252, 3],
      [0.01103, 1],
      [-0.00186, 3],
      [-0.00415, 0],
      [-0.00224, 3],
      [-0.00733, 2],
      [-0.00381, 0],
      [-0.00221, 3],
      [-0.00208, 3],
      [-0.00242, 3],
      [-0.00389, 0],
      [-0.0021, 3],
      [-0.0023, 3],
      [-0.00226, 3],
      [-0.00385, 0],
      [-0.00236, 3],
      [-0.00385, 0],
      [-0.00231, 3],
      [0.01196, 1],
      [-0.00645, 2]
    ],
    "red_o_points": [],
    "y_categories": ["N", "NOT APPLICABLE", "Y", "nan"],
    "blue_o_points": [],
    "blue_x_points": [
      [0.01569, 1],
      [-0.00082, 3],
      [0.01385, 1],
      [-0.00161, 0],
      [-0.00022, 3],
      [0.01261, 1],
      [0.01262, 1]
    ]
  },
  "QS_mulBpsurgeryType[Graft]": {
    "red_x_points": [
      [-0.00024, 3],
      [-0.00045, 0],
      [-0.00031, 0],
      [-0.00038, 0],
      [-0.00038, 0],
      [-0.00036, 0],
      [-0.00039, 0],
      [-0.00029, 3],
      [-0.00033, 0],
      [-0.00032, 0],
      [-0.00032, 0],
      [-0.00043, 3],
      [0.00145, 1],
      [-0.00025, 3],
      [-0.00137, 2],
      [-0.00035, 3],
      [-0.00037, 0],
      [-0.0004, 0],
      [-0.00037, 3],
      [-0.00028, 3],
      [-0.00026, 3],
      [-0.00036, 0],
      [-0.00023, 3],
      [-0.00035, 3],
      [-0.00027, 3],
      [-0.00041, 0],
      [-0.00035, 3],
      [-0.0003, 0],
      [-0.00042, 3],
      [0.00126, 1],
      [-0.00031, 0]
    ],
    "red_o_points": [],
    "y_categories": ["N", "NOT APPLICABLE", "Y", "nan"],
    "blue_o_points": [],
    "blue_x_points": [
      [0.00172, 1],
      [-0.00013, 3],
      [0.00154, 1],
      [-0.00022, 0],
      [-0.00012, 3],
      [0.0012, 1],
      [0.0009, 1]
    ]
  },
  "QS_mulNeuromadSite[T2]": {
    "red_x_points": [
      [-0.00134, 2],
      [-0.00502, 0],
      [-0.00514, 0],
      [-0.00505, 0],
      [-0.00463, 0],
      [-0.00451, 0],
      [-0.00507, 0],
      [-0.00134, 2],
      [-0.00514, 0],
      [-0.00495, 0],
      [-0.00498, 0],
      [-0.00185, 2],
      [0.00848, 1],
      [-0.00142, 2],
      [-0.00501, 0],
      [-0.00166, 2],
      [-0.00509, 0],
      [-0.00486, 0],
      [-0.00131, 2],
      [-0.00145, 2],
      [-0.00133, 2],
      [-0.00438, 0],
      [-0.00136, 2],
      [-0.00178, 2],
      [-0.00163, 2],
      [-0.00431, 0],
      [-0.00147, 2],
      [-0.00548, 0],
      [-0.0013, 2],
      [0.00965, 1],
      [-0.00442, 0]
    ],
    "red_o_points": [],
    "y_categories": ["N", "NOT APPLICABLE", "nan"],
    "blue_o_points": [],
    "blue_x_points": [
      [0.01591, 1],
      [-0.00053, 2],
      [0.01178, 1],
      [-0.00027, 0],
      [-0.00012, 2],
      [0.01063, 1],
      [0.01321, 1]
    ]
  },
  "QS_mulLysisSite[Root]": {
    "red_x_points": [
      [-0.00092, 3],
      [-0.00125, 0],
      [-0.00294, 2],
      [-0.00116, 0],
      [-0.00129, 0],
      [-0.00098, 0],
      [-0.00109, 0],
      [-0.00105, 3],
      [-0.00113, 0],
      [-0.00113, 0],
      [-0.00118, 0],
      [-0.00089, 3],
      [0.00301, 1],
      [-0.00099, 3],
      [-0.00119, 0],
      [-0.00098, 3],
      [-0.00115, 0],
      [-0.00107, 0],
      [-0.00096, 3],
      [-0.00104, 3],
      [-0.00094, 3],
      [-0.00123, 0],
      [-0.0009, 3],
      [-0.00096, 3],
      [-0.00099, 3],
      [-0.001, 0],
      [-0.00106, 3],
      [-0.00122, 0],
      [-0.00093, 3],
      [0.00453, 1],
      [-0.00266, 2]
    ],
    "red_o_points": [],
    "y_categories": ["N", "NOT APPLICABLE", "Y", "nan"],
    "blue_o_points": [],
    "blue_x_points": [
      [0.00534, 1],
      [-0.00037, 3],
      [0.00426, 1],
      [-0.00119, 0],
      [-0.00054, 3],
      [0.0048, 1],
      [0.00369, 1]
    ]
  },
  "QA_lstPexPalle[Clavicle]": {
    "red_x_points": [
      [4e-5, 3],
      [1e-5, 3],
      [1e-5, 3],
      [-0.00013, 2],
      [-5e-5, 2],
      [5e-5, 3],
      [1e-5, 3],
      [-0.00013, 0],
      [0.00087, 3],
      [1e-5, 3],
      [1e-5, 3],
      [0.00012, 3],
      [3e-5, 0],
      [-2e-5, 0],
      [-3e-5, 0],
      [-0.00024, 2],
      [-5e-5, 1],
      [5e-5, 3],
      [-0.00274, 2],
      [4e-5, 3],
      [1e-5, 3],
      [-0.00037, 2],
      [1e-5, 3],
      [9e-5, 3],
      [-0.01558, 2]
    ],
    "red_o_points": [],
    "y_categories": ["HYPO", "NAIA", "PT", "nan"],
    "blue_o_points": [],
    "blue_x_points": [
      [0.00131, 3],
      [0.00038, 3],
      [0.00666, 0],
      [0.00022, 3],
      [0.00032, 3],
      [0.00151, 3],
      [0.00157, 3]
    ]
  },
  "QS_mulGraftNerve[LT]": {
    "red_x_points": [
      [1e-5, 2],
      [-0.00026, 0],
      [-0.00031, 0],
      [-0.00029, 0],
      [-0.00039, 0],
      [-0.0003, 0],
      [-0.00035, 0],
      [-1e-5, 2],
      [-0.00032, 0],
      [-0.00023, 0],
      [-0.00023, 0],
      [-3e-5, 2],
      [0.00057, 1],
      [4e-5, 2],
      [-0.0004, 0],
      [1e-5, 2],
      [-0.00026, 0],
      [-0.00022, 0],
      [-3e-5, 2],
      [-4e-5, 2],
      [2e-5, 2],
      [-0.0002, 0],
      [-3e-5, 2],
      [-3e-5, 2],
      [0.0, 2],
      [-0.00026, 0],
      [-3e-5, 2],
      [-0.00032, 0],
      [0.0, 2],
      [0.00058, 1],
      [-0.00035, 0]
    ],
    "red_o_points": [],
    "y_categories": ["N", "NOT APPLICABLE", "nan"],
    "blue_o_points": [],
    "blue_x_points": [
      [0.00072, 1],
      [0.00011, 2],
      [0.00071, 1],
      [-2e-5, 0],
      [7e-5, 2],
      [0.0005, 1],
      [0.00054, 1]
    ]
  },
  "QS_mulLysisRoot[C5]": {
    "red_x_points": [
      [-0.001, 3],
      [-0.00216, 0],
      [-0.00354, 2],
      [-0.00237, 0],
      [-0.00216, 0],
      [-0.00216, 0],
      [-0.00206, 0],
      [-0.00104, 3],
      [-0.00237, 0],
      [-0.00211, 0],
      [-0.002, 0],
      [-0.00122, 3],
      [0.00523, 1],
      [-0.00103, 3],
      [-0.00224, 0],
      [-0.00115, 3],
      [-0.0021, 0],
      [-0.00207, 0],
      [-0.00089, 3],
      [-0.00087, 3],
      [-0.00104, 3],
      [-0.00212, 0],
      [-0.00112, 3],
      [-0.00097, 3],
      [-0.00102, 3],
      [-0.00197, 0],
      [-0.00104, 3],
      [-0.00211, 0],
      [-0.00099, 3],
      [0.00607, 1],
      [-0.00329, 2]
    ],
    "red_o_points": [],
    "y_categories": ["N", "NOT APPLICABLE", "Y", "nan"],
    "blue_o_points": [],
    "blue_x_points": [
      [0.0077, 1],
      [-0.00039, 3],
      [0.00701, 1],
      [-0.00116, 0],
      [-0.0006, 3],
      [0.00577, 1],
      [0.00633, 1]
    ]
  },
  "QA_lstPexMuscstrength[ThumbOppo]": {
    "red_x_points": [
      [-0.00023, 1],
      [-5e-5, 1],
      [-5e-5, 1],
      [-0.0, 0],
      [-0.0, 0],
      [-6e-5, 1],
      [-0.0, 0],
      [-6e-5, 0],
      [-6e-5, 0],
      [-0.0, 0],
      [2e-5, 2],
      [2e-5, 2],
      [0.0001, 2],
      [-0.00019, 0],
      [2e-5, 2],
      [-0.0, 0],
      [-5e-5, 1],
      [5e-5, 2],
      [5e-5, 2],
      [5e-5, 2],
      [-6e-5, 0],
      [2e-5, 2],
      [-5e-5, 1],
      [5e-5, 2],
      [2e-5, 2],
      [-5e-5, 1]
    ],
    "red_o_points": [],
    "y_categories": ["GREATER THAN OR EQUALS TO 3", "LESS THAN 3", "nan"],
    "blue_o_points": [],
    "blue_x_points": [[5e-5, 2], [-0.0, 0], [0.0001, 2], [9e-5, 2], [-0.0, 0]]
  },
  "QS_mulGraftNerve[IS]": {
    "red_x_points": [
      [-0.0002, 2],
      [-0.00067, 0],
      [-0.00068, 0],
      [-0.00079, 0],
      [-0.00088, 0],
      [-0.0006, 0],
      [-0.0007, 0],
      [-0.00023, 2],
      [-0.00058, 0],
      [-0.00057, 0],
      [-0.00076, 0],
      [-0.00023, 2],
      [0.00124, 1],
      [-0.00025, 2],
      [-0.00073, 0],
      [-0.00026, 2],
      [-0.00061, 0],
      [-0.00082, 0],
      [-0.00024, 2],
      [-0.00029, 2],
      [-0.00027, 2],
      [-0.00062, 0],
      [-0.00023, 2],
      [-0.00023, 2],
      [-0.00032, 2],
      [-0.00059, 0],
      [-0.00019, 2],
      [-0.0007, 0],
      [-0.00021, 2],
      [0.00172, 1],
      [-0.00048, 0]
    ],
    "red_o_points": [],
    "y_categories": ["N", "NOT APPLICABLE", "nan"],
    "blue_o_points": [],
    "blue_x_points": [
      [0.00183, 1],
      [-0.00011, 2],
      [0.00181, 1],
      [-0.0002, 0],
      [-0.00014, 2],
      [0.00196, 1],
      [0.0016, 1]
    ]
  },
  "QS_mulLysisNerve[Ul]": {
    "red_x_points": [
      [-1e-5, 2],
      [-5e-5, 0],
      [-5e-5, 0],
      [-5e-5, 0],
      [-5e-5, 0],
      [-5e-5, 0],
      [-1e-5, 2],
      [-5e-5, 0],
      [-5e-5, 0],
      [-5e-5, 0],
      [0.0001, 1],
      [-5e-5, 0],
      [-1e-5, 2],
      [-5e-5, 0],
      [-1e-5, 2],
      [-1e-5, 2],
      [-1e-5, 2],
      [-1e-5, 2],
      [-1e-5, 2],
      [-5e-5, 0],
      [-1e-5, 2],
      [-5e-5, 0],
      [0.0001, 1]
    ],
    "red_o_points": [],
    "y_categories": ["N", "NOT APPLICABLE", "nan"],
    "blue_o_points": [],
    "blue_x_points": [[0.0001, 1], [-1e-5, 2], [0.0001, 1], [0.0001, 1]]
  },
  "QS_mulGraftNerve[MC]": {
    "red_x_points": [
      [-0.00023, 2],
      [-0.00064, 0],
      [-0.00068, 0],
      [-0.00063, 0],
      [-0.00065, 0],
      [-0.00075, 0],
      [-0.00046, 0],
      [-0.00026, 2],
      [-0.00057, 0],
      [-0.00051, 0],
      [-0.00072, 0],
      [-0.00015, 2],
      [0.00104, 1],
      [-0.00029, 2],
      [-0.00063, 0],
      [-0.00025, 2],
      [-0.00046, 0],
      [-0.00057, 0],
      [-0.00029, 2],
      [-0.00014, 2],
      [-0.0001, 2],
      [-0.00063, 0],
      [-0.00028, 2],
      [-0.00015, 2],
      [-0.00029, 2],
      [-0.00057, 0],
      [-0.00026, 2],
      [-0.00056, 0],
      [-0.00023, 2],
      [0.00141, 1],
      [-0.00066, 0]
    ],
    "red_o_points": [],
    "y_categories": ["N", "NOT APPLICABLE", "nan"],
    "blue_o_points": [],
    "blue_x_points": [
      [0.00221, 1],
      [-0.00015, 2],
      [0.0013, 1],
      [-0.00021, 0],
      [-9e-5, 2],
      [0.00174, 1],
      [0.0013, 1]
    ]
  },
  "QS_mulGraftRoot[C8]": {
    "red_x_points": [
      [-1e-5, 2],
      [-1e-5, 0],
      [-4e-5, 0],
      [-3e-5, 0],
      [-1e-5, 0],
      [-3e-5, 0],
      [-4e-5, 0],
      [-5e-5, 2],
      [-3e-5, 0],
      [-4e-5, 0],
      [-1e-5, 0],
      [-6e-5, 2],
      [0.0002, 1],
      [-5e-5, 2],
      [-4e-5, 0],
      [-6e-5, 2],
      [-1e-5, 0],
      [-3e-5, 0],
      [-6e-5, 2],
      [-6e-5, 2],
      [-6e-5, 2],
      [-4e-5, 0],
      [-6e-5, 2],
      [-1e-5, 2],
      [-4e-5, 0],
      [-5e-5, 2],
      [-4e-5, 0],
      [-6e-5, 2],
      [9e-5, 1],
      [-4e-5, 0]
    ],
    "red_o_points": [],
    "y_categories": ["N", "NOT APPLICABLE", "nan"],
    "blue_o_points": [],
    "blue_x_points": [
      [9e-5, 1],
      [-1e-5, 2],
      [0.00011, 1],
      [-4e-5, 0],
      [-1e-5, 2],
      [9e-5, 1],
      [0.0002, 1]
    ]
  },
  "QA_lstPexKine[Index]": {
    "red_x_points": [
      [-0.00091, 0],
      [-0.00029, 2],
      [-0.00042, 2],
      [-0.00021, 2],
      [7e-5, 1],
      [0.00037, 1],
      [-0.00101, 0],
      [0.00028, 2],
      [0.00023, 1],
      [5e-5, 1],
      [0.00018, 1],
      [-0.00032, 1],
      [-2e-5, 2],
      [0.00018, 2],
      [0.00013, 1],
      [0.00029, 2],
      [0.0, 2],
      [0.00022, 1],
      [-0.00023, 1],
      [-0.00063, 0],
      [-0.00046, 1],
      [-0.00026, 2],
      [0.00016, 2],
      [-0.00036, 1],
      [0.00032, 2],
      [-0.00019, 2],
      [-0.0005, 1],
      [-0.00011, 2],
      [-0.00057, 1],
      [-0.0001, 2],
      [-0.00043, 0]
    ],
    "red_o_points": [],
    "y_categories": ["NPV", "PV", "nan"],
    "blue_o_points": [],
    "blue_x_points": [
      [0.00018, 1],
      [0.00067, 2],
      [7e-5, 1],
      [0.00095, 1],
      [0.00051, 2],
      [0.00014, 1],
      [-0.0, 2]
    ]
  },
  "QA_lstPexMuscstrength[ElbowFlex]": {
    "red_x_points": [
      [-0.00327, 1],
      [0.0003, 2],
      [-0.00163, 1],
      [-0.00129, 1],
      [0.00151, 0],
      [-0.00142, 1],
      [-0.00157, 1],
      [-0.0031, 1],
      [-0.0012, 1],
      [-0.00144, 1],
      [-0.00156, 1],
      [-0.0033, 1],
      [0.00046, 2],
      [0.00277, 2],
      [0.00036, 2],
      [-0.00325, 1],
      [0.0001, 2],
      [0.00136, 0],
      [-0.00316, 1],
      [-0.00288, 1],
      [-0.00324, 1],
      [-0.00148, 1],
      [0.00299, 2],
      [-0.00018, 0],
      [-0.00372, 1],
      [-0.00147, 1],
      [-0.00327, 1],
      [-0.00123, 1],
      [-0.00346, 1],
      [0.00032, 2],
      [-0.00126, 1]
    ],
    "red_o_points": [],
    "y_categories": ["GREATER THAN OR EQUALS TO 3", "LESS THAN 3", "nan"],
    "blue_o_points": [],
    "blue_x_points": [
      [0.00038, 2],
      [0.00481, 2],
      [0.0041, 0],
      [-6e-5, 1],
      [0.00488, 2],
      [0.00406, 0],
      [0.00461, 0]
    ]
  },
  "QS_mulGraftRoot[C6]": {
    "red_x_points": [
      [-0.0, 2],
      [-2e-5, 0],
      [-2e-5, 0],
      [-2e-5, 0],
      [-2e-5, 0],
      [-2e-5, 0],
      [-2e-5, 0],
      [-0.0, 2],
      [-2e-5, 0],
      [-2e-5, 0],
      [-2e-5, 0],
      [-0.0, 2],
      [-0.0, 2],
      [-2e-5, 0],
      [-0.0, 2],
      [-0.0, 2],
      [-0.0, 2],
      [-0.0, 2],
      [-2e-5, 0],
      [-0.0, 2],
      [-0.0, 2],
      [9e-5, 1],
      [-2e-5, 0]
    ],
    "red_o_points": [],
    "y_categories": ["N", "NOT APPLICABLE", "nan"],
    "blue_o_points": [],
    "blue_x_points": [[-0.0, 2], [-2e-5, 0], [-0.0, 2], [9e-5, 1], [9e-5, 1]]
  },
  "QA_yonInjDisloc": {
    "red_x_points": [
      [-3e-5, 2],
      [-4e-5, 2],
      [-4e-5, 2],
      [-4e-5, 2],
      [-4e-5, 2],
      [-4e-5, 2],
      [-4e-5, 2],
      [-4e-5, 2],
      [-4e-5, 2],
      [-4e-5, 2],
      [-3e-5, 2],
      [-2e-5, 2],
      [-3e-5, 2],
      [-4e-5, 2],
      [-4e-5, 2],
      [-5e-5, 2],
      [-3e-5, 2],
      [-4e-5, 2],
      [-0.00017, 0],
      [-5e-5, 2],
      [-5e-5, 2],
      [-3e-5, 2],
      [-5e-5, 2],
      [-4e-5, 2],
      [-3e-5, 2],
      [-2e-5, 2],
      [-2e-5, 2],
      [-3e-5, 2],
      [-2e-5, 2],
      [-2e-5, 2],
      [-0.00018, 1]
    ],
    "red_o_points": [],
    "y_categories": ["N", "Y", "nan"],
    "blue_o_points": [],
    "blue_x_points": [
      [6e-5, 2],
      [-2e-5, 2],
      [-0.0, 2],
      [-3e-5, 2],
      [0.00122, 0],
      [0.00023, 1],
      [-1e-5, 2]
    ]
  },
  "QA_lstPexInspectio[ScapulaAlata]": {
    "red_x_points": [
      [-0.00024, 1],
      [-0.00036, 1],
      [-0.00036, 1],
      [-0.00029, 1],
      [-0.00028, 1],
      [-0.00035, 1],
      [-0.0003, 1],
      [-0.00022, 1],
      [-0.00022, 1],
      [-0.00027, 1],
      [-0.00031, 1],
      [-0.00029, 1],
      [-0.00092, 1],
      [-0.0002, 1],
      [-0.00022, 1],
      [-0.00022, 1],
      [-0.00022, 1],
      [-0.00034, 1],
      [-0.00293, 0],
      [-0.00022, 1],
      [-0.00026, 1],
      [-0.00031, 1],
      [-0.00017, 1],
      [-0.00031, 1],
      [-0.00026, 1],
      [-0.00028, 1],
      [-0.00028, 1],
      [-0.0003, 1],
      [-0.00027, 1],
      [-0.00042, 1],
      [-0.00034, 1]
    ],
    "red_o_points": [],
    "y_categories": ["ABS", "NAIA", "PT", "nan"],
    "blue_o_points": [],
    "blue_x_points": [
      [-0.00016, 1],
      [-0.00014, 1],
      [-8e-5, 1],
      [-0.00039, 1],
      [0.00025, 1],
      [-0.00018, 1],
      [0.00691, 2]
    ]
  },
  "QS_mulGraftNerve[Ac]": {
    "red_x_points": [
      [-0.0005, 2],
      [-0.00148, 0],
      [-0.00141, 0],
      [-0.00133, 0],
      [-0.00157, 0],
      [-0.00134, 0],
      [-0.00134, 0],
      [-0.00053, 2],
      [-0.00151, 0],
      [-0.00139, 0],
      [-0.00146, 0],
      [-0.00053, 2],
      [0.00286, 1],
      [-0.00045, 2],
      [-0.00116, 0],
      [-0.00048, 2],
      [-0.00122, 0],
      [-0.00139, 0],
      [-0.00049, 2],
      [-0.00033, 2],
      [-0.00036, 2],
      [-0.0013, 0],
      [-0.00051, 2],
      [-0.00055, 2],
      [-0.00053, 2],
      [-0.0012, 0],
      [-0.00047, 2],
      [-0.00129, 0],
      [-0.00042, 2],
      [0.00296, 1],
      [-0.00137, 0]
    ],
    "red_o_points": [],
    "y_categories": ["N", "NOT APPLICABLE", "nan"],
    "blue_o_points": [],
    "blue_x_points": [
      [0.00441, 1],
      [-0.0001, 2],
      [0.00353, 1],
      [-0.00035, 0],
      [-0.00023, 2],
      [0.00281, 1],
      [0.00343, 1]
    ]
  },
  "QA_lstPexMuscstrength[FingersAbdu]": {
    "red_x_points": [
      [8e-5, 2],
      [3e-5, 2],
      [-0.00014, 1],
      [-0.0002, 1],
      [-1e-5, 0],
      [-0.00012, 0],
      [-0.0001, 1],
      [-1e-5, 0],
      [1e-5, 0],
      [4e-5, 2],
      [-0.00029, 1],
      [-6e-5, 0],
      [5e-5, 2],
      [8e-5, 2],
      [3e-5, 2],
      [-4e-5, 0],
      [2e-5, 2],
      [-0.00011, 0],
      [6e-5, 0],
      [-0.00019, 1],
      [-5e-5, 0],
      [-0.00024, 1],
      [7e-5, 2],
      [6e-5, 2],
      [5e-5, 2],
      [-0.0003, 1],
      [3e-5, 2],
      [-0.00018, 1],
      [8e-5, 2],
      [4e-5, 2],
      [-0.00015, 1]
    ],
    "red_o_points": [],
    "y_categories": ["GREATER THAN OR EQUALS TO 3", "LESS THAN 3", "nan"],
    "blue_o_points": [],
    "blue_x_points": [
      [7e-5, 2],
      [1e-5, 0],
      [0.00048, 2],
      [8e-5, 2],
      [1e-5, 0],
      [6e-5, 0]
    ]
  },
  "QS_mulNeuromadSite[C8]": {
    "red_x_points": [
      [-0.00127, 2],
      [-0.00324, 0],
      [-0.00378, 0],
      [-0.0037, 0],
      [-0.00397, 0],
      [-0.00337, 0],
      [-0.00361, 0],
      [-0.00147, 2],
      [-0.00355, 0],
      [-0.00351, 0],
      [-0.00327, 0],
      [-0.00173, 2],
      [0.00706, 1],
      [-0.00103, 2],
      [-0.00347, 0],
      [-0.0017, 2],
      [-0.0034, 0],
      [-0.0041, 0],
      [-0.00155, 2],
      [-0.00133, 2],
      [-0.00156, 2],
      [-0.00309, 0],
      [-0.00097, 2],
      [-0.00154, 2],
      [-0.0012, 2],
      [-0.00318, 0],
      [-0.00117, 2],
      [-0.00324, 0],
      [-0.00103, 2],
      [0.00704, 1],
      [-0.00339, 0]
    ],
    "red_o_points": [],
    "y_categories": ["N", "NOT APPLICABLE", "nan"],
    "blue_o_points": [],
    "blue_x_points": [
      [0.01203, 1],
      [-0.00021, 2],
      [0.0084, 1],
      [-0.00054, 0],
      [-0.00011, 2],
      [0.00868, 1],
      [0.00911, 1]
    ]
  },
  "QS_mulTransfSite[AcSsPA]": {
    "red_x_points": [
      [-0.0007, 3],
      [-0.00172, 0],
      [-0.00168, 0],
      [-0.00176, 0],
      [-0.0016, 0],
      [-0.0016, 0],
      [-0.00179, 0],
      [-0.00077, 3],
      [-0.00154, 0],
      [-0.00189, 0],
      [-0.00161, 0],
      [-0.0008, 3],
      [0.00469, 1],
      [-0.00085, 3],
      [-0.00168, 0],
      [-0.00095, 3],
      [-0.00319, 2],
      [-0.00177, 0],
      [-0.00102, 3],
      [-0.00079, 3],
      [-0.00081, 3],
      [-0.00164, 0],
      [-0.00068, 3],
      [-0.00072, 3],
      [-0.00097, 3],
      [-0.00164, 0],
      [-0.00072, 3],
      [-0.00158, 0],
      [-0.00068, 3],
      [0.0044, 1],
      [-0.00186, 0]
    ],
    "red_o_points": [],
    "y_categories": ["N", "NOT APPLICABLE", "Y", "nan"],
    "blue_o_points": [],
    "blue_x_points": [
      [0.00538, 1],
      [-0.00015, 3],
      [0.00508, 1],
      [-0.00099, 0],
      [-0.00038, 3],
      [0.00397, 1],
      [0.00486, 1]
    ]
  },
  "QA_lstPexPalle[Elbow]": {
    "red_x_points": [
      [0.0002, 4],
      [0.00013, 4],
      [0.00016, 4],
      [0.00012, 4],
      [-0.00052, 3],
      [-0.00047, 3],
      [0.00013, 4],
      [0.00016, 4],
      [0.00019, 4],
      [8e-5, 1],
      [-0.00038, 3],
      [9e-5, 1],
      [0.00097, 4],
      [0.00034, 4],
      [0.00012, 4],
      [0.00023, 4],
      [8e-5, 4],
      [0.00022, 1],
      [-0.0007, 3],
      [-0.00067, 0],
      [-0.00064, 3],
      [-0.00047, 2],
      [0.00019, 4],
      [-0.00336, 3],
      [0.0002, 4],
      [0.00015, 4],
      [-0.00062, 3],
      [0.0002, 4],
      [0.00014, 4],
      [-0.01198, 3],
      [-0.00037, 0]
    ],
    "red_o_points": [],
    "y_categories": ["ABS", "HYPO", "NAIA", "PT", "nan"],
    "blue_o_points": [],
    "blue_x_points": [
      [0.0012, 4],
      [0.00046, 4],
      [0.00546, 1],
      [0.00048, 4],
      [0.00048, 4],
      [0.00124, 4],
      [0.00129, 4]
    ]
  },
  "QA_lstPexMuscstrength[ScapulaAbducSuprot]": {
    "red_x_points": [
      [-0.00029, 0],
      [3e-5, 2],
      [-0.0001, 1],
      [-0.00014, 1],
      [-0.00015, 0],
      [-0.0005, 1],
      [-0.00017, 1],
      [-0.00019, 1],
      [-0.00027, 0],
      [-0.00027, 0],
      [-0.00031, 1],
      [-0.00023, 1],
      [3e-5, 2],
      [0.00017, 2],
      [0.00017, 2],
      [0.00011, 2],
      [9e-5, 2],
      [-0.00034, 0],
      [-0.0001, 0],
      [-0.00028, 1],
      [-0.00022, 0],
      [-9e-5, 1],
      [0.0001, 2],
      [-0.00014, 0],
      [0.00027, 2],
      [-0.00026, 1],
      [-0.00018, 1],
      [-4e-5, 0],
      [0.00014, 2],
      [3e-5, 2],
      [-0.0001, 1]
    ],
    "red_o_points": [],
    "y_categories": ["GREATER THAN OR EQUALS TO 3", "LESS THAN 3", "nan"],
    "blue_o_points": [],
    "blue_x_points": [
      [0.00025, 2],
      [2e-5, 0],
      [0.00111, 2],
      [0.00025, 2],
      [1e-5, 0]
    ]
  },
  "participant_code": {
    "red_x_points": [
      [-0.01353, 1],
      [-0.01358, 2],
      [-0.01362, 3],
      [-0.01283, 4],
      [-0.01208, 5],
      [-0.01344, 6],
      [-0.01255, 7],
      [-0.0126, 8],
      [-0.01292, 9],
      [-0.01292, 10],
      [-0.01311, 11],
      [-0.01311, 12],
      [-0.01381, 14],
      [-0.01316, 16],
      [-0.01302, 17],
      [-0.01269, 19],
      [-0.01274, 20],
      [-0.0132, 22],
      [-0.01264, 23],
      [-0.01236, 25],
      [-0.01232, 26],
      [-0.01288, 27],
      [-0.01297, 28],
      [-0.01264, 29],
      [-0.01269, 30],
      [-0.01222, 32],
      [-0.01278, 33],
      [-0.01278, 34],
      [-0.01358, 35],
      [-0.01236, 36],
      [-0.01311, 37]
    ],
    "red_o_points": [],
    "y_categories": [
      "P16554",
      "P18297",
      "P19283",
      "P19287",
      "P23391",
      "P31645",
      "P31691",
      "P34778",
      "P35046",
      "P36328",
      "P43633",
      "P4544",
      "P46417",
      "P48965",
      "P53068",
      "P5497",
      "P59529",
      "P62483",
      "P64658",
      "P65202",
      "P66816",
      "P6751",
      "P7408",
      "P75566",
      "P76226",
      "P79971",
      "P82621",
      "P82990",
      "P84932",
      "P85825",
      "P86989",
      "P8770",
      "P87791",
      "P90550",
      "P93159",
      "P94969",
      "P96710",
      "P9744",
      "nan"
    ],
    "blue_o_points": [],
    "blue_x_points": [
      [0.03833, 0],
      [0.03756, 13],
      [0.03741, 15],
      [0.03894, 18],
      [0.03787, 21],
      [0.03787, 24],
      [0.03603, 31]
    ]
  },
  "QA_lstPexTouch[T1]": {
    "red_x_points": [
      [-0.00198, 1],
      [-0.00072, 2],
      [0.00074, 1],
      [-0.00067, 2],
      [-0.00185, 0],
      [0.00052, 1],
      [0.001, 1],
      [-0.00219, 1],
      [-0.00247, 0],
      [-0.0015, 0],
      [-0.00148, 0],
      [-0.00265, 0],
      [-0.00761, 2],
      [0.00352, 2],
      [-0.00078, 2],
      [-0.0017, 1],
      [-0.00022, 2],
      [0.00117, 1],
      [-0.00243, 0],
      [-0.00193, 1],
      [-0.0026, 0],
      [-0.0005, 2],
      [0.00331, 2],
      [-0.00173, 1],
      [-0.00306, 0],
      [0.00109, 1],
      [-0.00311, 0],
      [-0.00043, 2],
      [-0.00297, 0],
      [0.00065, 1],
      [0.00042, 1]
    ],
    "red_o_points": [],
    "y_categories": ["NORM", "NPV", "nan"],
    "blue_o_points": [],
    "blue_x_points": [
      [0.00088, 1],
      [0.00547, 2],
      [0.00083, 1],
      [0.00315, 1],
      [0.00477, 2],
      [0.00049, 1],
      [0.00346, 0]
    ]
  },
  "QS_mulGraftNerve[Ul]": {
    "red_x_points": [
      [-0.00036, 2],
      [-0.00081, 0],
      [-0.00088, 0],
      [-0.00065, 0],
      [-0.00085, 0],
      [-0.00077, 0],
      [-0.00081, 0],
      [-0.00035, 2],
      [-0.00094, 0],
      [-0.00101, 0],
      [-0.00075, 0],
      [-0.00028, 2],
      [0.001, 1],
      [-0.0002, 2],
      [-0.00064, 0],
      [-0.00031, 2],
      [-0.00099, 0],
      [-0.00074, 0],
      [-0.00035, 2],
      [-0.00041, 2],
      [-0.00027, 2],
      [-0.00084, 0],
      [-0.00022, 2],
      [-0.00024, 2],
      [-0.00026, 2],
      [-0.00083, 0],
      [-0.00033, 2],
      [-0.001, 0],
      [-0.00022, 2],
      [0.00135, 1],
      [-0.0008, 0]
    ],
    "red_o_points": [],
    "y_categories": ["N", "NOT APPLICABLE", "nan"],
    "blue_o_points": [],
    "blue_x_points": [
      [0.00325, 1],
      [2e-5, 2],
      [0.00187, 1],
      [-0.00022, 0],
      [2e-5, 2],
      [0.00191, 1],
      [0.00275, 1]
    ]
  },
  "QS_mulGraftNerve[Ssr]": {
    "red_x_points": [
      [-3e-5, 0],
      [-3e-5, 0],
      [-8e-5, 0],
      [-8e-5, 0],
      [-5e-5, 2],
      [-8e-5, 0],
      [-8e-5, 0],
      [-3e-5, 0],
      [9e-5, 1],
      [-6e-5, 2],
      [-8e-5, 0],
      [-6e-5, 2],
      [-1e-5, 2],
      [-1e-5, 2],
      [-3e-5, 0],
      [-6e-5, 2],
      [-1e-5, 2],
      [-6e-5, 2],
      [-3e-5, 0],
      [-1e-5, 2],
      [-3e-5, 0],
      [-1e-5, 2],
      [9e-5, 1],
      [-3e-5, 0]
    ],
    "red_o_points": [],
    "y_categories": ["N", "NOT APPLICABLE", "nan"],
    "blue_o_points": [],
    "blue_x_points": [
      [0.00024, 1],
      [-1e-5, 2],
      [9e-5, 1],
      [-3e-5, 0],
      [-1e-5, 2],
      [9e-5, 1],
      [0.00015, 1]
    ]
  },
  "QS_mulLysisDivision[PDivisionMTrunk]": {
    "red_x_points": [
      [1e-5, 2],
      [-9e-5, 0],
      [-9e-5, 0],
      [-5e-5, 0],
      [-9e-5, 0],
      [-9e-5, 0],
      [-9e-5, 0],
      [-3e-5, 2],
      [-9e-5, 0],
      [-5e-5, 0],
      [-5e-5, 0],
      [-2e-5, 2],
      [7e-5, 1],
      [1e-5, 2],
      [-5e-5, 0],
      [-3e-5, 2],
      [-5e-5, 0],
      [-5e-5, 0],
      [-2e-5, 2],
      [-2e-5, 2],
      [-2e-5, 2],
      [-5e-5, 0],
      [-2e-5, 2],
      [1e-5, 2],
      [-9e-5, 0],
      [-2e-5, 2],
      [-5e-5, 0],
      [-2e-5, 2],
      [0.0002, 1],
      [-9e-5, 0]
    ],
    "red_o_points": [],
    "y_categories": ["N", "NOT APPLICABLE", "nan"],
    "blue_o_points": [],
    "blue_x_points": [
      [0.00012, 1],
      [-2e-5, 2],
      [0.00012, 1],
      [1e-5, 2],
      [0.0002, 1],
      [0.0002, 1]
    ]
  },
  "QS_mulGraftNerve[MCA]": {
    "red_x_points": [
      [-0.00021, 2],
      [-0.00033, 0],
      [-0.00031, 0],
      [-0.00029, 0],
      [-0.00029, 0],
      [-0.00035, 0],
      [-0.00028, 0],
      [-0.00027, 2],
      [-0.00028, 0],
      [-0.00027, 0],
      [-0.00034, 0],
      [-0.00024, 2],
      [0.00038, 1],
      [-0.00028, 2],
      [-0.00032, 0],
      [-0.00029, 2],
      [-0.00024, 0],
      [-0.00031, 0],
      [-0.00022, 2],
      [-0.00013, 2],
      [-0.00025, 2],
      [-0.00026, 0],
      [-0.00032, 2],
      [-0.00019, 2],
      [-0.00028, 2],
      [-0.00034, 0],
      [-0.00024, 2],
      [-0.00034, 0],
      [-0.00023, 2],
      [0.0009, 1],
      [-0.00026, 0]
    ],
    "red_o_points": [],
    "y_categories": ["N", "NOT APPLICABLE", "nan"],
    "blue_o_points": [],
    "blue_x_points": [
      [0.00142, 1],
      [5e-5, 2],
      [0.00075, 1],
      [-0.00012, 0],
      [-9e-5, 2],
      [0.00103, 1],
      [0.00126, 1]
    ]
  },
  "QS_mulGraftTrunk[UpperTrunk]": {
    "red_x_points": [
      [-0.00096, 3],
      [-0.002, 0],
      [-0.00207, 0],
      [-0.00199, 0],
      [-0.00254, 0],
      [-0.00203, 0],
      [-0.00185, 0],
      [-0.00103, 3],
      [-0.00202, 0],
      [-0.00162, 0],
      [-0.00204, 0],
      [-0.0011, 3],
      [0.00502, 1],
      [-0.00078, 3],
      [-0.00439, 2],
      [-0.00096, 3],
      [-0.0018, 0],
      [-0.00217, 0],
      [-0.0012, 3],
      [-0.00088, 3],
      [-0.00098, 3],
      [-0.00201, 0],
      [-0.00099, 3],
      [-0.00112, 3],
      [-0.001, 3],
      [-0.00185, 0],
      [-0.00093, 3],
      [-0.0022, 0],
      [-0.00096, 3],
      [0.0049, 1],
      [-0.00222, 0]
    ],
    "red_o_points": [],
    "y_categories": ["N", "NOT APPLICABLE", "Y", "nan"],
    "blue_o_points": [],
    "blue_x_points": [
      [0.0071, 1],
      [-0.00015, 3],
      [0.00653, 1],
      [-0.00104, 0],
      [-1e-5, 3],
      [0.0052, 1],
      [0.00778, 1]
    ]
  },
  "QA_lstPexKine[Elbow]": {
    "red_x_points": [
      [-0.00058, 0],
      [-0.00018, 2],
      [-5e-5, 2],
      [-0.00015, 2],
      [0.0002, 1],
      [-0.00045, 0],
      [6e-5, 2],
      [0.00013, 1],
      [2e-5, 1],
      [0.00027, 1],
      [-0.00025, 1],
      [-5e-5, 2],
      [0.00015, 2],
      [0.00014, 1],
      [-5e-5, 2],
      [-1e-5, 2],
      [8e-5, 1],
      [-6e-5, 1],
      [-0.00037, 0],
      [-6e-5, 1],
      [-0.00016, 2],
      [0.00013, 2],
      [-0.0003, 1],
      [-1e-5, 2],
      [-0.00012, 2],
      [-0.00017, 1],
      [-0.0001, 2],
      [-0.00013, 1],
      [-8e-5, 2],
      [-0.00012, 0]
    ],
    "red_o_points": [],
    "y_categories": ["NPV", "PV", "nan"],
    "blue_o_points": [],
    "blue_x_points": [
      [0.00014, 1],
      [0.00026, 2],
      [0.00049, 1],
      [9e-5, 2],
      [1e-5, 1],
      [-0.0, 2]
    ]
  },
  "QA_mulInjTbpiCause[Motorcycle]": {
    "red_x_points": [
      [0.00138, 0],
      [-0.00094, 1],
      [-0.00141, 1],
      [-0.00084, 1],
      [-0.00079, 1],
      [-0.00095, 1],
      [-0.00079, 1],
      [-0.00077, 1],
      [-0.00101, 1],
      [-0.00095, 1],
      [-0.00078, 1],
      [0.0008, 0],
      [-0.02908, 1],
      [-0.00079, 1],
      [-0.00107, 1],
      [-0.00096, 1],
      [-0.00099, 1],
      [-0.00115, 1],
      [0.00045, 0],
      [-0.00092, 1],
      [-0.00082, 1],
      [-0.00084, 1],
      [-0.00087, 1],
      [-0.00163, 1],
      [0.00123, 0],
      [-0.0008, 1],
      [-0.00084, 1],
      [-0.00098, 1],
      [-0.00067, 1],
      [-0.02919, 1],
      [-0.00083, 1]
    ],
    "red_o_points": [],
    "y_categories": ["N", "Y", "nan"],
    "blue_o_points": [],
    "blue_x_points": [
      [0.0135, 0],
      [-0.00027, 1],
      [0.01191, 0],
      [-0.00134, 1],
      [0.00091, 1],
      [0.01229, 0],
      [0.01267, 0]
    ]
  },
  "QA_yonInjUnconscio": {
    "red_x_points": [
      [-0.00193, 1],
      [-0.00223, 1],
      [-0.00145, 2],
      [-0.00114, 2],
      [0.00527, 0],
      [-0.00257, 1],
      [-0.00167, 2],
      [-0.00251, 2],
      [-0.00153, 2],
      [-0.00114, 2],
      [-0.00221, 1],
      [-0.00288, 1],
      [-0.01496, 1],
      [-0.00291, 2],
      [-0.0013, 2],
      [-0.00313, 2],
      [-0.00277, 1],
      [0.00477, 0],
      [-0.00227, 1],
      [-0.00208, 1],
      [-0.00216, 1],
      [-0.00243, 1],
      [-0.00268, 2],
      [-0.00456, 1],
      [-0.00262, 2],
      [-0.00236, 1],
      [0.00483, 0],
      [-0.00203, 1],
      [-0.00306, 2],
      [-0.00038, 2],
      [-0.00209, 1]
    ],
    "red_o_points": [],
    "y_categories": ["N", "Y", "nan"],
    "blue_o_points": [],
    "blue_x_points": [
      [0.0009, 2],
      [-0.00025, 1],
      [0.00824, 0],
      [0.01175, 0],
      [0.01393, 0],
      [0.0016, 2],
      [0.00153, 2]
    ]
  },
  "QS_mulGraftLevel[Trunk]": {
    "red_x_points": [
      [-0.00041, 3],
      [-0.00109, 0],
      [-0.00094, 0],
      [-0.0011, 0],
      [-0.00118, 0],
      [-0.00107, 0],
      [-0.00104, 0],
      [-0.00048, 3],
      [-0.00107, 0],
      [-0.00105, 0],
      [-0.00092, 0],
      [-0.00048, 3],
      [0.00265, 1],
      [-0.00065, 3],
      [-0.00258, 2],
      [-0.0008, 3],
      [-0.00079, 0],
      [-0.00102, 0],
      [-0.00059, 3],
      [-0.00034, 3],
      [-0.00044, 3],
      [-0.0011, 0],
      [-0.0007, 3],
      [-0.00075, 3],
      [-0.00053, 3],
      [-0.00096, 0],
      [-0.00047, 3],
      [-0.00097, 0],
      [-0.00051, 3],
      [0.00231, 1],
      [-0.00098, 0]
    ],
    "red_o_points": [],
    "y_categories": ["N", "NOT APPLICABLE", "Y", "nan"],
    "blue_o_points": [],
    "blue_x_points": [
      [0.00319, 1],
      [-0.0002, 3],
      [0.00336, 1],
      [-0.00031, 0],
      [-0.00018, 3],
      [0.00306, 1],
      [0.00349, 1]
    ]
  },
  "QS_mulNeuromadSite[C4]": {
    "red_x_points": [
      [-0.00079, 2],
      [-0.00188, 0],
      [-0.00242, 0],
      [-0.00209, 0],
      [-0.00209, 0],
      [-0.00212, 0],
      [-0.00214, 0],
      [-0.00064, 2],
      [-0.00192, 0],
      [-0.00196, 0],
      [-0.00164, 0],
      [-0.00087, 2],
      [0.00344, 1],
      [-0.00066, 2],
      [-0.00167, 0],
      [-0.00084, 2],
      [-0.0023, 0],
      [-0.00216, 0],
      [-0.00087, 2],
      [-0.00065, 2],
      [-0.00086, 2],
      [-0.00182, 0],
      [-0.00075, 2],
      [-0.00076, 2],
      [-0.00075, 2],
      [-0.00215, 0],
      [-0.00074, 2],
      [-0.00183, 0],
      [-0.00057, 2],
      [0.00438, 1],
      [-0.00206, 0]
    ],
    "red_o_points": [],
    "y_categories": ["N", "NOT APPLICABLE", "nan"],
    "blue_o_points": [],
    "blue_x_points": [
      [0.00712, 1],
      [-9e-5, 2],
      [0.00468, 1],
      [-0.00025, 0],
      [-0.0004, 2],
      [0.00569, 1],
      [0.00513, 1]
    ]
  },
  "QS_mulTransfSite[C7ipsi]": {
    "red_x_points": [
      [-0.0, 2],
      [-9e-5, 0],
      [-9e-5, 0],
      [-9e-5, 0],
      [-9e-5, 0],
      [-0.00013, 0],
      [-9e-5, 0],
      [2e-5, 2],
      [-5e-5, 0],
      [-9e-5, 0],
      [-6e-5, 2],
      [0.00016, 1],
      [-0.0, 2],
      [-5e-5, 0],
      [2e-5, 2],
      [-0.00013, 0],
      [-5e-5, 0],
      [2e-5, 2],
      [2e-5, 2],
      [2e-5, 2],
      [-9e-5, 0],
      [-0.0, 2],
      [2e-5, 2],
      [-0.0, 2],
      [-9e-5, 0],
      [-5e-5, 0],
      [2e-5, 2],
      [0.00016, 1],
      [-9e-5, 0]
    ],
    "red_o_points": [],
    "y_categories": ["N", "NOT APPLICABLE", "nan"],
    "blue_o_points": [],
    "blue_x_points": [
      [0.00016, 1],
      [2e-5, 2],
      [0.00021, 1],
      [2e-5, 2],
      [9e-5, 1],
      [7e-5, 1]
    ]
  },
  "QS_mulGraftNerve[MP]": {
    "red_x_points": [
      [-2e-5, 2],
      [-0.0001, 0],
      [-0.0001, 0],
      [-1e-5, 0],
      [-6e-5, 0],
      [-0.00015, 0],
      [-9e-5, 0],
      [-0.0, 2],
      [-0.0001, 0],
      [-0.0001, 0],
      [-6e-5, 0],
      [-1e-5, 2],
      [0.0003, 1],
      [-2e-5, 2],
      [-0.0001, 0],
      [-1e-5, 2],
      [-9e-5, 0],
      [-0.00015, 0],
      [-1e-5, 2],
      [-2e-5, 2],
      [-3e-5, 2],
      [-9e-5, 0],
      [-2e-5, 2],
      [-0.00016, 2],
      [1e-5, 2],
      [-0.00015, 0],
      [-2e-5, 2],
      [-0.0001, 0],
      [-1e-5, 2],
      [0.00019, 1],
      [-0.00015, 0]
    ],
    "red_o_points": [],
    "y_categories": ["N", "NOT APPLICABLE", "nan"],
    "blue_o_points": [],
    "blue_x_points": [
      [0.00047, 1],
      [-1e-5, 2],
      [0.00021, 1],
      [5e-5, 0],
      [-1e-5, 2],
      [0.00021, 1],
      [0.0001, 1]
    ]
  },
  "QS_mulGraftNerve[Ax]": {
    "red_x_points": [
      [-0.00018, 2],
      [-0.00059, 0],
      [-0.00058, 0],
      [-0.00071, 0],
      [-0.00037, 0],
      [-0.00057, 0],
      [-0.00057, 0],
      [-0.0001, 2],
      [-0.00069, 0],
      [-0.00067, 0],
      [-0.0005, 0],
      [-0.00024, 2],
      [0.00082, 1],
      [-0.00017, 2],
      [-0.00068, 0],
      [-0.00028, 2],
      [-0.00047, 0],
      [-0.00072, 0],
      [-0.00021, 2],
      [-0.00016, 2],
      [-0.00017, 2],
      [-0.00051, 0],
      [-0.00012, 2],
      [-6e-5, 2],
      [-0.0002, 2],
      [-0.00054, 0],
      [-0.0002, 2],
      [-0.00068, 0],
      [-6e-5, 2],
      [0.00102, 1],
      [-0.00054, 0]
    ],
    "red_o_points": [],
    "y_categories": ["N", "NOT APPLICABLE", "nan"],
    "blue_o_points": [],
    "blue_x_points": [
      [0.00207, 1],
      [0.00014, 2],
      [0.0015, 1],
      [-5e-5, 0],
      [0.00017, 2],
      [0.00172, 1],
      [0.00137, 1]
    ]
  },
  "QA_lstPexMuscstrength[ElbowExte]": {
    "red_x_points": [
      [-0.00407, 1],
      [-0.0001, 2],
      [-0.00017, 1],
      [-2e-5, 1],
      [-0.00132, 0],
      [8e-5, 1],
      [-5e-5, 1],
      [-0.00305, 1],
      [-0.00131, 0],
      [-0.00058, 0],
      [0.00011, 1],
      [-0.00266, 1],
      [0.00013, 2],
      [0.00336, 2],
      [-0.00052, 2],
      [-0.00346, 1],
      [-8e-5, 2],
      [0.00017, 1],
      [-0.00191, 0],
      [-0.00242, 1],
      [-0.00321, 0],
      [0.0001, 1],
      [0.00269, 2],
      [-0.00289, 0],
      [-0.00342, 0],
      [0.0001, 1],
      [-0.00226, 1],
      [1e-5, 2],
      [-0.003, 1],
      [-0.00015, 2],
      [-2e-5, 1]
    ],
    "red_o_points": [],
    "y_categories": ["GREATER THAN OR EQUALS TO 3", "LESS THAN 3", "nan"],
    "blue_o_points": [],
    "blue_x_points": [
      [0.00032, 2],
      [0.00638, 2],
      [0.00039, 0],
      [0.00198, 1],
      [0.00756, 2],
      [0.00028, 0],
      [0.00019, 0]
    ]
  },
  "QA_intPexForearmSupin": {
    "red_x_points": [
      [8e-5, 2],
      [9e-5, 0],
      [4e-5, 2],
      [1e-5, 2],
      [-0.00058, 1],
      [-0.00017, 1],
      [2e-5, 2],
      [-0.0004, 1],
      [0.0, 2],
      [3e-5, 2],
      [2e-5, 2],
      [-0.00018, 0],
      [0.00058, 2],
      [0.00016, 2],
      [2e-5, 2],
      [7e-5, 2],
      [4e-5, 2],
      [-0.00056, 1],
      [-0.00043, 1],
      [-5e-5, 0],
      [-0.00053, 1],
      [-0.00018, 1],
      [5e-5, 2],
      [0.00023, 2],
      [0.00018, 2],
      [2e-5, 2],
      [-0.001, 1],
      [4e-5, 2],
      [0.00011, 2],
      [-0.01468, 1],
      [7e-5, 0]
    ],
    "red_o_points": [],
    "y_categories": ["GREATER THAN OR EQUALS TO 80", "LESS THAN 80", "nan"],
    "blue_o_points": [],
    "blue_x_points": [
      [0.00125, 2],
      [0.00029, 2],
      [0.006, 0],
      [0.0004, 2],
      [0.00031, 2],
      [0.00119, 2],
      [0.00118, 2]
    ]
  },
  "QA_intPexShoulderExrot": {
    "red_x_points": [
      [9e-5, 2],
      [-0.0001, 1],
      [-0.00016, 0],
      [7e-5, 2],
      [4e-5, 2],
      [-0.00012, 1],
      [-0.00011, 1],
      [-0.00016, 0],
      [4e-5, 2],
      [9e-5, 2],
      [0.00012, 2],
      [-0.00016, 1],
      [-0.00016, 1]
    ],
    "red_o_points": [],
    "y_categories": ["GREATER THAN OR EQUALS TO 60", "LESS THAN 60", "nan"],
    "blue_o_points": [],
    "blue_x_points": [[0.00012, 2], [0.00016, 2]]
  },
  "QS_mulGraftNerve[MCF]": {
    "red_x_points": [
      [-0.00013, 2],
      [-0.00038, 0],
      [-0.00033, 0],
      [-0.00019, 0],
      [-0.00032, 0],
      [-0.0003, 0],
      [-0.00028, 0],
      [-9e-5, 2],
      [-0.00024, 0],
      [-0.00027, 0],
      [-0.00028, 0],
      [-0.00018, 2],
      [0.0005, 1],
      [-7e-5, 2],
      [-0.00025, 0],
      [-9e-5, 2],
      [-0.00036, 0],
      [-0.0003, 0],
      [-8e-5, 2],
      [-0.00013, 2],
      [-9e-5, 2],
      [-0.0003, 0],
      [-8e-5, 2],
      [-0.00019, 2],
      [-0.0001, 2],
      [-0.00027, 0],
      [-0.00011, 2],
      [-0.00032, 0],
      [-4e-5, 2],
      [0.00079, 1],
      [-0.00026, 0]
    ],
    "red_o_points": [],
    "y_categories": ["N", "NOT APPLICABLE", "nan"],
    "blue_o_points": [],
    "blue_x_points": [
      [0.00096, 1],
      [-4e-5, 2],
      [0.0007, 1],
      [2e-5, 0],
      [5e-5, 2],
      [0.00061, 1],
      [0.00079, 1]
    ]
  },
  "QS_mulLysisSite[Nerve]": {
    "red_x_points": [
      [-0.00045, 3],
      [-0.00077, 0],
      [-0.00146, 2],
      [-0.0008, 0],
      [-0.00057, 0],
      [-0.00073, 0],
      [-0.00058, 0],
      [-0.00038, 3],
      [-0.00069, 0],
      [-0.00078, 0],
      [-0.00072, 0],
      [-0.00045, 3],
      [0.00214, 1],
      [-0.00031, 3],
      [-0.0007, 0],
      [-0.00027, 3],
      [-0.00064, 0],
      [-0.00047, 0],
      [-0.00038, 3],
      [-0.00035, 3],
      [-0.00049, 3],
      [-0.00062, 0],
      [-0.00032, 3],
      [-0.00034, 3],
      [-0.00035, 3],
      [-0.00042, 0],
      [-0.00038, 3],
      [-0.00076, 0],
      [-0.00037, 3],
      [0.00229, 1],
      [-0.00077, 0]
    ],
    "red_o_points": [],
    "y_categories": ["N", "NOT APPLICABLE", "Y", "nan"],
    "blue_o_points": [],
    "blue_x_points": [
      [0.00255, 1],
      [-0.00014, 3],
      [0.00215, 1],
      [-0.00058, 0],
      [-0.00014, 3],
      [0.00215, 1],
      [0.0023, 1]
    ]
  },
  "QS_mulGraftNerve[TD]": {
    "red_x_points": [
      [-0.00015, 2],
      [-0.00016, 0],
      [-0.00033, 0],
      [-0.00026, 0],
      [-0.00028, 0],
      [-0.00024, 0],
      [-0.00022, 0],
      [-0.00014, 2],
      [-0.0003, 0],
      [-0.00026, 0],
      [-0.00029, 0],
      [-0.00015, 2],
      [0.00055, 1],
      [-0.00017, 2],
      [-0.0003, 0],
      [-0.00017, 2],
      [-0.00014, 0],
      [-0.00021, 0],
      [-0.0001, 2],
      [-0.00014, 2],
      [-0.00012, 2],
      [-0.00024, 0],
      [-0.00013, 2],
      [-8e-5, 2],
      [-0.00014, 2],
      [-0.00015, 0],
      [-9e-5, 2],
      [-0.00031, 0],
      [-0.00012, 2],
      [0.00061, 1],
      [-0.00018, 0]
    ],
    "red_o_points": [],
    "y_categories": ["N", "NOT APPLICABLE", "nan"],
    "blue_o_points": [],
    "blue_x_points": [
      [0.00077, 1],
      [-6e-5, 2],
      [0.00066, 1],
      [-8e-5, 0],
      [-7e-5, 2],
      [0.00061, 1],
      [0.00091, 1]
    ]
  },
  "QS_mulGraftLevel[other]": {
    "red_x_points": [
      [-3e-5, 2],
      [-3e-5, 0],
      [-1e-5, 0],
      [-3e-5, 0],
      [-3e-5, 0],
      [-2e-5, 0],
      [-2e-5, 0],
      [-2e-5, 0],
      [-2e-5, 0],
      [-3e-5, 0],
      [-3e-5, 2],
      [-4e-5, 1],
      [-2e-5, 2],
      [-3e-5, 2],
      [-3e-5, 2],
      [-1e-5, 2],
      [-1e-5, 0],
      [-2e-5, 2],
      [-2e-5, 2],
      [-3e-5, 2],
      [-3e-5, 0],
      [-3e-5, 2],
      [-2e-5, 0],
      [-1e-5, 0]
    ],
    "red_o_points": [],
    "y_categories": ["N", "NOT APPLICABLE", "nan"],
    "blue_o_points": [],
    "blue_x_points": [
      [0.00018, 1],
      [-1e-5, 2],
      [-4e-5, 1],
      [6e-5, 0],
      [-1e-5, 2],
      [0.00019, 1]
    ]
  },
  "QS_lstBpsurgSide": {
    "red_x_points": [
      [-0.00343, 3],
      [-0.00524, 0],
      [-0.00532, 0],
      [-0.00488, 0],
      [-0.01062, 2],
      [-0.0047, 0],
      [-0.00604, 0],
      [-0.00339, 3],
      [-0.00497, 0],
      [-0.01076, 2],
      [-0.0108, 2],
      [-0.00342, 3],
      [0.01862, 1],
      [-0.00316, 3],
      [-0.01148, 2],
      [-0.00295, 3],
      [-0.01143, 2],
      [-0.01102, 2],
      [-0.00327, 3],
      [-0.00341, 3],
      [-0.00302, 3],
      [-0.00507, 0],
      [-0.00336, 3],
      [-0.00329, 3],
      [-0.00339, 3],
      [-0.01095, 2],
      [-0.00345, 3],
      [-0.01053, 2],
      [-0.00335, 3],
      [0.01914, 1],
      [-0.00559, 0]
    ],
    "red_o_points": [],
    "y_categories": ["L", "NOT APPLICABLE", "R", "nan"],
    "blue_o_points": [],
    "blue_x_points": [
      [0.02671, 1],
      [-0.00085, 3],
      [0.02178, 1],
      [0.00053, 0],
      [-0.00122, 3],
      [0.02032, 1],
      [0.0217, 1]
    ]
  },
  "QS_mulTransfSite[AcMc]": {
    "red_x_points": [
      [-0.00118, 3],
      [-0.00141, 0],
      [-0.00155, 0],
      [-0.00137, 0],
      [-0.00143, 0],
      [-0.00144, 0],
      [-0.00157, 0],
      [-0.00117, 3],
      [-0.00157, 0],
      [-0.00127, 0],
      [-0.00326, 2],
      [-0.0011, 3],
      [0.00424, 1],
      [-0.00102, 3],
      [-0.00132, 0],
      [-0.00103, 3],
      [-0.00152, 0],
      [-0.00136, 0],
      [-0.00093, 3],
      [-0.00102, 3],
      [-0.00129, 3],
      [-0.00129, 0],
      [-0.00107, 3],
      [-0.00105, 3],
      [-0.00108, 3],
      [-0.00135, 0],
      [-0.00124, 3],
      [-0.00141, 0],
      [-0.00098, 3],
      [0.00498, 1],
      [-0.00116, 0]
    ],
    "red_o_points": [],
    "y_categories": ["N", "NOT APPLICABLE", "Y", "nan"],
    "blue_o_points": [],
    "blue_x_points": [
      [0.00597, 1],
      [-0.00066, 3],
      [0.00491, 1],
      [-0.00133, 0],
      [-0.00037, 3],
      [0.00531, 1],
      [0.00521, 1]
    ]
  },
  "QS_mulTransfSite[Other]": {
    "red_x_points": [
      [-0.0007, 3],
      [-0.0016, 0],
      [-0.00145, 0],
      [-0.00125, 0],
      [-0.00144, 0],
      [-0.00148, 0],
      [-0.00129, 0],
      [-0.00099, 3],
      [-0.00136, 0],
      [-0.00125, 0],
      [-0.00143, 0],
      [-0.00112, 3],
      [0.00402, 1],
      [-0.00081, 3],
      [-0.00148, 0],
      [-0.00109, 3],
      [-0.00154, 0],
      [-0.00372, 2],
      [-0.00094, 3],
      [-0.00071, 3],
      [-0.00117, 3],
      [-0.00138, 0],
      [-0.00084, 3],
      [-0.00072, 3],
      [-0.00055, 3],
      [-0.00153, 0],
      [-0.00072, 3],
      [-0.00142, 0],
      [-0.00055, 3],
      [0.00382, 1],
      [-0.00143, 0]
    ],
    "red_o_points": [],
    "y_categories": ["N", "NOT APPLICABLE", "Y", "nan"],
    "blue_o_points": [],
    "blue_x_points": [
      [0.0057, 1],
      [-0.00034, 3],
      [0.00472, 1],
      [-0.00105, 0],
      [-0.0003, 3],
      [0.00514, 1],
      [0.00533, 1]
    ]
  },
  "QA_mulInjOrthesisType[ShoulderSupport]": {
    "red_x_points": [
      [-0.00962, 0],
      [-0.00863, 0],
      [-0.00829, 0],
      [-0.00878, 0],
      [-0.00926, 0],
      [-0.00857, 0],
      [-0.00922, 0],
      [-0.01129, 2],
      [-0.00863, 0],
      [-0.0086, 0],
      [-0.00919, 0],
      [-0.00929, 0],
      [0.0251, 1],
      [-0.00966, 0],
      [-0.00893, 0],
      [-0.00923, 0],
      [-0.01138, 2],
      [-0.00917, 0],
      [-0.00954, 0],
      [-0.00961, 0],
      [-0.01118, 2],
      [-0.01044, 3],
      [-0.00908, 0],
      [0.02615, 1],
      [-0.0093, 0],
      [-0.0084, 0],
      [-0.00943, 0],
      [-0.00882, 0],
      [-0.01136, 3],
      [-0.01511, 3],
      [-0.00885, 0]
    ],
    "red_o_points": [],
    "y_categories": ["N", "NOT APPLICABLE", "Y", "nan"],
    "blue_o_points": [],
    "blue_x_points": [
      [-0.00424, 0],
      [0.02504, 1],
      [0.02187, 1],
      [0.02963, 1],
      [0.02697, 1],
      [0.02459, 1],
      [0.02468, 1]
    ]
  },
  "QA_equInjTbpiAge": {
    "red_x_points": [
      [-0.00056, 1],
      [-0.00019, 1],
      [-3e-5, 1],
      [-0.0001, 0],
      [-0.00086, 0],
      [-1e-5, 1],
      [4e-5, 1],
      [0.00034, 0],
      [-0.00089, 0],
      [-0.00015, 0],
      [0.0, 1],
      [0.00045, 0],
      [-0.01091, 1],
      [-0.00067, 1],
      [0.0001, 1],
      [-0.00076, 1],
      [-0.0004, 0],
      [-0.00038, 0],
      [-0.00105, 1],
      [0.00069, 0],
      [-0.00069, 1],
      [-5e-5, 1],
      [-0.00078, 1],
      [-0.00167, 1],
      [0.00042, 0],
      [6e-5, 1],
      [-0.0008, 1],
      [-6e-5, 1],
      [-0.00057, 1],
      [-0.01126, 1],
      [4e-5, 0]
    ],
    "red_o_points": [],
    "y_categories": ["GREATER THAN OR EQUALS TO 30", "LESS THAN 30", "nan"],
    "blue_o_points": [],
    "blue_x_points": [
      [-0.00329, 1],
      [-0.00094, 1],
      [0.00647, 0],
      [0.0004, 1],
      [0.00375, 0],
      [0.00657, 0],
      [0.0063, 0]
    ]
  },
  "QS_mulLysisNerve[Ssr]": {
    "red_x_points": [
      [-0.00058, 3],
      [-0.00083, 0],
      [-0.00155, 2],
      [-0.00089, 0],
      [-0.00082, 0],
      [-0.00084, 0],
      [-0.00074, 0],
      [-0.00055, 3],
      [-0.00079, 0],
      [-0.0008, 0],
      [-0.00089, 0],
      [-0.0007, 3],
      [0.00214, 1],
      [-0.00049, 3],
      [-0.00061, 0],
      [-0.00074, 3],
      [-0.00072, 0],
      [-0.00083, 0],
      [-0.00045, 3],
      [-0.00048, 3],
      [-0.00046, 3],
      [-0.00066, 0],
      [-0.00056, 3],
      [-0.00061, 3],
      [-0.00052, 3],
      [-0.00082, 0],
      [-0.00055, 3],
      [-0.00082, 0],
      [-0.00058, 3],
      [0.00226, 1],
      [-0.00084, 0]
    ],
    "red_o_points": [],
    "y_categories": ["N", "NOT APPLICABLE", "Y", "nan"],
    "blue_o_points": [],
    "blue_x_points": [
      [0.00338, 1],
      [-0.00014, 3],
      [0.00267, 1],
      [-0.0007, 0],
      [-0.00023, 3],
      [0.00296, 1],
      [0.00259, 1]
    ]
  },
  "QS_mulTransfSite[AcSsAA]": {
    "red_x_points": [
      [-0.00234, 3],
      [-0.00811, 2],
      [-0.00398, 0],
      [-0.0076, 2],
      [-0.00743, 2],
      [-0.00349, 0],
      [-0.00361, 0],
      [-0.00242, 3],
      [-0.00334, 0],
      [-0.00748, 2],
      [-0.00322, 0],
      [-0.00247, 3],
      [0.01247, 1],
      [-0.0024, 3],
      [-0.00874, 2],
      [-0.0027, 3],
      [-0.00337, 0],
      [-0.0037, 0],
      [-0.00237, 3],
      [-0.0025, 3],
      [-0.00259, 3],
      [-0.00737, 2],
      [-0.00236, 3],
      [-0.00266, 3],
      [-0.0025, 3],
      [-0.00359, 0],
      [-0.00248, 3],
      [-0.00764, 2],
      [-0.0025, 3],
      [0.01427, 1],
      [-0.00346, 0]
    ],
    "red_o_points": [],
    "y_categories": ["N", "NOT APPLICABLE", "Y", "nan"],
    "blue_o_points": [],
    "blue_x_points": [
      [0.01676, 1],
      [-0.001, 3],
      [0.01514, 1],
      [-0.00099, 0],
      [-0.00123, 3],
      [0.01421, 1],
      [0.01483, 1]
    ]
  },
  "QA_lstPexMuscstrength[WristExte]": {
    "red_x_points": [
      [-0.00322, 1],
      [-8e-5, 2],
      [-0.00148, 1],
      [-0.00132, 1],
      [0.00045, 0],
      [-0.00165, 1],
      [-0.00151, 1],
      [-0.00178, 0],
      [0.00095, 0],
      [0.00044, 0],
      [-0.00171, 1],
      [-0.00144, 0],
      [-0.00102, 2],
      [0.00185, 2],
      [-3e-5, 2],
      [-0.00131, 0],
      [5e-5, 2],
      [0.0003, 0],
      [-0.0008, 0],
      [-0.00297, 1],
      [-0.00124, 0],
      [-0.00158, 1],
      [0.00175, 2],
      [-0.00096, 0],
      [-0.00362, 1],
      [0.00047, 0],
      [-0.00281, 1],
      [0.0004, 0],
      [0.00223, 2],
      [-0.00097, 2],
      [-0.00108, 1]
    ],
    "red_o_points": [],
    "y_categories": ["GREATER THAN OR EQUALS TO 3", "LESS THAN 3", "nan"],
    "blue_o_points": [],
    "blue_x_points": [
      [0.00077, 0],
      [0.0035, 2],
      [0.00079, 0],
      [0.00239, 0],
      [0.00469, 2],
      [0.00055, 1],
      [0.00072, 0]
    ]
  },
  "QS_mulGraftTrunk[LowerTrunk]": {
    "red_x_points": [
      [-7e-5, 2],
      [-0.00017, 0],
      [-8e-5, 0],
      [-0.00014, 0],
      [-8e-5, 0],
      [-8e-5, 0],
      [-8e-5, 0],
      [-1e-5, 2],
      [-8e-5, 0],
      [-0.00011, 0],
      [-2e-5, 2],
      [4e-5, 1],
      [0.0, 2],
      [-0.00017, 0],
      [-5e-5, 2],
      [-0.00011, 0],
      [-8e-5, 0],
      [-7e-5, 2],
      [-7e-5, 2],
      [-1e-5, 2],
      [-0.00015, 0],
      [0.0, 2],
      [-0.00016, 2],
      [-6e-5, 2],
      [-5e-5, 0],
      [-6e-5, 2],
      [-8e-5, 0],
      [-6e-5, 2],
      [0.00042, 1],
      [-0.00011, 0]
    ],
    "red_o_points": [],
    "y_categories": ["N", "NOT APPLICABLE", "nan"],
    "blue_o_points": [],
    "blue_x_points": [
      [0.00042, 1],
      [5e-5, 2],
      [0.00031, 1],
      [-0.00011, 0],
      [4e-5, 2],
      [0.00032, 1],
      [0.00042, 1]
    ]
  },
  "QS_mulNeuromadSite[T1]": {
    "red_x_points": [
      [-0.00127, 2],
      [-0.00365, 0],
      [-0.0044, 0],
      [-0.00373, 0],
      [-0.0041, 0],
      [-0.00397, 0],
      [-0.00382, 0],
      [-0.00094, 2],
      [-0.00429, 0],
      [-0.00389, 0],
      [-0.00409, 0],
      [-0.00149, 2],
      [0.00797, 1],
      [-0.00147, 2],
      [-0.00397, 0],
      [-0.00149, 2],
      [-0.00362, 0],
      [-0.0042, 0],
      [-0.00122, 2],
      [-0.00128, 2],
      [-0.00132, 2],
      [-0.00397, 0],
      [-0.00167, 2],
      [-0.00146, 2],
      [-0.00133, 2],
      [-0.00406, 0],
      [-0.00132, 2],
      [-0.00411, 0],
      [-0.00116, 2],
      [0.0087, 1],
      [-0.0035, 0]
    ],
    "red_o_points": [],
    "y_categories": ["N", "NOT APPLICABLE", "nan"],
    "blue_o_points": [],
    "blue_x_points": [
      [0.01211, 1],
      [-0.00028, 2],
      [0.00902, 1],
      [-0.00041, 0],
      [-0.00037, 2],
      [0.00946, 1],
      [0.01064, 1]
    ]
  },
  "QA_lstPexMuscstrength[ShoulderAbduc]": {
    "red_x_points": [
      [-0.00502, 1],
      [-0.00483, 1],
      [-0.00521, 1],
      [-0.00481, 1],
      [-0.00514, 1],
      [-0.00489, 1],
      [-0.00558, 1],
      [-0.00492, 1],
      [-0.00517, 1],
      [-0.00471, 1],
      [-0.00496, 1],
      [-0.00527, 1],
      [0.00336, 2],
      [0.00449, 2],
      [0.00485, 2],
      [0.00451, 2],
      [0.00433, 2],
      [-0.0055, 1],
      [-0.0056, 1],
      [-0.00476, 1],
      [-0.00501, 1],
      [-0.00498, 1],
      [0.00413, 2],
      [-0.00562, 1],
      [-0.00531, 1],
      [-0.00552, 1],
      [-0.00537, 1],
      [-0.00512, 1],
      [-0.00472, 1],
      [0.00269, 2],
      [-0.00537, 1]
    ],
    "red_o_points": [],
    "y_categories": ["GREATER THAN OR EQUALS TO 3", "LESS THAN 3", "nan"],
    "blue_o_points": [],
    "blue_x_points": [
      [0.0032, 2],
      [0.0044, 2],
      [0.02224, 0],
      [0.00528, 2],
      [0.00432, 2],
      [0.02108, 0],
      [-0.00143, 1]
    ]
  },
  "QA_lstPexMuscstrength[ShoulderExrot]": {
    "red_x_points": [
      [-0.00109, 1],
      [0.00021, 2],
      [0.00109, 0],
      [-0.00088, 1],
      [-0.00078, 1],
      [-0.00087, 1],
      [0.00017, 2],
      [-0.00115, 1],
      [-0.00108, 1],
      [-0.00093, 1],
      [0.00017, 2],
      [-0.00076, 1],
      [-0.00031, 2],
      [0.00011, 2],
      [0.00017, 2],
      [0.00023, 2],
      [0.0002, 2],
      [-0.00102, 1],
      [-0.00091, 1],
      [-0.00098, 1],
      [-0.00105, 1],
      [0.00018, 2],
      [0.00022, 2],
      [0.00027, 2],
      [9e-5, 2],
      [-0.00119, 1],
      [0.00019, 2],
      [0.00078, 0],
      [0.00023, 2],
      [-0.00029, 2],
      [-0.00092, 1]
    ],
    "red_o_points": [],
    "y_categories": ["GREATER THAN OR EQUALS TO 3", "LESS THAN 3", "nan"],
    "blue_o_points": [],
    "blue_x_points": [
      [7e-5, 2],
      [0.00026, 2],
      [0.00252, 0],
      [0.00054, 2],
      [0.00026, 2],
      [0.00247, 0],
      [7e-5, 1]
    ]
  },
  "QS_mulGraftLevel[Root]": {
    "red_x_points": [
      [-4e-5, 2],
      [-2e-5, 0],
      [-4e-5, 2],
      [-2e-5, 0],
      [-4e-5, 2],
      [6e-5, 1]
    ],
    "red_o_points": [],
    "y_categories": ["N", "NOT APPLICABLE", "nan"],
    "blue_o_points": [],
    "blue_x_points": [[6e-5, 1], [-2e-5, 0], [-4e-5, 2]]
  },
  "QS_mulGraftNerve[Sc]": {
    "red_x_points": [
      [-2e-5, 2],
      [-6e-5, 0],
      [-2e-5, 0],
      [-6e-5, 0],
      [-6e-5, 0],
      [-2e-5, 0],
      [-7e-5, 0],
      [-4e-5, 2],
      [-6e-5, 0],
      [-6e-5, 0],
      [-7e-5, 0],
      [-2e-5, 2],
      [0.0001, 1],
      [-2e-5, 2],
      [-5e-5, 2],
      [-5e-5, 0],
      [-7e-5, 0],
      [-4e-5, 2],
      [-5e-5, 2],
      [-5e-5, 0],
      [-4e-5, 2],
      [-2e-5, 2],
      [-4e-5, 2],
      [-7e-5, 0],
      [-2e-5, 2],
      [-7e-5, 0],
      [0.0001, 1],
      [-5e-5, 0]
    ],
    "red_o_points": [],
    "y_categories": ["N", "NOT APPLICABLE", "nan"],
    "blue_o_points": [],
    "blue_x_points": [[0.00048, 1], [-2e-5, 2], [0.0001, 1], [0.0001, 1]]
  },
  "QA_yonPreOrtsurg": {
    "red_x_points": [
      [-0.00403, 0],
      [-0.00014, 2],
      [-0.00018, 0],
      [-0.00014, 0],
      [-0.00012, 0],
      [-8e-5, 0],
      [-0.00012, 0],
      [-0.00074, 2],
      [-0.00025, 0],
      [-8e-5, 0],
      [-0.00023, 2],
      [0.00624, 1],
      [-0.0011, 0],
      [-0.00035, 2],
      [-0.00043, 0],
      [-0.00435, 0],
      [0.00016, 1],
      [-2e-5, 0],
      [-0.00484, 0],
      [-0.00429, 0],
      [-0.00384, 0],
      [-0.00016, 0],
      [-0.00458, 0],
      [-0.00475, 0],
      [-0.00436, 0],
      [-6e-5, 2],
      [-0.00069, 2],
      [-0.00027, 0],
      [-0.00068, 2],
      [-0.0003, 2],
      [3e-5, 1]
    ],
    "red_o_points": [],
    "y_categories": ["N", "Y", "nan"],
    "blue_o_points": [],
    "blue_x_points": [
      [-3e-5, 0],
      [0.00172, 2],
      [-0.00011, 0],
      [-0.00011, 0],
      [0.01805, 1],
      [-0.00011, 0],
      [-7e-5, 0]
    ]
  },
  "QS_mulGraftNerve[Ra]": {
    "red_x_points": [
      [-0.00042, 2],
      [-0.00089, 0],
      [-0.00092, 0],
      [-0.00083, 0],
      [-0.00078, 0],
      [-0.00081, 0],
      [-0.00091, 0],
      [-0.00037, 2],
      [-0.00088, 0],
      [-0.00083, 0],
      [-0.00059, 0],
      [-0.00027, 2],
      [0.00163, 1],
      [-0.00026, 2],
      [-0.00115, 0],
      [-0.00049, 2],
      [-0.00078, 0],
      [-0.00073, 0],
      [-0.00041, 2],
      [-0.00041, 2],
      [-0.00023, 2],
      [-0.0006, 0],
      [-0.00019, 2],
      [-0.00033, 2],
      [-0.0004, 2],
      [-0.00091, 0],
      [-0.00038, 2],
      [-0.00058, 0],
      [-0.00025, 2],
      [0.00163, 1],
      [-0.00076, 0]
    ],
    "red_o_points": [],
    "y_categories": ["N", "NOT APPLICABLE", "nan"],
    "blue_o_points": [],
    "blue_x_points": [
      [0.00344, 1],
      [7e-5, 2],
      [0.00172, 1],
      [-0.00014, 0],
      [0.0001, 2],
      [0.00225, 1],
      [0.0022, 1]
    ]
  },
  "QS_mulTransfSite[Oberlin]": {
    "red_x_points": [
      [-0.00327, 3],
      [-0.00937, 0],
      [-0.0095, 0],
      [-0.00958, 0],
      [-0.00428, 2],
      [-0.00437, 2],
      [-0.00997, 0],
      [-0.00318, 3],
      [-0.00426, 2],
      [-0.00441, 2],
      [-0.00461, 2],
      [-0.00331, 3],
      [0.01671, 1],
      [-0.0029, 3],
      [-0.00462, 2],
      [-0.00341, 3],
      [-0.00901, 0],
      [-0.00451, 2],
      [-0.00355, 3],
      [-0.00297, 3],
      [-0.00311, 3],
      [-0.00864, 0],
      [-0.00291, 3],
      [-0.00346, 3],
      [-0.00308, 3],
      [-0.00423, 2],
      [-0.00295, 3],
      [-0.00884, 0],
      [-0.00282, 3],
      [0.01673, 1],
      [-0.00934, 0]
    ],
    "red_o_points": [],
    "y_categories": ["N", "NOT APPLICABLE", "Y", "nan"],
    "blue_o_points": [],
    "blue_x_points": [
      [0.02357, 1],
      [-0.00114, 3],
      [0.01767, 1],
      [-0.00015, 2],
      [-0.00106, 3],
      [0.01797, 1],
      [0.01768, 1]
    ]
  },
  "QA_intPexForearmProna": {
    "red_x_points": [
      [7e-5, 2],
      [-0.00023, 0],
      [3e-5, 2],
      [4e-5, 2],
      [-0.00074, 0],
      [-0.00049, 0],
      [4e-5, 2],
      [-0.00044, 0],
      [3e-5, 2],
      [3e-5, 2],
      [5e-5, 2],
      [-0.00048, 0],
      [6e-5, 2],
      [3e-5, 2],
      [3e-5, 2],
      [8e-5, 2],
      [2e-5, 2],
      [-0.00087, 0],
      [-0.00044, 0],
      [-0.00051, 0],
      [-0.00048, 0],
      [-0.00046, 0],
      [6e-5, 2],
      [0.00011, 2],
      [3e-5, 2],
      [7e-5, 2],
      [0.00025, 1],
      [7e-5, 2],
      [8e-5, 2],
      [0.00062, 1],
      [-0.00046, 0]
    ],
    "red_o_points": [],
    "y_categories": ["GREATER THAN OR EQUALS TO 80", "LESS THAN 80", "nan"],
    "blue_o_points": [],
    "blue_x_points": [
      [4e-5, 2],
      [7e-5, 2],
      [0.00123, 1],
      [0.00027, 2],
      [0.00013, 2],
      [1e-5, 2],
      [-0.0, 2]
    ]
  },
  "QS_mulGraftNerve[FI]": {
    "red_x_points": [
      [-0.00062, 2],
      [-0.00121, 0],
      [-0.00108, 0],
      [-0.00114, 0],
      [-0.00138, 0],
      [-0.00134, 0],
      [-0.00143, 0],
      [-0.00048, 2],
      [-0.0013, 0],
      [-0.0011, 0],
      [-0.00101, 0],
      [-0.00044, 2],
      [0.00196, 1],
      [-0.00068, 2],
      [-0.00107, 0],
      [-0.00057, 2],
      [-0.00103, 0],
      [-0.00129, 0],
      [-0.00047, 2],
      [-0.0005, 2],
      [-0.00059, 2],
      [-0.0011, 0],
      [-0.0007, 2],
      [-0.0006, 2],
      [-0.00072, 2],
      [-0.00119, 0],
      [-0.00059, 2],
      [-0.00132, 0],
      [-0.00059, 2],
      [0.00321, 1],
      [-0.0013, 0]
    ],
    "red_o_points": [],
    "y_categories": ["N", "NOT APPLICABLE", "nan"],
    "blue_o_points": [],
    "blue_x_points": [
      [0.00462, 1],
      [-0.00018, 2],
      [0.00241, 1],
      [-0.00023, 0],
      [-0.00016, 2],
      [0.00305, 1],
      [0.0042, 1]
    ]
  },
  "QA_lstPexPalle[Ulna]": {
    "red_x_points": [
      [7e-5, 3],
      [-6e-5, 2],
      [-6e-5, 1],
      [7e-5, 3],
      [8e-5, 3],
      [-6e-5, 2],
      [-0.00014, 1],
      [7e-5, 3],
      [-6e-5, 2],
      [-0.00014, 2],
      [-0.00014, 2],
      [-0.00014, 2],
      [3e-5, 3],
      [-7e-5, 2],
      [7e-5, 3]
    ],
    "red_o_points": [],
    "y_categories": ["ABS", "HYPO", "PT", "nan"],
    "blue_o_points": [],
    "blue_x_points": [[4e-5, 3], [8e-5, 3], [7e-5, 3]]
  }
}
