{
  "QA_lstPexMuscstrength[ElbowFlex]": {
    "red_x_points": [
      [-0.01609, 1],
      [-0.00095, 2],
      [-0.01399, 1],
      [-0.01322, 1],
      [-0.01488, 1],
      [-0.01649, 1],
      [-0.01453, 1],
      [-0.01412, 1],
      [-0.0151, 1],
      [-0.0163, 1],
      [-0.01567, 1],
      [-0.01622, 1],
      [-0.00162, 2],
      [-0.00601, 2],
      [0.00213, 2],
      [-0.01543, 1],
      [-0.01594, 1],
      [-0.01429, 1],
      [-0.01361, 1],
      [-0.01569, 1],
      [-0.00159, 2],
      [-0.01502, 1],
      [-0.01632, 1],
      [-0.01579, 1],
      [-0.01351, 1],
      [0.00115, 2],
      [-0.01358, 1],
      [-0.01443, 1],
      [-0.00114, 2]
    ],
    "red_o_points": [],
    "y_categories": ["GREATER THAN OR EQUALS TO 3", "LESS THAN 3", "nan"],
    "blue_o_points": [],
    "blue_x_points": [
      [0.00161, 2],
      [-0.01415, 1],
      [0.08483, 0],
      [-0.01474, 1],
      [0.00509, 2],
      [0.00416, 2],
      [0.0519, 0],
      [-0.01187, 1],
      [-0.01401, 1],
      [0.00346, 2],
      [0.08147, 0],
      [0.05547, 0],
      [0.06642, 0],
      [0.05144, 0],
      [-0.01284, 1]
    ]
  },
  "participant_code": {
    "red_x_points": [
      [-0.06081, 1],
      [-0.05875, 2],
      [-0.05937, 3],
      [-0.0604, 4],
      [-0.06095, 5],
      [-0.05903, 8],
      [-0.06115, 9],
      [-0.06074, 10],
      [-0.06033, 11],
      [-0.05848, 13],
      [-0.05903, 14],
      [-0.0591, 18],
      [-0.05923, 19],
      [-0.0591, 20],
      [-0.0591, 23],
      [-0.0593, 26],
      [-0.06074, 28],
      [-0.05944, 29],
      [-0.05951, 30],
      [-0.0593, 31],
      [-0.05917, 32],
      [-0.05923, 34],
      [-0.05971, 36],
      [-0.06013, 38],
      [-0.06081, 39],
      [-0.0591, 40],
      [-0.06115, 41],
      [-0.05999, 42],
      [-0.05978, 43]
    ],
    "red_o_points": [],
    "y_categories": [
      "P16554",
      "P18297",
      "P19283",
      "P19287",
      "P23172",
      "P23391",
      "P30595",
      "P31645",
      "P31691",
      "P34778",
      "P35046",
      "P36328",
      "P43633",
      "P4544",
      "P46417",
      "P48965",
      "P53068",
      "P5497",
      "P58556",
      "P59529",
      "P62483",
      "P64658",
      "P65202",
      "P66816",
      "P6751",
      "P7408",
      "P75566",
      "P76226",
      "P79971",
      "P82621",
      "P82990",
      "P84549",
      "P84932",
      "P85825",
      "P86989",
      "P8770",
      "P87791",
      "P90550",
      "P93159",
      "P94969",
      "P96710",
      "P97130",
      "P9744",
      "P98500",
      "nan"
    ],
    "blue_o_points": [],
    "blue_x_points": [
      [0.11655, 0],
      [0.11419, 6],
      [0.11774, 7],
      [0.1159, 12],
      [0.11209, 15],
      [0.11537, 16],
      [0.11563, 17],
      [0.11603, 21],
      [0.11577, 22],
      [0.11366, 24],
      [0.11669, 25],
      [0.1159, 27],
      [0.1155, 33],
      [0.11577, 35],
      [0.11616, 37]
    ]
  },
  "QS_mulLysisTrunk[Upper]": {
    "red_x_points": [
      [-0.00033, 3],
      [-0.0051, 0],
      [-0.00292, 0],
      [-0.00206, 0],
      [-0.00307, 0],
      [-0.00848, 2],
      [-0.00299, 0],
      [-0.00051, 3],
      [-0.0031, 0],
      [-0.00246, 0],
      [-0.00029, 3],
      [-0.00251, 0],
      [-0.00122, 3],
      [-0.00561, 0],
      [-0.00801, 2],
      [-0.00045, 3],
      [-0.00039, 3],
      [-0.00022, 3],
      [-0.00206, 0],
      [-0.00039, 3],
      [-0.0012, 3],
      [-0.00051, 3],
      [-0.00268, 0],
      [-0.00196, 0],
      [-0.00052, 3],
      [0.00774, 1],
      [-0.0005, 3],
      [-0.00938, 2],
      [-0.00084, 3]
    ],
    "red_o_points": [],
    "y_categories": ["N", "NOT APPLICABLE", "Y", "nan"],
    "blue_o_points": [],
    "blue_x_points": [
      [0.02706, 1],
      [-0.0001, 3],
      [-0.00058, 0],
      [-0.00114, 0],
      [0.00031, 3],
      [0.01414, 1],
      [0.00741, 1],
      [-0.00132, 0],
      [-6e-5, 3],
      [3e-5, 3],
      [-0.00047, 0],
      [0.0084, 1],
      [-0.0001, 3],
      [0.00874, 1],
      [-0.00031, 3]
    ]
  },
  "QS_lstBpsurgSide": {
    "red_x_points": [
      [-0.00064, 3],
      [-0.01694, 0],
      [-0.01751, 0],
      [-0.01272, 0],
      [-0.01806, 0],
      [-0.01469, 0],
      [-0.01743, 0],
      [-0.00179, 3],
      [-0.01876, 0],
      [0.00349, 2],
      [-0.00088, 3],
      [0.00372, 2],
      [-0.00219, 3],
      [0.00379, 2],
      [-0.00227, 2],
      [-0.00097, 3],
      [-0.00098, 3],
      [-0.00036, 3],
      [-0.00597, 0],
      [-0.00061, 3],
      [-0.00207, 3],
      [-0.00174, 3],
      [0.0032, 2],
      [0.00397, 2],
      [-0.00151, 3],
      [0.0131, 1],
      [-0.00141, 3],
      [-0.01492, 0],
      [-0.00194, 3]
    ],
    "red_o_points": [],
    "y_categories": ["L", "NOT APPLICABLE", "R", "nan"],
    "blue_o_points": [],
    "blue_x_points": [
      [0.04866, 1],
      [-0.00097, 3],
      [0.00662, 2],
      [0.01176, 2],
      [0.00032, 3],
      [0.01556, 1],
      [0.00923, 1],
      [-0.00058, 0],
      [-0.00081, 3],
      [-2e-5, 3],
      [0.00643, 2],
      [0.01509, 1],
      [-8e-5, 3],
      [0.01447, 1],
      [-0.00059, 3]
    ]
  },
  "QS_mulBpsurgeryType[Lysis]": {
    "red_x_points": [
      [-0.00107, 3],
      [-0.00738, 0],
      [-0.01894, 2],
      [-0.01622, 2],
      [-0.00374, 0],
      [-0.01726, 2],
      [-0.00341, 0],
      [-0.00208, 3],
      [-0.00346, 0],
      [-0.0032, 0],
      [-0.00113, 3],
      [-0.00255, 0],
      [-0.00296, 3],
      [-0.00721, 0],
      [-0.0157, 2],
      [-0.00147, 3],
      [-0.00132, 3],
      [-0.0007, 3],
      [-0.00293, 0],
      [-0.00101, 3],
      [-0.00307, 3],
      [-0.00212, 3],
      [-0.00324, 0],
      [-0.00245, 0],
      [-0.00186, 3],
      [0.01805, 1],
      [-0.00172, 3],
      [-0.01829, 2],
      [-0.00223, 3]
    ],
    "red_o_points": [],
    "y_categories": ["N", "NOT APPLICABLE", "Y", "nan"],
    "blue_o_points": [],
    "blue_x_points": [
      [0.05043, 1],
      [-0.00151, 3],
      [0.00053, 0],
      [-0.00062, 0],
      [0.00032, 3],
      [0.02777, 1],
      [0.01721, 1],
      [-0.00121, 0],
      [-0.00135, 3],
      [-0.0002, 3],
      [0.0002, 0],
      [0.02002, 1],
      [-0.00029, 3],
      [0.02036, 1],
      [-0.00099, 3]
    ]
  },
  "QA_yonInjUnconscio": {
    "red_x_points": [
      [-0.02622, 1],
      [-0.02597, 1],
      [-0.00116, 2],
      [-0.00225, 2],
      [-0.00144, 2],
      [-0.0285, 1],
      [-0.00122, 2],
      [-0.00315, 2],
      [-0.00177, 2],
      [-0.03025, 1],
      [-0.02726, 1],
      [-0.02965, 1],
      [-0.00511, 2],
      [-0.00211, 2],
      [-0.01434, 1],
      [-0.02721, 1],
      [-0.02718, 1],
      [-0.01537, 1],
      [-0.0165, 1],
      [-0.02663, 1],
      [-0.00575, 2],
      [-0.0024, 2],
      [-0.02944, 1],
      [-0.02681, 1],
      [-0.00426, 2],
      [-0.00349, 2],
      [-0.00462, 2],
      [-0.02586, 1],
      [-0.0059, 2]
    ],
    "red_o_points": [],
    "y_categories": ["N", "Y", "nan"],
    "blue_o_points": [],
    "blue_x_points": [
      [-0.00052, 2],
      [-0.0009, 2],
      [0.09646, 0],
      [0.00022, 2],
      [-0.00839, 1],
      [-0.01125, 1],
      [0.04494, 0],
      [0.06772, 0],
      [-0.00128, 2],
      [0.06386, 0],
      [0.09023, 0],
      [-0.00223, 2],
      [-0.01136, 1],
      [-0.00235, 2],
      [0.09665, 0]
    ]
  },
  "QA_lstPexTouch[C7]": {
    "red_x_points": [
      [-0.00342, 1],
      [-0.00917, 2],
      [-0.00573, 1],
      [-0.00254, 1],
      [-0.01728, 2],
      [-0.00913, 1],
      [-0.01041, 1],
      [-0.00581, 0],
      [-0.01542, 1],
      [-0.01585, 1],
      [-0.00283, 1],
      [-0.02559, 2],
      [-0.00949, 2],
      [-0.02668, 2],
      [-0.00313, 2],
      [0.00277, 0],
      [-0.0039, 1],
      [-0.00243, 0],
      [-0.00924, 2],
      [-0.00249, 0],
      [-0.00925, 2],
      [-0.00679, 0],
      [-0.01579, 1],
      [-0.01557, 2],
      [-0.00666, 0],
      [-7e-5, 1],
      [-0.00058, 2],
      [-0.00256, 1],
      [0.00424, 1]
    ],
    "red_o_points": [],
    "y_categories": ["NORM", "NPV", "nan"],
    "blue_o_points": [],
    "blue_x_points": [
      [-0.00018, 1],
      [0.01153, 1],
      [0.05814, 0],
      [0.08237, 0],
      [0.01247, 2],
      [3e-5, 2],
      [-2e-5, 1],
      [-0.00485, 1],
      [0.01093, 1],
      [0.0051, 2],
      [0.04746, 0],
      [3e-5, 1],
      [0.00224, 0],
      [0.00038, 0],
      [0.00516, 0]
    ]
  },
  "QA_lstPexInspectio[SurgicalScar]": {
    "red_x_points": [
      [-0.00394, 1],
      [-0.00617, 1],
      [-0.01296, 0],
      [-0.0048, 1],
      [-0.01242, 1],
      [-0.01769, 0],
      [-0.01228, 1],
      [-0.0035, 1],
      [-0.01782, 1],
      [-0.01746, 1],
      [-0.01003, 0],
      [-0.01725, 1],
      [-0.00031, 2],
      [-0.02177, 1],
      [-0.00623, 0],
      [0.00699, 2],
      [0.00667, 2],
      [-0.00125, 1],
      [-0.00554, 1],
      [-0.00427, 1],
      [-0.00123, 2],
      [-0.00527, 1],
      [-0.01769, 1],
      [0.01851, 2],
      [-0.00271, 1],
      [0.00071, 1],
      [-0.0016, 1],
      [0.00873, 2],
      [-0.00137, 1]
    ],
    "red_o_points": [],
    "y_categories": ["ABS", "NAIA", "PT", "nan"],
    "blue_o_points": [],
    "blue_x_points": [
      [-0.0006, 1],
      [0.01319, 2],
      [0.04231, 2],
      [0.06165, 2],
      [0.0036, 1],
      [0.00129, 1],
      [5e-5, 0],
      [-0.00829, 1],
      [-0.00308, 1],
      [0.00309, 1],
      [0.03629, 2],
      [-0.00026, 1],
      [0.00446, 2],
      [0.00115, 0],
      [0.00908, 2]
    ]
  },
  "QS_mulTransfSite[IMc]": {
    "red_x_points": [
      [-0.00062, 3],
      [-0.02117, 2],
      [-0.00325, 0],
      [-0.01575, 2],
      [-0.00368, 0],
      [-0.00316, 0],
      [-0.0037, 0],
      [-0.00154, 3],
      [-0.00389, 0],
      [-0.00306, 0],
      [-0.00058, 3],
      [-0.00306, 0],
      [-0.00231, 3],
      [-0.00771, 0],
      [-0.0165, 2],
      [-0.00091, 3],
      [-0.00094, 3],
      [-0.00035, 3],
      [-0.00302, 0],
      [-0.00061, 3],
      [-0.00226, 3],
      [-0.00158, 3],
      [-0.0032, 0],
      [-0.02078, 2],
      [-0.0014, 3],
      [0.0183, 1],
      [-0.00133, 3],
      [-0.0191, 2],
      [-0.0021, 3]
    ],
    "red_o_points": [],
    "y_categories": ["N", "NOT APPLICABLE", "Y", "nan"],
    "blue_o_points": [],
    "blue_x_points": [
      [0.04517, 1],
      [-0.00097, 3],
      [0.00131, 0],
      [0.00162, 0],
      [0.0004, 3],
      [0.02813, 1],
      [0.01644, 1],
      [-0.00168, 0],
      [-0.00059, 3],
      [-7e-5, 3],
      [0.00064, 0],
      [0.01921, 1],
      [-0.00017, 3],
      [0.02025, 1],
      [-0.00045, 3]
    ]
  },
  "QA_mulInjOrthesisType[ArmSling]": {
    "red_x_points": [
      [-0.01351, 2],
      [-0.01332, 2],
      [-0.0126, 2],
      [-0.01233, 2],
      [-0.01276, 2],
      [-0.01349, 2],
      [-0.01209, 2],
      [-0.01266, 2],
      [-0.01248, 2],
      [-0.01361, 2],
      [-0.01317, 2],
      [-0.01295, 2],
      [-0.01318, 2],
      [-0.01329, 2],
      [-0.04057, 0],
      [-0.01325, 2],
      [-0.01264, 2],
      [-0.04077, 0],
      [-0.04064, 3],
      [-0.01349, 2],
      [-0.01304, 2],
      [-0.0127, 2],
      [-0.01315, 2],
      [-0.01293, 2],
      [-0.04125, 3],
      [-0.04343, 3],
      [-0.04019, 3],
      [-0.01271, 2],
      [-0.01328, 2]
    ],
    "red_o_points": [],
    "y_categories": ["N", "NOT APPLICABLE", "Y", "nan"],
    "blue_o_points": [],
    "blue_x_points": [
      [-0.01186, 2],
      [-0.01234, 2],
      [-0.01222, 2],
      [-0.01196, 2],
      [0.08455, 1],
      [0.08043, 1],
      [0.07245, 1],
      [0.07949, 1],
      [-0.01217, 2],
      [0.07782, 1],
      [-0.01205, 2],
      [0.07597, 1],
      [0.08218, 1],
      [0.07776, 1],
      [-0.01255, 2]
    ]
  },
  "QS_mulLysisSite[Trunk]": {
    "red_x_points": [
      [-0.00018, 3],
      [-0.00358, 0],
      [-0.00202, 0],
      [-0.00161, 0],
      [-0.00213, 0],
      [-0.00565, 2],
      [-0.00204, 0],
      [-0.00043, 3],
      [-0.00195, 0],
      [-0.00164, 0],
      [-0.00026, 3],
      [-0.00143, 0],
      [-0.00125, 3],
      [-0.00349, 0],
      [-0.00513, 2],
      [-0.00053, 3],
      [-0.00066, 3],
      [-6e-5, 3],
      [-0.0014, 0],
      [-0.0002, 3],
      [-0.00113, 3],
      [-0.00047, 3],
      [-0.00169, 0],
      [-0.00106, 0],
      [-0.00043, 3],
      [0.00604, 1],
      [-0.00032, 3],
      [-0.007, 2],
      [-0.00102, 3]
    ],
    "red_o_points": [],
    "y_categories": ["N", "NOT APPLICABLE", "Y", "nan"],
    "blue_o_points": [],
    "blue_x_points": [
      [0.01784, 1],
      [-0.00052, 3],
      [0.00091, 0],
      [-0.00047, 0],
      [0.00056, 3],
      [0.00866, 1],
      [0.00459, 1],
      [-0.0007, 0],
      [-0.00012, 3],
      [0.00028, 3],
      [0.00068, 0],
      [0.00561, 1],
      [2e-5, 3],
      [0.00561, 1],
      [-0.00024, 3]
    ]
  },
  "QS_mulTransfSite[Oberlin]": {
    "red_x_points": [
      [-0.00203, 3],
      [-0.03696, 0],
      [-0.03579, 0],
      [-0.03086, 0],
      [-0.0367, 0],
      [0.00499, 2],
      [-0.03573, 0],
      [-0.00318, 3],
      [0.00599, 2],
      [0.00533, 2],
      [-0.00202, 3],
      [0.00547, 2],
      [-0.00385, 3],
      [0.00174, 2],
      [-0.02833, 0],
      [-0.00196, 3],
      [-0.00207, 3],
      [-0.00154, 3],
      [-0.02497, 0],
      [-0.00215, 3],
      [-0.0035, 3],
      [-0.00331, 3],
      [0.00527, 2],
      [-0.03563, 0],
      [-0.00282, 3],
      [0.03561, 1],
      [-0.00313, 3],
      [-0.03573, 0],
      [-0.00342, 3]
    ],
    "red_o_points": [],
    "y_categories": ["N", "NOT APPLICABLE", "Y", "nan"],
    "blue_o_points": [],
    "blue_x_points": [
      [0.0787, 1],
      [-0.00221, 3],
      [0.00983, 2],
      [0.01309, 2],
      [-4e-5, 3],
      [0.04717, 1],
      [0.03601, 1],
      [0.0059, 2],
      [-0.0021, 3],
      [-0.00057, 3],
      [0.00941, 2],
      [0.04037, 1],
      [-0.00101, 3],
      [0.03823, 1],
      [-0.00151, 3]
    ]
  },
  "QA_intPexForearmProna": {
    "red_x_points": [
      [-0.0024, 2],
      [-0.00124, 0],
      [-0.0013, 2],
      [-0.0008, 2],
      [-0.00119, 2],
      [-0.00491, 0],
      [-0.00117, 2],
      [-0.0301, 0],
      [-0.00137, 2],
      [-0.00109, 2],
      [-0.02928, 0],
      [-0.00459, 0],
      [-0.00376, 2],
      [-0.00118, 2],
      [4e-5, 2],
      [-0.02972, 0],
      [-0.02955, 0],
      [-0.0228, 0],
      [-0.00309, 0],
      [-0.00235, 2],
      [-0.00365, 2],
      [-0.00324, 2],
      [-0.00125, 2],
      [-0.00133, 2],
      [0.0001, 2],
      [0.00065, 1],
      [-4e-5, 2],
      [-0.0045, 0],
      [-0.0031, 2]
    ],
    "red_o_points": [],
    "y_categories": ["GREATER THAN OR EQUALS TO 80", "LESS THAN 80", "nan"],
    "blue_o_points": [],
    "blue_x_points": [
      [-0.00079, 2],
      [0.09977, 1],
      [-0.00066, 0],
      [-0.00124, 2],
      [0.00145, 2],
      [3e-5, 2],
      [0.00078, 1],
      [5e-5, 2],
      [-0.00178, 2],
      [0.00129, 2],
      [-0.00066, 0],
      [4e-5, 2],
      [0.00117, 2],
      [4e-5, 2],
      [0.08871, 1]
    ]
  },
  "QS_mulLysisSite[Nerve]": {
    "red_x_points": [
      [-1e-5, 3],
      [-0.00099, 0],
      [-0.00429, 2],
      [-0.00348, 2],
      [-0.00123, 0],
      [-0.00037, 0],
      [-0.00162, 0],
      [-0.00035, 3],
      [-0.00161, 0],
      [-0.00042, 0],
      [3e-5, 3],
      [-0.00027, 0],
      [-0.00031, 3],
      [-0.0018, 0],
      [-0.00059, 0],
      [2e-5, 3],
      [5e-5, 3],
      [2e-5, 3],
      [-0.00029, 0],
      [-8e-5, 3],
      [-0.00045, 3],
      [-0.00028, 3],
      [-0.00049, 0],
      [-0.00036, 0],
      [-0.00033, 3],
      [0.00278, 1],
      [-0.00039, 3],
      [-0.00034, 0],
      [-0.00041, 3]
    ],
    "red_o_points": [],
    "y_categories": ["N", "NOT APPLICABLE", "Y", "nan"],
    "blue_o_points": [],
    "blue_x_points": [
      [0.01108, 1],
      [1e-5, 3],
      [-0.00019, 0],
      [-0.00075, 0],
      [0.00017, 3],
      [0.00222, 1],
      [0.00063, 1],
      [-1e-5, 0],
      [-0.00017, 3],
      [-1e-5, 3],
      [-0.00011, 0],
      [0.00268, 1],
      [4e-5, 3],
      [0.00233, 1],
      [-2e-5, 3]
    ]
  },
  "QS_mulLysisRoot[C6]": {
    "red_x_points": [
      [-1e-5, 3],
      [-0.00348, 0],
      [-0.00604, 2],
      [-0.00151, 0],
      [-0.00183, 0],
      [-0.00127, 0],
      [-0.00187, 0],
      [-0.00035, 3],
      [-0.00175, 0],
      [-0.00147, 0],
      [5e-5, 3],
      [-0.00142, 0],
      [-0.00095, 3],
      [-0.00332, 0],
      [-0.00238, 0],
      [-1e-5, 3],
      [5e-5, 3],
      [-6e-5, 3],
      [-0.00112, 0],
      [0.00014, 3],
      [-0.00075, 3],
      [-0.00037, 3],
      [-0.00161, 0],
      [-0.00107, 0],
      [-0.00029, 3],
      [0.00437, 1],
      [-0.00034, 3],
      [-0.00541, 2],
      [-0.00067, 3]
    ],
    "red_o_points": [],
    "y_categories": ["N", "NOT APPLICABLE", "Y", "nan"],
    "blue_o_points": [],
    "blue_x_points": [
      [0.01644, 1],
      [-0.00011, 3],
      [-3e-5, 0],
      [-0.00056, 0],
      [0.00045, 3],
      [0.00781, 1],
      [0.00283, 1],
      [-0.00042, 0],
      [-0.00025, 3],
      [0.00012, 3],
      [-8e-5, 0],
      [0.00449, 1],
      [0.00019, 3],
      [0.0039, 1],
      [-6e-5, 3]
    ]
  },
  "QS_mulTransfSite[Other]": {
    "red_x_points": [
      [-0.00124, 3],
      [-0.0141, 0],
      [-0.01116, 0],
      [-0.00863, 0],
      [-0.01146, 0],
      [-0.01139, 0],
      [-0.01172, 0],
      [-0.0015, 3],
      [-0.01192, 0],
      [-0.0117, 0],
      [-0.0011, 3],
      [-0.01112, 0],
      [-0.00148, 3],
      [-0.01471, 0],
      [-0.01029, 0],
      [-0.00111, 3],
      [-0.00121, 3],
      [-0.00079, 3],
      [-0.0072, 0],
      [-0.00106, 3],
      [-0.00171, 3],
      [-0.00167, 3],
      [-0.01191, 0],
      [-0.01079, 0],
      [-0.00136, 3],
      [0.01752, 1],
      [-0.00127, 3],
      [-0.00997, 0],
      [-0.00129, 3]
    ],
    "red_o_points": [],
    "y_categories": ["N", "NOT APPLICABLE", "Y", "nan"],
    "blue_o_points": [],
    "blue_x_points": [
      [0.04936, 1],
      [-0.00079, 3],
      [-0.00881, 0],
      [-0.01091, 0],
      [-5e-5, 3],
      [0.02563, 1],
      [0.01837, 1],
      [-0.00643, 0],
      [-0.00059, 3],
      [-0.0003, 3],
      [0.06355, 2],
      [0.01991, 1],
      [-0.00051, 3],
      [0.01973, 1],
      [-0.0008, 3]
    ]
  },
  "QA_mulInjOrthesisType[ShoulderSupport]": {
    "red_x_points": [
      [-0.01373, 0],
      [-0.01372, 0],
      [-0.01324, 0],
      [-0.05141, 2],
      [-0.01298, 0],
      [-0.01353, 0],
      [-0.01307, 0],
      [-0.04912, 2],
      [-0.01315, 0],
      [-0.01319, 0],
      [-0.01361, 0],
      [-0.01334, 0],
      [-0.01378, 0],
      [-0.01272, 0],
      [-0.04866, 2],
      [-0.01399, 0],
      [-0.01393, 0],
      [-0.04985, 2],
      [-0.04771, 3],
      [-0.01358, 0],
      [-0.01338, 0],
      [-0.01321, 0],
      [-0.0137, 0],
      [-0.01345, 0],
      [-0.04997, 3],
      [-0.05039, 3],
      [-0.05004, 3],
      [-0.01339, 0],
      [-0.01342, 0]
    ],
    "red_o_points": [],
    "y_categories": ["N", "NOT APPLICABLE", "Y", "nan"],
    "blue_o_points": [],
    "blue_x_points": [
      [-0.0126, 0],
      [-0.01241, 0],
      [-0.01234, 0],
      [-0.0125, 0],
      [0.10054, 1],
      [0.09486, 1],
      [0.09008, 1],
      [0.09542, 1],
      [-0.0128, 0],
      [0.09358, 1],
      [-0.01288, 0],
      [0.09319, 1],
      [0.09978, 1],
      [0.09962, 1],
      [-0.01227, 0]
    ]
  },
  "QS_mulLysisNerve[Ssr]": {
    "red_x_points": [
      [5e-5, 3],
      [-0.00168, 0],
      [-0.00597, 2],
      [-0.00429, 2],
      [-0.00151, 0],
      [-0.00076, 0],
      [-0.00153, 0],
      [-0.00059, 3],
      [-0.00149, 0],
      [-0.0009, 0],
      [0.00016, 3],
      [-0.00075, 0],
      [-0.00089, 3],
      [-0.00203, 0],
      [-0.00083, 0],
      [3e-5, 3],
      [0.00012, 3],
      [0.00016, 3],
      [-0.00056, 0],
      [3e-5, 3],
      [-0.00082, 3],
      [-0.00063, 3],
      [-0.00099, 0],
      [-0.001, 0],
      [-0.00063, 3],
      [0.00362, 1],
      [-0.00064, 3],
      [-0.00069, 0],
      [-0.0009, 3]
    ],
    "red_o_points": [],
    "y_categories": ["N", "NOT APPLICABLE", "Y", "nan"],
    "blue_o_points": [],
    "blue_x_points": [
      [0.01463, 1],
      [-0.00018, 3],
      [-0.00033, 0],
      [-0.00113, 0],
      [0.00044, 3],
      [0.00321, 1],
      [0.00118, 1],
      [-4e-5, 0],
      [-0.00029, 3],
      [0.00016, 3],
      [-0.00032, 0],
      [0.00409, 1],
      [0.00015, 3],
      [0.00436, 1],
      [-1e-5, 3]
    ]
  }
}
