{
  "QA_lstPexMuscstrength[ElbowFlex]": {
    "red_x_points": [
      [-0.00639, 1],
      [0.00065, 2],
      [-0.00258, 1],
      [-0.00242, 1],
      [0.00118, 0],
      [-0.00205, 1],
      [-0.00271, 1],
      [-0.00594, 1],
      [-0.00253, 1],
      [-0.00264, 1],
      [-0.00209, 1],
      [-0.00629, 1],
      [0.00091, 2],
      [0.00547, 2],
      [0.00045, 2],
      [-0.00578, 1],
      [0.00029, 2],
      [0.00187, 0],
      [-0.0059, 1],
      [-0.006, 1],
      [-0.00529, 1],
      [-0.0022, 1],
      [0.00458, 2],
      [-0.00084, 0],
      [-0.00628, 1],
      [-0.00223, 1],
      [-0.0052, 1],
      [-0.00225, 1],
      [-0.00556, 1],
      [0.0007, 2],
      [-0.00204, 1]
    ],
    "red_o_points": [],
    "y_categories": ["GREATER THAN OR EQUALS TO 3", "LESS THAN 3", "nan"],
    "blue_o_points": [],
    "blue_x_points": [
      [0.00092, 2],
      [0.00949, 2],
      [0.00593, 0],
      [0.00133, 1],
      [0.00835, 2],
      [0.00702, 0],
      [0.00805, 0]
    ]
  },
  "QS_mulGraftNerve[other]": {
    "red_x_points": [
      [-0.00047, 2],
      [-0.00116, 0],
      [-0.00114, 0],
      [-0.00112, 0],
      [-0.00146, 0],
      [-0.00105, 0],
      [-0.00115, 0],
      [-0.00041, 2],
      [-0.00119, 0],
      [-0.00111, 0],
      [-0.00129, 0],
      [-0.00059, 2],
      [0.00146, 1],
      [-0.00046, 2],
      [-0.00153, 0],
      [-0.00044, 2],
      [-0.00099, 0],
      [-0.00119, 0],
      [-0.00038, 2],
      [-0.0005, 2],
      [-0.00018, 2],
      [-0.00081, 0],
      [-0.0003, 2],
      [-0.00081, 2],
      [-0.00053, 2],
      [-0.00111, 0],
      [-0.00054, 2],
      [-0.00084, 0],
      [-0.0003, 2],
      [0.00238, 1],
      [-0.00098, 0]
    ],
    "red_o_points": [],
    "y_categories": ["N", "NOT APPLICABLE", "nan"],
    "blue_o_points": [],
    "blue_x_points": [
      [0.00594, 1],
      [0.00011, 2],
      [0.00179, 1],
      [1e-5, 0],
      [-0.0, 2],
      [0.00175, 1],
      [0.00326, 1]
    ]
  },
  "QS_mulLysisTrunk[Upper]": {
    "red_x_points": [
      [-0.00158, 3],
      [-0.0029, 0],
      [-0.00286, 0],
      [-0.00313, 0],
      [-0.00251, 0],
      [-0.00457, 2],
      [-0.0032, 0],
      [-0.0016, 3],
      [-0.00297, 0],
      [-0.00266, 0],
      [-0.00295, 0],
      [-0.00176, 3],
      [0.00806, 1],
      [-0.00182, 3],
      [-0.00278, 0],
      [-0.00177, 3],
      [-0.00504, 2],
      [-0.00279, 0],
      [-0.00146, 3],
      [-0.00173, 3],
      [-0.00144, 3],
      [-0.00272, 0],
      [-0.00163, 3],
      [-0.0014, 3],
      [-0.00162, 3],
      [-0.00264, 0],
      [-0.00161, 3],
      [-0.00268, 0],
      [-0.0015, 3],
      [0.0078, 1],
      [-0.00481, 2]
    ],
    "red_o_points": [],
    "y_categories": ["N", "NOT APPLICABLE", "Y", "nan"],
    "blue_o_points": [],
    "blue_x_points": [
      [0.01202, 1],
      [-0.0008, 3],
      [0.00839, 1],
      [-0.00138, 0],
      [-0.00084, 3],
      [0.00854, 1],
      [0.00967, 1]
    ]
  },
  "QS_mulGraftTrunk[UpperTrunk]": {
    "red_x_points": [
      [-0.00055, 3],
      [-0.00116, 0],
      [-0.00102, 0],
      [-0.00097, 0],
      [-0.00114, 0],
      [-0.00081, 0],
      [-0.001, 0],
      [-0.00062, 3],
      [-0.00089, 0],
      [-0.00089, 0],
      [-0.00089, 0],
      [-0.00057, 3],
      [0.00319, 1],
      [-0.00057, 3],
      [-0.00319, 2],
      [-0.00055, 3],
      [-0.0009, 0],
      [-0.00104, 0],
      [-0.00069, 3],
      [-0.00051, 3],
      [-0.00062, 3],
      [-0.00079, 0],
      [-0.00053, 3],
      [-0.00057, 3],
      [-0.00064, 3],
      [-0.00103, 0],
      [-0.00058, 3],
      [-0.00094, 0],
      [-0.00056, 3],
      [0.00263, 1],
      [-0.00102, 0]
    ],
    "red_o_points": [],
    "y_categories": ["N", "NOT APPLICABLE", "Y", "nan"],
    "blue_o_points": [],
    "blue_x_points": [
      [0.00419, 1],
      [-0.00016, 3],
      [0.00306, 1],
      [-0.00042, 0],
      [-0.00015, 3],
      [0.00292, 1],
      [0.0036, 1]
    ]
  },
  "QS_mulNeuromadSite[C5]": {
    "red_x_points": [
      [-0.00129, 2],
      [-0.00371, 0],
      [-0.00397, 0],
      [-0.00395, 0],
      [-0.00421, 0],
      [-0.00417, 0],
      [-0.00382, 0],
      [-0.00108, 2],
      [-0.00415, 0],
      [-0.00446, 0],
      [-0.00387, 0],
      [-0.0012, 2],
      [0.0062, 1],
      [-0.00139, 2],
      [-0.00419, 0],
      [-0.00136, 2],
      [-0.00321, 0],
      [-0.00387, 0],
      [-0.0011, 2],
      [-0.00126, 2],
      [-0.00073, 2],
      [-0.00348, 0],
      [-0.00123, 2],
      [-0.00141, 2],
      [-0.00137, 2],
      [-0.00375, 0],
      [-0.00116, 2],
      [-0.0039, 0],
      [-0.00086, 2],
      [0.00664, 1],
      [-0.00379, 0]
    ],
    "red_o_points": [],
    "y_categories": ["N", "NOT APPLICABLE", "nan"],
    "blue_o_points": [],
    "blue_x_points": [
      [0.01616, 1],
      [-4e-5, 2],
      [0.00804, 1],
      [0.00041, 0],
      [-6e-5, 2],
      [0.00804, 1],
      [0.00844, 1]
    ]
  },
  "QS_mulNeuromadSite[C7]": {
    "red_x_points": [
      [-0.00079, 2],
      [-0.00233, 0],
      [-0.00205, 0],
      [-0.00224, 0],
      [-0.00241, 0],
      [-0.00205, 0],
      [-0.0025, 0],
      [-0.0006, 2],
      [-0.00221, 0],
      [-0.00207, 0],
      [-0.00206, 0],
      [-0.0008, 2],
      [0.00322, 1],
      [-0.00083, 2],
      [-0.00213, 0],
      [-0.00087, 2],
      [-0.00195, 0],
      [-0.00252, 0],
      [-0.00083, 2],
      [-0.00081, 2],
      [-0.00049, 2],
      [-0.00179, 0],
      [-0.00091, 2],
      [-0.00094, 2],
      [-0.0008, 2],
      [-0.0022, 0],
      [-0.00081, 2],
      [-0.0018, 0],
      [-0.00038, 2],
      [0.00349, 1],
      [-0.00191, 0]
    ],
    "red_o_points": [],
    "y_categories": ["N", "NOT APPLICABLE", "nan"],
    "blue_o_points": [],
    "blue_x_points": [
      [0.00954, 1],
      [0.00017, 2],
      [0.00407, 1],
      [0.00062, 0],
      [-3e-5, 2],
      [0.00448, 1],
      [0.0056, 1]
    ]
  },
  "QS_mulTransfSite[IMc]": {
    "red_x_points": [
      [-0.00242, 3],
      [-0.00678, 2],
      [-0.00396, 0],
      [-0.00386, 0],
      [-0.00414, 0],
      [-0.00408, 0],
      [-0.00416, 0],
      [-0.00252, 3],
      [-0.00402, 0],
      [-0.00405, 0],
      [-0.00362, 0],
      [-0.00247, 3],
      [0.01083, 1],
      [-0.00268, 3],
      [-0.00424, 0],
      [-0.00269, 3],
      [-0.00793, 2],
      [-0.00436, 0],
      [-0.00262, 3],
      [-0.00268, 3],
      [-0.00212, 3],
      [-0.00352, 0],
      [-0.00268, 3],
      [-0.00276, 3],
      [-0.00257, 3],
      [-0.00377, 0],
      [-0.0028, 3],
      [-0.0065, 2],
      [-0.00232, 3],
      [0.01073, 1],
      [-0.00665, 2]
    ],
    "red_o_points": [],
    "y_categories": ["N", "NOT APPLICABLE", "Y", "nan"],
    "blue_o_points": [],
    "blue_x_points": [
      [0.01859, 1],
      [-0.00095, 3],
      [0.01264, 1],
      [-0.00096, 0],
      [-0.00078, 3],
      [0.01203, 1],
      [0.01529, 1]
    ]
  },
  "QA_mulInjOrthesisType[ShoulderSupport]": {
    "red_x_points": [
      [-0.01557, 0],
      [-0.01453, 0],
      [-0.0145, 0],
      [-0.01452, 0],
      [-0.01508, 0],
      [-0.0153, 0],
      [-0.01496, 0],
      [-0.01858, 2],
      [-0.01512, 0],
      [-0.01464, 0],
      [-0.01419, 0],
      [-0.01532, 0],
      [0.03977, 1],
      [-0.01646, 0],
      [-0.01445, 0],
      [-0.01603, 0],
      [-0.01771, 2],
      [-0.0147, 0],
      [-0.01537, 0],
      [-0.01508, 0],
      [-0.01812, 2],
      [-0.01799, 3],
      [-0.01654, 0],
      [0.04395, 1],
      [-0.01484, 0],
      [-0.01496, 0],
      [-0.01561, 0],
      [-0.01397, 0],
      [-0.01945, 3],
      [-0.02826, 3],
      [-0.0151, 0]
    ],
    "red_o_points": [],
    "y_categories": ["N", "NOT APPLICABLE", "Y", "nan"],
    "blue_o_points": [],
    "blue_x_points": [
      [-0.00682, 0],
      [0.04684, 1],
      [0.03697, 1],
      [0.04892, 1],
      [0.04675, 1],
      [0.03771, 1],
      [0.03916, 1]
    ]
  },
  "QA_mulInjOrthesisType[ArmSling]": {
    "red_x_points": [
      [-0.01297, 2],
      [-0.01236, 2],
      [-0.01262, 2],
      [-0.01223, 2],
      [-0.01146, 2],
      [-0.0123, 2],
      [-0.01254, 2],
      [-0.01344, 2],
      [-0.01176, 2],
      [-0.01226, 2],
      [-0.01216, 2],
      [-0.01354, 2],
      [0.03275, 1],
      [-0.0133, 2],
      [-0.01183, 2],
      [-0.01307, 2],
      [-0.01375, 0],
      [-0.01201, 2],
      [-0.01372, 2],
      [-0.01292, 2],
      [-0.01588, 0],
      [-0.01532, 3],
      [-0.01369, 2],
      [0.03594, 1],
      [-0.01339, 2],
      [-0.01224, 2],
      [-0.0128, 2],
      [-0.0122, 2],
      [-0.01551, 3],
      [-0.02296, 3],
      [-0.01221, 2]
    ],
    "red_o_points": [],
    "y_categories": ["N", "NOT APPLICABLE", "Y", "nan"],
    "blue_o_points": [],
    "blue_x_points": [
      [-0.00513, 2],
      [0.03808, 1],
      [0.03142, 1],
      [0.03869, 1],
      [0.0365, 1],
      [0.03297, 1],
      [0.03083, 1]
    ]
  },
  "QS_mulNeuromadSite[C6]": {
    "red_x_points": [
      [-0.00063, 2],
      [-0.00153, 0],
      [-0.00181, 0],
      [-0.00136, 0],
      [-0.00132, 0],
      [-0.00141, 0],
      [-0.00156, 0],
      [-0.00068, 2],
      [-0.0018, 0],
      [-0.00176, 0],
      [-0.00147, 0],
      [-0.00067, 2],
      [0.00203, 1],
      [-0.00078, 2],
      [-0.00197, 0],
      [-0.00096, 2],
      [-0.00117, 0],
      [-0.00191, 0],
      [-0.00065, 2],
      [-0.00068, 2],
      [-0.00053, 2],
      [-0.00122, 0],
      [-0.00085, 2],
      [-0.00145, 2],
      [-0.00085, 2],
      [-0.00137, 0],
      [-0.00087, 2],
      [-0.00142, 0],
      [-0.0009, 2],
      [0.00307, 1],
      [-0.00139, 0]
    ],
    "red_o_points": [],
    "y_categories": ["N", "NOT APPLICABLE", "nan"],
    "blue_o_points": [],
    "blue_x_points": [
      [0.00807, 1],
      [5e-5, 2],
      [0.00349, 1],
      [0.00019, 0],
      [5e-5, 2],
      [0.0036, 1],
      [0.00358, 1]
    ]
  },
  "QS_mulGraftNerve[Ac]": {
    "red_x_points": [
      [-0.00011, 2],
      [-0.00038, 0],
      [-0.00039, 0],
      [-0.00035, 0],
      [-0.00044, 0],
      [-0.0004, 0],
      [-0.00048, 0],
      [-0.00014, 2],
      [-0.00056, 0],
      [-0.00047, 0],
      [-0.00038, 0],
      [-0.00026, 2],
      [0.00072, 1],
      [-0.00026, 2],
      [-0.00033, 0],
      [-0.00021, 2],
      [-0.00033, 0],
      [-0.00038, 0],
      [-0.00018, 2],
      [-0.00018, 2],
      [-6e-5, 2],
      [-0.00028, 0],
      [-0.00022, 2],
      [-0.00012, 2],
      [-0.00024, 2],
      [-0.00031, 0],
      [-0.00018, 2],
      [-0.00044, 0],
      [-0.00013, 2],
      [0.00057, 1],
      [-0.00047, 0]
    ],
    "red_o_points": [],
    "y_categories": ["N", "NOT APPLICABLE", "nan"],
    "blue_o_points": [],
    "blue_x_points": [
      [0.00288, 1],
      [-0.0001, 2],
      [0.00095, 1],
      [-1e-5, 0],
      [-4e-5, 2],
      [0.00043, 1],
      [0.00102, 1]
    ]
  },
  "QS_mulLysisRoot[C7]": {
    "red_x_points": [
      [-0.00014, 3],
      [-0.0002, 0],
      [-0.00042, 2],
      [-0.00017, 0],
      [-0.00018, 0],
      [-0.00016, 0],
      [-0.00019, 0],
      [-0.00012, 3],
      [-0.00019, 0],
      [-0.00018, 0],
      [-0.00016, 0],
      [-0.00012, 3],
      [0.00055, 1],
      [-0.00015, 3],
      [-0.00022, 0],
      [-0.0001, 3],
      [-0.0002, 0],
      [-0.00021, 0],
      [-0.00012, 3],
      [-7e-5, 3],
      [-6e-5, 3],
      [-0.0002, 0],
      [-0.00012, 3],
      [-7e-5, 3],
      [-0.00012, 3],
      [-0.00019, 0],
      [-0.00014, 3],
      [-0.00019, 0],
      [-0.00011, 3],
      [0.0007, 1],
      [-0.00018, 0]
    ],
    "red_o_points": [],
    "y_categories": ["N", "NOT APPLICABLE", "Y", "nan"],
    "blue_o_points": [],
    "blue_x_points": [
      [0.00048, 1],
      [-4e-5, 3],
      [0.00043, 1],
      [-0.00025, 0],
      [-7e-5, 3],
      [0.00083, 1],
      [0.00061, 1]
    ]
  },
  "QS_mulNeuromadSite[C8]": {
    "red_x_points": [
      [-0.00165, 2],
      [-0.00394, 0],
      [-0.0048, 0],
      [-0.00435, 0],
      [-0.00486, 0],
      [-0.00425, 0],
      [-0.0042, 0],
      [-0.00156, 2],
      [-0.00464, 0],
      [-0.00441, 0],
      [-0.00406, 0],
      [-0.00128, 2],
      [0.00627, 1],
      [-0.00157, 2],
      [-0.00492, 0],
      [-0.00194, 2],
      [-0.00414, 0],
      [-0.00519, 0],
      [-0.00145, 2],
      [-0.00153, 2],
      [-0.00133, 2],
      [-0.00372, 0],
      [-0.00184, 2],
      [-0.00252, 2],
      [-0.00188, 2],
      [-0.00426, 0],
      [-0.00181, 2],
      [-0.00413, 0],
      [-0.00137, 2],
      [0.009, 1],
      [-0.00391, 0]
    ],
    "red_o_points": [],
    "y_categories": ["N", "NOT APPLICABLE", "nan"],
    "blue_o_points": [],
    "blue_x_points": [
      [0.01737, 1],
      [0.00014, 2],
      [0.01006, 1],
      [0.00065, 0],
      [-0.00015, 2],
      [0.0101, 1],
      [0.01114, 1]
    ]
  },
  "QS_mulGraftNerve[Ph]": {
    "red_x_points": [
      [-5e-5, 2],
      [-0.00023, 0],
      [-0.00029, 0],
      [-0.00028, 0],
      [-0.00019, 0],
      [-0.00028, 0],
      [-0.00028, 0],
      [-4e-5, 2],
      [-0.00024, 0],
      [-0.00019, 0],
      [-0.00017, 0],
      [-2e-5, 2],
      [0.00036, 1],
      [-2e-5, 2],
      [-0.00026, 0],
      [-3e-5, 2],
      [-0.00019, 0],
      [-0.00013, 0],
      [-4e-5, 2],
      [-3e-5, 2],
      [-3e-5, 2],
      [-0.00025, 0],
      [-3e-5, 2],
      [-2e-5, 2],
      [-5e-5, 2],
      [-0.00024, 0],
      [-5e-5, 2],
      [-0.00022, 0],
      [-3e-5, 2],
      [0.00017, 1],
      [-0.0003, 0]
    ],
    "red_o_points": [],
    "y_categories": ["N", "NOT APPLICABLE", "nan"],
    "blue_o_points": [],
    "blue_x_points": [
      [0.001, 1],
      [5e-5, 2],
      [0.00023, 1],
      [5e-5, 0],
      [6e-5, 2],
      [0.00046, 1],
      [0.00103, 1]
    ]
  },
  "QS_mulTransfSite[AcSsPA]": {
    "red_x_points": [
      [-0.00034, 3],
      [-0.00071, 0],
      [-0.00062, 0],
      [-0.00056, 0],
      [-0.00065, 0],
      [-0.00066, 0],
      [-0.0006, 0],
      [-0.00026, 3],
      [-0.00051, 0],
      [-0.00064, 0],
      [-0.00064, 0],
      [-0.00031, 3],
      [0.00141, 1],
      [-0.00037, 3],
      [-0.00042, 0],
      [-0.00025, 3],
      [-0.00222, 2],
      [-0.00069, 0],
      [-0.00037, 3],
      [-0.00031, 3],
      [-0.0003, 3],
      [-0.00051, 0],
      [-0.00031, 3],
      [-0.00041, 3],
      [-0.00033, 3],
      [-0.0006, 0],
      [-0.00039, 3],
      [-0.00065, 0],
      [-0.00036, 3],
      [0.00134, 1],
      [-0.00058, 0]
    ],
    "red_o_points": [],
    "y_categories": ["N", "NOT APPLICABLE", "Y", "nan"],
    "blue_o_points": [],
    "blue_x_points": [
      [0.00208, 1],
      [5e-5, 3],
      [0.00202, 1],
      [-0.00018, 0],
      [-0.00019, 3],
      [0.00196, 1],
      [0.00261, 1]
    ]
  },
  "QS_mulTransfSite[AcMc]": {
    "red_x_points": [
      [-0.00032, 3],
      [-0.00038, 0],
      [-0.00042, 0],
      [-0.00038, 0],
      [-0.00045, 0],
      [-0.00037, 0],
      [-0.00042, 0],
      [-0.00026, 3],
      [-0.00048, 0],
      [-0.00034, 0],
      [-0.00103, 2],
      [-0.00025, 3],
      [0.00131, 1],
      [-0.00022, 3],
      [-0.00041, 0],
      [-0.00032, 3],
      [-0.00035, 0],
      [-0.00032, 0],
      [-0.00029, 3],
      [-0.0002, 3],
      [-0.00013, 3],
      [-0.00033, 0],
      [-0.00024, 3],
      [-0.0002, 3],
      [-0.00026, 3],
      [-0.00035, 0],
      [-0.00031, 3],
      [-0.0003, 0],
      [-0.0001, 3],
      [0.00102, 1],
      [-0.00043, 0]
    ],
    "red_o_points": [],
    "y_categories": ["N", "NOT APPLICABLE", "Y", "nan"],
    "blue_o_points": [],
    "blue_x_points": [
      [0.00156, 1],
      [-0.00011, 3],
      [0.00147, 1],
      [-0.00039, 0],
      [-7e-5, 3],
      [0.00133, 1],
      [0.00153, 1]
    ]
  },
  "QS_mulTransfSite[Other]": {
    "red_x_points": [
      [-0.00024, 3],
      [-0.00058, 0],
      [-0.0005, 0],
      [-0.0006, 0],
      [-0.00041, 0],
      [-0.00057, 0],
      [-0.00058, 0],
      [-0.00026, 3],
      [-0.00064, 0],
      [-0.00045, 0],
      [-0.00059, 0],
      [-0.00026, 3],
      [0.00176, 1],
      [-0.00034, 3],
      [-0.0005, 0],
      [-0.00037, 3],
      [-0.00069, 0],
      [-0.00411, 2],
      [-0.00028, 3],
      [-0.00022, 3],
      [-0.00026, 3],
      [-0.00057, 0],
      [-0.00028, 3],
      [-0.00034, 3],
      [-0.00031, 3],
      [-0.00054, 0],
      [-0.0005, 3],
      [-0.00053, 0],
      [-0.00035, 3],
      [0.00187, 1],
      [-0.00044, 0]
    ],
    "red_o_points": [],
    "y_categories": ["N", "NOT APPLICABLE", "Y", "nan"],
    "blue_o_points": [],
    "blue_x_points": [
      [0.00142, 1],
      [-0.00015, 3],
      [0.00249, 1],
      [0.00034, 0],
      [-2e-5, 3],
      [0.0022, 1],
      [0.00172, 1]
    ]
  },
  "QA_yonInjBpsurg": {
    "red_x_points": [
      [-0.00483, 1],
      [-0.0046, 1],
      [-0.00468, 1],
      [-0.00432, 1],
      [-0.00466, 1],
      [-0.0045, 1],
      [-0.0043, 1],
      [-0.0044, 1],
      [-0.00439, 1],
      [-0.00432, 1],
      [-0.00447, 1],
      [-0.00461, 1],
      [0.01064, 0],
      [-0.0047, 1],
      [-0.00437, 1],
      [-0.00457, 1],
      [-0.00323, 1],
      [-0.0045, 1],
      [-0.00438, 1],
      [-0.00424, 1],
      [-0.00384, 1],
      [-0.00319, 1],
      [-0.0043, 1],
      [-0.00486, 1],
      [-0.00452, 1],
      [-0.00423, 1],
      [-0.00438, 1],
      [-0.00407, 1],
      [-0.00427, 1],
      [0.01162, 0],
      [-0.00403, 1]
    ],
    "red_o_points": [],
    "y_categories": ["N", "Y", "nan"],
    "blue_o_points": [],
    "blue_x_points": [
      [0.02618, 0],
      [-0.00098, 1],
      [0.01334, 0],
      [-0.00306, 1],
      [-0.00084, 1],
      [0.01361, 0],
      [0.01666, 0]
    ]
  },
  "QS_mulNeuromadSite[T1]": {
    "red_x_points": [
      [-0.00162, 2],
      [-0.00444, 0],
      [-0.00425, 0],
      [-0.00431, 0],
      [-0.00489, 0],
      [-0.00425, 0],
      [-0.00455, 0],
      [-0.00155, 2],
      [-0.00419, 0],
      [-0.00427, 0],
      [-0.00442, 0],
      [-0.00144, 2],
      [0.0071, 1],
      [-0.00165, 2],
      [-0.00508, 0],
      [-0.00173, 2],
      [-0.00389, 0],
      [-0.00454, 0],
      [-0.00177, 2],
      [-0.00161, 2],
      [-0.00125, 2],
      [-0.00388, 0],
      [-0.00169, 2],
      [-0.00232, 2],
      [-0.0018, 2],
      [-0.00428, 0],
      [-0.00157, 2],
      [-0.00431, 0],
      [-0.00123, 2],
      [0.00735, 1],
      [-0.00441, 0]
    ],
    "red_o_points": [],
    "y_categories": ["N", "NOT APPLICABLE", "nan"],
    "blue_o_points": [],
    "blue_x_points": [
      [0.01742, 1],
      [-8e-5, 2],
      [0.00976, 1],
      [2e-5, 0],
      [-0.00016, 2],
      [0.01019, 1],
      [0.01232, 1]
    ]
  },
  "QS_mulTransfSite[AcSsAA]": {
    "red_x_points": [
      [-0.00294, 3],
      [-0.00864, 2],
      [-0.0033, 0],
      [-0.00909, 2],
      [-0.00933, 2],
      [-0.00311, 0],
      [-0.00336, 0],
      [-0.00284, 3],
      [-0.00295, 0],
      [-0.0081, 2],
      [-0.00329, 0],
      [-0.00332, 3],
      [0.01501, 1],
      [-0.00317, 3],
      [-0.01, 2],
      [-0.00324, 3],
      [-0.0026, 0],
      [-0.0033, 0],
      [-0.00299, 3],
      [-0.00321, 3],
      [-0.00307, 3],
      [-0.009, 2],
      [-0.00319, 3],
      [-0.00267, 3],
      [-0.00337, 3],
      [-0.00323, 0],
      [-0.00312, 3],
      [-0.00872, 2],
      [-0.00295, 3],
      [0.01511, 1],
      [-0.00308, 0]
    ],
    "red_o_points": [],
    "y_categories": ["N", "NOT APPLICABLE", "Y", "nan"],
    "blue_o_points": [],
    "blue_x_points": [
      [0.02106, 1],
      [-0.00121, 3],
      [0.01465, 1],
      [-0.00094, 0],
      [-0.00113, 3],
      [0.01537, 1],
      [0.01542, 1]
    ]
  },
  "QS_mulLysisRoot[C5]": {
    "red_x_points": [
      [-0.00075, 3],
      [-0.00095, 0],
      [-0.00221, 2],
      [-0.00098, 0],
      [-0.00091, 0],
      [-0.0009, 0],
      [-0.00084, 0],
      [-0.00071, 3],
      [-0.00094, 0],
      [-0.00076, 0],
      [-0.00076, 0],
      [-0.00073, 3],
      [0.00354, 1],
      [-0.00063, 3],
      [-0.00109, 0],
      [-0.00066, 3],
      [-0.00106, 0],
      [-0.00084, 0],
      [-0.00067, 3],
      [-0.00071, 3],
      [-0.00064, 3],
      [-0.00102, 0],
      [-0.00054, 3],
      [-0.0006, 3],
      [-0.00065, 3],
      [-0.00103, 0],
      [-0.00069, 3],
      [-0.00103, 0],
      [-0.00062, 3],
      [0.0032, 1],
      [-0.00229, 2]
    ],
    "red_o_points": [],
    "y_categories": ["N", "NOT APPLICABLE", "Y", "nan"],
    "blue_o_points": [],
    "blue_x_points": [
      [0.004, 1],
      [-0.00036, 3],
      [0.00261, 1],
      [-0.00097, 0],
      [-0.0004, 3],
      [0.00326, 1],
      [0.00392, 1]
    ]
  },
  "QS_mulGraftNerve[FI]": {
    "red_x_points": [
      [-5e-5, 2],
      [-0.00035, 0],
      [-0.00029, 0],
      [-0.0003, 0],
      [-0.00038, 0],
      [-0.00036, 0],
      [-0.00035, 0],
      [-5e-5, 2],
      [-0.00024, 0],
      [-0.00036, 0],
      [-0.00033, 0],
      [-7e-5, 2],
      [0.00048, 1],
      [-3e-5, 2],
      [-0.00021, 0],
      [-4e-5, 2],
      [-0.00023, 0],
      [-0.0003, 0],
      [-7e-5, 2],
      [-8e-5, 2],
      [-6e-5, 2],
      [-0.00029, 0],
      [-7e-5, 2],
      [-2e-5, 2],
      [-5e-5, 2],
      [-0.00023, 0],
      [-6e-5, 2],
      [-0.00037, 0],
      [-6e-5, 2],
      [0.00062, 1],
      [-0.00019, 0]
    ],
    "red_o_points": [],
    "y_categories": ["N", "NOT APPLICABLE", "nan"],
    "blue_o_points": [],
    "blue_x_points": [
      [0.0008, 1],
      [-4e-5, 2],
      [0.00061, 1],
      [-2e-5, 0],
      [0.0, 2],
      [0.00063, 1],
      [0.00069, 1]
    ]
  },
  "QS_mulGraftNerve[Ul]": {
    "red_x_points": [
      [-5e-5, 2],
      [-8e-5, 0],
      [-3e-5, 0],
      [-8e-5, 0],
      [-8e-5, 0],
      [-3e-5, 0],
      [-3e-5, 0],
      [-5e-5, 2],
      [-5e-5, 0],
      [-8e-5, 0],
      [-5e-5, 0],
      [-6e-5, 2],
      [-0.00016, 1],
      [-5e-5, 2],
      [-5e-5, 0],
      [-6e-5, 2],
      [-8e-5, 0],
      [-5e-5, 0],
      [-6e-5, 2],
      [-6e-5, 2],
      [-5e-5, 2],
      [-8e-5, 0],
      [-6e-5, 2],
      [-1e-5, 2],
      [-1e-5, 2],
      [-8e-5, 0],
      [-6e-5, 2],
      [-8e-5, 0],
      [-1e-5, 2],
      [0.00024, 1],
      [-8e-5, 0]
    ],
    "red_o_points": [],
    "y_categories": ["N", "NOT APPLICABLE", "nan"],
    "blue_o_points": [],
    "blue_x_points": [
      [0.00024, 1],
      [3e-5, 2],
      [0.00012, 1],
      [1e-5, 0],
      [-1e-5, 2],
      [0.00024, 1],
      [0.00024, 1]
    ]
  },
  "QS_mulBpsurgeryType[Lysis]": {
    "red_x_points": [
      [-0.00249, 3],
      [-0.00486, 0],
      [-0.00784, 2],
      [-0.00492, 0],
      [-0.00545, 0],
      [-0.00746, 2],
      [-0.00491, 0],
      [-0.00227, 3],
      [-0.00465, 0],
      [-0.00503, 0],
      [-0.00471, 0],
      [-0.00254, 3],
      [0.01232, 1],
      [-0.00259, 3],
      [-0.00459, 0],
      [-0.00242, 3],
      [-0.00879, 2],
      [-0.00548, 0],
      [-0.00271, 3],
      [-0.00248, 3],
      [-0.00252, 3],
      [-0.00469, 0],
      [-0.0027, 3],
      [-0.00253, 3],
      [-0.00267, 3],
      [-0.00466, 0],
      [-0.00245, 3],
      [-0.00486, 0],
      [-0.00258, 3],
      [0.01418, 1],
      [-0.00711, 2]
    ],
    "red_o_points": [],
    "y_categories": ["N", "NOT APPLICABLE", "Y", "nan"],
    "blue_o_points": [],
    "blue_x_points": [
      [0.01961, 1],
      [-0.00107, 3],
      [0.01422, 1],
      [-0.00117, 0],
      [-0.00104, 3],
      [0.0146, 1],
      [0.01636, 1]
    ]
  },
  "QA_yonInjUnconscio": {
    "red_x_points": [
      [-0.00408, 1],
      [-0.00484, 1],
      [-0.00222, 2],
      [-0.00221, 2],
      [0.00778, 0],
      [-0.00508, 1],
      [-0.00237, 2],
      [-0.00429, 2],
      [-0.00286, 2],
      [-0.00183, 2],
      [-0.00487, 1],
      [-0.00431, 1],
      [-0.03323, 1],
      [-0.00558, 2],
      [-0.00309, 2],
      [-0.00569, 2],
      [-0.00463, 1],
      [0.00909, 0],
      [-0.00448, 1],
      [-0.00439, 1],
      [-0.00421, 1],
      [-0.00429, 1],
      [-0.00545, 2],
      [-0.01156, 1],
      [-0.00466, 2],
      [-0.0044, 1],
      [0.01118, 0],
      [-0.00423, 1],
      [-0.00485, 2],
      [-0.0009, 2],
      [-0.00457, 1]
    ],
    "red_o_points": [],
    "y_categories": ["N", "Y", "nan"],
    "blue_o_points": [],
    "blue_x_points": [
      [0.0013, 2],
      [-0.00323, 1],
      [0.01768, 0],
      [0.0238, 0],
      [0.02714, 0],
      [0.00369, 2],
      [0.00419, 2]
    ]
  },
  "QS_mulTransfSite[Oberlin]": {
    "red_x_points": [
      [-0.0046, 3],
      [-0.01351, 0],
      [-0.01336, 0],
      [-0.01367, 0],
      [-0.00637, 2],
      [-0.00554, 2],
      [-0.01415, 0],
      [-0.00451, 3],
      [-0.00628, 2],
      [-0.00664, 2],
      [-0.00637, 2],
      [-0.00462, 3],
      [0.02242, 1],
      [-0.00469, 3],
      [-0.00671, 2],
      [-0.00501, 3],
      [-0.01272, 0],
      [-0.00706, 2],
      [-0.00452, 3],
      [-0.00416, 3],
      [-0.00396, 3],
      [-0.01288, 0],
      [-0.0046, 3],
      [-0.00447, 3],
      [-0.00431, 3],
      [-0.00628, 2],
      [-0.00469, 3],
      [-0.01297, 0],
      [-0.00438, 3],
      [0.02392, 1],
      [-0.01302, 0]
    ],
    "red_o_points": [],
    "y_categories": ["N", "NOT APPLICABLE", "Y", "nan"],
    "blue_o_points": [],
    "blue_x_points": [
      [0.03597, 1],
      [-0.0018, 3],
      [0.02431, 1],
      [3e-5, 2],
      [-0.00154, 3],
      [0.02507, 1],
      [0.02734, 1]
    ]
  },
  "QA_lstPexMuscstrength[ShoulderAbduc]": {
    "red_x_points": [
      [-0.00796, 1],
      [-0.00794, 1],
      [-0.00817, 1],
      [-0.00818, 1],
      [-0.00857, 1],
      [-0.00807, 1],
      [-0.00785, 1],
      [-0.00775, 1],
      [-0.00756, 1],
      [-0.00807, 1],
      [-0.00864, 1],
      [-0.00791, 1],
      [0.00393, 2],
      [0.00708, 2],
      [0.0072, 2],
      [0.00676, 2],
      [0.00711, 2],
      [-0.00847, 1],
      [-0.00837, 1],
      [-0.00842, 1],
      [-0.00803, 1],
      [-0.008, 1],
      [0.00702, 2],
      [-0.01204, 1],
      [-0.00829, 1],
      [-0.0082, 1],
      [-0.00903, 1],
      [-0.00745, 1],
      [-0.00813, 1],
      [0.00428, 2],
      [-0.00827, 1]
    ],
    "red_o_points": [],
    "y_categories": ["GREATER THAN OR EQUALS TO 3", "LESS THAN 3", "nan"],
    "blue_o_points": [],
    "blue_x_points": [
      [0.00548, 2],
      [0.00827, 2],
      [0.03241, 0],
      [0.00867, 2],
      [0.00802, 2],
      [0.03585, 0],
      [-0.00203, 1]
    ]
  },
  "participant_code": {
    "red_x_points": [
      [-0.02426, 1],
      [-0.02543, 2],
      [-0.02478, 3],
      [-0.02492, 4],
      [-0.02515, 5],
      [-0.02454, 6],
      [-0.02575, 7],
      [-0.02445, 8],
      [-0.02505, 9],
      [-0.02492, 10],
      [-0.02571, 11],
      [-0.0251, 12],
      [-0.02538, 14],
      [-0.02356, 16],
      [-0.02454, 17],
      [-0.02473, 19],
      [-0.02496, 20],
      [-0.02492, 22],
      [-0.02426, 23],
      [-0.02422, 25],
      [-0.02389, 26],
      [-0.02552, 27],
      [-0.02389, 28],
      [-0.02515, 29],
      [-0.02496, 30],
      [-0.02478, 32],
      [-0.02398, 33],
      [-0.02487, 34],
      [-0.02464, 35],
      [-0.02482, 36],
      [-0.02524, 37]
    ],
    "red_o_points": [],
    "y_categories": [
      "P16554",
      "P18297",
      "P19283",
      "P19287",
      "P23391",
      "P31645",
      "P31691",
      "P34778",
      "P35046",
      "P36328",
      "P43633",
      "P4544",
      "P46417",
      "P48965",
      "P53068",
      "P5497",
      "P59529",
      "P62483",
      "P64658",
      "P65202",
      "P66816",
      "P6751",
      "P7408",
      "P75566",
      "P76226",
      "P79971",
      "P82621",
      "P82990",
      "P84932",
      "P85825",
      "P86989",
      "P8770",
      "P87791",
      "P90550",
      "P93159",
      "P94969",
      "P96710",
      "P9744",
      "nan"
    ],
    "blue_o_points": [],
    "blue_x_points": [
      [0.07359, 0],
      [0.07359, 13],
      [0.07451, 15],
      [0.07144, 18],
      [0.06991, 21],
      [0.06761, 24],
      [0.07175, 31]
    ]
  },
  "QS_mulGraftNerve[Me]": {
    "red_x_points": [
      [-6e-5, 2],
      [-5e-5, 0],
      [-0.00014, 0],
      [-9e-5, 0],
      [-0.00014, 0],
      [-9e-5, 0],
      [-0.00014, 0],
      [-1e-5, 2],
      [-0.00014, 0],
      [-0.00014, 0],
      [-0.00014, 0],
      [-3e-5, 2],
      [0.0003, 1],
      [-3e-5, 2],
      [-0.00014, 0],
      [-4e-5, 2],
      [-9e-5, 0],
      [-9e-5, 0],
      [-6e-5, 2],
      [-3e-5, 2],
      [-6e-5, 2],
      [-9e-5, 0],
      [-4e-5, 2],
      [-6e-5, 2],
      [-3e-5, 2],
      [-0.00014, 0],
      [-3e-5, 2],
      [-5e-5, 0],
      [-5e-5, 2],
      [0.0003, 1],
      [-5e-5, 0]
    ],
    "red_o_points": [],
    "y_categories": ["N", "NOT APPLICABLE", "nan"],
    "blue_o_points": [],
    "blue_x_points": [
      [0.0003, 1],
      [-1e-5, 2],
      [0.0002, 1],
      [-5e-5, 2],
      [0.0002, 1],
      [0.00021, 1]
    ]
  },
  "QS_lstBpsurgSide": {
    "red_x_points": [
      [-0.005, 3],
      [-0.00708, 0],
      [-0.00681, 0],
      [-0.00744, 0],
      [-0.01459, 2],
      [-0.00637, 0],
      [-0.00722, 0],
      [-0.00453, 3],
      [-0.00688, 0],
      [-0.01429, 2],
      [-0.0137, 2],
      [-0.00497, 3],
      [0.02208, 1],
      [-0.00467, 3],
      [-0.01644, 2],
      [-0.00513, 3],
      [-0.01528, 2],
      [-0.01655, 2],
      [-0.00465, 3],
      [-0.00494, 3],
      [-0.00443, 3],
      [-0.0059, 0],
      [-0.00465, 3],
      [-0.00533, 3],
      [-0.00521, 3],
      [-0.01341, 2],
      [-0.0049, 3],
      [-0.01368, 2],
      [-0.00435, 3],
      [0.02357, 1],
      [-0.00691, 0]
    ],
    "red_o_points": [],
    "y_categories": ["L", "NOT APPLICABLE", "R", "nan"],
    "blue_o_points": [],
    "blue_x_points": [
      [0.03784, 1],
      [-0.00153, 3],
      [0.02693, 1],
      [0.00397, 0],
      [-0.00181, 3],
      [0.02714, 1],
      [0.0295, 1]
    ]
  },
  "QS_mulNeuromadSite[T2]": {
    "red_x_points": [
      [-0.00242, 2],
      [-0.00608, 0],
      [-0.00642, 0],
      [-0.00679, 0],
      [-0.00711, 0],
      [-0.00635, 0],
      [-0.00733, 0],
      [-0.00242, 2],
      [-0.00705, 0],
      [-0.00671, 0],
      [-0.00638, 0],
      [-0.00228, 2],
      [0.00994, 1],
      [-0.0024, 2],
      [-0.00702, 0],
      [-0.00252, 2],
      [-0.00652, 0],
      [-0.00732, 0],
      [-0.00229, 2],
      [-0.00235, 2],
      [-0.00176, 2],
      [-0.00525, 0],
      [-0.0024, 2],
      [-0.00291, 2],
      [-0.00291, 2],
      [-0.00613, 0],
      [-0.00247, 2],
      [-0.00664, 0],
      [-0.00213, 2],
      [0.0131, 1],
      [-0.00679, 0]
    ],
    "red_o_points": [],
    "y_categories": ["N", "NOT APPLICABLE", "nan"],
    "blue_o_points": [],
    "blue_x_points": [
      [0.02693, 1],
      [0.00024, 2],
      [0.01239, 1],
      [0.0006, 0],
      [-0.0002, 2],
      [0.01377, 1],
      [0.0174, 1]
    ]
  },
  "QS_mulLysisSite[Trunk]": {
    "red_x_points": [
      [-0.00137, 3],
      [-0.00198, 0],
      [-0.00196, 0],
      [-0.00198, 0],
      [-0.0018, 0],
      [-0.00398, 2],
      [-0.00192, 0],
      [-0.00115, 3],
      [-0.00199, 0],
      [-0.00204, 0],
      [-0.00181, 0],
      [-0.00136, 3],
      [0.0065, 1],
      [-0.00095, 3],
      [-0.00186, 0],
      [-0.00122, 3],
      [-0.00434, 2],
      [-0.00196, 0],
      [-0.00143, 3],
      [-0.00127, 3],
      [-0.00121, 3],
      [-0.00174, 0],
      [-0.00139, 3],
      [-0.00118, 3],
      [-0.00125, 3],
      [-0.00193, 0],
      [-0.0013, 3],
      [-0.00177, 0],
      [-0.00114, 3],
      [0.00628, 1],
      [-0.00352, 2]
    ],
    "red_o_points": [],
    "y_categories": ["N", "NOT APPLICABLE", "Y", "nan"],
    "blue_o_points": [],
    "blue_x_points": [
      [0.00874, 1],
      [-0.00058, 3],
      [0.00612, 1],
      [-0.00138, 0],
      [-0.00059, 3],
      [0.00653, 1],
      [0.00696, 1]
    ]
  },
  "QS_mulNeuromadSite[C4]": {
    "red_x_points": [
      [-0.00033, 2],
      [-0.0011, 0],
      [-0.00113, 0],
      [-0.00118, 0],
      [-0.00094, 0],
      [-0.00115, 0],
      [-0.00128, 0],
      [-0.0005, 2],
      [-0.00113, 0],
      [-0.00103, 0],
      [-0.0011, 0],
      [-0.00032, 2],
      [0.00195, 1],
      [-0.00051, 2],
      [-0.00149, 0],
      [-0.00053, 2],
      [-0.00107, 0],
      [-0.0011, 0],
      [-0.00036, 2],
      [-0.00036, 2],
      [-0.00034, 2],
      [-0.00101, 0],
      [-0.00041, 2],
      [-0.00075, 2],
      [-0.00056, 2],
      [-0.00105, 0],
      [-0.00051, 2],
      [-0.00107, 0],
      [-0.00052, 2],
      [0.00202, 1],
      [-0.00114, 0]
    ],
    "red_o_points": [],
    "y_categories": ["N", "NOT APPLICABLE", "nan"],
    "blue_o_points": [],
    "blue_x_points": [
      [0.00497, 1],
      [-6e-5, 2],
      [0.0026, 1],
      [0.00015, 0],
      [-8e-5, 2],
      [0.0029, 1],
      [0.00275, 1]
    ]
  },
  "QS_mulGraftNerve[Ra]": {
    "red_x_points": [
      [-1e-5, 2],
      [-6e-5, 0],
      [-6e-5, 0],
      [-1e-5, 0],
      [-9e-5, 0],
      [-4e-5, 0],
      [-8e-5, 0],
      [-4e-5, 2],
      [-9e-5, 0],
      [-4e-5, 0],
      [-9e-5, 0],
      [-7e-5, 2],
      [-7e-5, 2],
      [-9e-5, 0],
      [-6e-5, 2],
      [-5e-5, 0],
      [-8e-5, 0],
      [-6e-5, 2],
      [-3e-5, 2],
      [-3e-5, 2],
      [-4e-5, 2],
      [-3e-5, 2],
      [-7e-5, 2],
      [-8e-5, 0],
      [-7e-5, 2],
      [-7e-5, 0],
      [-3e-5, 2],
      [-7e-5, 0]
    ],
    "red_o_points": [],
    "y_categories": ["N", "NOT APPLICABLE", "nan"],
    "blue_o_points": [],
    "blue_x_points": [
      [0.00056, 1],
      [-3e-5, 2],
      [0.00015, 1],
      [0.00015, 1],
      [0.00015, 1]
    ]
  },
  "QS_mulTransfSite[PhMc]": {
    "red_x_points": [
      [-0.00098, 3],
      [-0.00174, 0],
      [-0.00167, 0],
      [-0.00171, 0],
      [-0.00173, 0],
      [-0.0016, 0],
      [-0.00311, 2],
      [-0.0009, 3],
      [-0.00159, 0],
      [-0.00156, 0],
      [-0.00165, 0],
      [-0.0009, 3],
      [0.00508, 1],
      [-0.00111, 3],
      [-0.00175, 0],
      [-0.00117, 3],
      [-0.00175, 0],
      [-0.00184, 0],
      [-0.0011, 3],
      [-0.00102, 3],
      [-0.00098, 3],
      [-0.00318, 2],
      [-0.00095, 3],
      [-0.00118, 3],
      [-0.00106, 3],
      [-0.0015, 0],
      [-0.00089, 3],
      [-0.00165, 0],
      [-0.00105, 3],
      [0.00503, 1],
      [-0.00166, 0]
    ],
    "red_o_points": [],
    "y_categories": ["N", "NOT APPLICABLE", "Y", "nan"],
    "blue_o_points": [],
    "blue_x_points": [
      [0.00661, 1],
      [-0.00046, 3],
      [0.00522, 1],
      [-0.00162, 0],
      [-0.00038, 3],
      [0.00541, 1],
      [0.00697, 1]
    ]
  },
  "QA_mulInjTbpiCause[Motorcycle]": {
    "red_x_points": [
      [0.00119, 0],
      [-0.00085, 1],
      [-0.00094, 1],
      [-0.00097, 1],
      [-0.00129, 1],
      [-0.00075, 1],
      [-0.00092, 1],
      [-0.00088, 1],
      [-0.00103, 1],
      [-0.00116, 1],
      [-0.00064, 1],
      [0.00084, 0],
      [-0.04341, 1],
      [-0.00152, 1],
      [-0.0014, 1],
      [-0.00144, 1],
      [-0.00098, 1],
      [-0.00131, 1],
      [0.00153, 0],
      [-0.00066, 1],
      [-0.00068, 1],
      [-0.00063, 1],
      [-0.00124, 1],
      [-0.0018, 1],
      [0.00177, 0],
      [-0.00066, 1],
      [-0.00081, 1],
      [-0.0008, 1],
      [-0.00091, 1],
      [-0.03766, 1],
      [-0.00073, 1]
    ],
    "red_o_points": [],
    "y_categories": ["N", "Y", "nan"],
    "blue_o_points": [],
    "blue_x_points": [
      [0.02092, 0],
      [-0.00093, 1],
      [0.01585, 0],
      [-0.00193, 1],
      [-0.00112, 1],
      [0.01718, 0],
      [0.01802, 0]
    ]
  },
  "QS_mulLysisRoot[C6]": {
    "red_x_points": [
      [-0.00063, 3],
      [-0.00125, 0],
      [-0.00235, 2],
      [-0.00129, 0],
      [-0.0012, 0],
      [-0.00118, 0],
      [-0.00109, 0],
      [-0.00063, 3],
      [-0.00119, 0],
      [-0.00124, 0],
      [-0.00113, 0],
      [-0.00067, 3],
      [0.00356, 1],
      [-0.00068, 3],
      [-0.00123, 0],
      [-0.00072, 3],
      [-0.00111, 0],
      [-0.00113, 0],
      [-0.00063, 3],
      [-0.00067, 3],
      [-0.00063, 3],
      [-0.00116, 0],
      [-0.00064, 3],
      [-0.0006, 3],
      [-0.00066, 3],
      [-0.00119, 0],
      [-0.00064, 3],
      [-0.00099, 0],
      [-0.00064, 3],
      [0.00357, 1],
      [-0.00198, 2]
    ],
    "red_o_points": [],
    "y_categories": ["N", "NOT APPLICABLE", "Y", "nan"],
    "blue_o_points": [],
    "blue_x_points": [
      [0.0039, 1],
      [-0.00039, 3],
      [0.00318, 1],
      [-0.00106, 0],
      [-0.00029, 3],
      [0.00425, 1],
      [0.0039, 1]
    ]
  },
  "QS_mulGraftLevel[Trunk]": {
    "red_x_points": [
      [-0.00031, 3],
      [-0.00036, 0],
      [-0.0003, 0],
      [-0.00029, 0],
      [-0.00033, 0],
      [-0.00027, 0],
      [-0.00027, 0],
      [-0.00033, 3],
      [-0.0003, 0],
      [-0.00027, 0],
      [-0.00027, 0],
      [-0.00034, 3],
      [0.00067, 1],
      [-0.00023, 3],
      [-0.0017, 2],
      [-0.00028, 3],
      [-0.00027, 0],
      [-0.00036, 0],
      [-0.0004, 3],
      [-0.00033, 3],
      [-0.00037, 3],
      [-0.00036, 0],
      [-0.00025, 3],
      [-0.00027, 3],
      [-0.0004, 3],
      [-0.00035, 0],
      [-0.00036, 3],
      [-0.00032, 0],
      [-0.00035, 3],
      [0.00121, 1],
      [-0.00035, 0]
    ],
    "red_o_points": [],
    "y_categories": ["N", "NOT APPLICABLE", "Y", "nan"],
    "blue_o_points": [],
    "blue_x_points": [
      [0.00161, 1],
      [3e-5, 3],
      [0.00132, 1],
      [0.00014, 0],
      [-9e-5, 3],
      [0.00091, 1],
      [0.00112, 1]
    ]
  }
}
