{
  "QA_lstPexMuscstrength[ElbowFlex]": {
    "red_x_points": [
      [-0.00331, 1],
      [0.00016, 2],
      [-0.00143, 1],
      [-0.00145, 1],
      [0.00162, 0],
      [-0.00152, 1],
      [-0.00145, 1],
      [-0.00312, 1],
      [-0.00145, 1],
      [-0.00118, 1],
      [-0.00138, 1],
      [-0.00368, 1],
      [0.00081, 2],
      [0.00315, 2],
      [0.00022, 2],
      [-0.00285, 1],
      [0.00038, 2],
      [-0.00047, 0],
      [-0.00331, 1],
      [-0.0032, 1],
      [-0.00316, 1],
      [-0.00152, 1],
      [0.00291, 2],
      [-0.00111, 0],
      [-0.00301, 1],
      [-0.00133, 1],
      [-0.00319, 1],
      [-0.00134, 1],
      [-0.00296, 1],
      [0.00075, 2],
      [-0.00138, 1]
    ],
    "red_o_points": [],
    "y_categories": ["GREATER THAN OR EQUALS TO 3", "LESS THAN 3", "nan"],
    "blue_o_points": [],
    "blue_x_points": [
      [0.00056, 2],
      [0.00489, 2],
      [0.00462, 0],
      [0.00084, 1],
      [0.00431, 2],
      [0.0038, 0],
      [0.00418, 0]
    ]
  },
  "QS_mulLysisTrunk[Upper]": {
    "red_x_points": [
      [-0.00156, 3],
      [-0.00305, 0],
      [-0.00322, 0],
      [-0.00297, 0],
      [-0.00292, 0],
      [-0.00515, 2],
      [-0.00263, 0],
      [-0.00139, 3],
      [-0.00279, 0],
      [-0.00277, 0],
      [-0.00301, 0],
      [-0.00182, 3],
      [0.00733, 1],
      [-0.00132, 3],
      [-0.00259, 0],
      [-0.00184, 3],
      [-0.005, 2],
      [-0.00298, 0],
      [-0.00174, 3],
      [-0.00134, 3],
      [-0.00169, 3],
      [-0.00294, 0],
      [-0.00132, 3],
      [-0.00145, 3],
      [-0.00165, 3],
      [-0.00285, 0],
      [-0.00166, 3],
      [-0.00289, 0],
      [-0.00161, 3],
      [0.00856, 1],
      [-0.00395, 2]
    ],
    "red_o_points": [],
    "y_categories": ["N", "NOT APPLICABLE", "Y", "nan"],
    "blue_o_points": [],
    "blue_x_points": [
      [0.01093, 1],
      [-0.00069, 3],
      [0.00869, 1],
      [-0.0011, 0],
      [-0.00034, 3],
      [0.00832, 1],
      [0.00985, 1]
    ]
  },
  "QS_mulBpsurgeryType[Transf]": {
    "red_x_points": [
      [-0.00024, 3],
      [-0.00051, 2],
      [-0.00103, 0],
      [-0.00028, 2],
      [-0.00039, 2],
      [-0.00042, 2],
      [-0.00037, 2],
      [-0.00041, 3],
      [-0.0004, 2],
      [-0.00038, 2],
      [-0.00038, 2],
      [-0.00033, 3],
      [0.00137, 1],
      [-0.0002, 3],
      [-0.00043, 2],
      [-0.00041, 3],
      [-0.00039, 2],
      [-0.0004, 2],
      [-0.00035, 3],
      [-0.00029, 3],
      [-0.00029, 3],
      [-0.00043, 2],
      [-0.00024, 3],
      [-0.00036, 3],
      [-0.00039, 3],
      [-0.00044, 2],
      [-0.00031, 3],
      [-0.00042, 2],
      [-0.00033, 3],
      [0.0011, 1],
      [-0.00044, 2]
    ],
    "red_o_points": [],
    "y_categories": ["N", "NOT APPLICABLE", "Y", "nan"],
    "blue_o_points": [],
    "blue_x_points": [
      [0.0017, 1],
      [-0.00014, 3],
      [0.00188, 1],
      [-0.00055, 2],
      [-0.00018, 3],
      [0.0011, 1],
      [0.00184, 1]
    ]
  },
  "QS_mulNeuromadSite[T1]": {
    "red_x_points": [
      [-0.00105, 2],
      [-0.00389, 0],
      [-0.0041, 0],
      [-0.00346, 0],
      [-0.00413, 0],
      [-0.00388, 0],
      [-0.00385, 0],
      [-0.00121, 2],
      [-0.00421, 0],
      [-0.00373, 0],
      [-0.00362, 0],
      [-0.0013, 2],
      [0.00617, 1],
      [-0.00087, 2],
      [-0.00365, 0],
      [-0.00134, 2],
      [-0.00395, 0],
      [-0.00397, 0],
      [-0.0012, 2],
      [-0.00119, 2],
      [-0.00092, 2],
      [-0.00334, 0],
      [-0.00103, 2],
      [-0.0013, 2],
      [-0.00132, 2],
      [-0.00355, 0],
      [-0.00105, 2],
      [-0.00457, 0],
      [-0.00085, 2],
      [0.00649, 1],
      [-0.00393, 0]
    ],
    "red_o_points": [],
    "y_categories": ["N", "NOT APPLICABLE", "nan"],
    "blue_o_points": [],
    "blue_x_points": [
      [0.01387, 1],
      [0.0002, 2],
      [0.00886, 1],
      [0.00038, 0],
      [-1e-5, 2],
      [0.00892, 1],
      [0.00889, 1]
    ]
  },
  "QS_mulNeuromadSite[T2]": {
    "red_x_points": [
      [-0.00182, 2],
      [-0.00598, 0],
      [-0.00619, 0],
      [-0.00627, 0],
      [-0.00671, 0],
      [-0.0063, 0],
      [-0.00608, 0],
      [-0.00177, 2],
      [-0.00611, 0],
      [-0.00661, 0],
      [-0.00573, 0],
      [-0.00222, 2],
      [0.01059, 1],
      [-0.00165, 2],
      [-0.00619, 0],
      [-0.00227, 2],
      [-0.00629, 0],
      [-0.00598, 0],
      [-0.00224, 2],
      [-0.00164, 2],
      [-0.00154, 2],
      [-0.0054, 0],
      [-0.0021, 2],
      [-0.00196, 2],
      [-0.00199, 2],
      [-0.0058, 0],
      [-0.00152, 2],
      [-0.00646, 0],
      [-0.00146, 2],
      [0.01188, 1],
      [-0.00538, 0]
    ],
    "red_o_points": [],
    "y_categories": ["N", "NOT APPLICABLE", "nan"],
    "blue_o_points": [],
    "blue_x_points": [
      [0.02011, 1],
      [-0.00019, 2],
      [0.01353, 1],
      [0.00022, 0],
      [-0.00026, 2],
      [0.01274, 1],
      [0.01586, 1]
    ]
  },
  "QS_mulGraftTrunk[MiddleTrunk]": {
    "red_x_points": [
      [-2e-5, 0],
      [-2e-5, 0],
      [-2e-5, 0],
      [-2e-5, 0],
      [-2e-5, 0],
      [-1e-5, 2],
      [-2e-5, 0],
      [-2e-5, 0],
      [-1e-5, 2],
      [0.0001, 1],
      [-1e-5, 2],
      [-2e-5, 0],
      [-1e-5, 2],
      [-2e-5, 0],
      [-1e-5, 2],
      [-1e-5, 2],
      [-1e-5, 2],
      [-2e-5, 0],
      [-1e-5, 2],
      [-1e-5, 2],
      [-2e-5, 0],
      [-1e-5, 2],
      [-2e-5, 0]
    ],
    "red_o_points": [],
    "y_categories": ["N", "NOT APPLICABLE", "nan"],
    "blue_o_points": [],
    "blue_x_points": [[0.0001, 1], [-1e-5, 2], [-2e-5, 0], [0.0001, 1]]
  },
  "QS_mulGraftNerve[Ac]": {
    "red_x_points": [
      [-0.00016, 2],
      [-0.00079, 0],
      [-0.00114, 0],
      [-0.00095, 0],
      [-0.00119, 0],
      [-0.00119, 0],
      [-0.00094, 0],
      [-0.00022, 2],
      [-0.00092, 0],
      [-0.00113, 0],
      [-0.00087, 0],
      [-0.00043, 2],
      [0.00147, 1],
      [-0.00022, 2],
      [-0.00117, 0],
      [-0.00029, 2],
      [-0.00098, 0],
      [-0.00086, 0],
      [-0.00017, 2],
      [-0.00019, 2],
      [-0.00016, 2],
      [-0.00105, 0],
      [-0.00016, 2],
      [-0.00014, 2],
      [-0.0002, 2],
      [-0.00083, 0],
      [-0.00014, 2],
      [-0.00101, 0],
      [-3e-5, 2],
      [0.00164, 1],
      [-0.0009, 0]
    ],
    "red_o_points": [],
    "y_categories": ["N", "NOT APPLICABLE", "nan"],
    "blue_o_points": [],
    "blue_x_points": [
      [0.00257, 1],
      [0.00015, 2],
      [0.00266, 1],
      [8e-5, 0],
      [7e-5, 2],
      [0.00199, 1],
      [0.0024, 1]
    ]
  },
  "QS_mulNeuromadSite[C8]": {
    "red_x_points": [
      [-0.00142, 2],
      [-0.00324, 0],
      [-0.00359, 0],
      [-0.00347, 0],
      [-0.0031, 0],
      [-0.00354, 0],
      [-0.00333, 0],
      [-0.00136, 2],
      [-0.00372, 0],
      [-0.00318, 0],
      [-0.00277, 0],
      [-0.00141, 2],
      [0.00547, 1],
      [-0.00113, 2],
      [-0.00375, 0],
      [-0.00151, 2],
      [-0.00296, 0],
      [-0.00319, 0],
      [-0.00133, 2],
      [-0.00131, 2],
      [-0.00122, 2],
      [-0.00317, 0],
      [-0.00139, 2],
      [-0.00169, 2],
      [-0.00169, 2],
      [-0.00338, 0],
      [-0.00111, 2],
      [-0.00349, 0],
      [-0.00107, 2],
      [0.00632, 1],
      [-0.00303, 0]
    ],
    "red_o_points": [],
    "y_categories": ["N", "NOT APPLICABLE", "nan"],
    "blue_o_points": [],
    "blue_x_points": [
      [0.01243, 1],
      [-0.00016, 2],
      [0.00674, 1],
      [0.00017, 0],
      [9e-5, 2],
      [0.00798, 1],
      [0.00823, 1]
    ]
  },
  "QS_mulGraftNerve[Ph]": {
    "red_x_points": [
      [-0.00029, 2],
      [-0.00123, 0],
      [-0.00126, 0],
      [-0.00102, 0],
      [-0.0014, 0],
      [-0.00099, 0],
      [-0.00118, 0],
      [-0.00034, 2],
      [-0.001, 0],
      [-0.00114, 0],
      [-0.00086, 0],
      [-0.00029, 2],
      [0.00218, 1],
      [-0.00041, 2],
      [-0.00106, 0],
      [-0.00043, 2],
      [-0.00087, 0],
      [-0.00104, 0],
      [-0.00032, 2],
      [-0.00033, 2],
      [-0.00034, 2],
      [-0.00082, 0],
      [-0.00025, 2],
      [-0.00046, 2],
      [-0.00057, 2],
      [-0.00072, 0],
      [-0.00035, 2],
      [-0.00078, 0],
      [-0.00034, 2],
      [0.00222, 1],
      [-0.00093, 0]
    ],
    "red_o_points": [],
    "y_categories": ["N", "NOT APPLICABLE", "nan"],
    "blue_o_points": [],
    "blue_x_points": [
      [0.00372, 1],
      [4e-5, 2],
      [0.00226, 1],
      [3e-5, 0],
      [-0.0001, 2],
      [0.00216, 1],
      [0.00238, 1]
    ]
  },
  "QS_mulTransfSite[AcSsPA]": {
    "red_x_points": [
      [-0.00022, 3],
      [-0.00065, 0],
      [-0.00052, 0],
      [-0.00043, 0],
      [-0.00054, 0],
      [-0.00063, 0],
      [-0.00057, 0],
      [-0.00019, 3],
      [-0.00068, 0],
      [-0.00052, 0],
      [-0.00063, 0],
      [-0.00018, 3],
      [0.00114, 1],
      [-0.0003, 3],
      [-0.00047, 0],
      [-0.0003, 3],
      [-0.00142, 2],
      [-0.00065, 0],
      [-0.00021, 3],
      [-0.00027, 3],
      [-0.00021, 3],
      [-0.00052, 0],
      [-0.00028, 3],
      [-0.0002, 3],
      [-0.00022, 3],
      [-0.00058, 0],
      [-0.0004, 3],
      [-0.00068, 0],
      [-0.00022, 3],
      [0.00131, 1],
      [-0.00061, 0]
    ],
    "red_o_points": [],
    "y_categories": ["N", "NOT APPLICABLE", "Y", "nan"],
    "blue_o_points": [],
    "blue_x_points": [
      [0.00171, 1],
      [-4e-5, 3],
      [0.00171, 1],
      [-0.00022, 0],
      [-0.00014, 3],
      [0.0019, 1],
      [0.00223, 1]
    ]
  },
  "QA_lstPexMuscstrength[ScapulaAbducSuprot]": {
    "red_x_points": [
      [-0.00039, 0],
      [7e-5, 2],
      [-0.00015, 1],
      [-0.00028, 1],
      [-0.00011, 0],
      [-0.00019, 1],
      [-0.00038, 1],
      [-0.0006, 1],
      [-0.0001, 0],
      [-0.00022, 0],
      [-0.00043, 1],
      [-0.0011, 1],
      [0.00017, 2],
      [0.0003, 2],
      [0.00019, 2],
      [0.00031, 2],
      [0.00012, 2],
      [5e-5, 0],
      [-0.00048, 0],
      [-0.00069, 1],
      [-0.00038, 0],
      [-0.00032, 1],
      [0.00037, 2],
      [-0.00046, 0],
      [0.00035, 2],
      [-0.00039, 1],
      [-0.0007, 1],
      [-0.00012, 0],
      [0.00054, 2],
      [0.00017, 2],
      [-0.00024, 1]
    ],
    "red_o_points": [],
    "y_categories": ["GREATER THAN OR EQUALS TO 3", "LESS THAN 3", "nan"],
    "blue_o_points": [],
    "blue_x_points": [
      [0.00015, 2],
      [0.00067, 2],
      [0.00013, 0],
      [0.00087, 2],
      [0.00062, 2],
      [0.00011, 0],
      [4e-5, 2]
    ]
  },
  "participant_code": {
    "red_x_points": [
      [-0.01764, 1],
      [-0.01843, 2],
      [-0.01824, 3],
      [-0.01796, 4],
      [-0.0174, 5],
      [-0.01834, 6],
      [-0.01843, 7],
      [-0.0182, 8],
      [-0.01843, 9],
      [-0.01759, 10],
      [-0.01838, 11],
      [-0.01782, 12],
      [-0.0174, 14],
      [-0.01796, 16],
      [-0.0182, 17],
      [-0.01717, 19],
      [-0.0181, 20],
      [-0.01638, 22],
      [-0.01764, 23],
      [-0.01731, 25],
      [-0.01782, 26],
      [-0.01787, 27],
      [-0.01694, 28],
      [-0.01694, 29],
      [-0.01801, 30],
      [-0.01731, 32],
      [-0.0174, 33],
      [-0.01792, 34],
      [-0.01773, 35],
      [-0.01759, 36],
      [-0.01796, 37]
    ],
    "red_o_points": [],
    "y_categories": [
      "P16554",
      "P18297",
      "P19283",
      "P19287",
      "P23391",
      "P31645",
      "P31691",
      "P34778",
      "P35046",
      "P36328",
      "P43633",
      "P4544",
      "P46417",
      "P48965",
      "P53068",
      "P5497",
      "P59529",
      "P62483",
      "P64658",
      "P65202",
      "P66816",
      "P6751",
      "P7408",
      "P75566",
      "P76226",
      "P79971",
      "P82621",
      "P82990",
      "P84932",
      "P85825",
      "P86989",
      "P8770",
      "P87791",
      "P90550",
      "P93159",
      "P94969",
      "P96710",
      "P9744",
      "nan"
    ],
    "blue_o_points": [],
    "blue_x_points": [
      [0.0532, 0],
      [0.05136, 13],
      [0.05197, 15],
      [0.05258, 18],
      [0.04982, 21],
      [0.05274, 24],
      [0.05504, 31]
    ]
  },
  "QA_lstPexMuscstrength[ShoulderExrot]": {
    "red_x_points": [
      [-0.0022, 1],
      [0.00026, 2],
      [0.00153, 0],
      [-0.00182, 1],
      [-0.00184, 1],
      [-0.0021, 1],
      [0.00027, 2],
      [-0.00166, 1],
      [-0.00206, 1],
      [-0.00174, 1],
      [0.00024, 2],
      [-0.00207, 1],
      [-0.00031, 2],
      [0.00023, 2],
      [0.00035, 2],
      [0.00025, 2],
      [0.00028, 2],
      [-0.00218, 1],
      [-0.00205, 1],
      [-0.00162, 1],
      [-0.0018, 1],
      [0.00028, 2],
      [0.00029, 2],
      [0.0003, 2],
      [0.00027, 2],
      [-0.00167, 1],
      [0.00024, 2],
      [0.00213, 0],
      [0.00029, 2],
      [-0.00027, 2],
      [-0.00167, 1]
    ],
    "red_o_points": [],
    "y_categories": ["GREATER THAN OR EQUALS TO 3", "LESS THAN 3", "nan"],
    "blue_o_points": [],
    "blue_x_points": [
      [1e-5, 2],
      [0.00028, 2],
      [0.00526, 0],
      [0.00101, 2],
      [0.00043, 2],
      [0.00464, 0],
      [-3e-5, 1]
    ]
  },
  "QA_mulInjOrthesisType[ArmSling]": {
    "red_x_points": [
      [-0.01146, 2],
      [-0.01059, 2],
      [-0.0104, 2],
      [-0.01011, 2],
      [-0.01045, 2],
      [-0.01011, 2],
      [-0.01021, 2],
      [-0.01132, 2],
      [-0.01013, 2],
      [-0.00879, 2],
      [-0.01103, 2],
      [-0.01165, 2],
      [0.02584, 1],
      [-0.01109, 2],
      [-0.01055, 2],
      [-0.01178, 2],
      [-0.01188, 0],
      [-0.01068, 2],
      [-0.01114, 2],
      [-0.01118, 2],
      [-0.01318, 0],
      [-0.01162, 3],
      [-0.0117, 2],
      [0.03193, 1],
      [-0.01148, 2],
      [-0.01055, 2],
      [-0.01166, 2],
      [-0.0098, 2],
      [-0.01381, 3],
      [-0.02176, 3],
      [-0.01013, 2]
    ],
    "red_o_points": [],
    "y_categories": ["N", "NOT APPLICABLE", "Y", "nan"],
    "blue_o_points": [],
    "blue_x_points": [
      [-0.00324, 2],
      [0.0329, 1],
      [0.02611, 1],
      [0.03309, 1],
      [0.03315, 1],
      [0.02893, 1],
      [0.02769, 1]
    ]
  },
  "QS_mulGraftNerve[Ul]": {
    "red_x_points": [
      [-0.00013, 2],
      [-0.0003, 0],
      [-0.00037, 0],
      [-0.0003, 0],
      [-0.00027, 0],
      [-0.00026, 0],
      [-0.00032, 0],
      [-0.00022, 2],
      [-0.00034, 0],
      [-0.00029, 0],
      [-0.00022, 0],
      [-0.00019, 2],
      [0.0003, 1],
      [-0.00014, 2],
      [-0.0004, 0],
      [-0.0003, 2],
      [-0.00035, 0],
      [-0.00031, 0],
      [-7e-5, 2],
      [-7e-5, 2],
      [-5e-5, 2],
      [-0.00028, 0],
      [-0.00023, 2],
      [-0.00013, 2],
      [-0.00022, 2],
      [-0.00018, 0],
      [-9e-5, 2],
      [-0.00037, 0],
      [-9e-5, 2],
      [0.00047, 1],
      [-0.00022, 0]
    ],
    "red_o_points": [],
    "y_categories": ["N", "NOT APPLICABLE", "nan"],
    "blue_o_points": [],
    "blue_x_points": [
      [0.00159, 1],
      [8e-5, 2],
      [0.00083, 1],
      [8e-5, 0],
      [0.0002, 2],
      [0.00054, 1],
      [0.00083, 1]
    ]
  },
  "QA_mulInjOrthesisType[ShoulderSupport]": {
    "red_x_points": [
      [-0.01345, 0],
      [-0.01184, 0],
      [-0.01288, 0],
      [-0.01198, 0],
      [-0.0121, 0],
      [-0.01171, 0],
      [-0.01156, 0],
      [-0.01381, 2],
      [-0.01262, 0],
      [-0.01198, 0],
      [-0.01208, 0],
      [-0.01288, 0],
      [0.03289, 1],
      [-0.01293, 0],
      [-0.01261, 0],
      [-0.01282, 0],
      [-0.01447, 2],
      [-0.01279, 0],
      [-0.01227, 0],
      [-0.0126, 0],
      [-0.01511, 2],
      [-0.01375, 3],
      [-0.01313, 0],
      [0.03561, 1],
      [-0.01311, 0],
      [-0.01195, 0],
      [-0.01333, 0],
      [-0.01112, 0],
      [-0.01459, 3],
      [-0.02051, 3],
      [-0.0121, 0]
    ],
    "red_o_points": [],
    "y_categories": ["N", "NOT APPLICABLE", "Y", "nan"],
    "blue_o_points": [],
    "blue_x_points": [
      [-0.00501, 0],
      [0.03683, 1],
      [0.03193, 1],
      [0.0387, 1],
      [0.03679, 1],
      [0.03091, 1],
      [0.03074, 1]
    ]
  },
  "QA_yonInjUnconscio": {
    "red_x_points": [
      [-0.0034, 1],
      [-0.00371, 1],
      [-0.00163, 2],
      [-0.00209, 2],
      [0.00715, 0],
      [-0.00423, 1],
      [-0.00219, 2],
      [-0.00547, 2],
      [-0.00233, 2],
      [-0.00152, 2],
      [-0.00387, 1],
      [-0.005, 1],
      [-0.02599, 1],
      [-0.00531, 2],
      [-0.00202, 2],
      [-0.00499, 2],
      [-0.00369, 1],
      [0.00784, 0],
      [-0.00399, 1],
      [-0.00333, 1],
      [-0.00281, 1],
      [-0.00371, 1],
      [-0.00424, 2],
      [-0.00969, 1],
      [-0.00436, 2],
      [-0.00391, 1],
      [0.008, 0],
      [-0.00338, 1],
      [-0.00562, 2],
      [-0.00109, 2],
      [-0.00347, 1]
    ],
    "red_o_points": [],
    "y_categories": ["N", "Y", "nan"],
    "blue_o_points": [],
    "blue_x_points": [
      [0.00105, 2],
      [0.0, 1],
      [0.01402, 0],
      [0.01919, 0],
      [0.0233, 0],
      [0.003, 2],
      [0.00296, 2]
    ]
  },
  "QS_mulGraftNerve[MCA]": {
    "red_x_points": [
      [-1e-5, 2],
      [-1e-5, 0],
      [-1e-5, 0],
      [-1e-5, 0],
      [-1e-5, 0],
      [-1e-5, 0],
      [-1e-5, 2],
      [-1e-5, 0],
      [-1e-5, 2],
      [-1e-5, 0],
      [-1e-5, 2],
      [-1e-5, 2],
      [-1e-5, 2],
      [-1e-5, 2],
      [-1e-5, 0],
      [-1e-5, 0]
    ],
    "red_o_points": [],
    "y_categories": ["N", "NOT APPLICABLE", "nan"],
    "blue_o_points": [],
    "blue_x_points": [[0.00019, 1]]
  },
  "QA_lstPexInspectio[SurgicalScar]": {
    "red_x_points": [
      [0.00269, 1],
      [0.00122, 1],
      [0.00055, 0],
      [0.00118, 1],
      [-0.00486, 2],
      [0.0008, 0],
      [0.00108, 1],
      [0.00201, 1],
      [0.00098, 1],
      [-0.0038, 2],
      [0.00129, 1],
      [-0.00281, 0],
      [-0.00096, 1],
      [-0.00783, 2],
      [0.00174, 1],
      [0.00304, 1],
      [-0.00098, 0],
      [-0.00567, 2],
      [-0.00579, 2],
      [-0.0056, 2],
      [0.00266, 1],
      [0.00123, 1],
      [-0.00784, 2],
      [-0.01421, 2],
      [0.00245, 1],
      [0.00106, 1],
      [-0.00659, 2],
      [-0.00285, 2],
      [0.00226, 1],
      [-0.00213, 1],
      [-0.00387, 2]
    ],
    "red_o_points": [],
    "y_categories": ["ABS", "NAIA", "PT", "nan"],
    "blue_o_points": [],
    "blue_x_points": [
      [0.00047, 1],
      [0.00451, 1],
      [0.00719, 0],
      [0.00388, 1],
      [0.00618, 1],
      [0.00025, 1],
      [0.00726, 0]
    ]
  },
  "QS_mulGraftNerve[Me]": {
    "red_x_points": [
      [-6e-5, 2],
      [-0.00037, 0],
      [-0.00034, 0],
      [-0.00037, 0],
      [-0.00034, 0],
      [-0.00048, 0],
      [-0.00046, 0],
      [-0.0001, 2],
      [-0.00043, 0],
      [-0.00036, 0],
      [-0.00034, 0],
      [-0.00022, 2],
      [0.00022, 1],
      [-0.00013, 2],
      [-0.00043, 0],
      [-9e-5, 2],
      [-0.00037, 0],
      [-0.00043, 0],
      [-0.00015, 2],
      [-5e-5, 2],
      [-8e-5, 2],
      [-0.00015, 0],
      [-0.00013, 2],
      [-0.00012, 2],
      [-0.00015, 2],
      [-0.00038, 0],
      [-0.0001, 2],
      [-0.00034, 0],
      [1e-5, 2],
      [0.00073, 1],
      [-0.00028, 0]
    ],
    "red_o_points": [],
    "y_categories": ["N", "NOT APPLICABLE", "nan"],
    "blue_o_points": [],
    "blue_x_points": [
      [0.00151, 1],
      [6e-5, 2],
      [0.00087, 1],
      [3e-5, 0],
      [5e-5, 2],
      [0.00056, 1],
      [0.00094, 1]
    ]
  },
  "QS_mulLysisSite[Trunk]": {
    "red_x_points": [
      [-0.00145, 3],
      [-0.00284, 0],
      [-0.00314, 0],
      [-0.00294, 0],
      [-0.00296, 0],
      [-0.00536, 2],
      [-0.00278, 0],
      [-0.00156, 3],
      [-0.0027, 0],
      [-0.00279, 0],
      [-0.0027, 0],
      [-0.00151, 3],
      [0.00658, 1],
      [-0.00163, 3],
      [-0.00297, 0],
      [-0.00148, 3],
      [-0.0053, 2],
      [-0.0027, 0],
      [-0.0014, 3],
      [-0.00138, 3],
      [-0.00129, 3],
      [-0.00283, 0],
      [-0.0015, 3],
      [-0.00148, 3],
      [-0.00146, 3],
      [-0.00277, 0],
      [-0.00147, 3],
      [-0.00242, 0],
      [-0.00143, 3],
      [0.0081, 1],
      [-0.00481, 2]
    ],
    "red_o_points": [],
    "y_categories": ["N", "NOT APPLICABLE", "Y", "nan"],
    "blue_o_points": [],
    "blue_x_points": [
      [0.01104, 1],
      [-0.00028, 3],
      [0.00797, 1],
      [-0.00175, 0],
      [-0.00037, 3],
      [0.00944, 1],
      [0.01004, 1]
    ]
  },
  "QS_mulGraftTrunk[UpperTrunk]": {
    "red_x_points": [
      [-0.00059, 3],
      [-0.00141, 0],
      [-0.00137, 0],
      [-0.00146, 0],
      [-0.0014, 0],
      [-0.00134, 0],
      [-0.00152, 0],
      [-0.00065, 3],
      [-0.00147, 0],
      [-0.00129, 0],
      [-0.00131, 0],
      [-0.00056, 3],
      [0.00339, 1],
      [-0.00068, 3],
      [-0.00332, 2],
      [-0.00058, 3],
      [-0.00121, 0],
      [-0.00128, 0],
      [-0.00077, 3],
      [-0.00075, 3],
      [-0.00053, 3],
      [-0.0013, 0],
      [-0.00066, 3],
      [-0.00065, 3],
      [-0.00074, 3],
      [-0.0011, 0],
      [-0.00071, 3],
      [-0.0014, 0],
      [-0.00066, 3],
      [0.00326, 1],
      [-0.00135, 0]
    ],
    "red_o_points": [],
    "y_categories": ["N", "NOT APPLICABLE", "Y", "nan"],
    "blue_o_points": [],
    "blue_x_points": [
      [0.00493, 1],
      [-0.00024, 3],
      [0.0038, 1],
      [-0.00032, 0],
      [-0.00028, 3],
      [0.00352, 1],
      [0.00446, 1]
    ]
  },
  "QS_mulTransfSite[PhMc]": {
    "red_x_points": [
      [-0.00145, 3],
      [-0.00262, 0],
      [-0.00245, 0],
      [-0.00259, 0],
      [-0.00254, 0],
      [-0.00265, 0],
      [-0.0051, 2],
      [-0.0013, 3],
      [-0.00284, 0],
      [-0.00249, 0],
      [-0.00243, 0],
      [-0.00123, 3],
      [0.00666, 1],
      [-0.00143, 3],
      [-0.00251, 0],
      [-0.00134, 3],
      [-0.00217, 0],
      [-0.00278, 0],
      [-0.00146, 3],
      [-0.00143, 3],
      [-0.00133, 3],
      [-0.00468, 2],
      [-0.00139, 3],
      [-0.00129, 3],
      [-0.00144, 3],
      [-0.00251, 0],
      [-0.00129, 3],
      [-0.00267, 0],
      [-0.00119, 3],
      [0.00671, 1],
      [-0.00231, 0]
    ],
    "red_o_points": [],
    "y_categories": ["N", "NOT APPLICABLE", "Y", "nan"],
    "blue_o_points": [],
    "blue_x_points": [
      [0.01101, 1],
      [-0.00055, 3],
      [0.00766, 1],
      [-0.00144, 0],
      [-0.00053, 3],
      [0.0073, 1],
      [0.00873, 1]
    ]
  },
  "QA_mulInjTbpiCause[Motorcycle]": {
    "red_x_points": [
      [0.00057, 0],
      [-0.00093, 1],
      [-0.00171, 1],
      [-0.00119, 1],
      [-0.00117, 1],
      [-0.00122, 1],
      [-0.00128, 1],
      [-0.00065, 1],
      [-0.0013, 1],
      [-0.00114, 1],
      [-0.00099, 1],
      [-0.00054, 0],
      [-0.0362, 1],
      [-0.00141, 1],
      [-0.0014, 1],
      [-0.0013, 1],
      [-0.00158, 1],
      [-0.00118, 1],
      [0.00058, 0],
      [-0.00083, 1],
      [-0.00068, 1],
      [-0.00085, 1],
      [-0.0013, 1],
      [-0.00213, 1],
      [0.00031, 0],
      [-0.00087, 1],
      [-0.00074, 1],
      [-0.00172, 1],
      [-0.00081, 1],
      [-0.03364, 1],
      [-0.00093, 1]
    ],
    "red_o_points": [],
    "y_categories": ["N", "Y", "nan"],
    "blue_o_points": [],
    "blue_x_points": [
      [0.01879, 0],
      [-0.00029, 1],
      [0.01552, 0],
      [-0.00171, 1],
      [0.00148, 1],
      [0.01643, 0],
      [0.01635, 0]
    ]
  },
  "QS_mulLysisRoot[C6]": {
    "red_x_points": [
      [-0.00108, 3],
      [-0.00145, 0],
      [-0.00338, 2],
      [-0.0015, 0],
      [-0.0015, 0],
      [-0.00138, 0],
      [-0.00155, 0],
      [-0.00111, 3],
      [-0.00161, 0],
      [-0.00159, 0],
      [-0.00153, 0],
      [-0.00095, 3],
      [0.00403, 1],
      [-0.00077, 3],
      [-0.00161, 0],
      [-0.00111, 3],
      [-0.00142, 0],
      [-0.00131, 0],
      [-0.00103, 3],
      [-0.00093, 3],
      [-0.00103, 3],
      [-0.0015, 0],
      [-0.00105, 3],
      [-0.00122, 3],
      [-0.00122, 3],
      [-0.00139, 0],
      [-0.00097, 3],
      [-0.00169, 0],
      [-0.00098, 3],
      [0.00547, 1],
      [-0.00269, 2]
    ],
    "red_o_points": [],
    "y_categories": ["N", "NOT APPLICABLE", "Y", "nan"],
    "blue_o_points": [],
    "blue_x_points": [
      [0.00619, 1],
      [-0.00021, 3],
      [0.00449, 1],
      [-0.00118, 0],
      [-0.00042, 3],
      [0.00487, 1],
      [0.00588, 1]
    ]
  },
  "QA_yonInjOrtsurg": {
    "red_x_points": [
      [-0.00384, 2],
      [-0.00027, 2],
      [0.0, 2],
      [4e-5, 2],
      [0.0001, 2],
      [5e-5, 2],
      [-0.00059, 1],
      [-0.00475, 2],
      [-7e-5, 0],
      [-0.00024, 1],
      [-0.00028, 1],
      [-0.00381, 2],
      [-0.0023, 0],
      [0.00047, 1],
      [-0.0003, 2],
      [-0.00503, 2],
      [9e-5, 0],
      [-0.0, 2],
      [0.00462, 0],
      [0.00035, 1],
      [-0.00471, 2],
      [-0.00035, 1],
      [-0.00495, 2],
      [-0.00418, 2],
      [-0.00425, 2],
      [1e-5, 0],
      [-1e-5, 1],
      [0.0, 0],
      [-0.00461, 2],
      [-0.00156, 1],
      [-3e-5, 1]
    ],
    "red_o_points": [],
    "y_categories": ["N", "Y", "nan"],
    "blue_o_points": [],
    "blue_x_points": [
      [0.00034, 2],
      [0.00556, 1],
      [0.00041, 2],
      [0.0004, 2],
      [0.01691, 0],
      [0.00041, 2],
      [0.00029, 2]
    ]
  },
  "QS_mulGraftLevel[Trunk]": {
    "red_x_points": [
      [-0.00034, 3],
      [-0.00051, 0],
      [-0.00058, 0],
      [-0.00056, 0],
      [-0.00063, 0],
      [-0.00052, 0],
      [-0.00051, 0],
      [-0.0004, 3],
      [-0.00048, 0],
      [-0.0005, 0],
      [-0.00058, 0],
      [-0.00045, 3],
      [0.00163, 1],
      [-0.00045, 3],
      [-0.00227, 2],
      [-0.0005, 3],
      [-0.00046, 0],
      [-0.00056, 0],
      [-0.00046, 3],
      [-0.00034, 3],
      [-0.00031, 3],
      [-0.00045, 0],
      [-0.00039, 3],
      [-0.00052, 3],
      [-0.00039, 3],
      [-0.00056, 0],
      [-0.0004, 3],
      [-0.00061, 0],
      [-0.00028, 3],
      [0.00168, 1],
      [-0.00046, 0]
    ],
    "red_o_points": [],
    "y_categories": ["N", "NOT APPLICABLE", "Y", "nan"],
    "blue_o_points": [],
    "blue_x_points": [
      [0.00238, 1],
      [-0.0001, 3],
      [0.00204, 1],
      [0.0002, 0],
      [-0.0002, 3],
      [0.00178, 1],
      [0.00142, 1]
    ]
  },
  "QS_mulGraftNerve[FI]": {
    "red_x_points": [
      [-0.0004, 2],
      [-0.00094, 0],
      [-0.00126, 0],
      [-0.00107, 0],
      [-0.00086, 0],
      [-0.00094, 0],
      [-0.00093, 0],
      [-0.00029, 2],
      [-0.00113, 0],
      [-0.00098, 0],
      [-0.00098, 0],
      [-0.00035, 2],
      [0.00167, 1],
      [-0.00038, 2],
      [-0.00098, 0],
      [-0.00059, 2],
      [-0.001, 0],
      [-0.00102, 0],
      [-0.00052, 2],
      [-0.00045, 2],
      [-0.0005, 2],
      [-0.00097, 0],
      [-0.00046, 2],
      [-0.00031, 2],
      [-0.00059, 2],
      [-0.00118, 0],
      [-0.0003, 2],
      [-0.00114, 0],
      [-0.0005, 2],
      [0.00178, 1],
      [-0.00096, 0]
    ],
    "red_o_points": [],
    "y_categories": ["N", "NOT APPLICABLE", "nan"],
    "blue_o_points": [],
    "blue_x_points": [
      [0.00424, 1],
      [-6e-5, 2],
      [0.0028, 1],
      [9e-5, 0],
      [-9e-5, 2],
      [0.00288, 1],
      [0.00327, 1]
    ]
  },
  "QS_mulGraftNerve[other]": {
    "red_x_points": [
      [-0.00033, 2],
      [-0.00134, 0],
      [-0.00148, 0],
      [-0.00143, 0],
      [-0.00138, 0],
      [-0.00132, 0],
      [-0.00148, 0],
      [-0.00054, 2],
      [-0.00141, 0],
      [-0.00126, 0],
      [-0.00147, 0],
      [-0.0007, 2],
      [0.00221, 1],
      [-0.00067, 2],
      [-0.00152, 0],
      [-0.00065, 2],
      [-0.00129, 0],
      [-0.00151, 0],
      [-0.00054, 2],
      [-0.00034, 2],
      [-0.00028, 2],
      [-0.00136, 0],
      [-0.0005, 2],
      [-0.00089, 2],
      [-0.00053, 2],
      [-0.00146, 0],
      [-0.00047, 2],
      [-0.00173, 0],
      [-0.00057, 2],
      [0.00214, 1],
      [-0.00132, 0]
    ],
    "red_o_points": [],
    "y_categories": ["N", "NOT APPLICABLE", "nan"],
    "blue_o_points": [],
    "blue_x_points": [
      [0.0054, 1],
      [-0.0002, 2],
      [0.00365, 1],
      [0.00035, 0],
      [-1e-5, 2],
      [0.00288, 1],
      [0.00367, 1]
    ]
  },
  "QS_mulTransfSite[AcSsAA]": {
    "red_x_points": [
      [-0.00245, 3],
      [-0.00778, 2],
      [-0.00337, 0],
      [-0.00795, 2],
      [-0.00833, 2],
      [-0.00339, 0],
      [-0.00292, 0],
      [-0.00291, 3],
      [-0.00283, 0],
      [-0.00842, 2],
      [-0.00264, 0],
      [-0.00278, 3],
      [0.01198, 1],
      [-0.00261, 3],
      [-0.00828, 2],
      [-0.003, 3],
      [-0.00305, 0],
      [-0.00284, 0],
      [-0.00258, 3],
      [-0.00233, 3],
      [-0.00256, 3],
      [-0.00807, 2],
      [-0.00248, 3],
      [-0.00288, 3],
      [-0.00263, 3],
      [-0.00256, 0],
      [-0.00246, 3],
      [-0.00786, 2],
      [-0.0027, 3],
      [0.01421, 1],
      [-0.00284, 0]
    ],
    "red_o_points": [],
    "y_categories": ["N", "NOT APPLICABLE", "Y", "nan"],
    "blue_o_points": [],
    "blue_x_points": [
      [0.01551, 1],
      [-0.00111, 3],
      [0.0138, 1],
      [0.00038, 0],
      [-0.00078, 3],
      [0.01384, 1],
      [0.01685, 1]
    ]
  },
  "QS_mulGraftNerve[Ax]": {
    "red_x_points": [
      [-6e-5, 2],
      [-0.00029, 0],
      [-0.00017, 0],
      [-0.00024, 0],
      [-0.00023, 0],
      [-0.00018, 0],
      [-0.00032, 0],
      [-4e-5, 2],
      [-0.00019, 0],
      [-0.00023, 0],
      [-0.00023, 0],
      [-0.0001, 2],
      [0.00058, 1],
      [-0.0001, 2],
      [-0.00023, 0],
      [-8e-5, 2],
      [-0.00026, 0],
      [-0.00028, 0],
      [-6e-5, 2],
      [-0.0001, 2],
      [-7e-5, 2],
      [-0.00017, 0],
      [-0.0001, 2],
      [-0.0001, 2],
      [-8e-5, 2],
      [-0.00032, 0],
      [-3e-5, 2],
      [-0.00022, 0],
      [-5e-5, 2],
      [0.00047, 1],
      [-0.00028, 0]
    ],
    "red_o_points": [],
    "y_categories": ["N", "NOT APPLICABLE", "nan"],
    "blue_o_points": [],
    "blue_x_points": [
      [0.00076, 1],
      [-7e-5, 2],
      [0.00066, 1],
      [-3e-5, 0],
      [-1e-5, 2],
      [0.00047, 1],
      [0.00049, 1]
    ]
  },
  "QA_lstPexMuscstrength[WristFlex]": {
    "red_x_points": [
      [-0.00343, 1],
      [-0.00038, 2],
      [-0.00125, 1],
      [-0.00089, 1],
      [0.00039, 0],
      [0.00073, 0],
      [-0.0015, 1],
      [-0.00218, 0],
      [0.00057, 0],
      [0.0003, 0],
      [0.00049, 0],
      [-0.00157, 0],
      [-0.00071, 2],
      [0.00186, 2],
      [-0.00019, 2],
      [-0.0014, 0],
      [-0.00017, 2],
      [0.00027, 0],
      [-0.00123, 0],
      [-0.00291, 1],
      [-0.00184, 0],
      [-0.00137, 1],
      [0.00123, 2],
      [-0.0088, 1],
      [-0.00222, 0],
      [0.0003, 0],
      [-0.00325, 1],
      [0.00028, 0],
      [0.00204, 2],
      [-9e-5, 2],
      [-0.00103, 1]
    ],
    "red_o_points": [],
    "y_categories": ["GREATER THAN OR EQUALS TO 3", "LESS THAN 3", "nan"],
    "blue_o_points": [],
    "blue_x_points": [
      [0.00057, 0],
      [0.00384, 2],
      [0.00141, 0],
      [0.00287, 0],
      [0.00553, 2],
      [0.00134, 0],
      [0.00136, 0]
    ]
  },
  "QS_mulNeuromadSite[C5]": {
    "red_x_points": [
      [-0.0009, 2],
      [-0.00321, 0],
      [-0.00387, 0],
      [-0.00292, 0],
      [-0.00317, 0],
      [-0.00338, 0],
      [-0.00329, 0],
      [-0.00104, 2],
      [-0.00347, 0],
      [-0.00311, 0],
      [-0.00319, 0],
      [-0.00101, 2],
      [0.0036, 1],
      [-0.00105, 2],
      [-0.00304, 0],
      [-0.0013, 2],
      [-0.00309, 0],
      [-0.00335, 0],
      [-0.00088, 2],
      [-0.00089, 2],
      [-0.00095, 2],
      [-0.00274, 0],
      [-0.00114, 2],
      [-0.0011, 2],
      [-0.00098, 2],
      [-0.00309, 0],
      [-0.00078, 2],
      [-0.00295, 0],
      [-0.00087, 2],
      [0.00588, 1],
      [-0.00292, 0]
    ],
    "red_o_points": [],
    "y_categories": ["N", "NOT APPLICABLE", "nan"],
    "blue_o_points": [],
    "blue_x_points": [
      [0.01269, 1],
      [0.00038, 2],
      [0.00681, 1],
      [0.00035, 0],
      [4e-5, 2],
      [0.00691, 1],
      [0.00879, 1]
    ]
  },
  "QS_mulNeuromadSite[C7]": {
    "red_x_points": [
      [-0.00103, 2],
      [-0.0026, 0],
      [-0.00318, 0],
      [-0.00275, 0],
      [-0.00254, 0],
      [-0.00277, 0],
      [-0.0029, 0],
      [-0.00119, 2],
      [-0.00282, 0],
      [-0.00277, 0],
      [-0.00248, 0],
      [-0.00098, 2],
      [0.00486, 1],
      [-0.00144, 2],
      [-0.00247, 0],
      [-0.00157, 2],
      [-0.00278, 0],
      [-0.00247, 0],
      [-0.00101, 2],
      [-0.001, 2],
      [-0.00071, 2],
      [-0.00258, 0],
      [-0.00151, 2],
      [-0.0009, 2],
      [-0.00118, 2],
      [-0.00255, 0],
      [-0.00102, 2],
      [-0.00232, 0],
      [-0.00066, 2],
      [0.00513, 1],
      [-0.00241, 0]
    ],
    "red_o_points": [],
    "y_categories": ["N", "NOT APPLICABLE", "nan"],
    "blue_o_points": [],
    "blue_x_points": [
      [0.00954, 1],
      [-0.00012, 2],
      [0.00702, 1],
      [-0.00025, 0],
      [-4e-5, 2],
      [0.00622, 1],
      [0.00606, 1]
    ]
  },
  "QA_lstPexMuscstrength[WristExte]": {
    "red_x_points": [
      [-0.00325, 1],
      [-0.00063, 2],
      [-0.00146, 1],
      [-0.00146, 1],
      [0.00077, 0],
      [-0.00172, 1],
      [-0.00208, 1],
      [-0.00226, 0],
      [0.00126, 0],
      [0.00044, 0],
      [-0.00182, 1],
      [-0.00185, 0],
      [-0.00254, 2],
      [0.00207, 2],
      [-0.00029, 2],
      [-0.00125, 0],
      [-0.00045, 2],
      [0.00065, 0],
      [-0.00113, 0],
      [-0.00304, 1],
      [-0.00197, 0],
      [-0.00174, 1],
      [0.00206, 2],
      [-0.00154, 0],
      [-0.00387, 1],
      [0.00074, 0],
      [-0.00313, 1],
      [0.00056, 0],
      [0.00225, 2],
      [-0.00253, 2],
      [-0.00099, 1]
    ],
    "red_o_points": [],
    "y_categories": ["GREATER THAN OR EQUALS TO 3", "LESS THAN 3", "nan"],
    "blue_o_points": [],
    "blue_x_points": [
      [0.00166, 0],
      [0.00492, 2],
      [0.00141, 0],
      [0.0036, 0],
      [0.00446, 2],
      [0.00096, 1],
      [0.00111, 0]
    ]
  },
  "QA_lstPexMuscstrength[ElbowExte]": {
    "red_x_points": [
      [-0.00319, 1],
      [-0.00026, 2],
      [5e-5, 1],
      [-0.0, 1],
      [-0.00129, 0],
      [0.0002, 1],
      [1e-5, 1],
      [-0.00325, 1],
      [-0.00072, 0],
      [-0.00033, 0],
      [2e-5, 1],
      [-0.00235, 1],
      [0.00276, 2],
      [-0.00025, 2],
      [-0.00271, 1],
      [-6e-5, 2],
      [8e-5, 1],
      [-0.00222, 0],
      [-0.00246, 1],
      [-0.00329, 0],
      [2e-5, 1],
      [0.00277, 2],
      [-0.00239, 0],
      [-0.00296, 0],
      [0.00027, 1],
      [-0.00185, 1],
      [-0.00024, 2],
      [-0.00275, 1],
      [-0.00012, 2],
      [5e-5, 1]
    ],
    "red_o_points": [],
    "y_categories": ["GREATER THAN OR EQUALS TO 3", "LESS THAN 3", "nan"],
    "blue_o_points": [],
    "blue_x_points": [
      [0.0002, 2],
      [0.00737, 2],
      [3e-5, 0],
      [0.00142, 1],
      [0.00612, 2],
      [0.00032, 0],
      [0.00014, 0]
    ]
  },
  "QS_mulGraftNerve[SS]": {
    "red_x_points": [
      [-3e-5, 2],
      [-6e-5, 0],
      [-0.0002, 0],
      [-8e-5, 0],
      [-8e-5, 0],
      [-0.00015, 0],
      [-6e-5, 0],
      [-0.0, 2],
      [-8e-5, 0],
      [-8e-5, 0],
      [-6e-5, 0],
      [-3e-5, 2],
      [-0.00013, 1],
      [-3e-5, 2],
      [-8e-5, 0],
      [-5e-5, 0],
      [-6e-5, 0],
      [-2e-5, 2],
      [-3e-5, 2],
      [-0.0, 2],
      [-2e-5, 2],
      [-0.0, 2],
      [-2e-5, 2],
      [-2e-5, 0],
      [-3e-5, 2],
      [-1e-5, 0],
      [0.00011, 1],
      [-5e-5, 0]
    ],
    "red_o_points": [],
    "y_categories": ["N", "NOT APPLICABLE", "nan"],
    "blue_o_points": [],
    "blue_x_points": [
      [0.00037, 1],
      [0.0, 2],
      [0.00019, 1],
      [7e-5, 0],
      [-0.0, 2],
      [0.00011, 1],
      [0.00019, 1]
    ]
  },
  "QS_mulGraftNerve[MCF]": {
    "red_x_points": [
      [-2e-5, 2],
      [-6e-5, 0],
      [-7e-5, 0],
      [-6e-5, 0],
      [-5e-5, 0],
      [-6e-5, 0],
      [-7e-5, 0],
      [-1e-5, 2],
      [-7e-5, 0],
      [-6e-5, 0],
      [-1e-5, 0],
      [-2e-5, 2],
      [-1e-5, 1],
      [0.0, 2],
      [-9e-5, 0],
      [-1e-5, 2],
      [-5e-5, 0],
      [-6e-5, 0],
      [-1e-5, 2],
      [-1e-5, 2],
      [-6e-5, 0],
      [-1e-5, 2],
      [-1e-5, 2],
      [-2e-5, 2],
      [-7e-5, 0],
      [-2e-5, 2],
      [-7e-5, 0],
      [-1e-5, 2],
      [0.0001, 1],
      [-2e-5, 0]
    ],
    "red_o_points": [],
    "y_categories": ["N", "NOT APPLICABLE", "nan"],
    "blue_o_points": [],
    "blue_x_points": [
      [0.00018, 1],
      [0.00012, 2],
      [0.00011, 1],
      [0.0, 2],
      [0.00011, 1],
      [0.0003, 1]
    ]
  },
  "QS_mulNeuromadSite[C6]": {
    "red_x_points": [
      [-0.00063, 2],
      [-0.00215, 0],
      [-0.00242, 0],
      [-0.00214, 0],
      [-0.0028, 0],
      [-0.00253, 0],
      [-0.00256, 0],
      [-0.00075, 2],
      [-0.00228, 0],
      [-0.00221, 0],
      [-0.00215, 0],
      [-0.0008, 2],
      [0.00414, 1],
      [-0.00069, 2],
      [-0.00229, 0],
      [-0.00086, 2],
      [-0.00209, 0],
      [-0.00248, 0],
      [-0.00087, 2],
      [-0.00076, 2],
      [-0.00078, 2],
      [-0.00227, 0],
      [-0.00064, 2],
      [-0.00093, 2],
      [-0.00077, 2],
      [-0.00254, 0],
      [-0.00062, 2],
      [-0.00255, 0],
      [-0.00046, 2],
      [0.00442, 1],
      [-0.00206, 0]
    ],
    "red_o_points": [],
    "y_categories": ["N", "NOT APPLICABLE", "nan"],
    "blue_o_points": [],
    "blue_x_points": [
      [0.00755, 1],
      [-2e-5, 2],
      [0.00584, 1],
      [-4e-5, 0],
      [-2e-5, 2],
      [0.00454, 1],
      [0.0068, 1]
    ]
  },
  "QS_mulLysisSite[Nerve]": {
    "red_x_points": [
      [-0.00023, 3],
      [-0.00043, 0],
      [-0.00102, 2],
      [-0.00035, 0],
      [-0.00027, 0],
      [-0.00032, 0],
      [-0.00032, 0],
      [-0.00029, 3],
      [-0.00046, 0],
      [-0.00038, 0],
      [-0.00044, 0],
      [-0.00028, 3],
      [0.00151, 1],
      [-0.00033, 3],
      [-0.0004, 0],
      [-0.00037, 3],
      [-0.0003, 0],
      [-0.00036, 0],
      [-0.00024, 3],
      [-0.00024, 3],
      [-0.00024, 3],
      [-0.00039, 0],
      [-0.00025, 3],
      [-0.00024, 3],
      [-0.00038, 3],
      [-0.00029, 0],
      [-0.00025, 3],
      [-0.00038, 0],
      [-0.00028, 3],
      [0.00114, 1],
      [-0.0004, 0]
    ],
    "red_o_points": [],
    "y_categories": ["N", "NOT APPLICABLE", "Y", "nan"],
    "blue_o_points": [],
    "blue_x_points": [
      [0.00154, 1],
      [-0.00012, 3],
      [0.00116, 1],
      [-0.00043, 0],
      [-0.00013, 3],
      [0.00138, 1],
      [0.00123, 1]
    ]
  },
  "QS_mulGraftNerve[TD]": {
    "red_x_points": [
      [-1e-5, 2],
      [-5e-5, 0],
      [-5e-5, 0],
      [-5e-5, 0],
      [-5e-5, 0],
      [-1e-5, 0],
      [-1e-5, 2],
      [-5e-5, 0],
      [-5e-5, 0],
      [-1e-5, 2],
      [-1e-5, 2],
      [-5e-5, 0],
      [-0.00011, 2],
      [-5e-5, 0],
      [-1e-5, 2],
      [-1e-5, 2],
      [-5e-5, 0],
      [-1e-5, 2],
      [-1e-5, 2],
      [-5e-5, 0],
      [-1e-5, 2],
      [-5e-5, 0],
      [-1e-5, 2],
      [-1e-5, 1],
      [-5e-5, 0]
    ],
    "red_o_points": [],
    "y_categories": ["N", "NOT APPLICABLE", "nan"],
    "blue_o_points": [],
    "blue_x_points": [
      [0.00014, 1],
      [-1e-5, 2],
      [4e-5, 0],
      [-1e-5, 2],
      [0.00015, 1],
      [0.00015, 1]
    ]
  },
  "QS_mulLysisRoot[C7]": {
    "red_x_points": [
      [-0.00047, 3],
      [-0.00057, 0],
      [-0.00153, 2],
      [-0.00063, 0],
      [-0.00064, 0],
      [-0.00067, 0],
      [-0.00067, 0],
      [-0.00037, 3],
      [-0.00074, 0],
      [-0.00069, 0],
      [-0.00048, 0],
      [-0.00039, 3],
      [0.0019, 1],
      [-0.00025, 3],
      [-0.00067, 0],
      [-0.00038, 3],
      [-0.00064, 0],
      [-0.00057, 0],
      [-0.00044, 3],
      [-0.00032, 3],
      [-0.00038, 3],
      [-0.00072, 0],
      [-0.00035, 3],
      [-0.00037, 3],
      [-0.00043, 3],
      [-0.00067, 0],
      [-0.0003, 3],
      [-0.00058, 0],
      [-0.0004, 3],
      [0.00199, 1],
      [-0.00068, 0]
    ],
    "red_o_points": [],
    "y_categories": ["N", "NOT APPLICABLE", "Y", "nan"],
    "blue_o_points": [],
    "blue_x_points": [
      [0.00244, 1],
      [-0.00017, 3],
      [0.00201, 1],
      [-0.0008, 0],
      [-9e-5, 3],
      [0.00201, 1],
      [0.00236, 1]
    ]
  },
  "QS_mulTransfSite[IMc]": {
    "red_x_points": [
      [-0.00267, 3],
      [-0.00822, 2],
      [-0.00478, 0],
      [-0.00434, 0],
      [-0.0048, 0],
      [-0.00451, 0],
      [-0.00463, 0],
      [-0.00245, 3],
      [-0.00474, 0],
      [-0.00437, 0],
      [-0.00424, 0],
      [-0.00277, 3],
      [0.01303, 1],
      [-0.00274, 3],
      [-0.00477, 0],
      [-0.00284, 3],
      [-0.00842, 2],
      [-0.00442, 0],
      [-0.00294, 3],
      [-0.00236, 3],
      [-0.00245, 3],
      [-0.00472, 0],
      [-0.00272, 3],
      [-0.00262, 3],
      [-0.00273, 3],
      [-0.00435, 0],
      [-0.00269, 3],
      [-0.00808, 2],
      [-0.0024, 3],
      [0.01377, 1],
      [-0.00793, 2]
    ],
    "red_o_points": [],
    "y_categories": ["N", "NOT APPLICABLE", "Y", "nan"],
    "blue_o_points": [],
    "blue_x_points": [
      [0.02141, 1],
      [-0.00093, 3],
      [0.01476, 1],
      [-0.00222, 0],
      [-0.00064, 3],
      [0.01494, 1],
      [0.01546, 1]
    ]
  },
  "QA_lstPexTouch[T1]": {
    "red_x_points": [
      [-0.0014, 1],
      [-0.00017, 2],
      [0.00047, 1],
      [-0.00037, 2],
      [-0.00176, 0],
      [0.00034, 1],
      [0.0006, 1],
      [-0.00182, 1],
      [-0.00195, 0],
      [-0.0009, 0],
      [-0.00165, 0],
      [-0.00228, 0],
      [-0.01, 2],
      [0.00219, 2],
      [-0.00031, 2],
      [-0.00117, 1],
      [2e-5, 2],
      [0.00093, 1],
      [-0.00245, 0],
      [-0.00175, 1],
      [-0.00226, 0],
      [-0.00034, 2],
      [0.00228, 2],
      [-0.00171, 1],
      [-0.00297, 0],
      [0.00061, 1],
      [-0.00309, 0],
      [-0.00035, 2],
      [-0.00281, 0],
      [0.00076, 1],
      [0.00018, 1]
    ],
    "red_o_points": [],
    "y_categories": ["NORM", "NPV", "nan"],
    "blue_o_points": [],
    "blue_x_points": [
      [0.00095, 1],
      [0.00519, 2],
      [0.00084, 1],
      [0.00218, 1],
      [0.00503, 2],
      [0.00094, 1],
      [0.00524, 0]
    ]
  },
  "QS_mulTransfSite[AcMc]": {
    "red_x_points": [
      [-0.00028, 3],
      [-0.00071, 0],
      [-0.00061, 0],
      [-0.00078, 0],
      [-0.00075, 0],
      [-0.00051, 0],
      [-0.00066, 0],
      [-0.00052, 3],
      [-0.00061, 0],
      [-0.00067, 0],
      [-0.00242, 2],
      [-0.00042, 3],
      [0.00221, 1],
      [-0.00041, 3],
      [-0.00064, 0],
      [-0.00055, 3],
      [-0.00069, 0],
      [-0.00057, 0],
      [-0.00045, 3],
      [-0.00039, 3],
      [-0.00033, 3],
      [-0.00072, 0],
      [-0.00035, 3],
      [-0.00031, 3],
      [-0.00046, 3],
      [-0.00064, 0],
      [-0.00037, 3],
      [-0.00082, 0],
      [-0.00034, 3],
      [0.00218, 1],
      [-0.00063, 0]
    ],
    "red_o_points": [],
    "y_categories": ["N", "NOT APPLICABLE", "Y", "nan"],
    "blue_o_points": [],
    "blue_x_points": [
      [0.00238, 1],
      [-0.00022, 3],
      [0.00261, 1],
      [-0.00022, 0],
      [-0.00019, 3],
      [0.00181, 1],
      [0.00294, 1]
    ]
  },
  "QS_mulTransfSite[Other]": {
    "red_x_points": [
      [-0.00038, 3],
      [-0.00064, 0],
      [-0.00077, 0],
      [-0.00064, 0],
      [-0.00051, 0],
      [-0.00058, 0],
      [-0.00066, 0],
      [-0.00039, 3],
      [-0.00046, 0],
      [-0.00062, 0],
      [-0.00057, 0],
      [-0.00046, 3],
      [0.00187, 1],
      [-0.00036, 3],
      [-0.0008, 0],
      [-0.00064, 3],
      [-0.00057, 0],
      [-0.00287, 2],
      [-0.00056, 3],
      [-0.00038, 3],
      [-0.00043, 3],
      [-0.00066, 0],
      [-0.00032, 3],
      [-0.00046, 3],
      [-0.00046, 3],
      [-0.00062, 0],
      [-0.00038, 3],
      [-0.00074, 0],
      [-0.00049, 3],
      [0.00163, 1],
      [-0.00052, 0]
    ],
    "red_o_points": [],
    "y_categories": ["N", "NOT APPLICABLE", "Y", "nan"],
    "blue_o_points": [],
    "blue_x_points": [
      [0.0029, 1],
      [-3e-5, 3],
      [0.00263, 1],
      [-0.00014, 0],
      [3e-5, 3],
      [0.00216, 1],
      [0.0022, 1]
    ]
  },
  "QA_yonInjBpsurg": {
    "red_x_points": [
      [-0.00388, 1],
      [-0.00325, 1],
      [-0.00452, 1],
      [-0.00357, 1],
      [-0.00384, 1],
      [-0.00411, 1],
      [-0.00333, 1],
      [-0.00381, 1],
      [-0.00385, 1],
      [-0.00374, 1],
      [-0.00361, 1],
      [-0.0039, 1],
      [0.00845, 0],
      [-0.00363, 1],
      [-0.00336, 1],
      [-0.00397, 1],
      [-0.00326, 1],
      [-0.00427, 1],
      [-0.00369, 1],
      [-0.00351, 1],
      [-0.00297, 1],
      [-0.00284, 1],
      [-0.0037, 1],
      [-0.00367, 1],
      [-0.00402, 1],
      [-0.00345, 1],
      [-0.00349, 1],
      [-0.00388, 1],
      [-0.00337, 1],
      [0.01003, 0],
      [-0.00314, 1]
    ],
    "red_o_points": [],
    "y_categories": ["N", "Y", "nan"],
    "blue_o_points": [],
    "blue_x_points": [
      [0.02033, 0],
      [-0.00064, 1],
      [0.01217, 0],
      [-0.00267, 1],
      [-0.00085, 1],
      [0.01214, 0],
      [0.01291, 0]
    ]
  },
  "QA_equInjTbpiAge": {
    "red_x_points": [
      [-0.00083, 1],
      [-0.00025, 1],
      [0.00017, 1],
      [-7e-5, 0],
      [-0.00146, 0],
      [8e-5, 1],
      [0.0001, 1],
      [0.00065, 0],
      [-0.00098, 0],
      [-0.00018, 0],
      [0.00011, 1],
      [0.00064, 0],
      [-0.01595, 1],
      [-0.00124, 1],
      [-0.00026, 1],
      [-0.00109, 1],
      [-0.00062, 0],
      [-0.00203, 0],
      [-0.00113, 1],
      [0.00081, 0],
      [-0.00081, 1],
      [-4e-5, 1],
      [-0.0011, 1],
      [-0.00339, 1],
      [0.00055, 0],
      [0.00026, 1],
      [-0.002, 1],
      [1e-5, 1],
      [-0.00113, 1],
      [-0.01342, 1],
      [-7e-5, 0]
    ],
    "red_o_points": [],
    "y_categories": ["GREATER THAN OR EQUALS TO 30", "LESS THAN 30", "nan"],
    "blue_o_points": [],
    "blue_x_points": [
      [-0.00452, 1],
      [-0.00144, 1],
      [0.00701, 0],
      [0.00151, 1],
      [0.00671, 0],
      [0.00932, 0],
      [0.00869, 0]
    ]
  },
  "QS_mulLysisNerve[Ssr]": {
    "red_x_points": [
      [-0.00022, 3],
      [-0.00039, 0],
      [-0.00129, 2],
      [-0.00039, 0],
      [-0.00051, 0],
      [-0.00042, 0],
      [-0.00036, 0],
      [-0.00023, 3],
      [-0.00039, 0],
      [-0.00042, 0],
      [-0.00042, 0],
      [-0.00018, 3],
      [0.00176, 1],
      [-0.00032, 3],
      [-0.00044, 0],
      [-0.00033, 3],
      [-0.00044, 0],
      [-0.00042, 0],
      [-0.00028, 3],
      [-0.00022, 3],
      [-0.00025, 3],
      [-0.00041, 0],
      [-0.00033, 3],
      [-0.00028, 3],
      [-0.00015, 3],
      [-0.00045, 0],
      [-0.00021, 3],
      [-0.00043, 0],
      [-0.00025, 3],
      [0.00106, 1],
      [-0.00038, 0]
    ],
    "red_o_points": [],
    "y_categories": ["N", "NOT APPLICABLE", "Y", "nan"],
    "blue_o_points": [],
    "blue_x_points": [
      [0.0017, 1],
      [-0.0001, 3],
      [0.00135, 1],
      [-0.00042, 0],
      [-4e-5, 3],
      [0.0008, 1],
      [0.00138, 1]
    ]
  },
  "QS_mulBpsurgeryType[Graft]": {
    "red_x_points": [
      [-0.00028, 3],
      [-0.00015, 0],
      [-0.00015, 0],
      [-9e-5, 0],
      [-0.00016, 0],
      [-0.0002, 0],
      [-0.00016, 0],
      [-0.00025, 3],
      [-0.0002, 0],
      [-0.0002, 0],
      [-0.00016, 0],
      [-7e-5, 3],
      [0.00036, 1],
      [-4e-5, 3],
      [-0.00165, 2],
      [-7e-5, 3],
      [-5e-5, 0],
      [-0.00013, 0],
      [-0.00012, 3],
      [-0.00017, 3],
      [-0.00019, 3],
      [-0.00018, 0],
      [-5e-5, 3],
      [-0.00012, 3],
      [-0.00018, 3],
      [-0.00013, 0],
      [-0.0002, 3],
      [-0.00018, 0],
      [-0.00023, 3],
      [0.00056, 1],
      [-0.00022, 0]
    ],
    "red_o_points": [],
    "y_categories": ["N", "NOT APPLICABLE", "Y", "nan"],
    "blue_o_points": [],
    "blue_x_points": [
      [0.00075, 1],
      [-4e-5, 3],
      [0.0009, 1],
      [0.00059, 0],
      [4e-5, 3],
      [0.0005, 1],
      [0.00063, 1]
    ]
  },
  "QS_mulLysisRoot[C5]": {
    "red_x_points": [
      [-0.00139, 3],
      [-0.00187, 0],
      [-0.00353, 2],
      [-0.0022, 0],
      [-0.00233, 0],
      [-0.0021, 0],
      [-0.00192, 0],
      [-0.00119, 3],
      [-0.00202, 0],
      [-0.00203, 0],
      [-0.00176, 0],
      [-0.00127, 3],
      [0.00453, 1],
      [-0.00112, 3],
      [-0.00212, 0],
      [-0.0013, 3],
      [-0.00183, 0],
      [-0.00192, 0],
      [-0.00113, 3],
      [-0.00126, 3],
      [-0.00114, 3],
      [-0.00202, 0],
      [-0.00108, 3],
      [-0.00122, 3],
      [-0.00122, 3],
      [-0.00195, 0],
      [-0.00124, 3],
      [-0.00205, 0],
      [-0.00104, 3],
      [0.00535, 1],
      [-0.00327, 2]
    ],
    "red_o_points": [],
    "y_categories": ["N", "NOT APPLICABLE", "Y", "nan"],
    "blue_o_points": [],
    "blue_x_points": [
      [0.00917, 1],
      [-0.00014, 3],
      [0.0061, 1],
      [-0.00138, 0],
      [-0.00052, 3],
      [0.00673, 1],
      [0.00725, 1]
    ]
  },
  "QS_mulLysisSite[Root]": {
    "red_x_points": [
      [-0.00052, 3],
      [-0.00094, 0],
      [-0.00214, 2],
      [-0.00105, 0],
      [-0.00079, 0],
      [-0.00103, 0],
      [-0.00103, 0],
      [-0.00048, 3],
      [-0.00115, 0],
      [-0.00112, 0],
      [-0.00089, 0],
      [-0.00058, 3],
      [0.00291, 1],
      [-0.00046, 3],
      [-0.00092, 0],
      [-0.00045, 3],
      [-0.0012, 0],
      [-0.00106, 0],
      [-0.00057, 3],
      [-0.00065, 3],
      [-0.00053, 3],
      [-0.00107, 0],
      [-0.00067, 3],
      [-0.00055, 3],
      [-0.00054, 3],
      [-0.00115, 0],
      [-0.00058, 3],
      [-0.0011, 0],
      [-0.00056, 3],
      [0.00379, 1],
      [-0.00238, 2]
    ],
    "red_o_points": [],
    "y_categories": ["N", "NOT APPLICABLE", "Y", "nan"],
    "blue_o_points": [],
    "blue_x_points": [
      [0.00368, 1],
      [-0.00029, 3],
      [0.00379, 1],
      [-0.00124, 0],
      [-0.00028, 3],
      [0.00332, 1],
      [0.00402, 1]
    ]
  },
  "QS_mulBpsurgeryType[Lysis]": {
    "red_x_points": [
      [-0.00308, 3],
      [-0.00561, 0],
      [-0.00862, 2],
      [-0.00528, 0],
      [-0.00562, 0],
      [-0.00907, 2],
      [-0.00556, 0],
      [-0.00301, 3],
      [-0.00563, 0],
      [-0.00548, 0],
      [-0.00531, 0],
      [-0.00335, 3],
      [0.01252, 1],
      [-0.00254, 3],
      [-0.00532, 0],
      [-0.00313, 3],
      [-0.00895, 2],
      [-0.00532, 0],
      [-0.00299, 3],
      [-0.00264, 3],
      [-0.0031, 3],
      [-0.00534, 0],
      [-0.00272, 3],
      [-0.003, 3],
      [-0.00301, 3],
      [-0.0049, 0],
      [-0.003, 3],
      [-0.00512, 0],
      [-0.00257, 3],
      [0.01531, 1],
      [-0.00782, 2]
    ],
    "red_o_points": [],
    "y_categories": ["N", "NOT APPLICABLE", "Y", "nan"],
    "blue_o_points": [],
    "blue_x_points": [
      [0.02112, 1],
      [-0.00059, 3],
      [0.01669, 1],
      [-0.00202, 0],
      [-0.00093, 3],
      [0.01632, 1],
      [0.01901, 1]
    ]
  },
  "QS_mulGraftNerve[LT]": {
    "red_x_points": [
      [-5e-5, 2],
      [-9e-5, 0],
      [-9e-5, 0],
      [-9e-5, 0],
      [-1e-5, 0],
      [-8e-5, 0],
      [-1e-5, 0],
      [-8e-5, 0],
      [-6e-5, 0],
      [-8e-5, 0],
      [-3e-5, 2],
      [0.00018, 1],
      [-4e-5, 2],
      [-0.00015, 0],
      [0.0, 2],
      [-3e-5, 0],
      [-9e-5, 0],
      [-5e-5, 2],
      [-1e-5, 2],
      [-8e-5, 0],
      [-2e-5, 2],
      [-4e-5, 2],
      [-5e-5, 2],
      [-9e-5, 0],
      [-5e-5, 2],
      [-9e-5, 0],
      [-4e-5, 2],
      [0.00018, 1],
      [-6e-5, 0]
    ],
    "red_o_points": [],
    "y_categories": ["N", "NOT APPLICABLE", "nan"],
    "blue_o_points": [],
    "blue_x_points": [
      [0.00037, 1],
      [3e-5, 2],
      [-3e-5, 0],
      [-4e-5, 2],
      [0.00019, 1],
      [0.0001, 1]
    ]
  },
  "QA_lstPexMuscstrength[ShoulderAbduc]": {
    "red_x_points": [
      [-0.0067, 1],
      [-0.00637, 1],
      [-0.00702, 1],
      [-0.00686, 1],
      [-0.00709, 1],
      [-0.00695, 1],
      [-0.00731, 1],
      [-0.00628, 1],
      [-0.00682, 1],
      [-0.00623, 1],
      [-0.00627, 1],
      [-0.00645, 1],
      [0.00555, 2],
      [0.00613, 2],
      [0.00588, 2],
      [0.0055, 2],
      [0.00531, 2],
      [-0.00709, 1],
      [-0.00685, 1],
      [-0.00608, 1],
      [-0.00663, 1],
      [-0.00643, 1],
      [0.0057, 2],
      [-0.00781, 1],
      [-0.00703, 1],
      [-0.00633, 1],
      [-0.00692, 1],
      [-0.00645, 1],
      [-0.0064, 1],
      [0.00435, 2],
      [-0.00604, 1]
    ],
    "red_o_points": [],
    "y_categories": ["GREATER THAN OR EQUALS TO 3", "LESS THAN 3", "nan"],
    "blue_o_points": [],
    "blue_x_points": [
      [0.00506, 2],
      [0.00599, 2],
      [0.02628, 0],
      [0.00717, 2],
      [0.00607, 2],
      [0.02712, 0],
      [-0.00199, 1]
    ]
  },
  "QS_mulNeuromadSite[C4]": {
    "red_x_points": [
      [-0.00057, 2],
      [-0.00186, 0],
      [-0.00195, 0],
      [-0.00199, 0],
      [-0.00204, 0],
      [-0.00216, 0],
      [-0.00176, 0],
      [-0.0006, 2],
      [-0.002, 0],
      [-0.00189, 0],
      [-0.00174, 0],
      [-0.00089, 2],
      [0.00205, 1],
      [-0.00042, 2],
      [-0.00216, 0],
      [-0.00082, 2],
      [-0.00184, 0],
      [-0.00205, 0],
      [-0.00068, 2],
      [-0.00046, 2],
      [-0.00093, 2],
      [-0.00178, 0],
      [-0.00061, 2],
      [-0.00078, 2],
      [-0.00077, 2],
      [-0.00213, 0],
      [-0.00067, 2],
      [-0.00209, 0],
      [-0.00046, 2],
      [0.00355, 1],
      [-0.00214, 0]
    ],
    "red_o_points": [],
    "y_categories": ["N", "NOT APPLICABLE", "nan"],
    "blue_o_points": [],
    "blue_x_points": [
      [0.007, 1],
      [0.00014, 2],
      [0.00464, 1],
      [0.00042, 0],
      [0.0, 2],
      [0.00465, 1],
      [0.00499, 1]
    ]
  },
  "QS_lstBpsurgSide": {
    "red_x_points": [
      [-0.004, 3],
      [-0.006, 0],
      [-0.00621, 0],
      [-0.00627, 0],
      [-0.01285, 2],
      [-0.00548, 0],
      [-0.00668, 0],
      [-0.00397, 3],
      [-0.00562, 0],
      [-0.01196, 2],
      [-0.01299, 2],
      [-0.00459, 3],
      [0.02026, 1],
      [-0.00381, 3],
      [-0.01456, 2],
      [-0.00445, 3],
      [-0.01347, 2],
      [-0.01407, 2],
      [-0.00382, 3],
      [-0.00399, 3],
      [-0.00368, 3],
      [-0.00564, 0],
      [-0.0043, 3],
      [-0.00426, 3],
      [-0.00423, 3],
      [-0.0127, 2],
      [-0.00443, 3],
      [-0.01296, 2],
      [-0.00359, 3],
      [0.02201, 1],
      [-0.00617, 0]
    ],
    "red_o_points": [],
    "y_categories": ["L", "NOT APPLICABLE", "R", "nan"],
    "blue_o_points": [],
    "blue_x_points": [
      [0.03363, 1],
      [-0.00102, 3],
      [0.02452, 1],
      [0.00183, 0],
      [-0.00129, 3],
      [0.024, 1],
      [0.02419, 1]
    ]
  },
  "QS_mulGraftNerve[IS]": {
    "red_x_points": [
      [-8e-5, 2],
      [-0.0003, 0],
      [-0.00026, 0],
      [-0.00034, 0],
      [-0.00042, 0],
      [-0.00015, 0],
      [-0.00026, 0],
      [-9e-5, 2],
      [-0.00026, 0],
      [-0.00026, 0],
      [-0.00024, 0],
      [-0.00011, 2],
      [0.00039, 1],
      [-5e-5, 2],
      [-0.00015, 0],
      [-0.00011, 2],
      [-0.00019, 0],
      [-0.00039, 0],
      [-0.00012, 2],
      [-0.00011, 2],
      [-7e-5, 2],
      [-0.00028, 0],
      [-0.00012, 2],
      [-9e-5, 2],
      [-6e-5, 2],
      [-0.00026, 0],
      [-0.0001, 2],
      [-0.00035, 0],
      [-8e-5, 2],
      [0.00075, 1],
      [-0.00026, 0]
    ],
    "red_o_points": [],
    "y_categories": ["N", "NOT APPLICABLE", "nan"],
    "blue_o_points": [],
    "blue_x_points": [
      [0.00112, 1],
      [-2e-5, 2],
      [0.00037, 1],
      [-5e-5, 2],
      [0.0007, 1],
      [0.00065, 1]
    ]
  },
  "QS_mulGraftNerve[MC]": {
    "red_x_points": [
      [-8e-5, 2],
      [-0.00019, 0],
      [-0.00012, 0],
      [-8e-5, 0],
      [-0.00014, 0],
      [-0.00017, 0],
      [-9e-5, 0],
      [-1e-5, 2],
      [-0.00011, 0],
      [-0.00012, 0],
      [-0.0001, 0],
      [0.0, 2],
      [-8e-5, 1],
      [1e-5, 2],
      [-0.00018, 0],
      [-0.00015, 2],
      [-7e-5, 0],
      [-4e-5, 0],
      [-3e-5, 2],
      [-9e-5, 2],
      [-2e-5, 2],
      [-8e-5, 0],
      [-3e-5, 2],
      [-8e-5, 2],
      [-3e-5, 2],
      [-0.00011, 0],
      [1e-5, 2],
      [-7e-5, 0],
      [1e-5, 2],
      [-0.0001, 1],
      [-9e-5, 0]
    ],
    "red_o_points": [],
    "y_categories": ["N", "NOT APPLICABLE", "nan"],
    "blue_o_points": [],
    "blue_x_points": [
      [0.00086, 1],
      [0.00014, 2],
      [0.00024, 1],
      [0.00015, 0],
      [0.00017, 2],
      [0.00021, 1],
      [7e-5, 1]
    ]
  },
  "QA_yonPreOrtsurg": {
    "red_x_points": [
      [-0.00459, 0],
      [-0.00039, 2],
      [-2e-5, 0],
      [-0.0002, 0],
      [-0.00015, 0],
      [-8e-5, 0],
      [-6e-5, 0],
      [-0.00072, 2],
      [-0.00011, 0],
      [-0.0001, 0],
      [-0.00014, 2],
      [0.0067, 1],
      [-0.00119, 0],
      [-0.00121, 2],
      [-0.00034, 0],
      [-0.00566, 0],
      [-5e-5, 1],
      [1e-5, 0],
      [-0.00464, 0],
      [-0.00433, 0],
      [-0.00507, 0],
      [-0.00013, 0],
      [-0.00511, 0],
      [-0.00679, 0],
      [-0.00478, 0],
      [-0.00043, 2],
      [-0.00086, 2],
      [-0.0001, 0],
      [-0.00071, 2],
      [-0.00052, 2],
      [-0.00014, 1]
    ],
    "red_o_points": [],
    "y_categories": ["N", "Y", "nan"],
    "blue_o_points": [],
    "blue_x_points": [
      [7e-5, 0],
      [0.00283, 2],
      [-0.00016, 0],
      [0.00016, 0],
      [0.0205, 1],
      [-0.00011, 0],
      [-8e-5, 0]
    ]
  },
  "QS_mulGraftNerve[Ra]": {
    "red_x_points": [
      [-7e-5, 2],
      [-0.00019, 0],
      [-0.00038, 0],
      [-0.00015, 0],
      [-0.00028, 0],
      [-0.00013, 0],
      [-0.00014, 0],
      [-0.00012, 2],
      [-0.00015, 0],
      [-0.0002, 0],
      [-0.00018, 0],
      [-0.00013, 2],
      [0.00025, 1],
      [-5e-5, 2],
      [-0.00024, 0],
      [-0.00014, 2],
      [-0.00017, 0],
      [-0.00034, 0],
      [-0.00014, 2],
      [-3e-5, 2],
      [-7e-5, 2],
      [-0.00016, 0],
      [-0.00015, 2],
      [-0.00024, 2],
      [-8e-5, 2],
      [-0.00014, 0],
      [-0.00014, 2],
      [-0.00023, 0],
      [-9e-5, 2],
      [0.00015, 1],
      [-0.00023, 0]
    ],
    "red_o_points": [],
    "y_categories": ["N", "NOT APPLICABLE", "nan"],
    "blue_o_points": [],
    "blue_x_points": [
      [0.00077, 1],
      [3e-5, 2],
      [0.00041, 1],
      [2e-5, 0],
      [1e-5, 2],
      [0.00095, 1],
      [0.00068, 1]
    ]
  },
  "QS_mulTransfSite[Oberlin]": {
    "red_x_points": [
      [-0.00394, 3],
      [-0.01085, 0],
      [-0.01217, 0],
      [-0.01136, 0],
      [-0.00545, 2],
      [-0.00566, 2],
      [-0.01125, 0],
      [-0.00344, 3],
      [-0.00561, 2],
      [-0.00501, 2],
      [-0.00497, 2],
      [-0.0041, 3],
      [0.02105, 1],
      [-0.00404, 3],
      [-0.00529, 2],
      [-0.00409, 3],
      [-0.01239, 0],
      [-0.00555, 2],
      [-0.00383, 3],
      [-0.0036, 3],
      [-0.00388, 3],
      [-0.01133, 0],
      [-0.0037, 3],
      [-0.00421, 3],
      [-0.0038, 3],
      [-0.00509, 2],
      [-0.00369, 3],
      [-0.01171, 0],
      [-0.00341, 3],
      [0.01922, 1],
      [-0.01123, 0]
    ],
    "red_o_points": [],
    "y_categories": ["N", "NOT APPLICABLE", "Y", "nan"],
    "blue_o_points": [],
    "blue_x_points": [
      [0.02654, 1],
      [-0.00132, 3],
      [0.02251, 1],
      [6e-5, 2],
      [-0.00147, 3],
      [0.02183, 1],
      [0.0231, 1]
    ]
  },
  "QA_lstPexKine[Index]": {
    "red_x_points": [
      [-0.00113, 0],
      [-0.00053, 2],
      [-0.00064, 2],
      [-0.00036, 2],
      [2e-5, 1],
      [0.00049, 1],
      [-0.00135, 0],
      [7e-5, 2],
      [0.00033, 1],
      [3e-5, 1],
      [0.00035, 1],
      [-0.00036, 1],
      [-5e-5, 2],
      [0.00051, 2],
      [0.00028, 1],
      [-6e-5, 2],
      [-0.00011, 2],
      [0.00027, 1],
      [-0.00042, 1],
      [-0.00125, 0],
      [-0.00037, 1],
      [-0.00056, 2],
      [0.00021, 2],
      [-0.00019, 1],
      [4e-5, 2],
      [-0.00028, 2],
      [-0.00076, 1],
      [-0.00015, 2],
      [-0.00024, 1],
      [-0.00022, 2],
      [-0.00057, 0]
    ],
    "red_o_points": [],
    "y_categories": ["NPV", "PV", "nan"],
    "blue_o_points": [],
    "blue_x_points": [
      [0.00019, 1],
      [0.00128, 2],
      [0.00016, 1],
      [0.00144, 1],
      [0.00037, 2],
      [0.00018, 1],
      [3e-5, 2]
    ]
  }
}
