{
  "QA_lstPexMuscstrength[ElbowFlex]": {
    "red_x_points": [
      [-0.00345, 1],
      [-0.00264, 2],
      [-0.00483, 1],
      [-0.00392, 1],
      [-0.00331, 1],
      [0.00929, 0],
      [-0.00433, 1],
      [-0.005, 1],
      [-0.00336, 1],
      [-0.00524, 1],
      [-0.0047, 1],
      [-0.00578, 1],
      [-0.00368, 1],
      [-0.00268, 2],
      [-0.00344, 2],
      [-0.0046, 2],
      [-0.00339, 1],
      [-0.0032, 2],
      [-0.00332, 2],
      [-0.00355, 1],
      [-0.00306, 1],
      [-0.00287, 1],
      [-0.0029, 1],
      [-0.0036, 2],
      [0.00382, 0],
      [-0.00372, 1],
      [-0.00572, 1],
      [-0.00377, 1],
      [-0.00283, 2],
      [-0.00342, 1],
      [-0.00428, 1],
      [-0.00368, 2]
    ],
    "red_o_points": [],
    "y_categories": ["GREATER THAN OR EQUALS TO 3", "LESS THAN 3", "nan"],
    "blue_o_points": [],
    "blue_x_points": [
      [-0.00033, 2],
      [-0.0001, 2],
      [0.0099, 0],
      [0.00017, 1],
      [0.03005, 0],
      [0.01166, 0],
      [-0.00117, 1],
      [0.011, 0],
      [-0.00072, 1],
      [-0.00119, 1]
    ]
  },
  "participant_code": {
    "red_x_points": [
      [-0.0407, 1],
      [-0.03982, 2],
      [-0.04105, 3],
      [-0.03999, 4],
      [-0.04029, 5],
      [-0.03982, 6],
      [-0.04258, 7],
      [-0.03864, 8],
      [-0.03858, 9],
      [-0.03852, 10],
      [-0.0374, 11],
      [-0.04076, 12],
      [-0.04087, 13],
      [-0.03958, 15],
      [-0.03905, 17],
      [-0.04029, 18],
      [-0.04005, 20],
      [-0.03952, 21],
      [-0.04064, 22],
      [-0.04176, 24],
      [-0.04087, 26],
      [-0.04029, 27],
      [-0.03917, 28],
      [-0.04034, 30],
      [-0.04158, 31],
      [-0.03935, 32],
      [-0.03835, 34],
      [-0.03923, 36],
      [-0.04187, 38],
      [-0.03829, 39],
      [-0.0394, 40],
      [-0.04017, 41]
    ],
    "red_o_points": [],
    "y_categories": [
      "P16554",
      "P18297",
      "P19283",
      "P19287",
      "P23391",
      "P30595",
      "P31645",
      "P31691",
      "P34778",
      "P35046",
      "P36328",
      "P43633",
      "P4544",
      "P46417",
      "P48965",
      "P53068",
      "P5497",
      "P59529",
      "P62483",
      "P64658",
      "P65202",
      "P66816",
      "P6751",
      "P7408",
      "P75566",
      "P76226",
      "P79971",
      "P82621",
      "P82990",
      "P84549",
      "P84932",
      "P85825",
      "P86989",
      "P8770",
      "P87791",
      "P90550",
      "P93159",
      "P94969",
      "P96710",
      "P97130",
      "P9744",
      "P98500",
      "nan"
    ],
    "blue_o_points": [],
    "blue_x_points": [
      [0.08398, 0],
      [0.08229, 14],
      [0.08257, 16],
      [0.08412, 19],
      [0.07947, 23],
      [0.08257, 25],
      [0.08539, 29],
      [0.08455, 33],
      [0.08483, 35],
      [0.08215, 37]
    ]
  },
  "QS_mulLysisTrunk[Upper]": {
    "red_x_points": [
      [-0.00106, 3],
      [-0.00601, 0],
      [-0.00586, 0],
      [-0.00661, 0],
      [-0.00144, 3],
      [-0.00632, 0],
      [-0.0111, 2],
      [-0.00587, 0],
      [-0.00171, 3],
      [-0.0058, 0],
      [-0.00693, 0],
      [-0.00528, 0],
      [-0.00113, 3],
      [0.01092, 1],
      [-0.00158, 3],
      [-0.00655, 0],
      [-0.0012, 3],
      [-0.01109, 2],
      [-0.00243, 3],
      [-0.00138, 3],
      [-0.00117, 3],
      [-0.00105, 3],
      [-0.00533, 0],
      [-0.0014, 3],
      [-0.00226, 3],
      [-0.00134, 3],
      [-0.00577, 0],
      [-0.00562, 0],
      [0.01322, 1],
      [-0.00105, 3],
      [-0.01103, 2],
      [-0.00161, 3]
    ],
    "red_o_points": [],
    "y_categories": ["N", "NOT APPLICABLE", "Y", "nan"],
    "blue_o_points": [],
    "blue_x_points": [
      [0.01812, 1],
      [0.00015, 3],
      [0.01272, 1],
      [0.00238, 0],
      [-0.00159, 0],
      [0.01526, 1],
      [-0.00053, 3],
      [0.01573, 1],
      [-0.00044, 3],
      [7e-5, 3]
    ]
  },
  "QS_mulTransfSite[PhMc]": {
    "red_x_points": [
      [-0.0007, 3],
      [-0.00195, 0],
      [-0.00135, 0],
      [-0.0019, 0],
      [-0.00071, 3],
      [-0.00219, 0],
      [-0.00166, 0],
      [-0.00644, 2],
      [-0.00063, 3],
      [-0.00183, 0],
      [-0.00181, 0],
      [-0.00174, 0],
      [-0.00046, 3],
      [0.00348, 1],
      [-0.00057, 3],
      [-0.00208, 0],
      [-0.00054, 3],
      [-0.00164, 0],
      [-0.00043, 3],
      [-0.00049, 3],
      [-0.00061, 3],
      [-0.0004, 3],
      [-0.00379, 2],
      [-0.00045, 3],
      [-0.0005, 3],
      [-0.00041, 3],
      [-0.00162, 0],
      [-0.00186, 0],
      [0.00385, 1],
      [-0.00039, 3],
      [-0.00168, 0],
      [-0.00056, 3]
    ],
    "red_o_points": [],
    "y_categories": ["N", "NOT APPLICABLE", "Y", "nan"],
    "blue_o_points": [],
    "blue_x_points": [
      [0.00755, 1],
      [-0.00014, 3],
      [0.0048, 1],
      [-2e-5, 0],
      [-0.00063, 0],
      [0.00453, 1],
      [-0.00022, 3],
      [0.00571, 1],
      [-0.00025, 3],
      [-0.00022, 3]
    ]
  },
  "QS_mulTransfSite[IMc]": {
    "red_x_points": [
      [-0.00099, 3],
      [-0.0083, 2],
      [-0.00317, 0],
      [-0.00368, 0],
      [-0.00114, 3],
      [-0.00337, 0],
      [-0.00305, 0],
      [-0.00393, 0],
      [-0.00171, 3],
      [-0.00365, 0],
      [-0.00403, 0],
      [-0.00269, 0],
      [-0.00091, 3],
      [0.00898, 1],
      [-0.00151, 3],
      [-0.00345, 0],
      [-0.00089, 3],
      [-0.00832, 2],
      [-0.00135, 3],
      [-0.00158, 3],
      [-0.001, 3],
      [-0.00102, 3],
      [-0.00312, 0],
      [-0.00165, 3],
      [-0.00156, 3],
      [-0.0011, 3],
      [-0.0033, 0],
      [-0.00861, 2],
      [0.00986, 1],
      [-0.00122, 3],
      [-0.00992, 2],
      [-0.00112, 3]
    ],
    "red_o_points": [],
    "y_categories": ["N", "NOT APPLICABLE", "Y", "nan"],
    "blue_o_points": [],
    "blue_x_points": [
      [0.01471, 1],
      [-0.00041, 3],
      [0.01056, 1],
      [0.00049, 0],
      [-0.00085, 0],
      [0.0111, 1],
      [-0.00038, 3],
      [0.01162, 1],
      [-0.0007, 3],
      [-0.00051, 3]
    ]
  },
  "QA_lstPexPain[C5]": {
    "red_x_points": [
      [-0.00311, 1],
      [-0.00715, 2],
      [-0.00861, 2],
      [-0.00861, 2],
      [-0.00335, 1],
      [-0.00102, 1],
      [-0.00106, 1],
      [-0.00178, 1],
      [-0.00358, 1],
      [-0.00194, 1],
      [-0.0016, 1],
      [-0.00105, 1],
      [-0.00361, 1],
      [-0.02393, 2],
      [-0.01035, 2],
      [-0.00819, 2],
      [-0.01073, 2],
      [-0.00663, 2],
      [-0.01015, 2],
      [-0.00285, 1],
      [-0.00351, 1],
      [-0.00283, 1],
      [-0.00925, 2],
      [-0.01054, 2],
      [-0.00302, 1],
      [-0.01173, 2],
      [-0.00762, 2],
      [-0.00704, 2],
      [-0.00606, 1],
      [-0.00805, 1],
      [-0.00088, 1],
      [-0.00335, 1]
    ],
    "red_o_points": [],
    "y_categories": ["NORM", "NPV", "nan"],
    "blue_o_points": [],
    "blue_x_points": [
      [0.03167, 0],
      [-0.00521, 2],
      [0.00054, 1],
      [-0.00018, 1],
      [-0.00029, 1],
      [-4e-5, 1],
      [-0.00139, 1],
      [0.02898, 0],
      [-0.00162, 1],
      [0.07035, 0]
    ]
  },
  "QS_mulNeuromadSite[C8]": {
    "red_x_points": [
      [-3e-5, 2],
      [-0.00281, 0],
      [-0.00259, 0],
      [-0.00335, 0],
      [-0.0004, 2],
      [-0.00355, 0],
      [-0.00218, 0],
      [-0.00297, 0],
      [-0.00055, 2],
      [-0.00323, 0],
      [-0.00349, 0],
      [-0.00247, 0],
      [2e-5, 2],
      [0.00229, 1],
      [-0.00053, 2],
      [-0.00357, 0],
      [-0.00032, 2],
      [-0.00248, 0],
      [-0.00112, 2],
      [-0.00023, 2],
      [-0.00013, 2],
      [-0.00015, 2],
      [-0.00217, 0],
      [-0.00039, 2],
      [-0.00162, 2],
      [-0.00038, 2],
      [-0.00283, 0],
      [-0.00225, 0],
      [0.00368, 1],
      [-0.0001, 2],
      [-0.00228, 0],
      [-0.00062, 2]
    ],
    "red_o_points": [],
    "y_categories": ["N", "NOT APPLICABLE", "nan"],
    "blue_o_points": [],
    "blue_x_points": [
      [0.00916, 1],
      [-0.00017, 2],
      [0.00484, 1],
      [0.00155, 0],
      [-0.00039, 0],
      [0.00449, 1],
      [6e-5, 2],
      [0.00564, 1],
      [6e-5, 2],
      [0.00033, 2]
    ]
  },
  "QS_mulTransfSite[Other]": {
    "red_x_points": [
      [-0.00295, 3],
      [-0.02084, 0],
      [-0.02061, 0],
      [-0.02116, 0],
      [-0.00323, 3],
      [-0.02194, 0],
      [-0.021, 0],
      [-0.02216, 0],
      [-0.00284, 3],
      [-0.02164, 0],
      [-0.02177, 0],
      [-0.01966, 0],
      [-0.00265, 3],
      [0.02748, 1],
      [-0.00323, 3],
      [-0.02012, 0],
      [-0.00319, 3],
      [-0.02046, 0],
      [-0.00444, 3],
      [-0.00313, 3],
      [-0.00277, 3],
      [-0.00296, 3],
      [-0.01962, 0],
      [-0.00338, 3],
      [-0.00462, 3],
      [-0.0028, 3],
      [-0.02085, 0],
      [-0.02074, 0],
      [0.02838, 1],
      [-0.00285, 3],
      [-0.02095, 0],
      [-0.00333, 3]
    ],
    "red_o_points": [],
    "y_categories": ["N", "NOT APPLICABLE", "Y", "nan"],
    "blue_o_points": [],
    "blue_x_points": [
      [0.03744, 1],
      [-0.001, 3],
      [0.0309, 1],
      [-0.00695, 0],
      [0.06795, 2],
      [0.03039, 1],
      [-0.00086, 3],
      [0.03148, 1],
      [-0.00082, 3],
      [0.0003, 3]
    ]
  },
  "QA_yonInjBpsurg": {
    "red_x_points": [
      [-0.00184, 1],
      [-0.00211, 1],
      [-0.00222, 1],
      [-0.00226, 1],
      [-0.00229, 1],
      [-0.00217, 1],
      [-0.00159, 1],
      [-0.00221, 1],
      [-0.00225, 1],
      [-0.00255, 1],
      [-0.00216, 1],
      [-0.00176, 1],
      [-0.00207, 1],
      [0.00284, 0],
      [-0.00227, 1],
      [-0.00234, 1],
      [-0.00249, 1],
      [-0.00178, 1],
      [-0.002, 1],
      [-0.00209, 1],
      [-0.0019, 1],
      [-0.00169, 1],
      [-0.00152, 1],
      [-0.00229, 1],
      [-0.00327, 1],
      [-0.00227, 1],
      [-0.00197, 1],
      [-0.00164, 1],
      [0.00479, 0],
      [-0.00219, 1],
      [-0.00149, 1],
      [-0.00221, 1]
    ],
    "red_o_points": [],
    "y_categories": ["N", "Y", "nan"],
    "blue_o_points": [],
    "blue_x_points": [
      [0.01209, 0],
      [-0.00046, 1],
      [0.00683, 0],
      [-0.00155, 1],
      [-0.00152, 1],
      [0.00933, 0],
      [-0.00098, 1],
      [0.00926, 0],
      [-0.00121, 1],
      [-0.00068, 1]
    ]
  },
  "QA_mulInjOrthesisType[ShoulderSupport]": {
    "red_x_points": [
      [-0.00935, 0],
      [-0.00864, 0],
      [-0.00889, 0],
      [-0.00899, 0],
      [-0.00871, 0],
      [-0.00929, 0],
      [-0.00897, 0],
      [-0.00955, 0],
      [-0.02488, 2],
      [-0.01019, 0],
      [-0.00915, 0],
      [-0.00971, 0],
      [-0.00989, 0],
      [0.01924, 1],
      [-0.00983, 0],
      [-0.00943, 0],
      [-0.00965, 0],
      [-0.01641, 2],
      [0.0183, 1],
      [-0.00849, 0],
      [-0.00926, 0],
      [-0.02701, 2],
      [-0.00424, 3],
      [-0.00883, 0],
      [0.01803, 1],
      [-0.00896, 0],
      [-0.00969, 0],
      [-0.00777, 0],
      [-0.01917, 3],
      [2e-5, 3],
      [-0.00853, 0],
      [-0.00874, 0]
    ],
    "red_o_points": [],
    "y_categories": ["N", "NOT APPLICABLE", "Y", "nan"],
    "blue_o_points": [],
    "blue_x_points": [
      [0.00286, 0],
      [0.0298, 1],
      [0.022, 1],
      [0.04979, 1],
      [-0.00695, 0],
      [0.02442, 1],
      [-0.00425, 0],
      [0.02209, 1],
      [-0.005, 0],
      [0.01812, 3]
    ]
  },
  "QS_mulTransfSite[AcSsAA]": {
    "red_x_points": [
      [-0.00257, 3],
      [-0.01895, 2],
      [-0.005, 0],
      [-0.01992, 2],
      [-0.00256, 3],
      [-0.02643, 2],
      [-0.00395, 0],
      [-0.00465, 0],
      [-0.00271, 3],
      [-0.00485, 0],
      [-0.02136, 2],
      [-0.00402, 0],
      [-0.00247, 3],
      [0.02183, 1],
      [-0.00283, 3],
      [-0.02281, 2],
      [-0.00227, 3],
      [-0.00496, 0],
      [-0.0045, 3],
      [-0.00241, 3],
      [-0.00239, 3],
      [-0.00223, 3],
      [-0.01998, 2],
      [-0.00279, 3],
      [-0.00474, 3],
      [-0.00242, 3],
      [-0.00471, 0],
      [-0.0188, 2],
      [0.0235, 1],
      [-0.00234, 3],
      [-0.00467, 0],
      [-0.00273, 3]
    ],
    "red_o_points": [],
    "y_categories": ["N", "NOT APPLICABLE", "Y", "nan"],
    "blue_o_points": [],
    "blue_x_points": [
      [0.03101, 1],
      [-0.00087, 3],
      [0.02499, 1],
      [0.0035, 0],
      [0.00222, 0],
      [0.02634, 1],
      [-0.00112, 3],
      [0.02647, 1],
      [-0.00137, 3],
      [-0.00066, 3]
    ]
  },
  "QA_lstPexTouch[T1]": {
    "red_x_points": [
      [-0.01464, 1],
      [-0.00219, 2],
      [0.001, 1],
      [-0.00254, 2],
      [-0.01574, 1],
      [-0.01116, 0],
      [0.00069, 1],
      [0.00162, 1],
      [-0.01444, 1],
      [-0.00386, 0],
      [-0.00414, 0],
      [-0.00799, 0],
      [0.01129, 0],
      [-0.01292, 2],
      [-0.00822, 2],
      [-0.00498, 2],
      [-0.01699, 1],
      [-0.00142, 2],
      [-0.0092, 2],
      [0.01176, 0],
      [-0.01697, 1],
      [0.01266, 0],
      [-0.00476, 2],
      [-0.00832, 2],
      [-0.01618, 1],
      [0.01252, 0],
      [0.00344, 1],
      [-0.00279, 2],
      [-0.00396, 1],
      [-0.00923, 2],
      [-5e-5, 1],
      [-0.01744, 1]
    ],
    "red_o_points": [],
    "y_categories": ["NORM", "NPV", "nan"],
    "blue_o_points": [],
    "blue_x_points": [
      [0.00091, 1],
      [0.00096, 2],
      [0.0013, 1],
      [0.00868, 1],
      [0.01297, 1],
      [0.00092, 1],
      [0.02162, 0],
      [0.00759, 0],
      [0.01668, 0],
      [0.02272, 0]
    ]
  },
  "QA_mulInjOrthesisType[ArmSling]": {
    "red_x_points": [
      [-0.01025, 2],
      [-0.00893, 2],
      [-0.01007, 2],
      [-0.01006, 2],
      [-0.00959, 2],
      [-0.00914, 2],
      [-0.00944, 2],
      [-0.01039, 2],
      [-0.00875, 2],
      [-0.01094, 2],
      [-0.00986, 2],
      [-0.00985, 2],
      [-0.0096, 2],
      [0.01912, 1],
      [-0.01007, 2],
      [-0.00984, 2],
      [-0.01043, 2],
      [-0.01649, 0],
      [0.01831, 1],
      [-0.00862, 2],
      [-0.0105, 2],
      [-0.02374, 0],
      [-0.00475, 3],
      [-0.01019, 2],
      [0.01682, 1],
      [-0.00949, 2],
      [-0.00998, 2],
      [-0.00835, 2],
      [-0.02372, 3],
      [-0.00035, 3],
      [-0.00871, 2],
      [-0.00893, 2]
    ],
    "red_o_points": [],
    "y_categories": ["N", "NOT APPLICABLE", "Y", "nan"],
    "blue_o_points": [],
    "blue_x_points": [
      [0.00484, 2],
      [0.03147, 1],
      [0.02379, 1],
      [0.04984, 1],
      [-0.00655, 2],
      [0.0245, 1],
      [-0.00536, 2],
      [0.02091, 1],
      [-0.00589, 2],
      [0.01567, 3]
    ]
  },
  "QS_lstBpsurgSide": {
    "red_x_points": [
      [-0.00101, 3],
      [-0.00779, 0],
      [-0.00834, 0],
      [-0.00831, 0],
      [-0.00103, 3],
      [-0.00845, 2],
      [-0.00781, 0],
      [-0.00872, 0],
      [-0.00186, 3],
      [-0.00793, 0],
      [-0.00713, 2],
      [-0.00733, 2],
      [-0.00096, 3],
      [0.01217, 1],
      [-0.00174, 3],
      [-0.00829, 2],
      [-0.00107, 3],
      [-0.00728, 2],
      [-0.00163, 3],
      [-0.00149, 3],
      [-0.00107, 3],
      [-0.00084, 3],
      [-0.00788, 0],
      [-0.00157, 3],
      [-0.0015, 3],
      [-0.00099, 3],
      [-0.007, 2],
      [-0.00638, 2],
      [0.01405, 1],
      [-0.00104, 3],
      [-0.00883, 0],
      [-0.00129, 3]
    ],
    "red_o_points": [],
    "y_categories": ["L", "NOT APPLICABLE", "R", "nan"],
    "blue_o_points": [],
    "blue_x_points": [
      [0.0206, 1],
      [-0.00022, 3],
      [0.01425, 1],
      [0.00419, 0],
      [-0.00019, 2],
      [0.01389, 1],
      [-0.0003, 3],
      [0.01482, 1],
      [-0.00042, 3],
      [-0.00024, 3]
    ]
  },
  "QA_equInjTbpiTime": {
    "red_x_points": [
      [-0.00162, 0],
      [-0.00339, 0],
      [0.00775, 3],
      [-0.00377, 0],
      [-0.00598, 1],
      [-0.01073, 0],
      [-0.0071, 1],
      [-0.00494, 0],
      [0.0032, 3],
      [-0.00805, 0],
      [-0.00677, 0],
      [0.01233, 3],
      [-0.00175, 0],
      [-0.05315, 2],
      [0.00161, 3],
      [-0.00645, 0],
      [-0.00058, 0],
      [-0.00221, 0],
      [-0.01987, 1],
      [0.00352, 3],
      [-0.0016, 0],
      [-0.00579, 1],
      [-0.01007, 2],
      [0.00123, 3],
      [-0.01727, 1],
      [-0.0158, 2],
      [-0.00756, 0],
      [-0.00908, 2],
      [0.00096, 0],
      [0.00016, 0],
      [0.00641, 3],
      [-0.00597, 1]
    ],
    "red_o_points": [],
    "y_categories": [
      "0 TO 6 MONTHS",
      "13 TO 24 MONTHS",
      "25 MONTHS OR MORE",
      "7 TO 12 MONTHS",
      "nan"
    ],
    "blue_o_points": [],
    "blue_x_points": [
      [0.00396, 0],
      [0.00979, 0],
      [0.00588, 0],
      [0.02174, 3],
      [0.01986, 3],
      [0.0068, 0],
      [0.0038, 1],
      [0.01686, 3],
      [0.00946, 3],
      [0.00362, 0]
    ]
  },
  "QA_yonInjUnconscio": {
    "red_x_points": [
      [-0.00692, 1],
      [-0.00828, 1],
      [-0.00752, 2],
      [-0.00539, 2],
      [-0.00974, 2],
      [0.02519, 0],
      [-0.01101, 1],
      [-0.00711, 2],
      [-0.00856, 2],
      [-0.00865, 2],
      [-0.00707, 2],
      [-0.01539, 1],
      [-0.00819, 1],
      [-0.02921, 1],
      [-0.01167, 2],
      [-0.00692, 2],
      [-0.00948, 2],
      [-0.00817, 1],
      [0.00864, 0],
      [-0.00971, 1],
      [-0.00644, 1],
      [-0.00741, 1],
      [-0.00913, 1],
      [-0.01047, 2],
      [-0.01018, 1],
      [-0.00797, 2],
      [-0.01115, 1],
      [-0.00898, 1],
      [-0.00259, 2],
      [-0.0084, 2],
      [-0.01018, 1],
      [-0.01028, 2]
    ],
    "red_o_points": [],
    "y_categories": ["N", "Y", "nan"],
    "blue_o_points": [],
    "blue_x_points": [
      [0.00065, 2],
      [0.00599, 1],
      [0.02433, 0],
      [0.03671, 0],
      [0.04053, 0],
      [0.00218, 2],
      [-0.00083, 1],
      [0.00167, 2],
      [0.04597, 0],
      [-0.00266, 2]
    ]
  },
  "QA_lstPexMuscstrength[ShoulderAbduc]": {
    "red_x_points": [
      [-0.00547, 1],
      [-0.00442, 1],
      [-0.0041, 1],
      [-0.00434, 1],
      [-0.00521, 1],
      [-0.00509, 1],
      [-0.00472, 1],
      [-0.00497, 1],
      [-0.00493, 1],
      [-0.00512, 1],
      [-0.00473, 1],
      [-0.00508, 1],
      [-0.00467, 1],
      [0.00114, 2],
      [0.00188, 2],
      [0.00166, 2],
      [0.00176, 2],
      [0.0021, 2],
      [0.00158, 2],
      [-0.00519, 1],
      [-0.00509, 1],
      [-0.00511, 1],
      [-0.0044, 1],
      [0.0022, 2],
      [-0.00852, 1],
      [-0.00447, 1],
      [-0.00425, 1],
      [-0.00399, 1],
      [0.00262, 2],
      [-0.00504, 1],
      [-0.00485, 1],
      [0.00306, 2]
    ],
    "red_o_points": [],
    "y_categories": ["GREATER THAN OR EQUALS TO 3", "LESS THAN 3", "nan"],
    "blue_o_points": [],
    "blue_x_points": [
      [0.00187, 2],
      [0.0027, 2],
      [0.02537, 0],
      [0.00369, 2],
      [-0.00387, 1],
      [0.02619, 0],
      [0.00317, 2],
      [-0.00238, 1],
      [-0.00262, 1],
      [-0.00264, 1]
    ]
  },
  "QS_mulNeuromadSite[T2]": {
    "red_x_points": [
      [-8e-5, 2],
      [-0.00105, 0],
      [-0.00139, 0],
      [-0.00124, 0],
      [-5e-5, 2],
      [-0.00154, 0],
      [-0.0011, 0],
      [-0.00131, 0],
      [-2e-5, 2],
      [-0.00127, 0],
      [-0.00141, 0],
      [-0.00112, 0],
      [-4e-5, 2],
      [0.00086, 1],
      [-5e-5, 2],
      [-0.00149, 0],
      [-6e-5, 2],
      [-0.00095, 0],
      [-0.00043, 2],
      [-0.0001, 2],
      [-4e-5, 2],
      [-8e-5, 2],
      [-0.00089, 0],
      [-2e-5, 2],
      [-0.00067, 2],
      [-9e-5, 2],
      [-0.00098, 0],
      [-0.00102, 0],
      [0.00175, 1],
      [-5e-5, 2],
      [-0.00113, 0],
      [-4e-5, 2]
    ],
    "red_o_points": [],
    "y_categories": ["N", "NOT APPLICABLE", "nan"],
    "blue_o_points": [],
    "blue_x_points": [
      [0.00384, 1],
      [-4e-5, 2],
      [0.00209, 1],
      [0.00064, 0],
      [-0.00074, 0],
      [0.00238, 1],
      [-4e-5, 2],
      [0.00275, 1],
      [3e-5, 2],
      [0.00022, 2]
    ]
  },
  "QS_mulBpsurgeryType[Lysis]": {
    "red_x_points": [
      [-0.00149, 3],
      [-0.00701, 0],
      [-0.01615, 2],
      [-0.00754, 0],
      [-0.00154, 3],
      [-0.00729, 0],
      [-0.01646, 2],
      [-0.00724, 0],
      [-0.0022, 3],
      [-0.00685, 0],
      [-0.00793, 0],
      [-0.00575, 0],
      [-0.00114, 3],
      [0.0159, 1],
      [-0.00232, 3],
      [-0.00776, 0],
      [-0.00147, 3],
      [-0.01464, 2],
      [-0.0031, 3],
      [-0.00183, 3],
      [-0.00145, 3],
      [-0.00151, 3],
      [-0.00689, 0],
      [-0.00228, 3],
      [-0.00305, 3],
      [-0.00171, 3],
      [-0.00658, 0],
      [-0.00642, 0],
      [0.01707, 1],
      [-0.00148, 3],
      [-0.01623, 2],
      [-0.00195, 3]
    ],
    "red_o_points": [],
    "y_categories": ["N", "NOT APPLICABLE", "Y", "nan"],
    "blue_o_points": [],
    "blue_x_points": [
      [0.02651, 1],
      [0.00013, 3],
      [0.01659, 1],
      [0.00206, 0],
      [-0.00036, 0],
      [0.01937, 1],
      [-0.00069, 3],
      [0.02116, 1],
      [-0.00062, 3],
      [4e-5, 3]
    ]
  },
  "QS_mulLysisSite[Trunk]": {
    "red_x_points": [
      [-0.00057, 3],
      [-0.00333, 0],
      [-0.00334, 0],
      [-0.00354, 0],
      [-0.0007, 3],
      [-0.00334, 0],
      [-0.00678, 2],
      [-0.00357, 0],
      [-0.00111, 3],
      [-0.00318, 0],
      [-0.00303, 0],
      [-0.00303, 0],
      [-0.00031, 3],
      [0.00539, 1],
      [-0.00106, 3],
      [-0.00349, 0],
      [-0.00046, 3],
      [-0.00558, 2],
      [-0.00093, 3],
      [-0.00103, 3],
      [-0.00058, 3],
      [-0.00057, 3],
      [-0.00314, 0],
      [-0.00089, 3],
      [-0.0009, 3],
      [-0.00047, 3],
      [-0.00328, 0],
      [-0.00306, 0],
      [0.00813, 1],
      [-0.00053, 3],
      [-0.0075, 2],
      [-0.00074, 3]
    ],
    "red_o_points": [],
    "y_categories": ["N", "NOT APPLICABLE", "Y", "nan"],
    "blue_o_points": [],
    "blue_x_points": [
      [0.01204, 1],
      [-0.00042, 3],
      [0.00845, 1],
      [0.0006, 0],
      [-0.00051, 0],
      [0.00798, 1],
      [-0.0003, 3],
      [0.00819, 1],
      [-0.00052, 3],
      [0.00022, 3]
    ]
  },
  "QS_mulTransfSite[Oberlin]": {
    "red_x_points": [
      [-0.00288, 3],
      [-0.02064, 0],
      [-0.02251, 0],
      [-0.022, 0],
      [-0.00332, 3],
      [-0.00392, 2],
      [-0.00312, 2],
      [-0.02172, 0],
      [-0.00324, 3],
      [-0.00399, 2],
      [-0.0041, 2],
      [-0.00259, 2],
      [-0.00255, 3],
      [0.02429, 1],
      [-0.00386, 3],
      [-0.00395, 2],
      [-0.00292, 3],
      [-0.02249, 0],
      [-0.00446, 3],
      [-0.00318, 3],
      [-0.00272, 3],
      [-0.00267, 3],
      [-0.02093, 0],
      [-0.0035, 3],
      [-0.00496, 3],
      [-0.00303, 3],
      [-0.00332, 2],
      [-0.01996, 0],
      [0.02525, 1],
      [-0.00259, 3],
      [-0.02258, 0],
      [-0.00309, 3]
    ],
    "red_o_points": [],
    "y_categories": ["N", "NOT APPLICABLE", "Y", "nan"],
    "blue_o_points": [],
    "blue_x_points": [
      [0.03633, 1],
      [-0.00155, 3],
      [0.02862, 1],
      [0.00472, 2],
      [0.00187, 2],
      [0.02709, 1],
      [-0.00118, 3],
      [0.02803, 1],
      [-0.00141, 3],
      [-0.00069, 3]
    ]
  },
  "QA_mulInjTbpiCause[Motorcycle]": {
    "red_x_points": [
      [-0.00481, 0],
      [-0.00084, 1],
      [-0.00115, 1],
      [-0.00087, 1],
      [-0.00042, 1],
      [-0.00127, 1],
      [-0.00067, 1],
      [-0.00127, 1],
      [-0.00037, 1],
      [-0.00115, 1],
      [-0.00072, 1],
      [-0.00066, 1],
      [-0.00956, 0],
      [-0.05764, 1],
      [-0.00073, 1],
      [-0.00142, 1],
      [-0.00021, 1],
      [-0.00095, 1],
      [-0.00166, 1],
      [-0.01014, 0],
      [0.00056, 1],
      [0.00303, 1],
      [-0.00053, 1],
      [-0.00059, 1],
      [-0.00174, 1],
      [-0.00784, 0],
      [-0.00058, 1],
      [-0.00044, 1],
      [-0.05963, 1],
      [0.00014, 1],
      [-0.00042, 1],
      [-0.00071, 1]
    ],
    "red_o_points": [],
    "y_categories": ["N", "Y", "nan"],
    "blue_o_points": [],
    "blue_x_points": [
      [0.0272, 0],
      [-0.00059, 1],
      [0.02271, 0],
      [-0.00238, 1],
      [-0.00056, 1],
      [0.02622, 0],
      [0.00372, 1],
      [0.02593, 0],
      [0.00429, 1],
      [0.00457, 1]
    ]
  }
}
