{
  "participant_code": {
    "red_x_points": [
      [-0.04358, 1],
      [-0.04292, 2],
      [-0.0439, 3],
      [-0.04358, 4],
      [-0.04283, 5],
      [-0.04325, 6],
      [-0.04498, 7],
      [-0.04386, 8],
      [-0.04456, 9],
      [-0.0426, 10],
      [-0.04428, 11],
      [-0.0433, 12],
      [-0.044, 14],
      [-0.04316, 16],
      [-0.04414, 17],
      [-0.04316, 19],
      [-0.044, 20],
      [-0.04362, 22],
      [-0.0432, 23],
      [-0.04381, 25],
      [-0.04474, 26],
      [-0.0432, 27],
      [-0.04283, 28],
      [-0.04283, 29],
      [-0.04358, 30],
      [-0.04246, 32],
      [-0.0425, 33],
      [-0.04376, 34],
      [-0.04264, 35],
      [-0.0432, 36],
      [-0.04334, 37]
    ],
    "red_o_points": [],
    "y_categories": [
      "P16554",
      "P18297",
      "P19283",
      "P19287",
      "P23391",
      "P31645",
      "P31691",
      "P34778",
      "P35046",
      "P36328",
      "P43633",
      "P4544",
      "P46417",
      "P48965",
      "P53068",
      "P5497",
      "P59529",
      "P62483",
      "P64658",
      "P65202",
      "P66816",
      "P6751",
      "P7408",
      "P75566",
      "P76226",
      "P79971",
      "P82621",
      "P82990",
      "P84932",
      "P85825",
      "P86989",
      "P8770",
      "P87791",
      "P90550",
      "P93159",
      "P94969",
      "P96710",
      "P9744",
      "nan"
    ],
    "blue_o_points": [],
    "blue_x_points": [
      [0.13107, 0],
      [0.12601, 13],
      [0.12847, 15],
      [0.12893, 18],
      [0.12004, 21],
      [0.13092, 24],
      [0.12801, 31]
    ]
  },
  "QA_mulInjOrthesisType[ArmSling]": {
    "red_x_points": [
      [-0.02162, 2],
      [-0.01987, 2],
      [-0.02013, 2],
      [-0.02009, 2],
      [-0.01865, 2],
      [-0.02012, 2],
      [-0.02074, 2],
      [-0.02054, 2],
      [-0.01987, 2],
      [-0.01974, 2],
      [-0.02013, 2],
      [-0.02093, 2],
      [0.05323, 1],
      [-0.02172, 2],
      [-0.01938, 2],
      [-0.02168, 2],
      [-0.02493, 0],
      [-0.02012, 2],
      [-0.02189, 2],
      [-0.02023, 2],
      [-0.02422, 0],
      [-0.02364, 3],
      [-0.02202, 2],
      [0.05884, 1],
      [-0.02167, 2],
      [-0.01956, 2],
      [-0.02067, 2],
      [-0.02015, 2],
      [-0.02559, 3],
      [-0.03494, 3],
      [-0.01988, 2]
    ],
    "red_o_points": [],
    "y_categories": ["N", "NOT APPLICABLE", "Y", "nan"],
    "blue_o_points": [],
    "blue_x_points": [
      [-0.00931, 2],
      [0.06169, 1],
      [0.05317, 1],
      [0.06208, 1],
      [0.06137, 1],
      [0.04987, 1],
      [0.05336, 1]
    ]
  },
  "QS_lstBpsurgSide": {
    "red_x_points": [
      [-0.00695, 3],
      [-0.01036, 0],
      [-0.01024, 0],
      [-0.0101, 0],
      [-0.01886, 2],
      [-0.00957, 0],
      [-0.01102, 0],
      [-0.00566, 3],
      [-0.01026, 0],
      [-0.01853, 2],
      [-0.01871, 2],
      [-0.00691, 3],
      [0.02902, 1],
      [-0.00712, 3],
      [-0.02413, 2],
      [-0.00743, 3],
      [-0.02078, 2],
      [-0.01963, 2],
      [-0.00731, 3],
      [-0.00674, 3],
      [-0.00558, 3],
      [-0.00936, 0],
      [-0.0075, 3],
      [-0.00696, 3],
      [-0.0068, 3],
      [-0.01891, 2],
      [-0.00706, 3],
      [-0.01939, 2],
      [-0.0058, 3],
      [0.02989, 1],
      [-0.01065, 0]
    ],
    "red_o_points": [],
    "y_categories": ["L", "NOT APPLICABLE", "R", "nan"],
    "blue_o_points": [],
    "blue_x_points": [
      [0.06509, 1],
      [-0.002, 3],
      [0.03347, 1],
      [0.00656, 0],
      [-0.00165, 3],
      [0.03371, 1],
      [0.04246, 1]
    ]
  },
  "QS_mulNeuromadSite[T1]": {
    "red_x_points": [
      [-0.00263, 2],
      [-0.00543, 0],
      [-0.00538, 0],
      [-0.00532, 0],
      [-0.00556, 0],
      [-0.00581, 0],
      [-0.00553, 0],
      [-0.00209, 2],
      [-0.00548, 0],
      [-0.00565, 0],
      [-0.00576, 0],
      [-0.00262, 2],
      [0.00528, 1],
      [-0.0024, 2],
      [-0.00572, 0],
      [-0.00256, 2],
      [-0.00458, 0],
      [-0.00564, 0],
      [-0.00276, 2],
      [-0.00243, 2],
      [-0.00157, 2],
      [-0.00449, 0],
      [-0.00257, 2],
      [-0.00261, 2],
      [-0.00266, 2],
      [-0.00558, 0],
      [-0.00264, 2],
      [-0.00563, 0],
      [-0.00138, 2],
      [0.01023, 1],
      [-0.0056, 0]
    ],
    "red_o_points": [],
    "y_categories": ["N", "NOT APPLICABLE", "nan"],
    "blue_o_points": [],
    "blue_x_points": [
      [0.03233, 1],
      [0.0001, 2],
      [0.01129, 1],
      [0.00059, 0],
      [-0.00029, 2],
      [0.01028, 1],
      [0.01473, 1]
    ]
  },
  "QA_lstPexMuscstrength[ShoulderAbduc]": {
    "red_x_points": [
      [-0.01044, 1],
      [-0.00998, 1],
      [-0.0104, 1],
      [-0.01038, 1],
      [-0.01082, 1],
      [-0.01028, 1],
      [-0.01069, 1],
      [-0.01003, 1],
      [-0.01045, 1],
      [-0.01043, 1],
      [-0.01037, 1],
      [-0.01096, 1],
      [0.00635, 2],
      [0.0092, 2],
      [0.00899, 2],
      [0.00926, 2],
      [0.00875, 2],
      [-0.01071, 1],
      [-0.01067, 1],
      [-0.01047, 1],
      [-0.01085, 1],
      [-0.0107, 1],
      [0.009, 2],
      [-0.02098, 1],
      [-0.01094, 1],
      [-0.01095, 1],
      [-0.01099, 1],
      [-0.01066, 1],
      [-0.01076, 1],
      [0.00631, 2],
      [-0.00997, 1]
    ],
    "red_o_points": [],
    "y_categories": ["GREATER THAN OR EQUALS TO 3", "LESS THAN 3", "nan"],
    "blue_o_points": [],
    "blue_x_points": [
      [0.00747, 2],
      [0.01077, 2],
      [0.04553, 0],
      [0.01162, 2],
      [0.01068, 2],
      [0.04471, 0],
      [-0.00451, 1]
    ]
  },
  "QS_mulNeuromadSite[C5]": {
    "red_x_points": [
      [-0.00096, 2],
      [-0.00203, 0],
      [-0.00224, 0],
      [-0.00173, 0],
      [-0.00186, 0],
      [-0.00184, 0],
      [-0.0018, 0],
      [-0.00051, 2],
      [-0.00209, 0],
      [-0.00213, 0],
      [-0.00202, 0],
      [-0.001, 2],
      [-0.002, 1],
      [-0.00099, 2],
      [-0.0021, 0],
      [-0.00102, 2],
      [-0.00155, 0],
      [-0.00188, 0],
      [-0.00084, 2],
      [-0.00084, 2],
      [-0.00032, 2],
      [-0.00139, 0],
      [-0.00087, 2],
      [-0.00107, 2],
      [-0.00083, 2],
      [-0.0016, 0],
      [-0.00083, 2],
      [-0.00205, 0],
      [-0.00023, 2],
      [0.00237, 1],
      [-0.00181, 0]
    ],
    "red_o_points": [],
    "y_categories": ["N", "NOT APPLICABLE", "nan"],
    "blue_o_points": [],
    "blue_x_points": [
      [0.01442, 1],
      [0.00051, 2],
      [0.00356, 1],
      [0.00255, 0],
      [0.00024, 2],
      [0.00266, 1],
      [0.00315, 1]
    ]
  },
  "QS_mulNeuromadSite[T2]": {
    "red_x_points": [
      [-0.0047, 2],
      [-0.0126, 0],
      [-0.01246, 0],
      [-0.01219, 0],
      [-0.01273, 0],
      [-0.01261, 0],
      [-0.0127, 0],
      [-0.00401, 2],
      [-0.01314, 0],
      [-0.01203, 0],
      [-0.01256, 0],
      [-0.00474, 2],
      [0.01542, 1],
      [-0.0047, 2],
      [-0.01311, 0],
      [-0.00513, 2],
      [-0.01058, 0],
      [-0.01221, 0],
      [-0.00448, 2],
      [-0.00459, 2],
      [-0.00341, 2],
      [-0.01112, 0],
      [-0.00481, 2],
      [-0.00438, 2],
      [-0.00493, 2],
      [-0.01266, 0],
      [-0.00493, 2],
      [-0.01251, 0],
      [-0.00341, 2],
      [0.02081, 1],
      [-0.0118, 0]
    ],
    "red_o_points": [],
    "y_categories": ["N", "NOT APPLICABLE", "nan"],
    "blue_o_points": [],
    "blue_x_points": [
      [0.05538, 1],
      [7e-5, 2],
      [0.02692, 1],
      [0.00103, 0],
      [-0.00037, 2],
      [0.02474, 1],
      [0.03219, 1]
    ]
  },
  "QS_mulTransfSite[Oberlin]": {
    "red_x_points": [
      [-0.00572, 3],
      [-0.01562, 0],
      [-0.01597, 0],
      [-0.01579, 0],
      [-0.00634, 2],
      [-0.00628, 2],
      [-0.01549, 0],
      [-0.00489, 3],
      [-0.00603, 2],
      [-0.00689, 2],
      [-0.0067, 2],
      [-0.00551, 3],
      [0.02149, 1],
      [-0.00542, 3],
      [-0.00706, 2],
      [-0.00565, 3],
      [-0.01681, 0],
      [-0.00608, 2],
      [-0.00584, 3],
      [-0.00552, 3],
      [-0.00441, 3],
      [-0.0151, 0],
      [-0.0054, 3],
      [-0.00503, 3],
      [-0.0052, 3],
      [-0.00677, 2],
      [-0.00577, 3],
      [-0.01459, 0],
      [-0.00425, 3],
      [0.02452, 1],
      [-0.01496, 0]
    ],
    "red_o_points": [],
    "y_categories": ["N", "NOT APPLICABLE", "Y", "nan"],
    "blue_o_points": [],
    "blue_x_points": [
      [0.04856, 1],
      [-0.00105, 3],
      [0.02516, 1],
      [0.00544, 2],
      [-0.00157, 3],
      [0.02567, 1],
      [0.02901, 1]
    ]
  },
  "QS_mulNeuromadSite[C8]": {
    "red_x_points": [
      [-0.00144, 2],
      [-0.00335, 0],
      [-0.00341, 0],
      [-0.00335, 0],
      [-0.00344, 0],
      [-0.00361, 0],
      [-0.00363, 0],
      [-0.00102, 2],
      [-0.00378, 0],
      [-0.00357, 0],
      [-0.00349, 0],
      [-0.00139, 2],
      [0.00032, 1],
      [-0.00135, 2],
      [-0.00363, 0],
      [-0.00117, 2],
      [-0.00292, 0],
      [-0.00339, 0],
      [-0.0015, 2],
      [-0.00148, 2],
      [-0.00085, 2],
      [-0.0028, 0],
      [-0.00122, 2],
      [-0.00142, 2],
      [-0.0015, 2],
      [-0.00305, 0],
      [-0.00136, 2],
      [-0.0032, 0],
      [-0.00073, 2],
      [0.00498, 1],
      [-0.003, 0]
    ],
    "red_o_points": [],
    "y_categories": ["N", "NOT APPLICABLE", "nan"],
    "blue_o_points": [],
    "blue_x_points": [
      [0.01961, 1],
      [0.00061, 2],
      [0.00749, 1],
      [0.00171, 0],
      [0.00056, 2],
      [0.00592, 1],
      [0.01004, 1]
    ]
  },
  "QA_mulInjTbpiCause[Motorcycle]": {
    "red_x_points": [
      [0.00505, 0],
      [-0.00199, 1],
      [-0.00217, 1],
      [-0.00197, 1],
      [-0.00191, 1],
      [-0.0021, 1],
      [-0.00212, 1],
      [-0.00194, 1],
      [-0.00222, 1],
      [-0.00224, 1],
      [-0.00218, 1],
      [0.00374, 0],
      [-0.06228, 1],
      [-0.00293, 1],
      [-0.00282, 1],
      [-0.00299, 1],
      [-0.00246, 1],
      [-0.00225, 1],
      [0.00339, 0],
      [-0.00209, 1],
      [-0.00207, 1],
      [-0.00226, 1],
      [-0.00266, 1],
      [-0.00646, 1],
      [0.00446, 0],
      [-0.00198, 1],
      [-0.00223, 1],
      [-0.00203, 1],
      [-0.00225, 1],
      [-0.0543, 1],
      [-0.00239, 1]
    ],
    "red_o_points": [],
    "y_categories": ["N", "Y", "nan"],
    "blue_o_points": [],
    "blue_x_points": [
      [0.0304, 0],
      [-0.0035, 1],
      [0.02819, 0],
      [-0.00557, 1],
      [-0.00305, 1],
      [0.0267, 0],
      [0.03011, 0]
    ]
  },
  "QA_yonInjBpsurg": {
    "red_x_points": [
      [-0.00833, 1],
      [-0.00717, 1],
      [-0.00758, 1],
      [-0.00743, 1],
      [-0.00732, 1],
      [-0.00718, 1],
      [-0.00723, 1],
      [-0.00651, 1],
      [-0.00751, 1],
      [-0.00713, 1],
      [-0.00697, 1],
      [-0.00835, 1],
      [0.00796, 0],
      [-0.00751, 1],
      [-0.00697, 1],
      [-0.00742, 1],
      [-0.00537, 1],
      [-0.00728, 1],
      [-0.00771, 1],
      [-0.00743, 1],
      [-0.00579, 1],
      [-0.0054, 1],
      [-0.00729, 1],
      [-0.007, 1],
      [-0.00889, 1],
      [-0.00697, 1],
      [-0.00742, 1],
      [-0.00729, 1],
      [-0.00566, 1],
      [0.01599, 0],
      [-0.00708, 1]
    ],
    "red_o_points": [],
    "y_categories": ["N", "Y", "nan"],
    "blue_o_points": [],
    "blue_x_points": [
      [0.05531, 0],
      [-0.00087, 1],
      [0.01945, 0],
      [-0.00248, 1],
      [-0.00044, 1],
      [0.01929, 0],
      [0.02584, 0]
    ]
  },
  "QA_mulInjOrthesisType[ShoulderSupport]": {
    "red_x_points": [
      [-0.02692, 0],
      [-0.02397, 0],
      [-0.02431, 0],
      [-0.02456, 0],
      [-0.02435, 0],
      [-0.0243, 0],
      [-0.02442, 0],
      [-0.03088, 2],
      [-0.02395, 0],
      [-0.02345, 0],
      [-0.02456, 0],
      [-0.02624, 0],
      [0.06838, 1],
      [-0.02733, 0],
      [-0.0244, 0],
      [-0.02688, 0],
      [-0.02892, 2],
      [-0.02346, 0],
      [-0.02634, 0],
      [-0.02575, 0],
      [-0.03113, 2],
      [-0.02832, 3],
      [-0.02655, 0],
      [0.07269, 1],
      [-0.02709, 0],
      [-0.02454, 0],
      [-0.02674, 0],
      [-0.02261, 0],
      [-0.03158, 3],
      [-0.04419, 3],
      [-0.02362, 0]
    ],
    "red_o_points": [],
    "y_categories": ["N", "NOT APPLICABLE", "Y", "nan"],
    "blue_o_points": [],
    "blue_x_points": [
      [-0.012, 0],
      [0.07481, 1],
      [0.06104, 1],
      [0.07971, 1],
      [0.07605, 1],
      [0.0613, 1],
      [0.06561, 1]
    ]
  }
}
