{
  "QA_lstPexMuscstrength[ElbowFlex]": {
    "red_x_points": [
      [-0.00402, 1],
      [-0.00228, 2],
      [-0.00483, 1],
      [-0.00397, 1],
      [-0.00383, 1],
      [0.01139, 0],
      [-0.0047, 1],
      [-0.00527, 1],
      [-0.00387, 1],
      [-0.00491, 1],
      [-0.00526, 1],
      [-0.00614, 1],
      [-0.00409, 1],
      [-0.00285, 2],
      [-0.00338, 2],
      [-0.00401, 2],
      [-0.00374, 1],
      [-0.00311, 2],
      [-0.00421, 2],
      [-0.00395, 1],
      [-0.00378, 1],
      [-0.00312, 1],
      [-0.00389, 1],
      [-0.00353, 2],
      [0.00274, 0],
      [-0.00367, 1],
      [-0.00576, 1],
      [-0.00394, 1],
      [-0.00271, 2],
      [-0.00375, 1],
      [-0.00455, 1],
      [-0.00326, 2]
    ],
    "red_o_points": [],
    "y_categories": ["GREATER THAN OR EQUALS TO 3", "LESS THAN 3", "nan"],
    "blue_o_points": [],
    "blue_x_points": [
      [-8e-5, 2],
      [-0.00038, 2],
      [0.01093, 0],
      [0.00019, 1],
      [0.02848, 0],
      [0.01203, 0],
      [-0.00158, 1],
      [0.01346, 0],
      [0.00056, 1],
      [-0.00084, 1]
    ]
  },
  "participant_code": {
    "red_x_points": [
      [-0.04029, 1],
      [-0.03805, 2],
      [-0.04058, 3],
      [-0.03911, 4],
      [-0.03829, 5],
      [-0.03887, 6],
      [-0.0377, 7],
      [-0.03746, 8],
      [-0.03929, 9],
      [-0.03746, 10],
      [-0.03823, 11],
      [-0.03776, 12],
      [-0.03887, 13],
      [-0.03905, 15],
      [-0.03887, 17],
      [-0.03846, 18],
      [-0.03887, 20],
      [-0.03864, 21],
      [-0.03776, 22],
      [-0.03817, 24],
      [-0.0387, 26],
      [-0.03793, 27],
      [-0.0384, 28],
      [-0.03846, 30],
      [-0.0387, 31],
      [-0.03899, 32],
      [-0.03835, 34],
      [-0.03846, 36],
      [-0.03846, 38],
      [-0.0387, 39],
      [-0.03829, 40],
      [-0.0384, 41]
    ],
    "red_o_points": [],
    "y_categories": [
      "P16554",
      "P18297",
      "P19283",
      "P19287",
      "P23391",
      "P30595",
      "P31645",
      "P31691",
      "P34778",
      "P35046",
      "P36328",
      "P43633",
      "P4544",
      "P46417",
      "P48965",
      "P53068",
      "P5497",
      "P59529",
      "P62483",
      "P64658",
      "P65202",
      "P66816",
      "P6751",
      "P7408",
      "P75566",
      "P76226",
      "P79971",
      "P82621",
      "P82990",
      "P84549",
      "P84932",
      "P85825",
      "P86989",
      "P8770",
      "P87791",
      "P90550",
      "P93159",
      "P94969",
      "P96710",
      "P97130",
      "P9744",
      "P98500",
      "nan"
    ],
    "blue_o_points": [],
    "blue_x_points": [
      [0.07834, 0],
      [0.08031, 14],
      [0.07989, 16],
      [0.0806, 19],
      [0.07721, 23],
      [0.08003, 25],
      [0.07749, 29],
      [0.0806, 33],
      [0.08328, 35],
      [0.0813, 37]
    ]
  },
  "QS_mulLysisTrunk[Upper]": {
    "red_x_points": [
      [-0.00115, 3],
      [-0.00452, 0],
      [-0.0042, 0],
      [-0.00515, 0],
      [-0.00114, 3],
      [-0.00594, 0],
      [-0.01166, 2],
      [-0.00472, 0],
      [-0.0018, 3],
      [-0.00554, 0],
      [-0.00525, 0],
      [-0.00456, 0],
      [-0.00098, 3],
      [0.00851, 1],
      [-0.00111, 3],
      [-0.00565, 0],
      [-0.00101, 3],
      [-0.00941, 2],
      [-0.00198, 3],
      [-0.00152, 3],
      [-0.00093, 3],
      [-0.00144, 3],
      [-0.00414, 0],
      [-0.00106, 3],
      [-0.00243, 3],
      [-0.00128, 3],
      [-0.00475, 0],
      [-0.00412, 0],
      [0.00911, 1],
      [-0.00102, 3],
      [-0.01071, 2],
      [-0.00136, 3]
    ],
    "red_o_points": [],
    "y_categories": ["N", "NOT APPLICABLE", "Y", "nan"],
    "blue_o_points": [],
    "blue_x_points": [
      [0.0179, 1],
      [-5e-5, 3],
      [0.01219, 1],
      [0.00256, 0],
      [-0.00113, 0],
      [0.01246, 1],
      [-0.0006, 3],
      [0.01397, 1],
      [-0.00084, 3],
      [-5e-5, 3]
    ]
  },
  "QS_mulNeuromadSite[C5]": {
    "red_x_points": [
      [-0.0, 2],
      [-0.00021, 0],
      [-0.00011, 0],
      [-0.00017, 0],
      [-4e-5, 2],
      [-0.00016, 0],
      [-0.00017, 0],
      [-0.00023, 0],
      [-1e-5, 2],
      [-0.00024, 0],
      [-0.00023, 0],
      [-0.00014, 0],
      [-4e-5, 2],
      [0.0001, 1],
      [-2e-5, 2],
      [-0.00019, 0],
      [1e-5, 2],
      [-0.00016, 0],
      [0.0, 2],
      [-2e-5, 2],
      [2e-5, 2],
      [-5e-5, 2],
      [-2e-5, 0],
      [-2e-5, 2],
      [-5e-5, 2],
      [-5e-5, 2],
      [-0.00016, 0],
      [-0.00017, 0],
      [7e-5, 1],
      [2e-5, 2],
      [-0.00012, 0],
      [-2e-5, 2]
    ],
    "red_o_points": [],
    "y_categories": ["N", "NOT APPLICABLE", "nan"],
    "blue_o_points": [],
    "blue_x_points": [
      [0.00057, 1],
      [4e-5, 2],
      [0.00011, 1],
      [5e-5, 0],
      [-7e-5, 0],
      [8e-5, 1],
      [-5e-5, 2],
      [0.00053, 1],
      [0.0, 2],
      [1e-5, 2]
    ]
  },
  "QS_mulNeuromadSite[C7]": {
    "red_x_points": [
      [-8e-5, 2],
      [-0.00029, 0],
      [-0.00024, 0],
      [-0.00015, 0],
      [-3e-5, 2],
      [-0.00029, 0],
      [-0.00023, 0],
      [-0.00032, 0],
      [-5e-5, 2],
      [-0.00031, 0],
      [-0.00027, 0],
      [-0.00028, 0],
      [-0.00012, 2],
      [0.00042, 1],
      [-5e-5, 2],
      [-0.00033, 0],
      [-0.0001, 2],
      [-6e-5, 0],
      [-8e-5, 2],
      [-0.0001, 2],
      [-9e-5, 2],
      [-4e-5, 2],
      [-0.00027, 0],
      [-6e-5, 2],
      [-7e-5, 2],
      [-6e-5, 2],
      [-0.00033, 0],
      [-0.00024, 0],
      [7e-5, 1],
      [-0.0, 2],
      [-0.0003, 0],
      [-5e-5, 2]
    ],
    "red_o_points": [],
    "y_categories": ["N", "NOT APPLICABLE", "nan"],
    "blue_o_points": [],
    "blue_x_points": [
      [0.00124, 1],
      [-8e-5, 2],
      [0.00059, 1],
      [8e-5, 0],
      [-0.00015, 0],
      [0.00078, 1],
      [-2e-5, 2],
      [0.00045, 1],
      [1e-5, 2],
      [-1e-5, 2]
    ]
  },
  "QS_mulTransfSite[IMc]": {
    "red_x_points": [
      [-0.00127, 3],
      [-0.01072, 2],
      [-0.00395, 0],
      [-0.00389, 0],
      [-0.0014, 3],
      [-0.00436, 0],
      [-0.00374, 0],
      [-0.0041, 0],
      [-0.00125, 3],
      [-0.00388, 0],
      [-0.00437, 0],
      [-0.00359, 0],
      [-0.00139, 3],
      [0.00992, 1],
      [-0.00139, 3],
      [-0.00415, 0],
      [-0.00142, 3],
      [-0.00958, 2],
      [-0.00134, 3],
      [-0.00121, 3],
      [-0.00139, 3],
      [-0.0014, 3],
      [-0.00392, 0],
      [-0.00114, 3],
      [-0.00153, 3],
      [-0.00123, 3],
      [-0.00424, 0],
      [-0.00908, 2],
      [0.01103, 1],
      [-0.00121, 3],
      [-0.01004, 2],
      [-0.00175, 3]
    ],
    "red_o_points": [],
    "y_categories": ["N", "NOT APPLICABLE", "Y", "nan"],
    "blue_o_points": [],
    "blue_x_points": [
      [0.01668, 1],
      [-0.00061, 3],
      [0.01239, 1],
      [-0.0002, 0],
      [-0.00154, 0],
      [0.01211, 1],
      [-0.00049, 3],
      [0.01288, 1],
      [-0.00066, 3],
      [-0.00039, 3]
    ]
  },
  "QA_mulInjOrthesisType[ShoulderSupport]": {
    "red_x_points": [
      [-0.00776, 0],
      [-0.00767, 0],
      [-0.00829, 0],
      [-0.00838, 0],
      [-0.00724, 0],
      [-0.00858, 0],
      [-0.00821, 0],
      [-0.00813, 0],
      [-0.02425, 2],
      [-0.00928, 0],
      [-0.00816, 0],
      [-0.00821, 0],
      [-0.00797, 0],
      [0.01624, 1],
      [-0.00927, 0],
      [-0.00944, 0],
      [-0.00943, 0],
      [-0.01546, 2],
      [0.01687, 1],
      [-0.00651, 0],
      [-0.00776, 0],
      [-0.02654, 2],
      [-0.0045, 3],
      [-0.00929, 0],
      [0.01306, 1],
      [-0.00843, 0],
      [-0.00804, 0],
      [-0.00706, 0],
      [-0.01757, 3],
      [-0.00194, 3],
      [-0.00753, 0],
      [-0.00756, 0]
    ],
    "red_o_points": [],
    "y_categories": ["N", "NOT APPLICABLE", "Y", "nan"],
    "blue_o_points": [],
    "blue_x_points": [
      [0.00269, 0],
      [0.02903, 1],
      [0.01943, 1],
      [0.04336, 1],
      [-0.00504, 0],
      [0.02032, 1],
      [-0.0018, 0],
      [0.02051, 1],
      [-0.0024, 0],
      [0.01847, 3]
    ]
  },
  "QA_mulInjOrthesisType[ArmSling]": {
    "red_x_points": [
      [-0.00788, 2],
      [-0.00697, 2],
      [-0.00779, 2],
      [-0.00707, 2],
      [-0.00681, 2],
      [-0.00821, 2],
      [-0.00727, 2],
      [-0.00763, 2],
      [-0.00681, 2],
      [-0.00827, 2],
      [-0.00784, 2],
      [-0.0079, 2],
      [-0.00866, 2],
      [0.0148, 1],
      [-0.00792, 2],
      [-0.00841, 2],
      [-0.00865, 2],
      [-0.01315, 0],
      [0.01402, 1],
      [-0.00757, 2],
      [-0.00801, 2],
      [-0.02325, 0],
      [-0.00317, 3],
      [-0.00862, 2],
      [0.01153, 1],
      [-0.0075, 2],
      [-0.00742, 2],
      [-0.00656, 2],
      [-0.01775, 3],
      [-0.00071, 3],
      [-0.0071, 2],
      [-0.00717, 2]
    ],
    "red_o_points": [],
    "y_categories": ["N", "NOT APPLICABLE", "Y", "nan"],
    "blue_o_points": [],
    "blue_x_points": [
      [0.00373, 2],
      [0.02498, 1],
      [0.01713, 1],
      [0.04116, 1],
      [-0.00501, 2],
      [0.01812, 1],
      [-0.00274, 2],
      [0.01543, 1],
      [-0.00374, 2],
      [0.01542, 3]
    ]
  },
  "QA_lstPexPain[C5]": {
    "red_x_points": [
      [-0.00282, 1],
      [-0.00643, 2],
      [-0.00684, 2],
      [-0.00727, 2],
      [-0.00337, 1],
      [-0.0014, 1],
      [-0.00132, 1],
      [-0.00193, 1],
      [-0.00372, 1],
      [-0.00196, 1],
      [-0.00172, 1],
      [-0.00126, 1],
      [-0.00353, 1],
      [-0.02241, 2],
      [-0.00918, 2],
      [-0.00727, 2],
      [-0.0094, 2],
      [-0.00661, 2],
      [-0.00872, 2],
      [-0.00311, 1],
      [-0.00312, 1],
      [-0.00285, 1],
      [-0.00891, 2],
      [-0.00996, 2],
      [-0.00335, 1],
      [-0.01138, 2],
      [-0.00669, 2],
      [-0.0059, 2],
      [-0.00796, 1],
      [-0.00747, 1],
      [-0.0011, 1],
      [-0.00353, 1]
    ],
    "red_o_points": [],
    "y_categories": ["NORM", "NPV", "nan"],
    "blue_o_points": [],
    "blue_x_points": [
      [0.03221, 0],
      [-0.00411, 2],
      [-0.00027, 1],
      [-0.00057, 1],
      [-0.00071, 1],
      [-9e-5, 1],
      [-0.00172, 1],
      [0.02823, 0],
      [-0.00148, 1],
      [0.06151, 0]
    ]
  },
  "QS_mulNeuromadSite[C8]": {
    "red_x_points": [
      [-9e-5, 2],
      [-0.00216, 0],
      [-0.00207, 0],
      [-0.00206, 0],
      [-0.00032, 2],
      [-0.00277, 0],
      [-0.00226, 0],
      [-0.00241, 0],
      [-0.00027, 2],
      [-0.0024, 0],
      [-0.00275, 0],
      [-0.00223, 0],
      [-0.00029, 2],
      [0.00129, 1],
      [-0.00019, 2],
      [-0.0026, 0],
      [-0.00027, 2],
      [-0.00179, 0],
      [-4e-5, 2],
      [-0.00017, 2],
      [-0.00015, 2],
      [-0.00033, 2],
      [-0.00171, 0],
      [-0.00039, 2],
      [-0.00087, 2],
      [-0.00027, 2],
      [-0.00176, 0],
      [-0.00166, 0],
      [0.00227, 1],
      [-0.00022, 2],
      [-0.00209, 0],
      [-0.00042, 2]
    ],
    "red_o_points": [],
    "y_categories": ["N", "NOT APPLICABLE", "nan"],
    "blue_o_points": [],
    "blue_x_points": [
      [0.00556, 1],
      [0.0004, 2],
      [0.00428, 1],
      [0.00121, 0],
      [-0.00062, 0],
      [0.00495, 1],
      [-7e-5, 2],
      [0.00472, 1],
      [0.00013, 2],
      [-3e-5, 2]
    ]
  },
  "QS_mulTransfSite[AcSsPA]": {
    "red_x_points": [
      [-6e-5, 3],
      [-0.00048, 0],
      [-0.00048, 0],
      [-0.0007, 0],
      [-7e-5, 3],
      [-0.00064, 0],
      [-0.00074, 0],
      [-0.00059, 0],
      [-5e-5, 3],
      [-0.00082, 0],
      [-0.00056, 0],
      [-0.00062, 0],
      [-7e-5, 3],
      [0.00106, 1],
      [-0.0001, 3],
      [-0.00069, 0],
      [-0.0001, 3],
      [-0.00169, 2],
      [-8e-5, 3],
      [-8e-5, 3],
      [-3e-5, 3],
      [-6e-5, 3],
      [-0.00063, 0],
      [-0.00016, 3],
      [-3e-5, 3],
      [-0.00012, 3],
      [-0.0006, 0],
      [-0.00051, 0],
      [0.00137, 1],
      [-0.00016, 3],
      [-0.00049, 0],
      [-2e-5, 3]
    ],
    "red_o_points": [],
    "y_categories": ["N", "NOT APPLICABLE", "Y", "nan"],
    "blue_o_points": [],
    "blue_x_points": [
      [0.00151, 1],
      [1e-5, 3],
      [0.0012, 1],
      [-3e-5, 0],
      [-0.00042, 0],
      [0.00152, 1],
      [-6e-5, 3],
      [0.0013, 1],
      [-4e-5, 3],
      [-1e-5, 3]
    ]
  },
  "QA_lstPexKine[Shoulder]": {
    "red_x_points": [
      [-0.00191, 1],
      [-0.00329, 2],
      [-0.00449, 2],
      [-0.00393, 2],
      [-0.00881, 2],
      [-0.00611, 1],
      [-0.00318, 1],
      [0.00693, 0],
      [-0.01028, 2],
      [-0.00244, 1],
      [-0.00363, 1],
      [-0.00417, 1],
      [-0.0038, 1],
      [-0.00151, 2],
      [-0.00712, 2],
      [-0.00289, 1],
      [-0.0081, 2],
      [-0.00247, 2],
      [-0.0069, 2],
      [-0.00385, 1],
      [-0.00189, 1],
      [-0.00413, 1],
      [-0.00331, 2],
      [-0.00755, 2],
      [-0.0028, 1],
      [-0.01004, 2],
      [-0.00793, 2],
      [-0.00404, 2],
      [-0.00166, 2],
      [-0.00676, 2],
      [-0.00132, 1],
      [-0.00828, 2]
    ],
    "red_o_points": [],
    "y_categories": ["NPV", "PV", "nan"],
    "blue_o_points": [],
    "blue_x_points": [
      [-0.00012, 1],
      [-0.00334, 2],
      [-0.00023, 1],
      [0.00027, 1],
      [0.03323, 0],
      [-0.00026, 1],
      [0.05872, 0],
      [-0.00064, 2],
      [0.00038, 1],
      [0.00037, 1]
    ]
  },
  "QA_lstPexPain[T1]": {
    "red_x_points": [
      [-0.01082, 1],
      [-0.00238, 2],
      [-0.00393, 2],
      [-0.00285, 2],
      [-0.01245, 1],
      [-0.00856, 0],
      [0.00098, 1],
      [0.00292, 1],
      [0.0091, 0],
      [0.00324, 1],
      [-0.00362, 0],
      [-0.00957, 0],
      [0.01029, 0],
      [-0.01731, 2],
      [-0.00713, 2],
      [-0.00454, 2],
      [-0.00561, 2],
      [-0.00134, 2],
      [-0.00619, 2],
      [0.00887, 0],
      [-0.01199, 1],
      [0.00924, 0],
      [-0.00449, 2],
      [-0.00646, 2],
      [-0.01302, 1],
      [-0.00674, 2],
      [-0.00601, 2],
      [-0.00233, 2],
      [-0.008, 1],
      [-0.01439, 1],
      [0.00021, 1],
      [-0.01301, 1]
    ],
    "red_o_points": [],
    "y_categories": ["NORM", "NPV", "nan"],
    "blue_o_points": [],
    "blue_x_points": [
      [-0.0005, 1],
      [-0.00152, 2],
      [0.00742, 0],
      [0.00918, 1],
      [0.01436, 1],
      [-0.00025, 1],
      [0.01502, 0],
      [0.00859, 0],
      [0.01439, 0],
      [0.01926, 0]
    ]
  },
  "QA_equInjTbpiTime": {
    "red_x_points": [
      [-0.0013, 0],
      [-0.00328, 0],
      [0.00825, 3],
      [-0.00437, 0],
      [-0.00566, 1],
      [-0.01092, 0],
      [-0.00846, 1],
      [-0.00594, 0],
      [0.00216, 3],
      [-0.00725, 0],
      [-0.00774, 0],
      [0.01434, 3],
      [-0.0023, 0],
      [-0.04942, 2],
      [-0.00072, 3],
      [-0.00665, 0],
      [0.00015, 0],
      [-0.00232, 0],
      [-0.02107, 1],
      [0.0005, 3],
      [-0.00145, 0],
      [-0.00658, 1],
      [-0.0089, 2],
      [-0.00029, 3],
      [-0.0168, 1],
      [-0.01772, 2],
      [-0.00802, 0],
      [-0.00842, 2],
      [0.00127, 0],
      [0.00113, 0],
      [0.00633, 3],
      [-0.00624, 1]
    ],
    "red_o_points": [],
    "y_categories": [
      "0 TO 6 MONTHS",
      "13 TO 24 MONTHS",
      "25 MONTHS OR MORE",
      "7 TO 12 MONTHS",
      "nan"
    ],
    "blue_o_points": [],
    "blue_x_points": [
      [0.00445, 0],
      [0.01179, 0],
      [0.00523, 0],
      [0.02203, 3],
      [0.0222, 3],
      [0.00595, 0],
      [0.00551, 1],
      [0.01543, 3],
      [0.01038, 3],
      [0.00658, 0]
    ]
  },
  "QS_mulTransfSite[AcSsAA]": {
    "red_x_points": [
      [-0.00272, 3],
      [-0.0183, 2],
      [-0.0046, 0],
      [-0.0177, 2],
      [-0.00264, 3],
      [-0.02412, 2],
      [-0.0038, 0],
      [-0.00498, 0],
      [-0.00273, 3],
      [-0.00393, 0],
      [-0.02083, 2],
      [-0.00377, 0],
      [-0.00299, 3],
      [0.02116, 1],
      [-0.00295, 3],
      [-0.01963, 2],
      [-0.0029, 3],
      [-0.00421, 0],
      [-0.00278, 3],
      [-0.00296, 3],
      [-0.00268, 3],
      [-0.00264, 3],
      [-0.01737, 2],
      [-0.00278, 3],
      [-0.00333, 3],
      [-0.00284, 3],
      [-0.00417, 0],
      [-0.01812, 2],
      [0.02107, 1],
      [-0.00234, 3],
      [-0.0041, 0],
      [-0.00297, 3]
    ],
    "red_o_points": [],
    "y_categories": ["N", "NOT APPLICABLE", "Y", "nan"],
    "blue_o_points": [],
    "blue_x_points": [
      [0.03117, 1],
      [-0.00116, 3],
      [0.02245, 1],
      [0.00245, 0],
      [0.00274, 0],
      [0.02398, 1],
      [-0.0015, 3],
      [0.02391, 1],
      [-0.00112, 3],
      [-0.00061, 3]
    ]
  },
  "QA_lstPexTouch[T1]": {
    "red_x_points": [
      [-0.01443, 1],
      [-0.00196, 2],
      [0.0011, 1],
      [-0.00192, 2],
      [-0.01472, 1],
      [-0.01053, 0],
      [0.0024, 1],
      [0.0019, 1],
      [-0.01541, 1],
      [-0.00617, 0],
      [-0.00505, 0],
      [-0.01015, 0],
      [0.01207, 0],
      [-0.01175, 2],
      [-0.00828, 2],
      [-0.00453, 2],
      [-0.01537, 1],
      [-0.00141, 2],
      [-0.00885, 2],
      [0.01174, 0],
      [-0.01492, 1],
      [0.01234, 0],
      [-0.00456, 2],
      [-0.00811, 2],
      [-0.01639, 1],
      [0.01198, 0],
      [0.00408, 1],
      [-0.00223, 2],
      [-0.00464, 1],
      [-0.00943, 2],
      [0.00011, 1],
      [-0.01581, 1]
    ],
    "red_o_points": [],
    "y_categories": ["NORM", "NPV", "nan"],
    "blue_o_points": [],
    "blue_x_points": [
      [0.00042, 1],
      [0.00105, 2],
      [0.00122, 1],
      [0.00966, 1],
      [0.01347, 1],
      [0.00063, 1],
      [0.02027, 0],
      [0.00743, 0],
      [0.01552, 0],
      [0.02444, 0]
    ]
  },
  "QS_mulLysisRoot[C5]": {
    "red_x_points": [
      [-0.00058, 3],
      [-0.00179, 0],
      [-0.00677, 2],
      [-0.00172, 0],
      [-0.00055, 3],
      [-0.00195, 0],
      [-0.00127, 0],
      [-0.00194, 0],
      [-0.00109, 3],
      [-0.00177, 0],
      [-0.00209, 0],
      [-0.00079, 0],
      [-0.00056, 3],
      [0.00315, 1],
      [-0.00092, 3],
      [-0.00191, 0],
      [-0.00058, 3],
      [-0.00148, 0],
      [-0.00046, 3],
      [-0.00086, 3],
      [-0.00044, 3],
      [-0.0003, 3],
      [-0.00129, 0],
      [-0.0009, 3],
      [-0.00072, 3],
      [-0.00043, 3],
      [-0.00174, 0],
      [-0.00151, 0],
      [0.00362, 1],
      [-0.0003, 3],
      [-0.00496, 2],
      [-0.00076, 3]
    ],
    "red_o_points": [],
    "y_categories": ["N", "NOT APPLICABLE", "Y", "nan"],
    "blue_o_points": [],
    "blue_x_points": [
      [0.00711, 1],
      [-9e-5, 3],
      [0.00399, 1],
      [0.00147, 0],
      [0.00094, 0],
      [0.00467, 1],
      [-0.00025, 3],
      [0.00491, 1],
      [-0.00054, 3],
      [-8e-5, 3]
    ]
  },
  "QS_mulNeuromadSite[C6]": {
    "red_x_points": [
      [3e-5, 2],
      [-0.00012, 0],
      [-0.00017, 0],
      [-0.00023, 0],
      [-2e-5, 2],
      [-0.00017, 0],
      [-0.00018, 0],
      [-0.00024, 0],
      [-1e-5, 2],
      [-0.00032, 0],
      [-0.00032, 0],
      [-0.0002, 0],
      [1e-5, 2],
      [0.00021, 1],
      [-1e-5, 2],
      [-0.00035, 0],
      [-1e-5, 2],
      [-0.00019, 0],
      [-0.00016, 2],
      [-0.0, 2],
      [1e-5, 2],
      [0.0, 2],
      [-9e-5, 0],
      [-2e-5, 2],
      [-0.00016, 2],
      [1e-5, 2],
      [-3e-5, 0],
      [-0.00015, 0],
      [0.00039, 1],
      [-1e-5, 2],
      [-0.00021, 0],
      [-0.0, 2]
    ],
    "red_o_points": [],
    "y_categories": ["N", "NOT APPLICABLE", "nan"],
    "blue_o_points": [],
    "blue_x_points": [
      [0.00063, 1],
      [0.0, 2],
      [0.00039, 1],
      [-0.0, 0],
      [-8e-5, 0],
      [0.00046, 1],
      [1e-5, 2],
      [0.00044, 1],
      [1e-5, 2],
      [-2e-5, 2]
    ]
  },
  "QS_lstBpsurgSide": {
    "red_x_points": [
      [-0.00098, 3],
      [-0.00686, 0],
      [-0.00817, 0],
      [-0.00795, 0],
      [-0.00132, 3],
      [-0.00917, 2],
      [-0.00915, 0],
      [-0.00995, 0],
      [-0.00179, 3],
      [-0.00876, 0],
      [-0.00745, 2],
      [-0.00783, 2],
      [-0.00143, 3],
      [0.01124, 1],
      [-0.00163, 3],
      [-0.00981, 2],
      [-0.00181, 3],
      [-0.00771, 2],
      [-0.00155, 3],
      [-0.00157, 3],
      [-0.00102, 3],
      [-0.00134, 3],
      [-0.00695, 0],
      [-0.00156, 3],
      [-0.00176, 3],
      [-0.00143, 3],
      [-0.00677, 2],
      [-0.00535, 2],
      [0.01225, 1],
      [-0.00108, 3],
      [-0.00761, 0],
      [-0.00169, 3]
    ],
    "red_o_points": [],
    "y_categories": ["L", "NOT APPLICABLE", "R", "nan"],
    "blue_o_points": [],
    "blue_x_points": [
      [0.01862, 1],
      [-0.0003, 3],
      [0.01504, 1],
      [0.00466, 0],
      [0.00146, 2],
      [0.01649, 1],
      [-0.0006, 3],
      [0.01671, 1],
      [-0.00037, 3],
      [-0.0004, 3]
    ]
  },
  "QS_mulNeuromadSite[T1]": {
    "red_x_points": [
      [-9e-5, 2],
      [-0.00044, 0],
      [-0.00032, 0],
      [-0.00039, 0],
      [-0.00011, 2],
      [-0.00062, 0],
      [-0.00026, 0],
      [-0.00052, 0],
      [-0.00026, 2],
      [-0.00047, 0],
      [-0.00051, 0],
      [-0.00035, 0],
      [-0.00015, 2],
      [0.00052, 1],
      [-0.00011, 2],
      [-0.00066, 0],
      [-0.00021, 2],
      [-0.0005, 0],
      [-9e-5, 2],
      [-0.00015, 2],
      [-4e-5, 2],
      [-8e-5, 2],
      [-0.00012, 0],
      [-0.00012, 2],
      [-0.00011, 2],
      [-0.00011, 2],
      [-0.00038, 0],
      [-0.00026, 0],
      [0.0007, 1],
      [-0.0001, 2],
      [-0.00037, 0],
      [-0.00012, 2]
    ],
    "red_o_points": [],
    "y_categories": ["N", "NOT APPLICABLE", "nan"],
    "blue_o_points": [],
    "blue_x_points": [
      [0.00184, 1],
      [0.0001, 2],
      [0.00072, 1],
      [-6e-5, 0],
      [-0.00026, 0],
      [0.00114, 1],
      [-8e-5, 2],
      [0.00148, 1],
      [-4e-5, 2],
      [-2e-5, 2]
    ]
  },
  "QA_yonInjUnconscio": {
    "red_x_points": [
      [-0.00798, 1],
      [-0.00845, 1],
      [-0.00707, 2],
      [-0.00503, 2],
      [-0.00664, 2],
      [0.02443, 0],
      [-0.01071, 1],
      [-0.00746, 2],
      [-0.00795, 2],
      [-0.00866, 2],
      [-0.00686, 2],
      [-0.01381, 1],
      [-0.01026, 1],
      [-0.02518, 1],
      [-0.00999, 2],
      [-0.00648, 2],
      [-0.00825, 2],
      [-0.00821, 1],
      [0.00418, 0],
      [-0.01098, 1],
      [-0.0084, 1],
      [-0.00985, 1],
      [-0.00864, 1],
      [-0.01021, 2],
      [-0.00923, 1],
      [-0.00812, 2],
      [-0.01105, 1],
      [-0.00809, 1],
      [-0.00255, 2],
      [-0.00657, 2],
      [-0.00948, 1],
      [-0.00778, 2]
    ],
    "red_o_points": [],
    "y_categories": ["N", "Y", "nan"],
    "blue_o_points": [],
    "blue_x_points": [
      [0.0003, 2],
      [0.0138, 1],
      [0.02218, 0],
      [0.03888, 0],
      [0.0346, 0],
      [0.00089, 2],
      [-0.00173, 1],
      [0.00083, 2],
      [0.04352, 0],
      [-0.00102, 2]
    ]
  },
  "QA_lstPexTouch[C7]": {
    "red_x_points": [
      [-0.0104, 1],
      [-0.00271, 2],
      [-0.00318, 1],
      [-0.00269, 2],
      [-0.00891, 1],
      [0.00355, 0],
      [-0.00349, 1],
      [-0.00477, 1],
      [0.00698, 0],
      [-0.00367, 1],
      [0.00467, 0],
      [-0.00388, 1],
      [-0.01488, 1],
      [-0.01027, 2],
      [-0.005, 2],
      [-0.00317, 2],
      [-0.01078, 1],
      [-0.00225, 2],
      [-0.00651, 2],
      [0.00951, 0],
      [-0.01074, 1],
      [0.00728, 0],
      [-0.00281, 2],
      [-0.0053, 2],
      [0.00365, 0],
      [0.0077, 0],
      [-0.0041, 1],
      [-0.00266, 2],
      [-0.00328, 1],
      [-0.0047, 2],
      [-0.0034, 1],
      [-0.00965, 1]
    ],
    "red_o_points": [],
    "y_categories": ["NORM", "NPV", "nan"],
    "blue_o_points": [],
    "blue_x_points": [
      [-0.00017, 1],
      [-0.00071, 2],
      [0.00152, 1],
      [0.00196, 1],
      [0.01354, 0],
      [0.00117, 1],
      [0.01293, 0],
      [0.00564, 0],
      [0.01118, 0],
      [0.01373, 0]
    ]
  },
  "QA_lstPexMuscstrength[ShoulderAbduc]": {
    "red_x_points": [
      [-0.00462, 1],
      [-0.00383, 1],
      [-0.00375, 1],
      [-0.00429, 1],
      [-0.00457, 1],
      [-0.00486, 1],
      [-0.00455, 1],
      [-0.00442, 1],
      [-0.00443, 1],
      [-0.00451, 1],
      [-0.00481, 1],
      [-0.00437, 1],
      [-0.00471, 1],
      [0.00158, 2],
      [0.00169, 2],
      [0.00152, 2],
      [0.00176, 2],
      [0.00162, 2],
      [0.00167, 2],
      [-0.00449, 1],
      [-0.00468, 1],
      [-0.00438, 1],
      [-0.00441, 1],
      [0.00148, 2],
      [-0.00698, 1],
      [-0.00381, 1],
      [-0.00431, 1],
      [-0.00361, 1],
      [0.00232, 2],
      [-0.00462, 1],
      [-0.00426, 1],
      [0.00241, 2]
    ],
    "red_o_points": [],
    "y_categories": ["GREATER THAN OR EQUALS TO 3", "LESS THAN 3", "nan"],
    "blue_o_points": [],
    "blue_x_points": [
      [0.00188, 2],
      [0.00229, 2],
      [0.02481, 0],
      [0.00352, 2],
      [-0.00332, 1],
      [0.02205, 0],
      [0.00332, 2],
      [-0.00169, 1],
      [-0.00248, 1],
      [-0.00239, 1]
    ]
  },
  "QA_lstPexMuscstrength[ThumbOppo]": {
    "red_x_points": [
      [-0.00691, 1],
      [0.00081, 2],
      [-0.00566, 1],
      [-0.00482, 1],
      [-0.00808, 1],
      [0.00128, 0],
      [0.0016, 0],
      [-0.00792, 1],
      [0.001, 0],
      [0.00113, 0],
      [0.00108, 0],
      [0.00158, 0],
      [0.00091, 0],
      [0.00087, 2],
      [0.00125, 2],
      [0.00088, 2],
      [0.00102, 0],
      [0.00105, 2],
      [0.00126, 2],
      [0.00083, 0],
      [-0.00743, 1],
      [0.0011, 0],
      [-0.00457, 1],
      [0.00111, 2],
      [0.00169, 2],
      [0.0015, 2],
      [0.00126, 0],
      [-0.00443, 1],
      [0.00129, 2],
      [-0.00705, 1],
      [-0.006, 1],
      [0.00079, 2]
    ],
    "red_o_points": [],
    "y_categories": ["GREATER THAN OR EQUALS TO 3", "LESS THAN 3", "nan"],
    "blue_o_points": [],
    "blue_x_points": [
      [0.00071, 2],
      [0.00191, 2],
      [0.00138, 0],
      [0.00384, 2],
      [0.00315, 0],
      [0.00131, 0],
      [0.00354, 0],
      [0.0014, 0],
      [0.00273, 2],
      [0.00323, 2]
    ]
  },
  "QA_yonInjBpsurg": {
    "red_x_points": [
      [-0.00227, 1],
      [-0.0018, 1],
      [-0.0021, 1],
      [-0.00197, 1],
      [-0.00204, 1],
      [-0.00262, 1],
      [-0.00167, 1],
      [-0.00218, 1],
      [-0.00213, 1],
      [-0.00198, 1],
      [-0.00207, 1],
      [-0.00195, 1],
      [-0.00237, 1],
      [0.00301, 0],
      [-0.00228, 1],
      [-0.0021, 1],
      [-0.00226, 1],
      [-0.0014, 1],
      [-0.00208, 1],
      [-0.00214, 1],
      [-0.00179, 1],
      [-0.0017, 1],
      [-0.00128, 1],
      [-0.00234, 1],
      [-0.00226, 1],
      [-0.00238, 1],
      [-0.00166, 1],
      [-0.00155, 1],
      [0.00456, 0],
      [-0.00195, 1],
      [-0.00187, 1],
      [-0.00214, 1]
    ],
    "red_o_points": [],
    "y_categories": ["N", "Y", "nan"],
    "blue_o_points": [],
    "blue_x_points": [
      [0.01077, 0],
      [0.00018, 1],
      [0.00725, 0],
      [-0.00151, 1],
      [-0.00183, 1],
      [0.00795, 0],
      [-0.00096, 1],
      [0.00819, 0],
      [-0.00105, 1],
      [-0.00035, 1]
    ]
  },
  "QS_mulNeuromadSite[T2]": {
    "red_x_points": [
      [-3e-5, 2],
      [-0.00141, 0],
      [-0.00132, 0],
      [-0.00131, 0],
      [-9e-5, 2],
      [-0.00152, 0],
      [-0.00134, 0],
      [-0.00149, 0],
      [-0.00017, 2],
      [-0.00156, 0],
      [-0.00131, 0],
      [-0.00141, 0],
      [-2e-5, 2],
      [0.0012, 1],
      [-6e-5, 2],
      [-0.00181, 0],
      [-6e-5, 2],
      [-0.0011, 0],
      [-0.0005, 2],
      [-9e-5, 2],
      [0.0, 2],
      [-0.00015, 2],
      [-0.00138, 0],
      [-6e-5, 2],
      [-0.00032, 2],
      [-6e-5, 2],
      [-0.00118, 0],
      [-0.00097, 0],
      [0.00192, 1],
      [-0.0, 2],
      [-0.00152, 0],
      [-0.00015, 2]
    ],
    "red_o_points": [],
    "y_categories": ["N", "NOT APPLICABLE", "nan"],
    "blue_o_points": [],
    "blue_x_points": [
      [0.00467, 1],
      [3e-5, 2],
      [0.00213, 1],
      [0.00054, 0],
      [-0.00033, 0],
      [0.00289, 1],
      [6e-5, 2],
      [0.00191, 1],
      [2e-5, 2],
      [0.00038, 2]
    ]
  },
  "QS_mulTransfSite[Other]": {
    "red_x_points": [
      [-0.00284, 3],
      [-0.01738, 0],
      [-0.01805, 0],
      [-0.01808, 0],
      [-0.00327, 3],
      [-0.01863, 0],
      [-0.01823, 0],
      [-0.0179, 0],
      [-0.00341, 3],
      [-0.01917, 0],
      [-0.01865, 0],
      [-0.01902, 0],
      [-0.00285, 3],
      [0.02594, 1],
      [-0.00313, 3],
      [-0.01883, 0],
      [-0.00332, 3],
      [-0.01747, 0],
      [-0.0036, 3],
      [-0.00298, 3],
      [-0.00286, 3],
      [-0.00282, 3],
      [-0.01704, 0],
      [-0.00315, 3],
      [-0.00352, 3],
      [-0.00301, 3],
      [-0.0178, 0],
      [-0.01759, 0],
      [0.02623, 1],
      [-0.00269, 3],
      [-0.01776, 0],
      [-0.00317, 3]
    ],
    "red_o_points": [],
    "y_categories": ["N", "NOT APPLICABLE", "Y", "nan"],
    "blue_o_points": [],
    "blue_x_points": [
      [0.03166, 1],
      [-0.00129, 3],
      [0.02667, 1],
      [-0.00758, 0],
      [0.06175, 2],
      [0.02903, 1],
      [-0.00152, 3],
      [0.02822, 1],
      [-0.00111, 3],
      [-0.00083, 3]
    ]
  },
  "QS_mulBpsurgeryType[Lysis]": {
    "red_x_points": [
      [-0.0017, 3],
      [-0.00614, 0],
      [-0.01499, 2],
      [-0.00639, 0],
      [-0.00195, 3],
      [-0.00757, 0],
      [-0.01542, 2],
      [-0.00548, 0],
      [-0.00269, 3],
      [-0.00604, 0],
      [-0.00715, 0],
      [-0.00485, 0],
      [-0.00145, 3],
      [0.01255, 1],
      [-0.0024, 3],
      [-0.00671, 0],
      [-0.00183, 3],
      [-0.01343, 2],
      [-0.00193, 3],
      [-0.00185, 3],
      [-0.00173, 3],
      [-0.00135, 3],
      [-0.00529, 0],
      [-0.00228, 3],
      [-0.00241, 3],
      [-0.00155, 3],
      [-0.0057, 0],
      [-0.00536, 0],
      [0.01511, 1],
      [-0.0017, 3],
      [-0.01432, 2],
      [-0.0022, 3]
    ],
    "red_o_points": [],
    "y_categories": ["N", "NOT APPLICABLE", "Y", "nan"],
    "blue_o_points": [],
    "blue_x_points": [
      [0.02173, 1],
      [-0.00023, 3],
      [0.01674, 1],
      [0.00232, 0],
      [0.00118, 0],
      [0.01876, 1],
      [-0.00094, 3],
      [0.01844, 1],
      [-0.00049, 3],
      [-0.00055, 3]
    ]
  },
  "QS_mulLysisSite[Trunk]": {
    "red_x_points": [
      [-0.00077, 3],
      [-0.00301, 0],
      [-0.00286, 0],
      [-0.00353, 0],
      [-0.00085, 3],
      [-0.00345, 0],
      [-0.00841, 2],
      [-0.00296, 0],
      [-0.00126, 3],
      [-0.0028, 0],
      [-0.00314, 0],
      [-0.00263, 0],
      [-0.0011, 3],
      [0.00667, 1],
      [-0.0009, 3],
      [-0.00326, 0],
      [-0.0013, 3],
      [-0.0063, 2],
      [-0.00129, 3],
      [-0.00124, 3],
      [-0.00096, 3],
      [-0.00109, 3],
      [-0.00297, 0],
      [-0.00098, 3],
      [-0.0013, 3],
      [-0.00079, 3],
      [-0.00301, 0],
      [-0.00266, 0],
      [0.0066, 1],
      [-0.00081, 3],
      [-0.00767, 2],
      [-0.00093, 3]
    ],
    "red_o_points": [],
    "y_categories": ["N", "NOT APPLICABLE", "Y", "nan"],
    "blue_o_points": [],
    "blue_x_points": [
      [0.01148, 1],
      [-0.00054, 3],
      [0.00919, 1],
      [0.00059, 0],
      [-0.00051, 0],
      [0.00864, 1],
      [-0.00067, 3],
      [0.00878, 1],
      [-0.00046, 3],
      [-0.00013, 3]
    ]
  },
  "QS_mulNeuromadSite[C4]": {
    "red_x_points": [
      [-8e-5, 2],
      [-0.00085, 0],
      [-0.00066, 0],
      [-0.00072, 0],
      [-0.00015, 2],
      [-0.00072, 0],
      [-0.00069, 0],
      [-0.00052, 0],
      [-0.00017, 2],
      [-0.00066, 0],
      [-0.00056, 0],
      [-0.00059, 0],
      [-0.00014, 2],
      [0.00065, 1],
      [-0.00013, 2],
      [-0.00061, 0],
      [-2e-5, 2],
      [-0.00067, 0],
      [-0.00035, 2],
      [-6e-5, 2],
      [-8e-5, 2],
      [-0.00012, 2],
      [-0.00056, 0],
      [-0.0002, 2],
      [-0.00042, 2],
      [-0.00011, 2],
      [-0.00061, 0],
      [-0.00063, 0],
      [0.00055, 1],
      [-0.00018, 2],
      [-0.00046, 0],
      [-0.00026, 2]
    ],
    "red_o_points": [],
    "y_categories": ["N", "NOT APPLICABLE", "nan"],
    "blue_o_points": [],
    "blue_x_points": [
      [0.00264, 1],
      [-0.00013, 2],
      [0.00141, 1],
      [0.00038, 0],
      [-0.00022, 0],
      [0.00155, 1],
      [-4e-5, 2],
      [0.00078, 1],
      [-5e-5, 2],
      [-8e-5, 2]
    ]
  },
  "QS_mulGraftTrunk[UpperTrunk]": {
    "red_x_points": [
      [-6e-5, 3],
      [-0.00033, 0],
      [-0.00048, 0],
      [-0.00059, 0],
      [-0.00014, 3],
      [-0.00069, 0],
      [-0.00048, 0],
      [-0.00051, 0],
      [-5e-5, 3],
      [-0.00055, 0],
      [-0.00068, 0],
      [-0.00045, 0],
      [-8e-5, 3],
      [0.00102, 1],
      [-0.00019, 3],
      [-0.00245, 2],
      [-0.00021, 3],
      [-0.00041, 0],
      [-7e-5, 3],
      [-5e-5, 3],
      [-0.0001, 3],
      [-8e-5, 3],
      [-0.00055, 0],
      [-0.0001, 3],
      [-0.00014, 3],
      [-0.0001, 3],
      [-0.00063, 0],
      [-0.00056, 0],
      [0.00083, 1],
      [-3e-5, 3],
      [-0.00058, 0],
      [-0.00023, 3]
    ],
    "red_o_points": [],
    "y_categories": ["N", "NOT APPLICABLE", "Y", "nan"],
    "blue_o_points": [],
    "blue_x_points": [
      [0.00186, 1],
      [-9e-5, 3],
      [0.00175, 1],
      [0.00047, 0],
      [-0.00036, 0],
      [0.00158, 1],
      [-1e-5, 3],
      [0.00146, 1],
      [-3e-5, 3],
      [-7e-5, 3]
    ]
  },
  "QS_mulTransfSite[PhMc]": {
    "red_x_points": [
      [-0.00042, 3],
      [-0.00184, 0],
      [-0.00154, 0],
      [-0.00149, 0],
      [-0.00048, 3],
      [-0.00213, 0],
      [-0.00158, 0],
      [-0.00882, 2],
      [-0.00066, 3],
      [-0.00148, 0],
      [-0.00198, 0],
      [-0.00172, 0],
      [-0.00048, 3],
      [0.00252, 1],
      [-0.00049, 3],
      [-0.00178, 0],
      [-0.00051, 3],
      [-0.00138, 0],
      [-0.00058, 3],
      [-0.00052, 3],
      [-0.00041, 3],
      [-0.0005, 3],
      [-0.00344, 2],
      [-0.00055, 3],
      [-0.00109, 3],
      [-0.00041, 3],
      [-0.00135, 0],
      [-0.00161, 0],
      [0.00364, 1],
      [-0.00039, 3],
      [-0.00151, 0],
      [-0.00062, 3]
    ],
    "red_o_points": [],
    "y_categories": ["N", "NOT APPLICABLE", "Y", "nan"],
    "blue_o_points": [],
    "blue_x_points": [
      [0.00608, 1],
      [-0.0001, 3],
      [0.00425, 1],
      [0.0009, 0],
      [0.00059, 0],
      [0.0051, 1],
      [7e-5, 3],
      [0.00562, 1],
      [-0.00017, 3],
      [-0.00013, 3]
    ]
  },
  "QS_mulTransfSite[Oberlin]": {
    "red_x_points": [
      [-0.0028, 3],
      [-0.02151, 0],
      [-0.02286, 0],
      [-0.02178, 0],
      [-0.00289, 3],
      [-0.00622, 2],
      [-0.00455, 2],
      [-0.02341, 0],
      [-0.0034, 3],
      [-0.00515, 2],
      [-0.00576, 2],
      [-0.0044, 2],
      [-0.00272, 3],
      [0.02447, 1],
      [-0.00324, 3],
      [-0.00516, 2],
      [-0.00248, 3],
      [-0.02111, 0],
      [-0.00385, 3],
      [-0.00322, 3],
      [-0.00284, 3],
      [-0.00286, 3],
      [-0.02084, 0],
      [-0.00334, 3],
      [-0.00374, 3],
      [-0.00287, 3],
      [-0.00464, 2],
      [-0.0216, 0],
      [0.02734, 1],
      [-0.00218, 3],
      [-0.0222, 0],
      [-0.00296, 3]
    ],
    "red_o_points": [],
    "y_categories": ["N", "NOT APPLICABLE", "Y", "nan"],
    "blue_o_points": [],
    "blue_x_points": [
      [0.03425, 1],
      [-0.00045, 3],
      [0.03056, 1],
      [0.0041, 2],
      [0.00153, 2],
      [0.02802, 1],
      [-0.00106, 3],
      [0.03044, 1],
      [-0.00191, 3],
      [-0.00044, 3]
    ]
  },
  "QA_mulInjTbpiCause[Motorcycle]": {
    "red_x_points": [
      [-0.00262, 0],
      [-0.00097, 1],
      [-0.00089, 1],
      [-0.00089, 1],
      [-0.00044, 1],
      [-0.00111, 1],
      [-0.00052, 1],
      [-0.00095, 1],
      [0.00145, 1],
      [-0.0009, 1],
      [-0.00062, 1],
      [-0.00034, 1],
      [-0.01088, 0],
      [-0.04806, 1],
      [-0.00085, 1],
      [-0.0015, 1],
      [-0.00042, 1],
      [-0.00092, 1],
      [-0.00108, 1],
      [-0.01535, 0],
      [0.00027, 1],
      [0.00329, 1],
      [-0.00034, 1],
      [-0.00072, 1],
      [-0.00062, 1],
      [-0.00932, 0],
      [-0.00056, 1],
      [-0.00037, 1],
      [-0.04821, 1],
      [-0.00018, 1],
      [-0.00039, 1],
      [-0.00096, 1]
    ],
    "red_o_points": [],
    "y_categories": ["N", "Y", "nan"],
    "blue_o_points": [],
    "blue_x_points": [
      [0.02439, 0],
      [-0.00055, 1],
      [0.02032, 0],
      [-0.00182, 1],
      [-0.00036, 1],
      [0.0191, 0],
      [0.00524, 1],
      [0.01911, 0],
      [0.00578, 1],
      [0.00485, 1]
    ]
  },
  "QS_mulLysisRoot[C6]": {
    "red_x_points": [
      [-0.00045, 3],
      [-0.00109, 0],
      [-0.00524, 2],
      [-0.00125, 0],
      [-0.00046, 3],
      [-0.00107, 0],
      [-0.00121, 0],
      [-0.00093, 0],
      [-0.00072, 3],
      [-0.00114, 0],
      [-0.00112, 0],
      [-0.00044, 0],
      [-0.00052, 3],
      [0.00288, 1],
      [-0.00065, 3],
      [-0.00121, 0],
      [-0.00048, 3],
      [-0.00095, 0],
      [-0.00036, 3],
      [-0.00089, 3],
      [-0.00051, 3],
      [-0.00045, 3],
      [-0.00097, 0],
      [-0.00066, 3],
      [-0.00049, 3],
      [-0.00033, 3],
      [-0.00115, 0],
      [-0.00102, 0],
      [0.00324, 1],
      [-0.00053, 3],
      [-0.00456, 2],
      [-0.00047, 3]
    ],
    "red_o_points": [],
    "y_categories": ["N", "NOT APPLICABLE", "Y", "nan"],
    "blue_o_points": [],
    "blue_x_points": [
      [0.0056, 1],
      [-8e-5, 3],
      [0.00335, 1],
      [0.00029, 0],
      [0.00036, 0],
      [0.003, 1],
      [-0.00027, 3],
      [0.00427, 1],
      [-0.00033, 3],
      [-0.0002, 3]
    ]
  },
  "QS_mulGraftNerve[FI]": {
    "red_x_points": [
      [3e-5, 2],
      [-0.0001, 0],
      [-0.00021, 0],
      [-0.00031, 0],
      [-1e-5, 2],
      [-0.00014, 0],
      [-0.0001, 0],
      [-0.00015, 0],
      [2e-5, 2],
      [-0.00031, 0],
      [-0.00019, 0],
      [-0.00026, 0],
      [3e-5, 2],
      [0.00034, 1],
      [-1e-5, 2],
      [-0.00025, 0],
      [-0.0, 2],
      [-0.00026, 0],
      [3e-5, 2],
      [3e-5, 2],
      [3e-5, 2],
      [3e-5, 2],
      [-0.00026, 0],
      [1e-5, 2],
      [1e-5, 2],
      [-1e-5, 2],
      [-0.00022, 0],
      [-0.00022, 0],
      [0.00024, 1],
      [1e-5, 2],
      [-0.00026, 0],
      [-2e-5, 2]
    ],
    "red_o_points": [],
    "y_categories": ["N", "NOT APPLICABLE", "nan"],
    "blue_o_points": [],
    "blue_x_points": [
      [0.00061, 1],
      [3e-5, 2],
      [0.00034, 1],
      [-5e-5, 0],
      [-4e-5, 0],
      [0.00035, 1],
      [3e-5, 2],
      [0.00044, 1],
      [3e-5, 2],
      [1e-5, 2]
    ]
  }
}
