{
  "QA_lstPexMuscstrength[ElbowFlex]": {
    "red_x_points": [
      [-0.00512, 1],
      [0.00045, 2],
      [-0.00198, 1],
      [-0.00204, 1],
      [0.002, 0],
      [-0.00176, 1],
      [-0.00203, 1],
      [-0.00464, 1],
      [-0.00229, 1],
      [-0.00217, 1],
      [-0.00178, 1],
      [-0.00517, 1],
      [0.00035, 2],
      [0.00453, 2],
      [0.00019, 2],
      [-0.00398, 1],
      [0.00022, 2],
      [0.00254, 0],
      [-0.00475, 1],
      [-0.00533, 1],
      [-0.00499, 1],
      [-0.00208, 1],
      [0.00388, 2],
      [-0.00052, 0],
      [-0.00496, 1],
      [-0.00192, 1],
      [-0.0041, 1],
      [-0.0019, 1],
      [-0.00455, 1],
      [0.0004, 2],
      [-0.002, 1]
    ],
    "red_o_points": [],
    "y_categories": ["GREATER THAN OR EQUALS TO 3", "LESS THAN 3", "nan"],
    "blue_o_points": [],
    "blue_x_points": [
      [0.00032, 2],
      [0.00742, 2],
      [0.00534, 0],
      [0.00031, 1],
      [0.0074, 2],
      [0.00605, 0],
      [0.00559, 0]
    ]
  },
  "QS_mulLysisRoot[C6]": {
    "red_x_points": [
      [-0.00118, 3],
      [-0.00196, 0],
      [-0.00335, 2],
      [-0.00192, 0],
      [-0.0018, 0],
      [-0.00187, 0],
      [-0.00216, 0],
      [-0.00114, 3],
      [-0.00194, 0],
      [-0.00204, 0],
      [-0.00182, 0],
      [-0.00136, 3],
      [0.00551, 1],
      [-0.00119, 3],
      [-0.00193, 0],
      [-0.00137, 3],
      [-0.00207, 0],
      [-0.00203, 0],
      [-0.00136, 3],
      [-0.00108, 3],
      [-0.00111, 3],
      [-0.00164, 0],
      [-0.00129, 3],
      [-0.0011, 3],
      [-0.0013, 3],
      [-0.00199, 0],
      [-0.0012, 3],
      [-0.00185, 0],
      [-0.00095, 3],
      [0.00544, 1],
      [-0.00345, 2]
    ],
    "red_o_points": [],
    "y_categories": ["N", "NOT APPLICABLE", "Y", "nan"],
    "blue_o_points": [],
    "blue_x_points": [
      [0.00796, 1],
      [-0.00046, 3],
      [0.00631, 1],
      [-0.00166, 0],
      [-0.00048, 3],
      [0.00508, 1],
      [0.00681, 1]
    ]
  },
  "QS_mulLysisTrunk[Upper]": {
    "red_x_points": [
      [-0.00169, 3],
      [-0.00266, 0],
      [-0.00249, 0],
      [-0.00266, 0],
      [-0.00243, 0],
      [-0.00519, 2],
      [-0.00264, 0],
      [-0.00143, 3],
      [-0.00266, 0],
      [-0.00233, 0],
      [-0.0025, 0],
      [-0.0018, 3],
      [0.00798, 1],
      [-0.00177, 3],
      [-0.00237, 0],
      [-0.00179, 3],
      [-0.00519, 2],
      [-0.00283, 0],
      [-0.00152, 3],
      [-0.00156, 3],
      [-0.00173, 3],
      [-0.0028, 0],
      [-0.00177, 3],
      [-0.00153, 3],
      [-0.00161, 3],
      [-0.00255, 0],
      [-0.00174, 3],
      [-0.00294, 0],
      [-0.00146, 3],
      [0.0081, 1],
      [-0.00448, 2]
    ],
    "red_o_points": [],
    "y_categories": ["N", "NOT APPLICABLE", "Y", "nan"],
    "blue_o_points": [],
    "blue_x_points": [
      [0.01104, 1],
      [-0.00103, 3],
      [0.00825, 1],
      [-0.00173, 0],
      [-0.00054, 3],
      [0.00927, 1],
      [0.00891, 1]
    ]
  },
  "QS_mulGraftNerve[Ac]": {
    "red_x_points": [
      [-0.00033, 2],
      [-0.00071, 0],
      [-0.00059, 0],
      [-0.00068, 0],
      [-0.00092, 0],
      [-0.00065, 0],
      [-0.00073, 0],
      [-0.00031, 2],
      [-0.00057, 0],
      [-0.00061, 0],
      [-0.0006, 0],
      [-0.00039, 2],
      [0.0007, 1],
      [-0.00022, 2],
      [-0.00086, 0],
      [-0.00031, 2],
      [-0.00041, 0],
      [-0.00083, 0],
      [-0.00029, 2],
      [-0.00028, 2],
      [-0.0001, 2],
      [-0.00036, 0],
      [-0.00021, 2],
      [-0.00072, 2],
      [-0.00031, 2],
      [-0.00059, 0],
      [-0.00032, 2],
      [-0.00047, 0],
      [-0.00017, 2],
      [0.00117, 1],
      [-0.00057, 0]
    ],
    "red_o_points": [],
    "y_categories": ["N", "NOT APPLICABLE", "nan"],
    "blue_o_points": [],
    "blue_x_points": [
      [0.00388, 1],
      [0.0, 2],
      [0.00109, 1],
      [0.00014, 0],
      [-2e-5, 2],
      [0.00155, 1],
      [0.00147, 1]
    ]
  },
  "QS_mulNeuromadSite[C8]": {
    "red_x_points": [
      [-0.00128, 2],
      [-0.00401, 0],
      [-0.00445, 0],
      [-0.00462, 0],
      [-0.00451, 0],
      [-0.00435, 0],
      [-0.00509, 0],
      [-0.00139, 2],
      [-0.00453, 0],
      [-0.00465, 0],
      [-0.00428, 0],
      [-0.00145, 2],
      [0.00738, 1],
      [-0.00142, 2],
      [-0.00478, 0],
      [-0.00135, 2],
      [-0.00411, 0],
      [-0.00488, 0],
      [-0.00126, 2],
      [-0.00124, 2],
      [-0.00102, 2],
      [-0.00375, 0],
      [-0.0013, 2],
      [-0.00165, 2],
      [-0.00168, 2],
      [-0.00395, 0],
      [-0.00143, 2],
      [-0.00465, 0],
      [-0.00112, 2],
      [0.00888, 1],
      [-0.00443, 0]
    ],
    "red_o_points": [],
    "y_categories": ["N", "NOT APPLICABLE", "nan"],
    "blue_o_points": [],
    "blue_x_points": [
      [0.01599, 1],
      [-0.0001, 2],
      [0.00925, 1],
      [-1e-5, 0],
      [-0.00011, 2],
      [0.00863, 1],
      [0.0115, 1]
    ]
  },
  "QS_mulGraftNerve[Ph]": {
    "red_x_points": [
      [-0.00015, 2],
      [-0.00046, 0],
      [-0.00041, 0],
      [-0.00044, 0],
      [-0.00042, 0],
      [-0.00047, 0],
      [-0.00049, 0],
      [-0.00011, 2],
      [-0.00043, 0],
      [-0.00032, 0],
      [-0.00043, 0],
      [-0.0002, 2],
      [0.00063, 1],
      [-0.00014, 2],
      [-0.00048, 0],
      [-0.00019, 2],
      [-0.00031, 0],
      [-0.00049, 0],
      [-0.00019, 2],
      [-0.00012, 2],
      [-9e-5, 2],
      [-0.00045, 0],
      [-0.00012, 2],
      [-6e-5, 2],
      [-0.00017, 2],
      [-0.00045, 0],
      [-0.00018, 2],
      [-0.0004, 0],
      [-0.00012, 2],
      [0.00068, 1],
      [-0.00037, 0]
    ],
    "red_o_points": [],
    "y_categories": ["N", "NOT APPLICABLE", "nan"],
    "blue_o_points": [],
    "blue_x_points": [
      [0.00177, 1],
      [-0.0, 2],
      [0.00078, 1],
      [0.0001, 0],
      [-5e-5, 2],
      [0.00083, 1],
      [0.00076, 1]
    ]
  },
  "QS_mulTransfSite[AcSsPA]": {
    "red_x_points": [
      [-0.00039, 3],
      [-0.00076, 0],
      [-0.00067, 0],
      [-0.00072, 0],
      [-0.0006, 0],
      [-0.00063, 0],
      [-0.00066, 0],
      [-0.00039, 3],
      [-0.00065, 0],
      [-0.00055, 0],
      [-0.00062, 0],
      [-0.00045, 3],
      [0.00202, 1],
      [-0.00031, 3],
      [-0.0005, 0],
      [-0.00044, 3],
      [-0.00197, 2],
      [-0.00062, 0],
      [-0.00043, 3],
      [-0.00045, 3],
      [-0.00035, 3],
      [-0.00065, 0],
      [-0.00036, 3],
      [-0.00033, 3],
      [-0.00047, 3],
      [-0.00069, 0],
      [-0.00037, 3],
      [-0.00064, 0],
      [-0.00035, 3],
      [0.00204, 1],
      [-0.00059, 0]
    ],
    "red_o_points": [],
    "y_categories": ["N", "NOT APPLICABLE", "Y", "nan"],
    "blue_o_points": [],
    "blue_x_points": [
      [0.00257, 1],
      [-0.00011, 3],
      [0.00154, 1],
      [-0.00061, 0],
      [-6e-5, 3],
      [0.00218, 1],
      [0.00225, 1]
    ]
  },
  "participant_code": {
    "red_x_points": [
      [-0.0223, 1],
      [-0.02207, 2],
      [-0.02086, 3],
      [-0.02118, 4],
      [-0.0216, 5],
      [-0.0224, 6],
      [-0.02235, 7],
      [-0.02165, 8],
      [-0.02142, 9],
      [-0.02188, 10],
      [-0.02254, 11],
      [-0.02282, 12],
      [-0.0223, 14],
      [-0.02137, 16],
      [-0.02137, 17],
      [-0.02137, 19],
      [-0.02151, 20],
      [-0.02272, 22],
      [-0.02128, 23],
      [-0.02086, 25],
      [-0.02142, 26],
      [-0.02216, 27],
      [-0.02151, 28],
      [-0.02254, 29],
      [-0.02118, 30],
      [-0.02207, 32],
      [-0.02118, 33],
      [-0.02118, 34],
      [-0.02254, 35],
      [-0.02277, 36],
      [-0.0217, 37]
    ],
    "red_o_points": [],
    "y_categories": [
      "P16554",
      "P18297",
      "P19283",
      "P19287",
      "P23391",
      "P31645",
      "P31691",
      "P34778",
      "P35046",
      "P36328",
      "P43633",
      "P4544",
      "P46417",
      "P48965",
      "P53068",
      "P5497",
      "P59529",
      "P62483",
      "P64658",
      "P65202",
      "P66816",
      "P6751",
      "P7408",
      "P75566",
      "P76226",
      "P79971",
      "P82621",
      "P82990",
      "P84932",
      "P85825",
      "P86989",
      "P8770",
      "P87791",
      "P90550",
      "P93159",
      "P94969",
      "P96710",
      "P9744",
      "nan"
    ],
    "blue_o_points": [],
    "blue_x_points": [
      [0.06485, 0],
      [0.06439, 13],
      [0.06638, 15],
      [0.06101, 18],
      [0.0627, 21],
      [0.05902, 24],
      [0.06255, 31]
    ]
  },
  "QS_mulGraftNerve[IS]": {
    "red_x_points": [
      [-3e-5, 2],
      [-8e-5, 0],
      [-8e-5, 0],
      [-6e-5, 0],
      [-8e-5, 0],
      [-1e-5, 0],
      [-8e-5, 0],
      [-0.0, 2],
      [-5e-5, 0],
      [-3e-5, 0],
      [-7e-5, 0],
      [-3e-5, 2],
      [-3e-5, 1],
      [-3e-5, 0],
      [-2e-5, 2],
      [-6e-5, 0],
      [-3e-5, 2],
      [-3e-5, 2],
      [-0.0, 2],
      [-5e-5, 0],
      [-3e-5, 2],
      [-2e-5, 2],
      [-0.0, 2],
      [-8e-5, 0],
      [-2e-5, 2],
      [-8e-5, 0],
      [9e-5, 1],
      [-3e-5, 0]
    ],
    "red_o_points": [],
    "y_categories": ["N", "NOT APPLICABLE", "nan"],
    "blue_o_points": [],
    "blue_x_points": [[0.00045, 1], [8e-5, 0], [-2e-5, 2], [9e-5, 1], [9e-5, 1]]
  },
  "QA_mulInjOrthesisType[ArmSling]": {
    "red_x_points": [
      [-0.01305, 2],
      [-0.01211, 2],
      [-0.01253, 2],
      [-0.01322, 2],
      [-0.01167, 2],
      [-0.01233, 2],
      [-0.01244, 2],
      [-0.01306, 2],
      [-0.01169, 2],
      [-0.01222, 2],
      [-0.01299, 2],
      [-0.01295, 2],
      [0.03501, 1],
      [-0.01278, 2],
      [-0.01254, 2],
      [-0.01287, 2],
      [-0.01419, 0],
      [-0.01211, 2],
      [-0.01339, 2],
      [-0.01328, 2],
      [-0.01593, 0],
      [-0.0154, 3],
      [-0.01234, 2],
      [0.03541, 1],
      [-0.01357, 2],
      [-0.01193, 2],
      [-0.01282, 2],
      [-0.0124, 2],
      [-0.01561, 3],
      [-0.02293, 3],
      [-0.01247, 2]
    ],
    "red_o_points": [],
    "y_categories": ["N", "NOT APPLICABLE", "Y", "nan"],
    "blue_o_points": [],
    "blue_x_points": [
      [-0.00622, 2],
      [0.03656, 1],
      [0.03199, 1],
      [0.04154, 1],
      [0.0368, 1],
      [0.03114, 1],
      [0.03242, 1]
    ]
  },
  "QS_mulGraftNerve[Ul]": {
    "red_x_points": [
      [-5e-5, 2],
      [-0.00022, 0],
      [-0.0003, 0],
      [-0.00028, 0],
      [-0.00013, 0],
      [-0.00024, 0],
      [-0.0003, 0],
      [-9e-5, 2],
      [-0.00019, 0],
      [-0.00011, 0],
      [-0.00011, 0],
      [-6e-5, 2],
      [0.00055, 1],
      [-0.00012, 2],
      [-0.00014, 0],
      [-0.00012, 2],
      [-9e-5, 0],
      [-7e-5, 0],
      [-4e-5, 2],
      [-6e-5, 2],
      [-4e-5, 2],
      [-0.00017, 0],
      [-0.0001, 2],
      [-1e-5, 2],
      [-9e-5, 2],
      [-0.00019, 0],
      [-6e-5, 2],
      [-0.00019, 0],
      [-4e-5, 2],
      [0.00019, 1],
      [-0.00024, 0]
    ],
    "red_o_points": [],
    "y_categories": ["N", "NOT APPLICABLE", "nan"],
    "blue_o_points": [],
    "blue_x_points": [
      [0.00062, 1],
      [-4e-5, 2],
      [0.00031, 1],
      [-6e-5, 0],
      [-2e-5, 2],
      [0.00044, 1],
      [0.00053, 1]
    ]
  },
  "QA_mulInjOrthesisType[ShoulderSupport]": {
    "red_x_points": [
      [-0.01445, 0],
      [-0.0134, 0],
      [-0.0137, 0],
      [-0.01274, 0],
      [-0.01408, 0],
      [-0.01376, 0],
      [-0.01358, 0],
      [-0.01692, 2],
      [-0.0138, 0],
      [-0.01323, 0],
      [-0.01271, 0],
      [-0.01411, 0],
      [0.03447, 1],
      [-0.01448, 0],
      [-0.0127, 0],
      [-0.01387, 0],
      [-0.01575, 2],
      [-0.01338, 0],
      [-0.01441, 0],
      [-0.01398, 0],
      [-0.01645, 2],
      [-0.01632, 3],
      [-0.01425, 0],
      [0.03888, 1],
      [-0.01386, 0],
      [-0.01321, 0],
      [-0.01429, 0],
      [-0.01264, 0],
      [-0.01721, 3],
      [-0.02386, 3],
      [-0.01311, 0]
    ],
    "red_o_points": [],
    "y_categories": ["N", "NOT APPLICABLE", "Y", "nan"],
    "blue_o_points": [],
    "blue_x_points": [
      [-0.00672, 0],
      [0.04155, 1],
      [0.03326, 1],
      [0.04573, 1],
      [0.04126, 1],
      [0.03548, 1],
      [0.03568, 1]
    ]
  },
  "QA_yonInjUnconscio": {
    "red_x_points": [
      [-0.00367, 1],
      [-0.00429, 1],
      [-0.00215, 2],
      [-0.00201, 2],
      [0.00685, 0],
      [-0.00457, 1],
      [-0.00222, 2],
      [-0.00454, 2],
      [-0.00272, 2],
      [-0.00198, 2],
      [-0.00368, 1],
      [-0.00384, 1],
      [-0.02913, 1],
      [-0.00496, 2],
      [-0.00236, 2],
      [-0.00488, 2],
      [-0.00358, 1],
      [0.00723, 0],
      [-0.00351, 1],
      [-0.00364, 1],
      [-0.00359, 1],
      [-0.00376, 1],
      [-0.00469, 2],
      [-0.00909, 1],
      [-0.00413, 2],
      [-0.00359, 1],
      [0.00986, 0],
      [-0.00331, 1],
      [-0.00491, 2],
      [-0.00146, 2],
      [-0.00339, 1]
    ],
    "red_o_points": [],
    "y_categories": ["N", "Y", "nan"],
    "blue_o_points": [],
    "blue_x_points": [
      [0.00148, 2],
      [-0.00225, 1],
      [0.01611, 0],
      [0.01897, 0],
      [0.02251, 0],
      [0.00273, 2],
      [0.0028, 2]
    ]
  },
  "QS_mulGraftNerve[Me]": {
    "red_x_points": [
      [-4e-5, 2],
      [-0.00023, 0],
      [-0.00011, 0],
      [-0.00026, 0],
      [-0.00035, 0],
      [-0.00015, 0],
      [-0.00023, 0],
      [-7e-5, 2],
      [-0.0002, 0],
      [-0.00026, 0],
      [-0.0002, 0],
      [-4e-5, 2],
      [0.00032, 1],
      [5e-5, 2],
      [-0.00012, 0],
      [-0.0001, 2],
      [-0.00014, 0],
      [-0.00029, 0],
      [-2e-5, 2],
      [-4e-5, 2],
      [-3e-5, 2],
      [-0.00021, 0],
      [-5e-5, 2],
      [-4e-5, 2],
      [-7e-5, 2],
      [-0.00014, 0],
      [-2e-5, 2],
      [-0.00016, 0],
      [-6e-5, 2],
      [0.00032, 1],
      [-0.00013, 0]
    ],
    "red_o_points": [],
    "y_categories": ["N", "NOT APPLICABLE", "nan"],
    "blue_o_points": [],
    "blue_x_points": [
      [0.00047, 1],
      [-2e-5, 2],
      [0.00034, 1],
      [0.00012, 0],
      [7e-5, 2],
      [0.00034, 1],
      [0.00036, 1]
    ]
  },
  "QS_mulBpsurgeryType[Lysis]": {
    "red_x_points": [
      [-0.00254, 3],
      [-0.00532, 0],
      [-0.00883, 2],
      [-0.00498, 0],
      [-0.00481, 0],
      [-0.00816, 2],
      [-0.00504, 0],
      [-0.00253, 3],
      [-0.00514, 0],
      [-0.00561, 0],
      [-0.00541, 0],
      [-0.00243, 3],
      [0.01379, 1],
      [-0.00242, 3],
      [-0.00499, 0],
      [-0.00281, 3],
      [-0.00945, 2],
      [-0.00497, 0],
      [-0.00266, 3],
      [-0.00283, 3],
      [-0.00257, 3],
      [-0.00487, 0],
      [-0.00232, 3],
      [-0.00258, 3],
      [-0.00273, 3],
      [-0.00547, 0],
      [-0.00275, 3],
      [-0.00496, 0],
      [-0.00268, 3],
      [0.01433, 1],
      [-0.00811, 2]
    ],
    "red_o_points": [],
    "y_categories": ["N", "NOT APPLICABLE", "Y", "nan"],
    "blue_o_points": [],
    "blue_x_points": [
      [0.02099, 1],
      [-0.00062, 3],
      [0.01392, 1],
      [-0.00192, 0],
      [-0.00128, 3],
      [0.01691, 1],
      [0.01804, 1]
    ]
  },
  "QS_mulLysisSite[Trunk]": {
    "red_x_points": [
      [-0.00191, 3],
      [-0.00284, 0],
      [-0.00249, 0],
      [-0.00252, 0],
      [-0.00251, 0],
      [-0.00485, 2],
      [-0.0023, 0],
      [-0.00187, 3],
      [-0.00254, 0],
      [-0.00242, 0],
      [-0.00231, 0],
      [-0.00193, 3],
      [0.00848, 1],
      [-0.00177, 3],
      [-0.00251, 0],
      [-0.00213, 3],
      [-0.00533, 2],
      [-0.00246, 0],
      [-0.00195, 3],
      [-0.00183, 3],
      [-0.00198, 3],
      [-0.00234, 0],
      [-0.00189, 3],
      [-0.00173, 3],
      [-0.00189, 3],
      [-0.00251, 0],
      [-0.00156, 3],
      [-0.00256, 0],
      [-0.00171, 3],
      [0.00825, 1],
      [-0.00495, 2]
    ],
    "red_o_points": [],
    "y_categories": ["N", "NOT APPLICABLE", "Y", "nan"],
    "blue_o_points": [],
    "blue_x_points": [
      [0.01187, 1],
      [-0.00058, 3],
      [0.00831, 1],
      [-0.0019, 0],
      [-0.00077, 3],
      [0.00906, 1],
      [0.00932, 1]
    ]
  },
  "QS_mulGraftTrunk[UpperTrunk]": {
    "red_x_points": [
      [-0.00072, 3],
      [-0.00115, 0],
      [-0.00092, 0],
      [-0.00101, 0],
      [-0.0011, 0],
      [-0.00104, 0],
      [-0.0012, 0],
      [-0.00061, 3],
      [-0.00102, 0],
      [-0.00097, 0],
      [-0.00097, 0],
      [-0.00048, 3],
      [0.00266, 1],
      [-0.00078, 3],
      [-0.00343, 2],
      [-0.00072, 3],
      [-0.00082, 0],
      [-0.00108, 0],
      [-0.00071, 3],
      [-0.00069, 3],
      [-0.00073, 3],
      [-0.00105, 0],
      [-0.00064, 3],
      [-0.00059, 3],
      [-0.00074, 3],
      [-0.00088, 0],
      [-0.00057, 3],
      [-0.00095, 0],
      [-0.00061, 3],
      [0.00274, 1],
      [-0.00096, 0]
    ],
    "red_o_points": [],
    "y_categories": ["N", "NOT APPLICABLE", "Y", "nan"],
    "blue_o_points": [],
    "blue_x_points": [
      [0.00384, 1],
      [-0.0004, 3],
      [0.00366, 1],
      [-0.00036, 0],
      [-0.00012, 3],
      [0.00363, 1],
      [0.00367, 1]
    ]
  },
  "QS_mulTransfSite[PhMc]": {
    "red_x_points": [
      [-0.00114, 3],
      [-0.00169, 0],
      [-0.00154, 0],
      [-0.00171, 0],
      [-0.00194, 0],
      [-0.00159, 0],
      [-0.00335, 2],
      [-0.00135, 3],
      [-0.00188, 0],
      [-0.00171, 0],
      [-0.00185, 0],
      [-0.00113, 3],
      [0.00573, 1],
      [-0.00125, 3],
      [-0.00175, 0],
      [-0.0011, 3],
      [-0.0017, 0],
      [-0.00211, 0],
      [-0.00135, 3],
      [-0.00139, 3],
      [-0.0013, 3],
      [-0.00316, 2],
      [-0.00115, 3],
      [-0.00135, 3],
      [-0.0014, 3],
      [-0.00177, 0],
      [-0.00136, 3],
      [-0.00168, 0],
      [-0.00132, 3],
      [0.00501, 1],
      [-0.00161, 0]
    ],
    "red_o_points": [],
    "y_categories": ["N", "NOT APPLICABLE", "Y", "nan"],
    "blue_o_points": [],
    "blue_x_points": [
      [0.00719, 1],
      [-0.00043, 3],
      [0.00614, 1],
      [-0.00155, 0],
      [-0.00052, 3],
      [0.00674, 1],
      [0.00641, 1]
    ]
  },
  "QA_mulInjTbpiCause[Motorcycle]": {
    "red_x_points": [
      [0.0018, 0],
      [-0.00109, 1],
      [-0.00117, 1],
      [-0.001, 1],
      [-0.00147, 1],
      [-0.00102, 1],
      [-0.00124, 1],
      [-0.00107, 1],
      [-0.00104, 1],
      [-0.0011, 1],
      [-0.001, 1],
      [0.0017, 0],
      [-0.04235, 1],
      [-0.00124, 1],
      [-0.00136, 1],
      [-0.00131, 1],
      [-0.00109, 1],
      [-0.00188, 1],
      [0.00107, 0],
      [-0.00091, 1],
      [-0.00092, 1],
      [-0.00078, 1],
      [-0.00119, 1],
      [-0.00293, 1],
      [0.00195, 0],
      [-0.00059, 1],
      [-0.0007, 1],
      [-0.00098, 1],
      [-0.00102, 1],
      [-0.03725, 1],
      [-0.00092, 1]
    ],
    "red_o_points": [],
    "y_categories": ["N", "Y", "nan"],
    "blue_o_points": [],
    "blue_x_points": [
      [0.01908, 0],
      [-0.00092, 1],
      [0.01615, 0],
      [-0.00196, 1],
      [-0.00093, 1],
      [0.01693, 0],
      [0.01858, 0]
    ]
  },
  "QS_mulLysisSite[Root]": {
    "red_x_points": [
      [-0.00047, 3],
      [-0.00055, 0],
      [-0.00145, 2],
      [-0.00055, 0],
      [-0.0005, 0],
      [-0.00049, 0],
      [-0.00054, 0],
      [-0.00045, 3],
      [-0.00057, 0],
      [-0.00058, 0],
      [-0.00046, 0],
      [-0.00043, 3],
      [0.00137, 1],
      [-0.0005, 3],
      [-0.00055, 0],
      [-0.00044, 3],
      [-0.00051, 0],
      [-0.00046, 0],
      [-0.00043, 3],
      [-0.0005, 3],
      [-0.00034, 3],
      [-0.00048, 0],
      [-0.00046, 3],
      [-0.00039, 3],
      [-0.00052, 3],
      [-0.00052, 0],
      [-0.00047, 3],
      [-0.00058, 0],
      [-0.00049, 3],
      [0.00248, 1],
      [-0.00126, 2]
    ],
    "red_o_points": [],
    "y_categories": ["N", "NOT APPLICABLE", "Y", "nan"],
    "blue_o_points": [],
    "blue_x_points": [
      [0.00224, 1],
      [-0.00016, 3],
      [0.00194, 1],
      [-0.0007, 0],
      [-0.00025, 3],
      [0.00207, 1],
      [0.00294, 1]
    ]
  },
  "QS_mulGraftLevel[Trunk]": {
    "red_x_points": [
      [-0.0004, 3],
      [-0.00047, 0],
      [-0.0004, 0],
      [-0.00047, 0],
      [-0.00042, 0],
      [-0.0005, 0],
      [-0.00051, 0],
      [-0.00043, 3],
      [-0.0005, 0],
      [-0.0004, 0],
      [-0.00058, 0],
      [-0.0004, 3],
      [0.00174, 1],
      [-0.00032, 3],
      [-0.00225, 2],
      [-0.0003, 3],
      [-0.00038, 0],
      [-0.0005, 0],
      [-0.00029, 3],
      [-0.00026, 3],
      [-0.00041, 3],
      [-0.00052, 0],
      [-0.00048, 3],
      [-0.00048, 3],
      [-0.00043, 3],
      [-0.00049, 0],
      [-0.00029, 3],
      [-0.00045, 0],
      [-0.00039, 3],
      [0.00161, 1],
      [-0.00048, 0]
    ],
    "red_o_points": [],
    "y_categories": ["N", "NOT APPLICABLE", "Y", "nan"],
    "blue_o_points": [],
    "blue_x_points": [
      [0.00156, 1],
      [-0.00022, 3],
      [0.00178, 1],
      [0.00015, 0],
      [-0.00014, 3],
      [0.00154, 1],
      [0.00161, 1]
    ]
  },
  "QS_mulGraftNerve[other]": {
    "red_x_points": [
      [-0.00054, 2],
      [-0.00146, 0],
      [-0.0016, 0],
      [-0.00142, 0],
      [-0.00166, 0],
      [-0.00156, 0],
      [-0.00177, 0],
      [-0.00064, 2],
      [-0.0018, 0],
      [-0.00168, 0],
      [-0.00151, 0],
      [-0.00069, 2],
      [0.00176, 1],
      [-0.00068, 2],
      [-0.00166, 0],
      [-0.00065, 2],
      [-0.00132, 0],
      [-0.0018, 0],
      [-0.00071, 2],
      [-0.00067, 2],
      [-0.00034, 2],
      [-0.00152, 0],
      [-0.00059, 2],
      [-0.00056, 2],
      [-0.00049, 2],
      [-0.00157, 0],
      [-0.00078, 2],
      [-0.00148, 0],
      [-0.00039, 2],
      [0.00258, 1],
      [-0.0016, 0]
    ],
    "red_o_points": [],
    "y_categories": ["N", "NOT APPLICABLE", "nan"],
    "blue_o_points": [],
    "blue_x_points": [
      [0.00731, 1],
      [-0.00012, 2],
      [0.00273, 1],
      [0.00067, 0],
      [-3e-5, 2],
      [0.00326, 1],
      [0.00447, 1]
    ]
  },
  "QS_mulGraftNerve[Ax]": {
    "red_x_points": [
      [-1e-5, 2],
      [-1e-5, 0],
      [-1e-5, 0],
      [-0.00019, 0],
      [-1e-5, 0],
      [-1e-5, 0],
      [-1e-5, 2],
      [-1e-5, 0],
      [-1e-5, 0],
      [-1e-5, 2],
      [-7e-5, 1],
      [-1e-5, 2],
      [-8e-5, 0],
      [-0.00018, 0],
      [-1e-5, 2],
      [6e-5, 2],
      [-1e-5, 0],
      [-0.0, 2],
      [-7e-5, 1],
      [-1e-5, 0]
    ],
    "red_o_points": [],
    "y_categories": ["N", "NOT APPLICABLE", "nan"],
    "blue_o_points": [],
    "blue_x_points": [
      [0.00019, 1],
      [7e-5, 2],
      [0.00015, 1],
      [-6e-5, 0],
      [1e-5, 2],
      [8e-5, 1]
    ]
  },
  "QA_lstPexMuscstrength[WristFlex]": {
    "red_x_points": [
      [-0.00375, 1],
      [-0.00029, 2],
      [-0.00147, 1],
      [-0.00131, 1],
      [0.00045, 0],
      [0.00067, 0],
      [-0.00155, 1],
      [-0.00195, 0],
      [0.00055, 0],
      [0.00045, 0],
      [0.00049, 0],
      [-0.00231, 0],
      [-0.00122, 2],
      [0.00304, 2],
      [1e-5, 2],
      [-0.00231, 0],
      [-0.00019, 2],
      [0.00049, 0],
      [-0.00249, 0],
      [-0.00376, 1],
      [-0.0022, 0],
      [-0.0014, 1],
      [0.00239, 2],
      [-0.01242, 1],
      [-0.00181, 0],
      [0.00038, 0],
      [-0.00376, 1],
      [0.00037, 0],
      [0.00222, 2],
      [-0.00014, 2],
      [-0.00148, 1]
    ],
    "red_o_points": [],
    "y_categories": ["GREATER THAN OR EQUALS TO 3", "LESS THAN 3", "nan"],
    "blue_o_points": [],
    "blue_x_points": [
      [0.00053, 0],
      [0.00531, 2],
      [0.00192, 0],
      [0.00343, 0],
      [0.00452, 2],
      [0.00198, 0],
      [0.0021, 0]
    ]
  },
  "QS_mulNeuromadSite[C5]": {
    "red_x_points": [
      [-0.00091, 2],
      [-0.00337, 0],
      [-0.00338, 0],
      [-0.00355, 0],
      [-0.00308, 0],
      [-0.00284, 0],
      [-0.00325, 0],
      [-0.00123, 2],
      [-0.00336, 0],
      [-0.00317, 0],
      [-0.00296, 0],
      [-0.00116, 2],
      [0.00331, 1],
      [-0.00093, 2],
      [-0.00293, 0],
      [-0.00141, 2],
      [-0.00288, 0],
      [-0.00421, 0],
      [-0.00112, 2],
      [-0.00093, 2],
      [-0.00098, 2],
      [-0.00256, 0],
      [-0.00104, 2],
      [-0.00143, 2],
      [-0.00131, 2],
      [-0.00283, 0],
      [-0.00104, 2],
      [-0.00307, 0],
      [-0.00072, 2],
      [0.00582, 1],
      [-0.00322, 0]
    ],
    "red_o_points": [],
    "y_categories": ["N", "NOT APPLICABLE", "nan"],
    "blue_o_points": [],
    "blue_x_points": [
      [0.01205, 1],
      [0.00019, 2],
      [0.00642, 1],
      [0.00042, 0],
      [0.00012, 2],
      [0.00746, 1],
      [0.00844, 1]
    ]
  },
  "QS_mulNeuromadSite[C7]": {
    "red_x_points": [
      [-0.00057, 2],
      [-0.00192, 0],
      [-0.00182, 0],
      [-0.00195, 0],
      [-0.00183, 0],
      [-0.002, 0],
      [-0.00192, 0],
      [-0.00062, 2],
      [-0.00179, 0],
      [-0.0022, 0],
      [-0.00184, 0],
      [-0.00059, 2],
      [0.00253, 1],
      [-0.0007, 2],
      [-0.0024, 0],
      [-0.00061, 2],
      [-0.00147, 0],
      [-0.00198, 0],
      [-0.00077, 2],
      [-0.00056, 2],
      [-0.00027, 2],
      [-0.0016, 0],
      [-0.00075, 2],
      [-0.00056, 2],
      [-0.00076, 2],
      [-0.00179, 0],
      [-0.00065, 2],
      [-0.00196, 0],
      [-0.0003, 2],
      [0.00347, 1],
      [-0.00197, 0]
    ],
    "red_o_points": [],
    "y_categories": ["N", "NOT APPLICABLE", "nan"],
    "blue_o_points": [],
    "blue_x_points": [
      [0.00915, 1],
      [2e-5, 2],
      [0.00324, 1],
      [0.00028, 0],
      [9e-5, 2],
      [0.00357, 1],
      [0.00468, 1]
    ]
  },
  "QS_mulGraftNerve[TD]": {
    "red_x_points": [
      [-3e-5, 0],
      [-3e-5, 0],
      [-3e-5, 0],
      [-3e-5, 0],
      [-3e-5, 0],
      [-3e-5, 0],
      [-3e-5, 2],
      [-3e-5, 0],
      [-3e-5, 0],
      [-3e-5, 0],
      [-3e-5, 2],
      [-3e-5, 2],
      [-3e-5, 2],
      [-3e-5, 2],
      [-3e-5, 2],
      [-3e-5, 0],
      [-3e-5, 2],
      [-3e-5, 2],
      [-3e-5, 2],
      [-3e-5, 0],
      [-3e-5, 2],
      [-3e-5, 2],
      [-3e-5, 0]
    ],
    "red_o_points": [],
    "y_categories": ["N", "NOT APPLICABLE", "nan"],
    "blue_o_points": [],
    "blue_x_points": [[0.00015, 1], [0.00015, 1], [-3e-5, 0], [-3e-5, 2]]
  },
  "QS_mulGraftNerve[SS]": {
    "red_x_points": [[-0.00016, 1], [0.0, 2]],
    "red_o_points": [],
    "y_categories": ["N", "NOT APPLICABLE", "nan"],
    "blue_o_points": [],
    "blue_x_points": [[0.0, 2], [4e-5, 0], [0.0, 2]]
  },
  "QS_mulTransfSite[IMc]": {
    "red_x_points": [
      [-0.00227, 3],
      [-0.00726, 2],
      [-0.00487, 0],
      [-0.00473, 0],
      [-0.00491, 0],
      [-0.00465, 0],
      [-0.00479, 0],
      [-0.00242, 3],
      [-0.00474, 0],
      [-0.00479, 0],
      [-0.00448, 0],
      [-0.00248, 3],
      [0.01205, 1],
      [-0.00226, 3],
      [-0.00464, 0],
      [-0.00268, 3],
      [-0.0079, 2],
      [-0.00512, 0],
      [-0.00272, 3],
      [-0.00245, 3],
      [-0.00215, 3],
      [-0.00429, 0],
      [-0.0023, 3],
      [-0.00257, 3],
      [-0.00245, 3],
      [-0.00458, 0],
      [-0.00259, 3],
      [-0.00787, 2],
      [-0.00223, 3],
      [0.01271, 1],
      [-0.00701, 2]
    ],
    "red_o_points": [],
    "y_categories": ["N", "NOT APPLICABLE", "Y", "nan"],
    "blue_o_points": [],
    "blue_x_points": [
      [0.02058, 1],
      [-0.00093, 3],
      [0.01319, 1],
      [-0.00137, 0],
      [-0.00074, 3],
      [0.0144, 1],
      [0.01687, 1]
    ]
  },
  "QS_mulLysisRoot[C7]": {
    "red_x_points": [
      [-0.00022, 3],
      [-0.00037, 0],
      [-0.00094, 2],
      [-0.00035, 0],
      [-0.0003, 0],
      [-0.0003, 0],
      [-0.00038, 0],
      [-0.00022, 3],
      [-0.00035, 0],
      [-0.00036, 0],
      [-0.0003, 0],
      [-0.0001, 3],
      [0.00144, 1],
      [-0.00028, 3],
      [-0.00035, 0],
      [-0.00024, 3],
      [-0.00028, 0],
      [-0.0002, 0],
      [-0.00014, 3],
      [-0.00019, 3],
      [-0.00023, 3],
      [-0.00037, 0],
      [-0.00021, 3],
      [-0.0002, 3],
      [-0.00018, 3],
      [-0.00035, 0],
      [-0.00013, 3],
      [-0.00032, 0],
      [-0.00016, 3],
      [0.00097, 1],
      [-0.00026, 0]
    ],
    "red_o_points": [],
    "y_categories": ["N", "NOT APPLICABLE", "Y", "nan"],
    "blue_o_points": [],
    "blue_x_points": [
      [0.00102, 1],
      [-0.00012, 3],
      [0.00096, 1],
      [-0.00041, 0],
      [-0.00011, 3],
      [0.00137, 1],
      [0.00105, 1]
    ]
  },
  "QS_lstBpsurgSide": {
    "red_x_points": [
      [-0.00458, 3],
      [-0.00725, 0],
      [-0.00757, 0],
      [-0.00701, 0],
      [-0.01513, 2],
      [-0.00701, 0],
      [-0.00783, 0],
      [-0.00424, 3],
      [-0.00717, 0],
      [-0.01331, 2],
      [-0.01384, 2],
      [-0.00458, 3],
      [0.02247, 1],
      [-0.00429, 3],
      [-0.01526, 2],
      [-0.00485, 3],
      [-0.01495, 2],
      [-0.01514, 2],
      [-0.00449, 3],
      [-0.00412, 3],
      [-0.00385, 3],
      [-0.00719, 0],
      [-0.00456, 3],
      [-0.00435, 3],
      [-0.00456, 3],
      [-0.01356, 2],
      [-0.00452, 3],
      [-0.01353, 2],
      [-0.00419, 3],
      [0.02315, 1],
      [-0.00707, 0]
    ],
    "red_o_points": [],
    "y_categories": ["L", "NOT APPLICABLE", "R", "nan"],
    "blue_o_points": [],
    "blue_x_points": [
      [0.03672, 1],
      [-0.00159, 3],
      [0.02851, 1],
      [0.00185, 0],
      [-0.00151, 3],
      [0.02732, 1],
      [0.02711, 1]
    ]
  },
  "QS_mulTransfSite[AcMc]": {
    "red_x_points": [
      [-0.00035, 3],
      [-0.00046, 0],
      [-0.00037, 0],
      [-0.0004, 0],
      [-0.00038, 0],
      [-0.00037, 0],
      [-0.0004, 0],
      [-0.00037, 3],
      [-0.00038, 0],
      [-0.00043, 0],
      [-0.00139, 2],
      [-0.0003, 3],
      [0.00126, 1],
      [-0.00035, 3],
      [-0.00036, 0],
      [-0.0003, 3],
      [-0.00043, 0],
      [-0.00045, 0],
      [-0.00052, 3],
      [-0.00033, 3],
      [-0.00036, 3],
      [-0.00039, 0],
      [-0.0003, 3],
      [-0.00032, 3],
      [-0.00043, 3],
      [-0.00048, 0],
      [-0.00026, 3],
      [-0.00053, 0],
      [-0.00033, 3],
      [0.0014, 1],
      [-0.0004, 0]
    ],
    "red_o_points": [],
    "y_categories": ["N", "NOT APPLICABLE", "Y", "nan"],
    "blue_o_points": [],
    "blue_x_points": [
      [0.00146, 1],
      [-0.00011, 3],
      [0.00143, 1],
      [-0.00044, 0],
      [-0.00018, 3],
      [0.002, 1],
      [0.00197, 1]
    ]
  },
  "QS_mulTransfSite[Other]": {
    "red_x_points": [
      [-0.00034, 3],
      [-0.00039, 0],
      [-0.00049, 0],
      [-0.00052, 0],
      [-0.00041, 0],
      [-0.00044, 0],
      [-0.00045, 0],
      [-0.00032, 3],
      [-0.00045, 0],
      [-0.00053, 0],
      [-0.00051, 0],
      [-0.00036, 3],
      [0.00151, 1],
      [-0.00018, 3],
      [-0.00053, 0],
      [-0.00044, 3],
      [-0.00049, 0],
      [-0.00342, 2],
      [-0.0003, 3],
      [-0.00034, 3],
      [-0.00034, 3],
      [-0.00055, 0],
      [-0.00031, 3],
      [-0.00035, 3],
      [-0.00035, 3],
      [-0.00052, 0],
      [-0.00024, 3],
      [-0.00051, 0],
      [-0.00028, 3],
      [0.0015, 1],
      [-0.00031, 0]
    ],
    "red_o_points": [],
    "y_categories": ["N", "NOT APPLICABLE", "Y", "nan"],
    "blue_o_points": [],
    "blue_x_points": [
      [0.00182, 1],
      [-0.00012, 3],
      [0.00211, 1],
      [1e-5, 0],
      [-0.0001, 3],
      [0.00229, 1],
      [0.00173, 1]
    ]
  },
  "QA_yonInjBpsurg": {
    "red_x_points": [
      [-0.00367, 1],
      [-0.00379, 1],
      [-0.00408, 1],
      [-0.00397, 1],
      [-0.00431, 1],
      [-0.00371, 1],
      [-0.00392, 1],
      [-0.00373, 1],
      [-0.00401, 1],
      [-0.00413, 1],
      [-0.00403, 1],
      [-0.00399, 1],
      [0.00774, 0],
      [-0.00403, 1],
      [-0.00368, 1],
      [-0.00421, 1],
      [-0.00298, 1],
      [-0.00368, 1],
      [-0.0039, 1],
      [-0.00368, 1],
      [-0.00348, 1],
      [-0.00304, 1],
      [-0.00404, 1],
      [-0.00456, 1],
      [-0.00455, 1],
      [-0.00381, 1],
      [-0.00399, 1],
      [-0.00375, 1],
      [-0.00353, 1],
      [0.00907, 0],
      [-0.00405, 1]
    ],
    "red_o_points": [],
    "y_categories": ["N", "Y", "nan"],
    "blue_o_points": [],
    "blue_x_points": [
      [0.02472, 0],
      [-0.0003, 1],
      [0.01145, 0],
      [-0.00276, 1],
      [-0.00095, 1],
      [0.0119, 0],
      [0.01492, 0]
    ]
  },
  "QS_mulLysisNerve[Ssr]": {
    "red_x_points": [
      [-0.00013, 3],
      [-0.00039, 0],
      [-0.00079, 2],
      [-0.00036, 0],
      [-0.00034, 0],
      [-0.00038, 0],
      [-0.00026, 0],
      [-0.00013, 3],
      [-0.00039, 0],
      [-0.0003, 0],
      [-0.00032, 0],
      [-0.00013, 3],
      [0.00126, 1],
      [-8e-5, 3],
      [-0.00021, 0],
      [-0.00012, 3],
      [-0.00034, 0],
      [-0.00024, 0],
      [-0.00013, 3],
      [-0.00013, 3],
      [-0.00013, 3],
      [-0.00033, 0],
      [-0.00013, 3],
      [-0.00015, 3],
      [-0.00016, 3],
      [-0.00029, 0],
      [-0.00015, 3],
      [-0.00025, 0],
      [-0.00012, 3],
      [0.00107, 1],
      [-0.0004, 0]
    ],
    "red_o_points": [],
    "y_categories": ["N", "NOT APPLICABLE", "Y", "nan"],
    "blue_o_points": [],
    "blue_x_points": [
      [0.00129, 1],
      [-9e-5, 3],
      [0.00106, 1],
      [-0.00045, 0],
      [-0.0001, 3],
      [0.00037, 1],
      [0.00104, 1]
    ]
  },
  "QS_mulTransfSite[AcSsAA]": {
    "red_x_points": [
      [-0.00344, 3],
      [-0.00782, 2],
      [-0.00366, 0],
      [-0.0088, 2],
      [-0.00927, 2],
      [-0.00343, 0],
      [-0.00357, 0],
      [-0.00317, 3],
      [-0.00359, 0],
      [-0.00851, 2],
      [-0.00339, 0],
      [-0.00329, 3],
      [0.01543, 1],
      [-0.00351, 3],
      [-0.01, 2],
      [-0.00346, 3],
      [-0.00328, 0],
      [-0.0039, 0],
      [-0.00325, 3],
      [-0.00315, 3],
      [-0.00293, 3],
      [-0.00762, 2],
      [-0.00307, 3],
      [-0.00308, 3],
      [-0.00342, 3],
      [-0.00341, 0],
      [-0.00313, 3],
      [-0.0084, 2],
      [-0.00312, 3],
      [0.01574, 1],
      [-0.00357, 0]
    ],
    "red_o_points": [],
    "y_categories": ["N", "NOT APPLICABLE", "Y", "nan"],
    "blue_o_points": [],
    "blue_x_points": [
      [0.02086, 1],
      [-0.001, 3],
      [0.01614, 1],
      [-0.00104, 0],
      [-0.00133, 3],
      [0.01494, 1],
      [0.01676, 1]
    ]
  },
  "QS_mulLysisRoot[C5]": {
    "red_x_points": [
      [-0.00083, 3],
      [-0.00118, 0],
      [-0.00224, 2],
      [-0.00114, 0],
      [-0.00135, 0],
      [-0.00125, 0],
      [-0.00116, 0],
      [-0.00075, 3],
      [-0.00125, 0],
      [-0.00136, 0],
      [-0.00117, 0],
      [-0.00064, 3],
      [0.00301, 1],
      [-0.00074, 3],
      [-0.00124, 0],
      [-0.0007, 3],
      [-0.00123, 0],
      [-0.0012, 0],
      [-0.00075, 3],
      [-0.0007, 3],
      [-0.00054, 3],
      [-0.00126, 0],
      [-0.00063, 3],
      [-0.00055, 3],
      [-0.00071, 3],
      [-0.00104, 0],
      [-0.00071, 3],
      [-0.00112, 0],
      [-0.00076, 3],
      [0.00375, 1],
      [-0.00219, 2]
    ],
    "red_o_points": [],
    "y_categories": ["N", "NOT APPLICABLE", "Y", "nan"],
    "blue_o_points": [],
    "blue_x_points": [
      [0.00514, 1],
      [-0.00032, 3],
      [0.00368, 1],
      [-0.00119, 0],
      [-0.00022, 3],
      [0.00356, 1],
      [0.00428, 1]
    ]
  },
  "QS_mulNeuromadSite[C6]": {
    "red_x_points": [
      [-0.00077, 2],
      [-0.00179, 0],
      [-0.00175, 0],
      [-0.00196, 0],
      [-0.00205, 0],
      [-0.00188, 0],
      [-0.00211, 0],
      [-0.00074, 2],
      [-0.00224, 0],
      [-0.0021, 0],
      [-0.0018, 0],
      [-0.00081, 2],
      [0.00251, 1],
      [-0.00083, 2],
      [-0.0023, 0],
      [-0.00067, 2],
      [-0.00152, 0],
      [-0.0017, 0],
      [-0.00062, 2],
      [-0.00074, 2],
      [-0.00043, 2],
      [-0.00138, 0],
      [-0.00066, 2],
      [-0.00075, 2],
      [-0.00086, 2],
      [-0.00174, 0],
      [-0.00077, 2],
      [-0.00183, 0],
      [-0.00049, 2],
      [0.00302, 1],
      [-0.00186, 0]
    ],
    "red_o_points": [],
    "y_categories": ["N", "NOT APPLICABLE", "nan"],
    "blue_o_points": [],
    "blue_x_points": [
      [0.00882, 1],
      [-1e-5, 2],
      [0.00397, 1],
      [0.00016, 0],
      [2e-5, 2],
      [0.00417, 1],
      [0.00358, 1]
    ]
  },
  "QS_mulNeuromadSite[T1]": {
    "red_x_points": [
      [-0.00141, 2],
      [-0.00434, 0],
      [-0.00437, 0],
      [-0.0043, 0],
      [-0.00468, 0],
      [-0.00393, 0],
      [-0.00435, 0],
      [-0.0012, 2],
      [-0.00457, 0],
      [-0.004, 0],
      [-0.00464, 0],
      [-0.00154, 2],
      [0.0079, 1],
      [-0.00182, 2],
      [-0.00475, 0],
      [-0.00174, 2],
      [-0.00346, 0],
      [-0.00477, 0],
      [-0.00143, 2],
      [-0.00142, 2],
      [-0.00082, 2],
      [-0.00323, 0],
      [-0.0014, 2],
      [-0.00156, 2],
      [-0.00148, 2],
      [-0.0039, 0],
      [-0.00179, 2],
      [-0.00417, 0],
      [-0.00122, 2],
      [0.00713, 1],
      [-0.00409, 0]
    ],
    "red_o_points": [],
    "y_categories": ["N", "NOT APPLICABLE", "nan"],
    "blue_o_points": [],
    "blue_x_points": [
      [0.01671, 1],
      [-0.00026, 2],
      [0.00838, 1],
      [0.00028, 0],
      [-0.00022, 2],
      [0.00818, 1],
      [0.01148, 1]
    ]
  },
  "QA_lstPexMuscstrength[ShoulderAbduc]": {
    "red_x_points": [
      [-0.00692, 1],
      [-0.00704, 1],
      [-0.00693, 1],
      [-0.00664, 1],
      [-0.00732, 1],
      [-0.00688, 1],
      [-0.00703, 1],
      [-0.00671, 1],
      [-0.00717, 1],
      [-0.00663, 1],
      [-0.00707, 1],
      [-0.00711, 1],
      [0.00187, 2],
      [0.00587, 2],
      [0.00582, 2],
      [0.00602, 2],
      [0.00606, 2],
      [-0.00732, 1],
      [-0.00715, 1],
      [-0.00696, 1],
      [-0.00714, 1],
      [-0.00712, 1],
      [0.00596, 2],
      [-0.00846, 1],
      [-0.00755, 1],
      [-0.00705, 1],
      [-0.00738, 1],
      [-0.00677, 1],
      [-0.00676, 1],
      [0.00205, 2],
      [-0.00653, 1]
    ],
    "red_o_points": [],
    "y_categories": ["GREATER THAN OR EQUALS TO 3", "LESS THAN 3", "nan"],
    "blue_o_points": [],
    "blue_x_points": [
      [0.00382, 2],
      [0.00596, 2],
      [0.02977, 0],
      [0.00707, 2],
      [0.006, 2],
      [0.02999, 0],
      [-0.00115, 1]
    ]
  },
  "QS_mulNeuromadSite[T2]": {
    "red_x_points": [
      [-0.00168, 2],
      [-0.00632, 0],
      [-0.00596, 0],
      [-0.00639, 0],
      [-0.00679, 0],
      [-0.00603, 0],
      [-0.00635, 0],
      [-0.00171, 2],
      [-0.00648, 0],
      [-0.00658, 0],
      [-0.00617, 0],
      [-0.00176, 2],
      [0.01038, 1],
      [-0.00181, 2],
      [-0.00652, 0],
      [-0.00206, 2],
      [-0.00657, 0],
      [-0.00695, 0],
      [-0.00179, 2],
      [-0.00183, 2],
      [-0.00131, 2],
      [-0.00563, 0],
      [-0.0018, 2],
      [-0.00245, 2],
      [-0.00203, 2],
      [-0.00635, 0],
      [-0.00195, 2],
      [-0.00614, 0],
      [-0.00131, 2],
      [0.01145, 1],
      [-0.00646, 0]
    ],
    "red_o_points": [],
    "y_categories": ["N", "NOT APPLICABLE", "nan"],
    "blue_o_points": [],
    "blue_x_points": [
      [0.02523, 1],
      [-0.00024, 2],
      [0.01232, 1],
      [0.00036, 0],
      [-0.00015, 2],
      [0.01357, 1],
      [0.01675, 1]
    ]
  },
  "QS_mulGraftNerve[MC]": {
    "red_x_points": [
      [-1e-5, 0],
      [-1e-5, 0],
      [-1e-5, 0],
      [-1e-5, 2],
      [-1e-5, 0],
      [-1e-5, 0],
      [-1e-5, 0],
      [-1e-5, 2],
      [-1e-5, 2],
      [-1e-5, 0],
      [-1e-5, 2],
      [-1e-5, 2],
      [-1e-5, 2],
      [-1e-5, 0],
      [-1e-5, 2],
      [-1e-5, 0],
      [-1e-5, 0]
    ],
    "red_o_points": [],
    "y_categories": ["N", "NOT APPLICABLE", "nan"],
    "blue_o_points": [],
    "blue_x_points": [[0.00019, 1]]
  },
  "QS_mulNeuromadSite[C4]": {
    "red_x_points": [
      [-0.00061, 2],
      [-0.00163, 0],
      [-0.00157, 0],
      [-0.00167, 0],
      [-0.00202, 0],
      [-0.00176, 0],
      [-0.00162, 0],
      [-0.00059, 2],
      [-0.00185, 0],
      [-0.00183, 0],
      [-0.0018, 0],
      [-0.00065, 2],
      [0.0029, 1],
      [-0.0006, 2],
      [-0.00166, 0],
      [-0.00083, 2],
      [-0.00174, 0],
      [-0.00151, 0],
      [-0.00059, 2],
      [-0.0006, 2],
      [-0.00067, 2],
      [-0.00171, 0],
      [-0.00053, 2],
      [-0.00056, 2],
      [-0.0008, 2],
      [-0.00167, 0],
      [-0.00072, 2],
      [-0.0019, 0],
      [-0.00049, 2],
      [0.00311, 1],
      [-0.00149, 0]
    ],
    "red_o_points": [],
    "y_categories": ["N", "NOT APPLICABLE", "nan"],
    "blue_o_points": [],
    "blue_x_points": [
      [0.00635, 1],
      [-0.00027, 2],
      [0.00408, 1],
      [-5e-5, 0],
      [-0.00019, 2],
      [0.0039, 1],
      [0.0048, 1]
    ]
  },
  "QS_mulGraftNerve[Ra]": {
    "red_x_points": [
      [-0.0, 2],
      [-0.00019, 0],
      [-0.00016, 0],
      [-0.00025, 0],
      [-0.00025, 0],
      [-0.00025, 0],
      [-0.00016, 0],
      [-1e-5, 2],
      [-0.00021, 0],
      [-0.00019, 0],
      [-0.00021, 0],
      [-3e-5, 2],
      [0.00029, 1],
      [-2e-5, 2],
      [-0.00025, 0],
      [-2e-5, 2],
      [-0.00023, 0],
      [-0.00019, 0],
      [-2e-5, 2],
      [-2e-5, 2],
      [2e-5, 2],
      [-0.00014, 0],
      [0.0, 2],
      [2e-5, 2],
      [-3e-5, 2],
      [-0.00021, 0],
      [-2e-5, 2],
      [-0.00011, 0],
      [-0.0, 2],
      [0.00018, 1],
      [-0.00011, 0]
    ],
    "red_o_points": [],
    "y_categories": ["N", "NOT APPLICABLE", "nan"],
    "blue_o_points": [],
    "blue_x_points": [
      [0.00052, 1],
      [0.0, 2],
      [0.0001, 1],
      [2e-5, 2],
      [0.0005, 1],
      [0.00049, 1]
    ]
  },
  "QS_mulTransfSite[Oberlin]": {
    "red_x_points": [
      [-0.00433, 3],
      [-0.0121, 0],
      [-0.01273, 0],
      [-0.01213, 0],
      [-0.00558, 2],
      [-0.00496, 2],
      [-0.01238, 0],
      [-0.00458, 3],
      [-0.00507, 2],
      [-0.00525, 2],
      [-0.00531, 2],
      [-0.00433, 3],
      [0.02245, 1],
      [-0.00431, 3],
      [-0.0054, 2],
      [-0.00457, 3],
      [-0.01153, 0],
      [-0.00562, 2],
      [-0.00472, 3],
      [-0.00416, 3],
      [-0.00416, 3],
      [-0.01145, 0],
      [-0.00443, 3],
      [-0.00486, 3],
      [-0.00481, 3],
      [-0.00513, 2],
      [-0.00461, 3],
      [-0.01135, 0],
      [-0.00411, 3],
      [0.02015, 1],
      [-0.01144, 0]
    ],
    "red_o_points": [],
    "y_categories": ["N", "NOT APPLICABLE", "Y", "nan"],
    "blue_o_points": [],
    "blue_x_points": [
      [0.03243, 1],
      [-0.00197, 3],
      [0.02326, 1],
      [0.00015, 2],
      [-0.00206, 3],
      [0.02298, 1],
      [0.02416, 1]
    ]
  },
  "QS_mulGraftNerve[FI]": {
    "red_x_points": [
      [-0.00018, 2],
      [-0.00039, 0],
      [-0.00047, 0],
      [-0.00044, 0],
      [-0.00078, 0],
      [-0.0004, 0],
      [-0.0005, 0],
      [-0.00013, 2],
      [-0.00037, 0],
      [-0.00037, 0],
      [-0.00049, 0],
      [-0.00027, 2],
      [0.00043, 1],
      [-0.00027, 2],
      [-0.00059, 0],
      [-0.00025, 2],
      [-0.00031, 0],
      [-0.00047, 0],
      [-0.00027, 2],
      [-0.00022, 2],
      [-0.00012, 2],
      [-0.0003, 0],
      [-0.00029, 2],
      [-0.00037, 2],
      [-0.00018, 2],
      [-0.00042, 0],
      [-0.0002, 2],
      [-0.00044, 0],
      [-9e-5, 2],
      [0.00039, 1],
      [-0.00054, 0]
    ],
    "red_o_points": [],
    "y_categories": ["N", "NOT APPLICABLE", "nan"],
    "blue_o_points": [],
    "blue_x_points": [
      [0.00288, 1],
      [8e-5, 2],
      [0.00107, 1],
      [0.00016, 0],
      [-9e-5, 2],
      [0.00088, 1],
      [0.00117, 1]
    ]
  }
}
