{
  "QA_lstPexMuscstrength[ElbowFlex]": {
    "red_x_points": [
      [-0.00377, 1],
      [0.0006, 2],
      [-0.00211, 1],
      [-0.00213, 1],
      [0.0014, 0],
      [-0.0014, 1],
      [-0.00222, 1],
      [-0.00354, 1],
      [-0.00185, 1],
      [-0.00163, 1],
      [-0.00161, 1],
      [-0.00337, 1],
      [0.00069, 2],
      [0.00302, 2],
      [0.00036, 2],
      [-0.00386, 1],
      [0.00039, 2],
      [0.00082, 0],
      [-0.00366, 1],
      [-0.00325, 1],
      [-0.00304, 1],
      [-0.00147, 1],
      [0.00224, 2],
      [0.0006, 0],
      [-0.00395, 1],
      [-0.0018, 1],
      [-0.00329, 1],
      [-0.00177, 1],
      [-0.00363, 1],
      [0.00061, 2],
      [-0.00173, 1]
    ],
    "red_o_points": [],
    "y_categories": ["GREATER THAN OR EQUALS TO 3", "LESS THAN 3", "nan"],
    "blue_o_points": [],
    "blue_x_points": [
      [0.00071, 2],
      [0.00493, 2],
      [0.00415, 0],
      [0.00136, 1],
      [0.00426, 2],
      [0.00628, 0],
      [0.00569, 0]
    ]
  },
  "QS_mulGraftRoot[C6]": {
    "red_x_points": [
      [-3e-5, 0],
      [-3e-5, 0],
      [-3e-5, 0],
      [-3e-5, 0],
      [-3e-5, 0],
      [-1e-5, 2],
      [-3e-5, 0],
      [-3e-5, 0],
      [-3e-5, 0],
      [-1e-5, 2],
      [-1e-5, 2],
      [-3e-5, 0],
      [-3e-5, 0],
      [-3e-5, 0],
      [-1e-5, 2],
      [-1e-5, 2],
      [-1e-5, 2],
      [-1e-5, 2],
      [-1e-5, 2],
      [-3e-5, 0],
      [-1e-5, 2],
      [-1e-5, 2],
      [0.00011, 1]
    ],
    "red_o_points": [],
    "y_categories": ["N", "NOT APPLICABLE", "nan"],
    "blue_o_points": [],
    "blue_x_points": [
      [0.00011, 1],
      [-1e-5, 2],
      [0.00011, 1],
      [-3e-5, 0],
      [-1e-5, 2]
    ]
  },
  "QS_mulBpsurgeryType[Transf]": {
    "red_x_points": [
      [-0.00034, 3],
      [-0.00092, 2],
      [-0.00197, 0],
      [-0.00069, 2],
      [-0.00089, 2],
      [-0.00074, 2],
      [-0.00085, 2],
      [-0.00047, 3],
      [-0.00085, 2],
      [-0.00085, 2],
      [-0.00079, 2],
      [-0.00047, 3],
      [0.00281, 1],
      [-0.00035, 3],
      [-0.00063, 2],
      [-0.00057, 3],
      [-0.00082, 2],
      [-0.00088, 2],
      [-0.00056, 3],
      [-0.00052, 3],
      [-0.00042, 3],
      [-0.00085, 2],
      [-0.00049, 3],
      [-0.00042, 3],
      [-0.00038, 3],
      [-0.00101, 2],
      [-0.00036, 3],
      [-0.00082, 2],
      [-0.00054, 3],
      [0.00231, 1],
      [-0.00073, 2]
    ],
    "red_o_points": [],
    "y_categories": ["N", "NOT APPLICABLE", "Y", "nan"],
    "blue_o_points": [],
    "blue_x_points": [
      [0.00257, 1],
      [-0.00032, 3],
      [0.00256, 1],
      [-0.00086, 2],
      [-0.0001, 3],
      [0.00283, 1],
      [0.00318, 1]
    ]
  },
  "QS_mulNeuromadSite[T1]": {
    "red_x_points": [
      [-0.00147, 2],
      [-0.00422, 0],
      [-0.00393, 0],
      [-0.00385, 0],
      [-0.00423, 0],
      [-0.00402, 0],
      [-0.00391, 0],
      [-0.00116, 2],
      [-0.00373, 0],
      [-0.00365, 0],
      [-0.00408, 0],
      [-0.00159, 2],
      [0.00636, 1],
      [-0.00129, 2],
      [-0.00421, 0],
      [-0.0016, 2],
      [-0.00429, 0],
      [-0.00395, 0],
      [-0.00154, 2],
      [-0.00101, 2],
      [-0.00126, 2],
      [-0.00363, 0],
      [-0.00136, 2],
      [-0.00171, 2],
      [-0.0013, 2],
      [-0.00367, 0],
      [-0.00124, 2],
      [-0.00376, 0],
      [-0.00089, 2],
      [0.00813, 1],
      [-0.00369, 0]
    ],
    "red_o_points": [],
    "y_categories": ["N", "NOT APPLICABLE", "nan"],
    "blue_o_points": [],
    "blue_x_points": [
      [0.01318, 1],
      [0.00018, 2],
      [0.00841, 1],
      [2e-5, 0],
      [-6e-5, 2],
      [0.01011, 1],
      [0.01058, 1]
    ]
  },
  "QS_mulNeuromadSite[T2]": {
    "red_x_points": [
      [-0.00196, 2],
      [-0.0063, 0],
      [-0.00585, 0],
      [-0.00563, 0],
      [-0.007, 0],
      [-0.00627, 0],
      [-0.0058, 0],
      [-0.00239, 2],
      [-0.00641, 0],
      [-0.0065, 0],
      [-0.00606, 0],
      [-0.00221, 2],
      [0.01144, 1],
      [-0.00175, 2],
      [-0.00668, 0],
      [-0.00244, 2],
      [-0.00673, 0],
      [-0.0061, 0],
      [-0.00208, 2],
      [-0.00206, 2],
      [-0.00205, 2],
      [-0.00575, 0],
      [-0.0018, 2],
      [-0.00248, 2],
      [-0.00237, 2],
      [-0.00614, 0],
      [-0.00196, 2],
      [-0.00643, 0],
      [-0.00206, 2],
      [0.01299, 1],
      [-0.00646, 0]
    ],
    "red_o_points": [],
    "y_categories": ["N", "NOT APPLICABLE", "nan"],
    "blue_o_points": [],
    "blue_x_points": [
      [0.01904, 1],
      [-0.00028, 2],
      [0.01414, 1],
      [-0.0005, 0],
      [-0.00047, 2],
      [0.01474, 1],
      [0.01682, 1]
    ]
  },
  "QA_mulInjOrthesisType[ShoulderSupport]": {
    "red_x_points": [
      [-0.01018, 0],
      [-0.0095, 0],
      [-0.00913, 0],
      [-0.00887, 0],
      [-0.00959, 0],
      [-0.00947, 0],
      [-0.00925, 0],
      [-0.01174, 2],
      [-0.00894, 0],
      [-0.0091, 0],
      [-0.00902, 0],
      [-0.00987, 0],
      [0.0222, 1],
      [-0.0103, 0],
      [-0.00924, 0],
      [-0.01025, 0],
      [-0.01123, 2],
      [-0.00939, 0],
      [-0.01031, 0],
      [-0.0103, 0],
      [-0.01179, 2],
      [-0.01057, 3],
      [-0.00996, 0],
      [0.02733, 1],
      [-0.00931, 0],
      [-0.0085, 0],
      [-0.01003, 0],
      [-0.00944, 0],
      [-0.01194, 3],
      [-0.01721, 3],
      [-0.00901, 0]
    ],
    "red_o_points": [],
    "y_categories": ["N", "NOT APPLICABLE", "Y", "nan"],
    "blue_o_points": [],
    "blue_x_points": [
      [-0.00235, 0],
      [0.02888, 1],
      [0.02539, 1],
      [0.02928, 1],
      [0.0294, 1],
      [0.0237, 1],
      [0.02495, 1]
    ]
  },
  "QS_mulGraftRoot[T1]": {
    "red_x_points": [
      [-3e-5, 2],
      [-7e-5, 0],
      [-4e-5, 0],
      [-7e-5, 0],
      [-4e-5, 0],
      [-6e-5, 0],
      [-3e-5, 0],
      [-1e-5, 2],
      [-3e-5, 0],
      [-4e-5, 0],
      [-6e-5, 0],
      [-3e-5, 2],
      [9e-5, 1],
      [-2e-5, 2],
      [-7e-5, 0],
      [-3e-5, 2],
      [-3e-5, 0],
      [-7e-5, 0],
      [-2e-5, 2],
      [-3e-5, 2],
      [-2e-5, 2],
      [-6e-5, 0],
      [-3e-5, 2],
      [-2e-5, 2],
      [-4e-5, 0],
      [-1e-5, 2],
      [-1e-5, 0],
      [-2e-5, 2],
      [0.00019, 1],
      [-4e-5, 0]
    ],
    "red_o_points": [],
    "y_categories": ["N", "NOT APPLICABLE", "nan"],
    "blue_o_points": [],
    "blue_x_points": [
      [0.00038, 1],
      [-2e-5, 2],
      [0.0001, 1],
      [-6e-5, 0],
      [-2e-5, 2],
      [9e-5, 1],
      [0.0001, 1]
    ]
  },
  "QA_lstPexMuscstrength[FingersAddu]": {
    "red_x_points": [
      [-7e-5, 0],
      [8e-5, 2],
      [-6e-5, 1],
      [-0.00018, 1],
      [-6e-5, 0],
      [-0.00017, 1],
      [-6e-5, 0],
      [-0.00018, 0],
      [-0.00011, 0],
      [-6e-5, 0],
      [2e-5, 2],
      [2e-5, 2],
      [2e-5, 2],
      [-7e-5, 0],
      [2e-5, 2],
      [-0.00011, 0],
      [-6e-5, 0],
      [-6e-5, 1],
      [-6e-5, 1],
      [7e-5, 2],
      [7e-5, 2],
      [0.00023, 2],
      [-6e-5, 1],
      [7e-5, 2],
      [-0.00011, 1]
    ],
    "red_o_points": [],
    "y_categories": ["GREATER THAN OR EQUALS TO 3", "LESS THAN 3", "nan"],
    "blue_o_points": [],
    "blue_x_points": [[7e-5, 2], [0.00032, 2], [7e-5, 2], [-1e-5, 0]]
  },
  "QS_mulGraftTrunk[MiddleTrunk]": {
    "red_x_points": [
      [-2e-5, 2],
      [-2e-5, 0],
      [-2e-5, 0],
      [-2e-5, 0],
      [-2e-5, 0],
      [-2e-5, 0],
      [-2e-5, 0],
      [-2e-5, 2],
      [-2e-5, 0],
      [-2e-5, 0],
      [-2e-5, 2],
      [-2e-5, 0],
      [-2e-5, 0],
      [-2e-5, 2],
      [-2e-5, 2],
      [-2e-5, 2],
      [-2e-5, 0]
    ],
    "red_o_points": [],
    "y_categories": ["N", "NOT APPLICABLE", "nan"],
    "blue_o_points": [],
    "blue_x_points": [[0.00018, 1]]
  },
  "QS_mulLysisTrunk[Upper]": {
    "red_x_points": [
      [-0.00167, 3],
      [-0.00298, 0],
      [-0.00269, 0],
      [-0.00289, 0],
      [-0.00285, 0],
      [-0.0051, 2],
      [-0.00292, 0],
      [-0.00197, 3],
      [-0.00299, 0],
      [-0.00277, 0],
      [-0.00287, 0],
      [-0.0019, 3],
      [0.00766, 1],
      [-0.00139, 3],
      [-0.00311, 0],
      [-0.00183, 3],
      [-0.00571, 2],
      [-0.00333, 0],
      [-0.00145, 3],
      [-0.00138, 3],
      [-0.00173, 3],
      [-0.00289, 0],
      [-0.00151, 3],
      [-0.0021, 3],
      [-0.00179, 3],
      [-0.00232, 0],
      [-0.00138, 3],
      [-0.00291, 0],
      [-0.00146, 3],
      [0.0087, 1],
      [-0.00487, 2]
    ],
    "red_o_points": [],
    "y_categories": ["N", "NOT APPLICABLE", "Y", "nan"],
    "blue_o_points": [],
    "blue_x_points": [
      [0.01114, 1],
      [-0.00063, 3],
      [0.01, 1],
      [-0.00133, 0],
      [-0.00029, 3],
      [0.00918, 1],
      [0.00872, 1]
    ]
  },
  "QS_mulGraftNerve[Ac]": {
    "red_x_points": [
      [-0.0005, 2],
      [-0.00119, 0],
      [-0.00161, 0],
      [-0.0015, 0],
      [-0.0015, 0],
      [-0.00143, 0],
      [-0.00137, 0],
      [-0.00059, 2],
      [-0.00142, 0],
      [-0.00135, 0],
      [-0.00125, 0],
      [-0.00086, 2],
      [0.00308, 1],
      [-0.00044, 2],
      [-0.00113, 0],
      [-0.00077, 2],
      [-0.0013, 0],
      [-0.00155, 0],
      [-0.00034, 2],
      [-0.00034, 2],
      [-0.00061, 2],
      [-0.00096, 0],
      [-0.00044, 2],
      [-0.00048, 2],
      [-0.00038, 2],
      [-0.0014, 0],
      [-0.00035, 2],
      [-0.00157, 0],
      [-0.00051, 2],
      [0.00341, 1],
      [-0.00113, 0]
    ],
    "red_o_points": [],
    "y_categories": ["N", "NOT APPLICABLE", "nan"],
    "blue_o_points": [],
    "blue_x_points": [
      [0.00398, 1],
      [-9e-5, 2],
      [0.00341, 1],
      [-0.00025, 0],
      [2e-5, 2],
      [0.00262, 1],
      [0.00336, 1]
    ]
  },
  "QS_mulGraftNerve[Me]": {
    "red_x_points": [
      [-0.00016, 2],
      [-0.0004, 0],
      [-0.00041, 0],
      [-0.00052, 0],
      [-0.00057, 0],
      [-0.00056, 0],
      [-0.0005, 0],
      [-0.00016, 2],
      [-0.00055, 0],
      [-0.00063, 0],
      [-0.00043, 0],
      [-9e-5, 2],
      [0.00082, 1],
      [-0.00015, 2],
      [-0.00053, 0],
      [-0.00022, 2],
      [-0.00051, 0],
      [-0.00069, 0],
      [-0.0001, 2],
      [-0.00016, 2],
      [-5e-5, 2],
      [-0.0003, 0],
      [-0.00016, 2],
      [-0.00036, 2],
      [-0.00016, 2],
      [-0.00037, 0],
      [-0.00015, 2],
      [-0.00043, 0],
      [-0.00014, 2],
      [0.00093, 1],
      [-0.00045, 0]
    ],
    "red_o_points": [],
    "y_categories": ["N", "NOT APPLICABLE", "nan"],
    "blue_o_points": [],
    "blue_x_points": [
      [0.00158, 1],
      [-1e-5, 2],
      [0.001, 1],
      [-0.00015, 0],
      [-2e-5, 2],
      [0.00158, 1],
      [0.00125, 1]
    ]
  },
  "QA_lstPexMuscstrength[FingersAbdu]": {
    "red_x_points": [
      [3e-5, 2],
      [1e-5, 2],
      [-0.0001, 1],
      [-9e-5, 1],
      [4e-5, 0],
      [2e-5, 0],
      [-0.0002, 1],
      [7e-5, 0],
      [-1e-5, 0],
      [0.00011, 2],
      [-0.0002, 1],
      [7e-5, 0],
      [3e-5, 2],
      [1e-5, 2],
      [2e-5, 2],
      [6e-5, 0],
      [3e-5, 2],
      [1e-5, 0],
      [0.0, 0],
      [-0.00019, 1],
      [7e-5, 0],
      [-5e-5, 1],
      [3e-5, 2],
      [0.0, 2],
      [3e-5, 2],
      [-0.00014, 1],
      [2e-5, 2],
      [-0.00014, 1],
      [1e-5, 2],
      [3e-5, 2],
      [-0.00019, 1]
    ],
    "red_o_points": [],
    "y_categories": ["GREATER THAN OR EQUALS TO 3", "LESS THAN 3", "nan"],
    "blue_o_points": [],
    "blue_x_points": [
      [3e-5, 2],
      [0.00011, 0],
      [0.0001, 2],
      [2e-5, 2],
      [0.00011, 0],
      [2e-5, 0]
    ]
  },
  "QS_mulNeuromadSite[C8]": {
    "red_x_points": [
      [-0.00105, 2],
      [-0.00366, 0],
      [-0.00429, 0],
      [-0.00365, 0],
      [-0.00406, 0],
      [-0.00359, 0],
      [-0.00405, 0],
      [-0.00146, 2],
      [-0.00358, 0],
      [-0.00353, 0],
      [-0.00347, 0],
      [-0.00104, 2],
      [0.00631, 1],
      [-0.00107, 2],
      [-0.00404, 0],
      [-0.00139, 2],
      [-0.00391, 0],
      [-0.00416, 0],
      [-0.00109, 2],
      [-0.00108, 2],
      [-0.00117, 2],
      [-0.00376, 0],
      [-0.00138, 2],
      [-0.00118, 2],
      [-0.00144, 2],
      [-0.00336, 0],
      [-0.00097, 2],
      [-0.00371, 0],
      [-0.00106, 2],
      [0.00644, 1],
      [-0.0038, 0]
    ],
    "red_o_points": [],
    "y_categories": ["N", "NOT APPLICABLE", "nan"],
    "blue_o_points": [],
    "blue_x_points": [
      [0.01229, 1],
      [0.00019, 2],
      [0.00951, 1],
      [-0.0004, 0],
      [-0.00024, 2],
      [0.00931, 1],
      [0.00962, 1]
    ]
  },
  "QS_mulGraftNerve[Ph]": {
    "red_x_points": [
      [-0.00047, 2],
      [-0.00145, 0],
      [-0.00152, 0],
      [-0.00126, 0],
      [-0.00145, 0],
      [-0.00119, 0],
      [-0.00142, 0],
      [-0.00047, 2],
      [-0.00129, 0],
      [-0.00127, 0],
      [-0.0013, 0],
      [-0.00049, 2],
      [0.00214, 1],
      [-0.00047, 2],
      [-0.00119, 0],
      [-0.00045, 2],
      [-0.00092, 0],
      [-0.00116, 0],
      [-0.00058, 2],
      [-0.00037, 2],
      [-0.00032, 2],
      [-0.00131, 0],
      [-0.00042, 2],
      [-0.00036, 2],
      [-0.00052, 2],
      [-0.0014, 0],
      [-0.00045, 2],
      [-0.00131, 0],
      [-0.00035, 2],
      [0.00281, 1],
      [-0.00109, 0]
    ],
    "red_o_points": [],
    "y_categories": ["N", "NOT APPLICABLE", "nan"],
    "blue_o_points": [],
    "blue_x_points": [
      [0.00416, 1],
      [-0.00021, 2],
      [0.00306, 1],
      [-8e-5, 0],
      [-8e-5, 2],
      [0.00325, 1],
      [0.00309, 1]
    ]
  },
  "QS_mulTransfSite[AcSsPA]": {
    "red_x_points": [
      [-0.00051, 3],
      [-0.00122, 0],
      [-0.00109, 0],
      [-0.00127, 0],
      [-0.00122, 0],
      [-0.001, 0],
      [-0.00111, 0],
      [-0.00034, 3],
      [-0.00131, 0],
      [-0.00102, 0],
      [-0.00121, 0],
      [-0.00035, 3],
      [0.00273, 1],
      [-0.00048, 3],
      [-0.00107, 0],
      [-0.00056, 3],
      [-0.00216, 2],
      [-0.00144, 0],
      [-0.00054, 3],
      [-0.00049, 3],
      [-0.00053, 3],
      [-0.00125, 0],
      [-0.00054, 3],
      [-0.0005, 3],
      [-0.00045, 3],
      [-0.00112, 0],
      [-0.00066, 3],
      [-0.0011, 0],
      [-0.00035, 3],
      [0.00329, 1],
      [-0.00104, 0]
    ],
    "red_o_points": [],
    "y_categories": ["N", "NOT APPLICABLE", "Y", "nan"],
    "blue_o_points": [],
    "blue_x_points": [
      [0.00369, 1],
      [-0.00012, 3],
      [0.00297, 1],
      [-0.00086, 0],
      [-0.00019, 3],
      [0.00338, 1],
      [0.00413, 1]
    ]
  },
  "QA_lstPexPalle[Elbow]": {
    "red_x_points": [
      [0.00013, 4],
      [3e-5, 4],
      [6e-5, 4],
      [3e-5, 4],
      [-0.00047, 3],
      [-0.00034, 3],
      [1e-5, 4],
      [5e-5, 4],
      [0.00012, 4],
      [0.00011, 1],
      [-0.00019, 3],
      [0.00023, 1],
      [0.00079, 4],
      [5e-5, 4],
      [5e-5, 4],
      [5e-5, 4],
      [4e-5, 4],
      [6e-5, 1],
      [-0.00023, 3],
      [-0.00024, 0],
      [-0.0002, 3],
      [-0.00024, 2],
      [6e-5, 4],
      [-0.00368, 3],
      [3e-5, 4],
      [2e-5, 4],
      [-0.00041, 3],
      [5e-5, 4],
      [4e-5, 4],
      [-0.01575, 3],
      [-0.00033, 0]
    ],
    "red_o_points": [],
    "y_categories": ["ABS", "HYPO", "NAIA", "PT", "nan"],
    "blue_o_points": [],
    "blue_x_points": [
      [0.00158, 4],
      [0.00028, 4],
      [0.00694, 1],
      [0.00051, 4],
      [0.00035, 4],
      [0.00178, 4],
      [0.002, 4]
    ]
  },
  "QA_lstPexMuscstrength[ScapulaAbducSuprot]": {
    "red_x_points": [
      [-0.00027, 0],
      [0.00022, 2],
      [-0.00019, 1],
      [-0.00027, 1],
      [-0.00024, 0],
      [-0.00035, 1],
      [-0.00049, 1],
      [-0.00061, 1],
      [-0.00022, 0],
      [-0.00016, 0],
      [-0.00056, 1],
      [-0.0008, 1],
      [0.00016, 2],
      [0.00027, 2],
      [7e-5, 2],
      [0.0003, 2],
      [0.00015, 2],
      [-0.00024, 0],
      [-0.00031, 0],
      [-0.00082, 1],
      [-0.00027, 0],
      [-0.00028, 1],
      [0.00038, 2],
      [-0.00053, 0],
      [0.00036, 2],
      [-0.00065, 1],
      [-0.0005, 1],
      [-4e-5, 0],
      [0.0002, 2],
      [0.00017, 2],
      [-0.00023, 1]
    ],
    "red_o_points": [],
    "y_categories": ["GREATER THAN OR EQUALS TO 3", "LESS THAN 3", "nan"],
    "blue_o_points": [],
    "blue_x_points": [
      [7e-5, 2],
      [0.00075, 2],
      [0.00012, 0],
      [0.00118, 2],
      [0.00039, 2],
      [0.00024, 0],
      [3e-5, 2]
    ]
  },
  "participant_code": {
    "red_x_points": [
      [-0.01479, 1],
      [-0.01414, 2],
      [-0.0146, 3],
      [-0.01474, 4],
      [-0.01488, 5],
      [-0.01442, 6],
      [-0.01479, 7],
      [-0.01521, 8],
      [-0.01418, 9],
      [-0.01381, 10],
      [-0.01479, 11],
      [-0.01409, 12],
      [-0.01418, 14],
      [-0.01437, 16],
      [-0.01372, 17],
      [-0.01414, 19],
      [-0.0147, 20],
      [-0.01432, 22],
      [-0.01474, 23],
      [-0.01381, 25],
      [-0.01432, 26],
      [-0.0139, 27],
      [-0.01381, 28],
      [-0.0146, 29],
      [-0.01484, 30],
      [-0.01386, 32],
      [-0.01446, 33],
      [-0.01488, 34],
      [-0.01493, 35],
      [-0.01442, 36],
      [-0.01395, 37]
    ],
    "red_o_points": [],
    "y_categories": [
      "P16554",
      "P18297",
      "P19283",
      "P19287",
      "P23391",
      "P31645",
      "P31691",
      "P34778",
      "P35046",
      "P36328",
      "P43633",
      "P4544",
      "P46417",
      "P48965",
      "P53068",
      "P5497",
      "P59529",
      "P62483",
      "P64658",
      "P65202",
      "P66816",
      "P6751",
      "P7408",
      "P75566",
      "P76226",
      "P79971",
      "P82621",
      "P82990",
      "P84932",
      "P85825",
      "P86989",
      "P8770",
      "P87791",
      "P90550",
      "P93159",
      "P94969",
      "P96710",
      "P9744",
      "nan"
    ],
    "blue_o_points": [],
    "blue_x_points": [
      [0.04415, 0],
      [0.04001, 13],
      [0.04032, 15],
      [0.04124, 18],
      [0.04231, 21],
      [0.042, 24],
      [0.04078, 31]
    ]
  },
  "QA_lstPexMuscstrength[ShoulderExrot]": {
    "red_x_points": [
      [-0.0016, 1],
      [0.00029, 2],
      [0.00166, 0],
      [-0.00144, 1],
      [-0.00206, 1],
      [-0.00148, 1],
      [0.00044, 2],
      [-0.00141, 1],
      [-0.00144, 1],
      [-0.00133, 1],
      [0.00028, 2],
      [-0.00132, 1],
      [0.00015, 2],
      [0.00025, 2],
      [0.00041, 2],
      [0.00038, 2],
      [0.00042, 2],
      [-0.0024, 1],
      [-0.00169, 1],
      [-0.00157, 1],
      [-0.00143, 1],
      [0.00033, 2],
      [0.00035, 2],
      [0.00034, 2],
      [0.00028, 2],
      [-0.00155, 1],
      [0.0005, 2],
      [0.00186, 0],
      [0.00035, 2],
      [9e-5, 2],
      [-0.00148, 1]
    ],
    "red_o_points": [],
    "y_categories": ["GREATER THAN OR EQUALS TO 3", "LESS THAN 3", "nan"],
    "blue_o_points": [],
    "blue_x_points": [
      [5e-5, 2],
      [0.00042, 2],
      [0.00297, 0],
      [0.00072, 2],
      [0.00054, 2],
      [0.00314, 0],
      [0.00011, 1]
    ]
  },
  "QA_mulInjOrthesisType[ArmSling]": {
    "red_x_points": [
      [-0.00938, 2],
      [-0.00912, 2],
      [-0.00876, 2],
      [-0.00911, 2],
      [-0.00877, 2],
      [-0.00852, 2],
      [-0.00907, 2],
      [-0.00924, 2],
      [-0.00938, 2],
      [-0.00857, 2],
      [-0.00909, 2],
      [-0.00985, 2],
      [0.0241, 1],
      [-0.00987, 2],
      [-0.00953, 2],
      [-0.00965, 2],
      [-0.01065, 0],
      [-0.00886, 2],
      [-0.00937, 2],
      [-0.00926, 2],
      [-0.01179, 0],
      [-0.01041, 3],
      [-0.01018, 2],
      [0.02582, 1],
      [-0.00954, 2],
      [-0.00897, 2],
      [-0.00964, 2],
      [-0.00876, 2],
      [-0.01097, 3],
      [-0.01599, 3],
      [-0.00834, 2]
    ],
    "red_o_points": [],
    "y_categories": ["N", "NOT APPLICABLE", "Y", "nan"],
    "blue_o_points": [],
    "blue_x_points": [
      [-0.00414, 2],
      [0.0271, 1],
      [0.02507, 1],
      [0.02914, 1],
      [0.02754, 1],
      [0.02366, 1],
      [0.024, 1]
    ]
  },
  "QS_mulGraftNerve[Ul]": {
    "red_x_points": [
      [-0.0003, 2],
      [-0.0009, 0],
      [-0.00091, 0],
      [-0.00087, 0],
      [-0.00095, 0],
      [-0.00093, 0],
      [-0.00092, 0],
      [-0.00035, 2],
      [-0.00083, 0],
      [-0.00091, 0],
      [-0.001, 0],
      [-0.00037, 2],
      [0.00145, 1],
      [-0.00033, 2],
      [-0.00099, 0],
      [-0.00051, 2],
      [-0.00069, 0],
      [-0.00094, 0],
      [-0.00046, 2],
      [-0.00031, 2],
      [-0.00031, 2],
      [-0.00077, 0],
      [-0.00047, 2],
      [-0.0005, 2],
      [-0.00042, 2],
      [-0.00055, 0],
      [-0.00037, 2],
      [-0.00092, 0],
      [-0.00031, 2],
      [0.00184, 1],
      [-0.00085, 0]
    ],
    "red_o_points": [],
    "y_categories": ["N", "NOT APPLICABLE", "nan"],
    "blue_o_points": [],
    "blue_x_points": [
      [0.00336, 1],
      [-0.00027, 2],
      [0.00252, 1],
      [2e-5, 0],
      [-0.0001, 2],
      [0.00228, 1],
      [0.00263, 1]
    ]
  },
  "QA_lstPexPain[C6]": {
    "red_x_points": [
      [-0.00055, 1],
      [-0.00018, 2],
      [-6e-5, 2],
      [-9e-5, 2],
      [-0.0014, 0],
      [5e-5, 1],
      [6e-5, 1],
      [-0.00103, 0],
      [0.00018, 1],
      [0.00017, 1],
      [0.00029, 1],
      [-0.00015, 1],
      [-0.00037, 2],
      [0.0003, 2],
      [-0.00011, 2],
      [0.00012, 2],
      [-5e-5, 2],
      [0.00027, 1],
      [-0.00042, 0],
      [-0.00044, 1],
      [-0.00027, 1],
      [-0.00014, 2],
      [0.00029, 2],
      [-0.00465, 0],
      [0.00017, 2],
      [-0.00046, 2],
      [-0.00044, 1],
      [-0.00026, 2],
      [-0.00048, 1],
      [1e-5, 1],
      [2e-5, 1]
    ],
    "red_o_points": [],
    "y_categories": ["NORM", "NPV", "nan"],
    "blue_o_points": [],
    "blue_x_points": [
      [0.0001, 1],
      [0.00088, 2],
      [0.00085, 1],
      [0.00177, 1],
      [0.00049, 2],
      [0.00089, 1],
      [0.00072, 1]
    ]
  },
  "QA_yonInjUnconscio": {
    "red_x_points": [
      [-0.00358, 1],
      [-0.00323, 1],
      [-0.00173, 2],
      [-0.00177, 2],
      [0.00782, 0],
      [-0.00441, 1],
      [-0.00181, 2],
      [-0.00357, 2],
      [-0.00209, 2],
      [-0.0013, 2],
      [-0.00345, 1],
      [-0.00441, 1],
      [-0.0187, 1],
      [-0.00445, 2],
      [-0.00155, 2],
      [-0.00404, 2],
      [-0.00339, 1],
      [0.00694, 0],
      [-0.00331, 1],
      [-0.0033, 1],
      [-0.00317, 1],
      [-0.00404, 1],
      [-0.00397, 2],
      [-0.00623, 1],
      [-0.00383, 2],
      [-0.00364, 1],
      [0.00812, 0],
      [-0.00336, 1],
      [-0.00436, 2],
      [-0.00072, 2],
      [-0.00342, 1]
    ],
    "red_o_points": [],
    "y_categories": ["N", "Y", "nan"],
    "blue_o_points": [],
    "blue_x_points": [
      [0.00062, 2],
      [-0.0004, 1],
      [0.0117, 0],
      [0.01587, 0],
      [0.01956, 0],
      [0.00146, 2],
      [0.0019, 2]
    ]
  },
  "QA_lstPexMuscstrength[ShoulderAbduc]": {
    "red_x_points": [
      [-0.00581, 1],
      [-0.00529, 1],
      [-0.0057, 1],
      [-0.00538, 1],
      [-0.00561, 1],
      [-0.00565, 1],
      [-0.00544, 1],
      [-0.00513, 1],
      [-0.00541, 1],
      [-0.00549, 1],
      [-0.00584, 1],
      [-0.00589, 1],
      [0.00217, 2],
      [0.0054, 2],
      [0.00498, 2],
      [0.00531, 2],
      [0.00464, 2],
      [-0.00573, 1],
      [-0.00589, 1],
      [-0.0055, 1],
      [-0.00585, 1],
      [-0.00572, 1],
      [0.00478, 2],
      [-0.00767, 1],
      [-0.00578, 1],
      [-0.0055, 1],
      [-0.00593, 1],
      [-0.00586, 1],
      [-0.00552, 1],
      [0.00319, 2],
      [-0.00541, 1]
    ],
    "red_o_points": [],
    "y_categories": ["GREATER THAN OR EQUALS TO 3", "LESS THAN 3", "nan"],
    "blue_o_points": [],
    "blue_x_points": [
      [0.00411, 2],
      [0.00537, 2],
      [0.02403, 0],
      [0.00575, 2],
      [0.00484, 2],
      [0.02155, 0],
      [-0.00076, 1]
    ]
  },
  "QS_mulGraftNerve[MCA]": {
    "red_x_points": [
      [-7e-5, 2],
      [-0.0001, 0],
      [-0.00014, 0],
      [-9e-5, 0],
      [-0.00017, 0],
      [-0.00013, 0],
      [-7e-5, 0],
      [-5e-5, 2],
      [-0.00017, 0],
      [-9e-5, 0],
      [-0.00017, 0],
      [-8e-5, 2],
      [0.00035, 1],
      [-7e-5, 2],
      [-0.00017, 0],
      [-7e-5, 2],
      [-9e-5, 0],
      [-0.00014, 0],
      [-4e-5, 2],
      [-6e-5, 2],
      [-5e-5, 2],
      [-0.0001, 0],
      [-3e-5, 2],
      [-2e-5, 2],
      [-7e-5, 2],
      [-0.00014, 0],
      [-3e-5, 2],
      [-0.00013, 0],
      [-5e-5, 2],
      [0.00026, 1],
      [-0.00012, 0]
    ],
    "red_o_points": [],
    "y_categories": ["N", "NOT APPLICABLE", "nan"],
    "blue_o_points": [],
    "blue_x_points": [
      [0.00087, 1],
      [-3e-5, 2],
      [0.00034, 1],
      [-0.00014, 0],
      [-4e-5, 2],
      [0.00026, 1],
      [0.00034, 1]
    ]
  },
  "QA_lstPexInspectio[SurgicalScar]": {
    "red_x_points": [
      [0.00168, 1],
      [0.00078, 1],
      [0.00032, 0],
      [0.00066, 1],
      [-0.00403, 2],
      [0.00013, 0],
      [0.00062, 1],
      [0.00174, 1],
      [0.001, 1],
      [-0.00267, 2],
      [0.00091, 1],
      [-0.00135, 0],
      [-0.0018, 1],
      [-0.00492, 2],
      [0.00105, 1],
      [0.00168, 1],
      [-0.00037, 0],
      [-0.00368, 2],
      [-0.00413, 2],
      [-0.00386, 2],
      [0.00122, 1],
      [0.00079, 1],
      [-0.00435, 2],
      [-0.00846, 2],
      [0.00196, 1],
      [0.00096, 1],
      [-0.00493, 2],
      [-0.00239, 2],
      [0.00135, 1],
      [-0.00103, 1],
      [-0.0024, 2]
    ],
    "red_o_points": [],
    "y_categories": ["ABS", "NAIA", "PT", "nan"],
    "blue_o_points": [],
    "blue_x_points": [
      [0.00052, 1],
      [0.00291, 1],
      [0.00463, 0],
      [0.00295, 1],
      [0.00425, 1],
      [-9e-5, 1],
      [0.00523, 0]
    ]
  },
  "QA_intPexWristFlex": {
    "red_x_points": [[0.00068, 2], [-0.00032, 1], [-0.01838, 1]],
    "red_o_points": [],
    "y_categories": ["GREATER THAN OR EQUALS TO 60", "LESS THAN 60", "nan"],
    "blue_o_points": [],
    "blue_x_points": [
      [0.0019, 2],
      [0.00729, 0],
      [8e-5, 2],
      [4e-5, 2],
      [0.00158, 2],
      [0.0017, 2]
    ]
  },
  "QS_mulGraftTrunk[LowerTrunk]": {
    "red_x_points": [
      [-2e-5, 2],
      [-5e-5, 0],
      [-0.0001, 0],
      [-7e-5, 0],
      [-0.0001, 0],
      [-0.0001, 0],
      [-8e-5, 0],
      [-3e-5, 2],
      [-0.0001, 0],
      [-0.0001, 0],
      [-3e-5, 0],
      [-0.0, 2],
      [0.00021, 1],
      [-5e-5, 2],
      [-0.0001, 0],
      [-3e-5, 2],
      [-3e-5, 0],
      [-2e-5, 0],
      [-5e-5, 2],
      [-3e-5, 2],
      [-3e-5, 2],
      [-8e-5, 0],
      [-5e-5, 2],
      [-3e-5, 2],
      [-5e-5, 2],
      [-0.0001, 0],
      [-3e-5, 2],
      [-0.0001, 0],
      [-3e-5, 2],
      [9e-5, 1],
      [-5e-5, 0]
    ],
    "red_o_points": [],
    "y_categories": ["N", "NOT APPLICABLE", "nan"],
    "blue_o_points": [],
    "blue_x_points": [
      [0.00039, 1],
      [-3e-5, 2],
      [0.00012, 1],
      [-3e-5, 0],
      [-0.0, 2],
      [0.00021, 1],
      [0.00021, 1]
    ]
  },
  "QS_mulGraftRoot[T2]": {
    "red_x_points": [
      [-8e-5, 2],
      [-5e-5, 0],
      [-5e-5, 0],
      [-8e-5, 0],
      [-0.00012, 0],
      [-5e-5, 0],
      [-0.00012, 0],
      [-8e-5, 2],
      [-9e-5, 0],
      [-0.00012, 0],
      [-0.00012, 0],
      [-5e-5, 2],
      [-8e-5, 2],
      [-0.00012, 0],
      [-8e-5, 2],
      [-0.00012, 0],
      [-0.00012, 0],
      [-8e-5, 2],
      [-3e-5, 2],
      [-8e-5, 2],
      [-8e-5, 0],
      [-8e-5, 2],
      [-8e-5, 2],
      [-3e-5, 2],
      [-5e-5, 0],
      [-8e-5, 2],
      [-8e-5, 0],
      [-5e-5, 2],
      [0.00012, 1],
      [-0.00012, 0]
    ],
    "red_o_points": [],
    "y_categories": ["N", "NOT APPLICABLE", "nan"],
    "blue_o_points": [],
    "blue_x_points": [
      [0.00015, 1],
      [-0.0, 2],
      [0.00043, 1],
      [-3e-5, 0],
      [-3e-5, 2],
      [0.00043, 1],
      [0.00043, 1]
    ]
  },
  "QS_mulGraftNerve[Ax]": {
    "red_x_points": [
      [-0.00016, 2],
      [-0.00079, 0],
      [-0.00089, 0],
      [-0.00071, 0],
      [-0.00079, 0],
      [-0.00088, 0],
      [-0.00072, 0],
      [-7e-5, 2],
      [-0.00074, 0],
      [-0.00062, 0],
      [-0.00078, 0],
      [-0.00013, 2],
      [0.00133, 1],
      [-0.00012, 2],
      [-0.00076, 0],
      [-0.00024, 2],
      [-0.00058, 0],
      [-0.00082, 0],
      [-0.00019, 2],
      [-0.00015, 2],
      [-0.00018, 2],
      [-0.00048, 0],
      [-0.00013, 2],
      [-3e-5, 2],
      [-0.00025, 2],
      [-0.00095, 0],
      [-0.00021, 2],
      [-0.0008, 0],
      [-0.00011, 2],
      [0.00175, 1],
      [-0.00065, 0]
    ],
    "red_o_points": [],
    "y_categories": ["N", "NOT APPLICABLE", "nan"],
    "blue_o_points": [],
    "blue_x_points": [
      [0.00229, 1],
      [-5e-5, 2],
      [0.00152, 1],
      [-4e-5, 0],
      [-6e-5, 2],
      [0.0012, 1],
      [0.0017, 1]
    ]
  },
  "QS_mulBpsurgeryType[Lysis]": {
    "red_x_points": [
      [-0.00291, 3],
      [-0.00447, 0],
      [-0.00854, 2],
      [-0.00475, 0],
      [-0.00444, 0],
      [-0.00744, 2],
      [-0.00436, 0],
      [-0.00262, 3],
      [-0.00477, 0],
      [-0.00419, 0],
      [-0.00419, 0],
      [-0.00324, 3],
      [0.01388, 1],
      [-0.00244, 3],
      [-0.00384, 0],
      [-0.00309, 3],
      [-0.00857, 2],
      [-0.00444, 0],
      [-0.0027, 3],
      [-0.00235, 3],
      [-0.00279, 3],
      [-0.00426, 0],
      [-0.00241, 3],
      [-0.00276, 3],
      [-0.00263, 3],
      [-0.00421, 0],
      [-0.00259, 3],
      [-0.00423, 0],
      [-0.00235, 3],
      [0.01269, 1],
      [-0.00754, 2]
    ],
    "red_o_points": [],
    "y_categories": ["N", "NOT APPLICABLE", "Y", "nan"],
    "blue_o_points": [],
    "blue_x_points": [
      [0.01794, 1],
      [-0.00071, 3],
      [0.0148, 1],
      [-0.00235, 0],
      [-0.00092, 3],
      [0.01492, 1],
      [0.01685, 1]
    ]
  },
  "QS_mulLysisSite[Trunk]": {
    "red_x_points": [
      [-0.00173, 3],
      [-0.00286, 0],
      [-0.00288, 0],
      [-0.00258, 0],
      [-0.0027, 0],
      [-0.0053, 2],
      [-0.00286, 0],
      [-0.00172, 3],
      [-0.00295, 0],
      [-0.00287, 0],
      [-0.00249, 0],
      [-0.00196, 3],
      [0.00802, 1],
      [-0.00167, 3],
      [-0.0025, 0],
      [-0.00178, 3],
      [-0.00518, 2],
      [-0.00269, 0],
      [-0.00183, 3],
      [-0.00169, 3],
      [-0.00184, 3],
      [-0.003, 0],
      [-0.00176, 3],
      [-0.00194, 3],
      [-0.00179, 3],
      [-0.0028, 0],
      [-0.00169, 3],
      [-0.00261, 0],
      [-0.00163, 3],
      [0.00857, 1],
      [-0.00455, 2]
    ],
    "red_o_points": [],
    "y_categories": ["N", "NOT APPLICABLE", "Y", "nan"],
    "blue_o_points": [],
    "blue_x_points": [
      [0.01089, 1],
      [-0.00074, 3],
      [0.009, 1],
      [-0.00131, 0],
      [-0.00071, 3],
      [0.0096, 1],
      [0.01032, 1]
    ]
  },
  "QS_mulGraftTrunk[UpperTrunk]": {
    "red_x_points": [
      [-0.00094, 3],
      [-0.00171, 0],
      [-0.00179, 0],
      [-0.00175, 0],
      [-0.00146, 0],
      [-0.00145, 0],
      [-0.00159, 0],
      [-0.00084, 3],
      [-0.00149, 0],
      [-0.00162, 0],
      [-0.0017, 0],
      [-0.00092, 3],
      [0.00377, 1],
      [-0.00092, 3],
      [-0.00415, 2],
      [-0.00081, 3],
      [-0.00135, 0],
      [-0.00138, 0],
      [-0.00094, 3],
      [-0.00075, 3],
      [-0.00075, 3],
      [-0.00154, 0],
      [-0.00088, 3],
      [-0.0012, 3],
      [-0.00102, 3],
      [-0.00123, 0],
      [-0.00088, 3],
      [-0.00169, 0],
      [-0.00067, 3],
      [0.0042, 1],
      [-0.00162, 0]
    ],
    "red_o_points": [],
    "y_categories": ["N", "NOT APPLICABLE", "Y", "nan"],
    "blue_o_points": [],
    "blue_x_points": [
      [0.00524, 1],
      [-0.00019, 3],
      [0.00423, 1],
      [-0.00014, 0],
      [-0.00014, 3],
      [0.0044, 1],
      [0.006, 1]
    ]
  },
  "QS_mulTransfSite[PhMc]": {
    "red_x_points": [
      [-0.00187, 3],
      [-0.00236, 0],
      [-0.00321, 0],
      [-0.00298, 0],
      [-0.00317, 0],
      [-0.00282, 0],
      [-0.00536, 2],
      [-0.00183, 3],
      [-0.00307, 0],
      [-0.00295, 0],
      [-0.00288, 0],
      [-0.00204, 3],
      [0.0085, 1],
      [-0.00146, 3],
      [-0.00262, 0],
      [-0.00174, 3],
      [-0.00241, 0],
      [-0.00289, 0],
      [-0.00177, 3],
      [-0.00156, 3],
      [-0.00165, 3],
      [-0.00492, 2],
      [-0.00196, 3],
      [-0.0015, 3],
      [-0.00153, 3],
      [-0.00279, 0],
      [-0.00177, 3],
      [-0.00299, 0],
      [-0.00161, 3],
      [0.00794, 1],
      [-0.00275, 0]
    ],
    "red_o_points": [],
    "y_categories": ["N", "NOT APPLICABLE", "Y", "nan"],
    "blue_o_points": [],
    "blue_x_points": [
      [0.01113, 1],
      [-0.00058, 3],
      [0.00925, 1],
      [-0.00209, 0],
      [-0.00056, 3],
      [0.00978, 1],
      [0.00876, 1]
    ]
  },
  "QA_mulInjTbpiCause[Motorcycle]": {
    "red_x_points": [
      [0.001, 0],
      [-0.00068, 1],
      [-0.00127, 1],
      [-0.00118, 1],
      [-0.00066, 1],
      [-0.00092, 1],
      [-0.00096, 1],
      [-0.00082, 1],
      [-0.0013, 1],
      [-0.00114, 1],
      [-0.00086, 1],
      [-0.0002, 0],
      [-0.03368, 1],
      [-0.00106, 1],
      [-0.00126, 1],
      [-0.00135, 1],
      [-0.00103, 1],
      [-0.00069, 1],
      [0.00021, 0],
      [-0.00068, 1],
      [-0.00069, 1],
      [-0.00066, 1],
      [-0.00096, 1],
      [-0.00128, 1],
      [0.00059, 0],
      [-0.0007, 1],
      [-0.00074, 1],
      [-0.001, 1],
      [-0.00101, 1],
      [-0.0307, 1],
      [-0.00072, 1]
    ],
    "red_o_points": [],
    "y_categories": ["N", "Y", "nan"],
    "blue_o_points": [],
    "blue_x_points": [
      [0.01565, 0],
      [-0.00054, 1],
      [0.01375, 0],
      [-0.00132, 1],
      [0.00124, 1],
      [0.01476, 0],
      [0.01421, 0]
    ]
  },
  "QS_mulLysisSite[Root]": {
    "red_x_points": [
      [-0.00071, 3],
      [-0.00107, 0],
      [-0.00237, 2],
      [-0.00106, 0],
      [-0.00116, 0],
      [-0.00099, 0],
      [-0.00102, 0],
      [-0.00087, 3],
      [-0.00127, 0],
      [-0.00102, 0],
      [-0.00109, 0],
      [-0.00079, 3],
      [0.00426, 1],
      [-0.00081, 3],
      [-0.00107, 0],
      [-0.00082, 3],
      [-0.00093, 0],
      [-0.00108, 0],
      [-0.00089, 3],
      [-0.00082, 3],
      [-0.00072, 3],
      [-0.00122, 0],
      [-0.00075, 3],
      [-0.00085, 3],
      [-0.00073, 3],
      [-0.0011, 0],
      [-0.00085, 3],
      [-0.00119, 0],
      [-0.00067, 3],
      [0.00355, 1],
      [-0.0024, 2]
    ],
    "red_o_points": [],
    "y_categories": ["N", "NOT APPLICABLE", "Y", "nan"],
    "blue_o_points": [],
    "blue_x_points": [
      [0.00483, 1],
      [-0.00052, 3],
      [0.00437, 1],
      [-0.0012, 0],
      [-0.00029, 3],
      [0.004, 1],
      [0.00389, 1]
    ]
  },
  "QA_yonInjOrtsurg": {
    "red_x_points": [
      [-0.00317, 2],
      [-0.00022, 2],
      [3e-5, 2],
      [-0.00012, 2],
      [7e-5, 2],
      [-3e-5, 2],
      [-0.00016, 1],
      [-0.0038, 2],
      [-3e-5, 0],
      [-0.0002, 1],
      [-0.00011, 1],
      [-0.00362, 2],
      [-0.00133, 0],
      [0.00102, 1],
      [-0.00024, 2],
      [-0.00445, 2],
      [5e-5, 0],
      [2e-5, 2],
      [0.00361, 0],
      [1e-5, 1],
      [-0.00362, 2],
      [-2e-5, 1],
      [-0.00485, 2],
      [-0.00402, 2],
      [-0.00416, 2],
      [-9e-5, 0],
      [-0.00022, 1],
      [-6e-5, 0],
      [-0.00438, 2],
      [-0.00116, 1],
      [-6e-5, 1]
    ],
    "red_o_points": [],
    "y_categories": ["N", "Y", "nan"],
    "blue_o_points": [],
    "blue_x_points": [
      [0.00033, 2],
      [0.00437, 1],
      [0.00026, 2],
      [0.00026, 2],
      [0.01498, 0],
      [0.0003, 2],
      [0.00046, 2]
    ]
  },
  "QS_mulGraftLevel[Trunk]": {
    "red_x_points": [
      [-0.00067, 3],
      [-0.00082, 0],
      [-0.00089, 0],
      [-0.00096, 0],
      [-0.00095, 0],
      [-0.00099, 0],
      [-0.00088, 0],
      [-0.00057, 3],
      [-0.00081, 0],
      [-0.00098, 0],
      [-0.00073, 0],
      [-0.00055, 3],
      [0.00315, 1],
      [-0.00086, 3],
      [-0.00247, 2],
      [-0.00084, 3],
      [-0.0009, 0],
      [-0.00084, 0],
      [-0.00074, 3],
      [-0.00062, 3],
      [-0.00068, 3],
      [-0.00068, 0],
      [-0.00078, 3],
      [-0.00062, 3],
      [-0.00068, 3],
      [-0.00068, 0],
      [-0.00058, 3],
      [-0.00081, 0],
      [-0.00068, 3],
      [0.00248, 1],
      [-0.00083, 0]
    ],
    "red_o_points": [],
    "y_categories": ["N", "NOT APPLICABLE", "Y", "nan"],
    "blue_o_points": [],
    "blue_x_points": [
      [0.00359, 1],
      [-0.00016, 3],
      [0.00294, 1],
      [-0.00048, 0],
      [-0.00036, 3],
      [0.00285, 1],
      [0.00304, 1]
    ]
  },
  "QS_mulGraftNerve[FI]": {
    "red_x_points": [
      [-0.00048, 2],
      [-0.00121, 0],
      [-0.00093, 0],
      [-0.00118, 0],
      [-0.0015, 0],
      [-0.00096, 0],
      [-0.00099, 0],
      [-0.00044, 2],
      [-0.00111, 0],
      [-0.00085, 0],
      [-0.00098, 0],
      [-0.00042, 2],
      [0.00139, 1],
      [-0.00039, 2],
      [-0.00075, 0],
      [-0.00043, 2],
      [-0.00101, 0],
      [-0.00126, 0],
      [-0.00066, 2],
      [-0.00034, 2],
      [-0.00051, 2],
      [-0.00104, 0],
      [-0.00042, 2],
      [-0.00045, 2],
      [-0.00045, 2],
      [-0.00097, 0],
      [-0.00049, 2],
      [-0.00122, 0],
      [-0.00023, 2],
      [0.00216, 1],
      [-0.00113, 0]
    ],
    "red_o_points": [],
    "y_categories": ["N", "NOT APPLICABLE", "nan"],
    "blue_o_points": [],
    "blue_x_points": [
      [0.00395, 1],
      [-7e-5, 2],
      [0.0024, 1],
      [0.00021, 0],
      [-6e-5, 2],
      [0.00258, 1],
      [0.00297, 1]
    ]
  },
  "QS_mulGraftNerve[other]": {
    "red_x_points": [
      [-0.00076, 2],
      [-0.00201, 0],
      [-0.00208, 0],
      [-0.00214, 0],
      [-0.002, 0],
      [-0.00208, 0],
      [-0.00224, 0],
      [-0.00088, 2],
      [-0.00222, 0],
      [-0.00215, 0],
      [-0.00205, 0],
      [-0.00104, 2],
      [0.00387, 1],
      [-0.00082, 2],
      [-0.00215, 0],
      [-0.00082, 2],
      [-0.00177, 0],
      [-0.00178, 0],
      [-0.00082, 2],
      [-0.00056, 2],
      [-0.00059, 2],
      [-0.00187, 0],
      [-0.0007, 2],
      [-0.00071, 2],
      [-0.00092, 2],
      [-0.00218, 0],
      [-0.00091, 2],
      [-0.00236, 0],
      [-0.00053, 2],
      [0.00469, 1],
      [-0.00217, 0]
    ],
    "red_o_points": [],
    "y_categories": ["N", "NOT APPLICABLE", "nan"],
    "blue_o_points": [],
    "blue_x_points": [
      [0.00849, 1],
      [2e-5, 2],
      [0.00478, 1],
      [-0.00031, 0],
      [-0.00014, 2],
      [0.00448, 1],
      [0.00541, 1]
    ]
  },
  "QS_mulTransfSite[AcSsAA]": {
    "red_x_points": [
      [-0.00228, 3],
      [-0.00751, 2],
      [-0.00348, 0],
      [-0.00773, 2],
      [-0.00807, 2],
      [-0.00345, 0],
      [-0.00352, 0],
      [-0.00203, 3],
      [-0.00337, 0],
      [-0.00754, 2],
      [-0.0035, 0],
      [-0.00226, 3],
      [0.01175, 1],
      [-0.00244, 3],
      [-0.00845, 2],
      [-0.00234, 3],
      [-0.00284, 0],
      [-0.00345, 0],
      [-0.00243, 3],
      [-0.00248, 3],
      [-0.00225, 3],
      [-0.00753, 2],
      [-0.0024, 3],
      [-0.00242, 3],
      [-0.00258, 3],
      [-0.0031, 0],
      [-0.00226, 3],
      [-0.0079, 2],
      [-0.00232, 3],
      [0.01352, 1],
      [-0.00298, 0]
    ],
    "red_o_points": [],
    "y_categories": ["N", "NOT APPLICABLE", "Y", "nan"],
    "blue_o_points": [],
    "blue_x_points": [
      [0.01849, 1],
      [-0.00064, 3],
      [0.01373, 1],
      [-0.00079, 0],
      [-0.00085, 3],
      [0.01374, 1],
      [0.01502, 1]
    ]
  },
  "QS_mulGraftNerve[DS]": {
    "red_x_points": [
      [-3e-5, 2],
      [-1e-5, 0],
      [-6e-5, 0],
      [-5e-5, 0],
      [-5e-5, 0],
      [-6e-5, 0],
      [-6e-5, 0],
      [-2e-5, 2],
      [-5e-5, 0],
      [-1e-5, 0],
      [-1e-5, 0],
      [-3e-5, 2],
      [-3e-5, 2],
      [-6e-5, 0],
      [-5e-5, 0],
      [-5e-5, 0],
      [-3e-5, 2],
      [-3e-5, 2],
      [-2e-5, 2],
      [-5e-5, 0],
      [-3e-5, 2],
      [-2e-5, 2],
      [-2e-5, 2],
      [-6e-5, 0],
      [-3e-5, 2],
      [-6e-5, 0],
      [-1e-5, 0]
    ],
    "red_o_points": [],
    "y_categories": ["N", "NOT APPLICABLE", "nan"],
    "blue_o_points": [],
    "blue_x_points": [
      [0.00034, 1],
      [-2e-5, 2],
      [-2e-5, 2],
      [0.00015, 1],
      [0.00015, 1]
    ]
  },
  "QS_mulGraftNerve[MP]": {
    "red_x_points": [[-0.00013, 1]],
    "red_o_points": [],
    "y_categories": ["N", "NOT APPLICABLE", "nan"],
    "blue_o_points": [],
    "blue_x_points": [[7e-5, 0]]
  },
  "QS_mulGraftNerve[LP]": {
    "red_x_points": [
      [-5e-5, 2],
      [-0.00014, 0],
      [-7e-5, 0],
      [-9e-5, 0],
      [-0.0001, 0],
      [-0.00014, 0],
      [-0.00014, 0],
      [0.0, 2],
      [-9e-5, 0],
      [-0.00014, 0],
      [-0.00012, 0],
      [-2e-5, 2],
      [0.00019, 1],
      [-2e-5, 2],
      [-0.00014, 0],
      [-2e-5, 2],
      [-8e-5, 0],
      [-0.0001, 0],
      [-2e-5, 2],
      [0.0, 2],
      [2e-5, 2],
      [-0.00012, 0],
      [-3e-5, 2],
      [-2e-5, 2],
      [0.0, 2],
      [-7e-5, 0],
      [-7e-5, 0],
      [0.0, 2],
      [0.00012, 1],
      [-0.0001, 0]
    ],
    "red_o_points": [],
    "y_categories": ["N", "NOT APPLICABLE", "nan"],
    "blue_o_points": [],
    "blue_x_points": [
      [0.00037, 1],
      [0.0, 2],
      [0.00022, 1],
      [-3e-5, 0],
      [3e-5, 2],
      [0.00012, 1],
      [0.00031, 1]
    ]
  },
  "QA_lstPexMuscstrength[WristFlex]": {
    "red_x_points": [
      [-0.0031, 1],
      [-0.00021, 2],
      [-0.00137, 1],
      [-0.00153, 1],
      [0.00043, 0],
      [0.00053, 0],
      [-0.00189, 1],
      [-0.00179, 0],
      [0.00075, 0],
      [0.00042, 0],
      [0.00061, 0],
      [-0.00088, 0],
      [-0.00066, 2],
      [0.00159, 2],
      [-0.00019, 2],
      [-0.00118, 0],
      [-0.0001, 2],
      [0.00048, 0],
      [-0.0015, 0],
      [-0.00261, 1],
      [-0.00125, 0],
      [-0.00156, 1],
      [0.00185, 2],
      [-0.00844, 1],
      [-0.0018, 0],
      [0.00048, 0],
      [-0.00346, 1],
      [0.00065, 0],
      [0.00211, 2],
      [-8e-5, 2],
      [-0.00122, 1]
    ],
    "red_o_points": [],
    "y_categories": ["GREATER THAN OR EQUALS TO 3", "LESS THAN 3", "nan"],
    "blue_o_points": [],
    "blue_x_points": [
      [0.00043, 0],
      [0.00349, 2],
      [0.00159, 0],
      [0.00264, 0],
      [0.00394, 2],
      [0.00145, 0],
      [0.00151, 0]
    ]
  },
  "QS_mulNeuromadSite[C5]": {
    "red_x_points": [
      [-0.00071, 2],
      [-0.00312, 0],
      [-0.004, 0],
      [-0.00299, 0],
      [-0.0029, 0],
      [-0.00329, 0],
      [-0.00328, 0],
      [-0.00143, 2],
      [-0.00372, 0],
      [-0.00325, 0],
      [-0.00331, 0],
      [-0.00144, 2],
      [0.00569, 1],
      [-0.00098, 2],
      [-0.00353, 0],
      [-0.00124, 2],
      [-0.00331, 0],
      [-0.00335, 0],
      [-0.00106, 2],
      [-0.0009, 2],
      [-0.00097, 2],
      [-0.00314, 0],
      [-0.00114, 2],
      [-0.00108, 2],
      [-0.00127, 2],
      [-0.00312, 0],
      [-0.00116, 2],
      [-0.00365, 0],
      [-0.00114, 2],
      [0.00656, 1],
      [-0.003, 0]
    ],
    "red_o_points": [],
    "y_categories": ["N", "NOT APPLICABLE", "nan"],
    "blue_o_points": [],
    "blue_x_points": [
      [0.01023, 1],
      [7e-5, 2],
      [0.00811, 1],
      [-0.00045, 0],
      [-0.0001, 2],
      [0.00869, 1],
      [0.00921, 1]
    ]
  },
  "QS_mulNeuromadSite[C7]": {
    "red_x_points": [
      [-0.00089, 2],
      [-0.00256, 0],
      [-0.00269, 0],
      [-0.00251, 0],
      [-0.00289, 0],
      [-0.00238, 0],
      [-0.00257, 0],
      [-0.00071, 2],
      [-0.00282, 0],
      [-0.00254, 0],
      [-0.0025, 0],
      [-0.00074, 2],
      [0.00432, 1],
      [-0.00082, 2],
      [-0.00261, 0],
      [-0.00105, 2],
      [-0.00235, 0],
      [-0.00309, 0],
      [-0.00075, 2],
      [-0.00081, 2],
      [-0.00093, 2],
      [-0.00238, 0],
      [-0.00074, 2],
      [-0.00102, 2],
      [-0.00091, 2],
      [-0.0024, 0],
      [-0.00088, 2],
      [-0.00242, 0],
      [-0.00065, 2],
      [0.00496, 1],
      [-0.00222, 0]
    ],
    "red_o_points": [],
    "y_categories": ["N", "NOT APPLICABLE", "nan"],
    "blue_o_points": [],
    "blue_x_points": [
      [0.00806, 1],
      [0.0001, 2],
      [0.00571, 1],
      [-0.0001, 0],
      [0.00025, 2],
      [0.00641, 1],
      [0.00739, 1]
    ]
  },
  "QA_lstPexMuscstrength[ShoulderInrot]": {
    "red_x_points": [
      [-0.00105, 1],
      [0.0001, 2],
      [0.00046, 0],
      [-0.00066, 1],
      [0.00022, 0],
      [-0.00075, 1],
      [8e-5, 2],
      [-0.00076, 1],
      [0.0001, 0],
      [0.00012, 2],
      [0.0, 2],
      [-0.00114, 1],
      [0.00012, 2],
      [0.0001, 2],
      [0.00011, 2],
      [5e-5, 2],
      [3e-5, 2],
      [-0.00119, 1],
      [0.00047, 0],
      [-0.00075, 1],
      [0.00045, 0],
      [4e-5, 2],
      [9e-5, 2],
      [0.0001, 2],
      [9e-5, 2],
      [-0.001, 1],
      [6e-5, 2],
      [-0.00091, 1],
      [3e-5, 2],
      [0.00012, 2],
      [0.00036, 0]
    ],
    "red_o_points": [],
    "y_categories": ["GREATER THAN OR EQUALS TO 3", "LESS THAN 3", "nan"],
    "blue_o_points": [],
    "blue_x_points": [
      [6e-5, 2],
      [8e-5, 2],
      [0.00079, 0],
      [0.00037, 2],
      [0.00013, 2],
      [0.00066, 0],
      [0.00074, 0]
    ]
  },
  "QA_lstPexMuscstrength[ElbowExte]": {
    "red_x_points": [
      [-0.00226, 1],
      [-4e-5, 2],
      [-0.00012, 1],
      [-3e-5, 1],
      [-0.00114, 0],
      [-0.00017, 1],
      [-1e-5, 1],
      [-0.00208, 1],
      [-0.00046, 0],
      [-0.00038, 0],
      [6e-5, 1],
      [-0.0022, 1],
      [7e-5, 2],
      [0.00194, 2],
      [-0.00018, 2],
      [-0.00187, 1],
      [-1e-5, 2],
      [9e-5, 1],
      [-0.00161, 0],
      [-0.00161, 1],
      [-0.00204, 0],
      [2e-5, 1],
      [0.0021, 2],
      [-0.00213, 0],
      [-0.00271, 0],
      [4e-5, 1],
      [-0.00185, 1],
      [-5e-5, 2],
      [-0.00245, 1],
      [7e-5, 2],
      [-3e-5, 1]
    ],
    "red_o_points": [],
    "y_categories": ["GREATER THAN OR EQUALS TO 3", "LESS THAN 3", "nan"],
    "blue_o_points": [],
    "blue_x_points": [
      [9e-5, 2],
      [0.00506, 2],
      [0.00032, 0],
      [0.0012, 1],
      [0.00599, 2],
      [0.00012, 0],
      [0.00022, 0]
    ]
  },
  "QA_intPexForearmSupin": {
    "red_x_points": [
      [3e-5, 2],
      [0.0, 0],
      [3e-5, 2],
      [3e-5, 2],
      [-0.00062, 1],
      [-0.00027, 1],
      [4e-5, 2],
      [-0.00032, 1],
      [4e-5, 2],
      [4e-5, 2],
      [6e-5, 2],
      [8e-5, 0],
      [0.00056, 2],
      [8e-5, 2],
      [3e-5, 2],
      [9e-5, 2],
      [1e-5, 2],
      [-0.00051, 1],
      [-0.00035, 1],
      [5e-5, 0],
      [-0.0003, 1],
      [-0.00019, 1],
      [8e-5, 2],
      [5e-5, 2],
      [4e-5, 2],
      [3e-5, 2],
      [-0.00029, 1],
      [6e-5, 2],
      [0.00015, 2],
      [-0.01109, 1],
      [9e-5, 0]
    ],
    "red_o_points": [],
    "y_categories": ["GREATER THAN OR EQUALS TO 80", "LESS THAN 80", "nan"],
    "blue_o_points": [],
    "blue_x_points": [
      [0.00104, 2],
      [8e-5, 2],
      [0.00484, 0],
      [0.00026, 2],
      [0.0002, 2],
      [0.00091, 2],
      [0.00123, 2]
    ]
  },
  "QS_mulGraftNerve[SS]": {
    "red_x_points": [
      [-0.00018, 2],
      [-0.00021, 0],
      [-0.00024, 0],
      [-0.00026, 0],
      [-0.00026, 0],
      [-0.00021, 0],
      [-0.00035, 0],
      [-0.00018, 2],
      [-0.00018, 0],
      [-0.00031, 0],
      [-0.00029, 0],
      [-0.0001, 2],
      [0.00052, 1],
      [-0.00012, 2],
      [-0.00029, 0],
      [-0.00011, 2],
      [-0.00019, 0],
      [-0.00026, 0],
      [-8e-5, 2],
      [-0.00015, 2],
      [-0.00018, 2],
      [-0.00026, 0],
      [-0.00014, 2],
      [-0.00018, 2],
      [-0.00013, 2],
      [-0.00034, 0],
      [-0.00021, 2],
      [-0.00033, 0],
      [-0.00013, 2],
      [0.00075, 1],
      [-0.00023, 0]
    ],
    "red_o_points": [],
    "y_categories": ["N", "NOT APPLICABLE", "nan"],
    "blue_o_points": [],
    "blue_x_points": [
      [0.00115, 1],
      [-7e-5, 2],
      [0.00089, 1],
      [-0.0001, 0],
      [1e-5, 2],
      [0.00018, 1],
      [0.00087, 1]
    ]
  },
  "QS_mulGraftNerve[MCF]": {
    "red_x_points": [
      [-0.0, 2],
      [-5e-5, 0],
      [-0.00015, 0],
      [-0.0001, 0],
      [-5e-5, 0],
      [-5e-5, 0],
      [-5e-5, 2],
      [-2e-5, 0],
      [-2e-5, 0],
      [-2e-5, 0],
      [-0.00012, 2],
      [9e-5, 1],
      [-8e-5, 2],
      [-5e-5, 0],
      [-0.00012, 2],
      [-0.00017, 0],
      [-2e-5, 0],
      [-2e-5, 2],
      [-0.0, 2],
      [-5e-5, 0],
      [-0.0, 2],
      [-9e-5, 2],
      [-6e-5, 2],
      [-9e-5, 2],
      [-5e-5, 0],
      [-0.00013, 2],
      [9e-5, 1],
      [-5e-5, 0]
    ],
    "red_o_points": [],
    "y_categories": ["N", "NOT APPLICABLE", "nan"],
    "blue_o_points": [],
    "blue_x_points": [
      [0.00048, 1],
      [-0.0, 2],
      [0.00018, 1],
      [3e-5, 0],
      [-0.0, 2],
      [0.0001, 1],
      [0.00019, 1]
    ]
  },
  "QS_mulNeuromadSite[C6]": {
    "red_x_points": [
      [-0.00072, 2],
      [-0.0025, 0],
      [-0.00278, 0],
      [-0.00212, 0],
      [-0.0022, 0],
      [-0.00243, 0],
      [-0.00231, 0],
      [-0.00069, 2],
      [-0.00229, 0],
      [-0.00195, 0],
      [-0.00222, 0],
      [-0.00108, 2],
      [0.00295, 1],
      [-0.0008, 2],
      [-0.00206, 0],
      [-0.0007, 2],
      [-0.00243, 0],
      [-0.00218, 0],
      [-0.00077, 2],
      [-0.00057, 2],
      [-0.001, 2],
      [-0.00198, 0],
      [-0.00066, 2],
      [-0.00052, 2],
      [-0.00072, 2],
      [-0.002, 0],
      [-0.00082, 2],
      [-0.00228, 0],
      [-0.00072, 2],
      [0.00447, 1],
      [-0.0024, 0]
    ],
    "red_o_points": [],
    "y_categories": ["N", "NOT APPLICABLE", "nan"],
    "blue_o_points": [],
    "blue_x_points": [
      [0.00696, 1],
      [0.00015, 2],
      [0.00552, 1],
      [0.00013, 0],
      [0.0, 2],
      [0.00571, 1],
      [0.00593, 1]
    ]
  },
  "QS_mulLysisSite[Nerve]": {
    "red_x_points": [
      [-0.00032, 3],
      [-0.00034, 0],
      [-0.00095, 2],
      [-0.00033, 0],
      [-0.00035, 0],
      [-0.00026, 0],
      [-0.00037, 0],
      [-0.00028, 3],
      [-0.00039, 0],
      [-0.00039, 0],
      [-0.00036, 0],
      [-0.00018, 3],
      [0.00148, 1],
      [-0.00029, 3],
      [-0.00042, 0],
      [-0.00026, 3],
      [-0.0003, 0],
      [-0.00027, 0],
      [-0.00014, 3],
      [-0.00026, 3],
      [-0.00022, 3],
      [-0.0004, 0],
      [-0.00021, 3],
      [-0.00021, 3],
      [-0.00024, 3],
      [-0.00033, 0],
      [-0.00013, 3],
      [-0.00037, 0],
      [-0.00024, 3],
      [0.00112, 1],
      [-0.00029, 0]
    ],
    "red_o_points": [],
    "y_categories": ["N", "NOT APPLICABLE", "Y", "nan"],
    "blue_o_points": [],
    "blue_x_points": [
      [0.00166, 1],
      [-0.00017, 3],
      [0.00103, 1],
      [-0.00047, 0],
      [-0.00014, 3],
      [0.00132, 1],
      [0.00096, 1]
    ]
  },
  "QS_mulGraftNerve[TD]": {
    "red_x_points": [
      [2e-5, 2],
      [-0.00028, 0],
      [-0.00022, 0],
      [-0.00022, 0],
      [-9e-5, 0],
      [-0.00022, 0],
      [-0.00024, 0],
      [4e-5, 2],
      [-0.00029, 0],
      [-0.0002, 0],
      [-0.00021, 0],
      [1e-5, 2],
      [0.00023, 1],
      [3e-5, 2],
      [-0.00028, 0],
      [-1e-5, 2],
      [-0.00027, 0],
      [-0.00012, 0],
      [1e-5, 2],
      [2e-5, 2],
      [2e-5, 2],
      [-0.00024, 0],
      [7e-5, 2],
      [3e-5, 2],
      [3e-5, 2],
      [-0.00025, 0],
      [-2e-5, 2],
      [-0.00014, 0],
      [4e-5, 2],
      [0.00034, 1],
      [-0.00018, 0]
    ],
    "red_o_points": [],
    "y_categories": ["N", "NOT APPLICABLE", "nan"],
    "blue_o_points": [],
    "blue_x_points": [
      [0.00058, 1],
      [0.0001, 2],
      [0.00044, 1],
      [-0.0001, 0],
      [0.00011, 2],
      [0.00013, 1],
      [0.00045, 1]
    ]
  },
  "QS_mulLysisRoot[C7]": {
    "red_x_points": [
      [-0.00054, 3],
      [-0.00075, 0],
      [-0.00168, 2],
      [-0.00076, 0],
      [-0.00073, 0],
      [-0.00077, 0],
      [-0.00081, 0],
      [-0.0005, 3],
      [-0.0006, 0],
      [-0.00081, 0],
      [-0.00082, 0],
      [-0.00042, 3],
      [0.00209, 1],
      [-0.00031, 3],
      [-0.00079, 0],
      [-0.00064, 3],
      [-0.0008, 0],
      [-0.00074, 0],
      [-0.00039, 3],
      [-0.00048, 3],
      [-0.00055, 3],
      [-0.0008, 0],
      [-0.00045, 3],
      [-0.00048, 3],
      [-0.00051, 3],
      [-0.00061, 0],
      [-0.00038, 3],
      [-0.00077, 0],
      [-0.00049, 3],
      [0.00247, 1],
      [-0.00073, 0]
    ],
    "red_o_points": [],
    "y_categories": ["N", "NOT APPLICABLE", "Y", "nan"],
    "blue_o_points": [],
    "blue_x_points": [
      [0.00246, 1],
      [-0.0003, 3],
      [0.00279, 1],
      [-0.00057, 0],
      [-0.00011, 3],
      [0.00255, 1],
      [0.00249, 1]
    ]
  },
  "QS_mulGraftLevel[other]": {
    "red_x_points": [
      [-1e-5, 0],
      [-1e-5, 0],
      [-1e-5, 0],
      [-1e-5, 0],
      [-1e-5, 0],
      [-1e-5, 2],
      [-1e-5, 0],
      [-1e-5, 0],
      [-1e-5, 2],
      [-1e-5, 2],
      [-1e-5, 2],
      [-1e-5, 2],
      [-1e-5, 2],
      [-1e-5, 0],
      [-1e-5, 2],
      [-1e-5, 0],
      [-1e-5, 0]
    ],
    "red_o_points": [],
    "y_categories": ["N", "NOT APPLICABLE", "nan"],
    "blue_o_points": [],
    "blue_x_points": [[0.00019, 1]]
  },
  "QA_lstPexTouch[T1]": {
    "red_x_points": [
      [-0.00179, 1],
      [-0.00031, 2],
      [0.00056, 1],
      [-0.00045, 2],
      [-0.00243, 0],
      [0.00057, 1],
      [0.00085, 1],
      [-0.00216, 1],
      [-0.00207, 0],
      [-0.00141, 0],
      [-0.00145, 0],
      [-0.00336, 0],
      [-0.00904, 2],
      [0.00289, 2],
      [-0.00022, 2],
      [-0.00141, 1],
      [-6e-5, 2],
      [0.00124, 1],
      [-0.0027, 0],
      [-0.00198, 1],
      [-0.00348, 0],
      [-0.00044, 2],
      [0.00276, 2],
      [-0.00182, 1],
      [-0.00309, 0],
      [0.00085, 1],
      [-0.00338, 0],
      [-0.0004, 2],
      [-0.00316, 0],
      [0.00081, 1],
      [0.00033, 1]
    ],
    "red_o_points": [],
    "y_categories": ["NORM", "NPV", "nan"],
    "blue_o_points": [],
    "blue_x_points": [
      [0.00099, 1],
      [0.00524, 2],
      [0.00096, 1],
      [0.00265, 1],
      [0.00578, 2],
      [0.00074, 1],
      [0.0046, 0]
    ]
  },
  "QS_mulTransfSite[AcMc]": {
    "red_x_points": [
      [-0.00072, 3],
      [-0.00134, 0],
      [-0.00114, 0],
      [-0.00105, 0],
      [-0.00149, 0],
      [-0.00131, 0],
      [-0.00128, 0],
      [-0.00074, 3],
      [-0.00104, 0],
      [-0.00103, 0],
      [-0.00312, 2],
      [-0.00086, 3],
      [0.00404, 1],
      [-0.00068, 3],
      [-0.00116, 0],
      [-0.00091, 3],
      [-0.00135, 0],
      [-0.00106, 0],
      [-0.0009, 3],
      [-0.00064, 3],
      [-0.00082, 3],
      [-0.00117, 0],
      [-0.00065, 3],
      [-0.00064, 3],
      [-0.0008, 3],
      [-0.00109, 0],
      [-0.00081, 3],
      [-0.00116, 0],
      [-0.00079, 3],
      [0.00364, 1],
      [-0.00081, 0]
    ],
    "red_o_points": [],
    "y_categories": ["N", "NOT APPLICABLE", "Y", "nan"],
    "blue_o_points": [],
    "blue_x_points": [
      [0.00459, 1],
      [-0.00035, 3],
      [0.00322, 1],
      [-0.00115, 0],
      [-0.00028, 3],
      [0.00371, 1],
      [0.00466, 1]
    ]
  },
  "QS_mulTransfSite[Other]": {
    "red_x_points": [
      [-0.00047, 3],
      [-0.0013, 0],
      [-0.00099, 0],
      [-0.00114, 0],
      [-0.00086, 0],
      [-0.00109, 0],
      [-0.00098, 0],
      [-0.00058, 3],
      [-0.00102, 0],
      [-0.00101, 0],
      [-0.00106, 0],
      [-0.00049, 3],
      [0.00364, 1],
      [-0.0004, 3],
      [-0.00107, 0],
      [-0.00051, 3],
      [-0.001, 0],
      [-0.00401, 2],
      [-0.0006, 3],
      [-0.00043, 3],
      [-0.00051, 3],
      [-0.00123, 0],
      [-0.00039, 3],
      [-0.00048, 3],
      [-0.00049, 3],
      [-0.00113, 0],
      [-0.00083, 3],
      [-0.00105, 0],
      [-0.00044, 3],
      [0.00264, 1],
      [-0.0012, 0]
    ],
    "red_o_points": [],
    "y_categories": ["N", "NOT APPLICABLE", "Y", "nan"],
    "blue_o_points": [],
    "blue_x_points": [
      [0.0038, 1],
      [-0.00016, 3],
      [0.00348, 1],
      [-0.00041, 0],
      [-0.00028, 3],
      [0.00356, 1],
      [0.00361, 1]
    ]
  },
  "QA_yonInjBpsurg": {
    "red_x_points": [
      [-0.00321, 1],
      [-0.00269, 1],
      [-0.00323, 1],
      [-0.00275, 1],
      [-0.00272, 1],
      [-0.00277, 1],
      [-0.0032, 1],
      [-0.00302, 1],
      [-0.0032, 1],
      [-0.00309, 1],
      [-0.00247, 1],
      [-0.00315, 1],
      [0.00745, 0],
      [-0.00287, 1],
      [-0.00306, 1],
      [-0.00314, 1],
      [-0.00249, 1],
      [-0.00348, 1],
      [-0.00319, 1],
      [-0.00298, 1],
      [-0.00315, 1],
      [-0.00224, 1],
      [-0.0029, 1],
      [-0.00317, 1],
      [-0.00328, 1],
      [-0.00283, 1],
      [-0.00267, 1],
      [-0.00315, 1],
      [-0.00272, 1],
      [0.00794, 0],
      [-0.00313, 1]
    ],
    "red_o_points": [],
    "y_categories": ["N", "Y", "nan"],
    "blue_o_points": [],
    "blue_x_points": [
      [0.01576, 0],
      [-0.00082, 1],
      [0.01015, 0],
      [-0.00259, 1],
      [-0.00116, 1],
      [0.01012, 0],
      [0.01156, 0]
    ]
  },
  "QA_equInjTbpiAge": {
    "red_x_points": [
      [-0.00074, 1],
      [-0.00025, 1],
      [-2e-5, 1],
      [-8e-5, 0],
      [-0.00075, 0],
      [1e-5, 1],
      [-0.00013, 1],
      [0.00052, 0],
      [-0.00061, 0],
      [-0.00019, 0],
      [-4e-5, 1],
      [0.00061, 0],
      [-0.01246, 1],
      [-0.00085, 1],
      [-0.00042, 1],
      [-0.00088, 1],
      [0.0004, 0],
      [-0.00081, 0],
      [-0.00138, 1],
      [0.0009, 0],
      [-0.0008, 1],
      [-0.0001, 1],
      [-0.00131, 1],
      [-0.00241, 1],
      [0.00097, 0],
      [6e-5, 1],
      [-0.00148, 1],
      [0.00011, 1],
      [-0.00106, 1],
      [-0.01179, 1],
      [1e-5, 0]
    ],
    "red_o_points": [],
    "y_categories": ["GREATER THAN OR EQUALS TO 30", "LESS THAN 30", "nan"],
    "blue_o_points": [],
    "blue_x_points": [
      [-0.00375, 1],
      [-0.00143, 1],
      [0.00621, 0],
      [0.00089, 1],
      [0.00565, 0],
      [0.00712, 0],
      [0.00656, 0]
    ]
  },
  "QS_mulLysisNerve[Ssr]": {
    "red_x_points": [
      [-0.00028, 3],
      [-0.0007, 0],
      [-0.00149, 2],
      [-0.00073, 0],
      [-0.0006, 0],
      [-0.00072, 0],
      [-0.00069, 0],
      [-0.00035, 3],
      [-0.00065, 0],
      [-0.00089, 0],
      [-0.00075, 0],
      [-0.00045, 3],
      [0.00238, 1],
      [-0.00025, 3],
      [-0.00076, 0],
      [-0.00032, 3],
      [-0.0007, 0],
      [-0.00081, 0],
      [-0.00029, 3],
      [-0.00029, 3],
      [-0.00037, 3],
      [-0.00066, 0],
      [-0.00017, 3],
      [-0.00036, 3],
      [-0.00031, 3],
      [-0.00079, 0],
      [-0.00038, 3],
      [-0.00065, 0],
      [-0.00041, 3],
      [0.00196, 1],
      [-0.0007, 0]
    ],
    "red_o_points": [],
    "y_categories": ["N", "NOT APPLICABLE", "Y", "nan"],
    "blue_o_points": [],
    "blue_x_points": [
      [0.00242, 1],
      [-0.0001, 3],
      [0.0023, 1],
      [-0.00089, 0],
      [-0.00013, 3],
      [0.00234, 1],
      [0.00189, 1]
    ]
  },
  "QS_mulBpsurgeryType[Graft]": {
    "red_x_points": [
      [-0.00036, 3],
      [-0.00044, 0],
      [-0.00051, 0],
      [-0.00048, 0],
      [-0.00057, 0],
      [-0.00056, 0],
      [-0.00057, 0],
      [-0.0003, 3],
      [-0.00057, 0],
      [-0.0005, 0],
      [-0.00051, 0],
      [-0.00038, 3],
      [0.00186, 1],
      [-0.00033, 3],
      [-0.00218, 2],
      [-0.00039, 3],
      [-0.00063, 0],
      [-0.00052, 0],
      [-0.00034, 3],
      [-0.00034, 3],
      [-0.00045, 3],
      [-0.00059, 0],
      [-0.00035, 3],
      [-0.00034, 3],
      [-0.00035, 3],
      [-0.00067, 0],
      [-0.00027, 3],
      [-0.00063, 0],
      [-0.00045, 3],
      [0.00145, 1],
      [-0.00052, 0]
    ],
    "red_o_points": [],
    "y_categories": ["N", "NOT APPLICABLE", "Y", "nan"],
    "blue_o_points": [],
    "blue_x_points": [
      [0.00224, 1],
      [-0.00011, 3],
      [0.00192, 1],
      [9e-5, 0],
      [-5e-5, 3],
      [0.00192, 1],
      [0.00209, 1]
    ]
  },
  "QA_lstPexMuscstrength[WristExte]": {
    "red_x_points": [
      [-0.00378, 1],
      [-0.00028, 2],
      [-0.00171, 1],
      [-0.00161, 1],
      [0.00082, 0],
      [-0.00179, 1],
      [-0.00193, 1],
      [-0.00236, 0],
      [0.00098, 0],
      [0.00073, 0],
      [-0.00187, 1],
      [-0.00143, 0],
      [-0.00116, 2],
      [0.00208, 2],
      [-0.00015, 2],
      [-0.00202, 0],
      [-4e-5, 2],
      [0.00087, 0],
      [-0.00138, 0],
      [-0.00349, 1],
      [-0.002, 0],
      [-0.00153, 1],
      [0.00207, 2],
      [-0.00188, 0],
      [-0.00437, 1],
      [0.00068, 0],
      [-0.00335, 1],
      [0.0008, 0],
      [0.00291, 2],
      [-0.0013, 2],
      [-0.00143, 1]
    ],
    "red_o_points": [],
    "y_categories": ["GREATER THAN OR EQUALS TO 3", "LESS THAN 3", "nan"],
    "blue_o_points": [],
    "blue_x_points": [
      [0.00071, 0],
      [0.00527, 2],
      [0.00094, 0],
      [0.00236, 0],
      [0.00551, 2],
      [0.00057, 1],
      [0.00095, 0]
    ]
  },
  "QS_mulLysisRoot[C6]": {
    "red_x_points": [
      [-0.00157, 3],
      [-0.00212, 0],
      [-0.00475, 2],
      [-0.00213, 0],
      [-0.00209, 0],
      [-0.00224, 0],
      [-0.00222, 0],
      [-0.00138, 3],
      [-0.00235, 0],
      [-0.00236, 0],
      [-0.00218, 0],
      [-0.00132, 3],
      [0.00728, 1],
      [-0.0013, 3],
      [-0.00213, 0],
      [-0.00169, 3],
      [-0.00217, 0],
      [-0.00214, 0],
      [-0.00122, 3],
      [-0.00151, 3],
      [-0.00129, 3],
      [-0.00204, 0],
      [-0.00129, 3],
      [-0.00153, 3],
      [-0.00128, 3],
      [-0.00226, 0],
      [-0.00148, 3],
      [-0.00236, 0],
      [-0.00122, 3],
      [0.00606, 1],
      [-0.00392, 2]
    ],
    "red_o_points": [],
    "y_categories": ["N", "NOT APPLICABLE", "Y", "nan"],
    "blue_o_points": [],
    "blue_x_points": [
      [0.00804, 1],
      [-0.00052, 3],
      [0.00688, 1],
      [-0.00129, 0],
      [-0.00061, 3],
      [0.00702, 1],
      [0.00766, 1]
    ]
  },
  "QA_lstPexPalle[Clavicle]": {
    "red_x_points": [
      [0.00015, 3],
      [-0.00026, 2],
      [-0.00015, 2],
      [3e-5, 3],
      [7e-5, 3],
      [8e-5, 3],
      [-6e-5, 2],
      [-6e-5, 2],
      [-0.00015, 0],
      [0.00059, 3],
      [3e-5, 3],
      [4e-5, 3],
      [3e-5, 3],
      [-0.00016, 0],
      [-0.00015, 0],
      [-9e-5, 0],
      [-9e-5, 2],
      [4e-5, 3],
      [-0.00305, 2],
      [3e-5, 3],
      [-0.0005, 2],
      [3e-5, 3],
      [-0.014, 2]
    ],
    "red_o_points": [],
    "y_categories": ["HYPO", "NAIA", "PT", "nan"],
    "blue_o_points": [],
    "blue_x_points": [
      [0.00131, 3],
      [0.00038, 3],
      [0.00634, 0],
      [0.00046, 3],
      [0.00033, 3],
      [0.00147, 3],
      [0.00135, 3]
    ]
  },
  "QS_mulGraftNerve[LT]": {
    "red_x_points": [
      [-1e-5, 2],
      [-0.00011, 0],
      [-0.00015, 0],
      [-0.00011, 0],
      [-0.00015, 0],
      [-0.00011, 0],
      [-0.00011, 0],
      [-2e-5, 2],
      [-0.00017, 0],
      [-7e-5, 0],
      [-8e-5, 0],
      [-1e-5, 2],
      [9e-5, 1],
      [-1e-5, 2],
      [-7e-5, 0],
      [-0.00011, 2],
      [-7e-5, 0],
      [-7e-5, 0],
      [-1e-5, 2],
      [-2e-5, 2],
      [-2e-5, 2],
      [-0.00011, 0],
      [-1e-5, 2],
      [-0.00012, 2],
      [-0.0001, 2],
      [-0.00011, 0],
      [-1e-5, 2],
      [-9e-5, 0],
      [-2e-5, 2],
      [0.0003, 1],
      [-0.00011, 0]
    ],
    "red_o_points": [],
    "y_categories": ["N", "NOT APPLICABLE", "nan"],
    "blue_o_points": [],
    "blue_x_points": [
      [0.0004, 1],
      [-2e-5, 2],
      [0.00031, 1],
      [0.00011, 0],
      [-1e-5, 2],
      [0.0002, 1],
      [0.00042, 1]
    ]
  },
  "QS_mulLysisRoot[C5]": {
    "red_x_points": [
      [-0.00129, 3],
      [-0.00177, 0],
      [-0.00372, 2],
      [-0.00177, 0],
      [-0.00156, 0],
      [-0.00184, 0],
      [-0.00169, 0],
      [-0.00098, 3],
      [-0.00181, 0],
      [-0.00181, 0],
      [-0.00182, 0],
      [-0.0013, 3],
      [0.00528, 1],
      [-0.00103, 3],
      [-0.00173, 0],
      [-0.00144, 3],
      [-0.00183, 0],
      [-0.00184, 0],
      [-0.00119, 3],
      [-0.00118, 3],
      [-0.00132, 3],
      [-0.0018, 0],
      [-0.00116, 3],
      [-0.00143, 3],
      [-0.00138, 3],
      [-0.0017, 0],
      [-0.0013, 3],
      [-0.00169, 0],
      [-0.00103, 3],
      [0.00507, 1],
      [-0.00343, 2]
    ],
    "red_o_points": [],
    "y_categories": ["N", "NOT APPLICABLE", "Y", "nan"],
    "blue_o_points": [],
    "blue_x_points": [
      [0.00643, 1],
      [-0.00023, 3],
      [0.00642, 1],
      [-0.00149, 0],
      [-0.00038, 3],
      [0.00564, 1],
      [0.00614, 1]
    ]
  },
  "QS_mulNeuromadSite[C4]": {
    "red_x_points": [
      [-0.00064, 2],
      [-0.00185, 0],
      [-0.0019, 0],
      [-0.00182, 0],
      [-0.0019, 0],
      [-0.00178, 0],
      [-0.00174, 0],
      [-0.00095, 2],
      [-0.00206, 0],
      [-0.0016, 0],
      [-0.00174, 0],
      [-0.00105, 2],
      [0.00247, 1],
      [-0.00081, 2],
      [-0.00179, 0],
      [-0.0013, 2],
      [-0.00185, 0],
      [-0.00182, 0],
      [-0.00079, 2],
      [-0.00071, 2],
      [-0.00087, 2],
      [-0.00145, 0],
      [-0.00074, 2],
      [-0.00073, 2],
      [-0.00083, 2],
      [-0.00209, 0],
      [-0.00068, 2],
      [-0.00188, 0],
      [-0.00046, 2],
      [0.00386, 1],
      [-0.00174, 0]
    ],
    "red_o_points": [],
    "y_categories": ["N", "NOT APPLICABLE", "nan"],
    "blue_o_points": [],
    "blue_x_points": [
      [0.00757, 1],
      [-0.00013, 2],
      [0.00449, 1],
      [-0.00014, 0],
      [0.0, 2],
      [0.00426, 1],
      [0.00546, 1]
    ]
  },
  "QS_lstBpsurgSide": {
    "red_x_points": [
      [-0.00312, 3],
      [-0.00537, 0],
      [-0.00615, 0],
      [-0.00533, 0],
      [-0.0111, 2],
      [-0.00505, 0],
      [-0.00574, 0],
      [-0.00333, 3],
      [-0.00522, 0],
      [-0.00989, 2],
      [-0.00999, 2],
      [-0.00354, 3],
      [0.01713, 1],
      [-0.00349, 3],
      [-0.01137, 2],
      [-0.00338, 3],
      [-0.01033, 2],
      [-0.01071, 2],
      [-0.00357, 3],
      [-0.00344, 3],
      [-0.00269, 3],
      [-0.00576, 0],
      [-0.0036, 3],
      [-0.00333, 3],
      [-0.00336, 3],
      [-0.01026, 2],
      [-0.00336, 3],
      [-0.00961, 2],
      [-0.00315, 3],
      [0.01825, 1],
      [-0.00518, 0]
    ],
    "red_o_points": [],
    "y_categories": ["L", "NOT APPLICABLE", "R", "nan"],
    "blue_o_points": [],
    "blue_x_points": [
      [0.02464, 1],
      [-0.00107, 3],
      [0.01978, 1],
      [0.00074, 0],
      [-0.00112, 3],
      [0.02042, 1],
      [0.02179, 1]
    ]
  },
  "QS_mulGraftNerve[IS]": {
    "red_x_points": [
      [-0.00027, 2],
      [-0.00053, 0],
      [-0.00058, 0],
      [-0.00065, 0],
      [-0.00059, 0],
      [-0.00048, 0],
      [-0.00056, 0],
      [-0.00022, 2],
      [-0.00066, 0],
      [-0.00059, 0],
      [-0.00051, 0],
      [-0.00022, 2],
      [0.0008, 1],
      [-0.00027, 2],
      [-0.0006, 0],
      [-0.00038, 2],
      [-0.00061, 0],
      [-0.00048, 0],
      [-0.00026, 2],
      [-0.00033, 2],
      [-0.0002, 2],
      [-0.00061, 0],
      [-0.00023, 2],
      [-0.0003, 2],
      [-0.00031, 2],
      [-0.00062, 0],
      [-0.00029, 2],
      [-0.0006, 0],
      [-0.00028, 2],
      [0.00172, 1],
      [-0.00061, 0]
    ],
    "red_o_points": [],
    "y_categories": ["N", "NOT APPLICABLE", "nan"],
    "blue_o_points": [],
    "blue_x_points": [
      [0.00266, 1],
      [-0.00015, 2],
      [0.00159, 1],
      [-9e-5, 0],
      [-5e-5, 2],
      [0.00136, 1],
      [0.00154, 1]
    ]
  },
  "QS_mulGraftNerve[MC]": {
    "red_x_points": [
      [-0.00015, 2],
      [-0.00044, 0],
      [-0.00028, 0],
      [-0.00042, 0],
      [-0.00036, 0],
      [-0.0003, 0],
      [-0.00039, 0],
      [-0.00021, 2],
      [-0.0005, 0],
      [-0.00047, 0],
      [-0.00028, 0],
      [-0.00022, 2],
      [0.00084, 1],
      [-0.00019, 2],
      [-0.00036, 0],
      [-0.00028, 2],
      [-0.00032, 0],
      [-0.00062, 0],
      [-0.00027, 2],
      [-0.00018, 2],
      [-0.00029, 2],
      [-0.00044, 0],
      [-0.00023, 2],
      [-0.00047, 2],
      [-0.00018, 2],
      [-0.00035, 0],
      [-0.00014, 2],
      [-0.00035, 0],
      [-0.00024, 2],
      [0.00069, 1],
      [-0.00033, 0]
    ],
    "red_o_points": [],
    "y_categories": ["N", "NOT APPLICABLE", "nan"],
    "blue_o_points": [],
    "blue_x_points": [
      [0.00126, 1],
      [-0.0001, 2],
      [0.00119, 1],
      [-5e-5, 0],
      [-8e-5, 2],
      [0.00118, 1],
      [0.00161, 1]
    ]
  },
  "QS_mulTransfSite[IMc]": {
    "red_x_points": [
      [-0.00227, 3],
      [-0.00648, 2],
      [-0.00459, 0],
      [-0.00393, 0],
      [-0.00392, 0],
      [-0.004, 0],
      [-0.00433, 0],
      [-0.00203, 3],
      [-0.00414, 0],
      [-0.00412, 0],
      [-0.00381, 0],
      [-0.00233, 3],
      [0.01145, 1],
      [-0.00193, 3],
      [-0.00394, 0],
      [-0.00254, 3],
      [-0.00781, 2],
      [-0.004, 0],
      [-0.00249, 3],
      [-0.00214, 3],
      [-0.00184, 3],
      [-0.00377, 0],
      [-0.0021, 3],
      [-0.00238, 3],
      [-0.00246, 3],
      [-0.00369, 0],
      [-0.00201, 3],
      [-0.00676, 2],
      [-0.00193, 3],
      [0.01081, 1],
      [-0.00661, 2]
    ],
    "red_o_points": [],
    "y_categories": ["N", "NOT APPLICABLE", "Y", "nan"],
    "blue_o_points": [],
    "blue_x_points": [
      [0.01607, 1],
      [-0.00045, 3],
      [0.01387, 1],
      [-0.00175, 0],
      [-0.00051, 3],
      [0.01255, 1],
      [0.01316, 1]
    ]
  },
  "QA_yonPreOrtsurg": {
    "red_x_points": [
      [-0.00387, 0],
      [-7e-5, 2],
      [-0.00014, 0],
      [-0.00039, 0],
      [-6e-5, 0],
      [-2e-5, 0],
      [-6e-5, 0],
      [-5e-5, 2],
      [-6e-5, 0],
      [-7e-5, 0],
      [-0.00025, 2],
      [0.00486, 1],
      [-0.00164, 0],
      [-0.0005, 2],
      [-0.00064, 0],
      [-0.00517, 0],
      [0.00012, 1],
      [-7e-5, 0],
      [-0.00374, 0],
      [-0.00416, 0],
      [-0.00424, 0],
      [-0.00016, 0],
      [-0.00462, 0],
      [-0.00515, 0],
      [-0.00457, 0],
      [-0.00016, 2],
      [-0.00048, 2],
      [-0.00022, 0],
      [-0.00063, 2],
      [-0.00017, 2],
      [0.00011, 1]
    ],
    "red_o_points": [],
    "y_categories": ["N", "Y", "nan"],
    "blue_o_points": [],
    "blue_x_points": [
      [-4e-5, 0],
      [0.00273, 2],
      [-4e-5, 0],
      [-0.00017, 0],
      [0.01863, 1],
      [-9e-5, 0],
      [-0.00014, 0]
    ]
  },
  "QS_mulGraftNerve[Ra]": {
    "red_x_points": [
      [-0.00027, 2],
      [-0.00037, 0],
      [-0.00052, 0],
      [-0.00055, 0],
      [-0.00067, 0],
      [-0.0006, 0],
      [-0.00061, 0],
      [-0.00017, 2],
      [-0.00055, 0],
      [-0.00041, 0],
      [-0.00053, 0],
      [-0.00026, 2],
      [0.00094, 1],
      [-0.0001, 2],
      [-0.00067, 0],
      [-0.00022, 2],
      [-0.00066, 0],
      [-0.00058, 0],
      [-0.00019, 2],
      [-0.00018, 2],
      [-0.00022, 2],
      [-0.00042, 0],
      [-0.00011, 2],
      [-0.00038, 2],
      [-0.00017, 2],
      [-0.0006, 0],
      [-0.00024, 2],
      [-0.0006, 0],
      [-8e-5, 2],
      [0.00131, 1],
      [-0.00047, 0]
    ],
    "red_o_points": [],
    "y_categories": ["N", "NOT APPLICABLE", "nan"],
    "blue_o_points": [],
    "blue_x_points": [
      [0.00179, 1],
      [5e-5, 2],
      [0.00129, 1],
      [-0.00019, 0],
      [0.00023, 2],
      [0.00104, 1],
      [0.00127, 1]
    ]
  },
  "QS_mulTransfSite[Oberlin]": {
    "red_x_points": [
      [-0.00312, 3],
      [-0.00974, 0],
      [-0.00953, 0],
      [-0.01029, 0],
      [-0.00553, 2],
      [-0.00504, 2],
      [-0.0098, 0],
      [-0.00309, 3],
      [-0.00507, 2],
      [-0.00485, 2],
      [-0.00507, 2],
      [-0.00331, 3],
      [0.01765, 1],
      [-0.00308, 3],
      [-0.00537, 2],
      [-0.00348, 3],
      [-0.00976, 0],
      [-0.00561, 2],
      [-0.00307, 3],
      [-0.00316, 3],
      [-0.00289, 3],
      [-0.00988, 0],
      [-0.00298, 3],
      [-0.00323, 3],
      [-0.00318, 3],
      [-0.00517, 2],
      [-0.00312, 3],
      [-0.00993, 0],
      [-0.00278, 3],
      [0.01627, 1],
      [-0.00966, 0]
    ],
    "red_o_points": [],
    "y_categories": ["N", "NOT APPLICABLE", "Y", "nan"],
    "blue_o_points": [],
    "blue_x_points": [
      [0.02496, 1],
      [-0.00094, 3],
      [0.01899, 1],
      [-0.00061, 2],
      [-0.00122, 3],
      [0.01868, 1],
      [0.02066, 1]
    ]
  },
  "QS_mulGraftNerve[Ssr]": {
    "red_x_points": [
      [1e-5, 2],
      [-8e-5, 0],
      [-8e-5, 0],
      [-3e-5, 0],
      [-8e-5, 0],
      [-5e-5, 0],
      [1e-5, 2],
      [-0.00012, 0],
      [-8e-5, 0],
      [-7e-5, 0],
      [1e-5, 2],
      [0.00019, 1],
      [1e-5, 2],
      [-9e-5, 0],
      [1e-5, 2],
      [-5e-5, 0],
      [-3e-5, 0],
      [1e-5, 2],
      [0.0, 2],
      [1e-5, 2],
      [-0.00012, 0],
      [1e-5, 2],
      [1e-5, 2],
      [1e-5, 2],
      [-7e-5, 0],
      [1e-5, 2],
      [-3e-5, 0],
      [0.0, 2],
      [0.00019, 1],
      [-8e-5, 0]
    ],
    "red_o_points": [],
    "y_categories": ["N", "NOT APPLICABLE", "nan"],
    "blue_o_points": [],
    "blue_x_points": [
      [0.00019, 1],
      [1e-5, 2],
      [7e-5, 1],
      [-7e-5, 0],
      [1e-5, 2],
      [0.00019, 1]
    ]
  },
  "QA_lstPexKine[Index]": {
    "red_x_points": [
      [-0.00076, 0],
      [-0.00024, 2],
      [-0.00036, 2],
      [-0.00029, 2],
      [7e-5, 1],
      [0.00032, 1],
      [-0.00073, 0],
      [0.00032, 2],
      [0.00021, 1],
      [0.0001, 1],
      [0.00013, 1],
      [-0.00045, 1],
      [-7e-5, 2],
      [0.00019, 2],
      [0.00012, 1],
      [0.00013, 2],
      [-0.00012, 2],
      [0.00023, 1],
      [-0.00036, 1],
      [-0.00083, 0],
      [-0.00043, 1],
      [-0.00017, 2],
      [0.00016, 2],
      [-0.00028, 1],
      [0.00012, 2],
      [-0.00029, 2],
      [-0.00028, 1],
      [-9e-5, 2],
      [-0.00037, 1],
      [-7e-5, 2],
      [-0.00019, 0]
    ],
    "red_o_points": [],
    "y_categories": ["NPV", "PV", "nan"],
    "blue_o_points": [],
    "blue_x_points": [
      [0.0001, 1],
      [0.00073, 2],
      [8e-5, 1],
      [0.00061, 1],
      [0.00042, 2],
      [4e-5, 1],
      [4e-5, 2]
    ]
  }
}
