{
  "QA_lstPexMuscstrength[ElbowFlex]": {
    "red_x_points": [
      [-0.00425, 1],
      [0.00056, 2],
      [-0.00212, 1],
      [-0.0019, 1],
      [0.00294, 0],
      [-0.00197, 1],
      [-0.00229, 1],
      [-0.00455, 1],
      [-0.00244, 1],
      [-0.00211, 1],
      [-0.00193, 1],
      [-0.00423, 1],
      [0.001, 2],
      [0.00365, 2],
      [0.0005, 2],
      [-0.00411, 1],
      [0.00049, 2],
      [0.00123, 0],
      [-0.00444, 1],
      [-0.00402, 1],
      [-0.00404, 1],
      [-0.00219, 1],
      [0.00344, 2],
      [0.00079, 0],
      [-0.00454, 1],
      [-0.00188, 1],
      [-0.0037, 1],
      [-0.00193, 1],
      [-0.00421, 1],
      [0.00085, 2],
      [-0.00193, 1]
    ],
    "red_o_points": [],
    "y_categories": ["GREATER THAN OR EQUALS TO 3", "LESS THAN 3", "nan"],
    "blue_o_points": [],
    "blue_x_points": [
      [0.00071, 2],
      [0.00614, 2],
      [0.00492, 0],
      [-0.00026, 1],
      [0.00587, 2],
      [0.00506, 0],
      [0.00594, 0]
    ]
  },
  "QS_mulLysisTrunk[Upper]": {
    "red_x_points": [
      [-0.00231, 3],
      [-0.00332, 0],
      [-0.00338, 0],
      [-0.00298, 0],
      [-0.0033, 0],
      [-0.00599, 2],
      [-0.00319, 0],
      [-0.00226, 3],
      [-0.00332, 0],
      [-0.00329, 0],
      [-0.00321, 0],
      [-0.00219, 3],
      [0.00904, 1],
      [-0.00183, 3],
      [-0.00336, 0],
      [-0.00218, 3],
      [-0.00525, 2],
      [-0.0035, 0],
      [-0.00194, 3],
      [-0.00193, 3],
      [-0.00198, 3],
      [-0.0031, 0],
      [-0.002, 3],
      [-0.00209, 3],
      [-0.00197, 3],
      [-0.00287, 0],
      [-0.00185, 3],
      [-0.00313, 0],
      [-0.00177, 3],
      [0.00891, 1],
      [-0.00527, 2]
    ],
    "red_o_points": [],
    "y_categories": ["N", "NOT APPLICABLE", "Y", "nan"],
    "blue_o_points": [],
    "blue_x_points": [
      [0.01183, 1],
      [-0.0007, 3],
      [0.01154, 1],
      [-0.00209, 0],
      [-0.00053, 3],
      [0.01123, 1],
      [0.01217, 1]
    ]
  },
  "QS_mulBpsurgeryType[Transf]": {
    "red_x_points": [
      [-0.00054, 3],
      [-0.00067, 2],
      [-0.00174, 0],
      [-0.00066, 2],
      [-0.00063, 2],
      [-0.00067, 2],
      [-0.00065, 2],
      [-0.00051, 3],
      [-0.00074, 2],
      [-0.00054, 2],
      [-0.00071, 2],
      [-0.00043, 3],
      [0.00238, 1],
      [-0.00043, 3],
      [-0.00068, 2],
      [-0.00038, 3],
      [-0.00067, 2],
      [-0.00048, 2],
      [-0.00043, 3],
      [-0.00052, 3],
      [-0.00046, 3],
      [-0.00068, 2],
      [-0.00048, 3],
      [-0.00041, 3],
      [-0.00038, 3],
      [-0.00065, 2],
      [-0.0005, 3],
      [-0.00069, 2],
      [-0.00041, 3],
      [0.00219, 1],
      [-0.00061, 2]
    ],
    "red_o_points": [],
    "y_categories": ["N", "NOT APPLICABLE", "Y", "nan"],
    "blue_o_points": [],
    "blue_x_points": [
      [0.00227, 1],
      [-0.00019, 3],
      [0.00247, 1],
      [-0.00076, 2],
      [-0.00028, 3],
      [0.00209, 1],
      [0.00254, 1]
    ]
  },
  "QS_mulNeuromadSite[T1]": {
    "red_x_points": [
      [-0.00107, 2],
      [-0.0054, 0],
      [-0.00621, 0],
      [-0.00502, 0],
      [-0.00557, 0],
      [-0.00516, 0],
      [-0.0046, 0],
      [-0.00151, 2],
      [-0.00468, 0],
      [-0.00476, 0],
      [-0.00515, 0],
      [-0.00165, 2],
      [0.0085, 1],
      [-0.00136, 2],
      [-0.00522, 0],
      [-0.00171, 2],
      [-0.00547, 0],
      [-0.0051, 0],
      [-0.00144, 2],
      [-0.00144, 2],
      [-0.00117, 2],
      [-0.005, 0],
      [-0.00148, 2],
      [-0.00184, 2],
      [-0.00177, 2],
      [-0.00472, 0],
      [-0.00111, 2],
      [-0.00474, 0],
      [-0.00128, 2],
      [0.00959, 1],
      [-0.0051, 0]
    ],
    "red_o_points": [],
    "y_categories": ["N", "NOT APPLICABLE", "nan"],
    "blue_o_points": [],
    "blue_x_points": [
      [0.01547, 1],
      [0.00019, 2],
      [0.01193, 1],
      [-0.00054, 0],
      [0.00058, 2],
      [0.01159, 1],
      [0.01262, 1]
    ]
  },
  "QS_mulNeuromadSite[T2]": {
    "red_x_points": [
      [-0.00192, 2],
      [-0.00505, 0],
      [-0.00533, 0],
      [-0.00501, 0],
      [-0.00601, 0],
      [-0.00492, 0],
      [-0.00535, 0],
      [-0.00245, 2],
      [-0.0054, 0],
      [-0.00534, 0],
      [-0.00459, 0],
      [-0.00223, 2],
      [0.00898, 1],
      [-0.00183, 2],
      [-0.00539, 0],
      [-0.00218, 2],
      [-0.00533, 0],
      [-0.00611, 0],
      [-0.00226, 2],
      [-0.00193, 2],
      [-0.00195, 2],
      [-0.00525, 0],
      [-0.00179, 2],
      [-0.0028, 2],
      [-0.00226, 2],
      [-0.00512, 0],
      [-0.00181, 2],
      [-0.0051, 0],
      [-0.00189, 2],
      [0.01143, 1],
      [-0.00486, 0]
    ],
    "red_o_points": [],
    "y_categories": ["N", "NOT APPLICABLE", "nan"],
    "blue_o_points": [],
    "blue_x_points": [
      [0.01839, 1],
      [-0.00023, 2],
      [0.0132, 1],
      [-0.00059, 0],
      [-0.00042, 2],
      [0.01284, 1],
      [0.01481, 1]
    ]
  },
  "QA_mulInjOrthesisType[ShoulderSupport]": {
    "red_x_points": [
      [-0.01109, 0],
      [-0.01035, 0],
      [-0.0097, 0],
      [-0.00974, 0],
      [-0.01026, 0],
      [-0.01067, 0],
      [-0.01024, 0],
      [-0.0129, 2],
      [-0.01048, 0],
      [-0.0101, 0],
      [-0.01, 0],
      [-0.01079, 0],
      [0.02808, 1],
      [-0.01163, 0],
      [-0.01009, 0],
      [-0.01074, 0],
      [-0.01247, 2],
      [-0.01053, 0],
      [-0.01062, 0],
      [-0.01127, 0],
      [-0.01312, 2],
      [-0.01312, 3],
      [-0.01137, 0],
      [0.03153, 1],
      [-0.01106, 0],
      [-0.01013, 0],
      [-0.01122, 0],
      [-0.01076, 0],
      [-0.01286, 3],
      [-0.01729, 3],
      [-0.00993, 0]
    ],
    "red_o_points": [],
    "y_categories": ["N", "NOT APPLICABLE", "Y", "nan"],
    "blue_o_points": [],
    "blue_x_points": [
      [-0.00487, 0],
      [0.03137, 1],
      [0.0247, 1],
      [0.03381, 1],
      [0.03079, 1],
      [0.02741, 1],
      [0.02792, 1]
    ]
  },
  "QS_mulGraftRoot[T1]": {
    "red_x_points": [
      [-5e-5, 2],
      [-1e-5, 0],
      [-3e-5, 0],
      [-2e-5, 0],
      [-2e-5, 0],
      [-3e-5, 0],
      [-3e-5, 0],
      [-4e-5, 2],
      [-3e-5, 0],
      [-2e-5, 0],
      [-2e-5, 0],
      [-5e-5, 2],
      [9e-5, 1],
      [-3e-5, 2],
      [-1e-5, 0],
      [-2e-5, 2],
      [-1e-5, 0],
      [-3e-5, 0],
      [-2e-5, 2],
      [-4e-5, 2],
      [-4e-5, 2],
      [-1e-5, 0],
      [-4e-5, 2],
      [-3e-5, 2],
      [-5e-5, 2],
      [-1e-5, 0],
      [-4e-5, 2],
      [-2e-5, 0],
      [-4e-5, 2],
      [-4e-5, 1],
      [-2e-5, 0]
    ],
    "red_o_points": [],
    "y_categories": ["N", "NOT APPLICABLE", "nan"],
    "blue_o_points": [],
    "blue_x_points": [
      [0.00028, 1],
      [1e-5, 2],
      [9e-5, 1],
      [6e-5, 0],
      [-2e-5, 2],
      [0.00028, 1]
    ]
  },
  "QS_mulGraftTrunk[MiddleTrunk]": {
    "red_x_points": [
      [-1e-5, 2],
      [-3e-5, 0],
      [-0.00013, 0],
      [-2e-5, 0],
      [-5e-5, 0],
      [-5e-5, 0],
      [-3e-5, 0],
      [-1e-5, 2],
      [-5e-5, 0],
      [-5e-5, 0],
      [0.0, 0],
      [-2e-5, 2],
      [-5e-5, 1],
      [0.0, 2],
      [2e-5, 0],
      [0.0, 2],
      [-3e-5, 0],
      [-5e-5, 0],
      [-1e-5, 2],
      [-1e-5, 2],
      [0.0, 2],
      [0.0, 2],
      [-5e-5, 0],
      [-0.0001, 2],
      [-0.00026, 0],
      [0.0, 2],
      [-2e-5, 1],
      [-3e-5, 0]
    ],
    "red_o_points": [],
    "y_categories": ["N", "NOT APPLICABLE", "nan"],
    "blue_o_points": [],
    "blue_x_points": [
      [3e-5, 1],
      [8e-5, 2],
      [0.00024, 1],
      [-1e-5, 0],
      [0.00017, 1],
      [0.00026, 1]
    ]
  },
  "QS_mulGraftNerve[Ac]": {
    "red_x_points": [
      [-0.00025, 2],
      [-0.00119, 0],
      [-0.00152, 0],
      [-0.00144, 0],
      [-0.00135, 0],
      [-0.00124, 0],
      [-0.00131, 0],
      [-0.00048, 2],
      [-0.00138, 0],
      [-0.00151, 0],
      [-0.00101, 0],
      [-0.00036, 2],
      [0.00175, 1],
      [-0.00026, 2],
      [-0.00118, 0],
      [-0.00044, 2],
      [-0.0011, 0],
      [-0.00141, 0],
      [-0.00037, 2],
      [-0.00032, 2],
      [-0.00019, 2],
      [-0.00108, 0],
      [-0.00043, 2],
      [-0.00056, 2],
      [-0.00033, 2],
      [-0.00122, 0],
      [-0.0003, 2],
      [-0.00121, 0],
      [-0.00018, 2],
      [0.00235, 1],
      [-0.00142, 0]
    ],
    "red_o_points": [],
    "y_categories": ["N", "NOT APPLICABLE", "nan"],
    "blue_o_points": [],
    "blue_x_points": [
      [0.00495, 1],
      [0.00021, 2],
      [0.00297, 1],
      [-3e-5, 0],
      [5e-5, 2],
      [0.00293, 1],
      [0.00314, 1]
    ]
  },
  "QS_mulNeuromadSite[C8]": {
    "red_x_points": [
      [-0.00112, 2],
      [-0.00365, 0],
      [-0.00384, 0],
      [-0.00382, 0],
      [-0.00394, 0],
      [-0.00353, 0],
      [-0.00362, 0],
      [-0.00128, 2],
      [-0.004, 0],
      [-0.004, 0],
      [-0.00347, 0],
      [-0.00109, 2],
      [0.00604, 1],
      [-0.0012, 2],
      [-0.00368, 0],
      [-0.00139, 2],
      [-0.00359, 0],
      [-0.00346, 0],
      [-0.00135, 2],
      [-0.00108, 2],
      [-0.00095, 2],
      [-0.00311, 0],
      [-0.00117, 2],
      [-0.00141, 2],
      [-0.00111, 2],
      [-0.00357, 0],
      [-0.00117, 2],
      [-0.00362, 0],
      [-0.00103, 2],
      [0.00695, 1],
      [-0.0039, 0]
    ],
    "red_o_points": [],
    "y_categories": ["N", "NOT APPLICABLE", "nan"],
    "blue_o_points": [],
    "blue_x_points": [
      [0.01314, 1],
      [0.0001, 2],
      [0.00899, 1],
      [0.00019, 0],
      [0.00012, 2],
      [0.00752, 1],
      [0.00952, 1]
    ]
  },
  "QS_mulGraftNerve[Ph]": {
    "red_x_points": [
      [-0.00053, 2],
      [-0.0013, 0],
      [-0.00116, 0],
      [-0.00098, 0],
      [-0.00128, 0],
      [-0.0012, 0],
      [-0.001, 0],
      [-0.00042, 2],
      [-0.00105, 0],
      [-0.00106, 0],
      [-0.00101, 0],
      [-0.00046, 2],
      [0.00184, 1],
      [-0.00052, 2],
      [-0.00107, 0],
      [-0.00039, 2],
      [-0.001, 0],
      [-0.00103, 0],
      [-0.00051, 2],
      [-0.0004, 2],
      [-0.00038, 2],
      [-0.00088, 0],
      [-0.00047, 2],
      [-0.00059, 2],
      [-0.00049, 2],
      [-0.00115, 0],
      [-0.00052, 2],
      [-0.00133, 0],
      [-0.00025, 2],
      [0.00256, 1],
      [-0.0009, 0]
    ],
    "red_o_points": [],
    "y_categories": ["N", "NOT APPLICABLE", "nan"],
    "blue_o_points": [],
    "blue_x_points": [
      [0.00463, 1],
      [-0.00015, 2],
      [0.00258, 1],
      [-0.00014, 0],
      [1e-5, 2],
      [0.00264, 1],
      [0.00287, 1]
    ]
  },
  "QS_mulTransfSite[AcSsPA]": {
    "red_x_points": [
      [-0.0005, 3],
      [-0.00113, 0],
      [-0.00113, 0],
      [-0.00131, 0],
      [-0.00112, 0],
      [-0.00107, 0],
      [-0.0011, 0],
      [-0.00054, 3],
      [-0.00111, 0],
      [-0.00109, 0],
      [-0.00109, 0],
      [-0.00054, 3],
      [0.00278, 1],
      [-0.00061, 3],
      [-0.00081, 0],
      [-0.00047, 3],
      [-0.00271, 2],
      [-0.0011, 0],
      [-0.0005, 3],
      [-0.00045, 3],
      [-0.0006, 3],
      [-0.0011, 0],
      [-0.00062, 3],
      [-0.00069, 3],
      [-0.00041, 3],
      [-0.00106, 0],
      [-0.00058, 3],
      [-0.00114, 0],
      [-0.00058, 3],
      [0.0035, 1],
      [-0.00114, 0]
    ],
    "red_o_points": [],
    "y_categories": ["N", "NOT APPLICABLE", "Y", "nan"],
    "blue_o_points": [],
    "blue_x_points": [
      [0.00446, 1],
      [-0.0002, 3],
      [0.00269, 1],
      [-0.00063, 0],
      [-0.00027, 3],
      [0.00289, 1],
      [0.00417, 1]
    ]
  },
  "QA_lstPexPalle[Elbow]": {
    "red_x_points": [
      [0.00013, 4],
      [9e-5, 4],
      [4e-5, 4],
      [9e-5, 4],
      [-0.00072, 3],
      [-0.00066, 3],
      [0.00011, 4],
      [0.00011, 4],
      [0.0001, 4],
      [0.00049, 1],
      [-0.00052, 3],
      [0.00047, 1],
      [0.00082, 4],
      [0.0001, 4],
      [0.0002, 4],
      [8e-5, 4],
      [0.0001, 4],
      [0.00032, 1],
      [-0.00055, 3],
      [-0.00051, 0],
      [-0.00042, 3],
      [-0.00042, 2],
      [0.0001, 4],
      [-0.00211, 3],
      [0.00013, 4],
      [9e-5, 4],
      [-0.0008, 3],
      [7e-5, 4],
      [7e-5, 4],
      [-0.01301, 3],
      [-0.00047, 0]
    ],
    "red_o_points": [],
    "y_categories": ["ABS", "HYPO", "NAIA", "PT", "nan"],
    "blue_o_points": [],
    "blue_x_points": [
      [0.00117, 4],
      [0.00026, 4],
      [0.00626, 1],
      [0.00052, 4],
      [0.00027, 4],
      [0.001, 4],
      [0.00134, 4]
    ]
  },
  "QA_lstPexMuscstrength[ScapulaAbducSuprot]": {
    "red_x_points": [
      [-0.00023, 0],
      [0.00024, 2],
      [-0.00019, 1],
      [-0.00053, 1],
      [-3e-5, 0],
      [-0.00038, 1],
      [-0.00062, 1],
      [-0.00103, 1],
      [-7e-5, 0],
      [-6e-5, 0],
      [-0.00058, 1],
      [-0.00071, 1],
      [0.00035, 2],
      [0.00033, 2],
      [0.00039, 2],
      [0.00048, 2],
      [0.00016, 2],
      [-7e-5, 0],
      [-0.00013, 0],
      [-0.0005, 1],
      [-0.00027, 0],
      [-0.00037, 1],
      [0.00053, 2],
      [-0.00027, 0],
      [0.00025, 2],
      [-0.0005, 1],
      [-0.00065, 1],
      [-2e-5, 0],
      [0.00039, 2],
      [0.00039, 2],
      [-0.00033, 1]
    ],
    "red_o_points": [],
    "y_categories": ["GREATER THAN OR EQUALS TO 3", "LESS THAN 3", "nan"],
    "blue_o_points": [],
    "blue_x_points": [
      [0.00012, 2],
      [0.00068, 2],
      [8e-5, 0],
      [0.00054, 2],
      [0.00058, 2],
      [0.00021, 0],
      [7e-5, 2]
    ]
  },
  "participant_code": {
    "red_x_points": [
      [-0.01689, 1],
      [-0.01544, 2],
      [-0.01619, 3],
      [-0.01572, 4],
      [-0.01558, 5],
      [-0.01614, 6],
      [-0.01624, 7],
      [-0.01596, 8],
      [-0.01647, 9],
      [-0.01628, 10],
      [-0.01535, 11],
      [-0.01558, 12],
      [-0.01675, 14],
      [-0.01568, 16],
      [-0.01535, 17],
      [-0.01563, 19],
      [-0.0161, 20],
      [-0.01661, 22],
      [-0.01638, 23],
      [-0.01582, 25],
      [-0.01628, 26],
      [-0.01652, 27],
      [-0.01628, 28],
      [-0.0174, 29],
      [-0.01572, 30],
      [-0.01661, 32],
      [-0.01484, 33],
      [-0.0167, 34],
      [-0.01568, 35],
      [-0.01666, 36],
      [-0.01614, 37]
    ],
    "red_o_points": [],
    "y_categories": [
      "P16554",
      "P18297",
      "P19283",
      "P19287",
      "P23391",
      "P31645",
      "P31691",
      "P34778",
      "P35046",
      "P36328",
      "P43633",
      "P4544",
      "P46417",
      "P48965",
      "P53068",
      "P5497",
      "P59529",
      "P62483",
      "P64658",
      "P65202",
      "P66816",
      "P6751",
      "P7408",
      "P75566",
      "P76226",
      "P79971",
      "P82621",
      "P82990",
      "P84932",
      "P85825",
      "P86989",
      "P8770",
      "P87791",
      "P90550",
      "P93159",
      "P94969",
      "P96710",
      "P9744",
      "nan"
    ],
    "blue_o_points": [],
    "blue_x_points": [
      [0.04798, 0],
      [0.04722, 13],
      [0.04829, 15],
      [0.04614, 18],
      [0.04706, 21],
      [0.0466, 24],
      [0.0463, 31]
    ]
  },
  "QA_lstPexMuscstrength[ShoulderExrot]": {
    "red_x_points": [
      [-0.0016, 1],
      [0.00016, 2],
      [0.00176, 0],
      [-0.00134, 1],
      [-0.00163, 1],
      [-0.00139, 1],
      [0.0003, 2],
      [-0.00129, 1],
      [-0.00138, 1],
      [-0.00132, 1],
      [0.00022, 2],
      [-0.0013, 1],
      [-0.00048, 2],
      [0.00016, 2],
      [0.00028, 2],
      [0.00027, 2],
      [0.00018, 2],
      [-0.0013, 1],
      [-0.00139, 1],
      [-0.00139, 1],
      [-0.00156, 1],
      [0.00023, 2],
      [0.00017, 2],
      [0.00019, 2],
      [0.00014, 2],
      [-0.00149, 1],
      [0.00017, 2],
      [0.00184, 0],
      [0.0002, 2],
      [-0.00039, 2],
      [-0.0017, 1]
    ],
    "red_o_points": [],
    "y_categories": ["GREATER THAN OR EQUALS TO 3", "LESS THAN 3", "nan"],
    "blue_o_points": [],
    "blue_x_points": [
      [-0.00036, 2],
      [0.00031, 2],
      [0.0037, 0],
      [0.00045, 2],
      [0.00028, 2],
      [0.00388, 0],
      [0.00037, 1]
    ]
  },
  "QA_mulInjOrthesisType[ArmSling]": {
    "red_x_points": [
      [-0.00885, 2],
      [-0.00851, 2],
      [-0.00811, 2],
      [-0.00803, 2],
      [-0.00849, 2],
      [-0.00838, 2],
      [-0.00794, 2],
      [-0.00862, 2],
      [-0.00846, 2],
      [-0.0081, 2],
      [-0.00892, 2],
      [-0.00842, 2],
      [0.02396, 1],
      [-0.00901, 2],
      [-0.00817, 2],
      [-0.00868, 2],
      [-0.00987, 0],
      [-0.008, 2],
      [-0.00881, 2],
      [-0.00895, 2],
      [-0.01089, 0],
      [-0.01012, 3],
      [-0.0091, 2],
      [0.02336, 1],
      [-0.00872, 2],
      [-0.00837, 2],
      [-0.0089, 2],
      [-0.00721, 2],
      [-0.01086, 3],
      [-0.01452, 3],
      [-0.00806, 2]
    ],
    "red_o_points": [],
    "y_categories": ["N", "NOT APPLICABLE", "Y", "nan"],
    "blue_o_points": [],
    "blue_x_points": [
      [-0.00446, 2],
      [0.02648, 1],
      [0.02128, 1],
      [0.02581, 1],
      [0.02564, 1],
      [0.0235, 1],
      [0.0205, 1]
    ]
  },
  "QS_mulGraftNerve[Ul]": {
    "red_x_points": [
      [-0.00013, 2],
      [-0.00048, 0],
      [-0.00035, 0],
      [-0.00031, 0],
      [-0.00034, 0],
      [-0.00026, 0],
      [-0.0005, 0],
      [-0.00032, 2],
      [-0.00035, 0],
      [-0.00039, 0],
      [-0.00045, 0],
      [-0.00032, 2],
      [0.00095, 1],
      [-0.00024, 2],
      [-0.00063, 0],
      [-0.0004, 2],
      [-0.00043, 0],
      [-0.00036, 0],
      [-0.00027, 2],
      [-0.00011, 2],
      [-0.0003, 2],
      [-0.00039, 0],
      [-0.00019, 2],
      [-0.00014, 2],
      [-0.00029, 2],
      [-0.00026, 0],
      [-0.0001, 2],
      [-0.00043, 0],
      [-7e-5, 2],
      [0.00071, 1],
      [-0.00036, 0]
    ],
    "red_o_points": [],
    "y_categories": ["N", "NOT APPLICABLE", "nan"],
    "blue_o_points": [],
    "blue_x_points": [
      [0.00182, 1],
      [7e-5, 2],
      [0.00126, 1],
      [-0.00014, 0],
      [2e-5, 2],
      [0.00109, 1],
      [0.00091, 1]
    ]
  },
  "QA_lstPexPain[C6]": {
    "red_x_points": [
      [-0.00038, 1],
      [-7e-5, 2],
      [-7e-5, 2],
      [-0.00125, 0],
      [5e-5, 1],
      [0.00011, 1],
      [-0.00066, 0],
      [0.0001, 1],
      [0.00018, 1],
      [9e-5, 1],
      [-0.00043, 1],
      [-0.00027, 2],
      [0.00039, 2],
      [-0.00015, 2],
      [0.0004, 2],
      [-3e-5, 2],
      [0.00012, 1],
      [-0.00055, 0],
      [-0.00041, 1],
      [-0.00038, 1],
      [-6e-5, 2],
      [0.00039, 2],
      [-0.00545, 0],
      [0.00013, 2],
      [-0.00031, 2],
      [-0.00047, 1],
      [-9e-5, 2],
      [-0.00052, 1],
      [3e-5, 1],
      [2e-5, 1]
    ],
    "red_o_points": [],
    "y_categories": ["NORM", "NPV", "nan"],
    "blue_o_points": [],
    "blue_x_points": [
      [0.00011, 1],
      [0.00077, 2],
      [0.00088, 1],
      [0.00129, 1],
      [0.00101, 2],
      [0.00079, 1],
      [0.00083, 1]
    ]
  },
  "QA_yonInjUnconscio": {
    "red_x_points": [
      [-0.00317, 1],
      [-0.003, 1],
      [-0.0011, 2],
      [-0.00149, 2],
      [0.00507, 0],
      [-0.00299, 1],
      [-0.0017, 2],
      [-0.00373, 2],
      [-0.00191, 2],
      [-0.00124, 2],
      [-0.00308, 1],
      [-0.00426, 1],
      [-0.01779, 1],
      [-0.00377, 2],
      [-0.00178, 2],
      [-0.0041, 2],
      [-0.00276, 1],
      [0.00634, 0],
      [-0.00275, 1],
      [-0.0028, 1],
      [-0.00287, 1],
      [-0.00278, 1],
      [-0.00399, 2],
      [-0.00434, 1],
      [-0.00336, 2],
      [-0.00295, 1],
      [0.00791, 0],
      [-0.0028, 1],
      [-0.00398, 2],
      [-0.00078, 2],
      [-0.00269, 1]
    ],
    "red_o_points": [],
    "y_categories": ["N", "Y", "nan"],
    "blue_o_points": [],
    "blue_x_points": [
      [0.00075, 2],
      [0.00025, 1],
      [0.01019, 0],
      [0.0139, 0],
      [0.0184, 0],
      [0.00144, 2],
      [0.00168, 2]
    ]
  },
  "QA_lstPexMuscstrength[ShoulderAbduc]": {
    "red_x_points": [
      [-0.00498, 1],
      [-0.00492, 1],
      [-0.00504, 1],
      [-0.00473, 1],
      [-0.00505, 1],
      [-0.0051, 1],
      [-0.00521, 1],
      [-0.00484, 1],
      [-0.00514, 1],
      [-0.0048, 1],
      [-0.00509, 1],
      [-0.00472, 1],
      [0.00189, 2],
      [0.00481, 2],
      [0.0047, 2],
      [0.00423, 2],
      [0.00432, 2],
      [-0.00537, 1],
      [-0.00517, 1],
      [-0.00499, 1],
      [-0.00508, 1],
      [-0.00494, 1],
      [0.00457, 2],
      [-0.00669, 1],
      [-0.00466, 1],
      [-0.00521, 1],
      [-0.0057, 1],
      [-0.00513, 1],
      [-0.00511, 1],
      [0.0011, 2],
      [-0.00501, 1]
    ],
    "red_o_points": [],
    "y_categories": ["GREATER THAN OR EQUALS TO 3", "LESS THAN 3", "nan"],
    "blue_o_points": [],
    "blue_x_points": [
      [0.00288, 2],
      [0.00529, 2],
      [0.02098, 0],
      [0.00542, 2],
      [0.00467, 2],
      [0.02119, 0],
      [-0.00053, 1]
    ]
  },
  "QS_mulGraftNerve[MCA]": {
    "red_x_points": [
      [-7e-5, 2],
      [-0.00012, 0],
      [-0.00012, 0],
      [-0.00012, 0],
      [-0.00016, 0],
      [-8e-5, 0],
      [-0.00012, 0],
      [-2e-5, 2],
      [-0.00012, 0],
      [-0.00017, 0],
      [-0.00012, 0],
      [-8e-5, 2],
      [0.00043, 1],
      [-8e-5, 2],
      [-0.00017, 0],
      [-8e-5, 2],
      [-0.00016, 0],
      [-0.00015, 0],
      [-5e-5, 2],
      [-5e-5, 2],
      [-0.0, 2],
      [-0.00016, 0],
      [-8e-5, 2],
      [-7e-5, 2],
      [-2e-5, 2],
      [-5e-5, 0],
      [-7e-5, 2],
      [-0.00014, 0],
      [-4e-5, 2],
      [0.0001, 1],
      [-0.00015, 0]
    ],
    "red_o_points": [],
    "y_categories": ["N", "NOT APPLICABLE", "nan"],
    "blue_o_points": [],
    "blue_x_points": [
      [0.00062, 1],
      [1e-5, 2],
      [0.00034, 1],
      [-2e-5, 0],
      [-2e-5, 2],
      [0.00023, 1],
      [0.00043, 1]
    ]
  },
  "QA_lstPexInspectio[SurgicalScar]": {
    "red_x_points": [
      [0.00177, 1],
      [0.00087, 1],
      [-0.00018, 0],
      [0.00094, 1],
      [-0.00351, 2],
      [-0.00035, 0],
      [0.00108, 1],
      [0.00172, 1],
      [0.00098, 1],
      [-0.00282, 2],
      [0.00102, 1],
      [-0.00194, 0],
      [-0.00115, 1],
      [-0.00464, 2],
      [0.00129, 1],
      [0.00208, 1],
      [-0.00107, 0],
      [-0.00342, 2],
      [-0.00372, 2],
      [-0.00365, 2],
      [0.00161, 1],
      [0.00101, 1],
      [-0.00459, 2],
      [-0.01083, 2],
      [0.00157, 1],
      [0.00105, 1],
      [-0.00547, 2],
      [-0.00287, 2],
      [0.00165, 1],
      [-0.00095, 1],
      [-0.00261, 2]
    ],
    "red_o_points": [],
    "y_categories": ["ABS", "NAIA", "PT", "nan"],
    "blue_o_points": [],
    "blue_x_points": [
      [1e-5, 1],
      [0.00356, 1],
      [0.00472, 0],
      [0.00318, 1],
      [0.00504, 1],
      [0.00063, 1],
      [0.00445, 0]
    ]
  },
  "QA_intPexWristFlex": {
    "red_x_points": [[0.00072, 2], [-0.0003, 1], [-0.0194, 1]],
    "red_o_points": [],
    "y_categories": ["GREATER THAN OR EQUALS TO 60", "LESS THAN 60", "nan"],
    "blue_o_points": [],
    "blue_x_points": [
      [0.00146, 2],
      [0.0075, 0],
      [0.0001, 2],
      [0.00178, 2],
      [0.00173, 2]
    ]
  },
  "QS_mulGraftNerve[Me]": {
    "red_x_points": [
      [-0.00022, 2],
      [-0.00068, 0],
      [-0.00081, 0],
      [-0.00052, 0],
      [-0.00074, 0],
      [-0.00075, 0],
      [-0.00068, 0],
      [-0.0002, 2],
      [-0.0008, 0],
      [-0.00061, 0],
      [-0.00068, 0],
      [-0.00024, 2],
      [0.00111, 1],
      [-0.00024, 2],
      [-0.00062, 0],
      [-0.00034, 2],
      [-0.00061, 0],
      [-0.0007, 0],
      [-0.00025, 2],
      [-0.00015, 2],
      [-0.00035, 2],
      [-0.00052, 0],
      [-0.00025, 2],
      [-9e-5, 2],
      [-0.00029, 2],
      [-0.00068, 0],
      [-0.00015, 2],
      [-0.00064, 0],
      [-4e-5, 2],
      [0.00147, 1],
      [-0.00067, 0]
    ],
    "red_o_points": [],
    "y_categories": ["N", "NOT APPLICABLE", "nan"],
    "blue_o_points": [],
    "blue_x_points": [
      [0.00263, 1],
      [0.0, 2],
      [0.00155, 1],
      [-6e-5, 0],
      [-3e-5, 2],
      [0.00172, 1],
      [0.00184, 1]
    ]
  },
  "QS_mulGraftNerve[Ax]": {
    "red_x_points": [
      [-0.00019, 2],
      [-0.00031, 0],
      [-0.00026, 0],
      [-0.00038, 0],
      [-0.00046, 0],
      [-0.00035, 0],
      [-0.00035, 0],
      [-0.00025, 2],
      [-0.00039, 0],
      [-0.00033, 0],
      [-0.00038, 0],
      [-0.00021, 2],
      [0.00057, 1],
      [-6e-5, 2],
      [-0.00043, 0],
      [-0.00019, 2],
      [-0.00045, 0],
      [-0.00053, 0],
      [-0.00033, 2],
      [-0.00028, 2],
      [-0.00015, 2],
      [-0.00035, 0],
      [-0.00016, 2],
      [-0.00049, 2],
      [-0.00024, 2],
      [-0.00034, 0],
      [-0.0002, 2],
      [-0.00034, 0],
      [-0.00022, 2],
      [0.00086, 1],
      [-0.00039, 0]
    ],
    "red_o_points": [],
    "y_categories": ["N", "NOT APPLICABLE", "nan"],
    "blue_o_points": [],
    "blue_x_points": [
      [0.0016, 1],
      [-3e-5, 2],
      [0.0008, 1],
      [-0.00011, 0],
      [0.00017, 2],
      [0.0006, 1],
      [0.00125, 1]
    ]
  },
  "QS_mulBpsurgeryType[Lysis]": {
    "red_x_points": [
      [-0.00232, 3],
      [-0.00452, 0],
      [-0.00709, 2],
      [-0.00438, 0],
      [-0.00425, 0],
      [-0.00775, 2],
      [-0.00425, 0],
      [-0.00262, 3],
      [-0.00399, 0],
      [-0.00448, 0],
      [-0.00409, 0],
      [-0.00248, 3],
      [0.01259, 1],
      [-0.00226, 3],
      [-0.00442, 0],
      [-0.0027, 3],
      [-0.00831, 2],
      [-0.00412, 0],
      [-0.00242, 3],
      [-0.00242, 3],
      [-0.00222, 3],
      [-0.00407, 0],
      [-0.00246, 3],
      [-0.00225, 3],
      [-0.00237, 3],
      [-0.00392, 0],
      [-0.00209, 3],
      [-0.00396, 0],
      [-0.00215, 3],
      [0.01312, 1],
      [-0.00775, 2]
    ],
    "red_o_points": [],
    "y_categories": ["N", "NOT APPLICABLE", "Y", "nan"],
    "blue_o_points": [],
    "blue_x_points": [
      [0.01722, 1],
      [-0.00068, 3],
      [0.0133, 1],
      [-0.0018, 0],
      [-0.00068, 3],
      [0.01461, 1],
      [0.01439, 1]
    ]
  },
  "QS_mulLysisSite[Trunk]": {
    "red_x_points": [
      [-0.0019, 3],
      [-0.00284, 0],
      [-0.00321, 0],
      [-0.00306, 0],
      [-0.00289, 0],
      [-0.00573, 2],
      [-0.00311, 0],
      [-0.0017, 3],
      [-0.00294, 0],
      [-0.00284, 0],
      [-0.00287, 0],
      [-0.00199, 3],
      [0.00907, 1],
      [-0.00156, 3],
      [-0.00294, 0],
      [-0.0018, 3],
      [-0.00587, 2],
      [-0.00301, 0],
      [-0.00189, 3],
      [-0.00187, 3],
      [-0.00198, 3],
      [-0.003, 0],
      [-0.0019, 3],
      [-0.00226, 3],
      [-0.00167, 3],
      [-0.00316, 0],
      [-0.00202, 3],
      [-0.00287, 0],
      [-0.00144, 3],
      [0.00924, 1],
      [-0.00492, 2]
    ],
    "red_o_points": [],
    "y_categories": ["N", "NOT APPLICABLE", "Y", "nan"],
    "blue_o_points": [],
    "blue_x_points": [
      [0.01161, 1],
      [-0.00064, 3],
      [0.01008, 1],
      [-0.00185, 0],
      [-0.00068, 3],
      [0.00996, 1],
      [0.01019, 1]
    ]
  },
  "QS_mulGraftTrunk[UpperTrunk]": {
    "red_x_points": [
      [-0.00089, 3],
      [-0.00177, 0],
      [-0.00185, 0],
      [-0.0017, 0],
      [-0.00165, 0],
      [-0.00173, 0],
      [-0.0016, 0],
      [-0.00078, 3],
      [-0.00194, 0],
      [-0.00201, 0],
      [-0.00159, 0],
      [-0.00095, 3],
      [0.00507, 1],
      [-0.00061, 3],
      [-0.00407, 2],
      [-0.0009, 3],
      [-0.00171, 0],
      [-0.0022, 0],
      [-0.00084, 3],
      [-0.00074, 3],
      [-0.00068, 3],
      [-0.00144, 0],
      [-0.00091, 3],
      [-0.00073, 3],
      [-0.00081, 3],
      [-0.00209, 0],
      [-0.00079, 3],
      [-0.00181, 0],
      [-0.00081, 3],
      [0.00419, 1],
      [-0.00178, 0]
    ],
    "red_o_points": [],
    "y_categories": ["N", "NOT APPLICABLE", "Y", "nan"],
    "blue_o_points": [],
    "blue_x_points": [
      [0.00632, 1],
      [-0.00037, 3],
      [0.00524, 1],
      [-0.00081, 0],
      [-0.00025, 3],
      [0.00485, 1],
      [0.00609, 1]
    ]
  },
  "QS_mulTransfSite[PhMc]": {
    "red_x_points": [
      [-0.00109, 3],
      [-0.00242, 0],
      [-0.00245, 0],
      [-0.00222, 0],
      [-0.00262, 0],
      [-0.00189, 0],
      [-0.00388, 2],
      [-0.00123, 3],
      [-0.00231, 0],
      [-0.00202, 0],
      [-0.00223, 0],
      [-0.00124, 3],
      [0.00466, 1],
      [-0.00107, 3],
      [-0.00252, 0],
      [-0.00136, 3],
      [-0.00222, 0],
      [-0.00237, 0],
      [-0.00122, 3],
      [-0.00113, 3],
      [-0.00121, 3],
      [-0.00374, 2],
      [-0.00119, 3],
      [-0.00113, 3],
      [-0.00131, 3],
      [-0.00242, 0],
      [-0.00136, 3],
      [-0.00242, 0],
      [-0.00111, 3],
      [0.00626, 1],
      [-0.00242, 0]
    ],
    "red_o_points": [],
    "y_categories": ["N", "NOT APPLICABLE", "Y", "nan"],
    "blue_o_points": [],
    "blue_x_points": [
      [0.00891, 1],
      [-0.00065, 3],
      [0.0079, 1],
      [-0.00095, 0],
      [-0.00043, 3],
      [0.00733, 1],
      [0.00788, 1]
    ]
  },
  "QA_mulInjTbpiCause[Motorcycle]": {
    "red_x_points": [
      [0.00046, 0],
      [-0.00057, 1],
      [-0.00068, 1],
      [-0.00054, 1],
      [-0.00066, 1],
      [-0.0005, 1],
      [-0.00047, 1],
      [-0.00023, 1],
      [-0.00046, 1],
      [-0.00038, 1],
      [-0.0005, 1],
      [-0.00113, 0],
      [-0.03098, 1],
      [-0.00062, 1],
      [-0.00059, 1],
      [-0.00034, 1],
      [-0.0007, 1],
      [-0.00101, 1],
      [-0.00088, 0],
      [-0.00024, 1],
      [-0.00041, 1],
      [-0.00039, 1],
      [-0.0006, 1],
      [-0.00119, 1],
      [0.0004, 0],
      [-0.00029, 1],
      [-0.00022, 1],
      [-0.0005, 1],
      [-0.00035, 1],
      [-0.02894, 1],
      [-0.00055, 1]
    ],
    "red_o_points": [],
    "y_categories": ["N", "Y", "nan"],
    "blue_o_points": [],
    "blue_x_points": [
      [0.01181, 0],
      [-0.00014, 1],
      [0.01115, 0],
      [-0.00078, 1],
      [0.00123, 1],
      [0.01223, 0],
      [0.01323, 0]
    ]
  },
  "QS_mulLysisSite[Root]": {
    "red_x_points": [
      [-0.00069, 3],
      [-0.00081, 0],
      [-0.00254, 2],
      [-0.00105, 0],
      [-0.00091, 0],
      [-0.00109, 0],
      [-0.00101, 0],
      [-0.00051, 3],
      [-0.0011, 0],
      [-0.00114, 0],
      [-0.001, 0],
      [-0.0007, 3],
      [0.00364, 1],
      [-0.00079, 3],
      [-0.00112, 0],
      [-0.00072, 3],
      [-0.00105, 0],
      [-0.00096, 0],
      [-0.00071, 3],
      [-0.00077, 3],
      [-0.00079, 3],
      [-0.00113, 0],
      [-0.00072, 3],
      [-0.00076, 3],
      [-0.00071, 3],
      [-0.00093, 0],
      [-0.00084, 3],
      [-0.00098, 0],
      [-0.00071, 3],
      [0.00397, 1],
      [-0.00276, 2]
    ],
    "red_o_points": [],
    "y_categories": ["N", "NOT APPLICABLE", "Y", "nan"],
    "blue_o_points": [],
    "blue_x_points": [
      [0.00443, 1],
      [-0.00049, 3],
      [0.00435, 1],
      [-0.0013, 0],
      [-0.00037, 3],
      [0.00394, 1],
      [0.00378, 1]
    ]
  },
  "QA_yonInjOrtsurg": {
    "red_x_points": [
      [-0.00337, 2],
      [-0.00014, 2],
      [3e-5, 2],
      [-4e-5, 2],
      [2e-5, 2],
      [0.0001, 2],
      [-0.00029, 1],
      [-0.00413, 2],
      [-0.00015, 0],
      [-0.00012, 1],
      [-0.00023, 1],
      [-0.00328, 2],
      [-0.00422, 0],
      [0.00016, 1],
      [-0.0003, 2],
      [-0.00404, 2],
      [-0.0002, 0],
      [0.0001, 2],
      [0.0035, 0],
      [-6e-5, 1],
      [-0.00335, 2],
      [-5e-5, 1],
      [-0.00462, 2],
      [-0.0034, 2],
      [-0.00323, 2],
      [-8e-5, 0],
      [-0.00101, 1],
      [-3e-5, 0],
      [-0.0037, 2],
      [-0.00193, 1],
      [-0.00016, 1]
    ],
    "red_o_points": [],
    "y_categories": ["N", "Y", "nan"],
    "blue_o_points": [],
    "blue_x_points": [
      [0.00066, 2],
      [0.00408, 1],
      [0.00087, 2],
      [0.00057, 2],
      [0.01451, 0],
      [0.00094, 2],
      [0.00081, 2]
    ]
  },
  "QS_mulGraftLevel[Trunk]": {
    "red_x_points": [
      [-0.00049, 3],
      [-0.00083, 0],
      [-0.00079, 0],
      [-0.00057, 0],
      [-0.00091, 0],
      [-0.00076, 0],
      [-0.00066, 0],
      [-0.00029, 3],
      [-0.00065, 0],
      [-0.00079, 0],
      [-0.00077, 0],
      [-0.0003, 3],
      [0.00231, 1],
      [-0.00027, 3],
      [-0.00237, 2],
      [-0.0004, 3],
      [-0.00073, 0],
      [-0.00074, 0],
      [-0.00029, 3],
      [-0.00043, 3],
      [-0.00035, 3],
      [-0.00077, 0],
      [-0.00034, 3],
      [-0.00062, 3],
      [-0.00035, 3],
      [-0.00071, 0],
      [-0.00027, 3],
      [-0.00072, 0],
      [-0.00041, 3],
      [0.00228, 1],
      [-0.00093, 0]
    ],
    "red_o_points": [],
    "y_categories": ["N", "NOT APPLICABLE", "Y", "nan"],
    "blue_o_points": [],
    "blue_x_points": [
      [0.00259, 1],
      [-3e-5, 3],
      [0.00198, 1],
      [-9e-5, 0],
      [-0.0002, 3],
      [0.00188, 1],
      [0.00248, 1]
    ]
  },
  "QS_mulGraftNerve[FI]": {
    "red_x_points": [
      [-0.00041, 2],
      [-0.00076, 0],
      [-0.00101, 0],
      [-0.00081, 0],
      [-0.00116, 0],
      [-0.00076, 0],
      [-0.00079, 0],
      [-0.00036, 2],
      [-0.00097, 0],
      [-0.00101, 0],
      [-0.00079, 0],
      [-0.00056, 2],
      [0.0015, 1],
      [-0.00029, 2],
      [-0.00098, 0],
      [-0.00048, 2],
      [-0.00068, 0],
      [-0.00094, 0],
      [-0.00047, 2],
      [-0.00041, 2],
      [-0.00041, 2],
      [-0.00066, 0],
      [-0.00027, 2],
      [-0.00089, 2],
      [-0.00039, 2],
      [-0.00095, 0],
      [-0.00036, 2],
      [-0.00114, 0],
      [-0.00023, 2],
      [0.00109, 1],
      [-0.00088, 0]
    ],
    "red_o_points": [],
    "y_categories": ["N", "NOT APPLICABLE", "nan"],
    "blue_o_points": [],
    "blue_x_points": [
      [0.00405, 1],
      [0.00011, 2],
      [0.00236, 1],
      [9e-5, 0],
      [3e-5, 2],
      [0.00192, 1],
      [0.00308, 1]
    ]
  },
  "QS_mulGraftNerve[other]": {
    "red_x_points": [
      [-0.00042, 2],
      [-0.00192, 0],
      [-0.00192, 0],
      [-0.00195, 0],
      [-0.00188, 0],
      [-0.00186, 0],
      [-0.00188, 0],
      [-0.00038, 2],
      [-0.00219, 0],
      [-0.00169, 0],
      [-0.00173, 0],
      [-0.00061, 2],
      [0.00246, 1],
      [-0.00049, 2],
      [-0.00175, 0],
      [-0.00049, 2],
      [-0.00155, 0],
      [-0.00198, 0],
      [-0.00037, 2],
      [-0.00048, 2],
      [-0.00042, 2],
      [-0.00173, 0],
      [-0.00048, 2],
      [-0.00057, 2],
      [-0.00042, 2],
      [-0.00194, 0],
      [-0.0005, 2],
      [-0.00184, 0],
      [-0.00029, 2],
      [0.00353, 1],
      [-0.00179, 0]
    ],
    "red_o_points": [],
    "y_categories": ["N", "NOT APPLICABLE", "nan"],
    "blue_o_points": [],
    "blue_x_points": [
      [0.00647, 1],
      [0.00014, 2],
      [0.00417, 1],
      [0.00021, 0],
      [-3e-5, 2],
      [0.00409, 1],
      [0.00507, 1]
    ]
  },
  "QS_mulTransfSite[AcSsAA]": {
    "red_x_points": [
      [-0.00292, 3],
      [-0.00829, 2],
      [-0.00366, 0],
      [-0.00748, 2],
      [-0.00866, 2],
      [-0.00354, 0],
      [-0.00356, 0],
      [-0.00311, 3],
      [-0.00358, 0],
      [-0.00804, 2],
      [-0.00341, 0],
      [-0.0029, 3],
      [0.01399, 1],
      [-0.00295, 3],
      [-0.009, 2],
      [-0.00274, 3],
      [-0.00303, 0],
      [-0.00374, 0],
      [-0.00274, 3],
      [-0.00279, 3],
      [-0.00283, 3],
      [-0.00831, 2],
      [-0.00297, 3],
      [-0.00287, 3],
      [-0.00312, 3],
      [-0.00343, 0],
      [-0.00306, 3],
      [-0.00759, 2],
      [-0.00296, 3],
      [0.01439, 1],
      [-0.00368, 0]
    ],
    "red_o_points": [],
    "y_categories": ["N", "NOT APPLICABLE", "Y", "nan"],
    "blue_o_points": [],
    "blue_x_points": [
      [0.01827, 1],
      [-0.00125, 3],
      [0.01434, 1],
      [-0.00112, 0],
      [-0.00124, 3],
      [0.01507, 1],
      [0.01743, 1]
    ]
  },
  "QS_mulGraftNerve[DS]": {
    "red_x_points": [
      [-3e-5, 2],
      [-3e-5, 0],
      [-3e-5, 0],
      [-3e-5, 0],
      [-3e-5, 0],
      [-3e-5, 2],
      [-3e-5, 0],
      [-3e-5, 0],
      [-3e-5, 0],
      [-3e-5, 2],
      [0.0001, 1],
      [-3e-5, 0],
      [-3e-5, 0],
      [-3e-5, 2],
      [-3e-5, 2],
      [-3e-5, 2],
      [-3e-5, 0],
      [-3e-5, 2],
      [-3e-5, 2],
      [-3e-5, 0],
      [-3e-5, 2],
      [0.0001, 1],
      [-3e-5, 0]
    ],
    "red_o_points": [],
    "y_categories": ["N", "NOT APPLICABLE", "nan"],
    "blue_o_points": [],
    "blue_x_points": [
      [0.0001, 1],
      [-3e-5, 2],
      [0.0001, 1],
      [-3e-5, 0],
      [0.0001, 1],
      [0.0001, 1]
    ]
  },
  "QS_mulGraftNerve[MP]": {
    "red_x_points": [
      [-0.0, 2],
      [-5e-5, 0],
      [-5e-5, 0],
      [-5e-5, 0],
      [-5e-5, 0],
      [-5e-5, 0],
      [-5e-5, 0],
      [-9e-5, 2],
      [-6e-5, 0],
      [-3e-5, 0],
      [-3e-5, 0],
      [-0.0001, 2],
      [3e-5, 1],
      [-1e-5, 2],
      [-5e-5, 0],
      [-0.0001, 2],
      [-3e-5, 0],
      [-3e-5, 0],
      [-0.0, 2],
      [-9e-5, 2],
      [-1e-5, 2],
      [-1e-5, 2],
      [-5e-5, 0],
      [-1e-5, 2],
      [-6e-5, 0],
      [-0.0, 2],
      [9e-5, 1],
      [-3e-5, 0]
    ],
    "red_o_points": [],
    "y_categories": ["N", "NOT APPLICABLE", "nan"],
    "blue_o_points": [],
    "blue_x_points": [
      [0.00039, 1],
      [-0.0, 2],
      [0.0002, 1],
      [-1e-5, 0],
      [-0.0, 2],
      [0.00014, 1],
      [0.00011, 1]
    ]
  },
  "QS_mulGraftNerve[LP]": {
    "red_x_points": [
      [-1e-5, 2],
      [-5e-5, 0],
      [-5e-5, 0],
      [-5e-5, 0],
      [-5e-5, 0],
      [-1e-5, 2],
      [-5e-5, 0],
      [-5e-5, 0],
      [-1e-5, 2],
      [0.0001, 1],
      [-1e-5, 2],
      [-5e-5, 0],
      [-1e-5, 2],
      [-2e-5, 0],
      [-5e-5, 0],
      [-1e-5, 2],
      [-1e-5, 2],
      [-5e-5, 0],
      [1e-5, 2],
      [-1e-5, 2],
      [-1e-5, 2],
      [-5e-5, 0],
      [-1e-5, 1],
      [-5e-5, 0]
    ],
    "red_o_points": [],
    "y_categories": ["N", "NOT APPLICABLE", "nan"],
    "blue_o_points": [],
    "blue_x_points": [
      [0.0001, 1],
      [1e-5, 2],
      [2e-5, 0],
      [-1e-5, 2],
      [0.0001, 1],
      [0.0001, 1]
    ]
  },
  "QA_lstPexMuscstrength[WristFlex]": {
    "red_x_points": [
      [-0.00348, 1],
      [-0.00016, 2],
      [-0.0011, 1],
      [-0.00123, 1],
      [0.00053, 0],
      [0.00048, 0],
      [-0.00139, 1],
      [-0.00139, 0],
      [0.00059, 0],
      [0.00036, 0],
      [0.00052, 0],
      [-0.00119, 0],
      [-0.00099, 2],
      [0.00153, 2],
      [-0.00012, 2],
      [-0.00129, 0],
      [-9e-5, 2],
      [0.0005, 0],
      [-0.00117, 0],
      [-0.00302, 1],
      [-0.00102, 0],
      [-0.00162, 1],
      [0.00159, 2],
      [-0.00781, 1],
      [-0.00139, 0],
      [0.0005, 0],
      [-0.00322, 1],
      [0.00038, 0],
      [0.00144, 2],
      [-0.00022, 2],
      [-0.00142, 1]
    ],
    "red_o_points": [],
    "y_categories": ["GREATER THAN OR EQUALS TO 3", "LESS THAN 3", "nan"],
    "blue_o_points": [],
    "blue_x_points": [
      [0.00043, 0],
      [0.00343, 2],
      [0.00151, 0],
      [0.00241, 0],
      [0.00357, 2],
      [0.00131, 0],
      [0.00157, 0]
    ]
  },
  "QS_mulNeuromadSite[C5]": {
    "red_x_points": [
      [-0.00128, 2],
      [-0.00328, 0],
      [-0.00367, 0],
      [-0.00346, 0],
      [-0.00383, 0],
      [-0.00337, 0],
      [-0.00299, 0],
      [-0.00097, 2],
      [-0.0032, 0],
      [-0.00366, 0],
      [-0.0034, 0],
      [-0.0016, 2],
      [0.00609, 1],
      [-0.00105, 2],
      [-0.00388, 0],
      [-0.00121, 2],
      [-0.00299, 0],
      [-0.00337, 0],
      [-0.00141, 2],
      [-0.00129, 2],
      [-0.00122, 2],
      [-0.00294, 0],
      [-0.00101, 2],
      [-0.00125, 2],
      [-0.00125, 2],
      [-0.00312, 0],
      [-0.00143, 2],
      [-0.00341, 0],
      [-0.00096, 2],
      [0.00641, 1],
      [-0.00365, 0]
    ],
    "red_o_points": [],
    "y_categories": ["N", "NOT APPLICABLE", "nan"],
    "blue_o_points": [],
    "blue_x_points": [
      [0.01149, 1],
      [0.00012, 2],
      [0.00769, 1],
      [-0.00011, 0],
      [0.00013, 2],
      [0.00776, 1],
      [0.00821, 1]
    ]
  },
  "QS_mulNeuromadSite[C7]": {
    "red_x_points": [
      [-0.00097, 2],
      [-0.00313, 0],
      [-0.0031, 0],
      [-0.00289, 0],
      [-0.00283, 0],
      [-0.00259, 0],
      [-0.00277, 0],
      [-0.00097, 2],
      [-0.00289, 0],
      [-0.00264, 0],
      [-0.00261, 0],
      [-0.00109, 2],
      [0.00361, 1],
      [-0.00069, 2],
      [-0.00253, 0],
      [-0.00128, 2],
      [-0.00269, 0],
      [-0.00242, 0],
      [-0.00116, 2],
      [-0.00096, 2],
      [-0.00083, 2],
      [-0.00237, 0],
      [-0.00066, 2],
      [-0.0009, 2],
      [-0.0012, 2],
      [-0.00257, 0],
      [-0.00076, 2],
      [-0.00278, 0],
      [-0.00079, 2],
      [0.00612, 1],
      [-0.00237, 0]
    ],
    "red_o_points": [],
    "y_categories": ["N", "NOT APPLICABLE", "nan"],
    "blue_o_points": [],
    "blue_x_points": [
      [0.00858, 1],
      [0.00019, 2],
      [0.00635, 1],
      [-0.00015, 0],
      [0.00015, 2],
      [0.00574, 1],
      [0.00641, 1]
    ]
  },
  "QA_lstPexMuscstrength[ShoulderInrot]": {
    "red_x_points": [
      [-0.00075, 1],
      [6e-5, 2],
      [0.00029, 0],
      [-0.00064, 1],
      [0.00017, 0],
      [-0.0004, 1],
      [7e-5, 2],
      [-0.00058, 1],
      [0.00039, 0],
      [6e-5, 2],
      [0.00011, 2],
      [-0.00047, 1],
      [0.00011, 2],
      [6e-5, 2],
      [9e-5, 2],
      [0.00016, 2],
      [4e-5, 2],
      [-0.00077, 1],
      [0.00013, 0],
      [-0.00064, 1],
      [0.00018, 0],
      [0.0001, 2],
      [5e-5, 2],
      [3e-5, 2],
      [8e-5, 2],
      [-0.00081, 1],
      [9e-5, 2],
      [-0.00042, 1],
      [8e-5, 2],
      [0.00011, 2],
      [0.00027, 0]
    ],
    "red_o_points": [],
    "y_categories": ["GREATER THAN OR EQUALS TO 3", "LESS THAN 3", "nan"],
    "blue_o_points": [],
    "blue_x_points": [
      [2e-5, 2],
      [0.00016, 2],
      [0.00055, 0],
      [0.00014, 2],
      [0.00014, 2],
      [0.00028, 0],
      [0.0003, 0]
    ]
  },
  "QA_lstPexMuscstrength[ElbowExte]": {
    "red_x_points": [
      [-0.00244, 1],
      [-5e-5, 2],
      [3e-5, 1],
      [-9e-5, 1],
      [-0.00139, 0],
      [0.00011, 1],
      [-5e-5, 1],
      [-0.003, 1],
      [-0.00131, 0],
      [-0.00056, 0],
      [7e-5, 1],
      [-0.0026, 1],
      [0.00017, 2],
      [0.00367, 2],
      [-0.00017, 2],
      [-0.00304, 1],
      [-0.00018, 2],
      [0.00029, 1],
      [-0.00235, 0],
      [-0.00289, 1],
      [-0.00268, 0],
      [1e-5, 1],
      [0.00294, 2],
      [-0.00221, 0],
      [-0.00351, 0],
      [0.00028, 1],
      [-0.00234, 1],
      [-0.00035, 2],
      [-0.00254, 1],
      [-5e-5, 2],
      [-3e-5, 1]
    ],
    "red_o_points": [],
    "y_categories": ["GREATER THAN OR EQUALS TO 3", "LESS THAN 3", "nan"],
    "blue_o_points": [],
    "blue_x_points": [
      [5e-5, 2],
      [0.00671, 2],
      [0.00126, 1],
      [0.00716, 2],
      [0.00023, 0],
      [0.00028, 0]
    ]
  },
  "QA_intPexForearmSupin": {
    "red_x_points": [
      [8e-5, 2],
      [0.00016, 0],
      [1e-5, 2],
      [-0.00047, 1],
      [-5e-5, 1],
      [2e-5, 2],
      [-0.00036, 1],
      [2e-5, 2],
      [1e-5, 2],
      [2e-5, 2],
      [-5e-5, 0],
      [0.00081, 2],
      [0.00014, 2],
      [2e-5, 2],
      [0.00014, 2],
      [1e-5, 2],
      [-0.00039, 1],
      [-0.00063, 1],
      [-0.00016, 0],
      [-0.00042, 1],
      [-0.00014, 1],
      [0.0001, 2],
      [4e-5, 2],
      [6e-5, 2],
      [4e-5, 2],
      [-0.00034, 1],
      [2e-5, 2],
      [6e-5, 2],
      [-0.01688, 1],
      [5e-5, 0]
    ],
    "red_o_points": [],
    "y_categories": ["GREATER THAN OR EQUALS TO 80", "LESS THAN 80", "nan"],
    "blue_o_points": [],
    "blue_x_points": [
      [0.00164, 2],
      [0.00012, 2],
      [0.00664, 0],
      [0.00019, 2],
      [0.00013, 2],
      [0.00158, 2],
      [0.00162, 2]
    ]
  },
  "QS_mulGraftNerve[SS]": {
    "red_x_points": [
      [-3e-5, 2],
      [-5e-5, 0],
      [-8e-5, 0],
      [-9e-5, 0],
      [-0.00011, 0],
      [-9e-5, 0],
      [-6e-5, 0],
      [-3e-5, 2],
      [-0.00011, 0],
      [-0.00011, 0],
      [-8e-5, 0],
      [-4e-5, 2],
      [0.00022, 1],
      [-0.00011, 2],
      [-3e-5, 0],
      [-4e-5, 2],
      [-0.0, 0],
      [-9e-5, 0],
      [-4e-5, 2],
      [-2e-5, 2],
      [-3e-5, 2],
      [-8e-5, 0],
      [-0.00012, 2],
      [-4e-5, 2],
      [-4e-5, 2],
      [-3e-5, 0],
      [-2e-5, 2],
      [-8e-5, 0],
      [-3e-5, 2],
      [0.00033, 1],
      [-2e-5, 0]
    ],
    "red_o_points": [],
    "y_categories": ["N", "NOT APPLICABLE", "nan"],
    "blue_o_points": [],
    "blue_x_points": [
      [0.00033, 1],
      [-3e-5, 2],
      [7e-5, 1],
      [-7e-5, 0],
      [-3e-5, 2],
      [0.00027, 1],
      [0.0002, 1]
    ]
  },
  "QS_mulGraftNerve[MCF]": {
    "red_x_points": [
      [-8e-5, 2],
      [-0.0001, 0],
      [-0.00023, 0],
      [-0.00022, 0],
      [-0.00022, 0],
      [-0.00017, 0],
      [-0.00022, 0],
      [-8e-5, 2],
      [-0.00034, 0],
      [-0.00017, 0],
      [-0.00026, 0],
      [-4e-5, 2],
      [0.00037, 1],
      [-5e-5, 2],
      [-0.0002, 0],
      [-6e-5, 2],
      [-0.00019, 0],
      [-0.00022, 0],
      [-8e-5, 2],
      [-8e-5, 2],
      [-4e-5, 2],
      [-0.00016, 0],
      [-7e-5, 2],
      [-3e-5, 2],
      [-4e-5, 2],
      [-0.00012, 0],
      [-8e-5, 2],
      [-0.00022, 0],
      [-4e-5, 2],
      [0.00037, 1],
      [-0.00025, 0]
    ],
    "red_o_points": [],
    "y_categories": ["N", "NOT APPLICABLE", "nan"],
    "blue_o_points": [],
    "blue_x_points": [
      [0.00086, 1],
      [-4e-5, 2],
      [0.00048, 1],
      [-2e-5, 0],
      [-7e-5, 2],
      [0.00034, 1],
      [0.00075, 1]
    ]
  },
  "QS_mulNeuromadSite[C6]": {
    "red_x_points": [
      [-0.00113, 2],
      [-0.00228, 0],
      [-0.00202, 0],
      [-0.00206, 0],
      [-0.00212, 0],
      [-0.00208, 0],
      [-0.0022, 0],
      [-0.00134, 2],
      [-0.00246, 0],
      [-0.00245, 0],
      [-0.00197, 0],
      [-0.00149, 2],
      [0.00365, 1],
      [-0.00109, 2],
      [-0.00234, 0],
      [-0.00131, 2],
      [-0.00228, 0],
      [-0.00247, 0],
      [-0.00127, 2],
      [-0.00088, 2],
      [-0.00088, 2],
      [-0.0017, 0],
      [-0.00096, 2],
      [-0.0013, 2],
      [-0.00114, 2],
      [-0.00187, 0],
      [-0.00093, 2],
      [-0.0022, 0],
      [-0.00109, 2],
      [0.00446, 1],
      [-0.00169, 0]
    ],
    "red_o_points": [],
    "y_categories": ["N", "NOT APPLICABLE", "nan"],
    "blue_o_points": [],
    "blue_x_points": [
      [0.00837, 1],
      [-0.00019, 2],
      [0.00586, 1],
      [-0.00024, 0],
      [-0.00012, 2],
      [0.00616, 1],
      [0.00538, 1]
    ]
  },
  "QS_mulLysisSite[Nerve]": {
    "red_x_points": [
      [-0.00041, 3],
      [-0.0007, 0],
      [-0.00146, 2],
      [-0.00069, 0],
      [-0.00072, 0],
      [-0.0008, 0],
      [-0.00077, 0],
      [-0.00028, 3],
      [-0.00069, 0],
      [-0.00059, 0],
      [-0.00064, 0],
      [-0.00037, 3],
      [0.00222, 1],
      [-0.00042, 3],
      [-0.00067, 0],
      [-0.00035, 3],
      [-0.00051, 0],
      [-0.00072, 0],
      [-0.00035, 3],
      [-0.00043, 3],
      [-0.00037, 3],
      [-0.00075, 0],
      [-0.00035, 3],
      [-0.00033, 3],
      [-0.00047, 3],
      [-0.00064, 0],
      [-0.0004, 3],
      [-0.00061, 0],
      [-0.0003, 3],
      [0.00203, 1],
      [-0.00063, 0]
    ],
    "red_o_points": [],
    "y_categories": ["N", "NOT APPLICABLE", "Y", "nan"],
    "blue_o_points": [],
    "blue_x_points": [
      [0.00245, 1],
      [-0.00013, 3],
      [0.0022, 1],
      [-0.00076, 0],
      [-0.00017, 3],
      [0.00202, 1],
      [0.00167, 1]
    ]
  },
  "QS_mulGraftNerve[TD]": {
    "red_x_points": [
      [-0.00012, 2],
      [-0.00026, 0],
      [-0.00011, 0],
      [-0.00027, 0],
      [-0.00014, 0],
      [-0.00017, 0],
      [-0.00023, 0],
      [-8e-5, 2],
      [-0.00025, 0],
      [-0.00014, 0],
      [-0.00027, 0],
      [-0.00018, 2],
      [0.00014, 1],
      [-0.00013, 2],
      [-0.00023, 0],
      [-0.00015, 2],
      [-0.00014, 0],
      [-0.00012, 0],
      [-0.00014, 2],
      [-0.00018, 2],
      [-3e-5, 2],
      [-0.00014, 0],
      [-0.00016, 2],
      [-7e-5, 2],
      [-0.00012, 2],
      [-0.0002, 0],
      [-0.00017, 2],
      [-0.00019, 0],
      [5e-5, 2],
      [0.0004, 1],
      [-9e-5, 0]
    ],
    "red_o_points": [],
    "y_categories": ["N", "NOT APPLICABLE", "nan"],
    "blue_o_points": [],
    "blue_x_points": [
      [0.0008, 1],
      [5e-5, 2],
      [0.0004, 1],
      [4e-5, 0],
      [1e-5, 2],
      [0.00046, 1],
      [0.00043, 1]
    ]
  },
  "QS_mulLysisRoot[C7]": {
    "red_x_points": [
      [-0.00038, 3],
      [-0.00044, 0],
      [-0.00135, 2],
      [-0.0006, 0],
      [-0.00055, 0],
      [-0.00048, 0],
      [-0.00052, 0],
      [-0.00037, 3],
      [-0.00049, 0],
      [-0.00056, 0],
      [-0.00059, 0],
      [-0.00037, 3],
      [0.00203, 1],
      [-0.00028, 3],
      [-0.0006, 0],
      [-0.00025, 3],
      [-0.00054, 0],
      [-0.00062, 0],
      [-0.00035, 3],
      [-0.00034, 3],
      [-0.00032, 3],
      [-0.00055, 0],
      [-0.00035, 3],
      [-0.0003, 3],
      [-0.00032, 3],
      [-0.00051, 0],
      [-0.00034, 3],
      [-0.00059, 0],
      [-0.00038, 3],
      [0.00164, 1],
      [-0.00048, 0]
    ],
    "red_o_points": [],
    "y_categories": ["N", "NOT APPLICABLE", "Y", "nan"],
    "blue_o_points": [],
    "blue_x_points": [
      [0.00195, 1],
      [-0.00013, 3],
      [0.00225, 1],
      [-0.00073, 0],
      [-0.00029, 3],
      [0.00205, 1],
      [0.00213, 1]
    ]
  },
  "QS_mulTransfSite[IMc]": {
    "red_x_points": [
      [-0.00177, 3],
      [-0.00704, 2],
      [-0.00426, 0],
      [-0.0043, 0],
      [-0.00424, 0],
      [-0.00447, 0],
      [-0.00433, 0],
      [-0.00206, 3],
      [-0.00404, 0],
      [-0.00425, 0],
      [-0.00447, 0],
      [-0.00262, 3],
      [0.01119, 1],
      [-0.00194, 3],
      [-0.00416, 0],
      [-0.002, 3],
      [-0.00701, 2],
      [-0.00403, 0],
      [-0.00232, 3],
      [-0.00197, 3],
      [-0.00171, 3],
      [-0.00418, 0],
      [-0.00181, 3],
      [-0.00227, 3],
      [-0.002, 3],
      [-0.00427, 0],
      [-0.00183, 3],
      [-0.00675, 2],
      [-0.00174, 3],
      [0.01112, 1],
      [-0.00652, 2]
    ],
    "red_o_points": [],
    "y_categories": ["N", "NOT APPLICABLE", "Y", "nan"],
    "blue_o_points": [],
    "blue_x_points": [
      [0.0155, 1],
      [-0.0006, 3],
      [0.01223, 1],
      [-0.00153, 0],
      [-0.00073, 3],
      [0.01289, 1],
      [0.01447, 1]
    ]
  },
  "QA_lstPexTouch[T1]": {
    "red_x_points": [
      [-0.00122, 1],
      [-0.00018, 2],
      [0.00036, 1],
      [-0.00024, 2],
      [-0.0015, 0],
      [0.00048, 1],
      [0.00083, 1],
      [-0.00185, 1],
      [-0.00184, 0],
      [-0.00135, 0],
      [-0.00165, 0],
      [-0.00281, 0],
      [-0.00784, 2],
      [0.00322, 2],
      [-0.0004, 2],
      [-0.0015, 1],
      [-0.00016, 2],
      [0.00071, 1],
      [-0.00244, 0],
      [-0.00153, 1],
      [-0.00293, 0],
      [-0.00022, 2],
      [0.00224, 2],
      [-0.00131, 1],
      [-0.00352, 0],
      [0.00084, 1],
      [-0.00364, 0],
      [-0.00044, 2],
      [-0.00336, 0],
      [0.00083, 1],
      [0.00045, 1]
    ],
    "red_o_points": [],
    "y_categories": ["NORM", "NPV", "nan"],
    "blue_o_points": [],
    "blue_x_points": [
      [0.00099, 1],
      [0.00448, 2],
      [0.00081, 1],
      [0.0023, 1],
      [0.00512, 2],
      [0.0006, 1],
      [0.00394, 0]
    ]
  },
  "QS_mulTransfSite[AcMc]": {
    "red_x_points": [
      [-0.0007, 3],
      [-0.00091, 0],
      [-0.00086, 0],
      [-0.00111, 0],
      [-0.00097, 0],
      [-0.00103, 0],
      [-0.0012, 0],
      [-0.00062, 3],
      [-0.00087, 0],
      [-0.00086, 0],
      [-0.00231, 2],
      [-0.00081, 3],
      [0.00329, 1],
      [-0.00064, 3],
      [-0.00113, 0],
      [-0.00064, 3],
      [-0.00102, 0],
      [-0.00113, 0],
      [-0.00072, 3],
      [-0.00072, 3],
      [-0.0007, 3],
      [-0.00091, 0],
      [-0.00063, 3],
      [-0.00061, 3],
      [-0.00066, 3],
      [-0.00104, 0],
      [-0.00064, 3],
      [-0.00125, 0],
      [-0.00069, 3],
      [0.00342, 1],
      [-0.00108, 0]
    ],
    "red_o_points": [],
    "y_categories": ["N", "NOT APPLICABLE", "Y", "nan"],
    "blue_o_points": [],
    "blue_x_points": [
      [0.00279, 1],
      [-0.00032, 3],
      [0.00334, 1],
      [-0.00106, 0],
      [-0.00041, 3],
      [0.00313, 1],
      [0.00401, 1]
    ]
  },
  "QS_mulTransfSite[Other]": {
    "red_x_points": [
      [-0.00057, 3],
      [-0.0013, 0],
      [-0.00095, 0],
      [-0.00115, 0],
      [-0.00108, 0],
      [-0.00111, 0],
      [-0.00114, 0],
      [-0.00054, 3],
      [-0.00113, 0],
      [-0.00117, 0],
      [-0.00107, 0],
      [-0.00055, 3],
      [0.00264, 1],
      [-0.00043, 3],
      [-0.00116, 0],
      [-0.00065, 3],
      [-0.00097, 0],
      [-0.00313, 2],
      [-0.0005, 3],
      [-0.00049, 3],
      [-0.00056, 3],
      [-0.00106, 0],
      [-0.00059, 3],
      [-0.00051, 3],
      [-0.00061, 3],
      [-0.00106, 0],
      [-0.00049, 3],
      [-0.00115, 0],
      [-0.00042, 3],
      [0.00312, 1],
      [-0.00109, 0]
    ],
    "red_o_points": [],
    "y_categories": ["N", "NOT APPLICABLE", "Y", "nan"],
    "blue_o_points": [],
    "blue_x_points": [
      [0.00466, 1],
      [-0.00011, 3],
      [0.00335, 1],
      [-0.00069, 0],
      [-0.00027, 3],
      [0.00302, 1],
      [0.00422, 1]
    ]
  },
  "QA_yonInjBpsurg": {
    "red_x_points": [
      [-0.00369, 1],
      [-0.00316, 1],
      [-0.00356, 1],
      [-0.00336, 1],
      [-0.00381, 1],
      [-0.00335, 1],
      [-0.0037, 1],
      [-0.00322, 1],
      [-0.00381, 1],
      [-0.00348, 1],
      [-0.00323, 1],
      [-0.00318, 1],
      [0.0077, 0],
      [-0.00358, 1],
      [-0.00341, 1],
      [-0.00335, 1],
      [-0.00261, 1],
      [-0.00393, 1],
      [-0.00329, 1],
      [-0.00345, 1],
      [-0.00284, 1],
      [-0.00316, 1],
      [-0.00362, 1],
      [-0.00387, 1],
      [-0.00349, 1],
      [-0.00299, 1],
      [-0.003, 1],
      [-0.0033, 1],
      [-0.00298, 1],
      [0.00943, 0],
      [-0.00277, 1]
    ],
    "red_o_points": [],
    "y_categories": ["N", "Y", "nan"],
    "blue_o_points": [],
    "blue_x_points": [
      [0.01787, 0],
      [-0.00097, 1],
      [0.0118, 0],
      [-0.00289, 1],
      [-0.00077, 1],
      [0.01134, 0],
      [0.01363, 0]
    ]
  },
  "QA_equInjTbpiAge": {
    "red_x_points": [
      [-0.0008, 1],
      [-0.00022, 1],
      [-6e-5, 1],
      [-8e-5, 0],
      [-0.00059, 0],
      [6e-5, 1],
      [0.0001, 1],
      [0.00057, 0],
      [-0.0005, 0],
      [-0.00014, 0],
      [2e-5, 1],
      [0.00058, 0],
      [-0.01573, 1],
      [-0.00126, 1],
      [-0.00034, 1],
      [-0.00109, 1],
      [0.0002, 0],
      [-0.00094, 0],
      [-0.00093, 1],
      [0.00097, 0],
      [-0.00068, 1],
      [-2e-5, 1],
      [-0.00113, 1],
      [-0.00316, 1],
      [0.00079, 0],
      [8e-5, 1],
      [-0.00151, 1],
      [-7e-5, 1],
      [-0.00093, 1],
      [-0.01166, 1],
      [-7e-5, 0]
    ],
    "red_o_points": [],
    "y_categories": ["GREATER THAN OR EQUALS TO 30", "LESS THAN 30", "nan"],
    "blue_o_points": [],
    "blue_x_points": [
      [-0.00363, 1],
      [-0.00098, 1],
      [0.00653, 0],
      [0.00013, 1],
      [0.00558, 0],
      [0.00813, 0],
      [0.00738, 0]
    ]
  },
  "QS_mulLysisNerve[Ssr]": {
    "red_x_points": [
      [-0.00039, 3],
      [-0.00058, 0],
      [-0.00131, 2],
      [-0.00053, 0],
      [-0.00049, 0],
      [-0.00046, 0],
      [-0.00045, 0],
      [-0.00037, 3],
      [-0.00038, 0],
      [-0.00056, 0],
      [-0.0004, 0],
      [-0.00024, 3],
      [0.00156, 1],
      [-0.00033, 3],
      [-0.00049, 0],
      [-0.00032, 3],
      [-0.0005, 0],
      [-0.00045, 0],
      [-0.00031, 3],
      [-0.0003, 3],
      [-0.00032, 3],
      [-0.00038, 0],
      [-0.00028, 3],
      [-0.00025, 3],
      [-0.00034, 3],
      [-0.00045, 0],
      [-0.00022, 3],
      [-0.0005, 0],
      [-0.00028, 3],
      [0.00171, 1],
      [-0.0005, 0]
    ],
    "red_o_points": [],
    "y_categories": ["N", "NOT APPLICABLE", "Y", "nan"],
    "blue_o_points": [],
    "blue_x_points": [
      [0.00168, 1],
      [-0.00028, 3],
      [0.00148, 1],
      [-0.00043, 0],
      [-0.00012, 3],
      [0.00148, 1],
      [0.0013, 1]
    ]
  },
  "QS_mulBpsurgeryType[Graft]": {
    "red_x_points": [
      [-0.00022, 3],
      [-0.00047, 0],
      [-0.00037, 0],
      [-0.00048, 0],
      [-0.00041, 0],
      [-0.00054, 0],
      [-0.00059, 0],
      [-0.00028, 3],
      [-0.00049, 0],
      [-0.00043, 0],
      [-0.00032, 0],
      [-0.00023, 3],
      [0.00169, 1],
      [-0.00027, 3],
      [-0.0016, 2],
      [-0.00031, 3],
      [-0.00052, 0],
      [-0.00047, 0],
      [-0.0002, 3],
      [-0.00024, 3],
      [-0.00022, 3],
      [-0.00049, 0],
      [-0.00033, 3],
      [-0.0003, 3],
      [-0.00028, 3],
      [-0.0005, 0],
      [-0.00025, 3],
      [-0.00052, 0],
      [-0.00016, 3],
      [0.00143, 1],
      [-0.00042, 0]
    ],
    "red_o_points": [],
    "y_categories": ["N", "NOT APPLICABLE", "Y", "nan"],
    "blue_o_points": [],
    "blue_x_points": [
      [0.00156, 1],
      [-0.00013, 3],
      [0.00166, 1],
      [-0.00032, 0],
      [-0.00017, 3],
      [0.00179, 1],
      [0.00191, 1]
    ]
  },
  "QA_lstPexMuscstrength[WristExte]": {
    "red_x_points": [
      [-0.00365, 1],
      [-0.00045, 2],
      [-0.00144, 1],
      [-0.00155, 1],
      [0.00049, 0],
      [-0.00186, 1],
      [-0.00198, 1],
      [-0.00214, 0],
      [0.00111, 0],
      [0.00053, 0],
      [-0.00197, 1],
      [-0.00146, 0],
      [-0.00151, 2],
      [0.00153, 2],
      [-0.00015, 2],
      [-0.00137, 0],
      [-1e-5, 2],
      [0.00042, 0],
      [-0.00114, 0],
      [-0.00267, 1],
      [-0.00169, 0],
      [-0.00183, 1],
      [0.00218, 2],
      [-0.00141, 0],
      [-0.00357, 1],
      [0.0009, 0],
      [-0.00259, 1],
      [0.00059, 0],
      [0.00168, 2],
      [-0.0015, 2],
      [-0.00142, 1]
    ],
    "red_o_points": [],
    "y_categories": ["GREATER THAN OR EQUALS TO 3", "LESS THAN 3", "nan"],
    "blue_o_points": [],
    "blue_x_points": [
      [0.00099, 0],
      [0.00394, 2],
      [0.00068, 0],
      [0.00303, 0],
      [0.00489, 2],
      [0.00084, 1],
      [0.00089, 0]
    ]
  },
  "QS_mulLysisRoot[C6]": {
    "red_x_points": [
      [-0.00127, 3],
      [-0.00212, 0],
      [-0.0036, 2],
      [-0.00191, 0],
      [-0.00255, 0],
      [-0.00199, 0],
      [-0.00197, 0],
      [-0.00131, 3],
      [-0.00201, 0],
      [-0.00208, 0],
      [-0.00203, 0],
      [-0.00135, 3],
      [0.00481, 1],
      [-0.00108, 3],
      [-0.00197, 0],
      [-0.00153, 3],
      [-0.0019, 0],
      [-0.00178, 0],
      [-0.00134, 3],
      [-0.00121, 3],
      [-0.00127, 3],
      [-0.00194, 0],
      [-0.00138, 3],
      [-0.00119, 3],
      [-0.00138, 3],
      [-0.00192, 0],
      [-0.00115, 3],
      [-0.00226, 0],
      [-0.00122, 3],
      [0.00604, 1],
      [-0.00305, 2]
    ],
    "red_o_points": [],
    "y_categories": ["N", "NOT APPLICABLE", "Y", "nan"],
    "blue_o_points": [],
    "blue_x_points": [
      [0.00802, 1],
      [-0.00038, 3],
      [0.0064, 1],
      [-0.00124, 0],
      [-0.00044, 3],
      [0.00703, 1],
      [0.00685, 1]
    ]
  },
  "QA_lstPexPalle[Clavicle]": {
    "red_x_points": [
      [0.00016, 3],
      [1e-5, 3],
      [1e-5, 3],
      [-0.00035, 2],
      [-5e-5, 2],
      [1e-5, 3],
      [1e-5, 3],
      [-5e-5, 2],
      [-5e-5, 2],
      [-0.00011, 0],
      [0.00086, 3],
      [1e-5, 3],
      [1e-5, 3],
      [1e-5, 3],
      [3e-5, 0],
      [-8e-5, 0],
      [-0.00011, 0],
      [-0.0001, 2],
      [-5e-5, 1],
      [1e-5, 3],
      [-0.00311, 2],
      [1e-5, 3],
      [1e-5, 3],
      [1e-5, 3],
      [-0.01565, 2],
      [3e-5, 0]
    ],
    "red_o_points": [],
    "y_categories": ["HYPO", "NAIA", "PT", "nan"],
    "blue_o_points": [],
    "blue_x_points": [
      [0.00151, 3],
      [0.00048, 3],
      [0.00704, 0],
      [0.00023, 3],
      [0.00026, 3],
      [0.00163, 3],
      [0.00145, 3]
    ]
  },
  "QS_mulGraftNerve[LT]": {
    "red_x_points": [
      [-2e-5, 2],
      [-0.00013, 0],
      [-8e-5, 0],
      [-0.00014, 0],
      [-0.00017, 0],
      [-9e-5, 0],
      [-0.00017, 0],
      [-3e-5, 2],
      [-0.00013, 0],
      [-0.00013, 0],
      [-0.00017, 0],
      [-2e-5, 2],
      [0.00037, 1],
      [-2e-5, 2],
      [-0.00013, 0],
      [-2e-5, 2],
      [-8e-5, 0],
      [-8e-5, 0],
      [-3e-5, 2],
      [-3e-5, 2],
      [-1e-5, 2],
      [-8e-5, 0],
      [-2e-5, 2],
      [-3e-5, 2],
      [-2e-5, 2],
      [-0.00013, 0],
      [-3e-5, 2],
      [-0.00013, 0],
      [-1e-5, 2],
      [0.00037, 1],
      [-0.00017, 0]
    ],
    "red_o_points": [],
    "y_categories": ["N", "NOT APPLICABLE", "nan"],
    "blue_o_points": [],
    "blue_x_points": [
      [0.00028, 1],
      [-2e-5, 2],
      [0.00028, 1],
      [-3e-5, 0],
      [-3e-5, 2],
      [0.00037, 1],
      [0.00028, 1]
    ]
  },
  "QS_mulLysisRoot[C5]": {
    "red_x_points": [
      [-0.00091, 3],
      [-0.00185, 0],
      [-0.0035, 2],
      [-0.00205, 0],
      [-0.0021, 0],
      [-0.00202, 0],
      [-0.0019, 0],
      [-0.00112, 3],
      [-0.00223, 0],
      [-0.00189, 0],
      [-0.00203, 0],
      [-0.00131, 3],
      [0.00504, 1],
      [-0.00108, 3],
      [-0.00221, 0],
      [-0.00103, 3],
      [-0.0021, 0],
      [-0.00215, 0],
      [-0.00132, 3],
      [-0.00078, 3],
      [-0.00104, 3],
      [-0.002, 0],
      [-0.00108, 3],
      [-0.00109, 3],
      [-0.00106, 3],
      [-0.00173, 0],
      [-0.00116, 3],
      [-0.00193, 0],
      [-0.00103, 3],
      [0.00475, 1],
      [-0.00324, 2]
    ],
    "red_o_points": [],
    "y_categories": ["N", "NOT APPLICABLE", "Y", "nan"],
    "blue_o_points": [],
    "blue_x_points": [
      [0.00756, 1],
      [-0.00042, 3],
      [0.00671, 1],
      [-0.0016, 0],
      [-0.00015, 3],
      [0.00629, 1],
      [0.00662, 1]
    ]
  },
  "QS_mulNeuromadSite[C4]": {
    "red_x_points": [
      [-0.00067, 2],
      [-0.00209, 0],
      [-0.00227, 0],
      [-0.00215, 0],
      [-0.00251, 0],
      [-0.00201, 0],
      [-0.00198, 0],
      [-0.00079, 2],
      [-0.00213, 0],
      [-0.00203, 0],
      [-0.00222, 0],
      [-0.00103, 2],
      [0.00347, 1],
      [-0.00078, 2],
      [-0.00224, 0],
      [-0.00117, 2],
      [-0.00211, 0],
      [-0.00236, 0],
      [-0.00092, 2],
      [-0.00087, 2],
      [-0.00084, 2],
      [-0.00131, 0],
      [-0.0008, 2],
      [-0.00119, 2],
      [-0.001, 2],
      [-0.0021, 0],
      [-0.00076, 2],
      [-0.00241, 0],
      [-0.00063, 2],
      [0.00438, 1],
      [-0.00191, 0]
    ],
    "red_o_points": [],
    "y_categories": ["N", "NOT APPLICABLE", "nan"],
    "blue_o_points": [],
    "blue_x_points": [
      [0.00843, 1],
      [-9e-5, 2],
      [0.00515, 1],
      [-3e-5, 0],
      [-1e-5, 2],
      [0.00432, 1],
      [0.00586, 1]
    ]
  },
  "QS_lstBpsurgSide": {
    "red_x_points": [
      [-0.00358, 3],
      [-0.00555, 0],
      [-0.00609, 0],
      [-0.00595, 0],
      [-0.0121, 2],
      [-0.00528, 0],
      [-0.00553, 0],
      [-0.00332, 3],
      [-0.00567, 0],
      [-0.01139, 2],
      [-0.01144, 2],
      [-0.00369, 3],
      [0.02047, 1],
      [-0.00372, 3],
      [-0.01277, 2],
      [-0.00351, 3],
      [-0.0109, 2],
      [-0.0123, 2],
      [-0.00367, 3],
      [-0.00372, 3],
      [-0.00332, 3],
      [-0.00522, 0],
      [-0.00373, 3],
      [-0.0039, 3],
      [-0.00378, 3],
      [-0.012, 2],
      [-0.00349, 3],
      [-0.01143, 2],
      [-0.00332, 3],
      [0.02066, 1],
      [-0.00551, 0]
    ],
    "red_o_points": [],
    "y_categories": ["L", "NOT APPLICABLE", "R", "nan"],
    "blue_o_points": [],
    "blue_x_points": [
      [0.02854, 1],
      [-0.00129, 3],
      [0.01935, 1],
      [0.00105, 0],
      [-0.00156, 3],
      [0.02111, 1],
      [0.02431, 1]
    ]
  },
  "QS_mulGraftNerve[IS]": {
    "red_x_points": [
      [-7e-5, 2],
      [-0.0003, 0],
      [-0.00031, 0],
      [-0.00022, 0],
      [-0.00029, 0],
      [-0.00028, 0],
      [-0.0003, 0],
      [-8e-5, 2],
      [-0.00036, 0],
      [-0.00024, 0],
      [-0.00023, 0],
      [-6e-5, 2],
      [0.00043, 1],
      [-8e-5, 2],
      [-0.00022, 0],
      [-0.0001, 2],
      [-0.00021, 0],
      [-0.00036, 0],
      [-0.0001, 2],
      [-0.00014, 2],
      [-5e-5, 2],
      [-0.00024, 0],
      [-0.00012, 2],
      [-0.00019, 2],
      [-0.00012, 2],
      [-0.0003, 0],
      [-8e-5, 2],
      [-0.00028, 0],
      [-8e-5, 2],
      [0.0008, 1],
      [-0.00031, 0]
    ],
    "red_o_points": [],
    "y_categories": ["N", "NOT APPLICABLE", "nan"],
    "blue_o_points": [],
    "blue_x_points": [
      [0.0014, 1],
      [-1e-5, 2],
      [0.00026, 1],
      [1e-5, 0],
      [1e-5, 2],
      [0.00077, 1],
      [0.00086, 1]
    ]
  },
  "QS_mulGraftNerve[MC]": {
    "red_x_points": [
      [-0.00013, 2],
      [-0.00028, 0],
      [-0.00038, 0],
      [-0.00024, 0],
      [-0.00017, 0],
      [-0.00015, 0],
      [-0.0003, 0],
      [-0.0001, 2],
      [-0.00024, 0],
      [-0.00023, 0],
      [-0.00023, 0],
      [-0.00014, 2],
      [0.00048, 1],
      [-9e-5, 2],
      [-0.00034, 0],
      [-0.00013, 2],
      [-0.00027, 0],
      [-0.00018, 0],
      [-0.00022, 2],
      [-0.00011, 2],
      [-0.00018, 2],
      [-0.00026, 0],
      [-0.00011, 2],
      [-4e-5, 2],
      [-0.00018, 2],
      [-0.00024, 0],
      [-5e-5, 2],
      [-0.00036, 0],
      [-0.00012, 2],
      [0.00059, 1],
      [-0.0002, 0]
    ],
    "red_o_points": [],
    "y_categories": ["N", "NOT APPLICABLE", "nan"],
    "blue_o_points": [],
    "blue_x_points": [
      [0.0012, 1],
      [3e-5, 2],
      [0.00078, 1],
      [-6e-5, 0],
      [-1e-5, 2],
      [0.00069, 1],
      [0.0005, 1]
    ]
  },
  "QS_mulGraftRoot[C8]": {
    "red_x_points": [
      [-3e-5, 2],
      [-5e-5, 0],
      [-5e-5, 0],
      [-5e-5, 0],
      [-5e-5, 0],
      [-3e-5, 0],
      [-3e-5, 0],
      [-4e-5, 2],
      [-5e-5, 0],
      [-3e-5, 0],
      [-1e-5, 2],
      [0.0002, 1],
      [-3e-5, 2],
      [-5e-5, 0],
      [-4e-5, 2],
      [-5e-5, 0],
      [-5e-5, 0],
      [-3e-5, 2],
      [-4e-5, 2],
      [-3e-5, 2],
      [-3e-5, 0],
      [-1e-5, 2],
      [-4e-5, 2],
      [-4e-5, 2],
      [-3e-5, 2],
      [-5e-5, 0],
      [-4e-5, 2],
      [9e-5, 1],
      [-5e-5, 0]
    ],
    "red_o_points": [],
    "y_categories": ["N", "NOT APPLICABLE", "nan"],
    "blue_o_points": [],
    "blue_x_points": [
      [0.00011, 1],
      [-4e-5, 2],
      [-5e-5, 0],
      [-1e-5, 2],
      [0.0002, 1],
      [0.0002, 1]
    ]
  },
  "QA_yonPreOrtsurg": {
    "red_x_points": [
      [-0.00421, 0],
      [-0.00021, 2],
      [-4e-5, 0],
      [-8e-5, 0],
      [-9e-5, 0],
      [-4e-5, 0],
      [-2e-5, 0],
      [-0.00043, 2],
      [-4e-5, 0],
      [-6e-5, 0],
      [-0.00018, 2],
      [0.00705, 1],
      [-0.00105, 0],
      [-0.00138, 2],
      [-0.00042, 0],
      [-0.00426, 0],
      [0.0001, 1],
      [-9e-5, 0],
      [-0.00401, 0],
      [-0.00344, 0],
      [-0.00432, 0],
      [-0.00011, 0],
      [-0.00455, 0],
      [-0.00514, 0],
      [-0.00434, 0],
      [-0.00014, 2],
      [-0.00055, 2],
      [-0.00012, 0],
      [-0.00094, 2],
      [-0.00052, 2],
      [0.00012, 1]
    ],
    "red_o_points": [],
    "y_categories": ["N", "Y", "nan"],
    "blue_o_points": [],
    "blue_x_points": [
      [-0.00019, 0],
      [0.00184, 2],
      [-0.00021, 0],
      [-4e-5, 0],
      [0.01776, 1],
      [-0.00022, 0],
      [-0.00011, 0]
    ]
  },
  "QS_mulGraftNerve[Ra]": {
    "red_x_points": [
      [-0.00037, 2],
      [-0.00055, 0],
      [-0.00056, 0],
      [-0.0006, 0],
      [-0.00069, 0],
      [-0.00078, 0],
      [-0.00067, 0],
      [-0.00044, 2],
      [-0.00072, 0],
      [-0.00058, 0],
      [-0.00068, 0],
      [-0.00035, 2],
      [0.00123, 1],
      [-0.00028, 2],
      [-0.00056, 0],
      [-0.00039, 2],
      [-0.00069, 0],
      [-0.00073, 0],
      [-0.0004, 2],
      [-0.00031, 2],
      [-0.0003, 2],
      [-0.00052, 0],
      [-0.00034, 2],
      [-0.00016, 2],
      [-0.00037, 2],
      [-0.00067, 0],
      [-0.0003, 2],
      [-0.00082, 0],
      [-0.00022, 2],
      [0.00154, 1],
      [-0.00064, 0]
    ],
    "red_o_points": [],
    "y_categories": ["N", "NOT APPLICABLE", "nan"],
    "blue_o_points": [],
    "blue_x_points": [
      [0.00246, 1],
      [-1e-5, 2],
      [0.00157, 1],
      [-0.00013, 0],
      [-0.00016, 2],
      [0.00135, 1],
      [0.00161, 1]
    ]
  },
  "QS_mulTransfSite[Oberlin]": {
    "red_x_points": [
      [-0.00359, 3],
      [-0.01049, 0],
      [-0.0104, 0],
      [-0.00984, 0],
      [-0.00534, 2],
      [-0.00492, 2],
      [-0.00971, 0],
      [-0.00357, 3],
      [-0.0051, 2],
      [-0.00541, 2],
      [-0.00476, 2],
      [-0.00342, 3],
      [0.01704, 1],
      [-0.00354, 3],
      [-0.00514, 2],
      [-0.00339, 3],
      [-0.01044, 0],
      [-0.00537, 2],
      [-0.00333, 3],
      [-0.00328, 3],
      [-0.00304, 3],
      [-0.01008, 0],
      [-0.00338, 3],
      [-0.00354, 3],
      [-0.00353, 3],
      [-0.00501, 2],
      [-0.00365, 3],
      [-0.01005, 0],
      [-0.00336, 3],
      [0.01915, 1],
      [-0.00992, 0]
    ],
    "red_o_points": [],
    "y_categories": ["N", "NOT APPLICABLE", "Y", "nan"],
    "blue_o_points": [],
    "blue_x_points": [
      [0.02534, 1],
      [-0.00125, 3],
      [0.01953, 1],
      [0.00014, 2],
      [-0.00146, 3],
      [0.01864, 1],
      [0.0212, 1]
    ]
  },
  "QS_mulGraftNerve[Ssr]": {
    "red_x_points": [
      [-1e-5, 2],
      [-0.00014, 0],
      [-0.00014, 0],
      [-9e-5, 0],
      [-0.00014, 0],
      [-9e-5, 0],
      [-9e-5, 0],
      [-0.00014, 0],
      [-5e-5, 0],
      [-0.00014, 0],
      [-4e-5, 2],
      [-5e-5, 1],
      [-8e-5, 2],
      [-0.00011, 0],
      [-8e-5, 2],
      [-0.00014, 0],
      [-9e-5, 0],
      [-8e-5, 2],
      [-8e-5, 2],
      [-8e-5, 2],
      [-9e-5, 0],
      [-8e-5, 2],
      [-8e-5, 2],
      [-8e-5, 2],
      [-0.00014, 0],
      [-5e-5, 2],
      [-0.00014, 0],
      [-8e-5, 2],
      [0.00022, 1],
      [-5e-5, 0]
    ],
    "red_o_points": [],
    "y_categories": ["N", "NOT APPLICABLE", "nan"],
    "blue_o_points": [],
    "blue_x_points": [
      [0.00038, 1],
      [5e-5, 2],
      [0.00038, 1],
      [-2e-5, 0],
      [1e-5, 2],
      [0.00028, 1]
    ]
  },
  "QA_lstPexKine[Index]": {
    "red_x_points": [
      [-0.00065, 0],
      [-0.00037, 2],
      [-0.0007, 2],
      [-0.00055, 2],
      [0.00012, 1],
      [0.00061, 1],
      [-0.00136, 0],
      [0.00011, 2],
      [0.00038, 1],
      [0.00017, 1],
      [0.00022, 1],
      [-0.00017, 1],
      [-5e-5, 2],
      [0.0001, 2],
      [0.00028, 1],
      [0.00021, 2],
      [-0.00025, 2],
      [0.0004, 1],
      [-0.00031, 1],
      [-0.00063, 0],
      [-0.00034, 1],
      [-0.00057, 2],
      [-2e-5, 2],
      [-6e-5, 1],
      [0.00015, 2],
      [-0.00032, 2],
      [-0.0002, 1],
      [-0.00019, 2],
      [-0.00018, 1],
      [-0.00015, 2],
      [-0.00067, 0]
    ],
    "red_o_points": [],
    "y_categories": ["NPV", "PV", "nan"],
    "blue_o_points": [],
    "blue_x_points": [
      [0.00017, 1],
      [0.00053, 2],
      [4e-5, 1],
      [0.00148, 1],
      [0.00041, 2],
      [0.00014, 1],
      [1e-5, 2]
    ]
  }
}
