{
  "QA_lstPexMuscstrength[ElbowFlex]": {
    "red_x_points": [
      [-0.00895, 1],
      [0.00029, 2],
      [-0.00786, 1],
      [-0.0077, 1],
      [-0.00785, 1],
      [-0.0084, 1],
      [-0.00783, 1],
      [-0.00757, 1],
      [-0.00769, 1],
      [-0.00821, 1],
      [-0.00818, 1],
      [-0.00828, 1],
      [-0.00026, 2],
      [-0.00091, 2],
      [0.00093, 2],
      [-0.00799, 1],
      [-0.0084, 1],
      [-0.00807, 1],
      [-0.00768, 1],
      [-0.00805, 1],
      [-0.00027, 2],
      [-0.00789, 1],
      [-0.00838, 1],
      [-0.00816, 1],
      [-0.00752, 1],
      [0.00063, 2],
      [-0.00712, 1],
      [-0.00844, 1],
      [0.00016, 2]
    ],
    "red_o_points": [],
    "y_categories": ["GREATER THAN OR EQUALS TO 3", "LESS THAN 3", "nan"],
    "blue_o_points": [],
    "blue_x_points": [
      [0.00133, 2],
      [-0.00784, 1],
      [0.03804, 0],
      [-0.00771, 1],
      [0.00266, 2],
      [0.00188, 2],
      [0.02943, 0],
      [-0.00711, 1],
      [-0.00743, 1],
      [0.00142, 2],
      [0.0388, 0],
      [0.03141, 0],
      [0.03665, 0],
      [0.03156, 0],
      [-0.00745, 1]
    ]
  },
  "QS_mulGraftNerve[other]": {
    "red_x_points": [
      [-0.0, 2],
      [-0.00042, 0],
      [-0.00034, 0],
      [-0.00038, 0],
      [-0.00035, 0],
      [-0.00029, 0],
      [-0.00037, 0],
      [-6e-5, 2],
      [-0.00041, 0],
      [-0.00039, 0],
      [0.0, 2],
      [-0.0004, 0],
      [-7e-5, 2],
      [-0.0004, 0],
      [-0.00027, 0],
      [-3e-5, 2],
      [-3e-5, 2],
      [-4e-5, 2],
      [-0.00039, 0],
      [-3e-5, 2],
      [-0.0001, 2],
      [-5e-5, 2],
      [-0.00036, 0],
      [-0.00038, 0],
      [-5e-5, 2],
      [0.00063, 1],
      [-5e-5, 2],
      [-0.00027, 0],
      [-4e-5, 2]
    ],
    "red_o_points": [],
    "y_categories": ["N", "NOT APPLICABLE", "nan"],
    "blue_o_points": [],
    "blue_x_points": [
      [0.00205, 1],
      [-4e-5, 2],
      [-0.00024, 0],
      [-0.00035, 0],
      [-5e-5, 2],
      [0.00124, 1],
      [0.00099, 1],
      [-0.00021, 0],
      [-3e-5, 2],
      [-3e-5, 2],
      [-0.00024, 0],
      [0.00104, 1],
      [1e-5, 2],
      [0.00121, 1],
      [-2e-5, 2]
    ]
  },
  "QS_mulLysisTrunk[Upper]": {
    "red_x_points": [
      [-0.00099, 3],
      [-0.00443, 0],
      [-0.00344, 0],
      [-0.00361, 0],
      [-0.00357, 0],
      [-0.0142, 2],
      [-0.00349, 0],
      [-0.00086, 3],
      [-0.00336, 0],
      [-0.00353, 0],
      [-0.00087, 3],
      [-0.00378, 0],
      [-0.00099, 3],
      [-0.00455, 0],
      [-0.01256, 2],
      [-0.00103, 3],
      [-0.00074, 3],
      [-0.00097, 3],
      [-0.0035, 0],
      [-0.00088, 3],
      [-0.00076, 3],
      [-0.00081, 3],
      [-0.00408, 0],
      [-0.00393, 0],
      [-0.00105, 3],
      [0.01463, 1],
      [-0.00085, 3],
      [-0.01377, 2],
      [-0.00072, 3]
    ],
    "red_o_points": [],
    "y_categories": ["N", "NOT APPLICABLE", "Y", "nan"],
    "blue_o_points": [],
    "blue_x_points": [
      [0.02366, 1],
      [-0.00029, 3],
      [-0.00154, 0],
      [-0.00201, 0],
      [-0.00024, 3],
      [0.01969, 1],
      [0.01561, 1],
      [-0.00258, 0],
      [-0.00057, 3],
      [-0.0003, 3],
      [-0.00182, 0],
      [0.01656, 1],
      [-0.00062, 3],
      [0.01777, 1],
      [-0.00065, 3]
    ]
  },
  "QS_mulBpsurgeryType[Transf]": {
    "red_x_points": [
      [-8e-5, 3],
      [-0.00129, 2],
      [-0.00406, 0],
      [-0.00114, 2],
      [-0.00125, 2],
      [-0.00109, 2],
      [-0.00129, 2],
      [-0.00014, 3],
      [-0.00135, 2],
      [-0.00107, 2],
      [-0.00014, 3],
      [-0.00109, 2],
      [-0.00016, 3],
      [-0.00143, 2],
      [-0.00115, 2],
      [-0.00015, 3],
      [-9e-5, 3],
      [-0.00015, 3],
      [-0.00105, 2],
      [-0.00012, 3],
      [-0.00022, 3],
      [-0.00011, 3],
      [-0.00115, 2],
      [-0.00122, 2],
      [-0.00026, 3],
      [0.0029, 1],
      [-0.00024, 3],
      [-0.00111, 2],
      [-0.00014, 3]
    ],
    "red_o_points": [],
    "y_categories": ["N", "NOT APPLICABLE", "Y", "nan"],
    "blue_o_points": [],
    "blue_x_points": [
      [0.00518, 1],
      [-0.00017, 3],
      [-0.00077, 2],
      [-0.00079, 2],
      [-3e-5, 3],
      [0.00442, 1],
      [0.00421, 1],
      [-0.0007, 2],
      [6e-5, 3],
      [-9e-5, 3],
      [-0.00071, 2],
      [0.00483, 1],
      [-0.0, 3],
      [0.00449, 1],
      [-0.00011, 3]
    ]
  },
  "QS_mulNeuromadSite[T2]": {
    "red_x_points": [
      [-8e-5, 2],
      [-0.00091, 0],
      [-0.0007, 0],
      [-0.00078, 0],
      [-0.00083, 0],
      [-0.0008, 0],
      [-0.00075, 0],
      [-0.00018, 2],
      [-0.0008, 0],
      [-0.00067, 0],
      [-4e-5, 2],
      [-0.00091, 0],
      [-0.00018, 2],
      [-0.00105, 0],
      [-0.00096, 0],
      [-0.00016, 2],
      [-3e-5, 2],
      [-3e-5, 2],
      [-0.00063, 0],
      [-3e-5, 2],
      [-0.00016, 2],
      [-0.00012, 2],
      [-0.00093, 0],
      [-0.00091, 0],
      [-0.00012, 2],
      [0.00194, 1],
      [-0.00014, 2],
      [-0.00078, 0],
      [-0.00022, 2]
    ],
    "red_o_points": [],
    "y_categories": ["N", "NOT APPLICABLE", "nan"],
    "blue_o_points": [],
    "blue_x_points": [
      [0.00385, 1],
      [-0.0001, 2],
      [-0.00053, 0],
      [-0.00042, 0],
      [-0.0, 2],
      [0.00373, 1],
      [0.00156, 1],
      [-0.00074, 0],
      [-0.0, 2],
      [-7e-5, 2],
      [-0.00048, 0],
      [0.00264, 1],
      [-0.0, 2],
      [0.00253, 1],
      [-3e-5, 2]
    ]
  },
  "QA_mulInjOrthesisType[ShoulderSupport]": {
    "red_x_points": [
      [-0.00643, 0],
      [-0.00644, 0],
      [-0.00599, 0],
      [-0.02192, 2],
      [-0.00626, 0],
      [-0.00613, 0],
      [-0.00627, 0],
      [-0.0229, 2],
      [-0.00629, 0],
      [-0.00603, 0],
      [-0.00641, 0],
      [-0.00623, 0],
      [-0.00636, 0],
      [-0.00603, 0],
      [-0.02252, 2],
      [-0.00626, 0],
      [-0.00648, 0],
      [-0.02439, 2],
      [-0.02452, 3],
      [-0.00597, 0],
      [-0.00631, 0],
      [-0.00652, 0],
      [-0.00629, 0],
      [-0.00632, 0],
      [-0.02198, 3],
      [-0.02324, 3],
      [-0.02362, 3],
      [-0.00641, 0],
      [-0.0063, 0]
    ],
    "red_o_points": [],
    "y_categories": ["N", "NOT APPLICABLE", "Y", "nan"],
    "blue_o_points": [],
    "blue_x_points": [
      [-0.00607, 0],
      [-0.00586, 0],
      [-0.0061, 0],
      [-0.00562, 0],
      [0.04587, 1],
      [0.04581, 1],
      [0.04376, 1],
      [0.04562, 1],
      [-0.0058, 0],
      [0.04414, 1],
      [-0.00601, 0],
      [0.04342, 1],
      [0.04613, 1],
      [0.04375, 1],
      [-0.00622, 0]
    ]
  },
  "QS_mulGraftRoot[C6]": {
    "red_x_points": [
      [0.0, 2],
      [-3e-5, 0],
      [-3e-5, 0],
      [-3e-5, 0],
      [-3e-5, 0],
      [-3e-5, 0],
      [0.0, 2],
      [-3e-5, 0],
      [-3e-5, 0],
      [0.0, 2],
      [-3e-5, 0],
      [0.0, 2],
      [0.0, 2],
      [-3e-5, 0],
      [0.0, 2],
      [0.0, 2],
      [0.0, 2],
      [-3e-5, 0],
      [0.0, 2],
      [8e-5, 1],
      [0.0, 2],
      [-3e-5, 0],
      [0.0, 2]
    ],
    "red_o_points": [],
    "y_categories": ["N", "NOT APPLICABLE", "nan"],
    "blue_o_points": [],
    "blue_x_points": [
      [0.0, 2],
      [-3e-5, 0],
      [0.0, 2],
      [8e-5, 1],
      [-3e-5, 0],
      [0.0, 2],
      [0.0, 2],
      [-3e-5, 0],
      [8e-5, 1],
      [0.0, 2],
      [8e-5, 1],
      [0.0, 2]
    ]
  },
  "QS_mulGraftNerve[Ac]": {
    "red_x_points": [
      [2e-5, 2],
      [-0.00029, 0],
      [-0.00024, 0],
      [-0.00016, 0],
      [-0.00024, 0],
      [-0.00017, 0],
      [-0.00017, 0],
      [-3e-5, 2],
      [-0.00027, 0],
      [-0.0002, 0],
      [0.0, 2],
      [-0.00019, 0],
      [6e-5, 2],
      [-0.00035, 0],
      [-0.00034, 0],
      [1e-5, 2],
      [-0.0, 2],
      [1e-5, 2],
      [-0.00012, 0],
      [3e-5, 2],
      [-1e-5, 2],
      [-1e-5, 2],
      [-0.00021, 0],
      [-0.0001, 0],
      [-0.0, 2],
      [0.00049, 1],
      [-3e-5, 2],
      [-0.00017, 0],
      [-9e-5, 2]
    ],
    "red_o_points": [],
    "y_categories": ["N", "NOT APPLICABLE", "nan"],
    "blue_o_points": [],
    "blue_x_points": [
      [0.00074, 1],
      [-0.0, 2],
      [-0.0001, 0],
      [-0.00015, 0],
      [9e-5, 2],
      [0.00081, 1],
      [0.00045, 1],
      [-3e-5, 0],
      [-1e-5, 2],
      [9e-5, 2],
      [-0.00017, 0],
      [0.00045, 1],
      [3e-5, 2],
      [0.00058, 1],
      [1e-5, 2]
    ]
  },
  "QS_mulNeuromadSite[C8]": {
    "red_x_points": [
      [-7e-5, 2],
      [-0.00144, 0],
      [-0.00076, 0],
      [-0.00078, 0],
      [-0.00089, 0],
      [-0.00083, 0],
      [-0.0008, 0],
      [-0.00018, 2],
      [-0.00114, 0],
      [-0.00083, 0],
      [-0.00019, 2],
      [-0.00092, 0],
      [-0.00019, 2],
      [-0.00127, 0],
      [-0.00127, 0],
      [-0.00011, 2],
      [-0.0001, 2],
      [-0.0001, 2],
      [-0.00082, 0],
      [-0.00014, 2],
      [-0.0001, 2],
      [-0.00012, 2],
      [-0.0009, 0],
      [-0.00072, 0],
      [-0.00019, 2],
      [0.00281, 1],
      [-0.00013, 2],
      [-0.00082, 0],
      [-0.00015, 2]
    ],
    "red_o_points": [],
    "y_categories": ["N", "NOT APPLICABLE", "nan"],
    "blue_o_points": [],
    "blue_x_points": [
      [0.00478, 1],
      [-0.00013, 2],
      [-0.00067, 0],
      [-0.00067, 0],
      [3e-5, 2],
      [0.0034, 1],
      [0.00229, 1],
      [-0.00068, 0],
      [1e-5, 2],
      [1e-5, 2],
      [-0.00069, 0],
      [0.00277, 1],
      [-0.0001, 2],
      [0.00282, 1],
      [-4e-5, 2]
    ]
  },
  "QS_mulGraftNerve[Ph]": {
    "red_x_points": [
      [-3e-5, 2],
      [-0.00075, 0],
      [-0.00043, 0],
      [-0.0005, 0],
      [-0.00053, 0],
      [-0.00034, 0],
      [-0.00052, 0],
      [-0.00014, 2],
      [-0.0005, 0],
      [-0.00038, 0],
      [-6e-5, 2],
      [-0.00043, 0],
      [-6e-5, 2],
      [-0.00058, 0],
      [-0.0008, 0],
      [-4e-5, 2],
      [-7e-5, 2],
      [-5e-5, 2],
      [-0.00041, 0],
      [-4e-5, 2],
      [-8e-5, 2],
      [-0.00013, 2],
      [-0.00048, 0],
      [-0.00045, 0],
      [-0.0001, 2],
      [0.00104, 1],
      [-0.0001, 2],
      [-0.00037, 0],
      [-0.00012, 2]
    ],
    "red_o_points": [],
    "y_categories": ["N", "NOT APPLICABLE", "nan"],
    "blue_o_points": [],
    "blue_x_points": [
      [0.00211, 1],
      [-5e-5, 2],
      [-0.00035, 0],
      [-0.00031, 0],
      [0.00012, 2],
      [0.00221, 1],
      [0.00111, 1],
      [-0.00037, 0],
      [-8e-5, 2],
      [2e-5, 2],
      [-0.00024, 0],
      [0.00169, 1],
      [0.0, 2],
      [0.00163, 1],
      [-4e-5, 2]
    ]
  },
  "QS_mulTransfSite[AcSsPA]": {
    "red_x_points": [
      [-0.00019, 3],
      [-0.00118, 0],
      [-0.00114, 0],
      [-0.00107, 0],
      [-0.00118, 0],
      [-0.00092, 0],
      [-0.00112, 0],
      [-0.00022, 3],
      [-0.00113, 0],
      [-0.00089, 0],
      [-0.0002, 3],
      [-0.00109, 0],
      [-0.00027, 3],
      [-0.00127, 0],
      [-0.00383, 2],
      [-0.00021, 3],
      [-0.0002, 3],
      [-0.00016, 3],
      [-0.00091, 0],
      [-0.00023, 3],
      [-0.00029, 3],
      [-0.00023, 3],
      [-0.00122, 0],
      [-0.00109, 0],
      [-0.00024, 3],
      [0.00356, 1],
      [-0.00028, 3],
      [-0.00101, 0],
      [-0.00022, 3]
    ],
    "red_o_points": [],
    "y_categories": ["N", "NOT APPLICABLE", "Y", "nan"],
    "blue_o_points": [],
    "blue_x_points": [
      [0.00551, 1],
      [-8e-5, 3],
      [-0.00086, 0],
      [-0.00078, 0],
      [-0.00018, 3],
      [0.00516, 1],
      [0.00394, 1],
      [-0.001, 0],
      [-7e-5, 3],
      [-0.0, 3],
      [-0.00074, 0],
      [0.00369, 1],
      [-0.00011, 3],
      [0.00408, 1],
      [-0.00015, 3]
    ]
  },
  "QA_lstPexMuscstrength[ScapulaElev]": {
    "red_x_points": [
      [-0.00015, 0],
      [-0.00039, 2],
      [-0.00048, 2],
      [-0.00043, 2],
      [-0.00185, 1],
      [0.00038, 0],
      [-0.00059, 2],
      [-0.00471, 1],
      [0.0007, 0],
      [-0.00044, 2],
      [-0.00038, 0],
      [-0.00038, 2],
      [-0.00027, 2],
      [-0.00063, 2],
      [0.00015, 0],
      [-0.00028, 0],
      [-0.0004, 0],
      [-0.00057, 0],
      [-0.00024, 2],
      [5e-5, 2],
      [-0.00021, 2],
      [-0.00021, 2],
      [0.00073, 0],
      [0.00059, 0],
      [3e-5, 2],
      [-0.00023, 2],
      [-9e-5, 2],
      [-0.00175, 1],
      [-0.00017, 2]
    ],
    "red_o_points": [],
    "y_categories": ["GREATER THAN OR EQUALS TO 3", "LESS THAN 3", "nan"],
    "blue_o_points": [],
    "blue_x_points": [
      [2e-5, 2],
      [0.0005, 2],
      [0.00134, 0],
      [0.00197, 0],
      [0.00029, 2],
      [2e-5, 0],
      [5e-5, 2],
      [0.00393, 0],
      [0.00016, 2],
      [0.00142, 0],
      [0.00048, 0],
      [0.0003, 2],
      [0.00078, 0],
      [0.00093, 2]
    ]
  },
  "QA_lstPexMuscstrength[ScapulaAbducSuprot]": {
    "red_x_points": [
      [0.00118, 0],
      [-0.00104, 2],
      [-0.00709, 1],
      [-0.00031, 2],
      [-0.008, 1],
      [-0.0078, 1],
      [-0.00787, 1],
      [-0.00603, 1],
      [0.00901, 0],
      [-0.01025, 1],
      [-0.00598, 1],
      [-0.00176, 2],
      [-0.00066, 2],
      [-0.00187, 2],
      [-0.00081, 2],
      [0.00248, 0],
      [-0.00581, 1],
      [0.00114, 0],
      [-0.00664, 1],
      [-0.0011, 2],
      [-0.00073, 2],
      [-0.0004, 2],
      [-0.01019, 1],
      [0.00877, 0],
      [-0.00026, 2],
      [0.00015, 2],
      [0.00265, 0],
      [-0.00547, 1],
      [-0.00044, 2]
    ],
    "red_o_points": [],
    "y_categories": ["GREATER THAN OR EQUALS TO 3", "LESS THAN 3", "nan"],
    "blue_o_points": [],
    "blue_x_points": [
      [0.00016, 2],
      [0.00749, 0],
      [0.01312, 0],
      [0.01356, 0],
      [0.00077, 2],
      [0.00024, 2],
      [0.00288, 0],
      [0.00063, 2],
      [0.00164, 2],
      [0.00056, 2],
      [0.01244, 0],
      [0.00295, 0],
      [0.00432, 0],
      [0.00016, 2],
      [0.0042, 1]
    ]
  },
  "participant_code": {
    "red_x_points": [
      [-0.02756, 1],
      [-0.02756, 2],
      [-0.02667, 3],
      [-0.02749, 4],
      [-0.02749, 5],
      [-0.02653, 8],
      [-0.02783, 9],
      [-0.02694, 10],
      [-0.02735, 11],
      [-0.02681, 13],
      [-0.02687, 14],
      [-0.02571, 18],
      [-0.0266, 19],
      [-0.02756, 20],
      [-0.02687, 23],
      [-0.02845, 26],
      [-0.02735, 28],
      [-0.02674, 29],
      [-0.02619, 30],
      [-0.02591, 31],
      [-0.02667, 32],
      [-0.02756, 34],
      [-0.02797, 36],
      [-0.02626, 38],
      [-0.02694, 39],
      [-0.02681, 40],
      [-0.02701, 41],
      [-0.02687, 42],
      [-0.02708, 43]
    ],
    "red_o_points": [],
    "y_categories": [
      "P16554",
      "P18297",
      "P19283",
      "P19287",
      "P23172",
      "P23391",
      "P30595",
      "P31645",
      "P31691",
      "P34778",
      "P35046",
      "P36328",
      "P43633",
      "P4544",
      "P46417",
      "P48965",
      "P53068",
      "P5497",
      "P58556",
      "P59529",
      "P62483",
      "P64658",
      "P65202",
      "P66816",
      "P6751",
      "P7408",
      "P75566",
      "P76226",
      "P79971",
      "P82621",
      "P82990",
      "P84549",
      "P84932",
      "P85825",
      "P86989",
      "P8770",
      "P87791",
      "P90550",
      "P93159",
      "P94969",
      "P96710",
      "P97130",
      "P9744",
      "P98500",
      "nan"
    ],
    "blue_o_points": [],
    "blue_x_points": [
      [0.05374, 0],
      [0.05256, 6],
      [0.05033, 7],
      [0.0523, 12],
      [0.05243, 15],
      [0.05204, 16],
      [0.05151, 17],
      [0.05269, 21],
      [0.05282, 22],
      [0.05072, 24],
      [0.05098, 25],
      [0.05387, 27],
      [0.05125, 33],
      [0.05414, 35],
      [0.0523, 37]
    ]
  },
  "QA_lstPexMuscstrength[ShoulderExrot]": {
    "red_x_points": [
      [-8e-5, 1],
      [-0.00047, 2],
      [-0.00134, 0],
      [-0.00036, 2],
      [0.00071, 1],
      [0.00012, 1],
      [-0.00029, 2],
      [-5e-5, 1],
      [0.00075, 1],
      [-0.00096, 2],
      [-0.00016, 1],
      [-0.00122, 2],
      [3e-5, 2],
      [-0.00084, 2],
      [-0.00042, 2],
      [-0.00021, 1],
      [0.0, 1],
      [-0.00023, 1],
      [-0.00055, 2],
      [0.0, 2],
      [-0.0, 2],
      [-0.0, 2],
      [0.00103, 1],
      [-0.00686, 0],
      [4e-5, 2],
      [-0.0, 2],
      [-0.0, 2],
      [0.00016, 1],
      [-0.0, 2]
    ],
    "red_o_points": [],
    "y_categories": ["GREATER THAN OR EQUALS TO 3", "LESS THAN 3", "nan"],
    "blue_o_points": [],
    "blue_x_points": [
      [-0.0, 2],
      [0.00013, 2],
      [0.00325, 1],
      [0.0038, 1],
      [-0.0, 2],
      [-0.0, 2],
      [0.00061, 0],
      [-0.00015, 2],
      [0.00023, 2],
      [0.0025, 1],
      [0.00058, 0],
      [0.00011, 2],
      [0.0001, 2]
    ]
  },
  "QA_yonInjTbi": {
    "red_x_points": [
      [0.00601, 0],
      [-0.00172, 2],
      [-0.00185, 0],
      [-0.00172, 0],
      [-0.00102, 2],
      [0.00026, 1],
      [-0.00185, 0],
      [-0.01115, 2],
      [-0.00359, 2],
      [0.00063, 1],
      [-0.00432, 1],
      [-0.00376, 0],
      [0.00732, 0],
      [0.00019, 1],
      [-0.00014, 1],
      [-0.00495, 1],
      [-0.00427, 1],
      [-0.00497, 1],
      [0.00072, 1],
      [-0.00519, 1],
      [0.00771, 0],
      [-0.00597, 1],
      [0.00111, 1],
      [0.00062, 1],
      [-0.00535, 1],
      [-0.00038, 2],
      [-0.01013, 2],
      [0.00018, 1],
      [-0.00626, 1]
    ],
    "red_o_points": [],
    "y_categories": ["N", "Y", "nan"],
    "blue_o_points": [],
    "blue_x_points": [
      [0.00063, 0],
      [-0.00295, 1],
      [0.00195, 1],
      [0.0025, 1],
      [0.01239, 0],
      [0.0001, 1],
      [4e-5, 1],
      [0.00312, 1],
      [0.01303, 0],
      [0.01125, 0],
      [0.00163, 1],
      [-9e-5, 2],
      [-0.00328, 1],
      [4e-5, 2],
      [0.0135, 0]
    ]
  },
  "QA_mulInjOrthesisType[ArmSling]": {
    "red_x_points": [
      [-0.00713, 2],
      [-0.00753, 2],
      [-0.00709, 2],
      [-0.0071, 2],
      [-0.0069, 2],
      [-0.00741, 2],
      [-0.0071, 2],
      [-0.00744, 2],
      [-0.00687, 2],
      [-0.00729, 2],
      [-0.00742, 2],
      [-0.00744, 2],
      [-0.00762, 2],
      [-0.0074, 2],
      [-0.02213, 0],
      [-0.00706, 2],
      [-0.00725, 2],
      [-0.02313, 0],
      [-0.02241, 3],
      [-0.00694, 2],
      [-0.00723, 2],
      [-0.00723, 2],
      [-0.00743, 2],
      [-0.0073, 2],
      [-0.02267, 3],
      [-0.02291, 3],
      [-0.02295, 3],
      [-0.0073, 2],
      [-0.00699, 2]
    ],
    "red_o_points": [],
    "y_categories": ["N", "NOT APPLICABLE", "Y", "nan"],
    "blue_o_points": [],
    "blue_x_points": [
      [-0.00701, 2],
      [-0.00661, 2],
      [-0.00711, 2],
      [-0.00688, 2],
      [0.04607, 1],
      [0.04395, 1],
      [0.04179, 1],
      [0.04678, 1],
      [-0.00687, 2],
      [0.04559, 1],
      [-0.00714, 2],
      [0.0404, 1],
      [0.04538, 1],
      [0.04133, 1],
      [-0.007, 2]
    ]
  },
  "QS_mulGraftNerve[Ul]": {
    "red_x_points": [
      [2e-5, 2],
      [-0.00021, 0],
      [-0.00014, 0],
      [-0.00016, 0],
      [-0.00012, 0],
      [-0.00012, 0],
      [-0.00014, 0],
      [2e-5, 2],
      [-0.00014, 0],
      [-0.00013, 0],
      [1e-5, 2],
      [-0.00012, 0],
      [3e-5, 2],
      [-0.00032, 0],
      [-0.0002, 0],
      [0.0, 2],
      [1e-5, 2],
      [2e-5, 2],
      [-0.00013, 0],
      [4e-5, 2],
      [4e-5, 2],
      [1e-5, 2],
      [-0.00012, 0],
      [-0.00014, 0],
      [3e-5, 2],
      [0.00022, 1],
      [2e-5, 2],
      [-0.00012, 0],
      [5e-5, 2]
    ],
    "red_o_points": [],
    "y_categories": ["N", "NOT APPLICABLE", "nan"],
    "blue_o_points": [],
    "blue_x_points": [
      [0.00057, 1],
      [1e-5, 2],
      [-7e-5, 0],
      [-0.0001, 0],
      [5e-5, 2],
      [0.00047, 1],
      [0.00031, 1],
      [-0.00013, 0],
      [2e-5, 2],
      [0.00016, 2],
      [-4e-5, 0],
      [0.00022, 1],
      [1e-5, 2],
      [0.00031, 1],
      [3e-5, 2]
    ]
  },
  "QS_mulGraftNerve[Ssr]": {
    "red_x_points": [
      [-1e-5, 2],
      [-3e-5, 0],
      [-3e-5, 0],
      [-3e-5, 0],
      [-3e-5, 0],
      [-3e-5, 0],
      [-3e-5, 0],
      [-3e-5, 0],
      [-1e-5, 2],
      [-3e-5, 0],
      [-1e-5, 2],
      [-1e-5, 2],
      [-1e-5, 2],
      [-1e-5, 2],
      [-3e-5, 0],
      [-1e-5, 2],
      [-1e-5, 2],
      [-3e-5, 0],
      [-3e-5, 0],
      [-1e-5, 2],
      [-1e-5, 2],
      [-3e-5, 0],
      [-1e-5, 2]
    ],
    "red_o_points": [],
    "y_categories": ["N", "NOT APPLICABLE", "nan"],
    "blue_o_points": [],
    "blue_x_points": [
      [0.00013, 1],
      [-3e-5, 0],
      [-3e-5, 0],
      [-1e-5, 2],
      [0.00013, 1],
      [-1e-5, 2],
      [-1e-5, 2],
      [-3e-5, 0],
      [0.00013, 1],
      [-1e-5, 2],
      [0.00013, 1],
      [-1e-5, 2]
    ]
  },
  "QA_yonInjUnconscio": {
    "red_x_points": [
      [-0.01273, 1],
      [-0.01205, 1],
      [-0.00221, 2],
      [-0.0025, 2],
      [-0.00208, 2],
      [-0.01348, 1],
      [-0.00229, 2],
      [-0.00249, 2],
      [-0.00244, 2],
      [-0.01371, 1],
      [-0.01254, 1],
      [-0.01353, 1],
      [-0.00253, 2],
      [-0.00247, 2],
      [-0.00968, 1],
      [-0.01289, 1],
      [-0.01257, 1],
      [-0.01031, 1],
      [-0.01008, 1],
      [-0.01286, 1],
      [-0.00289, 2],
      [-0.00212, 2],
      [-0.01373, 1],
      [-0.01269, 1],
      [-0.00267, 2],
      [-0.00236, 2],
      [-0.00281, 2],
      [-0.01254, 1],
      [-0.00241, 2]
    ],
    "red_o_points": [],
    "y_categories": ["N", "Y", "nan"],
    "blue_o_points": [],
    "blue_x_points": [
      [-0.00129, 2],
      [-0.00162, 2],
      [0.04731, 0],
      [-0.00122, 2],
      [-0.0085, 1],
      [-0.00843, 1],
      [0.03246, 0],
      [0.04024, 0],
      [-0.0018, 2],
      [0.0397, 0],
      [0.04792, 0],
      [-0.00187, 2],
      [-0.00821, 1],
      [-0.0018, 2],
      [0.04678, 0]
    ]
  },
  "QA_lstPexPalle[Elbow]": {
    "red_x_points": [
      [-0.00033, 4],
      [-0.00247, 4],
      [-0.00204, 4],
      [-0.0019, 3],
      [-0.00296, 4],
      [-0.00228, 3],
      [-0.00292, 4],
      [-0.00043, 4],
      [-0.00361, 4],
      [-0.00115, 3],
      [-0.0034, 1],
      [-0.0044, 4],
      [-0.00044, 4],
      [-0.00398, 4],
      [-0.00137, 4],
      [3e-5, 3],
      [-0.008, 0],
      [0.00048, 3],
      [-0.00717, 2],
      [0.00021, 3],
      [-0.0003, 4],
      [-0.00027, 4],
      [-0.00423, 4],
      [-0.00444, 4],
      [-0.0004, 4],
      [-0.02487, 3],
      [-0.00015, 4],
      [-0.00573, 0],
      [-0.00028, 4]
    ],
    "red_o_points": [],
    "y_categories": ["ABS", "HYPO", "NAIA", "PT", "nan"],
    "blue_o_points": [],
    "blue_x_points": [
      [0.00439, 4],
      [0.00026, 4],
      [0.0037, 3],
      [0.03083, 1],
      [0.00013, 4],
      [0.00445, 4],
      [0.00911, 1],
      [-0.00235, 4],
      [0.00051, 4],
      [0.00026, 4],
      [0.02316, 1],
      [0.00438, 4],
      [0.00161, 3],
      [0.00475, 4],
      [0.00361, 3]
    ]
  },
  "QS_mulGraftNerve[MCA]": {
    "red_x_points": [
      [-2e-5, 2],
      [-9e-5, 0],
      [-8e-5, 0],
      [-3e-5, 0],
      [-7e-5, 0],
      [-6e-5, 0],
      [-9e-5, 0],
      [-3e-5, 2],
      [-6e-5, 0],
      [-9e-5, 0],
      [-3e-5, 2],
      [-8e-5, 0],
      [0.0, 2],
      [-9e-5, 0],
      [-3e-5, 0],
      [-2e-5, 2],
      [-2e-5, 2],
      [-2e-5, 2],
      [-6e-5, 0],
      [-1e-5, 2],
      [-2e-5, 2],
      [-2e-5, 2],
      [-4e-5, 0],
      [-9e-5, 0],
      [-3e-5, 2],
      [8e-5, 1],
      [-3e-5, 2],
      [-9e-5, 0],
      [-0.0, 2]
    ],
    "red_o_points": [],
    "y_categories": ["N", "NOT APPLICABLE", "nan"],
    "blue_o_points": [],
    "blue_x_points": [
      [0.00049, 1],
      [-0.0, 2],
      [-9e-5, 0],
      [-5e-5, 0],
      [-3e-5, 2],
      [0.00034, 1],
      [0.00026, 1],
      [-7e-5, 0],
      [-2e-5, 2],
      [-2e-5, 2],
      [-3e-5, 0],
      [0.00013, 1],
      [-1e-5, 2],
      [0.00034, 1],
      [-2e-5, 2]
    ]
  },
  "QA_lstPexInspectio[Swelling]": {
    "red_x_points": [
      [0.00186, 1],
      [-0.00285, 1],
      [0.00149, 0],
      [-0.00186, 1],
      [-0.00024, 2],
      [0.00263, 0],
      [-0.00286, 1],
      [0.00143, 1],
      [-0.00668, 1],
      [-0.00712, 1],
      [-0.00737, 2],
      [-0.00523, 1],
      [-0.00417, 0],
      [-0.00579, 1],
      [-0.00141, 1],
      [-0.00367, 0],
      [-0.00728, 2],
      [0.00153, 1],
      [-0.00272, 1],
      [0.00159, 1],
      [-0.00523, 0],
      [0.00133, 1],
      [-0.00597, 1],
      [0.00495, 0],
      [0.00197, 1],
      [-0.00402, 0],
      [-0.00847, 2],
      [0.00056, 0],
      [0.00246, 1]
    ],
    "red_o_points": [],
    "y_categories": ["ABS", "NAIA", "PT", "nan"],
    "blue_o_points": [],
    "blue_x_points": [
      [0.00177, 1],
      [0.00366, 1],
      [0.00956, 0],
      [0.01168, 0],
      [0.00469, 1],
      [0.00172, 1],
      [-1e-5, 0],
      [-0.00284, 1],
      [0.00295, 0],
      [0.00423, 1],
      [0.01639, 2],
      [0.00114, 1],
      [0.00287, 1],
      [-0.00017, 0],
      [0.0035, 1]
    ]
  },
  "QA_lstPexInspectio[SurgicalScar]": {
    "red_x_points": [
      [-0.00392, 1],
      [-0.00479, 1],
      [-0.00522, 0],
      [-0.00332, 1],
      [-0.00539, 1],
      [-0.00978, 0],
      [-0.00469, 1],
      [-0.00301, 1],
      [-0.00814, 1],
      [-0.00806, 1],
      [-0.00859, 0],
      [-0.00718, 1],
      [-0.00146, 2],
      [-0.008, 1],
      [-0.00457, 0],
      [0.00498, 2],
      [0.00431, 2],
      [-0.00655, 1],
      [-0.00364, 1],
      [-0.00475, 1],
      [-0.00162, 2],
      [-0.00369, 1],
      [-0.00686, 1],
      [0.01183, 2],
      [-0.00369, 1],
      [-0.00451, 1],
      [-0.0022, 1],
      [0.00513, 2],
      [-0.00268, 1]
    ],
    "red_o_points": [],
    "y_categories": ["ABS", "NAIA", "PT", "nan"],
    "blue_o_points": [],
    "blue_x_points": [
      [-0.00082, 1],
      [0.0106, 2],
      [0.02067, 2],
      [0.02419, 2],
      [0.00148, 1],
      [9e-5, 1],
      [0.00135, 0],
      [-0.00382, 1],
      [0.00151, 1],
      [0.0013, 1],
      [0.01896, 2],
      [-0.00045, 1],
      [0.01009, 2],
      [0.00369, 0],
      [0.01119, 2]
    ]
  },
  "QA_intPexWristFlex": {
    "red_x_points": [
      [-0.00024, 2],
      [-0.00059, 2],
      [-0.00039, 2],
      [-0.00045, 2],
      [-0.00066, 2],
      [-0.00105, 0],
      [-0.00064, 2],
      [0.00023, 0],
      [-0.0009, 2],
      [-0.00088, 2],
      [-0.0002, 0],
      [-0.001, 2],
      [-0.00016, 2],
      [-0.0007, 2],
      [-0.00043, 2],
      [-0.00034, 0],
      [0.0, 0],
      [-0.00032, 0],
      [-0.00026, 0],
      [-4e-5, 2],
      [-7e-5, 2],
      [-0.00015, 2],
      [-0.00095, 2],
      [-0.00072, 2],
      [-2e-5, 2],
      [-0.02239, 1],
      [-0.00339, 1],
      [-0.00019, 0],
      [-0.00021, 2]
    ],
    "red_o_points": [],
    "y_categories": ["GREATER THAN OR EQUALS TO 60", "LESS THAN 60", "nan"],
    "blue_o_points": [],
    "blue_x_points": [
      [0.00432, 2],
      [0.00229, 0],
      [0.00049, 0],
      [-0.00061, 2],
      [0.00013, 2],
      [0.00426, 2],
      [0.00529, 0],
      [-0.00046, 2],
      [0.0002, 2],
      [0.0002, 2],
      [0.01147, 1],
      [0.00372, 2],
      [0.0004, 2],
      [0.00425, 2],
      [0.00118, 0]
    ]
  },
  "QS_mulGraftNerve[Me]": {
    "red_x_points": [
      [-2e-5, 2],
      [-0.00013, 0],
      [-9e-5, 0],
      [-8e-5, 0],
      [-0.00012, 0],
      [-0.0001, 0],
      [-0.00014, 0],
      [-2e-5, 2],
      [-0.00015, 0],
      [-0.00015, 0],
      [-0.0, 2],
      [-0.00011, 0],
      [-4e-5, 2],
      [-0.00018, 0],
      [-0.00028, 0],
      [-1e-5, 2],
      [-3e-5, 2],
      [1e-5, 2],
      [-0.0001, 0],
      [-3e-5, 2],
      [-3e-5, 2],
      [-3e-5, 2],
      [-9e-5, 0],
      [-0.00013, 0],
      [0.0, 2],
      [0.00035, 1],
      [-1e-5, 2],
      [-0.0001, 0],
      [-1e-5, 2]
    ],
    "red_o_points": [],
    "y_categories": ["N", "NOT APPLICABLE", "nan"],
    "blue_o_points": [],
    "blue_x_points": [
      [0.00108, 1],
      [-1e-5, 2],
      [-8e-5, 0],
      [-0.00011, 0],
      [1e-5, 2],
      [0.00052, 1],
      [0.00017, 1],
      [-5e-5, 0],
      [-3e-5, 2],
      [1e-5, 2],
      [-5e-5, 0],
      [0.00018, 1],
      [1e-5, 2],
      [0.00017, 1],
      [0.0, 2]
    ]
  },
  "QS_mulGraftRoot[T2]": {
    "red_x_points": [
      [1e-5, 2],
      [-8e-5, 0],
      [-0.00011, 0],
      [-5e-5, 0],
      [-9e-5, 0],
      [-8e-5, 0],
      [-0.00011, 0],
      [-1e-5, 2],
      [-7e-5, 0],
      [-5e-5, 0],
      [1e-5, 2],
      [-8e-5, 0],
      [-0.0, 2],
      [-0.00011, 0],
      [-5e-5, 0],
      [1e-5, 2],
      [-0.0, 2],
      [0.0, 2],
      [-5e-5, 0],
      [1e-5, 2],
      [1e-5, 2],
      [-0.0, 2],
      [-0.00011, 0],
      [-0.00011, 0],
      [-1e-5, 2],
      [0.00011, 1],
      [-0.0, 2],
      [-8e-5, 0],
      [1e-5, 2]
    ],
    "red_o_points": [],
    "y_categories": ["N", "NOT APPLICABLE", "nan"],
    "blue_o_points": [],
    "blue_x_points": [
      [0.00049, 1],
      [-0.0, 2],
      [-3e-5, 0],
      [-4e-5, 0],
      [1e-5, 2],
      [0.00033, 1],
      [0.0001, 1],
      [-9e-5, 0],
      [1e-5, 2],
      [-0.0, 2],
      [-5e-5, 0],
      [0.00019, 1],
      [-0.0, 2],
      [0.00019, 1],
      [1e-5, 2]
    ]
  },
  "QS_mulGraftNerve[Ax]": {
    "red_x_points": [
      [-2e-5, 2],
      [-0.00026, 0],
      [-0.00016, 0],
      [-0.00012, 0],
      [-0.00021, 0],
      [-0.00018, 0],
      [-0.00022, 0],
      [-1e-5, 2],
      [-0.00014, 0],
      [-0.00019, 0],
      [-3e-5, 2],
      [-0.00021, 0],
      [-5e-5, 2],
      [-0.00024, 0],
      [-0.00022, 0],
      [-1e-5, 2],
      [-5e-5, 2],
      [-4e-5, 2],
      [-0.00012, 0],
      [-3e-5, 2],
      [-4e-5, 2],
      [-4e-5, 2],
      [-0.00021, 0],
      [-0.00016, 0],
      [-2e-5, 2],
      [0.00044, 1],
      [-5e-5, 2],
      [-0.00016, 0],
      [-3e-5, 2]
    ],
    "red_o_points": [],
    "y_categories": ["N", "NOT APPLICABLE", "nan"],
    "blue_o_points": [],
    "blue_x_points": [
      [0.00151, 1],
      [0.0, 2],
      [-0.00012, 0],
      [-0.00018, 0],
      [-3e-5, 2],
      [0.00063, 1],
      [0.00028, 1],
      [-9e-5, 0],
      [0.0, 2],
      [-2e-5, 2],
      [-0.00012, 0],
      [0.00043, 1],
      [-1e-5, 2],
      [0.0005, 1],
      [-1e-5, 2]
    ]
  },
  "QS_mulBpsurgeryType[Lysis]": {
    "red_x_points": [
      [-0.00121, 3],
      [-0.00411, 0],
      [-0.01621, 2],
      [-0.01512, 2],
      [-0.00246, 0],
      [-0.01593, 2],
      [-0.00269, 0],
      [-0.00126, 3],
      [-0.00297, 0],
      [-0.00276, 0],
      [-0.0012, 3],
      [-0.00278, 0],
      [-0.00119, 3],
      [-0.00422, 0],
      [-0.0153, 2],
      [-0.00114, 3],
      [-0.00105, 3],
      [-0.00115, 3],
      [-0.00297, 0],
      [-0.00102, 3],
      [-0.00149, 3],
      [-0.00126, 3],
      [-0.00342, 0],
      [-0.00311, 0],
      [-0.00154, 3],
      [0.01866, 1],
      [-0.0014, 3],
      [-0.01475, 2],
      [-0.00129, 3]
    ],
    "red_o_points": [],
    "y_categories": ["N", "NOT APPLICABLE", "Y", "nan"],
    "blue_o_points": [],
    "blue_x_points": [
      [0.02957, 1],
      [-0.00063, 3],
      [-0.00054, 0],
      [-0.00137, 0],
      [-0.00042, 3],
      [0.02428, 1],
      [0.01913, 1],
      [-0.00179, 0],
      [-0.00088, 3],
      [-0.00065, 3],
      [-0.00106, 0],
      [0.02135, 1],
      [-0.00082, 3],
      [0.021, 1],
      [-0.00083, 3]
    ]
  },
  "QS_mulLysisSite[Trunk]": {
    "red_x_points": [
      [-0.00066, 3],
      [-0.00427, 0],
      [-0.00338, 0],
      [-0.00328, 0],
      [-0.00308, 0],
      [-0.01256, 2],
      [-0.00337, 0],
      [-0.00093, 3],
      [-0.00301, 0],
      [-0.00299, 0],
      [-0.00096, 3],
      [-0.0035, 0],
      [-0.0009, 3],
      [-0.00327, 0],
      [-0.01101, 2],
      [-0.00094, 3],
      [-0.00089, 3],
      [-0.00102, 3],
      [-0.00302, 0],
      [-0.00091, 3],
      [-0.00101, 3],
      [-0.00079, 3],
      [-0.00374, 0],
      [-0.0031, 0],
      [-0.00101, 3],
      [0.01101, 1],
      [-0.00077, 3],
      [-0.0106, 2],
      [-0.00102, 3]
    ],
    "red_o_points": [],
    "y_categories": ["N", "NOT APPLICABLE", "Y", "nan"],
    "blue_o_points": [],
    "blue_x_points": [
      [0.02123, 1],
      [-0.00047, 3],
      [-0.00131, 0],
      [-0.00111, 0],
      [-4e-5, 3],
      [0.0174, 1],
      [0.01379, 1],
      [-0.00212, 0],
      [-0.00049, 3],
      [-0.00016, 3],
      [-0.0017, 0],
      [0.01466, 1],
      [-0.00045, 3],
      [0.01622, 1],
      [-0.00047, 3]
    ]
  },
  "QS_mulGraftTrunk[UpperTrunk]": {
    "red_x_points": [
      [-0.00025, 3],
      [-0.00209, 0],
      [-0.0016, 0],
      [-0.00133, 0],
      [-0.00151, 0],
      [-0.00136, 0],
      [-0.00157, 0],
      [-0.00037, 3],
      [-0.00139, 0],
      [-0.00141, 0],
      [-0.00038, 3],
      [-0.0016, 0],
      [-0.00051, 3],
      [-0.00753, 2],
      [-0.00218, 0],
      [-0.00065, 3],
      [-0.00029, 3],
      [-0.00045, 3],
      [-0.00166, 0],
      [-0.00037, 3],
      [-0.00054, 3],
      [-0.00053, 3],
      [-0.00169, 0],
      [-0.00155, 0],
      [-0.00058, 3],
      [0.00527, 1],
      [-0.00039, 3],
      [-0.00138, 0],
      [-0.00054, 3]
    ],
    "red_o_points": [],
    "y_categories": ["N", "NOT APPLICABLE", "Y", "nan"],
    "blue_o_points": [],
    "blue_x_points": [
      [0.00912, 1],
      [-0.00026, 3],
      [-0.00046, 0],
      [-0.00043, 0],
      [-4e-5, 3],
      [0.00779, 1],
      [0.00572, 1],
      [-0.001, 0],
      [-0.00025, 3],
      [-0.00022, 3],
      [-0.00061, 0],
      [0.00584, 1],
      [-0.00025, 3],
      [0.00588, 1],
      [-0.00036, 3]
    ]
  },
  "QS_mulTransfSite[PhMc]": {
    "red_x_points": [
      [-0.00057, 3],
      [-0.00367, 0],
      [-0.0026, 0],
      [-0.00272, 0],
      [-0.00287, 0],
      [-0.00258, 0],
      [-0.00897, 2],
      [-0.0007, 3],
      [-0.00297, 0],
      [-0.00273, 0],
      [-0.00051, 3],
      [-0.00282, 0],
      [-0.0008, 3],
      [-0.00409, 0],
      [-0.00407, 0],
      [-0.00057, 3],
      [-0.00047, 3],
      [-0.00044, 3],
      [-0.00847, 2],
      [-0.00062, 3],
      [-0.0008, 3],
      [-0.00078, 3],
      [-0.00284, 0],
      [-0.0029, 0],
      [-0.00077, 3],
      [0.01023, 1],
      [-0.00076, 3],
      [-0.00271, 0],
      [-0.00069, 3]
    ],
    "red_o_points": [],
    "y_categories": ["N", "NOT APPLICABLE", "Y", "nan"],
    "blue_o_points": [],
    "blue_x_points": [
      [0.01654, 1],
      [-0.00048, 3],
      [-0.00171, 0],
      [-0.00231, 0],
      [9e-5, 3],
      [0.01422, 1],
      [0.01013, 1],
      [-0.00218, 0],
      [-0.00036, 3],
      [-0.00024, 3],
      [-0.00146, 0],
      [0.01217, 1],
      [-0.00034, 3],
      [0.01154, 1],
      [-0.00035, 3]
    ]
  },
  "QS_mulLysisSite[Root]": {
    "red_x_points": [
      [-0.00042, 3],
      [-0.00198, 0],
      [-0.00701, 2],
      [-0.00166, 0],
      [-0.00189, 0],
      [-0.0019, 0],
      [-0.0017, 0],
      [-0.0005, 3],
      [-0.0018, 0],
      [-0.00173, 0],
      [-0.00028, 3],
      [-0.00185, 0],
      [-0.00051, 3],
      [-0.00227, 0],
      [-0.00217, 0],
      [-0.00038, 3],
      [-0.0003, 3],
      [-0.00039, 3],
      [-0.00154, 0],
      [-0.00024, 3],
      [-0.00049, 3],
      [-0.00054, 3],
      [-0.00177, 0],
      [-0.00152, 0],
      [-0.00042, 3],
      [0.00591, 1],
      [-0.00046, 3],
      [-0.00638, 2],
      [-0.00047, 3]
    ],
    "red_o_points": [],
    "y_categories": ["N", "NOT APPLICABLE", "Y", "nan"],
    "blue_o_points": [],
    "blue_x_points": [
      [0.01237, 1],
      [-0.00021, 3],
      [-0.00091, 0],
      [-0.0016, 0],
      [-0.00023, 3],
      [0.00768, 1],
      [0.00669, 1],
      [-0.00132, 0],
      [-0.00021, 3],
      [-0.00016, 3],
      [-0.001, 0],
      [0.00816, 1],
      [-0.00021, 3],
      [0.00788, 1],
      [-0.00023, 3]
    ]
  },
  "QA_lstPexInspectio[ShoulderSubdisloc]": {
    "red_x_points": [
      [-0.00179, 1],
      [-0.00406, 1],
      [0.00328, 0],
      [-0.003, 1],
      [-0.00527, 1],
      [-0.00172, 2],
      [-0.00427, 1],
      [-0.00227, 1],
      [-0.00618, 1],
      [-0.00666, 1],
      [-0.00057, 2],
      [-0.00655, 1],
      [-0.00154, 1],
      [-0.00673, 1],
      [-0.00229, 1],
      [-0.0028, 2],
      [-0.00064, 2],
      [0.0001, 1],
      [-0.00352, 1],
      [-0.001, 1],
      [-0.01073, 0],
      [0.00258, 2],
      [-0.00128, 2],
      [-0.00143, 2],
      [-0.00167, 1],
      [-0.01033, 2],
      [-0.00167, 1],
      [-0.0012, 2],
      [-0.00209, 1]
    ],
    "red_o_points": [],
    "y_categories": ["ABS", "NAIA", "PT", "nan"],
    "blue_o_points": [],
    "blue_x_points": [
      [0.00372, 1],
      [0.00658, 2],
      [0.02829, 0],
      [0.00383, 2],
      [0.00089, 1],
      [0.00425, 1],
      [0.00359, 0],
      [-0.00271, 1],
      [0.00936, 2],
      [0.0007, 1],
      [0.02268, 0],
      [0.00259, 1],
      [0.00173, 1],
      [-0.00184, 2],
      [0.00165, 1]
    ]
  },
  "QA_yonPreTbi": {
    "red_x_points": [
      [-0.00079, 2],
      [-2e-5, 2],
      [-8e-5, 2],
      [-7e-5, 2],
      [-7e-5, 2],
      [-6e-5, 2],
      [-6e-5, 2],
      [-0.00065, 2],
      [-5e-5, 2],
      [-7e-5, 2],
      [-0.00079, 2],
      [-6e-5, 2],
      [-0.00065, 2],
      [-2e-5, 2],
      [-0.0, 2],
      [-0.01122, 1],
      [-0.00077, 2],
      [-0.00061, 2],
      [-6e-5, 2],
      [-0.00079, 2],
      [-0.00069, 2],
      [-0.00082, 2],
      [-8e-5, 2],
      [-9e-5, 2],
      [-0.00065, 2],
      [-0.00052, 2],
      [-7e-5, 2],
      [-0.00078, 2]
    ],
    "red_o_points": [],
    "y_categories": ["N", "Y", "nan"],
    "blue_o_points": [],
    "blue_x_points": [
      [-1e-5, 2],
      [0.02337, 0],
      [1e-5, 2],
      [-9e-5, 2],
      [-0.00044, 2],
      [0.0, 2],
      [-5e-5, 2],
      [-0.00069, 2],
      [-0.00038, 2],
      [0.0, 2],
      [0.0, 2],
      [-0.00045, 2],
      [-0.00068, 2]
    ]
  },
  "QS_mulGraftLevel[Trunk]": {
    "red_x_points": [
      [-0.00019, 3],
      [-0.0022, 0],
      [-0.00173, 0],
      [-0.00178, 0],
      [-0.00189, 0],
      [-0.00156, 0],
      [-0.00188, 0],
      [-0.00047, 3],
      [-0.00177, 0],
      [-0.00176, 0],
      [-0.00022, 3],
      [-0.00173, 0],
      [-0.00041, 3],
      [-0.00816, 2],
      [-0.00255, 0],
      [-0.00035, 3],
      [-6e-5, 3],
      [-0.00017, 3],
      [-0.00139, 0],
      [-0.00019, 3],
      [-0.00029, 3],
      [-0.00039, 3],
      [-0.0018, 0],
      [-0.00175, 0],
      [-0.00032, 3],
      [0.00601, 1],
      [-0.00037, 3],
      [-0.00173, 0],
      [-0.00032, 3]
    ],
    "red_o_points": [],
    "y_categories": ["N", "NOT APPLICABLE", "Y", "nan"],
    "blue_o_points": [],
    "blue_x_points": [
      [0.01085, 1],
      [-0.00018, 3],
      [-0.00096, 0],
      [-0.00087, 0],
      [0.0001, 3],
      [0.00725, 1],
      [0.00519, 1],
      [-0.00088, 0],
      [-0.00014, 3],
      [-0.00013, 3],
      [-0.00079, 0],
      [0.0059, 1],
      [-9e-5, 3],
      [0.00637, 1],
      [-0.00018, 3]
    ]
  },
  "QA_lstPexPain[C7]": {
    "red_x_points": [
      [-0.00177, 1],
      [-0.00325, 2],
      [-0.00274, 2],
      [-0.00131, 1],
      [-0.00437, 2],
      [-0.00346, 1],
      [-0.00182, 1],
      [-0.00547, 0],
      [-0.00389, 1],
      [0.00527, 0],
      [-0.00102, 1],
      [-0.00573, 2],
      [0.0018, 2],
      [-0.00488, 2],
      [-0.00213, 2],
      [-0.0047, 0],
      [-0.0004, 1],
      [-0.00483, 0],
      [-0.00351, 2],
      [-0.0048, 0],
      [0.00113, 2],
      [0.0015, 2],
      [-0.00608, 2],
      [-0.00623, 2],
      [-0.00447, 0],
      [-0.0019, 1],
      [-0.00068, 1],
      [-0.00124, 1],
      [-0.00115, 1]
    ],
    "red_o_points": [],
    "y_categories": ["NORM", "NPV", "nan"],
    "blue_o_points": [],
    "blue_x_points": [
      [0.00016, 1],
      [0.00381, 1],
      [0.01506, 0],
      [0.01744, 0],
      [0.0053, 2],
      [0.0002, 2],
      [6e-5, 1],
      [0.00146, 1],
      [0.00445, 2],
      [0.00469, 2],
      [0.01148, 0],
      [-0.0001, 1],
      [-9e-5, 0],
      [0.00205, 0],
      [0.00617, 1]
    ]
  },
  "QS_mulTransfSite[AcSsAA]": {
    "red_x_points": [
      [-0.00059, 3],
      [-0.00124, 2],
      [-0.00589, 0],
      [-0.00475, 0],
      [-0.00075, 2],
      [-0.00614, 0],
      [-0.00544, 0],
      [-0.0007, 3],
      [-0.00617, 0],
      [-0.00587, 0],
      [-0.00046, 3],
      [-0.00487, 0],
      [-0.00091, 3],
      [-0.00118, 2],
      [-0.00335, 0],
      [-0.00064, 3],
      [-0.00022, 3],
      [-0.00068, 3],
      [-0.00086, 2],
      [-0.00039, 3],
      [-0.00071, 3],
      [-0.00059, 3],
      [-0.00586, 0],
      [1e-5, 2],
      [-0.00066, 3],
      [0.00769, 1],
      [-0.00082, 3],
      [-0.00443, 0],
      [-0.00071, 3]
    ],
    "red_o_points": [],
    "y_categories": ["N", "NOT APPLICABLE", "Y", "nan"],
    "blue_o_points": [],
    "blue_x_points": [
      [0.01469, 1],
      [-0.00036, 3],
      [0.00533, 2],
      [0.00633, 2],
      [-0.00033, 3],
      [0.00927, 1],
      [0.00814, 1],
      [-0.00212, 0],
      [-7e-5, 3],
      [-0.00032, 3],
      [-0.00247, 0],
      [0.00958, 1],
      [-0.00066, 3],
      [0.01029, 1],
      [-0.00011, 3]
    ]
  },
  "QS_mulGraftNerve[DS]": {
    "red_x_points": [
      [-2e-5, 2],
      [-5e-5, 0],
      [-3e-5, 0],
      [-5e-5, 0],
      [-5e-5, 0],
      [-0.0, 2],
      [-3e-5, 0],
      [-5e-5, 0],
      [-0.0, 2],
      [-5e-5, 0],
      [-3e-5, 0],
      [-0.0, 2],
      [-0.0, 2],
      [-0.0, 2],
      [-3e-5, 0],
      [-0.0, 2],
      [-0.0, 2],
      [-2e-5, 2],
      [-5e-5, 0],
      [-3e-5, 0],
      [-0.0, 2],
      [9e-5, 1],
      [-3e-5, 0],
      [-2e-5, 2]
    ],
    "red_o_points": [],
    "y_categories": ["N", "NOT APPLICABLE", "nan"],
    "blue_o_points": [],
    "blue_x_points": [
      [0.00027, 1],
      [-0.0, 2],
      [-3e-5, 0],
      [9e-5, 1],
      [9e-5, 1],
      [-3e-5, 0],
      [-0.0, 2],
      [-0.0, 2],
      [-3e-5, 0],
      [9e-5, 1],
      [-0.0, 2],
      [-0.0, 2]
    ]
  },
  "QS_mulGraftNerve[MP]": {
    "red_x_points": [
      [-3e-5, 0],
      [-3e-5, 0],
      [-3e-5, 0],
      [-3e-5, 0],
      [-3e-5, 0],
      [-3e-5, 0],
      [-0.0, 2],
      [-3e-5, 0],
      [-0.0, 2],
      [-3e-5, 0],
      [-3e-5, 0],
      [-0.0, 2],
      [-0.0, 2],
      [-0.0, 2],
      [-3e-5, 0],
      [-0.0, 2],
      [-0.0, 2],
      [-0.0, 2],
      [-3e-5, 0],
      [-3e-5, 0],
      [-0.0, 2],
      [9e-5, 1],
      [-0.0, 2]
    ],
    "red_o_points": [],
    "y_categories": ["N", "NOT APPLICABLE", "nan"],
    "blue_o_points": [],
    "blue_x_points": [
      [9e-5, 1],
      [-3e-5, 0],
      [-0.0, 2],
      [9e-5, 1],
      [-3e-5, 0],
      [-0.0, 2],
      [-0.0, 2],
      [-3e-5, 0],
      [9e-5, 1],
      [-0.0, 2],
      [9e-5, 1],
      [-0.0, 2]
    ]
  },
  "QS_mulLysisSite[Nerve]": {
    "red_x_points": [
      [-0.00059, 3],
      [-0.00327, 0],
      [-0.00882, 2],
      [-0.00758, 2],
      [-0.00262, 0],
      [-0.00217, 0],
      [-0.00268, 0],
      [-0.00079, 3],
      [-0.00284, 0],
      [-0.00208, 0],
      [-0.00059, 3],
      [-0.00253, 0],
      [-0.00081, 3],
      [-0.00337, 0],
      [-0.00343, 0],
      [-0.00071, 3],
      [-0.00044, 3],
      [-0.00073, 3],
      [-0.00223, 0],
      [-0.0005, 3],
      [-0.00072, 3],
      [-0.00084, 3],
      [-0.00273, 0],
      [-0.00247, 0],
      [-0.00062, 3],
      [0.00902, 1],
      [-0.00076, 3],
      [-0.00214, 0],
      [-0.00084, 3]
    ],
    "red_o_points": [],
    "y_categories": ["N", "NOT APPLICABLE", "Y", "nan"],
    "blue_o_points": [],
    "blue_x_points": [
      [0.01548, 1],
      [-0.00027, 3],
      [-0.00111, 0],
      [-0.00146, 0],
      [1e-5, 3],
      [0.01273, 1],
      [0.00897, 1],
      [-0.00202, 0],
      [-0.00039, 3],
      [-0.00029, 3],
      [-0.00142, 0],
      [0.01097, 1],
      [-0.00059, 3],
      [0.01059, 1],
      [-0.00032, 3]
    ]
  },
  "QS_mulGraftNerve[LP]": {
    "red_x_points": [
      [-1e-5, 2],
      [-2e-5, 0],
      [-2e-5, 0],
      [-3e-5, 0],
      [-4e-5, 0],
      [-4e-5, 0],
      [-4e-5, 0],
      [-1e-5, 2],
      [-4e-5, 0],
      [-4e-5, 0],
      [-1e-5, 2],
      [-4e-5, 0],
      [-2e-5, 2],
      [-4e-5, 0],
      [-2e-5, 2],
      [-2e-5, 2],
      [-1e-5, 2],
      [-2e-5, 0],
      [-2e-5, 2],
      [-1e-5, 2],
      [-1e-5, 2],
      [-3e-5, 0],
      [-4e-5, 0],
      [-1e-5, 2],
      [-1e-5, 2],
      [-3e-5, 0],
      [-1e-5, 2]
    ],
    "red_o_points": [],
    "y_categories": ["N", "NOT APPLICABLE", "nan"],
    "blue_o_points": [],
    "blue_x_points": [
      [0.00044, 1],
      [-1e-5, 2],
      [-4e-5, 0],
      [-4e-5, 0],
      [0.00013, 1],
      [0.00013, 1],
      [-2e-5, 0],
      [-1e-5, 2],
      [-1e-5, 2],
      [-3e-5, 0],
      [-1e-5, 2],
      [0.00013, 1],
      [-2e-5, 2]
    ]
  },
  "QA_lstPexMuscstrength[WristFlex]": {
    "red_x_points": [
      [-0.00258, 1],
      [-0.00184, 2],
      [-0.00419, 1],
      [0.0015, 0],
      [-0.00452, 1],
      [0.00093, 0],
      [-0.00327, 1],
      [-0.00076, 0],
      [0.00183, 0],
      [0.00087, 0],
      [-0.00168, 0],
      [0.00125, 0],
      [-0.00268, 2],
      [-0.00292, 2],
      [-0.00077, 2],
      [-0.00569, 0],
      [-0.00092, 1],
      [-0.00708, 0],
      [-0.00222, 1],
      [-0.00434, 0],
      [-0.00265, 2],
      [-0.0, 0],
      [0.00125, 0],
      [0.00133, 0],
      [-0.00256, 2],
      [-0.00133, 2],
      [-0.00273, 1],
      [-0.0019, 1],
      [-0.00335, 2]
    ],
    "red_o_points": [],
    "y_categories": ["GREATER THAN OR EQUALS TO 3", "LESS THAN 3", "nan"],
    "blue_o_points": [],
    "blue_x_points": [
      [0.00105, 0],
      [0.00395, 0],
      [0.00256, 0],
      [0.00378, 0],
      [0.00225, 2],
      [-2e-5, 2],
      [6e-5, 0],
      [0.0016, 0],
      [0.00517, 0],
      [0.00176, 2],
      [0.00206, 0],
      [0.00099, 0],
      [0.01298, 1],
      [0.00116, 0],
      [0.01168, 1]
    ]
  },
  "QS_mulNeuromadSite[C5]": {
    "red_x_points": [
      [-2e-5, 2],
      [-0.00077, 0],
      [-0.00082, 0],
      [-0.00067, 0],
      [-0.00072, 0],
      [-0.0008, 0],
      [-0.00065, 0],
      [-0.00014, 2],
      [-0.00092, 0],
      [-0.00078, 0],
      [-0.00013, 2],
      [-0.00086, 0],
      [-0.00019, 2],
      [-0.00096, 0],
      [-0.00072, 0],
      [-0.00011, 2],
      [2e-5, 2],
      [-2e-5, 2],
      [-0.00062, 0],
      [-5e-5, 2],
      [-0.00013, 2],
      [-0.00014, 2],
      [-0.00068, 0],
      [-0.00072, 0],
      [-0.00015, 2],
      [0.00154, 1],
      [-8e-5, 2],
      [-0.00068, 0],
      [-0.00012, 2]
    ],
    "red_o_points": [],
    "y_categories": ["N", "NOT APPLICABLE", "nan"],
    "blue_o_points": [],
    "blue_x_points": [
      [0.00365, 1],
      [4e-5, 2],
      [-0.00039, 0],
      [-0.00039, 0],
      [8e-5, 2],
      [0.00221, 1],
      [0.0019, 1],
      [-0.00046, 0],
      [3e-5, 2],
      [1e-5, 2],
      [-0.00037, 0],
      [0.00255, 1],
      [2e-5, 2],
      [0.00224, 1],
      [-4e-5, 2]
    ]
  },
  "QS_mulNeuromadSite[C7]": {
    "red_x_points": [
      [-5e-5, 2],
      [-0.00053, 0],
      [-0.00035, 0],
      [-0.00032, 0],
      [-0.00049, 0],
      [-0.00036, 0],
      [-0.00036, 0],
      [-0.00012, 2],
      [-0.00032, 0],
      [-0.00022, 0],
      [-6e-5, 2],
      [-0.00024, 0],
      [-0.00015, 2],
      [-0.00048, 0],
      [-0.00041, 0],
      [-5e-5, 2],
      [-7e-5, 2],
      [-3e-5, 2],
      [-0.00037, 0],
      [-6e-5, 2],
      [-6e-5, 2],
      [-6e-5, 2],
      [-0.00044, 0],
      [-0.00039, 0],
      [-0.0001, 2],
      [0.00096, 1],
      [-0.00011, 2],
      [-0.00033, 0],
      [-0.00012, 2]
    ],
    "red_o_points": [],
    "y_categories": ["N", "NOT APPLICABLE", "nan"],
    "blue_o_points": [],
    "blue_x_points": [
      [0.00183, 1],
      [0.0, 2],
      [-0.00026, 0],
      [-0.00033, 0],
      [-7e-5, 2],
      [0.00114, 1],
      [0.00123, 1],
      [-0.00025, 0],
      [-3e-5, 2],
      [-2e-5, 2],
      [-0.00022, 0],
      [0.00167, 1],
      [-6e-5, 2],
      [0.00114, 1],
      [-6e-5, 2]
    ]
  },
  "QS_mulLysisRoot[C5]": {
    "red_x_points": [
      [-0.00044, 3],
      [-0.00273, 0],
      [-0.00874, 2],
      [-0.0025, 0],
      [-0.00263, 0],
      [-0.00223, 0],
      [-0.00255, 0],
      [-0.00069, 3],
      [-0.00276, 0],
      [-0.00238, 0],
      [-0.00048, 3],
      [-0.00257, 0],
      [-0.00063, 3],
      [-0.00307, 0],
      [-0.00258, 0],
      [-0.00045, 3],
      [-0.00047, 3],
      [-0.00049, 3],
      [-0.00227, 0],
      [-0.00049, 3],
      [-0.00071, 3],
      [-0.00064, 3],
      [-0.00246, 0],
      [-0.00228, 0],
      [-0.00056, 3],
      [0.00893, 1],
      [-0.00064, 3],
      [-0.00752, 2],
      [-0.00059, 3]
    ],
    "red_o_points": [],
    "y_categories": ["N", "NOT APPLICABLE", "Y", "nan"],
    "blue_o_points": [],
    "blue_x_points": [
      [0.0138, 1],
      [-0.00043, 3],
      [-0.00105, 0],
      [-0.00182, 0],
      [-7e-5, 3],
      [0.01165, 1],
      [0.0087, 1],
      [-0.0019, 0],
      [-0.00042, 3],
      [-0.00019, 3],
      [-0.00098, 0],
      [0.01136, 1],
      [-0.00038, 3],
      [0.00979, 1],
      [-0.00044, 3]
    ]
  },
  "QS_mulGraftNerve[TD]": {
    "red_x_points": [
      [3e-5, 2],
      [-0.00026, 0],
      [-0.00029, 0],
      [-0.00024, 0],
      [-0.00018, 0],
      [-0.00015, 0],
      [-0.00025, 0],
      [0.0, 2],
      [-0.00026, 0],
      [-0.00022, 0],
      [0.0, 2],
      [-0.00014, 0],
      [3e-5, 2],
      [-0.00026, 0],
      [-0.00017, 0],
      [4e-5, 2],
      [0.0, 2],
      [3e-5, 2],
      [-0.00013, 0],
      [5e-5, 2],
      [3e-5, 2],
      [1e-5, 2],
      [-0.00017, 0],
      [-0.00023, 0],
      [0.0, 2],
      [0.00051, 1],
      [-1e-5, 2],
      [-0.00022, 0],
      [-1e-5, 2]
    ],
    "red_o_points": [],
    "y_categories": ["N", "NOT APPLICABLE", "nan"],
    "blue_o_points": [],
    "blue_x_points": [
      [0.00093, 1],
      [0.0, 2],
      [-8e-5, 0],
      [-3e-5, 0],
      [6e-5, 2],
      [0.00055, 1],
      [0.00027, 1],
      [-9e-5, 0],
      [1e-5, 2],
      [2e-5, 2],
      [-7e-5, 0],
      [0.00036, 1],
      [4e-5, 2],
      [0.00045, 1],
      [2e-5, 2]
    ]
  },
  "QA_intPexForearmSupin": {
    "red_x_points": [
      [-0.00058, 2],
      [-0.00402, 0],
      [-0.0008, 2],
      [-0.00055, 2],
      [-0.00114, 2],
      [0.00406, 1],
      [-0.00095, 2],
      [0.00146, 1],
      [-0.00138, 2],
      [-0.00133, 2],
      [-0.00625, 0],
      [-0.00766, 0],
      [-0.00071, 2],
      [-0.00137, 2],
      [-0.00048, 2],
      [0.00308, 1],
      [-0.00638, 0],
      [0.00127, 1],
      [0.00219, 1],
      [-0.00051, 2],
      [-0.00064, 2],
      [-0.00069, 2],
      [-0.00161, 2],
      [-0.00135, 2],
      [4e-5, 2],
      [-0.02175, 1],
      [-0.00036, 2],
      [-0.00386, 0],
      [-0.00083, 2]
    ],
    "red_o_points": [],
    "y_categories": ["GREATER THAN OR EQUALS TO 80", "LESS THAN 80", "nan"],
    "blue_o_points": [],
    "blue_x_points": [
      [0.0039, 2],
      [0.00685, 1],
      [0.01075, 1],
      [-0.00105, 2],
      [0.0001, 2],
      [0.00374, 2],
      [0.0053, 0],
      [-0.00049, 2],
      [-0.00037, 2],
      [0.00013, 2],
      [0.00918, 1],
      [0.00397, 2],
      [0.00036, 2],
      [0.00465, 2],
      [0.00609, 1]
    ]
  },
  "QS_mulGraftNerve[SS]": {
    "red_x_points": [
      [-0.0, 2],
      [-0.00013, 0],
      [-5e-5, 0],
      [-5e-5, 0],
      [-5e-5, 0],
      [-3e-5, 0],
      [-3e-5, 0],
      [-0.0, 2],
      [-5e-5, 0],
      [-5e-5, 0],
      [-0.0, 2],
      [-5e-5, 0],
      [0.0, 2],
      [-5e-5, 0],
      [-0.0001, 0],
      [-0.0, 2],
      [-0.0, 2],
      [-5e-5, 0],
      [-0.0, 2],
      [-0.0, 2],
      [-0.0, 2],
      [-5e-5, 0],
      [-5e-5, 0],
      [-0.0, 2],
      [0.00015, 1],
      [-5e-5, 0],
      [-0.0, 2]
    ],
    "red_o_points": [],
    "y_categories": ["N", "NOT APPLICABLE", "nan"],
    "blue_o_points": [],
    "blue_x_points": [
      [0.00028, 1],
      [-0.0, 2],
      [-5e-5, 0],
      [-5e-5, 0],
      [-0.0, 2],
      [0.00015, 1],
      [0.00023, 1],
      [-2e-5, 0],
      [-0.0, 2],
      [0.0, 2],
      [-5e-5, 0],
      [0.0001, 1],
      [-0.0, 2],
      [0.00023, 1],
      [-0.0, 2]
    ]
  },
  "QS_mulGraftNerve[MCF]": {
    "red_x_points": [
      [-1e-5, 0],
      [-1e-5, 0],
      [-1e-5, 0],
      [-1e-5, 0],
      [-1e-5, 0],
      [-1e-5, 0],
      [0.0, 2],
      [-1e-5, 0],
      [-1e-5, 0],
      [0.0, 2],
      [-1e-5, 0],
      [0.0, 2],
      [0.0, 2],
      [0.0, 2],
      [0.0, 2],
      [-1e-5, 0],
      [-1e-5, 0],
      [0.0, 2]
    ],
    "red_o_points": [],
    "y_categories": ["N", "NOT APPLICABLE", "nan"],
    "blue_o_points": [],
    "blue_x_points": [
      [0.00014, 1],
      [0.0, 2],
      [-1e-5, 0],
      [-1e-5, 0],
      [0.0, 2],
      [-1e-5, 0],
      [0.0, 2]
    ]
  },
  "QA_lstPexArthre[Index]": {
    "red_x_points": [
      [-0.01002, 0],
      [-0.00509, 2],
      [-0.0038, 2],
      [-0.00697, 0],
      [-0.00952, 0],
      [0.00641, 1],
      [-0.00832, 0],
      [0.00064, 2],
      [0.00964, 1],
      [-0.01044, 0],
      [0.00286, 1],
      [-0.00579, 2],
      [5e-5, 2],
      [0.00842, 1],
      [-0.00294, 2],
      [0.00322, 1],
      [-0.00893, 0],
      [0.00205, 1],
      [-0.0046, 2],
      [-0.01097, 0],
      [0.0004, 2],
      [0.00049, 2],
      [-0.00616, 2],
      [-0.00589, 2],
      [0.00205, 1],
      [-0.0005, 2],
      [0.00039, 2],
      [-0.00589, 0],
      [0.00057, 2]
    ],
    "red_o_points": [],
    "y_categories": ["NPV", "PV", "nan"],
    "blue_o_points": [],
    "blue_x_points": [
      [0.00034, 0],
      [0.00142, 2],
      [0.01234, 1],
      [0.01279, 1],
      [0.00256, 2],
      [-0.00012, 2],
      [0.00155, 1],
      [0.01228, 1],
      [0.00132, 2],
      [0.00133, 2],
      [0.01119, 1],
      [0.00161, 1],
      [0.00431, 1],
      [-0.00012, 2],
      [0.00584, 1]
    ]
  },
  "QS_mulTransfSite[IMc]": {
    "red_x_points": [
      [-0.00099, 3],
      [-0.0168, 2],
      [-0.00264, 0],
      [-0.01497, 2],
      [-0.00299, 0],
      [-0.00283, 0],
      [-0.0028, 0],
      [-0.00111, 3],
      [-0.00302, 0],
      [-0.00273, 0],
      [-0.00071, 3],
      [-0.00299, 0],
      [-0.0013, 3],
      [-0.00411, 0],
      [-0.01465, 2],
      [-0.00092, 3],
      [-0.00087, 3],
      [-0.00087, 3],
      [-0.00271, 0],
      [-0.00084, 3],
      [-0.00138, 3],
      [-0.00119, 3],
      [-0.00315, 0],
      [-0.01746, 2],
      [-0.00112, 3],
      [0.01898, 1],
      [-0.00123, 3],
      [-0.01639, 2],
      [-0.00117, 3]
    ],
    "red_o_points": [],
    "y_categories": ["N", "NOT APPLICABLE", "Y", "nan"],
    "blue_o_points": [],
    "blue_x_points": [
      [0.0281, 1],
      [-0.00088, 3],
      [-0.0, 0],
      [-0.00074, 0],
      [-0.0001, 3],
      [0.02412, 1],
      [0.0187, 1],
      [-0.00136, 0],
      [-0.00047, 3],
      [-0.00052, 3],
      [-0.00098, 0],
      [0.02017, 1],
      [-0.00047, 3],
      [0.02015, 1],
      [-0.00074, 3]
    ]
  },
  "QS_mulLysisRoot[C7]": {
    "red_x_points": [
      [-0.00028, 3],
      [-0.00114, 0],
      [-0.00392, 2],
      [-0.00098, 0],
      [-0.00114, 0],
      [-0.00096, 0],
      [-0.00106, 0],
      [-0.00031, 3],
      [-0.00125, 0],
      [-0.00084, 0],
      [-0.00012, 3],
      [-0.00123, 0],
      [-0.00033, 3],
      [-0.00109, 0],
      [-0.00105, 0],
      [-0.00018, 3],
      [-0.00012, 3],
      [-0.00012, 3],
      [-0.00101, 0],
      [-0.00023, 3],
      [-0.00039, 3],
      [-0.00036, 3],
      [-0.00112, 0],
      [-0.00116, 0],
      [-0.00028, 3],
      [0.00281, 1],
      [-0.00032, 3],
      [-0.00098, 0],
      [-0.00029, 3]
    ],
    "red_o_points": [],
    "y_categories": ["N", "NOT APPLICABLE", "Y", "nan"],
    "blue_o_points": [],
    "blue_x_points": [
      [0.00651, 1],
      [-0.00023, 3],
      [-0.00033, 0],
      [-0.00086, 0],
      [-9e-5, 3],
      [0.00462, 1],
      [0.00313, 1],
      [-0.00087, 0],
      [-0.00013, 3],
      [-0.00012, 3],
      [-0.00038, 0],
      [0.00397, 1],
      [1e-5, 3],
      [0.00435, 1],
      [-0.00012, 3]
    ]
  },
  "QS_mulGraftLevel[other]": {
    "red_x_points": [
      [-3e-5, 0],
      [-3e-5, 0],
      [-3e-5, 0],
      [-3e-5, 0],
      [-3e-5, 0],
      [-3e-5, 0],
      [-1e-5, 2],
      [-3e-5, 0],
      [-1e-5, 2],
      [-3e-5, 0],
      [-3e-5, 0],
      [-1e-5, 2],
      [-1e-5, 2],
      [-1e-5, 2],
      [-1e-5, 2],
      [-1e-5, 2],
      [-1e-5, 2],
      [-3e-5, 0],
      [-3e-5, 0],
      [-1e-5, 2],
      [9e-5, 1],
      [-1e-5, 2],
      [-1e-5, 2]
    ],
    "red_o_points": [],
    "y_categories": ["N", "NOT APPLICABLE", "nan"],
    "blue_o_points": [],
    "blue_x_points": [
      [9e-5, 1],
      [-1e-5, 2],
      [-3e-5, 0],
      [-1e-5, 2],
      [9e-5, 1],
      [-3e-5, 0],
      [-1e-5, 2],
      [-3e-5, 0],
      [9e-5, 1],
      [-1e-5, 2],
      [9e-5, 1],
      [-1e-5, 2]
    ]
  },
  "QS_lstBpsurgSide": {
    "red_x_points": [
      [-0.00077, 3],
      [-0.01155, 0],
      [-0.01052, 0],
      [-0.00919, 0],
      [-0.01169, 0],
      [-0.01069, 0],
      [-0.01094, 0],
      [-0.0011, 3],
      [-0.01212, 0],
      [0.00056, 2],
      [-0.00078, 3],
      [0.00037, 2],
      [-0.00115, 3],
      [0.00016, 2],
      [-0.00231, 2],
      [-0.00092, 3],
      [-0.00065, 3],
      [-0.00074, 3],
      [-0.00808, 0],
      [-0.00059, 3],
      [-0.00095, 3],
      [-0.0012, 3],
      [0.00016, 2],
      [0.00087, 2],
      [-0.00097, 3],
      [0.01359, 1],
      [-0.001, 3],
      [-0.00984, 0],
      [-0.00103, 3]
    ],
    "red_o_points": [],
    "y_categories": ["L", "NOT APPLICABLE", "R", "nan"],
    "blue_o_points": [],
    "blue_x_points": [
      [0.02385, 1],
      [-0.00059, 3],
      [0.00373, 2],
      [0.00532, 2],
      [9e-5, 3],
      [0.01857, 1],
      [0.01268, 1],
      [-0.00322, 0],
      [-0.00054, 3],
      [-0.0003, 3],
      [0.00386, 2],
      [0.01503, 1],
      [-0.00031, 3],
      [0.01549, 1],
      [-0.00061, 3]
    ]
  },
  "QS_mulLysisRoot[C6]": {
    "red_x_points": [
      [-0.00047, 3],
      [-0.00378, 0],
      [-0.01052, 2],
      [-0.0027, 0],
      [-0.00305, 0],
      [-0.00288, 0],
      [-0.0032, 0],
      [-0.00067, 3],
      [-0.00328, 0],
      [-0.0028, 0],
      [-0.00038, 3],
      [-0.00302, 0],
      [-0.00093, 3],
      [-0.00389, 0],
      [-0.00341, 0],
      [-0.00067, 3],
      [-0.0004, 3],
      [-0.00044, 3],
      [-0.00284, 0],
      [-0.00046, 3],
      [-0.00065, 3],
      [-0.00057, 3],
      [-0.00327, 0],
      [-0.00313, 0],
      [-0.00071, 3],
      [0.00955, 1],
      [-0.00073, 3],
      [-0.00883, 2],
      [-0.00087, 3]
    ],
    "red_o_points": [],
    "y_categories": ["N", "NOT APPLICABLE", "Y", "nan"],
    "blue_o_points": [],
    "blue_x_points": [
      [0.01853, 1],
      [-0.00043, 3],
      [-0.00173, 0],
      [-0.00225, 0],
      [-9e-5, 3],
      [0.01446, 1],
      [0.01056, 1],
      [-0.00192, 0],
      [-0.00031, 3],
      [-0.00027, 3],
      [-0.00149, 0],
      [0.01196, 1],
      [-0.00031, 3],
      [0.01254, 1],
      [-0.00024, 3]
    ]
  },
  "QS_mulTransfSite[AcMc]": {
    "red_x_points": [
      [-0.00013, 3],
      [-0.00234, 0],
      [-0.00154, 0],
      [-0.00154, 0],
      [-0.00192, 0],
      [-0.00181, 0],
      [-0.00176, 0],
      [-0.00038, 3],
      [-0.00161, 0],
      [-0.00845, 2],
      [-0.00039, 3],
      [-0.00201, 0],
      [-0.00027, 3],
      [-0.00174, 0],
      [-0.00214, 0],
      [-0.00046, 3],
      [-0.00018, 3],
      [-0.00024, 3],
      [-0.00161, 0],
      [-0.00032, 3],
      [-0.00031, 3],
      [-0.00046, 3],
      [-0.00186, 0],
      [-0.00185, 0],
      [-0.00029, 3],
      [0.00475, 1],
      [-0.00027, 3],
      [-0.00177, 0],
      [-0.00023, 3]
    ],
    "red_o_points": [],
    "y_categories": ["N", "NOT APPLICABLE", "Y", "nan"],
    "blue_o_points": [],
    "blue_x_points": [
      [0.00793, 1],
      [-0.00023, 3],
      [0.00062, 0],
      [-0.00016, 0],
      [-2e-5, 3],
      [0.00823, 1],
      [0.00631, 1],
      [-0.00106, 0],
      [-0.0003, 3],
      [-0.00013, 3],
      [-0.00052, 0],
      [0.00617, 1],
      [-4e-5, 3],
      [0.00677, 1],
      [-0.00046, 3]
    ]
  },
  "QS_mulTransfSite[Other]": {
    "red_x_points": [
      [-0.00106, 3],
      [-0.00891, 0],
      [-0.00824, 0],
      [-0.00778, 0],
      [-0.00816, 0],
      [-0.00807, 0],
      [-0.00805, 0],
      [-0.00108, 3],
      [-0.0084, 0],
      [-0.00806, 0],
      [-0.00127, 3],
      [-0.00858, 0],
      [-0.00107, 3],
      [-0.00931, 0],
      [-0.00773, 0],
      [-0.00141, 3],
      [-0.001, 3],
      [-0.00126, 3],
      [-0.00725, 0],
      [-0.00105, 3],
      [-0.00112, 3],
      [-0.00081, 3],
      [-0.00836, 0],
      [-0.00788, 0],
      [-0.00094, 3],
      [0.01705, 1],
      [-0.00092, 3],
      [-0.00807, 0],
      [-0.00103, 3]
    ],
    "red_o_points": [],
    "y_categories": ["N", "NOT APPLICABLE", "Y", "nan"],
    "blue_o_points": [],
    "blue_x_points": [
      [0.02592, 1],
      [-0.00064, 3],
      [-0.00626, 0],
      [-0.00642, 0],
      [-0.00057, 3],
      [0.01972, 1],
      [0.01873, 1],
      [-0.0063, 0],
      [-0.00051, 3],
      [-0.00052, 3],
      [0.03788, 2],
      [0.02063, 1],
      [-0.00063, 3],
      [0.01937, 1],
      [-0.00057, 3]
    ]
  },
  "QA_yonInjBpsurg": {
    "red_x_points": [
      [-0.00059, 1],
      [-0.00059, 1],
      [-0.00054, 1],
      [-0.00057, 1],
      [-0.00058, 1],
      [-0.00045, 1],
      [-0.00051, 1],
      [-0.00053, 1],
      [-0.00059, 1],
      [-0.00048, 1],
      [-0.00058, 1],
      [-0.00055, 1],
      [-0.00077, 1],
      [-0.00073, 1],
      [-0.0005, 1],
      [-0.00059, 1],
      [-0.00058, 1],
      [-0.00061, 1],
      [-0.0004, 1],
      [-0.0006, 1],
      [-0.00099, 1],
      [-0.00056, 1],
      [-0.00054, 1],
      [-0.00056, 1],
      [-0.00075, 1],
      [0.00246, 0],
      [-0.00068, 1],
      [-0.00034, 1],
      [-0.00084, 1]
    ],
    "red_o_points": [],
    "y_categories": ["N", "Y", "nan"],
    "blue_o_points": [],
    "blue_x_points": [
      [0.00489, 0],
      [-0.00044, 1],
      [-0.00067, 1],
      [-0.00063, 1],
      [-0.00041, 1],
      [0.0033, 0],
      [0.00357, 0],
      [-0.00061, 1],
      [-0.00046, 1],
      [-0.00037, 1],
      [-0.00064, 1],
      [0.004, 0],
      [-0.00048, 1],
      [0.00348, 0],
      [-0.00038, 1]
    ]
  },
  "QA_lstPexTouch[C8]": {
    "red_x_points": [
      [-0.00163, 1],
      [-0.00475, 2],
      [-0.00208, 1],
      [-0.00187, 1],
      [-0.00584, 2],
      [-0.00387, 1],
      [-0.00303, 1],
      [-0.00341, 0],
      [-0.00596, 1],
      [0.0097, 0],
      [-0.00092, 1],
      [-0.00832, 2],
      [-0.00269, 2],
      [-0.00776, 2],
      [-0.00303, 2],
      [-0.00151, 0],
      [-0.00139, 1],
      [-0.00252, 0],
      [-0.00379, 2],
      [-0.00256, 0],
      [-0.00291, 2],
      [-0.00539, 0],
      [-0.00487, 1],
      [-0.00844, 2],
      [-0.00313, 0],
      [-0.00613, 1],
      [-0.00071, 2],
      [-0.00287, 1],
      [-0.00099, 1]
    ],
    "red_o_points": [],
    "y_categories": ["NORM", "NPV", "nan"],
    "blue_o_points": [],
    "blue_x_points": [
      [0.00428, 0],
      [0.00706, 1],
      [0.017, 0],
      [0.0223, 0],
      [0.00467, 2],
      [0.00089, 2],
      [7e-5, 1],
      [-0.00091, 1],
      [0.00923, 1],
      [0.00484, 2],
      [0.01688, 0],
      [-0.00032, 1],
      [-4e-5, 0],
      [0.00326, 0],
      [0.00346, 0]
    ]
  },
  "QS_mulNeuromadSite[T1]": {
    "red_x_points": [
      [-0.00018, 2],
      [-0.00096, 0],
      [-0.00058, 0],
      [-0.00064, 0],
      [-0.00061, 0],
      [-0.00047, 0],
      [-0.00065, 0],
      [-0.00014, 2],
      [-0.0007, 0],
      [-0.00039, 0],
      [-0.00014, 2],
      [-0.00046, 0],
      [-0.00011, 2],
      [-0.00074, 0],
      [-0.00077, 0],
      [-0.00018, 2],
      [-9e-5, 2],
      [-0.00014, 2],
      [-0.00051, 0],
      [-7e-5, 2],
      [-7e-5, 2],
      [-4e-5, 2],
      [-0.00044, 0],
      [-0.00063, 0],
      [-0.00015, 2],
      [0.00115, 1],
      [-0.00016, 2],
      [-0.00042, 0],
      [-0.0001, 2]
    ],
    "red_o_points": [],
    "y_categories": ["N", "NOT APPLICABLE", "nan"],
    "blue_o_points": [],
    "blue_x_points": [
      [0.0027, 1],
      [-0.00011, 2],
      [-0.00034, 0],
      [-0.00033, 0],
      [-4e-5, 2],
      [0.0021, 1],
      [0.00191, 1],
      [-0.00053, 0],
      [-7e-5, 2],
      [-1e-5, 2],
      [-0.00034, 0],
      [0.00246, 1],
      [-0.00011, 2],
      [0.00201, 1],
      [8e-5, 2]
    ]
  },
  "QS_mulBpsurgeryType[Graft]": {
    "red_x_points": [
      [-0.00017, 3],
      [-0.00133, 0],
      [-0.00077, 0],
      [-0.001, 0],
      [-0.00115, 0],
      [-0.00077, 0],
      [-0.00118, 0],
      [-0.00012, 3],
      [-0.00089, 0],
      [-0.00063, 0],
      [-0.00016, 3],
      [-0.00109, 0],
      [-0.0002, 3],
      [-0.0059, 2],
      [-0.00106, 0],
      [-0.00015, 3],
      [-0.00013, 3],
      [-0.00017, 3],
      [-0.00087, 0],
      [-0.00012, 3],
      [-0.00022, 3],
      [-0.00022, 3],
      [-0.00121, 0],
      [-0.00111, 0],
      [-0.00021, 3],
      [0.00304, 1],
      [-0.00019, 3],
      [-0.00084, 0],
      [-0.00023, 3]
    ],
    "red_o_points": [],
    "y_categories": ["N", "NOT APPLICABLE", "Y", "nan"],
    "blue_o_points": [],
    "blue_x_points": [
      [0.00527, 1],
      [-7e-5, 3],
      [-0.00025, 0],
      [-0.00013, 0],
      [-6e-5, 3],
      [0.00392, 1],
      [0.00327, 1],
      [-0.00057, 0],
      [-0.00015, 3],
      [-0.0001, 3],
      [-0.00039, 0],
      [0.00409, 1],
      [-7e-5, 3],
      [0.00433, 1],
      [-4e-5, 3]
    ]
  },
  "QA_lstPexMuscstrength[WristExte]": {
    "red_x_points": [
      [-0.00572, 1],
      [-0.00408, 2],
      [-0.00477, 1],
      [-0.00378, 1],
      [-0.00688, 1],
      [-0.00448, 1],
      [-0.00549, 1],
      [0.00042, 0],
      [0.00582, 0],
      [-0.00722, 1],
      [0.00028, 0],
      [0.00498, 0],
      [-0.00261, 2],
      [-0.00623, 2],
      [-0.0022, 2],
      [-0.00103, 0],
      [-0.0013, 1],
      [-0.0016, 0],
      [-0.00446, 1],
      [-0.00518, 1],
      [-0.00268, 2],
      [-0.0052, 1],
      [0.00601, 0],
      [0.00527, 0],
      [-0.00183, 2],
      [-0.0011, 2],
      [-0.00335, 1],
      [-0.0027, 1],
      [-0.00323, 2]
    ],
    "red_o_points": [],
    "y_categories": ["GREATER THAN OR EQUALS TO 3", "LESS THAN 3", "nan"],
    "blue_o_points": [],
    "blue_x_points": [
      [0.00275, 0],
      [0.00222, 1],
      [0.00789, 0],
      [0.00901, 0],
      [0.0006, 2],
      [-0.00019, 2],
      [0.00086, 0],
      [0.00704, 0],
      [0.01453, 0],
      [0.00044, 2],
      [0.00706, 0],
      [-5e-5, 1],
      [0.00681, 0],
      [0.00141, 0],
      [0.00399, 1]
    ]
  },
  "QS_mulNeuromadSite[C6]": {
    "red_x_points": [
      [-3e-5, 2],
      [-0.00049, 0],
      [-0.00036, 0],
      [-0.00039, 0],
      [-0.0004, 0],
      [-0.00041, 0],
      [-0.00046, 0],
      [-0.0001, 2],
      [-0.00049, 0],
      [-0.00046, 0],
      [-1e-5, 2],
      [-0.00035, 0],
      [-0.00012, 2],
      [-0.00054, 0],
      [-0.00038, 0],
      [-3e-5, 2],
      [-6e-5, 2],
      [-2e-5, 2],
      [-0.00035, 0],
      [-6e-5, 2],
      [-9e-5, 2],
      [-0.00011, 2],
      [-0.00052, 0],
      [-0.00046, 0],
      [-7e-5, 2],
      [0.001, 1],
      [-8e-5, 2],
      [-0.00037, 0],
      [-0.00015, 2]
    ],
    "red_o_points": [],
    "y_categories": ["N", "NOT APPLICABLE", "nan"],
    "blue_o_points": [],
    "blue_x_points": [
      [0.00267, 1],
      [-4e-5, 2],
      [-0.00026, 0],
      [-0.0002, 0],
      [1e-5, 2],
      [0.00181, 1],
      [0.001, 1],
      [-0.00028, 0],
      [-5e-5, 2],
      [-4e-5, 2],
      [-0.00026, 0],
      [0.00093, 1],
      [3e-5, 2],
      [0.00108, 1],
      [-5e-5, 2]
    ]
  },
  "QA_lstPexPalle[Clavicle]": {
    "red_x_points": [
      [-0.00026, 3],
      [-0.00156, 3],
      [-0.00096, 3],
      [0.00104, 2],
      [-0.00179, 3],
      [0.00225, 2],
      [-0.00157, 3],
      [1e-5, 3],
      [-0.00213, 3],
      [0.00309, 2],
      [-0.01351, 0],
      [-0.00227, 3],
      [-0.00029, 3],
      [-0.00212, 3],
      [-0.00085, 3],
      [-0.01422, 0],
      [-0.01317, 0],
      [0.00966, 2],
      [-0.00481, 1],
      [-0.01452, 1],
      [-0.00036, 3],
      [-0.00014, 3],
      [-0.00253, 3],
      [-0.00264, 3],
      [-2e-5, 3],
      [-0.0263, 2],
      [-0.00017, 3],
      [-0.00108, 0],
      [-0.00021, 3]
    ],
    "red_o_points": [],
    "y_categories": ["HYPO", "NAIA", "PT", "nan"],
    "blue_o_points": [],
    "blue_x_points": [
      [0.00482, 3],
      [0.00031, 3],
      [0.00594, 2],
      [0.00668, 2],
      [0.00055, 3],
      [0.00488, 3],
      [0.00676, 0],
      [-0.00192, 3],
      [0.00035, 3],
      [0.00037, 3],
      [0.01062, 0],
      [0.0046, 3],
      [0.01861, 2],
      [0.00526, 3],
      [0.02362, 2]
    ]
  },
  "QS_mulGraftNerve[LT]": {
    "red_x_points": [
      [-0.0, 2],
      [-4e-5, 0],
      [-7e-5, 0],
      [-3e-5, 0],
      [-7e-5, 0],
      [-0.0, 2],
      [-3e-5, 0],
      [-4e-5, 0],
      [-0.0, 2],
      [-4e-5, 0],
      [-4e-5, 0],
      [-0.0, 2],
      [-0.0, 2],
      [-4e-5, 0],
      [-0.0, 2]
    ],
    "red_o_points": [],
    "y_categories": ["N", "NOT APPLICABLE", "nan"],
    "blue_o_points": [],
    "blue_x_points": [
      [0.00026, 1],
      [0.0, 2],
      [-3e-5, 0],
      [-0.0, 2],
      [0.00013, 1],
      [-4e-5, 0],
      [-0.0, 2],
      [-0.0, 2],
      [0.00013, 1]
    ]
  },
  "QA_lstPexMuscstrength[ShoulderAbduc]": {
    "red_x_points": [
      [-0.00019, 1],
      [-0.0002, 1],
      [-0.00019, 1],
      [-0.00021, 1],
      [-0.00021, 1],
      [-0.00022, 1],
      [-0.00021, 1],
      [-0.00022, 1],
      [-0.00023, 1],
      [-0.00019, 1],
      [-0.00034, 1],
      [-0.0002, 1],
      [0.00018, 2],
      [0.00014, 2],
      [5e-5, 2],
      [-0.00026, 1],
      [-0.0002, 1],
      [-0.00029, 1],
      [-0.00013, 1],
      [8e-5, 2],
      [0.00021, 2],
      [-0.00013, 1],
      [-0.0002, 1],
      [-0.00018, 1],
      [-0.00027, 1],
      [0.00022, 2],
      [-0.00032, 1],
      [-0.00013, 1],
      [0.00016, 2]
    ],
    "red_o_points": [],
    "y_categories": ["GREATER THAN OR EQUALS TO 3", "LESS THAN 3", "nan"],
    "blue_o_points": [],
    "blue_x_points": [
      [0.00017, 2],
      [-0.00018, 1],
      [-0.00026, 1],
      [-0.00036, 1],
      [0.00022, 2],
      [0.00014, 2],
      [0.00173, 0],
      [0.00029, 2],
      [0.00031, 2],
      [0.0002, 2],
      [-0.00028, 1],
      [0.00218, 0],
      [-0.00024, 1],
      [-2e-5, 1],
      [-0.00022, 1]
    ]
  },
  "QA_yonInjPhysio": {
    "red_x_points": [
      [-0.00767, 0],
      [0.00038, 0],
      [3e-5, 0],
      [7e-5, 0],
      [-0.0017, 2],
      [0.00012, 0],
      [0.00025, 0],
      [-0.00686, 0],
      [0.00105, 0],
      [-0.00484, 1],
      [-0.0049, 0],
      [0.00105, 0],
      [-0.00763, 0],
      [-0.00461, 1],
      [-0.00094, 1],
      [0.00262, 1],
      [-0.00563, 0],
      [0.00435, 1],
      [-1e-5, 0],
      [-0.00638, 0],
      [0.00384, 1],
      [0.00389, 1],
      [0.00086, 0],
      [-0.00712, 1],
      [-0.00963, 2],
      [-0.01221, 1],
      [-0.00835, 2],
      [-0.00021, 0],
      [0.00487, 1]
    ],
    "red_o_points": [],
    "y_categories": ["N", "Y", "nan"],
    "blue_o_points": [],
    "blue_x_points": [
      [0.00497, 0],
      [0.00844, 1],
      [0.00518, 0],
      [0.00548, 0],
      [0.00822, 1],
      [0.00454, 0],
      [0.00276, 0],
      [0.00172, 0],
      [-0.00095, 0],
      [0.00723, 1],
      [0.0037, 0],
      [0.00316, 0],
      [0.00609, 1],
      [-0.00237, 1],
      [0.00714, 1]
    ]
  },
  "QA_lstPexTouch[C7]": {
    "red_x_points": [
      [-0.00248, 1],
      [-0.00804, 2],
      [-0.00298, 1],
      [-0.00275, 1],
      [-0.00931, 2],
      [-0.00514, 1],
      [-0.00462, 1],
      [-0.00373, 0],
      [-0.00674, 1],
      [-0.00623, 1],
      [-0.00028, 1],
      [-0.01235, 2],
      [-0.0016, 2],
      [-0.01073, 2],
      [-0.0058, 2],
      [-0.00283, 0],
      [-0.00178, 1],
      [-0.00273, 0],
      [-0.00764, 2],
      [-0.00347, 0],
      [-0.00143, 2],
      [-0.00599, 0],
      [-0.00603, 1],
      [-0.01009, 2],
      [-0.00382, 0],
      [-0.00347, 1],
      [-0.00106, 2],
      [-0.00252, 1],
      [-0.00117, 1]
    ],
    "red_o_points": [],
    "y_categories": ["NORM", "NPV", "nan"],
    "blue_o_points": [],
    "blue_x_points": [
      [9e-5, 1],
      [0.00685, 1],
      [0.03311, 0],
      [0.03961, 0],
      [0.00689, 2],
      [0.00011, 2],
      [4e-5, 1],
      [-0.00288, 1],
      [0.00842, 1],
      [0.00554, 2],
      [0.02976, 0],
      [-2e-5, 1],
      [0.00107, 0],
      [0.0033, 0],
      [0.00493, 0]
    ]
  },
  "QA_intPexShoulderFlex": {
    "red_x_points": [
      [-0.00012, 2],
      [-0.00032, 2],
      [-5e-5, 2],
      [-0.00589, 0],
      [-2e-5, 2],
      [-0.00046, 2],
      [-0.00075, 2],
      [7e-5, 1],
      [0.00025, 1],
      [-0.00049, 2],
      [-4e-5, 2],
      [4e-5, 1],
      [4e-5, 1],
      [0.00013, 1],
      [-4e-5, 2],
      [-0.00041, 2],
      [-7e-5, 2],
      [4e-5, 1],
      [0.00018, 1]
    ],
    "red_o_points": [],
    "y_categories": ["GREATER THAN OR EQUALS TO 180", "LESS THAN 180", "nan"],
    "blue_o_points": [],
    "blue_x_points": [
      [5e-5, 1],
      [0.00508, 1],
      [8e-5, 2],
      [-6e-5, 2],
      [0.00257, 1],
      [4e-5, 1],
      [0.00017, 1]
    ]
  },
  "QS_mulGraftNerve[IS]": {
    "red_x_points": [[-4e-5, 0], [-4e-5, 0], [-4e-5, 2], [-4e-5, 2]],
    "red_o_points": [],
    "y_categories": ["N", "NOT APPLICABLE", "nan"],
    "blue_o_points": [],
    "blue_x_points": [[0.00016, 1]]
  },
  "QS_mulGraftNerve[MC]": {
    "red_x_points": [
      [2e-5, 2],
      [-0.0003, 0],
      [-9e-5, 0],
      [-0.00012, 0],
      [-0.0002, 0],
      [-9e-5, 0],
      [-0.0002, 0],
      [-0.0, 2],
      [-0.00017, 0],
      [-0.00015, 0],
      [-2e-5, 2],
      [-0.00018, 0],
      [-4e-5, 2],
      [-0.0002, 0],
      [-0.00023, 0],
      [-1e-5, 2],
      [-1e-5, 2],
      [-0.0, 2],
      [-3e-5, 0],
      [-2e-5, 2],
      [-8e-5, 2],
      [0.0, 2],
      [-0.00021, 0],
      [-0.00018, 0],
      [-3e-5, 2],
      [0.00024, 1],
      [0.0, 2],
      [-9e-5, 0],
      [-3e-5, 2]
    ],
    "red_o_points": [],
    "y_categories": ["N", "NOT APPLICABLE", "nan"],
    "blue_o_points": [],
    "blue_x_points": [
      [0.00091, 1],
      [-0.0, 2],
      [-7e-5, 0],
      [-0.00013, 0],
      [1e-5, 2],
      [0.00069, 1],
      [0.00032, 1],
      [-9e-5, 0],
      [2e-5, 2],
      [0.0, 2],
      [-4e-5, 0],
      [0.00032, 1],
      [-3e-5, 2],
      [0.0005, 1],
      [1e-5, 2]
    ]
  },
  "QS_mulLysisNerve[Ssr]": {
    "red_x_points": [
      [-0.00026, 3],
      [-0.00304, 0],
      [-0.00926, 2],
      [-0.00856, 2],
      [-0.00256, 0],
      [-0.0023, 0],
      [-0.00268, 0],
      [-0.0006, 3],
      [-0.00269, 0],
      [-0.0024, 0],
      [-0.00041, 3],
      [-0.0025, 0],
      [-0.00057, 3],
      [-0.00344, 0],
      [-0.00316, 0],
      [-0.00035, 3],
      [-0.00027, 3],
      [-0.00032, 3],
      [-0.00221, 0],
      [-0.00025, 3],
      [-0.0007, 3],
      [-0.00071, 3],
      [-0.00263, 0],
      [-0.00259, 0],
      [-0.0006, 3],
      [0.00962, 1],
      [-0.00068, 3],
      [-0.0022, 0],
      [-0.00059, 3]
    ],
    "red_o_points": [],
    "y_categories": ["N", "NOT APPLICABLE", "Y", "nan"],
    "blue_o_points": [],
    "blue_x_points": [
      [0.01408, 1],
      [-0.00032, 3],
      [-0.00111, 0],
      [-0.00187, 0],
      [6e-5, 3],
      [0.01196, 1],
      [0.00843, 1],
      [-0.002, 0],
      [-0.00037, 3],
      [-0.00012, 3],
      [-0.00144, 0],
      [0.01123, 1],
      [-0.00025, 3],
      [0.01079, 1],
      [-0.00016, 3]
    ]
  },
  "QS_mulNeuromadSite[C4]": {
    "red_x_points": [
      [-7e-5, 2],
      [-0.0004, 0],
      [-0.00032, 0],
      [-0.00031, 0],
      [-0.00031, 0],
      [-0.00027, 0],
      [-0.00031, 0],
      [-4e-5, 2],
      [-0.00046, 0],
      [-0.00035, 0],
      [-0.0, 2],
      [-0.00032, 0],
      [-2e-5, 2],
      [-0.00025, 0],
      [-0.00025, 0],
      [-0.00015, 2],
      [-5e-5, 2],
      [-5e-5, 2],
      [-0.00022, 0],
      [-5e-5, 2],
      [-3e-5, 2],
      [-6e-5, 2],
      [-0.00044, 0],
      [-0.0003, 0],
      [-7e-5, 2],
      [0.0007, 1],
      [-0.0001, 2],
      [-0.00025, 0],
      [5e-5, 2]
    ],
    "red_o_points": [],
    "y_categories": ["N", "NOT APPLICABLE", "nan"],
    "blue_o_points": [],
    "blue_x_points": [
      [0.00149, 1],
      [0.0, 2],
      [-0.00013, 0],
      [-0.0003, 0],
      [8e-5, 2],
      [0.00125, 1],
      [0.00066, 1],
      [-0.00024, 0],
      [-2e-5, 2],
      [2e-5, 2],
      [-6e-5, 0],
      [0.00082, 1],
      [-3e-5, 2],
      [0.00117, 1],
      [-2e-5, 2]
    ]
  },
  "QS_mulGraftNerve[Ra]": {
    "red_x_points": [
      [-2e-5, 2],
      [-0.00034, 0],
      [-0.00023, 0],
      [-0.00023, 0],
      [-0.00027, 0],
      [-0.00017, 0],
      [-0.00014, 0],
      [-4e-5, 2],
      [-0.00025, 0],
      [-0.00015, 0],
      [-1e-5, 2],
      [-0.00026, 0],
      [-3e-5, 2],
      [-0.00024, 0],
      [-0.00024, 0],
      [-0.0, 2],
      [-0.0, 2],
      [-1e-5, 2],
      [-0.00024, 0],
      [-1e-5, 2],
      [-4e-5, 2],
      [-5e-5, 2],
      [-0.00023, 0],
      [-0.00026, 0],
      [-3e-5, 2],
      [0.00079, 1],
      [-3e-5, 2],
      [-0.00015, 0],
      [-3e-5, 2]
    ],
    "red_o_points": [],
    "y_categories": ["N", "NOT APPLICABLE", "nan"],
    "blue_o_points": [],
    "blue_x_points": [
      [0.00103, 1],
      [-1e-5, 2],
      [-0.00013, 0],
      [-0.00016, 0],
      [-2e-5, 2],
      [0.00103, 1],
      [0.00037, 1],
      [-0.00019, 0],
      [-0.0, 2],
      [-2e-5, 2],
      [-0.00015, 0],
      [0.00054, 1],
      [-1e-5, 2],
      [0.00064, 1],
      [-2e-5, 2]
    ]
  },
  "QS_mulTransfSite[Oberlin]": {
    "red_x_points": [
      [-0.00155, 3],
      [-0.01865, 0],
      [-0.01754, 0],
      [-0.01632, 0],
      [-0.01665, 0],
      [0.00269, 2],
      [-0.01888, 0],
      [-0.00178, 3],
      [0.00307, 2],
      [0.00258, 2],
      [-0.00143, 3],
      [0.00297, 2],
      [-0.00202, 3],
      [0.0025, 2],
      [-0.01547, 0],
      [-0.00143, 3],
      [-0.00153, 3],
      [-0.00135, 3],
      [-0.01498, 0],
      [-0.00153, 3],
      [-0.00183, 3],
      [-0.00188, 3],
      [0.00319, 2],
      [-0.0188, 0],
      [-0.00179, 3],
      [0.021, 1],
      [-0.00185, 3],
      [-0.0181, 0],
      [-0.00213, 3]
    ],
    "red_o_points": [],
    "y_categories": ["N", "NOT APPLICABLE", "Y", "nan"],
    "blue_o_points": [],
    "blue_x_points": [
      [0.034, 1],
      [-0.0012, 3],
      [0.00487, 2],
      [0.00599, 2],
      [-0.00083, 3],
      [0.02496, 1],
      [0.02135, 1],
      [0.00363, 2],
      [-0.00126, 3],
      [-0.00086, 3],
      [0.0048, 2],
      [0.02275, 1],
      [-0.00113, 3],
      [0.02329, 1],
      [-0.00088, 3]
    ]
  },
  "QA_intPexForearmProna": {
    "red_x_points": [
      [-0.00056, 2],
      [-0.00084, 0],
      [-0.00039, 2],
      [-0.00023, 2],
      [-0.00038, 2],
      [-0.00186, 0],
      [-0.0004, 2],
      [-0.01723, 0],
      [-0.00038, 2],
      [-0.00036, 2],
      [-0.01462, 0],
      [-0.00167, 0],
      [-0.00052, 2],
      [-0.00024, 2],
      [5e-5, 2],
      [-0.01776, 0],
      [-0.0159, 0],
      [-0.01564, 0],
      [-0.0012, 0],
      [-0.00032, 2],
      [-0.00069, 2],
      [-0.00045, 2],
      [-0.00037, 2],
      [-0.00039, 2],
      [9e-5, 2],
      [0.00093, 1],
      [4e-5, 2],
      [-0.002, 0],
      [-0.00044, 2]
    ],
    "red_o_points": [],
    "y_categories": ["GREATER THAN OR EQUALS TO 80", "LESS THAN 80", "nan"],
    "blue_o_points": [],
    "blue_x_points": [
      [-0.00026, 2],
      [0.04717, 1],
      [-0.00055, 0],
      [-0.00012, 2],
      [0.00078, 2],
      [6e-5, 2],
      [0.00125, 1],
      [9e-5, 2],
      [0.00011, 2],
      [0.00073, 2],
      [-0.00054, 0],
      [2e-5, 2],
      [0.0009, 2],
      [5e-5, 2],
      [0.04404, 1]
    ]
  },
  "QA_yonInjChesttube": {
    "red_x_points": [
      [-0.00262, 2],
      [-0.00192, 2],
      [0.00152, 0],
      [-0.00174, 2],
      [-0.00284, 2],
      [0.00157, 0],
      [-0.00412, 1],
      [-0.00169, 2],
      [-0.00295, 2],
      [-0.00271, 2],
      [0.00107, 0],
      [0.00278, 0],
      [-0.00347, 2],
      [-0.0025, 2],
      [0.00063, 0],
      [0.00111, 0],
      [0.00111, 0],
      [0.001, 0],
      [-0.00348, 1],
      [-0.00196, 2],
      [-0.01489, 1],
      [-0.00315, 2],
      [-0.00281, 2],
      [0.00212, 0],
      [-0.0028, 2],
      [-0.00018, 2],
      [-0.00274, 2],
      [0.00063, 0],
      [-0.00283, 2]
    ],
    "red_o_points": [],
    "y_categories": ["N", "Y", "nan"],
    "blue_o_points": [],
    "blue_x_points": [
      [0.0004, 1],
      [-0.00078, 2],
      [0.00345, 0],
      [0.005, 0],
      [-0.0023, 2],
      [-5e-5, 2],
      [8e-5, 0],
      [0.00481, 0],
      [0.01719, 0],
      [0.01216, 0],
      [0.00311, 0],
      [-6e-5, 2],
      [0.00503, 0],
      [-4e-5, 2],
      [-0.00015, 2]
    ]
  },
  "QA_yonPexPain": {
    "red_x_points": [
      [-0.00621, 1],
      [-0.00075, 1],
      [-0.00098, 1],
      [-0.00059, 1],
      [-0.0007, 1],
      [-0.00124, 0],
      [-0.00059, 1],
      [-0.00658, 1],
      [-0.00188, 0],
      [-0.0002, 1],
      [-0.00374, 1],
      [-0.00014, 0],
      [-0.00849, 1],
      [-0.00064, 1],
      [-0.00035, 1],
      [0.00491, 0],
      [-0.00455, 1],
      [0.00476, 0],
      [-0.00072, 1],
      [0.00699, 0],
      [-0.01682, 2],
      [-0.00755, 1],
      [-0.00043, 1],
      [-0.00111, 1],
      [-0.0127, 2],
      [-0.00152, 1],
      [-0.00625, 1],
      [-0.00037, 1],
      [-0.00806, 1]
    ],
    "red_o_points": [],
    "y_categories": ["N", "Y", "nan"],
    "blue_o_points": [],
    "blue_x_points": [
      [-0.00042, 1],
      [0.02074, 0],
      [0.00236, 0],
      [0.00149, 1],
      [-0.00421, 1],
      [0.00043, 2],
      [5e-5, 1],
      [0.00212, 1],
      [0.02291, 0],
      [0.0187, 0],
      [0.00136, 1],
      [0.00223, 0],
      [0.0091, 0],
      [-0.00029, 1],
      [-4e-5, 1]
    ]
  },
  "QS_mulGraftNerve[FI]": {
    "red_x_points": [
      [-4e-5, 2],
      [-0.0001, 0],
      [-0.0001, 0],
      [-0.00015, 0],
      [-0.00016, 0],
      [-0.00012, 0],
      [-0.00014, 0],
      [-5e-5, 2],
      [-0.00013, 0],
      [-0.00013, 0],
      [-2e-5, 2],
      [-0.00019, 0],
      [-5e-5, 2],
      [-0.00014, 0],
      [-0.00021, 0],
      [-4e-5, 2],
      [-3e-5, 2],
      [-2e-5, 2],
      [-0.00014, 0],
      [-5e-5, 2],
      [-4e-5, 2],
      [-6e-5, 2],
      [-0.00012, 0],
      [-0.0001, 0],
      [-5e-5, 2],
      [0.00046, 1],
      [-4e-5, 2],
      [-0.00012, 0],
      [-4e-5, 2]
    ],
    "red_o_points": [],
    "y_categories": ["N", "NOT APPLICABLE", "nan"],
    "blue_o_points": [],
    "blue_x_points": [
      [0.00068, 1],
      [-4e-5, 2],
      [-8e-5, 0],
      [-7e-5, 0],
      [-3e-5, 2],
      [0.00052, 1],
      [0.00052, 1],
      [-0.00014, 0],
      [-2e-5, 2],
      [-1e-5, 2],
      [-0.00011, 0],
      [0.00052, 1],
      [-3e-5, 2],
      [0.00046, 1],
      [-4e-5, 2]
    ]
  },
  "QA_lstPexPalle[Ulna]": {
    "red_x_points": [
      [-0.00086, 4],
      [-0.00283, 4],
      [-0.00182, 4],
      [-0.00679, 2],
      [-0.0032, 4],
      [-0.00965, 1],
      [-0.00285, 4],
      [-0.0006, 4],
      [-0.00374, 4],
      [0.01063, 3],
      [-0.00896, 1],
      [-0.00327, 4],
      [-0.0011, 4],
      [-0.00338, 4],
      [-0.0016, 4],
      [0.00471, 3],
      [-0.00836, 0],
      [0.00295, 3],
      [-0.00714, 0],
      [0.00437, 3],
      [-0.00096, 4],
      [-0.00083, 4],
      [-0.00339, 4],
      [-0.00322, 4],
      [-0.00042, 4],
      [0.00239, 3],
      [-0.00041, 4],
      [-0.00684, 0],
      [-0.00089, 4]
    ],
    "red_o_points": [],
    "y_categories": ["ABS", "HYPO", "NAIA", "PT", "nan"],
    "blue_o_points": [],
    "blue_x_points": [
      [-0.00034, 4],
      [-0.00042, 4],
      [0.01647, 3],
      [0.01717, 3],
      [-0.00011, 4],
      [-0.00017, 4],
      [0.00218, 3],
      [-0.00239, 4],
      [-0.00014, 4],
      [0.00012, 4],
      [0.01261, 3],
      [-0.00023, 4],
      [0.00434, 3],
      [-0.00015, 4],
      [0.00911, 3]
    ]
  }
}
