{
  "QS_mulTransfSite[AcSsAA]": {
    "red_x_points": [
      [-0.00201, 3],
      [-0.00666, 2],
      [-0.00143, 0],
      [-0.00623, 2],
      [-0.00638, 2],
      [-0.0015, 0],
      [-0.00131, 0],
      [-0.00168, 3],
      [-0.00161, 0],
      [-0.00617, 2],
      [-0.00154, 0],
      [-0.00188, 3],
      [0.00992, 1],
      [-0.002, 3],
      [-0.00915, 2],
      [-0.00201, 3],
      [-0.00104, 0],
      [-0.00145, 0],
      [-0.00189, 3],
      [-0.00172, 3],
      [-0.0017, 3],
      [-0.00624, 2],
      [-0.00199, 3],
      [-0.00179, 3],
      [-0.00194, 3],
      [-0.00149, 0],
      [-0.00186, 3],
      [-0.00594, 2],
      [-0.00192, 3],
      [0.0097, 1],
      [-0.0012, 0]
    ],
    "red_o_points": [],
    "y_categories": ["N", "NOT APPLICABLE", "Y", "nan"],
    "blue_o_points": [],
    "blue_x_points": [
      [0.01191, 1],
      [-0.00094, 3],
      [0.01015, 1],
      [0.00121, 0],
      [-0.00093, 3],
      [0.00908, 1],
      [0.01087, 1]
    ]
  },
  "participant_code": {
    "red_x_points": [
      [-0.04125, 1],
      [-0.04222, 2],
      [-0.04078, 3],
      [-0.04241, 4],
      [-0.04069, 5],
      [-0.04167, 6],
      [-0.04213, 7],
      [-0.04101, 8],
      [-0.04106, 9],
      [-0.04101, 10],
      [-0.04185, 11],
      [-0.04064, 12],
      [-0.0418, 14],
      [-0.04167, 16],
      [-0.04208, 17],
      [-0.04176, 19],
      [-0.04176, 20],
      [-0.04045, 22],
      [-0.0412, 23],
      [-0.04069, 25],
      [-0.04111, 26],
      [-0.04227, 27],
      [-0.04027, 28],
      [-0.04143, 29],
      [-0.04204, 30],
      [-0.0398, 32],
      [-0.04171, 33],
      [-0.0419, 34],
      [-0.04176, 35],
      [-0.04069, 36],
      [-0.04129, 37]
    ],
    "red_o_points": [],
    "y_categories": [
      "P16554",
      "P18297",
      "P19283",
      "P19287",
      "P23391",
      "P31645",
      "P31691",
      "P34778",
      "P35046",
      "P36328",
      "P43633",
      "P4544",
      "P46417",
      "P48965",
      "P53068",
      "P5497",
      "P59529",
      "P62483",
      "P64658",
      "P65202",
      "P66816",
      "P6751",
      "P7408",
      "P75566",
      "P76226",
      "P79971",
      "P82621",
      "P82990",
      "P84932",
      "P85825",
      "P86989",
      "P8770",
      "P87791",
      "P90550",
      "P93159",
      "P94969",
      "P96710",
      "P9744",
      "nan"
    ],
    "blue_o_points": [],
    "blue_x_points": [
      [0.12218, 0],
      [0.12188, 13],
      [0.11804, 15],
      [0.12034, 18],
      [0.12142, 21],
      [0.11942, 24],
      [0.12172, 31]
    ]
  },
  "QA_mulInjOrthesisType[ArmSling]": {
    "red_x_points": [
      [-0.01926, 2],
      [-0.01771, 2],
      [-0.01804, 2],
      [-0.01708, 2],
      [-0.01763, 2],
      [-0.01805, 2],
      [-0.01814, 2],
      [-0.01923, 2],
      [-0.01726, 2],
      [-0.01744, 2],
      [-0.01737, 2],
      [-0.01964, 2],
      [0.04738, 1],
      [-0.01921, 2],
      [-0.01706, 2],
      [-0.01917, 2],
      [-0.02046, 0],
      [-0.01816, 2],
      [-0.0188, 2],
      [-0.01938, 2],
      [-0.0227, 0],
      [-0.02078, 3],
      [-0.01955, 2],
      [0.05269, 1],
      [-0.01889, 2],
      [-0.01779, 2],
      [-0.0193, 2],
      [-0.01737, 2],
      [-0.02198, 3],
      [-0.03286, 3],
      [-0.0179, 2]
    ],
    "red_o_points": [],
    "y_categories": ["N", "NOT APPLICABLE", "Y", "nan"],
    "blue_o_points": [],
    "blue_x_points": [
      [-0.0079, 2],
      [0.05538, 1],
      [0.04625, 1],
      [0.05757, 1],
      [0.05548, 1],
      [0.04578, 1],
      [0.04647, 1]
    ]
  },
  "QS_lstBpsurgSide": {
    "red_x_points": [
      [-0.00652, 3],
      [-0.00883, 0],
      [-0.00872, 0],
      [-0.00877, 0],
      [-0.01716, 2],
      [-0.00835, 0],
      [-0.00903, 0],
      [-0.00522, 3],
      [-0.00842, 0],
      [-0.0166, 2],
      [-0.01785, 2],
      [-0.00629, 3],
      [0.02522, 1],
      [-0.00593, 3],
      [-0.0216, 2],
      [-0.00612, 3],
      [-0.01931, 2],
      [-0.01797, 2],
      [-0.00632, 3],
      [-0.00619, 3],
      [-0.00484, 3],
      [-0.00722, 0],
      [-0.00617, 3],
      [-0.006, 3],
      [-0.00661, 3],
      [-0.01749, 2],
      [-0.00621, 3],
      [-0.01668, 2],
      [-0.00451, 3],
      [0.02625, 1],
      [-0.00837, 0]
    ],
    "red_o_points": [],
    "y_categories": ["L", "NOT APPLICABLE", "R", "nan"],
    "blue_o_points": [],
    "blue_x_points": [
      [0.05624, 1],
      [-0.00193, 3],
      [0.0266, 1],
      [0.00806, 0],
      [-0.00201, 3],
      [0.03056, 1],
      [0.03325, 1]
    ]
  },
  "QS_mulBpsurgeryType[Lysis]": {
    "red_x_points": [
      [-0.002, 3],
      [-0.00217, 0],
      [-0.0053, 2],
      [-0.00224, 0],
      [-0.00219, 0],
      [-0.00579, 2],
      [-0.00246, 0],
      [-0.00138, 3],
      [-0.00222, 0],
      [-0.00221, 0],
      [-0.00224, 0],
      [-0.00188, 3],
      [0.00375, 1],
      [-0.00173, 3],
      [-0.00161, 0],
      [-0.00181, 3],
      [-0.00583, 2],
      [-0.00239, 0],
      [-0.00191, 3],
      [-0.00173, 3],
      [-0.00154, 3],
      [-0.00191, 0],
      [-0.00154, 3],
      [-0.00177, 3],
      [-0.00177, 3],
      [-0.00249, 0],
      [-0.00168, 3],
      [-0.00216, 0],
      [-0.00159, 3],
      [0.00722, 1],
      [-0.00484, 2]
    ],
    "red_o_points": [],
    "y_categories": ["N", "NOT APPLICABLE", "Y", "nan"],
    "blue_o_points": [],
    "blue_x_points": [
      [0.01429, 1],
      [0.0, 3],
      [0.00759, 1],
      [0.00139, 0],
      [-0.00044, 3],
      [0.00714, 1],
      [0.00846, 1]
    ]
  },
  "QA_lstPexMuscstrength[ShoulderAbduc]": {
    "red_x_points": [
      [-0.01065, 1],
      [-0.01028, 1],
      [-0.01079, 1],
      [-0.01041, 1],
      [-0.00997, 1],
      [-0.01006, 1],
      [-0.0102, 1],
      [-0.0106, 1],
      [-0.00997, 1],
      [-0.01015, 1],
      [-0.0107, 1],
      [-0.00979, 1],
      [0.00606, 2],
      [0.00884, 2],
      [0.00892, 2],
      [0.00933, 2],
      [0.00846, 2],
      [-0.00975, 1],
      [-0.01021, 1],
      [-0.01044, 1],
      [-0.01044, 1],
      [-0.00986, 1],
      [0.00879, 2],
      [-0.0212, 1],
      [-0.01022, 1],
      [-0.00992, 1],
      [-0.01019, 1],
      [-0.00982, 1],
      [-0.0098, 1],
      [0.00619, 2],
      [-0.0103, 1]
    ],
    "red_o_points": [],
    "y_categories": ["GREATER THAN OR EQUALS TO 3", "LESS THAN 3", "nan"],
    "blue_o_points": [],
    "blue_x_points": [
      [0.00671, 2],
      [0.00998, 2],
      [0.04487, 0],
      [0.01131, 2],
      [0.00923, 2],
      [0.04419, 0],
      [-0.00413, 1]
    ]
  },
  "QS_mulNeuromadSite[C5]": {
    "red_x_points": [
      [-0.00099, 2],
      [-0.00199, 0],
      [-0.00219, 0],
      [-0.00167, 0],
      [-0.00209, 0],
      [-0.00197, 0],
      [-0.00207, 0],
      [-0.0006, 2],
      [-0.00175, 0],
      [-0.00193, 0],
      [-0.00205, 0],
      [-0.00102, 2],
      [-0.00052, 1],
      [-0.0011, 2],
      [-0.00217, 0],
      [-0.00082, 2],
      [-0.00147, 0],
      [-0.00211, 0],
      [-0.00088, 2],
      [-0.0009, 2],
      [-0.00036, 2],
      [-0.00137, 0],
      [-0.0009, 2],
      [-0.00037, 2],
      [-0.00097, 2],
      [-0.00187, 0],
      [-0.00103, 2],
      [-0.002, 0],
      [-0.00043, 2],
      [0.00217, 1],
      [-0.00177, 0]
    ],
    "red_o_points": [],
    "y_categories": ["N", "NOT APPLICABLE", "nan"],
    "blue_o_points": [],
    "blue_x_points": [
      [0.01426, 1],
      [0.00036, 2],
      [0.00241, 1],
      [0.00171, 0],
      [0.00028, 2],
      [0.00305, 1],
      [0.00438, 1]
    ]
  },
  "QS_mulNeuromadSite[C7]": {
    "red_x_points": [
      [-0.0002, 2],
      [-0.00043, 0],
      [-0.00035, 0],
      [-0.00035, 0],
      [-0.00039, 0],
      [-0.00035, 0],
      [-0.00049, 0],
      [-0.00018, 2],
      [-0.00039, 0],
      [-0.00037, 0],
      [-0.00045, 0],
      [-0.00018, 2],
      [-0.00091, 1],
      [-0.00019, 2],
      [-0.00039, 0],
      [-0.00019, 2],
      [-0.00019, 0],
      [-0.00038, 0],
      [-0.00023, 2],
      [-0.00022, 2],
      [-0.0001, 2],
      [-0.00032, 0],
      [-0.00018, 2],
      [-0.00012, 2],
      [-0.00026, 2],
      [-0.00036, 0],
      [-0.00019, 2],
      [-0.0003, 0],
      [-0.00011, 2],
      [0.00049, 1],
      [-0.00027, 0]
    ],
    "red_o_points": [],
    "y_categories": ["N", "NOT APPLICABLE", "nan"],
    "blue_o_points": [],
    "blue_x_points": [
      [0.00319, 1],
      [0.00018, 2],
      [0.00056, 1],
      [0.00081, 0],
      [7e-5, 2],
      [0.00053, 1],
      [0.0007, 1]
    ]
  },
  "QA_mulInjOrthesisType[ShoulderSupport]": {
    "red_x_points": [
      [-0.02561, 0],
      [-0.02301, 0],
      [-0.02426, 0],
      [-0.02429, 0],
      [-0.02357, 0],
      [-0.02425, 0],
      [-0.02487, 0],
      [-0.03092, 2],
      [-0.02512, 0],
      [-0.02435, 0],
      [-0.02392, 0],
      [-0.02642, 0],
      [0.06627, 1],
      [-0.02645, 0],
      [-0.02382, 0],
      [-0.02592, 0],
      [-0.03025, 2],
      [-0.02449, 0],
      [-0.02613, 0],
      [-0.0257, 0],
      [-0.02989, 2],
      [-0.02948, 3],
      [-0.02625, 0],
      [0.07346, 1],
      [-0.02666, 0],
      [-0.02408, 0],
      [-0.02565, 0],
      [-0.02362, 0],
      [-0.03171, 3],
      [-0.04582, 3],
      [-0.02448, 0]
    ],
    "red_o_points": [],
    "y_categories": ["N", "NOT APPLICABLE", "Y", "nan"],
    "blue_o_points": [],
    "blue_x_points": [
      [-0.01093, 0],
      [0.07642, 1],
      [0.06334, 1],
      [0.07705, 1],
      [0.07821, 1],
      [0.06331, 1],
      [0.06377, 1]
    ]
  },
  "QS_mulTransfSite[IMc]": {
    "red_x_points": [
      [-0.00129, 3],
      [-0.00396, 2],
      [-0.00183, 0],
      [-0.00165, 0],
      [-0.00158, 0],
      [-0.00152, 0],
      [-0.00167, 0],
      [-0.00105, 3],
      [-0.00188, 0],
      [-0.00186, 0],
      [-0.00179, 0],
      [-0.0013, 3],
      [0.00387, 1],
      [-0.00132, 3],
      [-0.00128, 0],
      [-0.00146, 3],
      [-0.00509, 2],
      [-0.00205, 0],
      [-0.00127, 3],
      [-0.00128, 3],
      [-0.00101, 3],
      [-0.00152, 0],
      [-0.00148, 3],
      [-0.00122, 3],
      [-0.00114, 3],
      [-0.00176, 0],
      [-0.00127, 3],
      [-0.00409, 2],
      [-0.00101, 3],
      [0.00567, 1],
      [-0.00371, 2]
    ],
    "red_o_points": [],
    "y_categories": ["N", "NOT APPLICABLE", "Y", "nan"],
    "blue_o_points": [],
    "blue_x_points": [
      [0.00943, 1],
      [-6e-5, 3],
      [0.00549, 1],
      [0.00066, 0],
      [-0.0004, 3],
      [0.00586, 1],
      [0.007, 1]
    ]
  },
  "QS_mulNeuromadSite[T2]": {
    "red_x_points": [
      [-0.0039, 2],
      [-0.01063, 0],
      [-0.01049, 0],
      [-0.01045, 0],
      [-0.0105, 0],
      [-0.01037, 0],
      [-0.01113, 0],
      [-0.00279, 2],
      [-0.01058, 0],
      [-0.01027, 0],
      [-0.01053, 0],
      [-0.00385, 2],
      [0.01068, 1],
      [-0.00345, 2],
      [-0.00984, 0],
      [-0.00403, 2],
      [-0.00896, 0],
      [-0.01035, 0],
      [-0.00355, 2],
      [-0.00367, 2],
      [-0.00205, 2],
      [-0.00888, 0],
      [-0.0038, 2],
      [-0.00267, 2],
      [-0.0039, 2],
      [-0.01022, 0],
      [-0.0039, 2],
      [-0.01019, 0],
      [-0.00213, 2],
      [0.01714, 1],
      [-0.01026, 0]
    ],
    "red_o_points": [],
    "y_categories": ["N", "NOT APPLICABLE", "nan"],
    "blue_o_points": [],
    "blue_x_points": [
      [0.052, 1],
      [-0.00013, 2],
      [0.01941, 1],
      [0.00273, 0],
      [0.00041, 2],
      [0.01943, 1],
      [0.02487, 1]
    ]
  },
  "QS_mulTransfSite[Oberlin]": {
    "red_x_points": [
      [-0.00524, 3],
      [-0.01637, 0],
      [-0.01624, 0],
      [-0.01547, 0],
      [-0.00734, 2],
      [-0.00724, 2],
      [-0.01618, 0],
      [-0.00479, 3],
      [-0.00729, 2],
      [-0.00811, 2],
      [-0.0078, 2],
      [-0.00556, 3],
      [0.02458, 1],
      [-0.00568, 3],
      [-0.00758, 2],
      [-0.00577, 3],
      [-0.01537, 0],
      [-0.00789, 2],
      [-0.00579, 3],
      [-0.00576, 3],
      [-0.00445, 3],
      [-0.01485, 0],
      [-0.00564, 3],
      [-0.00467, 3],
      [-0.00556, 3],
      [-0.00775, 2],
      [-0.0051, 3],
      [-0.01441, 0],
      [-0.00453, 3],
      [0.02417, 1],
      [-0.016, 0]
    ],
    "red_o_points": [],
    "y_categories": ["N", "NOT APPLICABLE", "Y", "nan"],
    "blue_o_points": [],
    "blue_x_points": [
      [0.04869, 1],
      [-0.0021, 3],
      [0.02762, 1],
      [0.00321, 2],
      [-0.0015, 3],
      [0.02605, 1],
      [0.0321, 1]
    ]
  },
  "QS_mulNeuromadSite[C8]": {
    "red_x_points": [
      [-0.00137, 2],
      [-0.0031, 0],
      [-0.00307, 0],
      [-0.00312, 0],
      [-0.00289, 0],
      [-0.00331, 0],
      [-0.0032, 0],
      [-0.00109, 2],
      [-0.00351, 0],
      [-0.00326, 0],
      [-0.00303, 0],
      [-0.00134, 2],
      [0.00014, 1],
      [-0.0017, 2],
      [-0.00395, 0],
      [-0.00167, 2],
      [-0.00233, 0],
      [-0.00343, 0],
      [-0.00154, 2],
      [-0.00153, 2],
      [-0.00083, 2],
      [-0.00275, 0],
      [-0.00186, 2],
      [-0.00158, 2],
      [-0.00147, 2],
      [-0.003, 0],
      [-0.00144, 2],
      [-0.00306, 0],
      [-0.00074, 2],
      [0.00502, 1],
      [-0.00344, 0]
    ],
    "red_o_points": [],
    "y_categories": ["N", "NOT APPLICABLE", "nan"],
    "blue_o_points": [],
    "blue_x_points": [
      [0.01889, 1],
      [-1e-5, 2],
      [0.00591, 1],
      [0.0029, 0],
      [5e-5, 2],
      [0.00455, 1],
      [0.00875, 1]
    ]
  },
  "QA_mulInjTbpiCause[Motorcycle]": {
    "red_x_points": [
      [0.00232, 0],
      [-0.0011, 1],
      [-0.00131, 1],
      [-0.00142, 1],
      [-0.00138, 1],
      [-0.00128, 1],
      [-0.00112, 1],
      [-0.00145, 1],
      [-0.00149, 1],
      [-0.00133, 1],
      [-0.00141, 1],
      [0.00263, 0],
      [-0.06796, 1],
      [-0.00224, 1],
      [-0.00228, 1],
      [-0.00231, 1],
      [-0.00201, 1],
      [-0.00135, 1],
      [0.00167, 0],
      [-0.00133, 1],
      [-0.00154, 1],
      [-0.0012, 1],
      [-0.00208, 1],
      [-0.00565, 1],
      [0.00285, 0],
      [-0.00122, 1],
      [-0.00147, 1],
      [-0.00122, 1],
      [-0.00155, 1],
      [-0.05586, 1],
      [-0.00128, 1]
    ],
    "red_o_points": [],
    "y_categories": ["N", "Y", "nan"],
    "blue_o_points": [],
    "blue_x_points": [
      [0.03027, 0],
      [-0.00344, 1],
      [0.02806, 0],
      [-0.00533, 1],
      [-0.00318, 1],
      [0.02612, 0],
      [0.03054, 0]
    ]
  },
  "QA_yonInjBpsurg": {
    "red_x_points": [
      [-0.0077, 1],
      [-0.00733, 1],
      [-0.00725, 1],
      [-0.00758, 1],
      [-0.00701, 1],
      [-0.00714, 1],
      [-0.00782, 1],
      [-0.00653, 1],
      [-0.00712, 1],
      [-0.0074, 1],
      [-0.00731, 1],
      [-0.00811, 1],
      [0.00952, 0],
      [-0.00736, 1],
      [-0.00689, 1],
      [-0.00725, 1],
      [-0.00533, 1],
      [-0.00733, 1],
      [-0.00782, 1],
      [-0.00701, 1],
      [-0.0055, 1],
      [-0.00559, 1],
      [-0.00718, 1],
      [-0.00666, 1],
      [-0.00809, 1],
      [-0.00736, 1],
      [-0.00773, 1],
      [-0.00724, 1],
      [-0.00622, 1],
      [0.0159, 0],
      [-0.0073, 1]
    ],
    "red_o_points": [],
    "y_categories": ["N", "Y", "nan"],
    "blue_o_points": [],
    "blue_x_points": [
      [0.05549, 0],
      [-0.00061, 1],
      [0.01887, 0],
      [-0.0029, 1],
      [-0.00067, 1],
      [0.01815, 0],
      [0.02512, 0]
    ]
  },
  "QS_mulNeuromadSite[T1]": {
    "red_x_points": [
      [-0.00164, 2],
      [-0.00527, 0],
      [-0.00528, 0],
      [-0.00479, 0],
      [-0.00475, 0],
      [-0.005, 0],
      [-0.00496, 0],
      [-0.00137, 2],
      [-0.0049, 0],
      [-0.00513, 0],
      [-0.00485, 0],
      [-0.00175, 2],
      [0.00446, 1],
      [-0.00172, 2],
      [-0.00501, 0],
      [-0.00198, 2],
      [-0.00367, 0],
      [-0.00466, 0],
      [-0.00193, 2],
      [-0.00198, 2],
      [-0.00094, 2],
      [-0.004, 0],
      [-0.00201, 2],
      [-0.00193, 2],
      [-0.00182, 2],
      [-0.00494, 0],
      [-0.00192, 2],
      [-0.00522, 0],
      [-0.00083, 2],
      [0.00766, 1],
      [-0.00532, 0]
    ],
    "red_o_points": [],
    "y_categories": ["N", "NOT APPLICABLE", "nan"],
    "blue_o_points": [],
    "blue_x_points": [
      [0.02655, 1],
      [-0.0, 2],
      [0.00923, 1],
      [0.00193, 0],
      [0.00026, 2],
      [0.00982, 1],
      [0.01156, 1]
    ]
  }
}
