{
  "QA_lstPexMuscstrength[ElbowFlex]": {
    "red_x_points": [
      [-0.01063, 1],
      [-0.00025, 2],
      [-0.00968, 1],
      [-0.00969, 1],
      [-0.00999, 1],
      [-0.01052, 1],
      [-0.01062, 1],
      [-0.01006, 1],
      [-0.01039, 1],
      [-0.01023, 1],
      [-0.01103, 1],
      [-0.01122, 1],
      [-0.00063, 2],
      [-0.00229, 2],
      [0.00083, 2],
      [-0.01105, 1],
      [-0.01085, 1],
      [-0.01006, 1],
      [-0.01006, 1],
      [-0.0103, 1],
      [-0.00037, 2],
      [-0.01028, 1],
      [-0.01103, 1],
      [-0.01036, 1],
      [-0.00971, 1],
      [0.00063, 2],
      [-0.00981, 1],
      [-0.01068, 1],
      [-0.00059, 2]
    ],
    "red_o_points": [],
    "y_categories": ["GREATER THAN OR EQUALS TO 3", "LESS THAN 3", "nan"],
    "blue_o_points": [],
    "blue_x_points": [
      [0.00102, 2],
      [-0.00965, 1],
      [0.05495, 0],
      [-0.01037, 1],
      [0.00268, 2],
      [0.002, 2],
      [0.03829, 0],
      [-0.0092, 1],
      [-0.00991, 1],
      [0.00183, 2],
      [0.05158, 0],
      [0.04087, 0],
      [0.04779, 0],
      [0.03887, 0],
      [-0.00984, 1]
    ]
  },
  "QS_mulGraftNerve[other]": {
    "red_x_points": [
      [3e-5, 2],
      [-0.00037, 0],
      [-0.00027, 0],
      [-0.00012, 0],
      [-0.00035, 0],
      [-0.00015, 0],
      [-0.00023, 0],
      [-0.00014, 2],
      [-0.00025, 0],
      [-0.00014, 0],
      [1e-5, 2],
      [-0.00028, 0],
      [-5e-5, 2],
      [-0.00039, 0],
      [-0.00017, 0],
      [2e-5, 2],
      [3e-5, 2],
      [2e-5, 2],
      [-0.00012, 0],
      [1e-5, 2],
      [-9e-5, 2],
      [-7e-5, 2],
      [-0.00015, 0],
      [-0.00027, 0],
      [-0.00013, 2],
      [0.0002, 1],
      [-9e-5, 2],
      [-0.00022, 0],
      [-0.00015, 2]
    ],
    "red_o_points": [],
    "y_categories": ["N", "NOT APPLICABLE", "nan"],
    "blue_o_points": [],
    "blue_x_points": [
      [0.00168, 1],
      [-3e-5, 2],
      [-8e-5, 0],
      [-0.00014, 0],
      [9e-5, 2],
      [0.00079, 1],
      [0.00039, 1],
      [-0.0001, 0],
      [-5e-5, 2],
      [6e-5, 2],
      [-3e-5, 0],
      [0.00073, 1],
      [2e-5, 2],
      [0.00057, 1],
      [0.0, 2]
    ]
  },
  "QS_mulLysisTrunk[Upper]": {
    "red_x_points": [
      [-0.00074, 3],
      [-0.00534, 0],
      [-0.00365, 0],
      [-0.00294, 0],
      [-0.00371, 0],
      [-0.01396, 2],
      [-0.00368, 0],
      [-0.00118, 3],
      [-0.00357, 0],
      [-0.00336, 0],
      [-0.00103, 3],
      [-0.00328, 0],
      [-0.00103, 3],
      [-0.00457, 0],
      [-0.01221, 2],
      [-0.00112, 3],
      [-0.00076, 3],
      [-0.00098, 3],
      [-0.00328, 0],
      [-0.00075, 3],
      [-0.00091, 3],
      [-0.00091, 3],
      [-0.00375, 0],
      [-0.00367, 0],
      [-0.00094, 3],
      [0.01275, 1],
      [-0.00088, 3],
      [-0.01097, 2],
      [-0.00081, 3]
    ],
    "red_o_points": [],
    "y_categories": ["N", "NOT APPLICABLE", "Y", "nan"],
    "blue_o_points": [],
    "blue_x_points": [
      [0.02308, 1],
      [-0.00036, 3],
      [-0.00148, 0],
      [-0.00139, 0],
      [-0.00016, 3],
      [0.02016, 1],
      [0.01432, 1],
      [-0.00196, 0],
      [-0.00043, 3],
      [-0.00029, 3],
      [-0.00153, 0],
      [0.01643, 1],
      [-0.00062, 3],
      [0.01597, 1],
      [-0.00051, 3]
    ]
  },
  "QS_mulBpsurgeryType[Transf]": {
    "red_x_points": [
      [-4e-5, 3],
      [-0.00063, 2],
      [-0.00212, 0],
      [-0.00047, 2],
      [-0.00056, 2],
      [-0.00035, 2],
      [-0.00051, 2],
      [-8e-5, 3],
      [-0.00044, 2],
      [-0.00029, 2],
      [-2e-5, 3],
      [-0.00039, 2],
      [-7e-5, 3],
      [-0.00053, 2],
      [-0.00055, 2],
      [-2e-5, 3],
      [-6e-5, 3],
      [-4e-5, 3],
      [-0.00035, 2],
      [-3e-5, 3],
      [-0.0001, 3],
      [-0.00013, 3],
      [-0.00049, 2],
      [-0.00054, 2],
      [-0.0001, 3],
      [0.00125, 1],
      [-8e-5, 3],
      [-0.00037, 2],
      [-5e-5, 3]
    ],
    "red_o_points": [],
    "y_categories": ["N", "NOT APPLICABLE", "Y", "nan"],
    "blue_o_points": [],
    "blue_x_points": [
      [0.00307, 1],
      [-4e-5, 3],
      [-0.00018, 2],
      [-0.00039, 2],
      [3e-5, 3],
      [0.00145, 1],
      [0.00119, 1],
      [-0.00033, 2],
      [-6e-5, 3],
      [1e-5, 3],
      [-0.00021, 2],
      [0.00193, 1],
      [-4e-5, 3],
      [0.00172, 1],
      [-1e-5, 3]
    ]
  },
  "participant_code": {
    "red_x_points": [
      [-0.03332, 1],
      [-0.03209, 2],
      [-0.03284, 3],
      [-0.03263, 4],
      [-0.03229, 5],
      [-0.03174, 8],
      [-0.03222, 9],
      [-0.03304, 10],
      [-0.03318, 11],
      [-0.03195, 13],
      [-0.03298, 14],
      [-0.03277, 18],
      [-0.0327, 19],
      [-0.03318, 20],
      [-0.03174, 23],
      [-0.03277, 26],
      [-0.03277, 28],
      [-0.03209, 29],
      [-0.03229, 30],
      [-0.03222, 31],
      [-0.03174, 32],
      [-0.03209, 34],
      [-0.03332, 36],
      [-0.03298, 38],
      [-0.0314, 39],
      [-0.03277, 40],
      [-0.03209, 41],
      [-0.03263, 42],
      [-0.03154, 43]
    ],
    "red_o_points": [],
    "y_categories": [
      "P16554",
      "P18297",
      "P19283",
      "P19287",
      "P23172",
      "P23391",
      "P30595",
      "P31645",
      "P31691",
      "P34778",
      "P35046",
      "P36328",
      "P43633",
      "P4544",
      "P46417",
      "P48965",
      "P53068",
      "P5497",
      "P58556",
      "P59529",
      "P62483",
      "P64658",
      "P65202",
      "P66816",
      "P6751",
      "P7408",
      "P75566",
      "P76226",
      "P79971",
      "P82621",
      "P82990",
      "P84549",
      "P84932",
      "P85825",
      "P86989",
      "P8770",
      "P87791",
      "P90550",
      "P93159",
      "P94969",
      "P96710",
      "P97130",
      "P9744",
      "P98500",
      "nan"
    ],
    "blue_o_points": [],
    "blue_x_points": [
      [0.06399, 0],
      [0.06136, 6],
      [0.06518, 7],
      [0.06215, 12],
      [0.06189, 15],
      [0.0636, 16],
      [0.06136, 17],
      [0.06281, 21],
      [0.06242, 22],
      [0.06281, 24],
      [0.0632, 25],
      [0.06242, 27],
      [0.06202, 33],
      [0.06334, 35],
      [0.06281, 37]
    ]
  },
  "QS_mulGraftNerve[Ac]": {
    "red_x_points": [
      [-3e-5, 2],
      [-8e-5, 0],
      [-0.00012, 0],
      [-2e-5, 0],
      [-0.00012, 0],
      [-5e-5, 0],
      [-0.00012, 0],
      [-3e-5, 2],
      [-0.0001, 0],
      [-2e-5, 0],
      [-1e-5, 2],
      [-0.00012, 0],
      [-3e-5, 2],
      [-9e-5, 0],
      [-8e-5, 0],
      [-1e-5, 2],
      [-1e-5, 2],
      [-1e-5, 2],
      [-2e-5, 0],
      [-1e-5, 2],
      [-3e-5, 2],
      [-1e-5, 2],
      [-7e-5, 0],
      [-5e-5, 0],
      [-3e-5, 2],
      [9e-5, 1],
      [-2e-5, 2],
      [-3e-5, 0],
      [-3e-5, 2]
    ],
    "red_o_points": [],
    "y_categories": ["N", "NOT APPLICABLE", "nan"],
    "blue_o_points": [],
    "blue_x_points": [
      [0.0005, 1],
      [-3e-5, 2],
      [-5e-5, 0],
      [-5e-5, 0],
      [-1e-5, 2],
      [0.00027, 1],
      [0.00022, 1],
      [-0.0001, 0],
      [-2e-5, 2],
      [-1e-5, 2],
      [-5e-5, 0],
      [0.00023, 1],
      [-1e-5, 2],
      [0.00036, 1],
      [-0.0, 2]
    ]
  },
  "QS_mulNeuromadSite[C8]": {
    "red_x_points": [
      [0.0, 2],
      [-0.00128, 0],
      [-0.00037, 0],
      [-0.0004, 0],
      [-0.0005, 0],
      [-0.00036, 0],
      [-0.00046, 0],
      [-6e-5, 2],
      [-0.00033, 0],
      [-0.00027, 0],
      [2e-5, 2],
      [-0.00072, 0],
      [-3e-5, 2],
      [-0.00081, 0],
      [-0.00107, 0],
      [-0.00023, 2],
      [-2e-5, 2],
      [-4e-5, 2],
      [-0.00046, 0],
      [-9e-5, 2],
      [-6e-5, 2],
      [-0.00011, 2],
      [-0.00059, 0],
      [-0.00054, 0],
      [-0.0001, 2],
      [0.00103, 1],
      [-5e-5, 2],
      [-0.00043, 0],
      [-7e-5, 2]
    ],
    "red_o_points": [],
    "y_categories": ["N", "NOT APPLICABLE", "nan"],
    "blue_o_points": [],
    "blue_x_points": [
      [0.00256, 1],
      [-2e-5, 2],
      [-0.00016, 0],
      [-8e-5, 0],
      [0.00017, 2],
      [0.00265, 1],
      [0.00101, 1],
      [-0.00033, 0],
      [2e-5, 2],
      [-0.0, 2],
      [-0.00016, 0],
      [0.00134, 1],
      [-4e-5, 2],
      [0.00158, 1],
      [-0.00016, 2]
    ]
  },
  "QS_mulGraftNerve[Ph]": {
    "red_x_points": [
      [2e-5, 2],
      [-0.00025, 0],
      [-0.0002, 0],
      [-0.0001, 0],
      [-0.00029, 0],
      [-9e-5, 0],
      [-0.00024, 0],
      [-2e-5, 2],
      [-0.0004, 0],
      [-3e-5, 0],
      [-1e-5, 2],
      [-0.00022, 0],
      [2e-5, 2],
      [-0.00028, 0],
      [-0.00014, 0],
      [-0.0, 2],
      [-1e-5, 2],
      [-0.0, 2],
      [-6e-5, 0],
      [-1e-5, 2],
      [1e-5, 2],
      [-0.0, 2],
      [-0.00025, 0],
      [-0.00014, 0],
      [1e-5, 2],
      [0.00027, 1],
      [-1e-5, 2],
      [-9e-5, 0],
      [-0.0, 2]
    ],
    "red_o_points": [],
    "y_categories": ["N", "NOT APPLICABLE", "nan"],
    "blue_o_points": [],
    "blue_x_points": [
      [0.00117, 1],
      [3e-5, 2],
      [-6e-5, 0],
      [-0.00015, 0],
      [-0.0, 2],
      [0.0004, 1],
      [0.00018, 1],
      [-0.00018, 0],
      [4e-5, 2],
      [3e-5, 2],
      [-6e-5, 0],
      [0.00066, 1],
      [1e-5, 2],
      [0.00045, 1],
      [-1e-5, 2]
    ]
  },
  "QS_mulTransfSite[AcSsPA]": {
    "red_x_points": [
      [-0.00018, 3],
      [-0.00077, 0],
      [-0.00077, 0],
      [-0.00066, 0],
      [-0.00079, 0],
      [-0.00064, 0],
      [-0.00078, 0],
      [-0.00029, 3],
      [-0.00082, 0],
      [-0.00075, 0],
      [-0.00021, 3],
      [-0.0008, 0],
      [-0.00016, 3],
      [-0.00073, 0],
      [-0.00274, 2],
      [-0.00027, 3],
      [-0.00014, 3],
      [-0.00026, 3],
      [-0.00071, 0],
      [-0.0002, 3],
      [-0.00015, 3],
      [-0.00016, 3],
      [-0.00061, 0],
      [-0.0006, 0],
      [-0.00023, 3],
      [0.00187, 1],
      [-0.00021, 3],
      [-0.00056, 0],
      [-0.00023, 3]
    ],
    "red_o_points": [],
    "y_categories": ["N", "NOT APPLICABLE", "Y", "nan"],
    "blue_o_points": [],
    "blue_x_points": [
      [0.00429, 1],
      [-0.00012, 3],
      [-0.00023, 0],
      [-0.00059, 0],
      [-0.00011, 3],
      [0.0032, 1],
      [0.00261, 1],
      [-0.00058, 0],
      [-0.00016, 3],
      [-0.00012, 3],
      [-0.00045, 0],
      [0.00313, 1],
      [-0.00011, 3],
      [0.00297, 1],
      [-0.00016, 3]
    ]
  },
  "QA_lstPexPalle[Elbow]": {
    "red_x_points": [
      [-0.00062, 4],
      [-0.00348, 4],
      [-0.00233, 4],
      [-0.00191, 3],
      [-0.00375, 4],
      [-0.00167, 3],
      [-0.00371, 4],
      [-0.0003, 4],
      [-0.00426, 4],
      [-0.00157, 3],
      [-0.00314, 1],
      [-0.00464, 4],
      [-0.00075, 4],
      [-0.00463, 4],
      [-0.00175, 4],
      [0.00026, 3],
      [-0.00873, 0],
      [-0.00017, 3],
      [-0.00717, 2],
      [-0.00044, 3],
      [-0.00055, 4],
      [-0.00055, 4],
      [-0.00523, 4],
      [-0.005, 4],
      [-0.0002, 4],
      [-0.02686, 3],
      [-0.0003, 4],
      [-0.00671, 0],
      [-0.00066, 4]
    ],
    "red_o_points": [],
    "y_categories": ["ABS", "HYPO", "NAIA", "PT", "nan"],
    "blue_o_points": [],
    "blue_x_points": [
      [0.00414, 4],
      [0.00021, 4],
      [0.00395, 3],
      [0.0372, 1],
      [0.00043, 4],
      [0.00451, 4],
      [0.01003, 1],
      [-0.00302, 4],
      [0.00049, 4],
      [0.00051, 4],
      [0.02702, 1],
      [0.00479, 4],
      [0.00063, 3],
      [0.00521, 4],
      [0.00474, 3]
    ]
  },
  "QA_lstPexArthre[Index]": {
    "red_x_points": [
      [-0.00969, 0],
      [-0.00503, 2],
      [-0.00344, 2],
      [-0.00606, 0],
      [-0.00915, 0],
      [0.00747, 1],
      [-0.00919, 0],
      [0.0004, 2],
      [0.00994, 1],
      [-0.01354, 0],
      [0.00298, 1],
      [-0.00721, 2],
      [0.00012, 2],
      [0.00916, 1],
      [-0.00276, 2],
      [0.003, 1],
      [-0.00916, 0],
      [0.00227, 1],
      [-0.00434, 2],
      [-0.01076, 0],
      [0.00033, 2],
      [0.00034, 2],
      [-0.00705, 2],
      [-0.00601, 2],
      [0.00222, 1],
      [-0.00069, 2],
      [0.00034, 2],
      [-0.00581, 0],
      [0.00051, 2]
    ],
    "red_o_points": [],
    "y_categories": ["NPV", "PV", "nan"],
    "blue_o_points": [],
    "blue_x_points": [
      [0.00025, 0],
      [0.00151, 2],
      [0.01253, 1],
      [0.01446, 1],
      [0.00271, 2],
      [-0.00019, 2],
      [0.00175, 1],
      [0.01167, 1],
      [0.00158, 2],
      [0.00165, 2],
      [0.01202, 1],
      [0.00185, 1],
      [0.00316, 1],
      [-0.0002, 2],
      [0.00606, 1]
    ]
  },
  "QA_yonInjTbi": {
    "red_x_points": [
      [0.00791, 0],
      [-0.00197, 2],
      [-0.00254, 0],
      [-0.00128, 0],
      [-0.00159, 2],
      [0.00049, 1],
      [-0.00205, 0],
      [-0.01066, 2],
      [-0.00431, 2],
      [0.0011, 1],
      [-0.00465, 1],
      [-0.00514, 0],
      [0.00765, 0],
      [0.00067, 1],
      [-0.00017, 1],
      [-0.00599, 1],
      [-0.00432, 1],
      [-0.00575, 1],
      [0.0007, 1],
      [-0.00553, 1],
      [0.0066, 0],
      [-0.00612, 1],
      [0.00162, 1],
      [0.00084, 1],
      [-0.00502, 1],
      [-0.00109, 2],
      [-0.01059, 2],
      [0.00024, 1],
      [-0.00694, 1]
    ],
    "red_o_points": [],
    "y_categories": ["N", "Y", "nan"],
    "blue_o_points": [],
    "blue_x_points": [
      [0.00068, 0],
      [-0.00263, 1],
      [0.00258, 1],
      [0.0029, 1],
      [0.01189, 0],
      [3e-5, 1],
      [2e-5, 1],
      [0.00322, 1],
      [0.01421, 0],
      [0.01206, 0],
      [0.0021, 1],
      [2e-5, 2],
      [-0.00389, 1],
      [2e-5, 2],
      [0.01468, 0]
    ]
  },
  "QA_mulInjOrthesisType[ArmSling]": {
    "red_x_points": [
      [-0.00829, 2],
      [-0.00817, 2],
      [-0.00784, 2],
      [-0.00788, 2],
      [-0.00804, 2],
      [-0.00827, 2],
      [-0.00831, 2],
      [-0.00781, 2],
      [-0.00794, 2],
      [-0.00782, 2],
      [-0.00829, 2],
      [-0.00815, 2],
      [-0.00821, 2],
      [-0.00802, 2],
      [-0.02405, 0],
      [-0.00837, 2],
      [-0.00804, 2],
      [-0.02393, 0],
      [-0.02482, 3],
      [-0.00799, 2],
      [-0.00808, 2],
      [-0.00786, 2],
      [-0.00825, 2],
      [-0.00815, 2],
      [-0.02409, 3],
      [-0.02555, 3],
      [-0.02409, 3],
      [-0.00803, 2],
      [-0.00764, 2]
    ],
    "red_o_points": [],
    "y_categories": ["N", "NOT APPLICABLE", "Y", "nan"],
    "blue_o_points": [],
    "blue_x_points": [
      [-0.00724, 2],
      [-0.00762, 2],
      [-0.00763, 2],
      [-0.00779, 2],
      [0.04834, 1],
      [0.04906, 1],
      [0.04796, 1],
      [0.04759, 1],
      [-0.00776, 2],
      [0.04705, 1],
      [-0.00751, 2],
      [0.04752, 1],
      [0.04815, 1],
      [0.04918, 1],
      [-0.00735, 2]
    ]
  },
  "QS_mulGraftNerve[Ul]": {
    "red_x_points": [
      [-0.0, 2],
      [-3e-5, 0],
      [-3e-5, 0],
      [-3e-5, 0],
      [-3e-5, 0],
      [-3e-5, 0],
      [-0.0, 2],
      [-3e-5, 0],
      [-0.0, 2],
      [-3e-5, 0],
      [-0.0, 2],
      [-3e-5, 0],
      [-3e-5, 0],
      [-0.0, 2],
      [-0.0, 2],
      [-0.0, 2],
      [-0.0, 2],
      [-0.0, 2],
      [-3e-5, 0],
      [-3e-5, 0],
      [9e-5, 1],
      [-3e-5, 0],
      [-0.0, 2]
    ],
    "red_o_points": [],
    "y_categories": ["N", "NOT APPLICABLE", "nan"],
    "blue_o_points": [],
    "blue_x_points": [
      [9e-5, 1],
      [-0.0, 2],
      [-3e-5, 0],
      [-0.0, 2],
      [9e-5, 1],
      [9e-5, 1],
      [-3e-5, 0],
      [-0.0, 2],
      [-0.0, 2],
      [-3e-5, 0],
      [-0.0, 2],
      [9e-5, 1]
    ]
  },
  "QA_mulInjOrthesisType[ShoulderSupport]": {
    "red_x_points": [
      [-0.00803, 0],
      [-0.00795, 0],
      [-0.00788, 0],
      [-0.02809, 2],
      [-0.00762, 0],
      [-0.00775, 0],
      [-0.00762, 0],
      [-0.02802, 2],
      [-0.00767, 0],
      [-0.00789, 0],
      [-0.00771, 0],
      [-0.00769, 0],
      [-0.00757, 0],
      [-0.00791, 0],
      [-0.02827, 2],
      [-0.00771, 0],
      [-0.00785, 0],
      [-0.02902, 2],
      [-0.02705, 3],
      [-0.00734, 0],
      [-0.00772, 0],
      [-0.00747, 0],
      [-0.00799, 0],
      [-0.00784, 0],
      [-0.02847, 3],
      [-0.02919, 3],
      [-0.02847, 3],
      [-0.00795, 0],
      [-0.00759, 0]
    ],
    "red_o_points": [],
    "y_categories": ["N", "NOT APPLICABLE", "Y", "nan"],
    "blue_o_points": [],
    "blue_x_points": [
      [-0.00726, 0],
      [-0.00737, 0],
      [-0.00717, 0],
      [-0.0075, 0],
      [0.05704, 1],
      [0.05543, 1],
      [0.05256, 1],
      [0.05455, 1],
      [-0.00681, 0],
      [0.05548, 1],
      [-0.00741, 0],
      [0.05152, 1],
      [0.05686, 1],
      [0.05718, 1],
      [-0.00778, 0]
    ]
  },
  "QA_yonInjUnconscio": {
    "red_x_points": [
      [-0.0147, 1],
      [-0.01349, 1],
      [-0.00187, 2],
      [-0.00213, 2],
      [-0.00182, 2],
      [-0.01625, 1],
      [-0.00209, 2],
      [-0.00262, 2],
      [-0.00215, 2],
      [-0.01655, 1],
      [-0.01476, 1],
      [-0.01633, 1],
      [-0.00326, 2],
      [-0.00225, 2],
      [-0.01082, 1],
      [-0.01506, 1],
      [-0.01493, 1],
      [-0.0115, 1],
      [-0.01176, 1],
      [-0.0146, 1],
      [-0.00349, 2],
      [-0.00277, 2],
      [-0.01653, 1],
      [-0.01565, 1],
      [-0.00299, 2],
      [-0.00244, 2],
      [-0.00296, 2],
      [-0.01496, 1],
      [-0.00385, 2]
    ],
    "red_o_points": [],
    "y_categories": ["N", "Y", "nan"],
    "blue_o_points": [],
    "blue_x_points": [
      [-0.00119, 2],
      [-0.0019, 2],
      [0.05234, 0],
      [-0.00112, 2],
      [-0.00793, 1],
      [-0.00872, 1],
      [0.03469, 0],
      [0.04568, 0],
      [-0.00166, 2],
      [0.0452, 0],
      [0.05365, 0],
      [-0.00179, 2],
      [-0.00915, 1],
      [-0.00199, 2],
      [0.05846, 0]
    ]
  },
  "QA_lstPexInspectio[SurgicalScar]": {
    "red_x_points": [
      [-0.00365, 1],
      [-0.00431, 1],
      [-0.00684, 0],
      [-0.00412, 1],
      [-0.0072, 1],
      [-0.01187, 0],
      [-0.00616, 1],
      [-0.00304, 1],
      [-0.00868, 1],
      [-0.00968, 1],
      [-0.0086, 0],
      [-0.0085, 1],
      [-0.00342, 2],
      [-0.0096, 1],
      [-0.00502, 0],
      [0.00726, 2],
      [0.00442, 2],
      [-0.00871, 1],
      [-0.00508, 1],
      [-0.00524, 1],
      [-0.00243, 2],
      [-0.00448, 1],
      [-0.00887, 1],
      [0.01334, 2],
      [-0.00314, 1],
      [-0.00336, 1],
      [-0.00247, 1],
      [0.00655, 2],
      [-0.00232, 1]
    ],
    "red_o_points": [],
    "y_categories": ["ABS", "NAIA", "PT", "nan"],
    "blue_o_points": [],
    "blue_x_points": [
      [-0.00053, 1],
      [0.01233, 2],
      [0.02435, 2],
      [0.03085, 2],
      [0.00283, 1],
      [0.00043, 1],
      [0.00025, 0],
      [-0.00529, 1],
      [-0.00048, 1],
      [0.00332, 1],
      [0.02177, 2],
      [-0.00036, 1],
      [0.00958, 2],
      [0.00354, 0],
      [0.01261, 2]
    ]
  },
  "QA_intPexWristFlex": {
    "red_x_points": [
      [-0.00048, 2],
      [-0.00067, 2],
      [-0.00051, 2],
      [-0.00035, 2],
      [-0.00062, 2],
      [-0.0011, 0],
      [-0.00073, 2],
      [0.00048, 0],
      [-0.00098, 2],
      [-0.0011, 2],
      [-0.0004, 0],
      [-0.00117, 2],
      [-0.00032, 2],
      [-0.00067, 2],
      [-0.00022, 2],
      [-0.00027, 0],
      [-4e-5, 0],
      [-8e-5, 0],
      [-0.00013, 0],
      [-0.00029, 2],
      [-8e-5, 2],
      [-0.00038, 2],
      [-0.00093, 2],
      [-0.00075, 2],
      [-0.00029, 2],
      [-0.0244, 1],
      [-0.00346, 1],
      [-0.0008, 0],
      [-0.00047, 2]
    ],
    "red_o_points": [],
    "y_categories": ["GREATER THAN OR EQUALS TO 60", "LESS THAN 60", "nan"],
    "blue_o_points": [],
    "blue_x_points": [
      [0.0043, 2],
      [0.00474, 0],
      [0.00081, 0],
      [-0.00062, 2],
      [-6e-5, 2],
      [0.00434, 2],
      [0.00608, 0],
      [-0.00054, 2],
      [8e-5, 2],
      [0.00012, 2],
      [0.01202, 1],
      [0.0045, 2],
      [0.0002, 2],
      [0.00439, 2],
      [0.00088, 0]
    ]
  },
  "QS_mulBpsurgeryType[Lysis]": {
    "red_x_points": [
      [-0.00086, 3],
      [-0.00504, 0],
      [-0.01807, 2],
      [-0.0161, 2],
      [-0.00339, 0],
      [-0.01897, 2],
      [-0.00345, 0],
      [-0.00141, 3],
      [-0.00325, 0],
      [-0.0032, 0],
      [-0.00094, 3],
      [-0.00359, 0],
      [-0.00149, 3],
      [-0.00487, 0],
      [-0.01642, 2],
      [-0.0012, 3],
      [-0.001, 3],
      [-0.0007, 3],
      [-0.00319, 0],
      [-0.00098, 3],
      [-0.00121, 3],
      [-0.00138, 3],
      [-0.00364, 0],
      [-0.00333, 0],
      [-0.00145, 3],
      [0.02009, 1],
      [-0.00106, 3],
      [-0.01721, 2],
      [-0.00143, 3]
    ],
    "red_o_points": [],
    "y_categories": ["N", "NOT APPLICABLE", "Y", "nan"],
    "blue_o_points": [],
    "blue_x_points": [
      [0.0333, 1],
      [-0.00063, 3],
      [-0.001, 0],
      [-0.00139, 0],
      [-0.00017, 3],
      [0.02614, 1],
      [0.02129, 1],
      [-0.00173, 0],
      [-0.00047, 3],
      [-0.00038, 3],
      [-0.00114, 0],
      [0.02318, 1],
      [-0.00041, 3],
      [0.02289, 1],
      [-0.00076, 3]
    ]
  },
  "QS_mulLysisSite[Trunk]": {
    "red_x_points": [
      [-0.00049, 3],
      [-0.00449, 0],
      [-0.00344, 0],
      [-0.00295, 0],
      [-0.00338, 0],
      [-0.01219, 2],
      [-0.00375, 0],
      [-0.00091, 3],
      [-0.00334, 0],
      [-0.00318, 0],
      [-0.00085, 3],
      [-0.00341, 0],
      [-0.0008, 3],
      [-0.00406, 0],
      [-0.01102, 2],
      [-0.00088, 3],
      [-0.0006, 3],
      [-0.00081, 3],
      [-0.003, 0],
      [-0.00058, 3],
      [-0.0006, 3],
      [-0.00065, 3],
      [-0.00338, 0],
      [-0.00338, 0],
      [-0.00082, 3],
      [0.01309, 1],
      [-0.00061, 3],
      [-0.01082, 2],
      [-0.00088, 3]
    ],
    "red_o_points": [],
    "y_categories": ["N", "NOT APPLICABLE", "Y", "nan"],
    "blue_o_points": [],
    "blue_x_points": [
      [0.02095, 1],
      [-0.0004, 3],
      [-0.00154, 0],
      [-0.00189, 0],
      [-0.0, 3],
      [0.01777, 1],
      [0.01369, 1],
      [-0.00196, 0],
      [-0.00021, 3],
      [-0.0003, 3],
      [-0.00154, 0],
      [0.01462, 1],
      [-0.00036, 3],
      [0.01373, 1],
      [-0.0004, 3]
    ]
  },
  "QS_mulGraftTrunk[UpperTrunk]": {
    "red_x_points": [
      [-0.00015, 3],
      [-0.0022, 0],
      [-0.00127, 0],
      [-0.001, 0],
      [-0.00121, 0],
      [-0.00096, 0],
      [-0.00146, 0],
      [-0.0002, 3],
      [-0.00116, 0],
      [-0.00108, 0],
      [-0.00044, 3],
      [-0.0015, 0],
      [-0.00028, 3],
      [-0.00928, 2],
      [-0.00218, 0],
      [-0.00021, 3],
      [-0.00021, 3],
      [-0.00019, 3],
      [-0.00104, 0],
      [-0.00015, 3],
      [-0.00012, 3],
      [-0.00016, 3],
      [-0.00134, 0],
      [-0.00155, 0],
      [-0.00035, 3],
      [0.00453, 1],
      [-0.00018, 3],
      [-0.00097, 0],
      [-0.00017, 3]
    ],
    "red_o_points": [],
    "y_categories": ["N", "NOT APPLICABLE", "Y", "nan"],
    "blue_o_points": [],
    "blue_x_points": [
      [0.00815, 1],
      [-2e-5, 3],
      [-8e-5, 0],
      [0.00012, 0],
      [0.00011, 3],
      [0.00569, 1],
      [0.00417, 1],
      [-0.00028, 0],
      [-2e-5, 3],
      [0.0, 3],
      [-0.00021, 0],
      [0.00499, 1],
      [-0.0002, 3],
      [0.00431, 1],
      [-0.00026, 3]
    ]
  },
  "QS_mulTransfSite[PhMc]": {
    "red_x_points": [
      [-0.00031, 3],
      [-0.00243, 0],
      [-0.0017, 0],
      [-0.0017, 0],
      [-0.00195, 0],
      [-0.00179, 0],
      [-0.00748, 2],
      [-0.0007, 3],
      [-0.00194, 0],
      [-0.00174, 0],
      [-0.00036, 3],
      [-0.00202, 0],
      [-0.00081, 3],
      [-0.00291, 0],
      [-0.00231, 0],
      [-0.00028, 3],
      [-0.00042, 3],
      [-0.00025, 3],
      [-0.00734, 2],
      [-0.00034, 3],
      [-0.00074, 3],
      [-0.00074, 3],
      [-0.00186, 0],
      [-0.00199, 0],
      [-0.00059, 3],
      [0.00771, 1],
      [-0.00074, 3],
      [-0.00166, 0],
      [-0.00077, 3]
    ],
    "red_o_points": [],
    "y_categories": ["N", "NOT APPLICABLE", "Y", "nan"],
    "blue_o_points": [],
    "blue_x_points": [
      [0.01239, 1],
      [-0.00027, 3],
      [-0.00065, 0],
      [-0.00147, 0],
      [-0.00024, 3],
      [0.01019, 1],
      [0.0069, 1],
      [-0.00144, 0],
      [-0.0004, 3],
      [-0.00027, 3],
      [-0.00089, 0],
      [0.00881, 1],
      [-0.0001, 3],
      [0.00789, 1],
      [-0.00028, 3]
    ]
  },
  "QS_mulLysisRoot[C6]": {
    "red_x_points": [
      [-0.00033, 3],
      [-0.00415, 0],
      [-0.01116, 2],
      [-0.0026, 0],
      [-0.00319, 0],
      [-0.00303, 0],
      [-0.00305, 0],
      [-0.00105, 3],
      [-0.00324, 0],
      [-0.00286, 0],
      [-0.00067, 3],
      [-0.00317, 0],
      [-0.00074, 3],
      [-0.00433, 0],
      [-0.00368, 0],
      [-0.00033, 3],
      [-0.00029, 3],
      [-0.00041, 3],
      [-0.00267, 0],
      [-0.00029, 3],
      [-0.00076, 3],
      [-0.00076, 3],
      [-0.00313, 0],
      [-0.0031, 0],
      [-0.00122, 3],
      [0.01028, 1],
      [-0.00082, 3],
      [-0.00903, 2],
      [-0.00099, 3]
    ],
    "red_o_points": [],
    "y_categories": ["N", "NOT APPLICABLE", "Y", "nan"],
    "blue_o_points": [],
    "blue_x_points": [
      [0.02021, 1],
      [-0.00026, 3],
      [-0.00102, 0],
      [-0.00166, 0],
      [0.00014, 3],
      [0.01436, 1],
      [0.00964, 1],
      [-0.00191, 0],
      [-0.00024, 3],
      [-0.00022, 3],
      [-0.00161, 0],
      [0.01189, 1],
      [-0.00019, 3],
      [0.01202, 1],
      [-0.00039, 3]
    ]
  },
  "QA_lstPexInspectio[ShoulderSubdisloc]": {
    "red_x_points": [
      [-0.00287, 1],
      [-0.0053, 1],
      [0.00303, 0],
      [-0.00325, 1],
      [-0.00722, 1],
      [-0.00246, 2],
      [-0.00618, 1],
      [-0.00328, 1],
      [-0.00842, 1],
      [-0.00898, 1],
      [-0.00071, 2],
      [-0.00855, 1],
      [-0.00256, 1],
      [-0.00977, 1],
      [-0.00289, 1],
      [-0.00456, 2],
      [-0.00042, 2],
      [0.00045, 1],
      [-0.00434, 1],
      [-0.00097, 1],
      [-0.01493, 0],
      [0.00456, 2],
      [-0.00135, 2],
      [-0.00113, 2],
      [-0.00193, 1],
      [-0.01519, 2],
      [-0.00233, 1],
      [-0.00084, 2],
      [-0.00343, 1]
    ],
    "red_o_points": [],
    "y_categories": ["ABS", "NAIA", "PT", "nan"],
    "blue_o_points": [],
    "blue_x_points": [
      [0.00444, 1],
      [0.00932, 2],
      [0.03529, 0],
      [0.00781, 2],
      [0.00113, 1],
      [0.00592, 1],
      [0.00415, 0],
      [-0.00351, 1],
      [0.01436, 2],
      [0.00081, 1],
      [0.02766, 0],
      [0.00401, 1],
      [0.00212, 1],
      [-0.00146, 2],
      [0.00375, 1]
    ]
  },
  "QS_mulGraftLevel[Trunk]": {
    "red_x_points": [
      [-0.00014, 3],
      [-0.0018, 0],
      [-0.00151, 0],
      [-0.00143, 0],
      [-0.00167, 0],
      [-0.0012, 0],
      [-0.00159, 0],
      [-0.00039, 3],
      [-0.00112, 0],
      [-0.0014, 0],
      [-0.00021, 3],
      [-0.00141, 0],
      [-0.00042, 3],
      [-0.0086, 2],
      [-0.00207, 0],
      [-0.00021, 3],
      [-0.0001, 3],
      [-0.00014, 3],
      [-0.00134, 0],
      [-0.00011, 3],
      [-0.00033, 3],
      [-0.00021, 3],
      [-0.00145, 0],
      [-0.00164, 0],
      [-0.00045, 3],
      [0.00433, 1],
      [-0.00032, 3],
      [-0.00124, 0],
      [-0.00042, 3]
    ],
    "red_o_points": [],
    "y_categories": ["N", "NOT APPLICABLE", "Y", "nan"],
    "blue_o_points": [],
    "blue_x_points": [
      [0.00887, 1],
      [-0.00025, 3],
      [-0.00011, 0],
      [3e-5, 0],
      [0.0002, 3],
      [0.00662, 1],
      [0.00383, 1],
      [-0.0005, 0],
      [-0.00016, 3],
      [6e-5, 3],
      [-0.00034, 0],
      [0.00629, 1],
      [-8e-5, 3],
      [0.00442, 1],
      [-0.0003, 3]
    ]
  },
  "QA_lstPexPain[C7]": {
    "red_x_points": [
      [-0.00188, 1],
      [-0.00333, 2],
      [-0.00257, 2],
      [-0.00138, 1],
      [-0.00449, 2],
      [-0.00335, 1],
      [-0.00228, 1],
      [-0.00709, 0],
      [-0.00425, 1],
      [0.0057, 0],
      [-0.00212, 1],
      [-0.00648, 2],
      [0.00176, 2],
      [-0.00591, 2],
      [-0.00219, 2],
      [-0.00801, 0],
      [-0.00071, 1],
      [-0.00621, 0],
      [-0.00393, 2],
      [-0.00526, 0],
      [0.00141, 2],
      [0.00202, 2],
      [-0.0075, 2],
      [-0.00593, 2],
      [-0.00469, 0],
      [-0.00341, 1],
      [-0.00126, 1],
      [-0.00168, 1],
      [-0.00131, 1]
    ],
    "red_o_points": [],
    "y_categories": ["NORM", "NPV", "nan"],
    "blue_o_points": [],
    "blue_x_points": [
      [7e-5, 1],
      [0.00651, 1],
      [0.01469, 0],
      [0.02041, 0],
      [0.00652, 2],
      [0.0002, 2],
      [0.00107, 1],
      [0.00711, 2],
      [0.00649, 2],
      [0.01342, 0],
      [-3e-5, 1],
      [-0.00213, 0],
      [0.00339, 0],
      [0.00859, 1]
    ]
  },
  "QS_mulBpsurgeryType[Graft]": {
    "red_x_points": [
      [-5e-5, 3],
      [-0.00093, 0],
      [-0.00087, 0],
      [-0.00065, 0],
      [-0.00088, 0],
      [-0.00085, 0],
      [-0.00102, 0],
      [-0.00014, 3],
      [-0.00092, 0],
      [-0.0007, 0],
      [-0.00011, 3],
      [-0.00087, 0],
      [-0.00019, 3],
      [-0.00532, 2],
      [-0.00091, 0],
      [-0.0001, 3],
      [-7e-5, 3],
      [-6e-5, 3],
      [-0.00079, 0],
      [-0.00014, 3],
      [-0.0002, 3],
      [-0.00023, 3],
      [-0.00094, 0],
      [-0.0008, 0],
      [-0.00016, 3],
      [0.00296, 1],
      [-0.00016, 3],
      [-0.00086, 0],
      [-0.00012, 3]
    ],
    "red_o_points": [],
    "y_categories": ["N", "NOT APPLICABLE", "Y", "nan"],
    "blue_o_points": [],
    "blue_x_points": [
      [0.0042, 1],
      [-0.00011, 3],
      [-0.00012, 0],
      [-0.00013, 0],
      [-2e-5, 3],
      [0.00369, 1],
      [0.00233, 1],
      [-0.0003, 0],
      [-5e-5, 3],
      [-5e-5, 3],
      [-0.00021, 0],
      [0.00381, 1],
      [-3e-5, 3],
      [0.00325, 1],
      [-0.00017, 3]
    ]
  },
  "QS_mulGraftNerve[Ra]": {
    "red_x_points": [
      [-3e-5, 2],
      [-0.00012, 0],
      [-6e-5, 0],
      [-6e-5, 0],
      [-9e-5, 0],
      [-6e-5, 0],
      [-6e-5, 0],
      [-2e-5, 2],
      [-3e-5, 0],
      [-9e-5, 0],
      [-2e-5, 2],
      [-6e-5, 0],
      [-1e-5, 2],
      [-0.00022, 0],
      [-0.00013, 0],
      [-2e-5, 2],
      [-0.0, 2],
      [-2e-5, 2],
      [-3e-5, 0],
      [-3e-5, 2],
      [-3e-5, 2],
      [-2e-5, 2],
      [-9e-5, 0],
      [-9e-5, 0],
      [-3e-5, 2],
      [0.0002, 1],
      [-3e-5, 2],
      [-3e-5, 0],
      [-3e-5, 2]
    ],
    "red_o_points": [],
    "y_categories": ["N", "NOT APPLICABLE", "nan"],
    "blue_o_points": [],
    "blue_x_points": [
      [0.00046, 1],
      [-2e-5, 2],
      [-6e-5, 0],
      [-6e-5, 0],
      [-2e-5, 2],
      [0.00046, 1],
      [0.0001, 1],
      [-9e-5, 0],
      [-3e-5, 2],
      [-3e-5, 2],
      [-3e-5, 0],
      [0.00023, 1],
      [-1e-5, 2],
      [0.00036, 1]
    ]
  },
  "QS_mulNeuromadSite[C5]": {
    "red_x_points": [
      [-8e-5, 2],
      [-0.00076, 0],
      [-0.00042, 0],
      [-0.00029, 0],
      [-0.00046, 0],
      [-0.00031, 0],
      [-0.00045, 0],
      [-0.00013, 2],
      [-0.0005, 0],
      [-0.00035, 0],
      [-9e-5, 2],
      [-0.00042, 0],
      [-7e-5, 2],
      [-0.00088, 0],
      [-0.00069, 0],
      [-8e-5, 2],
      [-8e-5, 2],
      [-7e-5, 2],
      [-0.00035, 0],
      [-4e-5, 2],
      [1e-5, 2],
      [-9e-5, 2],
      [-0.00037, 0],
      [-0.00042, 0],
      [-8e-5, 2],
      [0.00138, 1],
      [-5e-5, 2],
      [-0.00031, 0],
      [-5e-5, 2]
    ],
    "red_o_points": [],
    "y_categories": ["N", "NOT APPLICABLE", "nan"],
    "blue_o_points": [],
    "blue_x_points": [
      [0.00208, 1],
      [-5e-5, 2],
      [-0.00023, 0],
      [-0.0003, 0],
      [4e-5, 2],
      [0.00207, 1],
      [0.00095, 1],
      [-0.00038, 0],
      [-9e-5, 2],
      [8e-5, 2],
      [-0.00024, 0],
      [0.00153, 1],
      [-5e-5, 2],
      [0.00107, 1],
      [1e-5, 2]
    ]
  },
  "QS_mulNeuromadSite[C7]": {
    "red_x_points": [
      [-1e-5, 2],
      [-0.0003, 0],
      [-0.00024, 0],
      [-0.00013, 0],
      [-0.00022, 0],
      [-0.00019, 0],
      [-0.00025, 0],
      [-3e-5, 2],
      [-0.0002, 0],
      [-0.00017, 0],
      [-3e-5, 2],
      [-0.00024, 0],
      [1e-5, 2],
      [-0.00023, 0],
      [-0.00018, 0],
      [-3e-5, 2],
      [-3e-5, 2],
      [-2e-5, 2],
      [-0.00021, 0],
      [-4e-5, 2],
      [-2e-5, 2],
      [-0.0, 2],
      [-0.00023, 0],
      [-0.00034, 0],
      [-4e-5, 2],
      [0.00071, 1],
      [-2e-5, 2],
      [-0.00015, 0],
      [-2e-5, 2]
    ],
    "red_o_points": [],
    "y_categories": ["N", "NOT APPLICABLE", "nan"],
    "blue_o_points": [],
    "blue_x_points": [
      [0.00137, 1],
      [2e-5, 2],
      [-0.00014, 0],
      [-0.00016, 0],
      [-2e-5, 2],
      [0.00063, 1],
      [0.00039, 1],
      [-0.00015, 0],
      [-1e-5, 2],
      [-2e-5, 2],
      [-0.00017, 0],
      [0.00064, 1],
      [-2e-5, 2],
      [0.00054, 1],
      [-3e-5, 2]
    ]
  },
  "QS_mulLysisRoot[C5]": {
    "red_x_points": [
      [-0.00036, 3],
      [-0.00251, 0],
      [-0.00753, 2],
      [-0.00126, 0],
      [-0.00173, 0],
      [-0.00159, 0],
      [-0.00168, 0],
      [-0.00062, 3],
      [-0.00167, 0],
      [-0.00163, 0],
      [-0.00048, 3],
      [-0.00175, 0],
      [-0.00082, 3],
      [-0.00249, 0],
      [-0.00207, 0],
      [-0.00031, 3],
      [-0.0003, 3],
      [-0.00046, 3],
      [-0.00144, 0],
      [-0.00049, 3],
      [-0.00071, 3],
      [-0.00056, 3],
      [-0.0017, 0],
      [-0.00128, 0],
      [-0.00059, 3],
      [0.00639, 1],
      [-0.00046, 3],
      [-0.00618, 2],
      [-0.00064, 3]
    ],
    "red_o_points": [],
    "y_categories": ["N", "NOT APPLICABLE", "Y", "nan"],
    "blue_o_points": [],
    "blue_x_points": [
      [0.01206, 1],
      [-0.00028, 3],
      [-0.00041, 0],
      [-0.00062, 0],
      [-0.00019, 3],
      [0.00824, 1],
      [0.00599, 1],
      [-0.00115, 0],
      [-0.0003, 3],
      [-0.00022, 3],
      [-0.00021, 0],
      [0.00767, 1],
      [-0.00031, 3],
      [0.00698, 1],
      [-0.00035, 3]
    ]
  },
  "QS_mulTransfSite[IMc]": {
    "red_x_points": [
      [-0.00073, 3],
      [-0.01818, 2],
      [-0.00342, 0],
      [-0.01538, 2],
      [-0.00351, 0],
      [-0.00283, 0],
      [-0.00333, 0],
      [-0.00121, 3],
      [-0.00325, 0],
      [-0.00275, 0],
      [-0.00085, 3],
      [-0.00355, 0],
      [-0.00119, 3],
      [-0.00537, 0],
      [-0.01639, 2],
      [-0.00096, 3],
      [-0.00089, 3],
      [-0.00097, 3],
      [-0.0031, 0],
      [-0.00075, 3],
      [-0.00129, 3],
      [-0.00099, 3],
      [-0.00352, 0],
      [-0.01792, 2],
      [-0.00138, 3],
      [0.0189, 1],
      [-0.00115, 3],
      [-0.0161, 2],
      [-0.00127, 3]
    ],
    "red_o_points": [],
    "y_categories": ["N", "NOT APPLICABLE", "Y", "nan"],
    "blue_o_points": [],
    "blue_x_points": [
      [0.03193, 1],
      [-0.00058, 3],
      [-0.00092, 0],
      [-0.00057, 0],
      [1e-5, 3],
      [0.0256, 1],
      [0.01957, 1],
      [-0.00174, 0],
      [-0.00059, 3],
      [-0.00029, 3],
      [-0.00078, 0],
      [0.02211, 1],
      [-0.00047, 3],
      [0.02081, 1],
      [-0.0008, 3]
    ]
  },
  "QA_intPexForearmSupin": {
    "red_x_points": [
      [-0.00147, 2],
      [-0.00448, 0],
      [-0.00115, 2],
      [-0.00074, 2],
      [-0.00145, 2],
      [0.00493, 1],
      [-0.00131, 2],
      [0.00316, 1],
      [-0.00161, 2],
      [-0.00183, 2],
      [-0.00894, 0],
      [-0.00955, 0],
      [-0.00094, 2],
      [-0.00172, 2],
      [-0.0005, 2],
      [0.00625, 1],
      [-0.00904, 0],
      [0.00143, 1],
      [0.00178, 1],
      [-0.00091, 2],
      [-0.00082, 2],
      [-0.00088, 2],
      [-0.00178, 2],
      [-0.0019, 2],
      [-2e-5, 2],
      [-0.02706, 1],
      [-0.00039, 2],
      [-0.00471, 0],
      [-0.00116, 2]
    ],
    "red_o_points": [],
    "y_categories": ["GREATER THAN OR EQUALS TO 80", "LESS THAN 80", "nan"],
    "blue_o_points": [],
    "blue_x_points": [
      [0.00472, 2],
      [0.00836, 1],
      [0.01187, 1],
      [-0.00135, 2],
      [0.00015, 2],
      [0.00488, 2],
      [0.00664, 0],
      [-0.0004, 2],
      [-0.0005, 2],
      [0.00014, 2],
      [0.0125, 1],
      [0.00529, 2],
      [0.00039, 2],
      [0.00508, 2],
      [0.00904, 1]
    ]
  },
  "QS_mulGraftNerve[SS]": {
    "red_x_points": [
      [-1e-5, 2],
      [-1e-5, 0],
      [-1e-5, 0],
      [-1e-5, 0],
      [-1e-5, 2],
      [-1e-5, 0],
      [-1e-5, 0],
      [-1e-5, 2],
      [-1e-5, 0],
      [-1e-5, 2],
      [-1e-5, 2],
      [-1e-5, 2],
      [-1e-5, 2],
      [-1e-5, 2],
      [-1e-5, 0],
      [-1e-5, 0],
      [-1e-5, 0],
      [-1e-5, 2]
    ],
    "red_o_points": [],
    "y_categories": ["N", "NOT APPLICABLE", "nan"],
    "blue_o_points": [],
    "blue_x_points": [
      [0.00016, 1],
      [-1e-5, 0],
      [-1e-5, 2],
      [-1e-5, 0],
      [-1e-5, 2]
    ]
  },
  "QS_mulLysisSite[Nerve]": {
    "red_x_points": [
      [-0.00046, 3],
      [-0.00277, 0],
      [-0.00763, 2],
      [-0.00763, 2],
      [-0.00234, 0],
      [-0.00215, 0],
      [-0.00228, 0],
      [-0.00066, 3],
      [-0.00226, 0],
      [-0.0021, 0],
      [-0.00046, 3],
      [-0.00226, 0],
      [-0.00096, 3],
      [-0.00279, 0],
      [-0.00265, 0],
      [-0.00053, 3],
      [-0.0004, 3],
      [-0.00053, 3],
      [-0.00213, 0],
      [-0.00051, 3],
      [-0.00082, 3],
      [-0.00069, 3],
      [-0.00241, 0],
      [-0.00237, 0],
      [-0.00075, 3],
      [0.00812, 1],
      [-0.00059, 3],
      [-0.0018, 0],
      [-0.00076, 3]
    ],
    "red_o_points": [],
    "y_categories": ["N", "NOT APPLICABLE", "Y", "nan"],
    "blue_o_points": [],
    "blue_x_points": [
      [0.01322, 1],
      [-0.00043, 3],
      [-0.00111, 0],
      [-0.00159, 0],
      [-3e-5, 3],
      [0.01072, 1],
      [0.00789, 1],
      [-0.0015, 0],
      [-0.00032, 3],
      [-5e-5, 3],
      [-0.00101, 0],
      [0.01033, 1],
      [-0.00027, 3],
      [0.01006, 1],
      [-0.00036, 3]
    ]
  },
  "QS_mulLysisRoot[C7]": {
    "red_x_points": [
      [-3e-5, 3],
      [-0.00078, 0],
      [-0.00344, 2],
      [-0.00075, 0],
      [-0.00087, 0],
      [-0.00084, 0],
      [-0.00099, 0],
      [-3e-5, 3],
      [-0.00081, 0],
      [-0.00075, 0],
      [-5e-5, 3],
      [-0.00071, 0],
      [-8e-5, 3],
      [-0.00085, 0],
      [-0.00079, 0],
      [-2e-5, 3],
      [-7e-5, 3],
      [-3e-5, 3],
      [-0.00078, 0],
      [-3e-5, 3],
      [-0.00013, 3],
      [-0.00014, 3],
      [-0.00075, 0],
      [-0.00082, 0],
      [-8e-5, 3],
      [0.00236, 1],
      [-8e-5, 3],
      [-0.0008, 0],
      [-0.00017, 3]
    ],
    "red_o_points": [],
    "y_categories": ["N", "NOT APPLICABLE", "Y", "nan"],
    "blue_o_points": [],
    "blue_x_points": [
      [0.00461, 1],
      [0.00011, 3],
      [-0.00025, 0],
      [-0.00064, 0],
      [-3e-5, 3],
      [0.00281, 1],
      [0.00238, 1],
      [-0.00083, 0],
      [0.00023, 3],
      [-3e-5, 3],
      [-0.00045, 0],
      [0.00277, 1],
      [2e-5, 3],
      [0.00259, 1],
      [-0.0, 3]
    ]
  },
  "QS_lstBpsurgSide": {
    "red_x_points": [
      [-0.00049, 3],
      [-0.012, 0],
      [-0.01204, 0],
      [-0.01015, 0],
      [-0.01175, 0],
      [-0.01212, 0],
      [-0.01166, 0],
      [-0.00104, 3],
      [-0.01295, 0],
      [0.00065, 2],
      [-0.00074, 3],
      [-0.00032, 2],
      [-0.00098, 3],
      [-0.00065, 2],
      [-0.00276, 2],
      [-0.00052, 3],
      [-0.00034, 3],
      [-0.00044, 3],
      [-0.00766, 0],
      [-0.00032, 3],
      [-0.00087, 3],
      [-0.00112, 3],
      [-0.00053, 2],
      [0.00024, 2],
      [-0.0011, 3],
      [0.01297, 1],
      [-0.00096, 3],
      [-0.01074, 0],
      [-0.00074, 3]
    ],
    "red_o_points": [],
    "y_categories": ["L", "NOT APPLICABLE", "R", "nan"],
    "blue_o_points": [],
    "blue_x_points": [
      [0.02913, 1],
      [-0.00036, 3],
      [0.004, 2],
      [0.00637, 2],
      [0.00024, 3],
      [0.01776, 1],
      [0.01207, 1],
      [-0.001, 0],
      [-0.00054, 3],
      [2e-5, 3],
      [0.00305, 2],
      [0.01503, 1],
      [-0.00017, 3],
      [0.0156, 1],
      [-8e-5, 3]
    ]
  },
  "QS_mulTransfSite[AcMc]": {
    "red_x_points": [
      [-0.00012, 3],
      [-0.00188, 0],
      [-0.00078, 0],
      [-0.00077, 0],
      [-0.00088, 0],
      [-0.0007, 0],
      [-0.001, 0],
      [-0.00023, 3],
      [-0.00107, 0],
      [-0.00942, 2],
      [-0.0001, 3],
      [-0.00089, 0],
      [-0.00032, 3],
      [-0.00175, 0],
      [-0.00169, 0],
      [-0.00015, 3],
      [-7e-5, 3],
      [-0.00014, 3],
      [-0.00076, 0],
      [-0.00035, 3],
      [-0.0002, 3],
      [-0.00021, 3],
      [-0.0009, 0],
      [-0.00103, 0],
      [-0.00022, 3],
      [0.00272, 1],
      [-0.00016, 3],
      [-0.00079, 0],
      [-6e-5, 3]
    ],
    "red_o_points": [],
    "y_categories": ["N", "NOT APPLICABLE", "Y", "nan"],
    "blue_o_points": [],
    "blue_x_points": [
      [0.00622, 1],
      [-0.00014, 3],
      [0.00196, 0],
      [0.00213, 0],
      [0.00032, 3],
      [0.0047, 1],
      [0.00254, 1],
      [-0.00046, 0],
      [-9e-5, 3],
      [0.00015, 3],
      [0.00063, 0],
      [0.00302, 1],
      [-2e-5, 3],
      [0.00311, 1],
      [-0.00016, 3]
    ]
  },
  "QS_mulTransfSite[Other]": {
    "red_x_points": [
      [-0.00107, 3],
      [-0.01075, 0],
      [-0.00871, 0],
      [-0.00815, 0],
      [-0.0088, 0],
      [-0.00895, 0],
      [-0.00895, 0],
      [-0.00108, 3],
      [-0.00917, 0],
      [-0.00957, 0],
      [-0.00112, 3],
      [-0.00881, 0],
      [-0.00123, 3],
      [-0.00962, 0],
      [-0.00869, 0],
      [-0.00132, 3],
      [-0.00098, 3],
      [-0.00125, 3],
      [-0.00775, 0],
      [-0.00105, 3],
      [-0.00128, 3],
      [-0.0012, 3],
      [-0.00978, 0],
      [-0.00904, 0],
      [-0.00122, 3],
      [0.01649, 1],
      [-0.0011, 3],
      [-0.00929, 0],
      [-0.00129, 3]
    ],
    "red_o_points": [],
    "y_categories": ["N", "NOT APPLICABLE", "Y", "nan"],
    "blue_o_points": [],
    "blue_x_points": [
      [0.03203, 1],
      [-0.00065, 3],
      [-0.0081, 0],
      [-0.00746, 0],
      [-0.00052, 3],
      [0.02398, 1],
      [0.02012, 1],
      [-0.00644, 0],
      [-0.00083, 3],
      [-0.00057, 3],
      [0.04437, 2],
      [0.01978, 1],
      [-0.00066, 3],
      [0.02051, 1],
      [-0.00085, 3]
    ]
  },
  "QA_yonInjBpsurg": {
    "red_x_points": [
      [-0.00051, 1],
      [-0.0005, 1],
      [-0.00063, 1],
      [-0.00058, 1],
      [-0.00061, 1],
      [-0.00036, 1],
      [-0.00072, 1],
      [-0.00074, 1],
      [-0.0008, 1],
      [-0.00036, 1],
      [-0.00056, 1],
      [-0.00049, 1],
      [-0.00074, 1],
      [-0.00065, 1],
      [-0.00038, 1],
      [-0.00042, 1],
      [-0.00043, 1],
      [-0.00045, 1],
      [-0.00042, 1],
      [-0.00042, 1],
      [-0.00093, 1],
      [-0.00069, 1],
      [-0.0005, 1],
      [-0.00046, 1],
      [-0.00081, 1],
      [0.00174, 0],
      [-0.0006, 1],
      [-0.0003, 1],
      [-0.00069, 1]
    ],
    "red_o_points": [],
    "y_categories": ["N", "Y", "nan"],
    "blue_o_points": [],
    "blue_x_points": [
      [0.00523, 0],
      [-0.00041, 1],
      [-0.00042, 1],
      [-0.00073, 1],
      [-0.00017, 1],
      [0.00295, 0],
      [0.00257, 0],
      [-0.0005, 1],
      [-0.00043, 1],
      [-0.00036, 1],
      [-0.00039, 1],
      [0.00366, 0],
      [-0.00028, 1],
      [0.00357, 0],
      [-0.0003, 1]
    ]
  },
  "QA_lstPexTouch[C8]": {
    "red_x_points": [
      [-0.00152, 1],
      [-0.00498, 2],
      [-0.00212, 1],
      [-0.00175, 1],
      [-0.00601, 2],
      [-0.00454, 1],
      [-0.00319, 1],
      [-0.00308, 0],
      [-0.00488, 1],
      [0.0108, 0],
      [-0.0024, 1],
      [-0.00872, 2],
      [-0.00253, 2],
      [-0.00761, 2],
      [-0.00266, 2],
      [-0.00074, 0],
      [-0.00152, 1],
      [-0.00178, 0],
      [-0.00381, 2],
      [-0.00131, 0],
      [-0.00234, 2],
      [-0.00483, 0],
      [-0.00552, 1],
      [-0.00813, 2],
      [-0.00286, 0],
      [-0.00764, 1],
      [-0.00114, 2],
      [-0.00218, 1],
      [-0.00098, 1]
    ],
    "red_o_points": [],
    "y_categories": ["NORM", "NPV", "nan"],
    "blue_o_points": [],
    "blue_x_points": [
      [0.00588, 0],
      [0.00636, 1],
      [0.01804, 0],
      [0.02125, 0],
      [0.00453, 2],
      [0.00173, 2],
      [-0.00096, 1],
      [0.00774, 1],
      [0.00365, 2],
      [0.01577, 0],
      [-0.0005, 1],
      [-0.00067, 0],
      [0.00322, 0],
      [0.00391, 0]
    ]
  },
  "QA_lstPexPalle[Clavicle]": {
    "red_x_points": [
      [5e-5, 3],
      [-0.00159, 3],
      [-0.00104, 3],
      [0.0009, 2],
      [-0.002, 3],
      [0.00336, 2],
      [-0.00199, 3],
      [-4e-5, 3],
      [-0.00272, 3],
      [0.00352, 2],
      [-0.01468, 0],
      [-0.0031, 3],
      [-8e-5, 3],
      [-0.00269, 3],
      [-0.00071, 3],
      [-0.01714, 0],
      [-0.01404, 0],
      [0.01146, 2],
      [-0.0048, 1],
      [-0.01758, 1],
      [-0.00024, 3],
      [-2e-5, 3],
      [-0.00341, 3],
      [-0.0026, 3],
      [-9e-5, 3],
      [-0.03103, 2],
      [0.0001, 3],
      [-0.00201, 0],
      [-6e-5, 3]
    ],
    "red_o_points": [],
    "y_categories": ["HYPO", "NAIA", "PT", "nan"],
    "blue_o_points": [],
    "blue_x_points": [
      [0.0061, 3],
      [0.00153, 3],
      [0.00619, 2],
      [0.00752, 2],
      [0.00094, 3],
      [0.00567, 3],
      [0.00754, 0],
      [-0.00193, 3],
      [0.00088, 3],
      [0.00093, 3],
      [0.01289, 0],
      [0.00577, 3],
      [0.0197, 2],
      [0.00584, 3],
      [0.02467, 2]
    ]
  },
  "QS_mulTransfSite[AcSsAA]": {
    "red_x_points": [
      [-0.0002, 3],
      [-0.00148, 2],
      [-0.00625, 0],
      [-0.00668, 0],
      [-0.00077, 2],
      [-0.0081, 0],
      [-0.00655, 0],
      [-0.00049, 3],
      [-0.00694, 0],
      [-0.00768, 0],
      [-0.00023, 3],
      [-0.00582, 0],
      [-0.00055, 3],
      [-0.00031, 2],
      [-0.00434, 0],
      [-0.00069, 3],
      [-0.0001, 3],
      [-0.00024, 3],
      [-0.00088, 2],
      [-0.00051, 3],
      [-0.00071, 3],
      [-0.0005, 3],
      [-0.00626, 0],
      [-0.00069, 2],
      [-0.00047, 3],
      [0.00783, 1],
      [-0.00052, 3],
      [-0.0045, 0],
      [-0.00037, 3]
    ],
    "red_o_points": [],
    "y_categories": ["N", "NOT APPLICABLE", "Y", "nan"],
    "blue_o_points": [],
    "blue_x_points": [
      [0.01727, 1],
      [-0.00028, 3],
      [0.0082, 2],
      [0.00778, 2],
      [2e-5, 3],
      [0.0085, 1],
      [0.00729, 1],
      [-0.00302, 0],
      [1e-5, 3],
      [9e-5, 3],
      [-0.00255, 0],
      [0.01054, 1],
      [0.00011, 3],
      [0.01073, 1],
      [0.00029, 3]
    ]
  },
  "QA_lstPexMuscstrength[WristExte]": {
    "red_x_points": [
      [-0.00696, 1],
      [-0.00453, 2],
      [-0.00509, 1],
      [-0.00429, 1],
      [-0.00708, 1],
      [-0.00603, 1],
      [-0.00556, 1],
      [-0.00131, 0],
      [0.00666, 0],
      [-0.00969, 1],
      [0.00039, 0],
      [0.00601, 0],
      [-0.00345, 2],
      [-0.00721, 2],
      [-0.00264, 2],
      [-0.00326, 0],
      [-0.00169, 1],
      [-0.00176, 0],
      [-0.00577, 1],
      [-0.0068, 1],
      [-0.0034, 2],
      [-0.00608, 1],
      [0.00731, 0],
      [0.00569, 0],
      [-0.00193, 2],
      [-0.00079, 2],
      [-0.00429, 1],
      [-0.00335, 1],
      [-0.00276, 2]
    ],
    "red_o_points": [],
    "y_categories": ["GREATER THAN OR EQUALS TO 3", "LESS THAN 3", "nan"],
    "blue_o_points": [],
    "blue_x_points": [
      [0.00233, 0],
      [0.00526, 1],
      [0.00996, 0],
      [0.01166, 0],
      [0.00204, 2],
      [-0.00015, 2],
      [0.00123, 0],
      [0.00853, 0],
      [0.01601, 0],
      [0.00141, 2],
      [0.00702, 0],
      [-0.00015, 1],
      [0.00722, 0],
      [0.00115, 0],
      [0.00613, 1]
    ]
  },
  "QS_mulNeuromadSite[C6]": {
    "red_x_points": [
      [-3e-5, 2],
      [-0.00028, 0],
      [-0.00012, 0],
      [-0.00013, 0],
      [-0.00015, 0],
      [-8e-5, 0],
      [-0.00013, 0],
      [-8e-5, 2],
      [-0.00014, 0],
      [-0.00016, 0],
      [-4e-5, 2],
      [-0.00012, 0],
      [-7e-5, 2],
      [-0.00022, 0],
      [-0.00034, 0],
      [-4e-5, 2],
      [-2e-5, 2],
      [-0.0, 2],
      [-0.00018, 0],
      [-4e-5, 2],
      [-0.0001, 2],
      [-0.0001, 2],
      [-0.00012, 0],
      [-0.00018, 0],
      [-2e-5, 2],
      [0.00046, 1],
      [-8e-5, 2],
      [-0.00017, 0],
      [-7e-5, 2]
    ],
    "red_o_points": [],
    "y_categories": ["N", "NOT APPLICABLE", "nan"],
    "blue_o_points": [],
    "blue_x_points": [
      [0.00083, 1],
      [-3e-5, 2],
      [-6e-5, 0],
      [-0.00012, 0],
      [9e-5, 2],
      [0.00076, 1],
      [0.0005, 1],
      [-0.0001, 0],
      [-0.0001, 2],
      [2e-5, 2],
      [-0.00013, 0],
      [0.0005, 1],
      [1e-5, 2],
      [0.00059, 1],
      [-1e-5, 2]
    ]
  },
  "QS_mulNeuromadSite[T1]": {
    "red_x_points": [
      [-1e-5, 2],
      [-0.00067, 0],
      [-0.00041, 0],
      [-0.00015, 0],
      [-0.00046, 0],
      [-0.00018, 0],
      [-0.00056, 0],
      [-0.00018, 2],
      [-0.00051, 0],
      [-0.00029, 0],
      [-2e-5, 2],
      [-0.00031, 0],
      [-7e-5, 2],
      [-0.00067, 0],
      [-0.00044, 0],
      [-4e-5, 2],
      [-3e-5, 2],
      [-9e-5, 2],
      [-0.00022, 0],
      [-7e-5, 2],
      [-8e-5, 2],
      [-2e-5, 2],
      [-0.00042, 0],
      [-0.00046, 0],
      [-0.00011, 2],
      [0.00031, 1],
      [-9e-5, 2],
      [-0.00022, 0],
      [-9e-5, 2]
    ],
    "red_o_points": [],
    "y_categories": ["N", "NOT APPLICABLE", "nan"],
    "blue_o_points": [],
    "blue_x_points": [
      [0.00326, 1],
      [6e-5, 2],
      [-0.0001, 0],
      [-0.00017, 0],
      [-3e-5, 2],
      [0.00159, 1],
      [0.0008, 1],
      [-0.0002, 0],
      [-2e-5, 2],
      [-5e-5, 2],
      [-8e-5, 0],
      [0.00092, 1],
      [-7e-5, 2],
      [0.00072, 1],
      [-6e-5, 2]
    ]
  },
  "QA_lstPexTouch[C7]": {
    "red_x_points": [
      [-0.0011, 1],
      [-0.00871, 2],
      [-0.00409, 1],
      [-0.00361, 1],
      [-0.01144, 2],
      [-0.00645, 1],
      [-0.0063, 1],
      [-0.00529, 0],
      [-0.00843, 1],
      [-0.00922, 1],
      [-0.00192, 1],
      [-0.01469, 2],
      [-0.00301, 2],
      [-0.01537, 2],
      [-0.00496, 2],
      [-0.00282, 0],
      [-0.00149, 1],
      [-0.00353, 0],
      [-0.009, 2],
      [-0.00299, 0],
      [-0.00226, 2],
      [-0.00708, 0],
      [-0.00913, 1],
      [-0.01156, 2],
      [-0.00354, 0],
      [-0.00404, 1],
      [-0.00087, 2],
      [-0.0025, 1],
      [0.00107, 1]
    ],
    "red_o_points": [],
    "y_categories": ["NORM", "NPV", "nan"],
    "blue_o_points": [],
    "blue_x_points": [
      [-0.00025, 1],
      [0.01187, 1],
      [0.03991, 0],
      [0.04993, 0],
      [0.00507, 2],
      [0.00019, 2],
      [-0.00028, 1],
      [-0.00425, 1],
      [0.0114, 1],
      [0.00519, 2],
      [0.03805, 0],
      [-5e-5, 1],
      [-0.0014, 0],
      [0.00379, 0],
      [0.00515, 0]
    ]
  },
  "QA_yonInjPhysio": {
    "red_x_points": [
      [-0.00809, 0],
      [0.00046, 0],
      [0.00014, 0],
      [0.0002, 0],
      [-0.00179, 2],
      [-0.00018, 0],
      [0.00028, 0],
      [-0.00604, 0],
      [0.00065, 0],
      [-0.00761, 1],
      [-0.00608, 0],
      [0.00155, 0],
      [-0.00882, 0],
      [-0.00517, 1],
      [-0.00134, 1],
      [0.0048, 1],
      [-0.0074, 0],
      [0.00442, 1],
      [0.00021, 0],
      [-0.007, 0],
      [0.00485, 1],
      [0.0039, 1],
      [0.00141, 0],
      [-0.00682, 1],
      [-0.01018, 2],
      [-0.01388, 1],
      [-0.00994, 2],
      [6e-5, 0],
      [0.00468, 1]
    ],
    "red_o_points": [],
    "y_categories": ["N", "Y", "nan"],
    "blue_o_points": [],
    "blue_x_points": [
      [0.00618, 0],
      [0.00828, 1],
      [0.00535, 0],
      [0.0075, 0],
      [0.00958, 1],
      [0.0053, 0],
      [0.00258, 0],
      [0.0016, 0],
      [-0.00124, 0],
      [0.00756, 1],
      [0.00385, 0],
      [0.00351, 0],
      [0.00719, 1],
      [-0.00285, 1],
      [0.00838, 1]
    ]
  },
  "QS_mulLysisSite[Root]": {
    "red_x_points": [
      [-0.00026, 3],
      [-0.00121, 0],
      [-0.00404, 2],
      [-0.00091, 0],
      [-0.00128, 0],
      [-0.00101, 0],
      [-0.00116, 0],
      [-0.00024, 3],
      [-0.00134, 0],
      [-0.00094, 0],
      [-0.00017, 3],
      [-0.00113, 0],
      [-0.00023, 3],
      [-0.00124, 0],
      [-0.00121, 0],
      [-0.00025, 3],
      [-0.00024, 3],
      [-0.00021, 3],
      [-0.00094, 0],
      [-0.00024, 3],
      [-0.00019, 3],
      [-0.00013, 3],
      [-0.00114, 0],
      [-0.00101, 0],
      [-0.00021, 3],
      [0.00341, 1],
      [-0.00017, 3],
      [-0.00407, 2],
      [-0.00028, 3]
    ],
    "red_o_points": [],
    "y_categories": ["N", "NOT APPLICABLE", "Y", "nan"],
    "blue_o_points": [],
    "blue_x_points": [
      [0.0083, 1],
      [-0.00012, 3],
      [-0.00047, 0],
      [-0.00081, 0],
      [-7e-5, 3],
      [0.00399, 1],
      [0.00365, 1],
      [-0.00059, 0],
      [-8e-5, 3],
      [-0.00012, 3],
      [-0.00017, 0],
      [0.0043, 1],
      [-0.00024, 3],
      [0.00464, 1],
      [-0.0002, 3]
    ]
  },
  "QS_mulNeuromadSite[T2]": {
    "red_x_points": [
      [-5e-5, 2],
      [-0.00101, 0],
      [-0.00086, 0],
      [-0.00059, 0],
      [-0.00062, 0],
      [-0.0006, 0],
      [-0.00069, 0],
      [-6e-5, 2],
      [-0.00076, 0],
      [-0.00057, 0],
      [-0.00011, 2],
      [-0.00073, 0],
      [-4e-5, 2],
      [-0.0012, 0],
      [-0.00126, 0],
      [-3e-5, 2],
      [-5e-5, 2],
      [-4e-5, 2],
      [-0.00067, 0],
      [-2e-5, 2],
      [-8e-5, 2],
      [-5e-5, 2],
      [-0.00074, 0],
      [-0.00065, 0],
      [-8e-5, 2],
      [0.00165, 1],
      [-3e-5, 2],
      [-0.00068, 0],
      [-0.00016, 2]
    ],
    "red_o_points": [],
    "y_categories": ["N", "NOT APPLICABLE", "nan"],
    "blue_o_points": [],
    "blue_x_points": [
      [0.00355, 1],
      [-2e-5, 2],
      [-0.00037, 0],
      [-0.00036, 0],
      [0.00011, 2],
      [0.00311, 1],
      [0.00138, 1],
      [-0.00032, 0],
      [-1e-5, 2],
      [3e-5, 2],
      [-0.00046, 0],
      [0.0021, 1],
      [-3e-5, 2],
      [0.00213, 1],
      [-2e-5, 2]
    ]
  },
  "QS_mulNeuromadSite[C4]": {
    "red_x_points": [
      [-3e-5, 2],
      [-0.00053, 0],
      [-0.00029, 0],
      [-0.00028, 0],
      [-0.00029, 0],
      [-0.00028, 0],
      [-0.00028, 0],
      [-3e-5, 2],
      [-0.00023, 0],
      [-0.00029, 0],
      [-3e-5, 2],
      [-0.00029, 0],
      [3e-5, 2],
      [-0.00031, 0],
      [-0.00041, 0],
      [-3e-5, 2],
      [-1e-5, 2],
      [-3e-5, 2],
      [-0.00028, 0],
      [-2e-5, 2],
      [1e-5, 2],
      [-4e-5, 2],
      [-0.0003, 0],
      [-0.00027, 0],
      [-3e-5, 2],
      [0.00038, 1],
      [-4e-5, 2],
      [-0.00024, 0],
      [-3e-5, 2]
    ],
    "red_o_points": [],
    "y_categories": ["N", "NOT APPLICABLE", "nan"],
    "blue_o_points": [],
    "blue_x_points": [
      [0.00107, 1],
      [-1e-5, 2],
      [-0.00016, 0],
      [-0.00019, 0],
      [0.00012, 2],
      [0.00139, 1],
      [0.00081, 1],
      [-0.00011, 0],
      [-3e-5, 2],
      [1e-5, 2],
      [-0.00023, 0],
      [0.00081, 1],
      [-2e-5, 2],
      [0.00104, 1],
      [-3e-5, 2]
    ]
  },
  "QS_mulLysisNerve[Ssr]": {
    "red_x_points": [
      [-0.00058, 3],
      [-0.00409, 0],
      [-0.01225, 2],
      [-0.01017, 2],
      [-0.00316, 0],
      [-0.00279, 0],
      [-0.00339, 0],
      [-0.0009, 3],
      [-0.00343, 0],
      [-0.00295, 0],
      [-0.00062, 3],
      [-0.00321, 0],
      [-0.00109, 3],
      [-0.0042, 0],
      [-0.00363, 0],
      [-0.00075, 3],
      [-0.00053, 3],
      [-0.00076, 3],
      [-0.00281, 0],
      [-0.00054, 3],
      [-0.00103, 3],
      [-0.00081, 3],
      [-0.00324, 0],
      [-0.00318, 0],
      [-0.00098, 3],
      [0.01116, 1],
      [-0.00094, 3],
      [-0.00279, 0],
      [-0.00114, 3]
    ],
    "red_o_points": [],
    "y_categories": ["N", "NOT APPLICABLE", "Y", "nan"],
    "blue_o_points": [],
    "blue_x_points": [
      [0.02115, 1],
      [-0.00038, 3],
      [-0.001, 0],
      [-0.00214, 0],
      [2e-5, 3],
      [0.01402, 1],
      [0.01088, 1],
      [-0.00236, 0],
      [-0.00052, 3],
      [-0.00015, 3],
      [-0.00157, 0],
      [0.01366, 1],
      [-0.00041, 3],
      [0.01395, 1],
      [-0.00035, 3]
    ]
  },
  "QS_mulTransfSite[Oberlin]": {
    "red_x_points": [
      [-0.00178, 3],
      [-0.02454, 0],
      [-0.02339, 0],
      [-0.02083, 0],
      [-0.023, 0],
      [0.00331, 2],
      [-0.02267, 0],
      [-0.00231, 3],
      [0.00311, 2],
      [0.00308, 2],
      [-0.0017, 3],
      [0.00268, 2],
      [-0.00244, 3],
      [0.00232, 2],
      [-0.02061, 0],
      [-0.00164, 3],
      [-0.00165, 3],
      [-0.00147, 3],
      [-0.02046, 0],
      [-0.00145, 3],
      [-0.00218, 3],
      [-0.00215, 3],
      [0.00341, 2],
      [-0.02245, 0],
      [-0.00202, 3],
      [0.0263, 1],
      [-0.00218, 3],
      [-0.02199, 0],
      [-0.0023, 3]
    ],
    "red_o_points": [],
    "y_categories": ["N", "NOT APPLICABLE", "Y", "nan"],
    "blue_o_points": [],
    "blue_x_points": [
      [0.04187, 1],
      [-0.00124, 3],
      [0.00511, 2],
      [0.00606, 2],
      [-0.00079, 3],
      [0.0349, 1],
      [0.0283, 1],
      [0.0043, 2],
      [-0.00158, 3],
      [-0.00102, 3],
      [0.00526, 2],
      [0.03036, 1],
      [-0.00106, 3],
      [0.03179, 1],
      [-0.00124, 3]
    ]
  },
  "QA_intPexForearmProna": {
    "red_x_points": [
      [-0.00064, 2],
      [-0.00101, 0],
      [-0.00064, 2],
      [-0.00048, 2],
      [-0.0006, 2],
      [-0.00296, 0],
      [-0.00051, 2],
      [-0.01966, 0],
      [-0.00061, 2],
      [-0.00062, 2],
      [-0.0192, 0],
      [-0.00252, 0],
      [-0.0008, 2],
      [-0.00058, 2],
      [2e-5, 2],
      [-0.01945, 0],
      [-0.01963, 0],
      [-0.01802, 0],
      [-0.00172, 0],
      [-0.00061, 2],
      [-0.00059, 2],
      [-0.00064, 2],
      [-0.00051, 2],
      [-0.00056, 2],
      [0.00022, 2],
      [0.00087, 1],
      [0.00024, 2],
      [-0.00291, 0],
      [-0.00072, 2]
    ],
    "red_o_points": [],
    "y_categories": ["GREATER THAN OR EQUALS TO 80", "LESS THAN 80", "nan"],
    "blue_o_points": [],
    "blue_x_points": [
      [-0.00038, 2],
      [0.05749, 1],
      [-0.00062, 0],
      [-0.00029, 2],
      [0.00095, 2],
      [6e-5, 2],
      [0.00146, 1],
      [0.0001, 2],
      [0.00015, 2],
      [0.0011, 2],
      [-0.00024, 0],
      [4e-5, 2],
      [0.00109, 2],
      [0.00011, 2],
      [0.05385, 1]
    ]
  },
  "QA_yonInjChesttube": {
    "red_x_points": [
      [-0.00267, 2],
      [-0.00214, 2],
      [0.00156, 0],
      [-0.00153, 2],
      [-0.00283, 2],
      [0.00109, 0],
      [-0.00396, 1],
      [-0.00185, 2],
      [-0.00318, 2],
      [-0.00267, 2],
      [0.001, 0],
      [0.0029, 0],
      [-0.00371, 2],
      [-0.00259, 2],
      [0.00056, 0],
      [0.00089, 0],
      [0.00062, 0],
      [0.00121, 0],
      [-0.00324, 1],
      [-0.00163, 2],
      [-0.01877, 1],
      [-0.00348, 2],
      [-0.00314, 2],
      [0.00219, 0],
      [-0.0024, 2],
      [-3e-5, 2],
      [-0.00286, 2],
      [0.00054, 0],
      [-0.00323, 2]
    ],
    "red_o_points": [],
    "y_categories": ["N", "Y", "nan"],
    "blue_o_points": [],
    "blue_x_points": [
      [1e-5, 1],
      [-0.00085, 2],
      [0.00349, 0],
      [0.00503, 0],
      [-0.00196, 2],
      [0.00631, 0],
      [0.01881, 0],
      [0.01483, 0],
      [0.00235, 0],
      [-3e-5, 2],
      [0.00494, 0],
      [-1e-5, 2],
      [0.00042, 2]
    ]
  },
  "QA_yonPexPain": {
    "red_x_points": [
      [-0.00805, 1],
      [-0.00093, 1],
      [-0.00086, 1],
      [-0.00062, 1],
      [-0.00098, 1],
      [-0.00149, 0],
      [-0.00062, 1],
      [-0.00795, 1],
      [-0.00288, 0],
      [-0.00114, 1],
      [-0.00562, 1],
      [-0.00059, 0],
      [-0.01087, 1],
      [-0.00086, 1],
      [-0.00043, 1],
      [0.00706, 0],
      [-0.0055, 1],
      [0.00654, 0],
      [-0.00082, 1],
      [0.00938, 0],
      [-0.02175, 2],
      [-0.00987, 1],
      [-0.00018, 1],
      [-0.00094, 1],
      [-0.01508, 2],
      [-0.0018, 1],
      [-0.00758, 1],
      [-0.00021, 1],
      [-0.01071, 1]
    ],
    "red_o_points": [],
    "y_categories": ["N", "Y", "nan"],
    "blue_o_points": [],
    "blue_x_points": [
      [-0.00023, 1],
      [0.02609, 0],
      [0.0042, 0],
      [0.0015, 1],
      [-0.005, 1],
      [0.00092, 2],
      [-2e-5, 1],
      [0.00377, 1],
      [0.02951, 0],
      [0.02064, 0],
      [0.00123, 1],
      [0.0019, 0],
      [0.01119, 0],
      [-0.00039, 1],
      [3e-5, 1]
    ]
  },
  "QS_mulGraftNerve[FI]": {
    "red_x_points": [
      [5e-5, 2],
      [-0.00015, 0],
      [-9e-5, 0],
      [-0.00011, 0],
      [-0.00011, 0],
      [-0.00011, 0],
      [-0.0002, 0],
      [-2e-5, 2],
      [-0.00016, 0],
      [-0.00012, 0],
      [2e-5, 2],
      [-0.00019, 0],
      [-4e-5, 2],
      [-0.00016, 0],
      [-6e-5, 0],
      [2e-5, 2],
      [-1e-5, 2],
      [2e-5, 2],
      [-0.0001, 0],
      [-0.0, 2],
      [-1e-5, 2],
      [-1e-5, 2],
      [-0.00015, 0],
      [-0.00016, 0],
      [-2e-5, 2],
      [0.00035, 1],
      [-4e-5, 2],
      [-0.00014, 0],
      [-1e-5, 2]
    ],
    "red_o_points": [],
    "y_categories": ["N", "NOT APPLICABLE", "nan"],
    "blue_o_points": [],
    "blue_x_points": [
      [0.00074, 1],
      [-1e-5, 2],
      [-7e-5, 0],
      [-9e-5, 0],
      [2e-5, 2],
      [0.00051, 1],
      [0.00018, 1],
      [-3e-5, 0],
      [-1e-5, 2],
      [-0.0, 2],
      [-6e-5, 0],
      [0.00035, 1],
      [2e-5, 2],
      [0.00018, 1]
    ]
  },
  "QA_lstPexPalle[Ulna]": {
    "red_x_points": [
      [-0.00081, 4],
      [-0.00315, 4],
      [-0.00221, 4],
      [-0.00653, 2],
      [-0.0034, 4],
      [-0.01142, 1],
      [-0.00303, 4],
      [-0.00043, 4],
      [-0.00378, 4],
      [0.01225, 3],
      [-0.00829, 1],
      [-0.00402, 4],
      [-0.00094, 4],
      [-0.00397, 4],
      [-0.00153, 4],
      [0.00494, 3],
      [-0.00805, 0],
      [0.00235, 3],
      [-0.00749, 0],
      [0.00421, 3],
      [-0.00074, 4],
      [-0.00076, 4],
      [-0.00396, 4],
      [-0.00335, 4],
      [-0.00039, 4],
      [0.00216, 3],
      [-0.00035, 4],
      [-0.0074, 0],
      [-0.00082, 4]
    ],
    "red_o_points": [],
    "y_categories": ["ABS", "HYPO", "NAIA", "PT", "nan"],
    "blue_o_points": [],
    "blue_x_points": [
      [-0.00057, 4],
      [-3e-5, 4],
      [0.01768, 3],
      [0.0187, 3],
      [-4e-5, 4],
      [-0.00015, 4],
      [0.00193, 3],
      [-0.00311, 4],
      [-0.00027, 4],
      [-0.00018, 4],
      [0.01472, 3],
      [-0.00013, 4],
      [0.00396, 3],
      [-9e-5, 4],
      [0.00849, 3]
    ]
  }
}
