{
  "QA_lstPexMuscstrength[ElbowFlex]": {
    "red_x_points": [
      [-0.00377, 1],
      [0.00064, 2],
      [-0.00164, 1],
      [-0.00161, 1],
      [0.00105, 0],
      [-0.00135, 1],
      [-0.00181, 1],
      [-0.00379, 1],
      [-0.00189, 1],
      [-0.00151, 1],
      [-0.00171, 1],
      [-0.00394, 1],
      [0.00071, 2],
      [0.00394, 2],
      [0.00043, 2],
      [-0.00423, 1],
      [0.00032, 2],
      [-0.00049, 0],
      [-0.00333, 1],
      [-0.00361, 1],
      [-0.00402, 1],
      [-0.00151, 1],
      [0.0035, 2],
      [-0.00146, 0],
      [-0.00431, 1],
      [-0.00149, 1],
      [-0.00375, 1],
      [-0.00143, 1],
      [-0.00417, 1],
      [0.00072, 2],
      [-0.00122, 1]
    ],
    "red_o_points": [],
    "y_categories": ["GREATER THAN OR EQUALS TO 3", "LESS THAN 3", "nan"],
    "blue_o_points": [],
    "blue_x_points": [
      [0.00064, 2],
      [0.00651, 2],
      [0.00364, 0],
      [0.00107, 1],
      [0.00582, 2],
      [0.00456, 0],
      [0.00481, 0]
    ]
  },
  "QS_mulLysisTrunk[Upper]": {
    "red_x_points": [
      [-0.00167, 3],
      [-0.0029, 0],
      [-0.0029, 0],
      [-0.00265, 0],
      [-0.00268, 0],
      [-0.00593, 2],
      [-0.00267, 0],
      [-0.00211, 3],
      [-0.00244, 0],
      [-0.00297, 0],
      [-0.00255, 0],
      [-0.00207, 3],
      [0.00964, 1],
      [-0.00137, 3],
      [-0.00284, 0],
      [-0.0019, 3],
      [-0.00507, 2],
      [-0.00318, 0],
      [-0.00189, 3],
      [-0.00155, 3],
      [-0.00166, 3],
      [-0.00275, 0],
      [-0.00153, 3],
      [-0.00195, 3],
      [-0.00174, 3],
      [-0.00295, 0],
      [-0.00171, 3],
      [-0.00271, 0],
      [-0.00155, 3],
      [0.00762, 1],
      [-0.00537, 2]
    ],
    "red_o_points": [],
    "y_categories": ["N", "NOT APPLICABLE", "Y", "nan"],
    "blue_o_points": [],
    "blue_x_points": [
      [0.01007, 1],
      [-0.00086, 3],
      [0.00858, 1],
      [-0.00118, 0],
      [-0.00046, 3],
      [0.00914, 1],
      [0.01126, 1]
    ]
  },
  "QS_mulBpsurgeryType[Transf]": {
    "red_x_points": [
      [-0.00033, 3],
      [-0.00044, 2],
      [-0.00104, 0],
      [-0.00047, 2],
      [-0.00056, 2],
      [-0.00046, 2],
      [-0.00046, 2],
      [-0.00042, 3],
      [-0.00032, 2],
      [-0.00052, 2],
      [-0.0004, 2],
      [-0.00038, 3],
      [0.00127, 1],
      [-0.00039, 3],
      [-0.00051, 2],
      [-0.0004, 3],
      [-0.00033, 2],
      [-0.00044, 2],
      [-0.00027, 3],
      [-0.00027, 3],
      [-0.00041, 3],
      [-0.00046, 2],
      [-0.00032, 3],
      [-0.00028, 3],
      [-0.00031, 3],
      [-0.00037, 2],
      [-0.00036, 3],
      [-0.00049, 2],
      [-0.00032, 3],
      [0.00157, 1],
      [-0.00039, 2]
    ],
    "red_o_points": [],
    "y_categories": ["N", "NOT APPLICABLE", "Y", "nan"],
    "blue_o_points": [],
    "blue_x_points": [
      [0.00142, 1],
      [-0.00023, 3],
      [0.0019, 1],
      [-0.00047, 2],
      [-0.00016, 3],
      [0.00191, 1],
      [0.00197, 1]
    ]
  },
  "QS_mulNeuromadSite[T1]": {
    "red_x_points": [
      [-0.00117, 2],
      [-0.00396, 0],
      [-0.00426, 0],
      [-0.00434, 0],
      [-0.00457, 0],
      [-0.00419, 0],
      [-0.00368, 0],
      [-0.00111, 2],
      [-0.00373, 0],
      [-0.00354, 0],
      [-0.00393, 0],
      [-0.00141, 2],
      [0.00714, 1],
      [-0.00133, 2],
      [-0.0041, 0],
      [-0.00137, 2],
      [-0.00374, 0],
      [-0.00477, 0],
      [-0.00134, 2],
      [-0.00125, 2],
      [-0.00117, 2],
      [-0.00364, 0],
      [-0.0013, 2],
      [-0.00142, 2],
      [-0.00145, 2],
      [-0.00379, 0],
      [-0.0014, 2],
      [-0.00411, 0],
      [-0.00092, 2],
      [0.00751, 1],
      [-0.00391, 0]
    ],
    "red_o_points": [],
    "y_categories": ["N", "NOT APPLICABLE", "nan"],
    "blue_o_points": [],
    "blue_x_points": [
      [0.0137, 1],
      [-4e-5, 2],
      [0.00882, 1],
      [-6e-5, 0],
      [-0.00036, 2],
      [0.0092, 1],
      [0.00952, 1]
    ]
  },
  "QS_mulNeuromadSite[T2]": {
    "red_x_points": [
      [-0.00146, 2],
      [-0.00582, 0],
      [-0.00631, 0],
      [-0.0058, 0],
      [-0.00559, 0],
      [-0.00585, 0],
      [-0.00592, 0],
      [-0.00156, 2],
      [-0.00569, 0],
      [-0.00573, 0],
      [-0.006, 0],
      [-0.00214, 2],
      [0.00981, 1],
      [-0.00146, 2],
      [-0.00631, 0],
      [-0.00217, 2],
      [-0.00549, 0],
      [-0.00574, 0],
      [-0.00169, 2],
      [-0.00139, 2],
      [-0.0013, 2],
      [-0.00549, 0],
      [-0.00161, 2],
      [-0.00198, 2],
      [-0.00186, 2],
      [-0.00526, 0],
      [-0.00174, 2],
      [-0.00668, 0],
      [-0.0014, 2],
      [0.01232, 1],
      [-0.00569, 0]
    ],
    "red_o_points": [],
    "y_categories": ["N", "NOT APPLICABLE", "nan"],
    "blue_o_points": [],
    "blue_x_points": [
      [0.01943, 1],
      [-0.00011, 2],
      [0.01352, 1],
      [6e-5, 0],
      [-0.0001, 2],
      [0.01214, 1],
      [0.01384, 1]
    ]
  },
  "QA_mulInjOrthesisType[ShoulderSupport]": {
    "red_x_points": [
      [-0.01001, 0],
      [-0.00958, 0],
      [-0.00961, 0],
      [-0.00956, 0],
      [-0.00985, 0],
      [-0.0096, 0],
      [-0.00955, 0],
      [-0.01124, 2],
      [-0.00875, 0],
      [-0.0098, 0],
      [-0.00973, 0],
      [-0.01022, 0],
      [0.02624, 1],
      [-0.0101, 0],
      [-0.00975, 0],
      [-0.01017, 0],
      [-0.01154, 2],
      [-0.01013, 0],
      [-0.00972, 0],
      [-0.0106, 0],
      [-0.01226, 2],
      [-0.01175, 3],
      [-0.0102, 0],
      [0.02948, 1],
      [-0.01032, 0],
      [-0.00942, 0],
      [-0.00999, 0],
      [-0.00934, 0],
      [-0.01202, 3],
      [-0.01435, 3],
      [-0.00924, 0]
    ],
    "red_o_points": [],
    "y_categories": ["N", "NOT APPLICABLE", "Y", "nan"],
    "blue_o_points": [],
    "blue_x_points": [
      [-0.00462, 0],
      [0.0288, 1],
      [0.02445, 1],
      [0.03219, 1],
      [0.02875, 1],
      [0.02516, 1],
      [0.02506, 1]
    ]
  },
  "QS_mulGraftRoot[T1]": {
    "red_x_points": [
      [3e-5, 2],
      [-3e-5, 0],
      [-3e-5, 0],
      [-3e-5, 0],
      [-3e-5, 0],
      [-3e-5, 0],
      [-3e-5, 0],
      [-3e-5, 0],
      [-3e-5, 0],
      [-3e-5, 0],
      [9e-5, 1],
      [3e-5, 2],
      [-3e-5, 0],
      [3e-5, 2],
      [-3e-5, 0],
      [-3e-5, 0],
      [3e-5, 2],
      [-3e-5, 0],
      [3e-5, 2],
      [3e-5, 2],
      [-3e-5, 0],
      [3e-5, 2],
      [-3e-5, 0]
    ],
    "red_o_points": [],
    "y_categories": ["N", "NOT APPLICABLE", "nan"],
    "blue_o_points": [],
    "blue_x_points": [[3e-5, 2], [-3e-5, 0], [3e-5, 2], [9e-5, 1], [9e-5, 1]]
  },
  "QA_yonInjUnconscio": {
    "red_x_points": [
      [-0.00344, 1],
      [-0.00354, 1],
      [-0.00182, 2],
      [-0.00176, 2],
      [0.00656, 0],
      [-0.00368, 1],
      [-0.00182, 2],
      [-0.00402, 2],
      [-0.00229, 2],
      [-0.00141, 2],
      [-0.0037, 1],
      [-0.00487, 1],
      [-0.01891, 1],
      [-0.00463, 2],
      [-0.00178, 2],
      [-0.00423, 2],
      [-0.00345, 1],
      [0.00752, 0],
      [-0.00301, 1],
      [-0.00347, 1],
      [-0.00293, 1],
      [-0.00386, 1],
      [-0.00422, 2],
      [-0.00591, 1],
      [-0.00363, 2],
      [-0.00374, 1],
      [0.00689, 0],
      [-0.00286, 1],
      [-0.00423, 2],
      [-0.0007, 2],
      [-0.00335, 1]
    ],
    "red_o_points": [],
    "y_categories": ["N", "Y", "nan"],
    "blue_o_points": [],
    "blue_x_points": [
      [0.00123, 2],
      [9e-5, 1],
      [0.01157, 0],
      [0.01605, 0],
      [0.02063, 0],
      [0.00174, 2],
      [0.00181, 2]
    ]
  },
  "QS_mulGraftNerve[Ac]": {
    "red_x_points": [
      [-0.00038, 2],
      [-0.00123, 0],
      [-0.00134, 0],
      [-0.00118, 0],
      [-0.00116, 0],
      [-0.00153, 0],
      [-0.00122, 0],
      [-0.00041, 2],
      [-0.00108, 0],
      [-0.0013, 0],
      [-0.00115, 0],
      [-0.00051, 2],
      [0.00239, 1],
      [-0.00022, 2],
      [-0.00137, 0],
      [-0.00045, 2],
      [-0.00138, 0],
      [-0.00138, 0],
      [-0.00032, 2],
      [-0.00029, 2],
      [-0.00029, 2],
      [-0.00111, 0],
      [-0.00037, 2],
      [-0.00039, 2],
      [-0.00034, 2],
      [-0.00144, 0],
      [-0.00054, 2],
      [-0.00121, 0],
      [-0.0003, 2],
      [0.00257, 1],
      [-0.00127, 0]
    ],
    "red_o_points": [],
    "y_categories": ["N", "NOT APPLICABLE", "nan"],
    "blue_o_points": [],
    "blue_x_points": [
      [0.00397, 1],
      [-1e-5, 2],
      [0.00347, 1],
      [-0.00017, 0],
      [0.0, 2],
      [0.00228, 1],
      [0.00326, 1]
    ]
  },
  "QS_mulGraftNerve[Me]": {
    "red_x_points": [
      [-0.00016, 2],
      [-0.00049, 0],
      [-0.00045, 0],
      [-0.00049, 0],
      [-0.00025, 0],
      [-0.00045, 0],
      [-0.00041, 0],
      [-0.00028, 2],
      [-0.00041, 0],
      [-0.00046, 0],
      [-0.00047, 0],
      [-0.0002, 2],
      [0.00104, 1],
      [-0.00022, 2],
      [-0.00048, 0],
      [-0.00029, 2],
      [-0.00038, 0],
      [-0.00051, 0],
      [-0.00023, 2],
      [-0.00017, 2],
      [-0.00019, 2],
      [-0.00047, 0],
      [-0.00018, 2],
      [-0.00029, 2],
      [-0.0002, 2],
      [-0.00039, 0],
      [-0.0001, 2],
      [-0.00042, 0],
      [-0.0001, 2],
      [0.00108, 1],
      [-0.00046, 0]
    ],
    "red_o_points": [],
    "y_categories": ["N", "NOT APPLICABLE", "nan"],
    "blue_o_points": [],
    "blue_x_points": [
      [0.00171, 1],
      [-6e-5, 2],
      [0.00115, 1],
      [-4e-5, 0],
      [-4e-5, 2],
      [0.001, 1],
      [0.00123, 1]
    ]
  },
  "QS_mulNeuromadSite[C8]": {
    "red_x_points": [
      [-0.00116, 2],
      [-0.00394, 0],
      [-0.00362, 0],
      [-0.00298, 0],
      [-0.00333, 0],
      [-0.00372, 0],
      [-0.00369, 0],
      [-0.0012, 2],
      [-0.00299, 0],
      [-0.00365, 0],
      [-0.00364, 0],
      [-0.00146, 2],
      [0.00484, 1],
      [-0.00101, 2],
      [-0.00381, 0],
      [-0.00161, 2],
      [-0.00345, 0],
      [-0.00385, 0],
      [-0.00112, 2],
      [-0.00099, 2],
      [-0.00078, 2],
      [-0.00324, 0],
      [-0.00115, 2],
      [-0.00128, 2],
      [-0.00127, 2],
      [-0.00367, 0],
      [-0.00099, 2],
      [-0.00375, 0],
      [-0.00075, 2],
      [0.00587, 1],
      [-0.0034, 0]
    ],
    "red_o_points": [],
    "y_categories": ["N", "NOT APPLICABLE", "nan"],
    "blue_o_points": [],
    "blue_x_points": [
      [0.01364, 1],
      [0.00068, 2],
      [0.00803, 1],
      [0.0001, 0],
      [6e-5, 2],
      [0.00716, 1],
      [0.00947, 1]
    ]
  },
  "QS_mulGraftNerve[Ph]": {
    "red_x_points": [
      [-0.00023, 2],
      [-0.00122, 0],
      [-0.00137, 0],
      [-0.00128, 0],
      [-0.00113, 0],
      [-0.00085, 0],
      [-0.00126, 0],
      [-0.00028, 2],
      [-0.00121, 0],
      [-0.00108, 0],
      [-0.00114, 0],
      [-0.00025, 2],
      [0.0018, 1],
      [-0.00026, 2],
      [-0.00131, 0],
      [-0.00043, 2],
      [-0.00105, 0],
      [-0.00136, 0],
      [-0.00029, 2],
      [-0.00024, 2],
      [-0.0002, 2],
      [-0.0011, 0],
      [-0.00027, 2],
      [-0.00034, 2],
      [-0.00018, 2],
      [-0.00106, 0],
      [-0.0002, 2],
      [-0.00119, 0],
      [-0.00015, 2],
      [0.0025, 1],
      [-0.00109, 0]
    ],
    "red_o_points": [],
    "y_categories": ["N", "NOT APPLICABLE", "nan"],
    "blue_o_points": [],
    "blue_x_points": [
      [0.00343, 1],
      [5e-5, 2],
      [0.00264, 1],
      [-0.00019, 0],
      [0.00013, 2],
      [0.00239, 1],
      [0.00309, 1]
    ]
  },
  "QS_mulTransfSite[AcSsPA]": {
    "red_x_points": [
      [-0.00056, 3],
      [-0.00141, 0],
      [-0.00107, 0],
      [-0.00121, 0],
      [-0.00131, 0],
      [-0.00138, 0],
      [-0.00116, 0],
      [-0.00052, 3],
      [-0.00119, 0],
      [-0.00143, 0],
      [-0.00118, 0],
      [-0.00061, 3],
      [0.00333, 1],
      [-0.00052, 3],
      [-0.00113, 0],
      [-0.00052, 3],
      [-0.00266, 2],
      [-0.00135, 0],
      [-0.00062, 3],
      [-0.00038, 3],
      [-0.00052, 3],
      [-0.00119, 0],
      [-0.0005, 3],
      [-0.00056, 3],
      [-0.00049, 3],
      [-0.00121, 0],
      [-0.00054, 3],
      [-0.00107, 0],
      [-0.00059, 3],
      [0.00342, 1],
      [-0.00103, 0]
    ],
    "red_o_points": [],
    "y_categories": ["N", "NOT APPLICABLE", "Y", "nan"],
    "blue_o_points": [],
    "blue_x_points": [
      [0.00405, 1],
      [-0.0002, 3],
      [0.00324, 1],
      [-0.00075, 0],
      [-6e-5, 3],
      [0.00357, 1],
      [0.00363, 1]
    ]
  },
  "QA_lstPexMuscstrength[ScapulaAbducSuprot]": {
    "red_x_points": [
      [-0.00019, 0],
      [0.00018, 2],
      [-0.00014, 1],
      [-0.0003, 1],
      [-6e-5, 0],
      [-0.00045, 1],
      [-0.00029, 1],
      [-0.00042, 1],
      [-0.00018, 0],
      [-0.00013, 0],
      [-0.00024, 1],
      [-0.00055, 1],
      [0.0001, 2],
      [0.00019, 2],
      [9e-5, 2],
      [0.00024, 2],
      [0.0001, 2],
      [-0.00012, 0],
      [-0.00026, 0],
      [-0.00042, 1],
      [-0.00025, 0],
      [-0.00018, 1],
      [0.00018, 2],
      [-0.00025, 0],
      [0.00018, 2],
      [-0.00037, 1],
      [-0.00035, 1],
      [-4e-5, 0],
      [0.00017, 2],
      [0.00019, 2],
      [-0.0002, 1]
    ],
    "red_o_points": [],
    "y_categories": ["GREATER THAN OR EQUALS TO 3", "LESS THAN 3", "nan"],
    "blue_o_points": [],
    "blue_x_points": [
      [0.00074, 2],
      [0.00019, 0],
      [0.00074, 2],
      [0.00032, 2],
      [0.0001, 0],
      [3e-5, 2]
    ]
  },
  "participant_code": {
    "red_x_points": [
      [-0.01568, 1],
      [-0.016, 2],
      [-0.01512, 3],
      [-0.016, 4],
      [-0.016, 5],
      [-0.01568, 6],
      [-0.01549, 7],
      [-0.01558, 8],
      [-0.01745, 9],
      [-0.01568, 10],
      [-0.01549, 11],
      [-0.01502, 12],
      [-0.0153, 14],
      [-0.016, 16],
      [-0.01521, 17],
      [-0.01619, 19],
      [-0.01577, 20],
      [-0.0153, 22],
      [-0.0161, 23],
      [-0.01661, 25],
      [-0.01633, 26],
      [-0.01572, 27],
      [-0.01605, 28],
      [-0.01596, 29],
      [-0.01605, 30],
      [-0.0161, 32],
      [-0.01582, 33],
      [-0.01596, 34],
      [-0.01596, 35],
      [-0.01582, 36],
      [-0.01498, 37]
    ],
    "red_o_points": [],
    "y_categories": [
      "P16554",
      "P18297",
      "P19283",
      "P19287",
      "P23391",
      "P31645",
      "P31691",
      "P34778",
      "P35046",
      "P36328",
      "P43633",
      "P4544",
      "P46417",
      "P48965",
      "P53068",
      "P5497",
      "P59529",
      "P62483",
      "P64658",
      "P65202",
      "P66816",
      "P6751",
      "P7408",
      "P75566",
      "P76226",
      "P79971",
      "P82621",
      "P82990",
      "P84932",
      "P85825",
      "P86989",
      "P8770",
      "P87791",
      "P90550",
      "P93159",
      "P94969",
      "P96710",
      "P9744",
      "nan"
    ],
    "blue_o_points": [],
    "blue_x_points": [
      [0.04553, 0],
      [0.04798, 13],
      [0.04676, 15],
      [0.04568, 18],
      [0.0443, 21],
      [0.04446, 24],
      [0.04722, 31]
    ]
  },
  "QA_lstPexMuscstrength[ShoulderExrot]": {
    "red_x_points": [
      [-0.0017, 1],
      [0.00034, 2],
      [0.00218, 0],
      [-0.00142, 1],
      [-0.00223, 1],
      [-0.00168, 1],
      [0.00025, 2],
      [-0.00153, 1],
      [-0.00182, 1],
      [-0.00171, 1],
      [0.00026, 2],
      [-0.00163, 1],
      [-0.00028, 2],
      [0.00031, 2],
      [0.00027, 2],
      [0.00037, 2],
      [0.0003, 2],
      [-0.00218, 1],
      [-0.00167, 1],
      [-0.00165, 1],
      [-0.00164, 1],
      [0.00023, 2],
      [0.00025, 2],
      [0.00027, 2],
      [0.00038, 2],
      [-0.00182, 1],
      [0.00036, 2],
      [0.00213, 0],
      [0.0004, 2],
      [-0.00033, 2],
      [-0.00188, 1]
    ],
    "red_o_points": [],
    "y_categories": ["GREATER THAN OR EQUALS TO 3", "LESS THAN 3", "nan"],
    "blue_o_points": [],
    "blue_x_points": [
      [4e-5, 2],
      [0.0004, 2],
      [0.00392, 0],
      [0.00062, 2],
      [0.00048, 2],
      [0.00424, 0],
      [0.00018, 1]
    ]
  },
  "QA_mulInjOrthesisType[ArmSling]": {
    "red_x_points": [
      [-0.01061, 2],
      [-0.00936, 2],
      [-0.00981, 2],
      [-0.00917, 2],
      [-0.00939, 2],
      [-0.00978, 2],
      [-0.00945, 2],
      [-0.01068, 2],
      [-0.00953, 2],
      [-0.00951, 2],
      [-0.00964, 2],
      [-0.01015, 2],
      [0.02638, 1],
      [-0.01097, 2],
      [-0.00997, 2],
      [-0.01005, 2],
      [-0.01165, 0],
      [-0.00937, 2],
      [-0.0099, 2],
      [-0.01004, 2],
      [-0.01172, 0],
      [-0.01103, 3],
      [-0.00997, 2],
      [0.02889, 1],
      [-0.01059, 2],
      [-0.00924, 2],
      [-0.01061, 2],
      [-0.00888, 2],
      [-0.01225, 3],
      [-0.01657, 3],
      [-0.00946, 2]
    ],
    "red_o_points": [],
    "y_categories": ["N", "NOT APPLICABLE", "Y", "nan"],
    "blue_o_points": [],
    "blue_x_points": [
      [-0.0045, 2],
      [0.02867, 1],
      [0.0248, 1],
      [0.03048, 1],
      [0.03071, 1],
      [0.02453, 1],
      [0.02431, 1]
    ]
  },
  "QS_mulGraftNerve[Ul]": {
    "red_x_points": [
      [-5e-5, 2],
      [-0.0005, 0],
      [-0.00062, 0],
      [-0.00068, 0],
      [-0.0007, 0],
      [-0.00061, 0],
      [-0.00054, 0],
      [-8e-5, 2],
      [-0.00061, 0],
      [-0.0006, 0],
      [-0.00056, 0],
      [-9e-5, 2],
      [0.00049, 1],
      [-0.00013, 2],
      [-0.00061, 0],
      [-0.00027, 2],
      [-0.00049, 0],
      [-0.00067, 0],
      [-0.00012, 2],
      [-6e-5, 2],
      [-2e-5, 2],
      [-0.00054, 0],
      [-0.00018, 2],
      [-0.00014, 2],
      [-6e-5, 2],
      [-0.0005, 0],
      [-0.00013, 2],
      [-0.00062, 0],
      [-2e-5, 2],
      [0.0008, 1],
      [-0.00054, 0]
    ],
    "red_o_points": [],
    "y_categories": ["N", "NOT APPLICABLE", "nan"],
    "blue_o_points": [],
    "blue_x_points": [
      [0.00197, 1],
      [6e-5, 2],
      [0.00144, 1],
      [0.00017, 0],
      [0.0001, 2],
      [0.00089, 1],
      [0.00162, 1]
    ]
  },
  "QA_lstPexPain[C6]": {
    "red_x_points": [
      [-0.00044, 1],
      [-0.0001, 2],
      [-5e-5, 2],
      [-9e-5, 2],
      [-0.00119, 0],
      [8e-5, 1],
      [0.00011, 1],
      [-0.00109, 0],
      [7e-5, 1],
      [6e-5, 1],
      [6e-5, 1],
      [-0.00029, 1],
      [-0.00056, 2],
      [0.00068, 2],
      [-8e-5, 2],
      [0.0001, 2],
      [-2e-5, 2],
      [0.0002, 1],
      [-0.00077, 0],
      [-0.00052, 1],
      [-0.00055, 1],
      [-7e-5, 2],
      [0.00022, 2],
      [-0.00619, 0],
      [0.0004, 2],
      [-0.00032, 2],
      [-0.00068, 1],
      [-0.00021, 2],
      [-0.00079, 1],
      [0.00014, 1],
      [9e-5, 1]
    ],
    "red_o_points": [],
    "y_categories": ["NORM", "NPV", "nan"],
    "blue_o_points": [],
    "blue_x_points": [
      [0.00021, 1],
      [0.00107, 2],
      [0.00142, 1],
      [0.0014, 1],
      [0.00102, 2],
      [0.001, 1],
      [0.00122, 1]
    ]
  },
  "QS_mulGraftLevel[Nerve]": {
    "red_x_points": [
      [-1e-5, 2],
      [-0.0001, 0],
      [-6e-5, 0],
      [-6e-5, 0],
      [-0.0001, 0],
      [-6e-5, 0],
      [-6e-5, 0],
      [-2e-5, 2],
      [-6e-5, 0],
      [-6e-5, 0],
      [-6e-5, 0],
      [-2e-5, 2],
      [0.0001, 1],
      [-2e-5, 2],
      [-0.0001, 0],
      [-1e-5, 2],
      [-9e-5, 0],
      [-5e-5, 0],
      [-2e-5, 2],
      [-1e-5, 2],
      [-1e-5, 2],
      [-9e-5, 0],
      [-0.0, 2],
      [-1e-5, 2],
      [-1e-5, 2],
      [-0.0001, 0],
      [-1e-5, 2],
      [-0.0001, 0],
      [-1e-5, 2],
      [0.00021, 1],
      [-5e-5, 0]
    ],
    "red_o_points": [],
    "y_categories": ["N", "NOT APPLICABLE", "nan"],
    "blue_o_points": [],
    "blue_x_points": [
      [0.0004, 1],
      [-1e-5, 2],
      [0.00021, 1],
      [-1e-5, 2],
      [0.00021, 1],
      [0.0001, 1]
    ]
  },
  "QS_mulGraftNerve[MCA]": {
    "red_x_points": [
      [-5e-5, 2],
      [-0.00025, 0],
      [-0.00019, 0],
      [-0.00021, 0],
      [-0.00016, 0],
      [-0.00026, 0],
      [-0.00026, 0],
      [-5e-5, 2],
      [-0.00015, 0],
      [-0.00015, 0],
      [-0.00011, 0],
      [-9e-5, 2],
      [0.00028, 1],
      [-0.00012, 2],
      [-0.00022, 0],
      [-0.00011, 2],
      [-0.00012, 0],
      [-0.00026, 0],
      [-0.00013, 2],
      [-0.00013, 2],
      [-0.0001, 2],
      [-0.00015, 0],
      [-7e-5, 2],
      [-0.00021, 2],
      [-7e-5, 2],
      [-0.00014, 0],
      [-0.00011, 2],
      [-0.00017, 0],
      [-0.00011, 2],
      [0.00028, 1],
      [-0.0002, 0]
    ],
    "red_o_points": [],
    "y_categories": ["N", "NOT APPLICABLE", "nan"],
    "blue_o_points": [],
    "blue_x_points": [
      [0.00072, 1],
      [1e-5, 2],
      [0.00053, 1],
      [0.00012, 0],
      [4e-5, 2],
      [0.00044, 1],
      [0.00061, 1]
    ]
  },
  "QA_lstPexInspectio[SurgicalScar]": {
    "red_x_points": [
      [0.00185, 1],
      [0.00097, 1],
      [-0.00029, 0],
      [0.00103, 1],
      [-0.00399, 2],
      [-0.00052, 0],
      [0.00101, 1],
      [0.00236, 1],
      [0.00097, 1],
      [-0.00274, 2],
      [0.00105, 1],
      [-0.00225, 0],
      [-0.00164, 1],
      [-0.00516, 2],
      [0.00109, 1],
      [0.00208, 1],
      [-0.0011, 0],
      [-0.00433, 2],
      [-0.00454, 2],
      [-0.00379, 2],
      [0.00204, 1],
      [0.00091, 1],
      [-0.00463, 2],
      [-0.01183, 2],
      [0.00191, 1],
      [0.0011, 1],
      [-0.00504, 2],
      [-0.00281, 2],
      [0.00154, 1],
      [-0.00126, 1],
      [-0.00234, 2]
    ],
    "red_o_points": [],
    "y_categories": ["ABS", "NAIA", "PT", "nan"],
    "blue_o_points": [],
    "blue_x_points": [
      [0.00028, 1],
      [0.00362, 1],
      [0.00477, 0],
      [0.00401, 1],
      [0.0045, 1],
      [0.00049, 1],
      [0.00497, 0]
    ]
  },
  "QA_intPexWristFlex": {
    "red_x_points": [[0.00053, 2], [-0.01775, 1]],
    "red_o_points": [],
    "y_categories": ["GREATER THAN OR EQUALS TO 60", "LESS THAN 60", "nan"],
    "blue_o_points": [],
    "blue_x_points": [[0.00147, 2], [0.00705, 0], [0.00153, 2], [0.00161, 2]]
  },
  "QS_mulGraftTrunk[LowerTrunk]": {
    "red_x_points": [
      [-5e-5, 2],
      [-2e-5, 0],
      [-2e-5, 0],
      [-2e-5, 0],
      [-2e-5, 0],
      [-5e-5, 2],
      [-5e-5, 2],
      [-2e-5, 0],
      [-5e-5, 2],
      [-5e-5, 2],
      [-5e-5, 2],
      [-5e-5, 2]
    ],
    "red_o_points": [],
    "y_categories": ["N", "NOT APPLICABLE", "nan"],
    "blue_o_points": [],
    "blue_x_points": [[0.00015, 1], [0.00015, 1], [-2e-5, 0]]
  },
  "QS_mulGraftRoot[T2]": {
    "red_x_points": [
      [-2e-5, 2],
      [-7e-5, 0],
      [-7e-5, 0],
      [-7e-5, 0],
      [-9e-5, 0],
      [-7e-5, 0],
      [-9e-5, 0],
      [-0.0, 2],
      [-9e-5, 0],
      [-9e-5, 0],
      [-4e-5, 0],
      [-3e-5, 2],
      [0.00016, 1],
      [-5e-5, 2],
      [-3e-5, 2],
      [-2e-5, 0],
      [-7e-5, 0],
      [-0.0, 2],
      [-0.0, 2],
      [-0.0, 2],
      [-7e-5, 0],
      [-0.0, 2],
      [-5e-5, 2],
      [-9e-5, 0],
      [-9e-5, 0],
      [-0.0, 2],
      [0.00016, 1],
      [-9e-5, 0]
    ],
    "red_o_points": [],
    "y_categories": ["N", "NOT APPLICABLE", "nan"],
    "blue_o_points": [],
    "blue_x_points": [
      [0.00034, 1],
      [2e-5, 2],
      [-2e-5, 0],
      [-0.0, 2],
      [9e-5, 1],
      [0.00016, 1]
    ]
  },
  "QS_mulGraftNerve[LP]": {
    "red_x_points": [
      [-1e-5, 2],
      [-3e-5, 0],
      [-3e-5, 0],
      [-3e-5, 0],
      [-3e-5, 0],
      [-3e-5, 0],
      [-1e-5, 2],
      [-3e-5, 0],
      [-3e-5, 0],
      [9e-5, 1],
      [-1e-5, 2],
      [-1e-5, 2],
      [-3e-5, 0],
      [-3e-5, 0],
      [-1e-5, 2],
      [-1e-5, 2],
      [-1e-5, 2],
      [-1e-5, 2],
      [-3e-5, 0],
      [-1e-5, 2],
      [-3e-5, 0],
      [9e-5, 1],
      [-3e-5, 0]
    ],
    "red_o_points": [],
    "y_categories": ["N", "NOT APPLICABLE", "nan"],
    "blue_o_points": [],
    "blue_x_points": [[-1e-5, 2], [9e-5, 1], [-3e-5, 0], [9e-5, 1]]
  },
  "QS_mulBpsurgeryType[Lysis]": {
    "red_x_points": [
      [-0.00212, 3],
      [-0.00424, 0],
      [-0.00773, 2],
      [-0.00426, 0],
      [-0.00464, 0],
      [-0.00748, 2],
      [-0.00425, 0],
      [-0.00215, 3],
      [-0.00439, 0],
      [-0.00429, 0],
      [-0.00465, 0],
      [-0.00192, 3],
      [0.0126, 1],
      [-0.00213, 3],
      [-0.00425, 0],
      [-0.00228, 3],
      [-0.00684, 2],
      [-0.00427, 0],
      [-0.00223, 3],
      [-0.00244, 3],
      [-0.00234, 3],
      [-0.00402, 0],
      [-0.00208, 3],
      [-0.00264, 3],
      [-0.00225, 3],
      [-0.00417, 0],
      [-0.00229, 3],
      [-0.00431, 0],
      [-0.00197, 3],
      [0.01232, 1],
      [-0.00676, 2]
    ],
    "red_o_points": [],
    "y_categories": ["N", "NOT APPLICABLE", "Y", "nan"],
    "blue_o_points": [],
    "blue_x_points": [
      [0.01581, 1],
      [-0.00076, 3],
      [0.01383, 1],
      [-0.00106, 0],
      [-0.00074, 3],
      [0.01356, 1],
      [0.01325, 1]
    ]
  },
  "QS_mulLysisSite[Trunk]": {
    "red_x_points": [
      [-0.00164, 3],
      [-0.00316, 0],
      [-0.00351, 0],
      [-0.00294, 0],
      [-0.00297, 0],
      [-0.00567, 2],
      [-0.00313, 0],
      [-0.00183, 3],
      [-0.00324, 0],
      [-0.0034, 0],
      [-0.00322, 0],
      [-0.00161, 3],
      [0.00845, 1],
      [-0.0016, 3],
      [-0.00335, 0],
      [-0.00184, 3],
      [-0.00553, 2],
      [-0.00325, 0],
      [-0.00177, 3],
      [-0.0016, 3],
      [-0.00158, 3],
      [-0.00314, 0],
      [-0.00168, 3],
      [-0.00163, 3],
      [-0.00159, 3],
      [-0.00271, 0],
      [-0.00146, 3],
      [-0.00329, 0],
      [-0.00152, 3],
      [0.00952, 1],
      [-0.00525, 2]
    ],
    "red_o_points": [],
    "y_categories": ["N", "NOT APPLICABLE", "Y", "nan"],
    "blue_o_points": [],
    "blue_x_points": [
      [0.01188, 1],
      [-0.00072, 3],
      [0.01021, 1],
      [-0.00124, 0],
      [-0.00056, 3],
      [0.00924, 1],
      [0.01106, 1]
    ]
  },
  "QS_mulGraftTrunk[UpperTrunk]": {
    "red_x_points": [
      [-0.00091, 3],
      [-0.00187, 0],
      [-0.0017, 0],
      [-0.00165, 0],
      [-0.00168, 0],
      [-0.00141, 0],
      [-0.00168, 0],
      [-0.0008, 3],
      [-0.00181, 0],
      [-0.00164, 0],
      [-0.00176, 0],
      [-0.00084, 3],
      [0.00433, 1],
      [-0.00086, 3],
      [-0.00384, 2],
      [-0.00112, 3],
      [-0.00163, 0],
      [-0.00191, 0],
      [-0.00099, 3],
      [-0.00102, 3],
      [-0.00074, 3],
      [-0.00151, 0],
      [-0.00092, 3],
      [-0.00094, 3],
      [-0.00095, 3],
      [-0.00155, 0],
      [-0.00104, 3],
      [-0.00165, 0],
      [-0.00085, 3],
      [0.00504, 1],
      [-0.0016, 0]
    ],
    "red_o_points": [],
    "y_categories": ["N", "NOT APPLICABLE", "Y", "nan"],
    "blue_o_points": [],
    "blue_x_points": [
      [0.00692, 1],
      [-0.00024, 3],
      [0.00443, 1],
      [-0.00105, 0],
      [-0.00038, 3],
      [0.00523, 1],
      [0.00562, 1]
    ]
  },
  "QS_mulTransfSite[PhMc]": {
    "red_x_points": [
      [-0.00132, 3],
      [-0.00269, 0],
      [-0.00302, 0],
      [-0.00253, 0],
      [-0.00271, 0],
      [-0.00265, 0],
      [-0.00571, 2],
      [-0.00124, 3],
      [-0.00283, 0],
      [-0.0025, 0],
      [-0.00284, 0],
      [-0.00161, 3],
      [0.00701, 1],
      [-0.00162, 3],
      [-0.00274, 0],
      [-0.00125, 3],
      [-0.00263, 0],
      [-0.00269, 0],
      [-0.00144, 3],
      [-0.00137, 3],
      [-0.00131, 3],
      [-0.00503, 2],
      [-0.00134, 3],
      [-0.00148, 3],
      [-0.00172, 3],
      [-0.00229, 0],
      [-0.00151, 3],
      [-0.0028, 0],
      [-0.00146, 3],
      [0.0083, 1],
      [-0.00269, 0]
    ],
    "red_o_points": [],
    "y_categories": ["N", "NOT APPLICABLE", "Y", "nan"],
    "blue_o_points": [],
    "blue_x_points": [
      [0.00997, 1],
      [-0.00071, 3],
      [0.0076, 1],
      [-0.00161, 0],
      [-0.00066, 3],
      [0.00834, 1],
      [0.00945, 1]
    ]
  },
  "QA_mulInjTbpiCause[Motorcycle]": {
    "red_x_points": [
      [0.0003, 0],
      [-0.00086, 1],
      [-0.00139, 1],
      [-0.00094, 1],
      [-0.00086, 1],
      [-0.00071, 1],
      [-0.00079, 1],
      [-0.00077, 1],
      [-0.00081, 1],
      [-0.00084, 1],
      [-0.0007, 1],
      [-0.00033, 0],
      [-0.03349, 1],
      [-0.00077, 1],
      [-0.00117, 1],
      [-0.00065, 1],
      [-0.00072, 1],
      [-0.00111, 1],
      [-0.00016, 0],
      [-0.00089, 1],
      [-0.00049, 1],
      [-0.00072, 1],
      [-0.00101, 1],
      [-0.00174, 1],
      [0.00148, 0],
      [-0.00077, 1],
      [-0.00044, 1],
      [-0.00056, 1],
      [-0.00068, 1],
      [-0.02939, 1],
      [-0.00073, 1]
    ],
    "red_o_points": [],
    "y_categories": ["N", "Y", "nan"],
    "blue_o_points": [],
    "blue_x_points": [
      [0.01519, 0],
      [-0.00018, 1],
      [0.01336, 0],
      [-0.00119, 1],
      [0.00124, 1],
      [0.01325, 0],
      [0.01412, 0]
    ]
  },
  "QS_mulLysisRoot[C6]": {
    "red_x_points": [
      [-0.00121, 3],
      [-0.00194, 0],
      [-0.00362, 2],
      [-0.00228, 0],
      [-0.00179, 0],
      [-0.00182, 0],
      [-0.00203, 0],
      [-0.00086, 3],
      [-0.00214, 0],
      [-0.00179, 0],
      [-0.00143, 0],
      [-0.00116, 3],
      [0.00514, 1],
      [-0.00118, 3],
      [-0.00217, 0],
      [-0.00126, 3],
      [-0.00195, 0],
      [-0.00172, 0],
      [-0.00108, 3],
      [-0.00096, 3],
      [-0.00106, 3],
      [-0.00184, 0],
      [-0.00109, 3],
      [-0.00099, 3],
      [-0.0011, 3],
      [-0.00191, 0],
      [-0.00134, 3],
      [-0.00228, 0],
      [-0.0011, 3],
      [0.0058, 1],
      [-0.00357, 2]
    ],
    "red_o_points": [],
    "y_categories": ["N", "NOT APPLICABLE", "Y", "nan"],
    "blue_o_points": [],
    "blue_x_points": [
      [0.00763, 1],
      [-0.00027, 3],
      [0.00534, 1],
      [-0.00123, 0],
      [-0.00035, 3],
      [0.0065, 1],
      [0.00678, 1]
    ]
  },
  "QA_yonInjOrtsurg": {
    "red_x_points": [
      [-0.00358, 2],
      [-0.00029, 2],
      [0.0, 2],
      [-5e-5, 2],
      [2e-5, 2],
      [0.0, 2],
      [-9e-5, 1],
      [-0.00387, 2],
      [-1e-5, 0],
      [-1e-5, 1],
      [-2e-5, 1],
      [-0.00344, 2],
      [-0.00362, 0],
      [0.00029, 1],
      [-0.00022, 2],
      [-0.00328, 2],
      [-0.00039, 0],
      [-0.0, 2],
      [0.00352, 0],
      [-0.00049, 1],
      [-0.00313, 2],
      [-6e-5, 1],
      [-0.00386, 2],
      [-0.00356, 2],
      [-0.0031, 2],
      [-0.0001, 0],
      [-0.00066, 1],
      [-6e-5, 0],
      [-0.00359, 2],
      [-0.0021, 1],
      [-5e-5, 1]
    ],
    "red_o_points": [],
    "y_categories": ["N", "Y", "nan"],
    "blue_o_points": [],
    "blue_x_points": [
      [0.00065, 2],
      [0.00374, 1],
      [0.00072, 2],
      [0.00023, 2],
      [0.01283, 0],
      [0.00064, 2],
      [0.00077, 2]
    ]
  },
  "QS_mulGraftNerve[Ra]": {
    "red_x_points": [
      [-0.00013, 2],
      [-0.00037, 0],
      [-0.00047, 0],
      [-0.00048, 0],
      [-0.00043, 0],
      [-0.00036, 0],
      [-0.0005, 0],
      [-0.00011, 2],
      [-0.00032, 0],
      [-0.00058, 0],
      [-0.00044, 0],
      [-8e-5, 2],
      [0.00051, 1],
      [-0.00018, 2],
      [-0.00074, 0],
      [-0.00022, 2],
      [-0.00037, 0],
      [-0.0004, 0],
      [-8e-5, 2],
      [-9e-5, 2],
      [-9e-5, 2],
      [-0.00044, 0],
      [-0.0001, 2],
      [-0.00024, 2],
      [-0.00024, 2],
      [-0.00032, 0],
      [-0.00012, 2],
      [-0.0006, 0],
      [-3e-5, 2],
      [0.00097, 1],
      [-0.00045, 0]
    ],
    "red_o_points": [],
    "y_categories": ["N", "NOT APPLICABLE", "nan"],
    "blue_o_points": [],
    "blue_x_points": [
      [0.00183, 1],
      [0.0001, 2],
      [0.00102, 1],
      [6e-5, 0],
      [0.00013, 2],
      [0.00073, 1],
      [0.00099, 1]
    ]
  },
  "QS_mulGraftLevel[Trunk]": {
    "red_x_points": [
      [-0.0003, 3],
      [-0.00077, 0],
      [-0.00088, 0],
      [-0.00078, 0],
      [-0.0007, 0],
      [-0.00062, 0],
      [-0.00067, 0],
      [-0.00024, 3],
      [-0.00081, 0],
      [-0.00071, 0],
      [-0.00073, 0],
      [-0.0004, 3],
      [0.00185, 1],
      [-0.00044, 3],
      [-0.00218, 2],
      [-0.00035, 3],
      [-0.00054, 0],
      [-0.00069, 0],
      [-0.00033, 3],
      [-0.00038, 3],
      [-0.00027, 3],
      [-0.00056, 0],
      [-0.00032, 3],
      [-0.00026, 3],
      [-0.00034, 3],
      [-0.00067, 0],
      [-0.00037, 3],
      [-0.00067, 0],
      [-0.00036, 3],
      [0.00148, 1],
      [-0.0007, 0]
    ],
    "red_o_points": [],
    "y_categories": ["N", "NOT APPLICABLE", "Y", "nan"],
    "blue_o_points": [],
    "blue_x_points": [
      [0.00304, 1],
      [-6e-5, 3],
      [0.00214, 1],
      [-0.00036, 0],
      [-0.0001, 3],
      [0.00217, 1],
      [0.00205, 1]
    ]
  },
  "QS_mulGraftNerve[FI]": {
    "red_x_points": [
      [-0.00038, 2],
      [-0.00067, 0],
      [-0.00088, 0],
      [-0.00087, 0],
      [-0.00087, 0],
      [-0.00089, 0],
      [-0.00089, 0],
      [-0.00045, 2],
      [-0.00082, 0],
      [-0.00087, 0],
      [-0.0009, 0],
      [-0.0005, 2],
      [0.00143, 1],
      [-0.00048, 2],
      [-0.00089, 0],
      [-0.00056, 2],
      [-0.00066, 0],
      [-0.00066, 0],
      [-0.00037, 2],
      [-0.00045, 2],
      [-0.00032, 2],
      [-0.00064, 0],
      [-0.00036, 2],
      [-0.0004, 2],
      [-0.00057, 2],
      [-0.00072, 0],
      [-0.0005, 2],
      [-0.00059, 0],
      [-0.00044, 2],
      [0.00178, 1],
      [-0.00072, 0]
    ],
    "red_o_points": [],
    "y_categories": ["N", "NOT APPLICABLE", "nan"],
    "blue_o_points": [],
    "blue_x_points": [
      [0.00399, 1],
      [-0.0002, 2],
      [0.00222, 1],
      [-0.00027, 0],
      [-0.00012, 2],
      [0.00174, 1],
      [0.00253, 1]
    ]
  },
  "QS_mulGraftNerve[other]": {
    "red_x_points": [
      [-0.00081, 2],
      [-0.00213, 0],
      [-0.00229, 0],
      [-0.00253, 0],
      [-0.00265, 0],
      [-0.00221, 0],
      [-0.00236, 0],
      [-0.00073, 2],
      [-0.00246, 0],
      [-0.00223, 0],
      [-0.00225, 0],
      [-0.00069, 2],
      [0.00436, 1],
      [-0.00062, 2],
      [-0.00235, 0],
      [-0.00085, 2],
      [-0.00173, 0],
      [-0.00269, 0],
      [-0.00064, 2],
      [-0.0006, 2],
      [-0.00077, 2],
      [-0.00209, 0],
      [-0.00073, 2],
      [-0.00092, 2],
      [-0.0008, 2],
      [-0.00195, 0],
      [-0.00065, 2],
      [-0.00233, 0],
      [-0.00064, 2],
      [0.00488, 1],
      [-0.00215, 0]
    ],
    "red_o_points": [],
    "y_categories": ["N", "NOT APPLICABLE", "nan"],
    "blue_o_points": [],
    "blue_x_points": [
      [0.00801, 1],
      [-0.00031, 2],
      [0.00468, 1],
      [-0.00027, 0],
      [-0.00029, 2],
      [0.00562, 1],
      [0.00698, 1]
    ]
  },
  "QS_mulTransfSite[AcSsAA]": {
    "red_x_points": [
      [-0.00284, 3],
      [-0.00902, 2],
      [-0.00453, 0],
      [-0.0089, 2],
      [-0.00864, 2],
      [-0.00425, 0],
      [-0.0041, 0],
      [-0.00303, 3],
      [-0.00416, 0],
      [-0.00874, 2],
      [-0.00451, 0],
      [-0.00308, 3],
      [0.01421, 1],
      [-0.00254, 3],
      [-0.01017, 2],
      [-0.0035, 3],
      [-0.00417, 0],
      [-0.00408, 0],
      [-0.00316, 3],
      [-0.00291, 3],
      [-0.00287, 3],
      [-0.00869, 2],
      [-0.003, 3],
      [-0.00282, 3],
      [-0.00323, 3],
      [-0.00382, 0],
      [-0.00311, 3],
      [-0.00852, 2],
      [-0.00278, 3],
      [0.01479, 1],
      [-0.00409, 0]
    ],
    "red_o_points": [],
    "y_categories": ["N", "NOT APPLICABLE", "Y", "nan"],
    "blue_o_points": [],
    "blue_x_points": [
      [0.02091, 1],
      [-0.00091, 3],
      [0.01598, 1],
      [-0.00079, 0],
      [-0.00112, 3],
      [0.01912, 1],
      [0.01618, 1]
    ]
  },
  "QS_mulGraftNerve[MP]": {
    "red_x_points": [
      [-0.0, 2],
      [-3e-5, 0],
      [-3e-5, 0],
      [-3e-5, 0],
      [-0.0, 2],
      [-3e-5, 0],
      [-3e-5, 0],
      [-0.0, 2],
      [0.0001, 1],
      [-0.0, 2],
      [-3e-5, 0],
      [-0.0, 2],
      [-3e-5, 0],
      [-3e-5, 0],
      [-0.0, 2],
      [-3e-5, 0],
      [-0.0, 2],
      [-0.0, 2],
      [-0.0, 2],
      [-3e-5, 0],
      [-0.0, 2],
      [-0.0, 2],
      [-3e-5, 0]
    ],
    "red_o_points": [],
    "y_categories": ["N", "NOT APPLICABLE", "nan"],
    "blue_o_points": [],
    "blue_x_points": [
      [0.0001, 1],
      [-0.0, 2],
      [-3e-5, 0],
      [0.0001, 1],
      [0.0001, 1]
    ]
  },
  "QS_mulGraftNerve[Ax]": {
    "red_x_points": [
      [-0.0002, 2],
      [-0.0004, 0],
      [-0.00035, 0],
      [-0.00028, 0],
      [-0.00034, 0],
      [-0.00044, 0],
      [-0.00026, 0],
      [-0.00021, 2],
      [-0.00042, 0],
      [-0.00038, 0],
      [-0.00026, 0],
      [-0.00032, 2],
      [0.00047, 1],
      [-0.0002, 2],
      [-0.00026, 0],
      [-0.00017, 2],
      [-0.00033, 0],
      [-0.00028, 0],
      [-0.0002, 2],
      [-0.00023, 2],
      [-0.00024, 2],
      [-0.0003, 0],
      [-0.00023, 2],
      [-0.00018, 2],
      [-0.00018, 2],
      [-0.0003, 0],
      [-0.00018, 2],
      [-0.0003, 0],
      [-0.00015, 2],
      [0.00087, 1],
      [-0.00024, 0]
    ],
    "red_o_points": [],
    "y_categories": ["N", "NOT APPLICABLE", "nan"],
    "blue_o_points": [],
    "blue_x_points": [
      [0.00146, 1],
      [-5e-5, 2],
      [0.00124, 1],
      [5e-5, 0],
      [-1e-5, 2],
      [0.00065, 1],
      [0.00095, 1]
    ]
  },
  "QA_lstPexMuscstrength[WristFlex]": {
    "red_x_points": [
      [-0.00335, 1],
      [-0.00011, 2],
      [-0.00109, 1],
      [-0.0014, 1],
      [0.00033, 0],
      [0.00044, 0],
      [-0.00207, 1],
      [-0.00232, 0],
      [0.00042, 0],
      [0.00025, 0],
      [0.00038, 0],
      [-0.0019, 0],
      [-0.00074, 2],
      [0.00154, 2],
      [-7e-5, 2],
      [-0.00167, 0],
      [4e-5, 2],
      [0.00033, 0],
      [-0.00114, 0],
      [-0.00294, 1],
      [-0.00158, 0],
      [-0.00169, 1],
      [0.00191, 2],
      [-0.00792, 1],
      [-0.00222, 0],
      [0.00044, 0],
      [-0.00278, 1],
      [0.00027, 0],
      [0.00202, 2],
      [-0.00018, 2],
      [-0.00087, 1]
    ],
    "red_o_points": [],
    "y_categories": ["GREATER THAN OR EQUALS TO 3", "LESS THAN 3", "nan"],
    "blue_o_points": [],
    "blue_x_points": [
      [0.0004, 0],
      [0.00382, 2],
      [0.00103, 0],
      [0.00295, 0],
      [0.0054, 2],
      [0.00126, 0],
      [0.00143, 0]
    ]
  },
  "QS_mulNeuromadSite[C5]": {
    "red_x_points": [
      [-0.00121, 2],
      [-0.00382, 0],
      [-0.00373, 0],
      [-0.00342, 0],
      [-0.00359, 0],
      [-0.00355, 0],
      [-0.00374, 0],
      [-0.00162, 2],
      [-0.00376, 0],
      [-0.00367, 0],
      [-0.00356, 0],
      [-0.00138, 2],
      [0.00706, 1],
      [-0.00112, 2],
      [-0.0034, 0],
      [-0.00138, 2],
      [-0.00312, 0],
      [-0.00345, 0],
      [-0.00108, 2],
      [-0.00108, 2],
      [-0.00105, 2],
      [-0.00342, 0],
      [-0.00129, 2],
      [-0.00102, 2],
      [-0.0016, 2],
      [-0.00361, 0],
      [-0.00121, 2],
      [-0.0035, 0],
      [-0.00084, 2],
      [0.00641, 1],
      [-0.00352, 0]
    ],
    "red_o_points": [],
    "y_categories": ["N", "NOT APPLICABLE", "nan"],
    "blue_o_points": [],
    "blue_x_points": [
      [0.01244, 1],
      [-0.00028, 2],
      [0.0073, 1],
      [-3e-5, 0],
      [-0.00018, 2],
      [0.00864, 1],
      [0.00944, 1]
    ]
  },
  "QS_mulNeuromadSite[C7]": {
    "red_x_points": [
      [-0.00081, 2],
      [-0.00234, 0],
      [-0.00321, 0],
      [-0.00329, 0],
      [-0.00258, 0],
      [-0.00285, 0],
      [-0.00299, 0],
      [-0.00089, 2],
      [-0.00292, 0],
      [-0.00291, 0],
      [-0.00207, 0],
      [-0.00074, 2],
      [0.00444, 1],
      [-0.0007, 2],
      [-0.00297, 0],
      [-0.00095, 2],
      [-0.00296, 0],
      [-0.00263, 0],
      [-0.00086, 2],
      [-0.00066, 2],
      [-0.0006, 2],
      [-0.00235, 0],
      [-0.00075, 2],
      [-0.00086, 2],
      [-0.001, 2],
      [-0.0026, 0],
      [-0.00096, 2],
      [-0.00314, 0],
      [-0.00077, 2],
      [0.00492, 1],
      [-0.00269, 0]
    ],
    "red_o_points": [],
    "y_categories": ["N", "NOT APPLICABLE", "nan"],
    "blue_o_points": [],
    "blue_x_points": [
      [0.00953, 1],
      [0.00024, 2],
      [0.00641, 1],
      [-8e-5, 0],
      [8e-5, 2],
      [0.00675, 1],
      [0.00728, 1]
    ]
  },
  "QA_lstPexMuscstrength[WristExte]": {
    "red_x_points": [
      [-0.00283, 1],
      [-0.00062, 2],
      [-0.00126, 1],
      [-0.00154, 1],
      [0.00071, 0],
      [-0.00191, 1],
      [-0.00178, 1],
      [-0.00173, 0],
      [0.00079, 0],
      [0.00071, 0],
      [-0.00151, 1],
      [-0.0013, 0],
      [-0.00183, 2],
      [0.00117, 2],
      [-0.00059, 2],
      [-0.00097, 0],
      [-0.00041, 2],
      [0.00111, 0],
      [-0.00087, 0],
      [-0.0027, 1],
      [-0.00156, 0],
      [-0.00176, 1],
      [0.00165, 2],
      [-0.00092, 0],
      [-0.00379, 1],
      [0.00082, 0],
      [-0.00313, 1],
      [0.00085, 0],
      [0.0016, 2],
      [-0.00175, 2],
      [-0.00152, 1]
    ],
    "red_o_points": [],
    "y_categories": ["GREATER THAN OR EQUALS TO 3", "LESS THAN 3", "nan"],
    "blue_o_points": [],
    "blue_x_points": [
      [0.00113, 0],
      [0.00403, 2],
      [0.00097, 0],
      [0.00323, 0],
      [0.00472, 2],
      [0.00077, 1],
      [0.00085, 0]
    ]
  },
  "QA_lstPexMuscstrength[ElbowExte]": {
    "red_x_points": [
      [-0.00269, 1],
      [0.0, 2],
      [-4e-5, 1],
      [-4e-5, 1],
      [-0.00149, 0],
      [7e-5, 1],
      [6e-5, 1],
      [-0.00309, 1],
      [-0.00154, 0],
      [-0.00079, 0],
      [8e-5, 1],
      [-0.00242, 1],
      [2e-5, 2],
      [0.00307, 2],
      [-0.00018, 2],
      [-0.00238, 1],
      [-1e-5, 2],
      [0.00011, 1],
      [-0.00195, 0],
      [-0.00234, 1],
      [-0.00248, 0],
      [3e-5, 1],
      [0.00293, 2],
      [-0.00213, 0],
      [-0.00283, 0],
      [0.00016, 1],
      [-0.00203, 1],
      [-0.00032, 2],
      [-0.00264, 1],
      [7e-5, 2]
    ],
    "red_o_points": [],
    "y_categories": ["GREATER THAN OR EQUALS TO 3", "LESS THAN 3", "nan"],
    "blue_o_points": [],
    "blue_x_points": [
      [0.00017, 2],
      [0.00666, 2],
      [0.00011, 0],
      [0.00169, 1],
      [0.00658, 2],
      [0.00013, 0],
      [0.00013, 0]
    ]
  },
  "QA_intPexForearmSupin": {
    "red_x_points": [
      [-1e-5, 2],
      [0.00013, 0],
      [-1e-5, 2],
      [-0.00017, 1],
      [-0.00014, 1],
      [5e-5, 2],
      [-0.00016, 1],
      [0.0, 2],
      [0.0, 2],
      [-1e-5, 2],
      [0.00013, 0],
      [0.00039, 2],
      [-0.0, 2],
      [-1e-5, 2],
      [-2e-5, 2],
      [-1e-5, 2],
      [-0.00029, 1],
      [-0.00024, 1],
      [0.00018, 0],
      [-7e-5, 1],
      [-9e-5, 1],
      [-0.0, 2],
      [2e-5, 2],
      [-1e-5, 2],
      [0.0, 2],
      [-0.00024, 1],
      [0.0, 2],
      [-1e-5, 2],
      [-0.01616, 1],
      [-2e-5, 0]
    ],
    "red_o_points": [],
    "y_categories": ["GREATER THAN OR EQUALS TO 80", "LESS THAN 80", "nan"],
    "blue_o_points": [],
    "blue_x_points": [
      [0.00162, 2],
      [0.00659, 0],
      [0.00011, 2],
      [-0.0, 2],
      [0.00161, 2],
      [0.0015, 2]
    ]
  },
  "QS_mulGraftNerve[SS]": {
    "red_x_points": [
      [-0.00012, 2],
      [-0.00032, 0],
      [-0.00017, 0],
      [-0.0003, 0],
      [-0.0003, 0],
      [-0.00018, 0],
      [-0.00024, 0],
      [-0.0001, 2],
      [-0.00029, 0],
      [-0.00037, 0],
      [-0.00023, 0],
      [-4e-5, 2],
      [0.00054, 1],
      [-5e-5, 2],
      [-0.00018, 0],
      [-4e-5, 2],
      [-0.00032, 0],
      [-0.00033, 0],
      [-0.0001, 2],
      [-7e-5, 2],
      [-0.0001, 2],
      [-0.00022, 0],
      [-0.00011, 2],
      [-4e-5, 2],
      [-8e-5, 2],
      [-0.00029, 0],
      [-0.0001, 2],
      [-0.00033, 0],
      [-0.00011, 2],
      [0.00029, 1],
      [-0.00034, 0]
    ],
    "red_o_points": [],
    "y_categories": ["N", "NOT APPLICABLE", "nan"],
    "blue_o_points": [],
    "blue_x_points": [
      [0.00058, 1],
      [-4e-5, 2],
      [0.00088, 1],
      [-6e-5, 0],
      [-4e-5, 2],
      [0.00074, 1],
      [0.00102, 1]
    ]
  },
  "QS_mulGraftNerve[MCF]": {
    "red_x_points": [
      [-0.0, 2],
      [-2e-5, 0],
      [-2e-5, 0],
      [-2e-5, 0],
      [-2e-5, 0],
      [-0.0, 2],
      [-2e-5, 0],
      [-2e-5, 0],
      [-2e-5, 0],
      [-0.0, 2],
      [-0.0, 2],
      [-2e-5, 0],
      [-0.0, 2],
      [-2e-5, 0],
      [-2e-5, 0],
      [-0.0, 2],
      [-0.0, 2],
      [-0.0, 2],
      [-2e-5, 0],
      [-0.0, 2],
      [-0.0, 2],
      [9e-5, 1],
      [-2e-5, 0]
    ],
    "red_o_points": [],
    "y_categories": ["N", "NOT APPLICABLE", "nan"],
    "blue_o_points": [],
    "blue_x_points": [[-0.0, 2], [-2e-5, 0], [-0.0, 2], [9e-5, 1], [9e-5, 1]]
  },
  "QS_mulNeuromadSite[C6]": {
    "red_x_points": [
      [-0.00098, 2],
      [-0.00225, 0],
      [-0.00278, 0],
      [-0.0024, 0],
      [-0.00279, 0],
      [-0.00231, 0],
      [-0.00278, 0],
      [-0.00074, 2],
      [-0.00255, 0],
      [-0.00224, 0],
      [-0.00237, 0],
      [-0.00095, 2],
      [0.00379, 1],
      [-0.00094, 2],
      [-0.00221, 0],
      [-0.00082, 2],
      [-0.00248, 0],
      [-0.00259, 0],
      [-0.00073, 2],
      [-0.00078, 2],
      [-0.00069, 2],
      [-0.00232, 0],
      [-0.00096, 2],
      [-0.00096, 2],
      [-0.00095, 2],
      [-0.00236, 0],
      [-0.00079, 2],
      [-0.00225, 0],
      [-0.00089, 2],
      [0.00497, 1],
      [-0.00247, 0]
    ],
    "red_o_points": [],
    "y_categories": ["N", "NOT APPLICABLE", "nan"],
    "blue_o_points": [],
    "blue_x_points": [
      [0.00831, 1],
      [-0.00026, 2],
      [0.00609, 1],
      [0.00012, 0],
      [-9e-5, 2],
      [0.00567, 1],
      [0.00617, 1]
    ]
  },
  "QS_mulLysisSite[Nerve]": {
    "red_x_points": [
      [-0.00034, 3],
      [-0.0005, 0],
      [-0.00121, 2],
      [-0.00042, 0],
      [-0.00047, 0],
      [-0.00039, 0],
      [-0.00047, 0],
      [-0.00042, 3],
      [-0.00037, 0],
      [-0.0005, 0],
      [-0.00041, 0],
      [-0.00037, 3],
      [0.00146, 1],
      [-0.00013, 3],
      [-0.00042, 0],
      [-0.00033, 3],
      [-0.00045, 0],
      [-0.00027, 0],
      [-0.00043, 3],
      [-0.00029, 3],
      [-0.00029, 3],
      [-0.00043, 0],
      [-0.00027, 3],
      [-0.00031, 3],
      [-0.00037, 3],
      [-0.00043, 0],
      [-0.00028, 3],
      [-0.00052, 0],
      [-0.00038, 3],
      [0.00155, 1],
      [-0.00045, 0]
    ],
    "red_o_points": [],
    "y_categories": ["N", "NOT APPLICABLE", "Y", "nan"],
    "blue_o_points": [],
    "blue_x_points": [
      [0.0018, 1],
      [-6e-5, 3],
      [0.00155, 1],
      [-0.00057, 0],
      [-0.00014, 3],
      [0.00157, 1],
      [0.00167, 1]
    ]
  },
  "QS_mulGraftNerve[TD]": {
    "red_x_points": [
      [-7e-5, 2],
      [-0.00036, 0],
      [-0.00015, 0],
      [-0.00026, 0],
      [-7e-5, 0],
      [-0.00018, 0],
      [-0.0002, 0],
      [-9e-5, 2],
      [-0.00023, 0],
      [-0.00013, 0],
      [-0.0002, 0],
      [-0.00014, 2],
      [0.00048, 1],
      [-8e-5, 2],
      [-0.00018, 0],
      [-0.00019, 2],
      [-0.00014, 0],
      [-0.00021, 0],
      [-9e-5, 2],
      [-0.00025, 2],
      [-9e-5, 2],
      [-0.0002, 0],
      [-0.0001, 2],
      [-0.00013, 2],
      [-0.00016, 2],
      [-0.00018, 0],
      [-9e-5, 2],
      [-0.00016, 0],
      [-0.0001, 2],
      [0.00064, 1],
      [-0.00016, 0]
    ],
    "red_o_points": [],
    "y_categories": ["N", "NOT APPLICABLE", "nan"],
    "blue_o_points": [],
    "blue_x_points": [
      [0.00074, 1],
      [-2e-5, 2],
      [0.00029, 1],
      [-4e-5, 0],
      [-7e-5, 2],
      [0.00064, 1],
      [0.0008, 1]
    ]
  },
  "QS_mulLysisRoot[C7]": {
    "red_x_points": [
      [-0.00044, 3],
      [-0.00059, 0],
      [-0.0014, 2],
      [-0.0005, 0],
      [-0.00068, 0],
      [-0.00072, 0],
      [-0.00057, 0],
      [-0.00047, 3],
      [-0.00062, 0],
      [-0.00064, 0],
      [-0.00053, 0],
      [-0.0004, 3],
      [0.00194, 1],
      [-0.00037, 3],
      [-0.00083, 0],
      [-0.00057, 3],
      [-0.00056, 0],
      [-0.00067, 0],
      [-0.00037, 3],
      [-0.00041, 3],
      [-0.0004, 3],
      [-0.0007, 0],
      [-0.00042, 3],
      [-0.00076, 3],
      [-0.00043, 3],
      [-0.00059, 0],
      [-0.00044, 3],
      [-0.00065, 0],
      [-0.00038, 3],
      [0.00209, 1],
      [-0.00064, 0]
    ],
    "red_o_points": [],
    "y_categories": ["N", "NOT APPLICABLE", "Y", "nan"],
    "blue_o_points": [],
    "blue_x_points": [
      [0.00252, 1],
      [-0.00012, 3],
      [0.00214, 1],
      [-0.00052, 0],
      [-0.00016, 3],
      [0.00209, 1],
      [0.00258, 1]
    ]
  },
  "QS_mulTransfSite[IMc]": {
    "red_x_points": [
      [-0.00252, 3],
      [-0.00725, 2],
      [-0.00449, 0],
      [-0.00387, 0],
      [-0.00398, 0],
      [-0.00377, 0],
      [-0.00408, 0],
      [-0.00238, 3],
      [-0.0039, 0],
      [-0.00377, 0],
      [-0.00376, 0],
      [-0.00265, 3],
      [0.01166, 1],
      [-0.00225, 3],
      [-0.00395, 0],
      [-0.00248, 3],
      [-0.00765, 2],
      [-0.00363, 0],
      [-0.00255, 3],
      [-0.00238, 3],
      [-0.00242, 3],
      [-0.00386, 0],
      [-0.0024, 3],
      [-0.00262, 3],
      [-0.00248, 3],
      [-0.00362, 0],
      [-0.00202, 3],
      [-0.00647, 2],
      [-0.00244, 3],
      [0.01118, 1],
      [-0.00665, 2]
    ],
    "red_o_points": [],
    "y_categories": ["N", "NOT APPLICABLE", "Y", "nan"],
    "blue_o_points": [],
    "blue_x_points": [
      [0.01616, 1],
      [-0.00056, 3],
      [0.01229, 1],
      [-0.00139, 0],
      [-0.00065, 3],
      [0.01243, 1],
      [0.01508, 1]
    ]
  },
  "QA_lstPexTouch[T1]": {
    "red_x_points": [
      [-0.00205, 1],
      [-0.00014, 2],
      [0.00045, 1],
      [8e-5, 2],
      [-0.00112, 0],
      [0.00038, 1],
      [0.00054, 1],
      [-0.00275, 1],
      [-0.00139, 0],
      [-0.00093, 0],
      [-0.00139, 0],
      [-0.00251, 0],
      [-0.00942, 2],
      [0.00315, 2],
      [-0.00026, 2],
      [-0.00174, 1],
      [-2e-5, 2],
      [0.00077, 1],
      [-0.00268, 0],
      [-0.00208, 1],
      [-0.00306, 0],
      [-0.00028, 2],
      [0.0032, 2],
      [-0.00161, 1],
      [-0.00342, 0],
      [0.00051, 1],
      [-0.00325, 0],
      [-0.00027, 2],
      [-0.00317, 0],
      [0.00019, 1],
      [0.00023, 1]
    ],
    "red_o_points": [],
    "y_categories": ["NORM", "NPV", "nan"],
    "blue_o_points": [],
    "blue_x_points": [
      [0.00086, 1],
      [0.00586, 2],
      [0.00052, 1],
      [0.00162, 1],
      [0.00618, 2],
      [0.00068, 1],
      [0.00501, 0]
    ]
  },
  "QS_mulTransfSite[AcMc]": {
    "red_x_points": [
      [-0.00038, 3],
      [-0.0008, 0],
      [-0.00089, 0],
      [-0.00077, 0],
      [-0.00066, 0],
      [-0.00077, 0],
      [-0.00086, 0],
      [-0.00055, 3],
      [-0.00075, 0],
      [-0.00058, 0],
      [-0.00198, 2],
      [-0.00049, 3],
      [0.00232, 1],
      [-0.00049, 3],
      [-0.00077, 0],
      [-0.00049, 3],
      [-0.00064, 0],
      [-0.00069, 0],
      [-0.00065, 3],
      [-0.00051, 3],
      [-0.00043, 3],
      [-0.00086, 0],
      [-0.00048, 3],
      [-0.0005, 3],
      [-0.00061, 3],
      [-0.0008, 0],
      [-0.00041, 3],
      [-0.00101, 0],
      [-0.00039, 3],
      [0.0024, 1],
      [-0.0007, 0]
    ],
    "red_o_points": [],
    "y_categories": ["N", "NOT APPLICABLE", "Y", "nan"],
    "blue_o_points": [],
    "blue_x_points": [
      [0.00315, 1],
      [-0.00016, 3],
      [0.00208, 1],
      [-0.00082, 0],
      [-9e-5, 3],
      [0.00263, 1],
      [0.0028, 1]
    ]
  },
  "QS_mulTransfSite[Other]": {
    "red_x_points": [
      [-0.00068, 3],
      [-0.00129, 0],
      [-0.00113, 0],
      [-0.00119, 0],
      [-0.00113, 0],
      [-0.00123, 0],
      [-0.00127, 0],
      [-0.00067, 3],
      [-0.00122, 0],
      [-0.0012, 0],
      [-0.00117, 0],
      [-0.00081, 3],
      [0.00407, 1],
      [-0.00061, 3],
      [-0.00119, 0],
      [-0.00084, 3],
      [-0.00116, 0],
      [-0.00356, 2],
      [-0.00082, 3],
      [-0.00071, 3],
      [-0.00061, 3],
      [-0.00136, 0],
      [-0.00062, 3],
      [-0.00077, 3],
      [-0.00079, 3],
      [-0.00135, 0],
      [-0.00062, 3],
      [-0.0013, 0],
      [-0.00074, 3],
      [0.00382, 1],
      [-0.00098, 0]
    ],
    "red_o_points": [],
    "y_categories": ["N", "NOT APPLICABLE", "Y", "nan"],
    "blue_o_points": [],
    "blue_x_points": [
      [0.0043, 1],
      [-0.00041, 3],
      [0.00443, 1],
      [-0.00095, 0],
      [-0.00043, 3],
      [0.00349, 1],
      [0.00405, 1]
    ]
  },
  "QA_yonInjBpsurg": {
    "red_x_points": [
      [-0.00366, 1],
      [-0.00315, 1],
      [-0.004, 1],
      [-0.00329, 1],
      [-0.00337, 1],
      [-0.00368, 1],
      [-0.00339, 1],
      [-0.00341, 1],
      [-0.00324, 1],
      [-0.00322, 1],
      [-0.00293, 1],
      [-0.0034, 1],
      [0.0077, 0],
      [-0.00325, 1],
      [-0.00298, 1],
      [-0.00347, 1],
      [-0.00291, 1],
      [-0.00309, 1],
      [-0.00326, 1],
      [-0.00323, 1],
      [-0.00282, 1],
      [-0.00295, 1],
      [-0.00358, 1],
      [-0.00321, 1],
      [-0.00339, 1],
      [-0.00285, 1],
      [-0.00332, 1],
      [-0.00339, 1],
      [-0.00278, 1],
      [0.00913, 0],
      [-0.00338, 1]
    ],
    "red_o_points": [],
    "y_categories": ["N", "Y", "nan"],
    "blue_o_points": [],
    "blue_x_points": [
      [0.01769, 0],
      [-0.00099, 1],
      [0.01105, 0],
      [-0.00291, 1],
      [-0.00112, 1],
      [0.00988, 0],
      [0.01346, 0]
    ]
  },
  "QA_equInjTbpiAge": {
    "red_x_points": [
      [-0.00069, 1],
      [-7e-5, 1],
      [0.0, 1],
      [-0.00011, 0],
      [-0.0007, 0],
      [0.00012, 1],
      [0.0001, 1],
      [0.00073, 0],
      [-0.00092, 0],
      [-0.00031, 0],
      [0.00015, 1],
      [0.00054, 0],
      [-0.01436, 1],
      [-0.00089, 1],
      [-3e-5, 1],
      [-0.00076, 1],
      [-0.00017, 0],
      [-0.00108, 0],
      [-0.00106, 1],
      [0.00083, 0],
      [-0.00076, 1],
      [-4e-5, 1],
      [-0.00085, 1],
      [-0.00292, 1],
      [0.00045, 0],
      [0.00021, 1],
      [-0.00147, 1],
      [0.0001, 1],
      [-0.00086, 1],
      [-0.01153, 1],
      [-1e-5, 0]
    ],
    "red_o_points": [],
    "y_categories": ["GREATER THAN OR EQUALS TO 30", "LESS THAN 30", "nan"],
    "blue_o_points": [],
    "blue_x_points": [
      [-0.00386, 1],
      [-0.00131, 1],
      [0.00637, 0],
      [0.00016, 1],
      [0.00508, 0],
      [0.00727, 0],
      [0.00809, 0]
    ]
  },
  "QS_mulGraftNerve[Ssr]": {
    "red_x_points": [
      [-2e-5, 2],
      [-9e-5, 0],
      [-9e-5, 0],
      [-5e-5, 0],
      [-9e-5, 0],
      [-5e-5, 0],
      [-1e-5, 2],
      [-9e-5, 0],
      [-9e-5, 0],
      [-9e-5, 0],
      [-1e-5, 2],
      [0.00019, 1],
      [-2e-5, 2],
      [-9e-5, 0],
      [-1e-5, 2],
      [-9e-5, 0],
      [-9e-5, 0],
      [-1e-5, 2],
      [-1e-5, 2],
      [-1e-5, 2],
      [-9e-5, 0],
      [-2e-5, 2],
      [-2e-5, 2],
      [-1e-5, 2],
      [-5e-5, 0],
      [-1e-5, 2],
      [-9e-5, 0],
      [-1e-5, 2],
      [0.00019, 1]
    ],
    "red_o_points": [],
    "y_categories": ["N", "NOT APPLICABLE", "nan"],
    "blue_o_points": [],
    "blue_x_points": [
      [0.00019, 1],
      [-1e-5, 2],
      [0.0001, 1],
      [-1e-5, 2],
      [0.00019, 1],
      [0.0001, 1]
    ]
  },
  "QS_mulBpsurgeryType[Graft]": {
    "red_x_points": [
      [-0.00032, 3],
      [-0.00038, 0],
      [-0.00037, 0],
      [-0.00041, 0],
      [-0.00035, 0],
      [-0.00041, 0],
      [-0.00047, 0],
      [-0.00021, 3],
      [-0.00041, 0],
      [-0.00036, 0],
      [-0.00034, 0],
      [-0.00025, 3],
      [0.00088, 1],
      [-0.00021, 3],
      [-0.00186, 2],
      [-0.00023, 3],
      [-0.0003, 0],
      [-0.00043, 0],
      [-0.00031, 3],
      [-0.00023, 3],
      [-0.00037, 3],
      [-0.00038, 0],
      [-0.00023, 3],
      [-0.0003, 3],
      [-0.00026, 3],
      [-0.00053, 0],
      [-0.00021, 3],
      [-0.00039, 0],
      [-0.0003, 3],
      [0.00116, 1],
      [-0.00031, 0]
    ],
    "red_o_points": [],
    "y_categories": ["N", "NOT APPLICABLE", "Y", "nan"],
    "blue_o_points": [],
    "blue_x_points": [
      [0.00225, 1],
      [-9e-5, 3],
      [0.00107, 1],
      [-0.00022, 0],
      [-2e-5, 3],
      [0.0016, 1],
      [0.00152, 1]
    ]
  },
  "QS_mulLysisRoot[C5]": {
    "red_x_points": [
      [-0.001, 3],
      [-0.0017, 0],
      [-0.00311, 2],
      [-0.00164, 0],
      [-0.00174, 0],
      [-0.00156, 0],
      [-0.00174, 0],
      [-0.00089, 3],
      [-0.0018, 0],
      [-0.00175, 0],
      [-0.00175, 0],
      [-0.00109, 3],
      [0.005, 1],
      [-0.0007, 3],
      [-0.00186, 0],
      [-0.0012, 3],
      [-0.00188, 0],
      [-0.00183, 0],
      [-0.0011, 3],
      [-0.0011, 3],
      [-0.00105, 3],
      [-0.00165, 0],
      [-0.00101, 3],
      [-0.0011, 3],
      [-0.00114, 3],
      [-0.00168, 0],
      [-0.00107, 3],
      [-0.00169, 0],
      [-0.00108, 3],
      [0.0054, 1],
      [-0.00277, 2]
    ],
    "red_o_points": [],
    "y_categories": ["N", "NOT APPLICABLE", "Y", "nan"],
    "blue_o_points": [],
    "blue_x_points": [
      [0.00753, 1],
      [-0.00038, 3],
      [0.00491, 1],
      [-0.00133, 0],
      [-0.00048, 3],
      [0.00508, 1],
      [0.0045, 1]
    ]
  },
  "QS_mulLysisSite[Root]": {
    "red_x_points": [
      [-0.00089, 3],
      [-0.00123, 0],
      [-0.00253, 2],
      [-0.00113, 0],
      [-0.00114, 0],
      [-0.00105, 0],
      [-0.001, 0],
      [-0.00091, 3],
      [-0.00114, 0],
      [-0.00104, 0],
      [-0.0011, 0],
      [-0.00109, 3],
      [0.00402, 1],
      [-0.00089, 3],
      [-0.00107, 0],
      [-0.00096, 3],
      [-0.00101, 0],
      [-0.00101, 0],
      [-0.001, 3],
      [-0.00098, 3],
      [-0.00092, 3],
      [-0.001, 0],
      [-0.00097, 3],
      [-0.00097, 3],
      [-0.00088, 3],
      [-0.00129, 0],
      [-0.0009, 3],
      [-0.00116, 0],
      [-0.00094, 3],
      [0.00417, 1],
      [-0.00225, 2]
    ],
    "red_o_points": [],
    "y_categories": ["N", "NOT APPLICABLE", "Y", "nan"],
    "blue_o_points": [],
    "blue_x_points": [
      [0.00529, 1],
      [-0.00053, 3],
      [0.0044, 1],
      [-0.00119, 0],
      [-0.00049, 3],
      [0.00395, 1],
      [0.00435, 1]
    ]
  },
  "QA_lstPexPalle[Clavicle]": {
    "red_x_points": [
      [0.00012, 3],
      [4e-5, 3],
      [4e-5, 3],
      [2e-5, 3],
      [-0.00059, 2],
      [-0.00012, 2],
      [2e-5, 3],
      [2e-5, 3],
      [9e-5, 3],
      [-0.00016, 2],
      [-0.00016, 2],
      [-2e-5, 0],
      [0.00059, 3],
      [2e-5, 3],
      [4e-5, 3],
      [4e-5, 3],
      [4e-5, 3],
      [-0.00011, 0],
      [-8e-5, 0],
      [-6e-5, 0],
      [-0.00016, 2],
      [-5e-5, 1],
      [5e-5, 3],
      [-0.00268, 2],
      [5e-5, 3],
      [4e-5, 3],
      [-0.00079, 2],
      [4e-5, 3],
      [2e-5, 3],
      [-0.01804, 2],
      [0.0, 0]
    ],
    "red_o_points": [],
    "y_categories": ["HYPO", "NAIA", "PT", "nan"],
    "blue_o_points": [],
    "blue_x_points": [
      [0.00165, 3],
      [0.00028, 3],
      [0.00732, 0],
      [0.00067, 3],
      [0.00061, 3],
      [0.00194, 3],
      [0.00201, 3]
    ]
  },
  "QS_mulGraftNerve[LT]": {
    "red_x_points": [
      [-2e-5, 0],
      [-2e-5, 0],
      [1e-5, 0],
      [-1e-5, 0],
      [-2e-5, 0],
      [-2e-5, 2],
      [-2e-5, 0],
      [-1e-5, 0],
      [1e-5, 0],
      [-2e-5, 2],
      [1e-5, 1],
      [-6e-5, 2],
      [-2e-5, 0],
      [-6e-5, 2],
      [-1e-5, 0],
      [-9e-5, 2],
      [-2e-5, 2],
      [-7e-5, 2],
      [-6e-5, 2],
      [-2e-5, 2],
      [-9e-5, 2],
      [-2e-5, 0],
      [1e-5, 1]
    ],
    "red_o_points": [],
    "y_categories": ["N", "NOT APPLICABLE", "nan"],
    "blue_o_points": [],
    "blue_x_points": [[0.00019, 1], [-4e-5, 2], [0.00012, 0], [0.00013, 1]]
  },
  "QA_lstPexMuscstrength[ShoulderAbduc]": {
    "red_x_points": [
      [-0.0057, 1],
      [-0.00484, 1],
      [-0.00535, 1],
      [-0.00595, 1],
      [-0.00528, 1],
      [-0.00574, 1],
      [-0.00593, 1],
      [-0.0058, 1],
      [-0.0057, 1],
      [-0.0054, 1],
      [-0.00567, 1],
      [-0.00602, 1],
      [0.0032, 2],
      [0.00462, 2],
      [0.00429, 2],
      [0.00522, 2],
      [0.00447, 2],
      [-0.0057, 1],
      [-0.00595, 1],
      [-0.00547, 1],
      [-0.00588, 1],
      [-0.00533, 1],
      [0.00474, 2],
      [-0.00689, 1],
      [-0.00576, 1],
      [-0.00566, 1],
      [-0.00638, 1],
      [-0.00509, 1],
      [-0.00578, 1],
      [0.00292, 2],
      [-0.00563, 1]
    ],
    "red_o_points": [],
    "y_categories": ["GREATER THAN OR EQUALS TO 3", "LESS THAN 3", "nan"],
    "blue_o_points": [],
    "blue_x_points": [
      [0.00324, 2],
      [0.00512, 2],
      [0.02216, 0],
      [0.00592, 2],
      [0.00523, 2],
      [0.02464, 0],
      [-0.00113, 1]
    ]
  },
  "QS_mulNeuromadSite[C4]": {
    "red_x_points": [
      [-0.00059, 2],
      [-0.00173, 0],
      [-0.00197, 0],
      [-0.00186, 0],
      [-0.00197, 0],
      [-0.00168, 0],
      [-0.00191, 0],
      [-0.00049, 2],
      [-0.00172, 0],
      [-0.00162, 0],
      [-0.00169, 0],
      [-0.00074, 2],
      [0.00224, 1],
      [-0.00054, 2],
      [-0.00174, 0],
      [-0.0006, 2],
      [-0.00179, 0],
      [-0.00176, 0],
      [-0.00071, 2],
      [-0.00054, 2],
      [-0.00045, 2],
      [-0.00159, 0],
      [-0.0005, 2],
      [-0.00076, 2],
      [-0.00047, 2],
      [-0.00186, 0],
      [-0.00053, 2],
      [-0.00201, 0],
      [-0.00024, 2],
      [0.00375, 1],
      [-0.00157, 0]
    ],
    "red_o_points": [],
    "y_categories": ["N", "NOT APPLICABLE", "nan"],
    "blue_o_points": [],
    "blue_x_points": [
      [0.00623, 1],
      [0.00018, 2],
      [0.0038, 1],
      [0.00032, 0],
      [8e-5, 2],
      [0.00367, 1],
      [0.00398, 1]
    ]
  },
  "QS_lstBpsurgSide": {
    "red_x_points": [
      [-0.00372, 3],
      [-0.00609, 0],
      [-0.00542, 0],
      [-0.00625, 0],
      [-0.01309, 2],
      [-0.00509, 0],
      [-0.00611, 0],
      [-0.00401, 3],
      [-0.00599, 0],
      [-0.01168, 2],
      [-0.01202, 2],
      [-0.00436, 3],
      [0.02053, 1],
      [-0.004, 3],
      [-0.01236, 2],
      [-0.00426, 3],
      [-0.01257, 2],
      [-0.01305, 2],
      [-0.00433, 3],
      [-0.00371, 3],
      [-0.00387, 3],
      [-0.00523, 0],
      [-0.00374, 3],
      [-0.00373, 3],
      [-0.0043, 3],
      [-0.01188, 2],
      [-0.00394, 3],
      [-0.01174, 2],
      [-0.00369, 3],
      [0.02068, 1],
      [-0.00586, 0]
    ],
    "red_o_points": [],
    "y_categories": ["L", "NOT APPLICABLE", "R", "nan"],
    "blue_o_points": [],
    "blue_x_points": [
      [0.02934, 1],
      [-0.00131, 3],
      [0.02293, 1],
      [0.00181, 0],
      [-0.00122, 3],
      [0.0226, 1],
      [0.02397, 1]
    ]
  },
  "QS_mulGraftNerve[IS]": {
    "red_x_points": [
      [-0.00015, 2],
      [-0.00052, 0],
      [-0.00036, 0],
      [-0.00046, 0],
      [-0.00051, 0],
      [-0.00035, 0],
      [-0.00035, 0],
      [-0.00022, 2],
      [-0.00045, 0],
      [-0.00041, 0],
      [-0.00027, 0],
      [-0.00017, 2],
      [-3e-5, 1],
      [-0.00011, 2],
      [-0.00056, 0],
      [-0.00024, 2],
      [-0.00028, 0],
      [-0.0005, 0],
      [-0.00028, 2],
      [-0.00017, 2],
      [-0.00013, 2],
      [-0.00044, 0],
      [-0.00031, 2],
      [-0.00023, 2],
      [-0.0002, 2],
      [-0.00032, 0],
      [-0.00011, 2],
      [-0.00025, 0],
      [-0.00012, 2],
      [0.00069, 1],
      [-0.0004, 0]
    ],
    "red_o_points": [],
    "y_categories": ["N", "NOT APPLICABLE", "nan"],
    "blue_o_points": [],
    "blue_x_points": [
      [0.00178, 1],
      [8e-5, 2],
      [0.00101, 1],
      [0.00014, 0],
      [6e-5, 2],
      [0.00095, 1],
      [0.00119, 1]
    ]
  },
  "QS_mulGraftNerve[MC]": {
    "red_x_points": [
      [-5e-5, 2],
      [-0.00036, 0],
      [-0.00037, 0],
      [-0.00032, 0],
      [-0.00023, 0],
      [-0.00031, 0],
      [-0.00026, 0],
      [0.0, 2],
      [-0.00023, 0],
      [-0.0004, 0],
      [-0.00031, 0],
      [-5e-5, 2],
      [0.0001, 1],
      [-8e-5, 2],
      [-0.00035, 0],
      [-6e-5, 2],
      [-0.0002, 0],
      [-0.00017, 0],
      [-2e-5, 2],
      [-3e-5, 2],
      [1e-5, 2],
      [-0.00026, 0],
      [-0.00011, 2],
      [-2e-5, 2],
      [-2e-5, 2],
      [-0.00031, 0],
      [-3e-5, 2],
      [-0.00022, 0],
      [-7e-5, 2],
      [0.00069, 1],
      [-0.00026, 0]
    ],
    "red_o_points": [],
    "y_categories": ["N", "NOT APPLICABLE", "nan"],
    "blue_o_points": [],
    "blue_x_points": [
      [0.00096, 1],
      [4e-5, 2],
      [0.0002, 1],
      [-2e-5, 0],
      [4e-5, 2],
      [0.0005, 1],
      [0.00084, 1]
    ]
  },
  "QA_yonPreOrtsurg": {
    "red_x_points": [
      [-0.00427, 0],
      [-5e-5, 2],
      [-3e-5, 0],
      [-9e-5, 0],
      [-6e-5, 0],
      [-0.00011, 0],
      [-0.0001, 0],
      [-0.0, 2],
      [-0.0001, 0],
      [-8e-5, 0],
      [-6e-5, 2],
      [0.00659, 1],
      [-0.00126, 0],
      [-9e-5, 2],
      [-0.00027, 0],
      [-0.00501, 0],
      [0.00028, 1],
      [-5e-5, 0],
      [-0.00389, 0],
      [-0.00435, 0],
      [-0.00429, 0],
      [-0.0001, 0],
      [-0.00446, 0],
      [-0.00523, 0],
      [-0.00463, 0],
      [-2e-5, 2],
      [0.00025, 2],
      [-0.0001, 0],
      [-0.00039, 2],
      [-0.00019, 2],
      [0.00027, 1]
    ],
    "red_o_points": [],
    "y_categories": ["N", "Y", "nan"],
    "blue_o_points": [],
    "blue_x_points": [
      [-7e-5, 0],
      [0.00288, 2],
      [-0.00023, 0],
      [-0.00024, 0],
      [0.01574, 1],
      [-0.00026, 0],
      [-0.00023, 0]
    ]
  },
  "QS_mulLysisNerve[Ssr]": {
    "red_x_points": [
      [-0.00049, 3],
      [-0.00053, 0],
      [-0.00167, 2],
      [-0.00065, 0],
      [-0.00062, 0],
      [-0.00043, 0],
      [-0.00059, 0],
      [-0.0006, 3],
      [-0.00062, 0],
      [-0.00066, 0],
      [-0.00062, 0],
      [-0.00042, 3],
      [0.00162, 1],
      [-0.00043, 3],
      [-0.00056, 0],
      [-0.00046, 3],
      [-0.00055, 0],
      [-0.00071, 0],
      [-0.00055, 3],
      [-0.00034, 3],
      [-0.0004, 3],
      [-0.00054, 0],
      [-0.00038, 3],
      [-0.0006, 3],
      [-0.00049, 3],
      [-0.0006, 0],
      [-0.00057, 3],
      [-0.00066, 0],
      [-0.00048, 3],
      [0.00253, 1],
      [-0.00054, 0]
    ],
    "red_o_points": [],
    "y_categories": ["N", "NOT APPLICABLE", "Y", "nan"],
    "blue_o_points": [],
    "blue_x_points": [
      [0.00238, 1],
      [-0.0002, 3],
      [0.00202, 1],
      [-0.00054, 0],
      [-0.00024, 3],
      [0.00259, 1],
      [0.00215, 1]
    ]
  },
  "QS_mulTransfSite[Oberlin]": {
    "red_x_points": [
      [-0.00364, 3],
      [-0.01119, 0],
      [-0.01101, 0],
      [-0.01082, 0],
      [-0.00485, 2],
      [-0.00429, 2],
      [-0.01134, 0],
      [-0.00343, 3],
      [-0.0043, 2],
      [-0.00505, 2],
      [-0.00449, 2],
      [-0.00383, 3],
      [0.01961, 1],
      [-0.00364, 3],
      [-0.00473, 2],
      [-0.00378, 3],
      [-0.01156, 0],
      [-0.00489, 2],
      [-0.00332, 3],
      [-0.00314, 3],
      [-0.00362, 3],
      [-0.01073, 0],
      [-0.00366, 3],
      [-0.00314, 3],
      [-0.00359, 3],
      [-0.00451, 2],
      [-0.00347, 3],
      [-0.01058, 0],
      [-0.00368, 3],
      [0.02007, 1],
      [-0.01032, 0]
    ],
    "red_o_points": [],
    "y_categories": ["N", "NOT APPLICABLE", "Y", "nan"],
    "blue_o_points": [],
    "blue_x_points": [
      [0.0256, 1],
      [-0.00103, 3],
      [0.02158, 1],
      [-0.00045, 2],
      [-0.00139, 3],
      [0.01866, 1],
      [0.02086, 1]
    ]
  },
  "QA_lstPexKine[Index]": {
    "red_x_points": [
      [-0.00124, 0],
      [-0.00033, 2],
      [-0.00061, 2],
      [-0.00049, 2],
      [8e-5, 1],
      [0.00053, 1],
      [-0.00107, 0],
      [0.00029, 2],
      [0.00041, 1],
      [6e-5, 1],
      [0.00039, 1],
      [-0.0004, 1],
      [-8e-5, 2],
      [0.00035, 2],
      [0.00018, 1],
      [0.00029, 2],
      [-3e-5, 2],
      [0.00027, 1],
      [-0.00033, 1],
      [-0.00071, 0],
      [-0.00045, 1],
      [-0.00065, 2],
      [0.00016, 2],
      [-0.00051, 1],
      [1e-5, 2],
      [-0.00048, 2],
      [-0.00042, 1],
      [-0.0001, 2],
      [-0.0003, 1],
      [-0.00015, 2],
      [-0.0006, 0]
    ],
    "red_o_points": [],
    "y_categories": ["NPV", "PV", "nan"],
    "blue_o_points": [],
    "blue_x_points": [
      [0.00032, 1],
      [0.00073, 2],
      [8e-5, 1],
      [0.00132, 1],
      [0.00054, 2],
      [0.00014, 1],
      [1e-5, 2]
    ]
  }
}
