{
  "participant_code": {
    "red_x_points": [
      [-0.03583, 1],
      [-0.0356, 2],
      [-0.03551, 3],
      [-0.03495, 4],
      [-0.03644, 5],
      [-0.03481, 6],
      [-0.03546, 7],
      [-0.03583, 8],
      [-0.03429, 9],
      [-0.03518, 10],
      [-0.03569, 11],
      [-0.03509, 12],
      [-0.03546, 14],
      [-0.03574, 16],
      [-0.03555, 17],
      [-0.03527, 19],
      [-0.03471, 20],
      [-0.03485, 22],
      [-0.03509, 23],
      [-0.03471, 25],
      [-0.03476, 26],
      [-0.03569, 27],
      [-0.03551, 28],
      [-0.03476, 29],
      [-0.03443, 30],
      [-0.03443, 32],
      [-0.03555, 33],
      [-0.03378, 34],
      [-0.03476, 35],
      [-0.03443, 36],
      [-0.03504, 37]
    ],
    "red_o_points": [],
    "y_categories": [
      "P16554",
      "P18297",
      "P19283",
      "P19287",
      "P23391",
      "P31645",
      "P31691",
      "P34778",
      "P35046",
      "P36328",
      "P43633",
      "P4544",
      "P46417",
      "P48965",
      "P53068",
      "P5497",
      "P59529",
      "P62483",
      "P64658",
      "P65202",
      "P66816",
      "P6751",
      "P7408",
      "P75566",
      "P76226",
      "P79971",
      "P82621",
      "P82990",
      "P84932",
      "P85825",
      "P86989",
      "P8770",
      "P87791",
      "P90550",
      "P93159",
      "P94969",
      "P96710",
      "P9744",
      "nan"
    ],
    "blue_o_points": [],
    "blue_x_points": [
      [0.10026, 0],
      [0.10563, 13],
      [0.10333, 15],
      [0.09735, 18],
      [0.1044, 21],
      [0.10379, 24],
      [0.10501, 31]
    ]
  },
  "QA_mulInjOrthesisType[ArmSling]": {
    "red_x_points": [
      [-0.01832, 2],
      [-0.01665, 2],
      [-0.01657, 2],
      [-0.01656, 2],
      [-0.01604, 2],
      [-0.017, 2],
      [-0.01607, 2],
      [-0.01751, 2],
      [-0.01665, 2],
      [-0.0165, 2],
      [-0.0164, 2],
      [-0.01748, 2],
      [0.0458, 1],
      [-0.01872, 2],
      [-0.01744, 2],
      [-0.0178, 2],
      [-0.01995, 0],
      [-0.01737, 2],
      [-0.01726, 2],
      [-0.01862, 2],
      [-0.01999, 0],
      [-0.02022, 3],
      [-0.01851, 2],
      [0.04999, 1],
      [-0.0174, 2],
      [-0.01641, 2],
      [-0.01767, 2],
      [-0.01682, 2],
      [-0.02011, 3],
      [-0.0342, 3],
      [-0.01618, 2]
    ],
    "red_o_points": [],
    "y_categories": ["N", "NOT APPLICABLE", "Y", "nan"],
    "blue_o_points": [],
    "blue_x_points": [
      [-0.00744, 2],
      [0.0528, 1],
      [0.04364, 1],
      [0.05406, 1],
      [0.05255, 1],
      [0.04483, 1],
      [0.04438, 1]
    ]
  },
  "QS_lstBpsurgSide": {
    "red_x_points": [
      [-0.00602, 3],
      [-0.00847, 0],
      [-0.00876, 0],
      [-0.00798, 0],
      [-0.0166, 2],
      [-0.00838, 0],
      [-0.00809, 0],
      [-0.00539, 3],
      [-0.00815, 0],
      [-0.01762, 2],
      [-0.01639, 2],
      [-0.00559, 3],
      [0.02676, 1],
      [-0.00563, 3],
      [-0.01933, 2],
      [-0.00581, 3],
      [-0.0183, 2],
      [-0.01697, 2],
      [-0.0055, 3],
      [-0.00595, 3],
      [-0.00497, 3],
      [-0.0073, 0],
      [-0.00606, 3],
      [-0.00619, 3],
      [-0.00606, 3],
      [-0.01688, 2],
      [-0.0055, 3],
      [-0.01699, 2],
      [-0.00487, 3],
      [0.03008, 1],
      [-0.0087, 0]
    ],
    "red_o_points": [],
    "y_categories": ["L", "NOT APPLICABLE", "R", "nan"],
    "blue_o_points": [],
    "blue_x_points": [
      [0.05074, 1],
      [-0.00189, 3],
      [0.03095, 1],
      [0.00351, 0],
      [-0.00225, 3],
      [0.02948, 1],
      [0.03335, 1]
    ]
  },
  "QS_mulBpsurgeryType[Lysis]": {
    "red_x_points": [
      [-0.00346, 3],
      [-0.00448, 0],
      [-0.00816, 2],
      [-0.00446, 0],
      [-0.00432, 0],
      [-0.00964, 2],
      [-0.00448, 0],
      [-0.00309, 3],
      [-0.00424, 0],
      [-0.0042, 0],
      [-0.00449, 0],
      [-0.00351, 3],
      [0.01094, 1],
      [-0.00364, 3],
      [-0.00417, 0],
      [-0.00361, 3],
      [-0.00964, 2],
      [-0.00432, 0],
      [-0.00351, 3],
      [-0.00353, 3],
      [-0.00311, 3],
      [-0.00393, 0],
      [-0.0037, 3],
      [-0.00373, 3],
      [-0.00345, 3],
      [-0.00453, 0],
      [-0.00337, 3],
      [-0.00415, 0],
      [-0.00284, 3],
      [0.01383, 1],
      [-0.00892, 2]
    ],
    "red_o_points": [],
    "y_categories": ["N", "NOT APPLICABLE", "Y", "nan"],
    "blue_o_points": [],
    "blue_x_points": [
      [0.02628, 1],
      [-0.00092, 3],
      [0.01514, 1],
      [0.00012, 0],
      [-0.00137, 3],
      [0.01451, 1],
      [0.01568, 1]
    ]
  },
  "QA_lstPexMuscstrength[ShoulderAbduc]": {
    "red_x_points": [
      [-0.01107, 1],
      [-0.01054, 1],
      [-0.01082, 1],
      [-0.0103, 1],
      [-0.01105, 1],
      [-0.01014, 1],
      [-0.01079, 1],
      [-0.0102, 1],
      [-0.01109, 1],
      [-0.01014, 1],
      [-0.01006, 1],
      [-0.01062, 1],
      [0.00596, 2],
      [0.00934, 2],
      [0.0087, 2],
      [0.00838, 2],
      [0.00916, 2],
      [-0.01064, 1],
      [-0.01094, 1],
      [-0.01056, 1],
      [-0.0105, 1],
      [-0.00989, 1],
      [0.00937, 2],
      [-0.01918, 1],
      [-0.01016, 1],
      [-0.0107, 1],
      [-0.01045, 1],
      [-0.01005, 1],
      [-0.01068, 1],
      [0.00465, 2],
      [-0.01024, 1]
    ],
    "red_o_points": [],
    "y_categories": ["GREATER THAN OR EQUALS TO 3", "LESS THAN 3", "nan"],
    "blue_o_points": [],
    "blue_x_points": [
      [0.00646, 2],
      [0.0099, 2],
      [0.04249, 0],
      [0.01092, 2],
      [0.00966, 2],
      [0.04697, 0],
      [-0.00359, 1]
    ]
  },
  "QS_mulNeuromadSite[C5]": {
    "red_x_points": [
      [-0.00147, 2],
      [-0.00273, 0],
      [-0.0027, 0],
      [-0.0029, 0],
      [-0.00281, 0],
      [-0.00293, 0],
      [-0.00265, 0],
      [-0.00104, 2],
      [-0.0029, 0],
      [-0.00276, 0],
      [-0.00288, 0],
      [-0.00132, 2],
      [0.00152, 1],
      [-0.00122, 2],
      [-0.00293, 0],
      [-0.00114, 2],
      [-0.00223, 0],
      [-0.00284, 0],
      [-0.00166, 2],
      [-0.00144, 2],
      [-0.0006, 2],
      [-0.00186, 0],
      [-0.00116, 2],
      [-0.00097, 2],
      [-0.00125, 2],
      [-0.00301, 0],
      [-0.00159, 2],
      [-0.00284, 0],
      [-0.00067, 2],
      [0.004, 1],
      [-0.00248, 0]
    ],
    "red_o_points": [],
    "y_categories": ["N", "NOT APPLICABLE", "nan"],
    "blue_o_points": [],
    "blue_x_points": [
      [0.01881, 1],
      [0.00043, 2],
      [0.00439, 1],
      [0.00114, 0],
      [9e-5, 2],
      [0.00472, 1],
      [0.00779, 1]
    ]
  },
  "QS_mulNeuromadSite[C7]": {
    "red_x_points": [
      [-0.00049, 2],
      [-0.00124, 0],
      [-0.00114, 0],
      [-0.00124, 0],
      [-0.00144, 0],
      [-0.00122, 0],
      [-0.00121, 0],
      [-0.00022, 2],
      [-0.00133, 0],
      [-0.00125, 0],
      [-0.00131, 0],
      [-0.0005, 2],
      [-0.00026, 1],
      [-0.00056, 2],
      [-0.00148, 0],
      [-0.00051, 2],
      [-0.00084, 0],
      [-0.0012, 0],
      [-0.00044, 2],
      [-0.00047, 2],
      [-0.00012, 2],
      [-0.00094, 0],
      [-0.00064, 2],
      [-0.00045, 2],
      [-0.00059, 2],
      [-0.00124, 0],
      [-0.00037, 2],
      [-0.00112, 0],
      [-0.00018, 2],
      [0.00089, 1],
      [-0.00125, 0]
    ],
    "red_o_points": [],
    "y_categories": ["N", "NOT APPLICABLE", "nan"],
    "blue_o_points": [],
    "blue_x_points": [
      [0.00883, 1],
      [0.00015, 2],
      [0.00184, 1],
      [0.00105, 0],
      [0.00028, 2],
      [0.00196, 1],
      [0.00279, 1]
    ]
  },
  "QA_mulInjOrthesisType[ShoulderSupport]": {
    "red_x_points": [
      [-0.02173, 0],
      [-0.01932, 0],
      [-0.01988, 0],
      [-0.01968, 0],
      [-0.01929, 0],
      [-0.02037, 0],
      [-0.01989, 0],
      [-0.02557, 2],
      [-0.02059, 0],
      [-0.02025, 0],
      [-0.02031, 0],
      [-0.02154, 0],
      [0.05832, 1],
      [-0.02135, 0],
      [-0.01993, 0],
      [-0.02233, 0],
      [-0.02415, 2],
      [-0.01986, 0],
      [-0.02232, 0],
      [-0.0216, 0],
      [-0.02627, 2],
      [-0.02415, 3],
      [-0.02206, 0],
      [0.05943, 1],
      [-0.02075, 0],
      [-0.02014, 0],
      [-0.02134, 0],
      [-0.02031, 0],
      [-0.02572, 3],
      [-0.0352, 3],
      [-0.02045, 0]
    ],
    "red_o_points": [],
    "y_categories": ["N", "NOT APPLICABLE", "Y", "nan"],
    "blue_o_points": [],
    "blue_x_points": [
      [-0.01112, 0],
      [0.06292, 1],
      [0.05103, 1],
      [0.06541, 1],
      [0.06149, 1],
      [0.0533, 1],
      [0.05639, 1]
    ]
  },
  "QS_mulTransfSite[IMc]": {
    "red_x_points": [
      [-0.00293, 3],
      [-0.00858, 2],
      [-0.00355, 0],
      [-0.00371, 0],
      [-0.00382, 0],
      [-0.00364, 0],
      [-0.00363, 0],
      [-0.00252, 3],
      [-0.00333, 0],
      [-0.00383, 0],
      [-0.0037, 0],
      [-0.00251, 3],
      [0.00929, 1],
      [-0.00259, 3],
      [-0.00363, 0],
      [-0.00269, 3],
      [-0.00873, 2],
      [-0.00372, 0],
      [-0.00271, 3],
      [-0.00253, 3],
      [-0.00207, 3],
      [-0.00335, 0],
      [-0.00258, 3],
      [-0.00271, 3],
      [-0.00291, 3],
      [-0.00383, 0],
      [-0.0027, 3],
      [-0.0075, 2],
      [-0.00204, 3],
      [0.01249, 1],
      [-0.00776, 2]
    ],
    "red_o_points": [],
    "y_categories": ["N", "NOT APPLICABLE", "Y", "nan"],
    "blue_o_points": [],
    "blue_x_points": [
      [0.02215, 1],
      [-0.00091, 3],
      [0.01212, 1],
      [-0.00114, 0],
      [-0.00063, 3],
      [0.01128, 1],
      [0.01435, 1]
    ]
  },
  "QS_mulNeuromadSite[T2]": {
    "red_x_points": [
      [-0.00349, 2],
      [-0.00969, 0],
      [-0.01023, 0],
      [-0.01013, 0],
      [-0.01098, 0],
      [-0.01013, 0],
      [-0.00998, 0],
      [-0.00273, 2],
      [-0.00999, 0],
      [-0.01058, 0],
      [-0.01046, 0],
      [-0.00354, 2],
      [0.01782, 1],
      [-0.00357, 2],
      [-0.01047, 0],
      [-0.00358, 2],
      [-0.00891, 0],
      [-0.01005, 0],
      [-0.0038, 2],
      [-0.00332, 2],
      [-0.00248, 2],
      [-0.00886, 0],
      [-0.00374, 2],
      [-0.00313, 2],
      [-0.00329, 2],
      [-0.01078, 0],
      [-0.00351, 2],
      [-0.01053, 0],
      [-0.00276, 2],
      [0.01868, 1],
      [-0.01048, 0]
    ],
    "red_o_points": [],
    "y_categories": ["N", "NOT APPLICABLE", "nan"],
    "blue_o_points": [],
    "blue_x_points": [
      [0.04045, 1],
      [-0.00066, 2],
      [0.02158, 1],
      [-0.00015, 0],
      [-0.00092, 2],
      [0.0212, 1],
      [0.02576, 1]
    ]
  },
  "QS_mulTransfSite[Oberlin]": {
    "red_x_points": [
      [-0.00537, 3],
      [-0.0168, 0],
      [-0.01673, 0],
      [-0.01624, 0],
      [-0.0084, 2],
      [-0.00767, 2],
      [-0.01752, 0],
      [-0.00503, 3],
      [-0.00718, 2],
      [-0.00812, 2],
      [-0.00816, 2],
      [-0.00584, 3],
      [0.02464, 1],
      [-0.0056, 3],
      [-0.00823, 2],
      [-0.00558, 3],
      [-0.01732, 0],
      [-0.00797, 2],
      [-0.00603, 3],
      [-0.00594, 3],
      [-0.00504, 3],
      [-0.01544, 0],
      [-0.0061, 3],
      [-0.00561, 3],
      [-0.00629, 3],
      [-0.00764, 2],
      [-0.00581, 3],
      [-0.01698, 0],
      [-0.00487, 3],
      [0.0286, 1],
      [-0.01694, 0]
    ],
    "red_o_points": [],
    "y_categories": ["N", "NOT APPLICABLE", "Y", "nan"],
    "blue_o_points": [],
    "blue_x_points": [
      [0.05037, 1],
      [-0.00206, 3],
      [0.02973, 1],
      [0.00184, 2],
      [-0.00222, 3],
      [0.0295, 1],
      [0.03365, 1]
    ]
  },
  "QS_mulNeuromadSite[C8]": {
    "red_x_points": [
      [-0.00177, 2],
      [-0.00396, 0],
      [-0.004, 0],
      [-0.00381, 0],
      [-0.00429, 0],
      [-0.00399, 0],
      [-0.00433, 0],
      [-0.00134, 2],
      [-0.00418, 0],
      [-0.00422, 0],
      [-0.0036, 0],
      [-0.00181, 2],
      [0.00354, 1],
      [-0.00175, 2],
      [-0.00408, 0],
      [-0.0018, 2],
      [-0.0036, 0],
      [-0.00411, 0],
      [-0.00169, 2],
      [-0.00168, 2],
      [-0.00079, 2],
      [-0.00324, 0],
      [-0.00192, 2],
      [-0.00162, 2],
      [-0.00174, 2],
      [-0.00405, 0],
      [-0.00166, 2],
      [-0.00391, 0],
      [-0.0009, 2],
      [0.0064, 1],
      [-0.00401, 0]
    ],
    "red_o_points": [],
    "y_categories": ["N", "NOT APPLICABLE", "nan"],
    "blue_o_points": [],
    "blue_x_points": [
      [0.02302, 1],
      [0.00027, 2],
      [0.00718, 1],
      [0.00093, 0],
      [0.0001, 2],
      [0.00598, 1],
      [0.0103, 1]
    ]
  },
  "QA_mulInjTbpiCause[Motorcycle]": {
    "red_x_points": [
      [0.00261, 0],
      [-0.00145, 1],
      [-0.00143, 1],
      [-0.00156, 1],
      [-0.00147, 1],
      [-0.00145, 1],
      [-0.00128, 1],
      [-0.00151, 1],
      [-0.00137, 1],
      [-0.0015, 1],
      [-0.00145, 1],
      [0.00294, 0],
      [-0.05642, 1],
      [-0.0024, 1],
      [-0.00238, 1],
      [-0.00223, 1],
      [-0.00218, 1],
      [-0.00147, 1],
      [0.00242, 0],
      [-0.0015, 1],
      [-0.00175, 1],
      [-0.00149, 1],
      [-0.00217, 1],
      [-0.00348, 1],
      [0.00325, 0],
      [-0.00145, 1],
      [-0.00155, 1],
      [-0.00159, 1],
      [-0.00154, 1],
      [-0.05245, 1],
      [-0.00142, 1]
    ],
    "red_o_points": [],
    "y_categories": ["N", "Y", "nan"],
    "blue_o_points": [],
    "blue_x_points": [
      [0.027, 0],
      [-0.00203, 1],
      [0.02278, 0],
      [-0.00383, 1],
      [-0.00195, 1],
      [0.0229, 0],
      [0.0252, 0]
    ]
  },
  "QA_yonInjBpsurg": {
    "red_x_points": [
      [-0.00711, 1],
      [-0.00652, 1],
      [-0.00684, 1],
      [-0.00673, 1],
      [-0.00689, 1],
      [-0.00659, 1],
      [-0.00672, 1],
      [-0.0063, 1],
      [-0.00686, 1],
      [-0.00669, 1],
      [-0.00683, 1],
      [-0.00733, 1],
      [0.01628, 0],
      [-0.00745, 1],
      [-0.00665, 1],
      [-0.00662, 1],
      [-0.00556, 1],
      [-0.00654, 1],
      [-0.00737, 1],
      [-0.00717, 1],
      [-0.00542, 1],
      [-0.00615, 1],
      [-0.00765, 1],
      [-0.00671, 1],
      [-0.0083, 1],
      [-0.00659, 1],
      [-0.00706, 1],
      [-0.00647, 1],
      [-0.00592, 1],
      [0.01741, 0],
      [-0.00682, 1]
    ],
    "red_o_points": [],
    "y_categories": ["N", "Y", "nan"],
    "blue_o_points": [],
    "blue_x_points": [
      [0.04104, 0],
      [-0.00178, 1],
      [0.02198, 0],
      [-0.00416, 1],
      [-0.00206, 1],
      [0.01902, 0],
      [0.02547, 0]
    ]
  },
  "QS_mulNeuromadSite[T1]": {
    "red_x_points": [
      [-0.0029, 2],
      [-0.00635, 0],
      [-0.00643, 0],
      [-0.00645, 0],
      [-0.00645, 0],
      [-0.00635, 0],
      [-0.00607, 0],
      [-0.00193, 2],
      [-0.00653, 0],
      [-0.00621, 0],
      [-0.00703, 0],
      [-0.00248, 2],
      [0.00713, 1],
      [-0.00236, 2],
      [-0.00658, 0],
      [-0.00233, 2],
      [-0.00575, 0],
      [-0.00674, 0],
      [-0.00266, 2],
      [-0.00258, 2],
      [-0.00186, 2],
      [-0.00561, 0],
      [-0.00249, 2],
      [-0.0024, 2],
      [-0.00264, 2],
      [-0.00664, 0],
      [-0.00262, 2],
      [-0.0063, 0],
      [-0.00177, 2],
      [0.01141, 1],
      [-0.00633, 0]
    ],
    "red_o_points": [],
    "y_categories": ["N", "NOT APPLICABLE", "nan"],
    "blue_o_points": [],
    "blue_x_points": [
      [0.02962, 1],
      [-3e-5, 2],
      [0.01173, 1],
      [0.00016, 0],
      [3e-5, 2],
      [0.0119, 1],
      [0.01926, 1]
    ]
  }
}
