{
  "QA_lstPexPain[C8]": {
    "red_x_points": [
      [0.00846, 0],
      [-0.00527, 2],
      [-0.00493, 2],
      [0.00616, 0],
      [-0.00578, 2],
      [-0.00678, 1],
      [-0.00946, 1],
      [-0.01039, 1],
      [-0.00684, 2],
      [-0.00663, 2],
      [-0.00952, 2],
      [-0.00564, 2],
      [-0.01023, 1],
      [0.00696, 0],
      [-0.01034, 1],
      [-0.00744, 1],
      [-0.00526, 2],
      [-0.00778, 2],
      [-0.00892, 2],
      [-0.00574, 2],
      [-0.01168, 1],
      [-0.0053, 1],
      [-0.01141, 1]
    ],
    "red_o_points": [],
    "y_categories": ["NORM", "NPV", "nan"],
    "blue_o_points": [],
    "blue_x_points": [
      [-0.00681, 1],
      [-0.00565, 1],
      [0.01238, 0],
      [-0.00237, 1],
      [0.01686, 0],
      [0.0139, 0],
      [0.01352, 0],
      [0.01146, 0],
      [-0.00488, 2],
      [-0.00103, 2],
      [-0.00398, 2],
      [-0.00111, 1],
      [-0.00422, 2],
      [0.01245, 0],
      [0.01281, 0],
      [0.01259, 0],
      [-0.00463, 2],
      [0.0124, 0],
      [0.01319, 0],
      [0.0176, 0],
      [0.01928, 0]
    ]
  },
  "QA_lstPexPain[C7]": {
    "red_x_points": [
      [-0.00716, 1],
      [-0.00831, 2],
      [-0.0079, 2],
      [-0.00776, 1],
      [-0.00719, 2],
      [-0.00557, 1],
      [-0.00671, 1],
      [-0.00783, 1],
      [-0.00814, 2],
      [-0.00862, 2],
      [-0.01027, 2],
      [-0.00794, 2],
      [-0.00735, 1],
      [0.01191, 0],
      [-0.00821, 1],
      [-0.00619, 1],
      [-0.00717, 2],
      [-0.00944, 2],
      [-0.01049, 2],
      [-0.00787, 2],
      [-0.00848, 1],
      [-0.00532, 1],
      [-0.00792, 1]
    ],
    "red_o_points": [],
    "y_categories": ["NORM", "NPV", "nan"],
    "blue_o_points": [],
    "blue_x_points": [
      [-0.0062, 1],
      [-0.00511, 1],
      [0.0192, 0],
      [-0.0027, 1],
      [0.02458, 0],
      [-0.00385, 1],
      [0.02232, 0],
      [0.02216, 0],
      [-0.00733, 2],
      [-0.00415, 2],
      [-0.00696, 2],
      [-0.00349, 1],
      [-0.00679, 2],
      [0.01998, 0],
      [0.01928, 0],
      [0.02032, 0],
      [-0.00639, 2],
      [0.02054, 0],
      [0.02382, 0],
      [-0.00651, 1],
      [0.0272, 0]
    ]
  },
  "QS_mulTransfSite[TrAx]": {
    "red_x_points": [
      [-0.00034, 1],
      [-0.00018, 0],
      [-3e-5, 0],
      [-8e-5, 0],
      [8e-5, 0],
      [0.0, 2],
      [3e-5, 2],
      [-0.00013, 0],
      [5e-5, 2],
      [-0.00013, 0],
      [1e-5, 2],
      [-0.00047, 1],
      [0.0, 2],
      [-0.0001, 0],
      [-1e-5, 2],
      [0.0, 0],
      [-0.00015, 0],
      [-0.00041, 1],
      [3e-5, 0],
      [1e-5, 2]
    ],
    "red_o_points": [],
    "y_categories": ["N", "NOT APPLICABLE", "nan"],
    "blue_o_points": [],
    "blue_x_points": [
      [5e-5, 2],
      [0.00013, 2],
      [5e-5, 0],
      [6e-5, 0],
      [0.00021, 0],
      [3e-5, 0],
      [9e-5, 0],
      [0.00015, 2],
      [0.00051, 1],
      [-0.00013, 0],
      [0.00018, 0],
      [0.00012, 2],
      [2e-5, 2],
      [5e-5, 2],
      [2e-5, 2],
      [0.00017, 2],
      [3e-5, 2],
      [5e-5, 2],
      [1e-5, 2]
    ]
  },
  "QA_lstPexKine[Index]": {
    "red_x_points": [
      [1e-5, 1],
      [-0.00107, 2],
      [-0.00239, 2],
      [0.0016, 1],
      [-0.00168, 2],
      [-0.01071, 0],
      [0.00076, 1],
      [-0.00025, 1],
      [-0.00096, 2],
      [0.00126, 1],
      [-0.00173, 2],
      [-0.00115, 2],
      [-0.00183, 2],
      [0.00168, 1],
      [3e-5, 1],
      [-0.0024, 0],
      [-0.00144, 2],
      [-0.00139, 2],
      [-0.0051, 2],
      [-0.00141, 2],
      [-0.00051, 2],
      [-0.00625, 0],
      [-0.00201, 2]
    ],
    "red_o_points": [],
    "y_categories": ["NPV", "PV", "nan"],
    "blue_o_points": [],
    "blue_x_points": [
      [0.00451, 0],
      [-0.00094, 2],
      [0.0014, 1],
      [0.0045, 1],
      [-0.0006, 2],
      [0.00474, 1],
      [0.00312, 1],
      [0.004, 1],
      [-0.00075, 2],
      [-0.0002, 2],
      [-0.00077, 2],
      [0.00687, 1],
      [-0.00029, 2],
      [0.00134, 1],
      [0.00123, 1],
      [0.00337, 0],
      [-0.00061, 2],
      [0.0016, 1],
      [-0.00011, 2],
      [0.00276, 1],
      [0.0018, 1]
    ]
  },
  "QA_yonInjDisloc": {
    "red_x_points": [
      [-4e-5, 2],
      [-4e-5, 2],
      [-6e-5, 2],
      [1e-5, 2],
      [-3e-5, 2],
      [-5e-5, 2],
      [-9e-5, 2],
      [0.0, 2],
      [-5e-5, 2],
      [-5e-5, 2],
      [2e-5, 2],
      [-4e-5, 2],
      [-2e-5, 2],
      [-5e-5, 2],
      [-0.01235, 1],
      [-9e-5, 2],
      [-4e-5, 2],
      [-4e-5, 2],
      [-1e-5, 2],
      [-2e-5, 2],
      [-3e-5, 2],
      [-0.00621, 1],
      [-4e-5, 2]
    ],
    "red_o_points": [],
    "y_categories": ["N", "Y", "nan"],
    "blue_o_points": [],
    "blue_x_points": [
      [5e-5, 2],
      [-0.0, 2],
      [5e-5, 2],
      [8e-5, 2],
      [4e-5, 2],
      [6e-5, 2],
      [3e-5, 2],
      [9e-5, 2],
      [0.00014, 2],
      [0.00015, 2],
      [-5e-5, 2],
      [0.00018, 2],
      [0.00912, 0],
      [0.00905, 0],
      [4e-5, 2],
      [5e-5, 2],
      [-4e-5, 2],
      [4e-5, 2],
      [0.0003, 2],
      [-3e-5, 2],
      [-4e-5, 2]
    ]
  },
  "QA_lstPexTouch[C7]": {
    "red_x_points": [
      [-0.01122, 1],
      [-0.0035, 2],
      [-0.00867, 1],
      [-0.00998, 1],
      [-0.00291, 2],
      [-0.00819, 1],
      [-0.00918, 1],
      [-0.01087, 1],
      [-0.00263, 2],
      [-0.0035, 2],
      [-0.01241, 1],
      [-0.00289, 2],
      [-0.0105, 1],
      [0.00987, 0],
      [-0.01073, 1],
      [-0.00949, 1],
      [-0.00277, 2],
      [0.01061, 0],
      [-0.00838, 1],
      [-0.00322, 2],
      [-0.0118, 1],
      [-0.00804, 1],
      [-0.01194, 1]
    ],
    "red_o_points": [],
    "y_categories": ["NORM", "NPV", "nan"],
    "blue_o_points": [],
    "blue_x_points": [
      [-0.00859, 1],
      [-0.00921, 1],
      [0.01785, 0],
      [-0.00596, 1],
      [0.01958, 0],
      [-0.00677, 1],
      [0.01911, 0],
      [-0.00729, 1],
      [-0.00046, 2],
      [0.0007, 2],
      [-0.00124, 2],
      [-0.00733, 1],
      [0.00046, 2],
      [0.01672, 0],
      [0.01596, 0],
      [0.01844, 0],
      [0.00046, 2],
      [0.01659, 0],
      [0.02096, 0],
      [0.02093, 0],
      [0.02142, 0]
    ]
  },
  "QA_lstPexTouch[C6]": {
    "red_x_points": [
      [-0.00541, 1],
      [-0.00281, 2],
      [-0.00306, 1],
      [-0.00323, 1],
      [-0.00293, 2],
      [-0.00284, 1],
      [-0.0027, 1],
      [-0.00468, 1],
      [-0.0032, 2],
      [-0.00304, 2],
      [-0.00429, 1],
      [-0.00294, 2],
      [-0.00352, 1],
      [-0.00363, 1],
      [-0.0048, 1],
      [-0.00275, 1],
      [-0.0024, 2],
      [-0.00431, 1],
      [-0.00344, 1],
      [-0.00375, 2],
      [-0.00429, 1],
      [-0.00263, 1],
      [-0.00409, 1]
    ],
    "red_o_points": [],
    "y_categories": ["NORM", "NPV", "nan"],
    "blue_o_points": [],
    "blue_x_points": [
      [-0.00332, 1],
      [-0.00314, 1],
      [0.01825, 0],
      [-0.00261, 1],
      [0.02646, 0],
      [-0.00268, 1],
      [-0.00267, 1],
      [-0.00264, 1],
      [-0.00132, 2],
      [0.00143, 2],
      [-0.00112, 2],
      [-0.00341, 1],
      [-0.00015, 2],
      [-0.00266, 1],
      [-0.00249, 1],
      [0.02106, 0],
      [-0.00086, 2],
      [0.01998, 0],
      [0.02885, 0],
      [-0.003, 1],
      [-0.00325, 1]
    ]
  },
  "QS_equBpsurgTime": {
    "red_x_points": [
      [0.00149, 3],
      [-0.01124, 0],
      [-0.0007, 2],
      [-0.01302, 0],
      [-0.00761, 0],
      [-0.00332, 1],
      [0.0, 3],
      [-0.00049, 3],
      [0.00196, 3],
      [-0.00898, 1],
      [0.00081, 3],
      [0.00109, 2],
      [0.00098, 3],
      [-0.00783, 2],
      [0.00073, 3],
      [0.00035, 3],
      [-0.00619, 0],
      [0.0018, 3],
      [-0.01205, 0],
      [-0.00852, 0],
      [0.00071, 3],
      [-0.00197, 2],
      [0.00132, 3]
    ],
    "red_o_points": [],
    "y_categories": [
      "0 TO 6 MONTHS",
      "13 TO 24 MONTHS",
      "7 TO 12 MONTHS",
      "nan"
    ],
    "blue_o_points": [],
    "blue_x_points": [
      [0.00191, 3],
      [0.0013, 3],
      [0.00045, 0],
      [0.01134, 1],
      [0.00222, 3],
      [0.00658, 1],
      [0.0015, 0],
      [0.00658, 2],
      [0.00248, 3],
      [0.00239, 3],
      [0.01074, 2],
      [0.00788, 2],
      [0.00262, 3],
      [0.00098, 3],
      [0.00125, 3],
      [0.0011, 3],
      [0.00281, 3],
      [0.0012, 3],
      [0.00197, 3],
      [0.0016, 3],
      [0.00178, 3]
    ]
  },
  "QA_lstPexPain[T1]": {
    "red_x_points": [
      [-0.00508, 1],
      [-0.00412, 2],
      [-0.00436, 2],
      [0.00218, 0],
      [-0.00359, 2],
      [-0.00216, 1],
      [0.00124, 0],
      [0.00193, 0],
      [-0.00559, 2],
      [-0.00488, 2],
      [-0.00684, 2],
      [-0.00346, 2],
      [-0.00638, 1],
      [-0.00825, 1],
      [-0.00354, 1],
      [-0.00292, 1],
      [-0.00326, 2],
      [-0.00726, 2],
      [-0.00757, 2],
      [-0.00341, 2],
      [-0.00665, 1],
      [-0.00188, 1],
      [-0.00574, 1]
    ],
    "red_o_points": [],
    "y_categories": ["NORM", "NPV", "nan"],
    "blue_o_points": [],
    "blue_x_points": [
      [0.00045, 1],
      [-0.00123, 1],
      [0.00551, 0],
      [0.00242, 1],
      [0.01469, 0],
      [0.00029, 1],
      [0.012, 0],
      [0.00973, 0],
      [-0.00284, 2],
      [-1e-5, 2],
      [-0.00274, 2],
      [-0.00028, 1],
      [-0.00241, 2],
      [0.00688, 0],
      [0.00565, 0],
      [0.00766, 0],
      [-0.00256, 2],
      [-0.00269, 1],
      [0.01109, 0],
      [0.01419, 0],
      [0.01582, 0]
    ]
  },
  "QA_lstPexInspectio[ScapulaAlata]": {
    "red_x_points": [
      [-0.00123, 1],
      [-0.00016, 1],
      [-0.00057, 1],
      [-0.00036, 1],
      [-0.00019, 1],
      [-0.00019, 1],
      [-0.00121, 1],
      [-0.00241, 1],
      [-0.00057, 1],
      [-0.00017, 1],
      [-0.00095, 1],
      [-0.00014, 1],
      [-0.00058, 1],
      [-0.0012, 1],
      [-0.0015, 1],
      [-0.00065, 1],
      [-0.00014, 1],
      [-0.00045, 1],
      [-0.00045, 1],
      [-0.00049, 1],
      [-0.00121, 1],
      [-0.00046, 1],
      [-0.00043, 1]
    ],
    "red_o_points": [],
    "y_categories": ["ABS", "NAIA", "PT", "nan"],
    "blue_o_points": [],
    "blue_x_points": [
      [-0.00036, 1],
      [-0.00038, 1],
      [-0.00037, 1],
      [-0.0005, 1],
      [-0.00039, 1],
      [-0.00033, 1],
      [-0.00047, 1],
      [-0.00045, 1],
      [-0.00019, 1],
      [-0.00076, 1],
      [-0.00018, 1],
      [-0.00027, 1],
      [-0.00015, 1],
      [0.00952, 0],
      [-0.0003, 1],
      [-0.00031, 1],
      [-0.00058, 1],
      [-0.00015, 1],
      [0.01296, 2],
      [-0.00038, 1],
      [-0.00024, 1]
    ]
  },
  "QS_mulGraftRoot[T1]": {
    "red_x_points": [[-3e-5, 2], [-0.00025, 1], [-3e-5, 2], [-0.00018, 1]],
    "red_o_points": [],
    "y_categories": ["N", "NOT APPLICABLE", "nan"],
    "blue_o_points": [],
    "blue_x_points": [
      [2e-5, 2],
      [2e-5, 2],
      [2e-5, 0],
      [0.00012, 0],
      [0.00012, 0],
      [5e-5, 0],
      [2e-5, 0],
      [5e-5, 0],
      [2e-5, 2],
      [2e-5, 2],
      [2e-5, 2],
      [2e-5, 2],
      [2e-5, 2]
    ]
  },
  "QA_yonInjFracture": {
    "red_x_points": [
      [0.00411, 0],
      [-0.00281, 2],
      [0.00321, 0],
      [-0.00456, 2],
      [-0.00839, 1],
      [-0.01111, 1],
      [0.00139, 0],
      [0.00223, 0],
      [-0.01368, 1],
      [-0.01072, 1],
      [0.00347, 0],
      [-0.00978, 1],
      [-0.01368, 1],
      [-0.00195, 0],
      [-0.01176, 1],
      [-0.00838, 1],
      [-0.00714, 1],
      [0.00324, 0],
      [0.00334, 0],
      [0.0038, 0],
      [-0.00892, 1],
      [-0.00655, 1],
      [-0.01827, 1]
    ],
    "red_o_points": [],
    "y_categories": ["N", "Y", "nan"],
    "blue_o_points": [],
    "blue_x_points": [
      [0.00939, 0],
      [0.00944, 0],
      [0.003, 0],
      [0.00574, 0],
      [0.00901, 2],
      [0.00732, 0],
      [0.00293, 1],
      [0.00154, 1],
      [-0.00763, 1],
      [0.00751, 0],
      [0.00977, 0],
      [0.01009, 0],
      [0.00828, 0],
      [0.00317, 0],
      [0.00382, 0],
      [0.00574, 2],
      [0.00954, 0],
      [0.00492, 0],
      [0.00472, 0],
      [-0.00366, 1],
      [0.00829, 2]
    ]
  },
  "QS_mulGraftTrunk[MiddleTrunk]": {
    "red_x_points": [
      [-4e-5, 1],
      [-3e-5, 0],
      [-9e-5, 0],
      [3e-5, 0],
      [-9e-5, 2],
      [-0.00014, 1],
      [0.0, 2],
      [-3e-5, 0],
      [2e-5, 2],
      [-0.00033, 1],
      [1e-5, 2],
      [-0.00014, 0],
      [0.0, 2],
      [-0.00014, 0],
      [-4e-5, 1],
      [0.0, 2]
    ],
    "red_o_points": [],
    "y_categories": ["N", "NOT APPLICABLE", "nan"],
    "blue_o_points": [],
    "blue_x_points": [
      [1e-5, 2],
      [1e-5, 2],
      [4e-5, 0],
      [0.00014, 0],
      [0.0001, 0],
      [0.00017, 0],
      [7e-5, 0],
      [0.0, 2],
      [0.00024, 1],
      [-3e-5, 0],
      [-3e-5, 0],
      [6e-5, 2],
      [0.0, 2],
      [5e-5, 2],
      [0.0, 2],
      [0.00011, 1],
      [0.0, 2]
    ]
  },
  "QS_mulGraftNerve[Ac]": {
    "red_x_points": [
      [-0.00144, 1],
      [-0.00028, 0],
      [-0.0003, 0],
      [0.00015, 0],
      [-0.00014, 0],
      [0.00011, 0],
      [-7e-5, 2],
      [-0.00113, 1],
      [0.00023, 2],
      [-0.00044, 0],
      [8e-5, 2],
      [-0.00041, 0],
      [4e-5, 2],
      [-0.0001, 0],
      [-0.00103, 1],
      [7e-5, 2],
      [-0.00013, 0],
      [0.00014, 2],
      [-0.00028, 0],
      [-0.00038, 0],
      [-0.00089, 1],
      [3e-5, 0],
      [-4e-5, 2]
    ],
    "red_o_points": [],
    "y_categories": ["N", "NOT APPLICABLE", "nan"],
    "blue_o_points": [],
    "blue_x_points": [
      [0.00044, 2],
      [0.00029, 2],
      [0.00011, 0],
      [0.00037, 0],
      [9e-5, 2],
      [0.00068, 0],
      [0.00025, 0],
      [0.0001, 0],
      [0.00022, 2],
      [0.00139, 1],
      [-4e-5, 0],
      [0.00111, 0],
      [0.00012, 2],
      [0.00012, 2],
      [9e-5, 2],
      [8e-5, 2],
      [0.00028, 2],
      [0.00019, 2],
      [0.00017, 1],
      [9e-5, 2],
      [6e-5, 2]
    ]
  },
  "QA_lstPexArthre[Shoulder]": {
    "red_x_points": [
      [0.0053, 2],
      [-0.00216, 3],
      [-0.0037, 3],
      [0.00624, 2],
      [-0.01476, 0],
      [-0.01791, 1],
      [0.00615, 2],
      [0.00604, 2],
      [-0.00277, 3],
      [0.00499, 2],
      [-0.00349, 3],
      [-0.00196, 3],
      [-0.00396, 3],
      [-0.02775, 1],
      [0.00548, 2],
      [-0.0135, 1],
      [-0.00262, 3],
      [-0.00342, 3],
      [-0.00622, 3],
      [-0.0024, 3],
      [-0.00324, 3],
      [-0.01274, 1],
      [-0.00414, 3]
    ],
    "red_o_points": [],
    "y_categories": ["NAIA", "NPV", "PV", "nan"],
    "blue_o_points": [],
    "blue_x_points": [
      [0.01049, 2],
      [-0.00279, 3],
      [0.00785, 2],
      [0.01127, 2],
      [-0.00158, 3],
      [0.01155, 2],
      [0.0107, 2],
      [0.00974, 2],
      [-0.00182, 3],
      [-0.00144, 3],
      [-0.00235, 3],
      [0.0109, 2],
      [-0.00151, 3],
      [0.00773, 2],
      [0.00701, 2],
      [-0.00174, 1],
      [-0.00175, 3],
      [0.00664, 2],
      [-0.00093, 3],
      [0.00865, 2],
      [0.00593, 2]
    ]
  },
  "QS_mulNeuromadSite[C8]": {
    "red_x_points": [
      [-0.00339, 1],
      [-0.00225, 0],
      [-0.00061, 0],
      [0.00021, 0],
      [-0.00145, 0],
      [0.00036, 0],
      [0.00019, 2],
      [-0.00448, 1],
      [0.00147, 2],
      [-0.00195, 0],
      [0.00054, 2],
      [-0.00219, 0],
      [0.00038, 2],
      [0.0001, 0],
      [-0.00545, 1],
      [0.00017, 2],
      [-0.0013, 0],
      [0.00025, 2],
      [-0.001, 0],
      [-0.00237, 0],
      [-0.00442, 1],
      [0.00015, 0],
      [0.00043, 2]
    ],
    "red_o_points": [],
    "y_categories": ["N", "NOT APPLICABLE", "nan"],
    "blue_o_points": [],
    "blue_x_points": [
      [0.00156, 2],
      [0.00101, 2],
      [0.00076, 0],
      [0.00139, 0],
      [0.00075, 2],
      [0.0009, 0],
      [0.00084, 0],
      [0.00076, 0],
      [0.00159, 2],
      [0.00598, 1],
      [-0.00137, 0],
      [0.00136, 0],
      [0.00194, 2],
      [0.00117, 2],
      [0.00104, 2],
      [0.00059, 2],
      [0.00182, 2],
      [0.00108, 2],
      [0.00107, 1],
      [0.00146, 2],
      [0.00093, 2]
    ]
  },
  "QS_mulGraftNerve[Ph]": {
    "red_x_points": [
      [-0.00093, 1],
      [-0.00094, 0],
      [-0.0004, 0],
      [0.00014, 0],
      [-0.00062, 0],
      [0.0002, 0],
      [-0.00018, 2],
      [-0.00149, 1],
      [0.00023, 2],
      [-0.00028, 0],
      [5e-5, 2],
      [-0.00047, 0],
      [-1e-5, 2],
      [2e-5, 0],
      [-0.00236, 1],
      [-2e-5, 2],
      [-0.00047, 0],
      [4e-5, 2],
      [-0.00018, 0],
      [-0.00109, 0],
      [-0.00099, 1],
      [0.0001, 0],
      [-5e-5, 2]
    ],
    "red_o_points": [],
    "y_categories": ["N", "NOT APPLICABLE", "nan"],
    "blue_o_points": [],
    "blue_x_points": [
      [0.00041, 2],
      [9e-5, 2],
      [0.00038, 0],
      [0.00054, 0],
      [0.00014, 2],
      [0.00082, 0],
      [0.00056, 0],
      [0.00026, 0],
      [0.00081, 2],
      [0.00219, 1],
      [-0.00014, 0],
      [0.00085, 0],
      [0.0006, 2],
      [0.0002, 2],
      [0.00017, 2],
      [0.00015, 2],
      [0.0006, 2],
      [0.00022, 2],
      [0.00015, 1],
      [0.00036, 2],
      [0.00032, 2]
    ]
  },
  "QA_lstPexMuscstrength[FingersFlex]": {
    "red_x_points": [
      [0.00213, 2],
      [0.00236, 2],
      [-0.02675, 1],
      [0.00795, 0],
      [-0.0258, 1],
      [-0.02698, 1],
      [-0.0287, 1],
      [0.00845, 0],
      [0.00247, 2],
      [0.00221, 2],
      [0.00914, 0],
      [0.0023, 2],
      [-0.03144, 1],
      [0.00752, 0],
      [0.00828, 0],
      [-0.02909, 1],
      [-0.0263, 1],
      [0.00256, 2],
      [0.00775, 0],
      [0.00792, 0],
      [0.00208, 2],
      [-0.02537, 1],
      [0.002, 2]
    ],
    "red_o_points": [],
    "y_categories": ["GREATER THAN OR EQUALS TO 3", "LESS THAN 3", "nan"],
    "blue_o_points": [],
    "blue_x_points": [
      [0.01147, 0],
      [0.01086, 0],
      [0.009, 0],
      [0.00914, 0],
      [0.00992, 0],
      [0.00934, 0],
      [0.00919, 0],
      [0.00907, 0],
      [0.00307, 2],
      [0.00343, 2],
      [0.00339, 2],
      [0.00406, 2],
      [0.00335, 2],
      [0.00958, 0],
      [0.00915, 0],
      [0.00914, 0],
      [0.00349, 2],
      [0.00299, 2],
      [0.0095, 0],
      [0.00308, 2],
      [0.00307, 2]
    ]
  },
  "QA_lstPexPalle[Elbow]": {
    "red_x_points": [
      [-0.00145, 4],
      [-0.00127, 4],
      [-0.00128, 4],
      [0.01053, 3],
      [-0.00115, 4],
      [-0.00123, 4],
      [-0.01513, 1],
      [-0.01294, 1],
      [-0.00121, 4],
      [-0.00151, 4],
      [-0.00142, 4],
      [-0.00112, 4],
      [-0.00123, 4],
      [-0.01566, 1],
      [-0.0012, 4],
      [-0.0213, 0],
      [-0.0189, 2],
      [-0.00152, 4],
      [-0.00174, 4],
      [-0.00138, 4],
      [0.00965, 3],
      [-0.01803, 0],
      [-0.00138, 4]
    ],
    "red_o_points": [],
    "y_categories": ["ABS", "HYPO", "NAIA", "PT", "nan"],
    "blue_o_points": [],
    "blue_x_points": [
      [-0.00068, 4],
      [-0.00095, 4],
      [0.01391, 3],
      [0.01672, 3],
      [-0.00078, 4],
      [-0.00093, 4],
      [-0.00545, 1],
      [0.01455, 3],
      [-0.00111, 4],
      [-0.00096, 4],
      [-0.00117, 4],
      [-0.00084, 4],
      [-0.00109, 4],
      [0.01558, 3],
      [0.01429, 3],
      [0.01384, 3],
      [-0.00111, 4],
      [0.01437, 3],
      [-0.00057, 4],
      [0.01544, 3],
      [-0.00116, 4]
    ]
  },
  "QS_mulGraftRoot[C5]": {
    "red_x_points": [
      [-0.00018, 1],
      [-0.00027, 0],
      [-0.00011, 0],
      [-1e-5, 0],
      [-3e-5, 0],
      [2e-5, 0],
      [-7e-5, 2],
      [-0.00058, 1],
      [8e-5, 2],
      [-0.00032, 0],
      [8e-5, 2],
      [-0.00029, 0],
      [3e-5, 2],
      [3e-5, 0],
      [-0.00043, 1],
      [-2e-5, 2],
      [-0.00031, 0],
      [-6e-5, 2],
      [-9e-5, 0],
      [-0.00021, 0],
      [-0.00044, 1],
      [6e-5, 0],
      [-2e-5, 2]
    ],
    "red_o_points": [],
    "y_categories": ["N", "NOT APPLICABLE", "nan"],
    "blue_o_points": [],
    "blue_x_points": [
      [7e-5, 2],
      [0.0001, 2],
      [4e-5, 0],
      [0.00018, 0],
      [7e-5, 2],
      [4e-5, 0],
      [0.00023, 0],
      [8e-5, 0],
      [0.00041, 2],
      [0.00074, 1],
      [-0.0003, 0],
      [0.0003, 0],
      [0.00032, 2],
      [6e-5, 2],
      [0.00012, 2],
      [9e-5, 2],
      [0.00032, 2],
      [7e-5, 2],
      [0.0001, 1],
      [5e-5, 2],
      [5e-5, 2]
    ]
  },
  "QA_lstPexPalle[Ulna]": {
    "red_x_points": [
      [-0.00103, 4],
      [-0.00124, 4],
      [-0.00101, 4],
      [-0.0249, 2],
      [-0.00103, 4],
      [-0.00068, 4],
      [-0.01004, 1],
      [0.00624, 3],
      [-0.00131, 4],
      [-0.00114, 4],
      [-0.00128, 4],
      [-0.00098, 4],
      [-0.0011, 4],
      [0.00714, 3],
      [-0.00082, 4],
      [-0.02044, 0],
      [-0.01723, 0],
      [-0.00119, 4],
      [-0.0014, 4],
      [-0.00106, 4],
      [0.00686, 3],
      [-0.01767, 0],
      [-0.00103, 4]
    ],
    "red_o_points": [],
    "y_categories": ["ABS", "HYPO", "NAIA", "PT", "nan"],
    "blue_o_points": [],
    "blue_x_points": [
      [-0.00057, 4],
      [-0.00056, 4],
      [0.00879, 3],
      [0.00897, 1],
      [-0.00085, 4],
      [-0.00054, 4],
      [0.01046, 3],
      [0.01125, 3],
      [-0.00099, 4],
      [-0.00093, 4],
      [-0.00087, 4],
      [-0.00049, 4],
      [-0.00103, 4],
      [0.01066, 3],
      [0.0106, 3],
      [0.01129, 3],
      [-0.00095, 4],
      [0.00948, 3],
      [-0.00057, 4],
      [0.01395, 3],
      [-0.00077, 4]
    ]
  },
  "QA_lstPexMuscstrength[ScapulaAbducSuprot]": {
    "red_x_points": [
      [-0.00111, 2],
      [-0.00066, 2],
      [-0.00474, 1],
      [-0.00204, 2],
      [-0.00427, 1],
      [-0.00766, 1],
      [-0.00883, 1],
      [0.00291, 0],
      [-0.00144, 2],
      [-0.0015, 2],
      [-0.00405, 2],
      [-0.00055, 2],
      [-0.00881, 1],
      [-0.00127, 0],
      [0.00375, 0],
      [-0.00833, 1],
      [-0.00277, 1],
      [-0.00155, 2],
      [-0.00697, 1],
      [0.00129, 0],
      [-0.00117, 2],
      [-0.00292, 1],
      [-0.00624, 2]
    ],
    "red_o_points": [],
    "y_categories": ["GREATER THAN OR EQUALS TO 3", "LESS THAN 3", "nan"],
    "blue_o_points": [],
    "blue_x_points": [
      [0.02005, 0],
      [0.01681, 0],
      [0.00305, 0],
      [-0.00085, 1],
      [-0.00166, 1],
      [0.00972, 0],
      [0.0066, 0],
      [0.00036, 1],
      [-0.00029, 2],
      [0.00022, 2],
      [0.00093, 2],
      [0.00141, 2],
      [0.00014, 2],
      [0.0053, 0],
      [0.00592, 0],
      [-0.00087, 2],
      [4e-5, 2],
      [0.00457, 0],
      [0.00041, 2],
      [-0.00213, 1],
      [-0.00082, 2]
    ]
  },
  "participant_code": {
    "red_x_points": [
      [-0.04001, 0],
      [-0.03924, 2],
      [-0.0371, 3],
      [-0.03904, 4],
      [-0.04069, 5],
      [-0.03924, 9],
      [-0.03924, 14],
      [-0.03924, 17],
      [-0.03817, 19],
      [-0.03953, 20],
      [-0.03856, 22],
      [-0.04031, 23],
      [-0.04031, 24],
      [-0.03836, 26],
      [-0.03885, 28],
      [-0.04011, 29],
      [-0.03691, 31],
      [-0.04031, 35],
      [-0.03856, 37],
      [-0.03982, 39],
      [-0.03856, 41],
      [-0.03749, 42],
      [-0.03895, 43]
    ],
    "red_o_points": [],
    "y_categories": [
      "P16554",
      "P18297",
      "P19283",
      "P19287",
      "P23172",
      "P23391",
      "P30595",
      "P31645",
      "P31691",
      "P34778",
      "P35046",
      "P36328",
      "P43633",
      "P4544",
      "P46417",
      "P48965",
      "P53068",
      "P5497",
      "P58556",
      "P59529",
      "P62483",
      "P64658",
      "P65202",
      "P66816",
      "P67052",
      "P6751",
      "P7408",
      "P75566",
      "P76226",
      "P79971",
      "P82621",
      "P82990",
      "P84549",
      "P84932",
      "P85825",
      "P86989",
      "P8770",
      "P87791",
      "P90550",
      "P93159",
      "P94969",
      "P96710",
      "P9744",
      "P98500",
      "nan"
    ],
    "blue_o_points": [],
    "blue_x_points": [
      [0.0434, 1],
      [0.04309, 6],
      [0.0434, 7],
      [0.04309, 8],
      [0.04083, 10],
      [0.04227, 11],
      [0.0435, 12],
      [0.04257, 13],
      [0.0435, 15],
      [0.04288, 16],
      [0.04206, 18],
      [0.04185, 21],
      [0.04515, 25],
      [0.04329, 27],
      [0.04329, 30],
      [0.04216, 32],
      [0.04257, 33],
      [0.04206, 34],
      [0.0436, 36],
      [0.04319, 38],
      [0.04083, 40]
    ]
  },
  "QS_mulGraftNerve[IS]": {
    "red_x_points": [
      [-7e-5, 1],
      [-8e-5, 0],
      [3e-5, 0],
      [3e-5, 0],
      [-8e-5, 0],
      [7e-5, 0],
      [0.0, 2],
      [-0.00028, 1],
      [-8e-5, 0],
      [-7e-5, 2],
      [3e-5, 2],
      [-0.00042, 1],
      [-2e-5, 2],
      [-8e-5, 0],
      [-6e-5, 2],
      [-7e-5, 0],
      [-0.00013, 1]
    ],
    "red_o_points": [],
    "y_categories": ["N", "NOT APPLICABLE", "nan"],
    "blue_o_points": [],
    "blue_x_points": [
      [7e-5, 2],
      [0.0, 2],
      [5e-5, 0],
      [0.00022, 0],
      [0.00013, 0],
      [7e-5, 0],
      [0.0001, 0],
      [0.00038, 1],
      [-2e-5, 0],
      [0.00012, 0],
      [0.00013, 2],
      [5e-5, 2],
      [0.0, 2],
      [-2e-5, 2]
    ]
  },
  "QA_mulInjOrthesisType[ArmSling]": {
    "red_x_points": [
      [-0.00601, 2],
      [-0.00703, 2],
      [-0.00347, 2],
      [-0.00196, 2],
      [-0.00462, 2],
      [-0.00331, 2],
      [-0.00139, 2],
      [-0.00147, 1],
      [-0.00815, 2],
      [-0.00664, 2],
      [-0.00417, 2],
      [-0.02039, 0],
      [-0.00612, 3],
      [-0.00138, 2],
      [9e-5, 1],
      [-0.0013, 2],
      [-0.01212, 3],
      [-0.00707, 2],
      [-0.00372, 2],
      [-0.00484, 2],
      [-0.00638, 3],
      [-0.00115, 2],
      [-0.00531, 2]
    ],
    "red_o_points": [],
    "y_categories": ["N", "NOT APPLICABLE", "Y", "nan"],
    "blue_o_points": [],
    "blue_x_points": [
      [-0.00172, 2],
      [-0.00183, 2],
      [-7e-5, 2],
      [-0.00072, 2],
      [-0.00166, 2],
      [-0.00098, 2],
      [-3e-5, 2],
      [-0.00041, 2],
      [0.03452, 1],
      [0.02759, 1],
      [-0.00517, 2],
      [0.0222, 1],
      [0.02571, 1],
      [-0.00028, 2],
      [0.00737, 0],
      [-0.00093, 2],
      [-0.00667, 2],
      [0.01084, 1],
      [0.01046, 1],
      [-0.00256, 2],
      [0.00226, 3]
    ]
  },
  "QS_mulGraftNerve[Ul]": {
    "red_x_points": [
      [-0.0004, 1],
      [-6e-5, 0],
      [6e-5, 0],
      [-6e-5, 0],
      [4e-5, 0],
      [8e-5, 2],
      [-0.0003, 1],
      [2e-5, 2],
      [-5e-5, 0],
      [-5e-5, 0],
      [0.00011, 2],
      [2e-5, 0],
      [-0.0003, 1],
      [3e-5, 2],
      [5e-5, 2],
      [-0.00017, 0],
      [-0.00018, 0],
      [-0.00016, 1],
      [4e-5, 0]
    ],
    "red_o_points": [],
    "y_categories": ["N", "NOT APPLICABLE", "nan"],
    "blue_o_points": [],
    "blue_x_points": [
      [9e-5, 2],
      [0.00014, 2],
      [2e-5, 0],
      [8e-5, 0],
      [0.00011, 2],
      [6e-5, 0],
      [9e-5, 0],
      [4e-5, 0],
      [6e-5, 2],
      [0.00023, 1],
      [-5e-5, 0],
      [4e-5, 0],
      [8e-5, 2],
      [3e-5, 2],
      [3e-5, 2],
      [2e-5, 2],
      [1e-5, 2],
      [8e-5, 1],
      [5e-5, 2],
      [5e-5, 2]
    ]
  },
  "QS_mulGraftNerve[Ssr]": {
    "red_x_points": [
      [-0.001, 1],
      [-0.00049, 0],
      [-3e-5, 0],
      [-2e-5, 0],
      [-0.0004, 0],
      [2e-5, 0],
      [-1e-5, 2],
      [-0.00078, 1],
      [0.00034, 2],
      [-0.00047, 0],
      [-5e-5, 2],
      [-0.0006, 0],
      [6e-5, 2],
      [-0.00018, 0],
      [-0.00158, 1],
      [-4e-5, 2],
      [-0.00043, 0],
      [-1e-5, 2],
      [-5e-5, 0],
      [-0.00045, 0],
      [-0.00101, 1],
      [7e-5, 0],
      [5e-5, 2]
    ],
    "red_o_points": [],
    "y_categories": ["N", "NOT APPLICABLE", "nan"],
    "blue_o_points": [],
    "blue_x_points": [
      [0.00049, 2],
      [0.00018, 2],
      [0.00034, 0],
      [0.00018, 0],
      [0.00017, 2],
      [0.00036, 0],
      [0.00038, 0],
      [6e-5, 0],
      [0.00062, 2],
      [0.00171, 1],
      [-0.0002, 0],
      [0.00036, 0],
      [0.00034, 2],
      [0.00022, 2],
      [0.00021, 2],
      [0.00011, 2],
      [0.00031, 2],
      [0.00022, 2],
      [0.00028, 1],
      [0.00047, 2],
      [0.00026, 2]
    ]
  },
  "QA_lstPexKine[Shoulder]": {
    "red_x_points": [
      [0.00107, 1],
      [-0.00135, 2],
      [-0.00235, 2],
      [0.00188, 1],
      [-0.00185, 2],
      [-0.0135, 0],
      [0.00107, 1],
      [0.00085, 1],
      [-0.00107, 2],
      [0.00182, 1],
      [-0.00203, 2],
      [-0.00147, 2],
      [-0.00119, 2],
      [-0.02529, 0],
      [0.00105, 1],
      [0.00122, 1],
      [-0.00126, 2],
      [-0.00149, 2],
      [-0.00594, 2],
      [-0.00175, 2],
      [-0.00102, 2],
      [0.00152, 1],
      [-0.00172, 2]
    ],
    "red_o_points": [],
    "y_categories": ["NPV", "PV", "nan"],
    "blue_o_points": [],
    "blue_x_points": [
      [0.00332, 1],
      [-0.00094, 2],
      [0.00483, 1],
      [0.00726, 1],
      [-0.00012, 2],
      [0.00838, 1],
      [0.00585, 1],
      [0.00629, 1],
      [-0.00035, 2],
      [-0.00042, 2],
      [-0.00137, 2],
      [0.00666, 1],
      [-0.00046, 2],
      [0.00309, 1],
      [0.00216, 1],
      [0.00249, 0],
      [-0.00062, 2],
      [0.00184, 1],
      [0.00013, 2],
      [0.00279, 1],
      [0.002, 1]
    ]
  },
  "QS_mulGraftNerve[MCA]": {
    "red_x_points": [
      [-0.00059, 1],
      [-0.00057, 0],
      [-0.00041, 0],
      [0.0001, 0],
      [-0.00028, 0],
      [0.00017, 0],
      [0.00011, 2],
      [-0.00087, 1],
      [0.00029, 2],
      [-0.00035, 0],
      [-5e-5, 2],
      [-0.00049, 0],
      [8e-5, 2],
      [-3e-5, 0],
      [-0.00126, 1],
      [1e-5, 2],
      [-0.00032, 0],
      [-0.0, 2],
      [-0.00037, 0],
      [-0.00042, 0],
      [-0.00076, 1],
      [3e-5, 0],
      [-4e-5, 2]
    ],
    "red_o_points": [],
    "y_categories": ["N", "NOT APPLICABLE", "nan"],
    "blue_o_points": [],
    "blue_x_points": [
      [0.00023, 2],
      [4e-5, 2],
      [0.00027, 0],
      [0.00024, 0],
      [3e-5, 2],
      [0.00056, 0],
      [0.00029, 0],
      [5e-5, 0],
      [0.00043, 2],
      [0.00144, 1],
      [-0.00018, 0],
      [0.00051, 0],
      [0.00038, 2],
      [0.00023, 2],
      [0.00018, 2],
      [0.0001, 2],
      [0.00031, 2],
      [0.00018, 2],
      [0.00034, 1],
      [0.00018, 2],
      [0.00021, 2]
    ]
  },
  "QA_lstPexInspectio[Swelling]": {
    "red_x_points": [
      [0.00093, 1],
      [0.00196, 1],
      [-0.00183, 0],
      [0.00182, 1],
      [-0.01392, 2],
      [0.002, 1],
      [-0.01937, 2],
      [-0.0018, 0],
      [-0.00852, 0],
      [0.00121, 1],
      [-0.00704, 0],
      [0.00163, 1],
      [0.00325, 1],
      [-0.03354, 2],
      [0.00184, 1],
      [-0.01613, 2],
      [0.00129, 1],
      [0.0028, 1],
      [0.00132, 1],
      [-0.00181, 0],
      [-0.00484, 0],
      [-0.00142, 0],
      [0.00332, 1]
    ],
    "red_o_points": [],
    "y_categories": ["ABS", "NAIA", "PT", "nan"],
    "blue_o_points": [],
    "blue_x_points": [
      [0.00737, 1],
      [0.00539, 1],
      [0.00399, 0],
      [0.0052, 0],
      [0.00445, 1],
      [0.00366, 1],
      [0.00775, 0],
      [0.00407, 1],
      [0.00458, 1],
      [0.00275, 1],
      [0.00283, 1],
      [0.00386, 1],
      [0.0037, 1],
      [0.00208, 0],
      [0.00439, 1],
      [0.00388, 1],
      [-4e-5, 0],
      [0.00367, 1],
      [0.00425, 0],
      [0.00459, 1],
      [0.00444, 1]
    ]
  },
  "QA_mulInjOrthesisType[ShoulderSupport]": {
    "red_x_points": [
      [-0.00561, 0],
      [-0.00708, 0],
      [-0.00381, 0],
      [-0.01345, 2],
      [-0.00416, 0],
      [-0.00256, 0],
      [-0.00159, 0],
      [-0.00036, 1],
      [-0.00761, 0],
      [-0.00594, 0],
      [-0.00478, 0],
      [-0.01395, 2],
      [-0.00738, 3],
      [-0.00133, 0],
      [0.00024, 1],
      [-0.00175, 0],
      [-0.01079, 3],
      [-0.00727, 0],
      [-0.00446, 0],
      [-0.00534, 0],
      [-0.00643, 3],
      [-0.00098, 0],
      [-0.00536, 0]
    ],
    "red_o_points": [],
    "y_categories": ["N", "NOT APPLICABLE", "Y", "nan"],
    "blue_o_points": [],
    "blue_x_points": [
      [-0.00212, 0],
      [-0.0014, 0],
      [0.00043, 0],
      [0.00064, 0],
      [0.00741, 2],
      [-0.0005, 0],
      [0.00012, 0],
      [0.00109, 0],
      [0.0332, 1],
      [0.02547, 1],
      [-0.00571, 0],
      [0.02141, 1],
      [0.02419, 1],
      [-0.00033, 0],
      [0.0035, 2],
      [-0.0008, 0],
      [-0.00615, 0],
      [0.01093, 1],
      [0.01077, 1],
      [-0.00115, 0],
      [0.00076, 3]
    ]
  },
  "QA_lstPexPain[C6]": {
    "red_x_points": [
      [-0.00037, 1],
      [-0.00277, 2],
      [-0.0027, 2],
      [-0.00076, 1],
      [-0.00265, 2],
      [-0.00013, 1],
      [-0.0008, 1],
      [-0.00055, 1],
      [-0.00394, 2],
      [-0.00348, 2],
      [-0.00484, 2],
      [-0.00211, 2],
      [-0.00106, 1],
      [-0.0018, 1],
      [-0.00041, 1],
      [-0.00078, 1],
      [-0.00267, 2],
      [-0.00435, 2],
      [-0.00404, 2],
      [-0.00324, 2],
      [-0.00073, 1],
      [-0.00042, 1],
      [-0.00113, 1]
    ],
    "red_o_points": [],
    "y_categories": ["NORM", "NPV", "nan"],
    "blue_o_points": [],
    "blue_x_points": [
      [-6e-5, 1],
      [-0.00022, 1],
      [0.00927, 0],
      [-0.0001, 1],
      [0.01599, 0],
      [7e-5, 1],
      [0.00013, 1],
      [-0.00012, 1],
      [-0.00241, 2],
      [-0.00234, 2],
      [-0.00254, 2],
      [-6e-5, 1],
      [-0.0022, 2],
      [0.01122, 0],
      [-0.00042, 1],
      [0.01135, 0],
      [-0.00224, 2],
      [0.01089, 0],
      [-9e-5, 1],
      [-0.00036, 1],
      [-6e-5, 1]
    ]
  },
  "QS_mulGraftTrunk[LowerTrunk]": {
    "red_x_points": [
      [-0.00072, 1],
      [-0.0004, 0],
      [-7e-5, 0],
      [7e-5, 0],
      [-0.0003, 0],
      [8e-5, 0],
      [-0.00011, 2],
      [-0.0012, 1],
      [0.00036, 2],
      [-0.0003, 0],
      [2e-5, 2],
      [-0.00048, 0],
      [-1e-5, 2],
      [0.0, 0],
      [-0.00158, 1],
      [3e-5, 2],
      [-0.00046, 0],
      [0.0, 2],
      [-7e-5, 0],
      [-0.00044, 0],
      [-0.0012, 1],
      [0.0, 0],
      [-0.00013, 2]
    ],
    "red_o_points": [],
    "y_categories": ["N", "NOT APPLICABLE", "nan"],
    "blue_o_points": [],
    "blue_x_points": [
      [0.00023, 2],
      [0.0, 2],
      [0.00035, 0],
      [0.00033, 0],
      [7e-5, 2],
      [0.0006, 0],
      [0.00072, 0],
      [0.00037, 0],
      [0.00037, 2],
      [0.00157, 1],
      [-0.00043, 0],
      [0.00047, 0],
      [0.00042, 2],
      [0.00018, 2],
      [0.00027, 2],
      [0.00024, 2],
      [0.0004, 2],
      [0.0003, 2],
      [-0.0, 1],
      [0.00029, 2],
      [0.00017, 2]
    ]
  },
  "QS_mulGraftRoot[T2]": {
    "red_x_points": [
      [-0.00033, 1],
      [-0.00027, 0],
      [-4e-5, 0],
      [5e-5, 0],
      [-0.00017, 0],
      [7e-5, 0],
      [-5e-5, 2],
      [-0.00014, 1],
      [4e-5, 2],
      [-0.0001, 0],
      [5e-5, 2],
      [-0.00011, 0],
      [3e-5, 2],
      [2e-5, 0],
      [-0.00053, 1],
      [-0.0, 2],
      [-0.00012, 0],
      [6e-5, 2],
      [-4e-5, 0],
      [-0.00025, 0],
      [-0.0003, 1],
      [5e-5, 0],
      [1e-5, 2]
    ],
    "red_o_points": [],
    "y_categories": ["N", "NOT APPLICABLE", "nan"],
    "blue_o_points": [],
    "blue_x_points": [
      [0.00011, 2],
      [1e-5, 2],
      [4e-5, 0],
      [5e-5, 0],
      [2e-5, 2],
      [0.00026, 0],
      [0.00017, 0],
      [5e-5, 0],
      [0.00025, 2],
      [0.00058, 1],
      [-0.00012, 0],
      [0.00018, 0],
      [0.00014, 2],
      [2e-5, 2],
      [5e-5, 2],
      [2e-5, 2],
      [0.00025, 2],
      [-8e-5, 1],
      [2e-5, 2],
      [5e-5, 2]
    ]
  },
  "QS_mulGraftTrunk[UpperTrunk]": {
    "red_x_points": [
      [-0.0074, 1],
      [-0.00464, 0],
      [-0.00133, 0],
      [-0.00017, 0],
      [-0.00317, 0],
      [0.00047, 0],
      [0.00027, 3],
      [-0.00858, 1],
      [0.00395, 3],
      [-0.02028, 2],
      [0.00129, 3],
      [-0.004, 0],
      [0.00084, 3],
      [0.00018, 0],
      [-0.00832, 1],
      [0.00067, 3],
      [-0.00319, 0],
      [0.00147, 3],
      [-0.00167, 0],
      [-0.00449, 0],
      [-0.00712, 1],
      [0.00029, 0],
      [0.0012, 3]
    ],
    "red_o_points": [],
    "y_categories": ["N", "NOT APPLICABLE", "Y", "nan"],
    "blue_o_points": [],
    "blue_x_points": [
      [0.00253, 3],
      [0.00185, 3],
      [0.00253, 0],
      [0.00245, 0],
      [0.00139, 3],
      [0.00428, 0],
      [0.00296, 0],
      [0.00181, 0],
      [0.00533, 3],
      [0.01222, 1],
      [-0.00148, 0],
      [0.00488, 0],
      [0.00473, 3],
      [0.00138, 3],
      [0.00187, 3],
      [0.00142, 3],
      [0.00503, 3],
      [0.00197, 3],
      [0.00114, 1],
      [0.00309, 3],
      [0.00233, 3]
    ]
  },
  "QS_mulTransfSite[PhMc]": {
    "red_x_points": [
      [-0.00666, 1],
      [-0.00413, 0],
      [-0.00067, 0],
      [0.00108, 0],
      [-0.00227, 0],
      [-0.01322, 2],
      [0.00114, 3],
      [-0.00699, 1],
      [0.0032, 3],
      [-0.00288, 0],
      [0.00153, 3],
      [-0.00324, 0],
      [0.00139, 3],
      [8e-5, 0],
      [-0.01085, 1],
      [0.00098, 3],
      [-0.00889, 2],
      [0.00191, 3],
      [-0.00096, 0],
      [-0.00391, 0],
      [-0.00703, 1],
      [0.00159, 0],
      [0.00196, 3]
    ],
    "red_o_points": [],
    "y_categories": ["N", "NOT APPLICABLE", "Y", "nan"],
    "blue_o_points": [],
    "blue_x_points": [
      [0.00344, 3],
      [0.00253, 3],
      [0.00097, 0],
      [0.00307, 0],
      [0.00153, 3],
      [0.0043, 0],
      [0.00166, 0],
      [0.00173, 0],
      [0.00472, 3],
      [0.00909, 1],
      [-0.00184, 0],
      [0.00433, 0],
      [0.00399, 3],
      [0.0013, 3],
      [0.00219, 3],
      [0.0016, 3],
      [0.00466, 3],
      [0.00166, 3],
      [0.00086, 1],
      [0.00256, 3],
      [0.00249, 3]
    ]
  },
  "QA_yonPexPain": {
    "red_x_points": [
      [-0.01153, 1],
      [-0.01269, 1],
      [-0.011, 1],
      [-0.01154, 1],
      [-0.01193, 1],
      [-0.01124, 1],
      [-0.01121, 1],
      [-0.0111, 1],
      [-0.01221, 1],
      [-0.01269, 1],
      [0.01524, 0],
      [-0.01277, 1],
      [-0.01194, 1],
      [-0.01213, 1],
      [0.01416, 0],
      [-0.01114, 1],
      [-0.01132, 1],
      [-0.01247, 1],
      [-0.01233, 1],
      [-0.01218, 1],
      [-0.01256, 1],
      [-0.01085, 1],
      [-0.0134, 1]
    ],
    "red_o_points": [],
    "y_categories": ["N", "Y", "nan"],
    "blue_o_points": [],
    "blue_x_points": [
      [-0.01101, 1],
      [0.02338, 0],
      [0.01916, 0],
      [0.02133, 0],
      [-0.01111, 1],
      [0.0232, 0],
      [-0.01097, 1],
      [-0.01064, 1],
      [-0.01242, 1],
      [0.03221, 2],
      [0.02561, 0],
      [-0.01266, 1],
      [0.02253, 0],
      [0.01974, 0],
      [0.02016, 0],
      [0.02045, 0],
      [0.03326, 2],
      [0.02124, 0],
      [-0.00998, 1],
      [-0.01181, 1],
      [0.02914, 2]
    ]
  },
  "QS_mulLysisRoot[C6]": {
    "red_x_points": [
      [-0.0035, 1],
      [-0.00035, 0],
      [-0.00812, 2],
      [0.00135, 0],
      [-0.00032, 0],
      [0.0018, 0],
      [0.00057, 3],
      [-0.00369, 1],
      [0.00052, 3],
      [-0.00034, 0],
      [0.00087, 3],
      [-0.00044, 0],
      [0.00087, 3],
      [0.00089, 0],
      [-0.0033, 1],
      [0.00053, 3],
      [-0.0005, 0],
      [0.00089, 3],
      [0.00067, 0],
      [-0.00049, 0],
      [-0.00315, 1],
      [-0.00706, 2],
      [0.00076, 3]
    ],
    "red_o_points": [],
    "y_categories": ["N", "NOT APPLICABLE", "Y", "nan"],
    "blue_o_points": [],
    "blue_x_points": [
      [0.00123, 3],
      [0.00119, 3],
      [0.00046, 0],
      [0.00276, 0],
      [0.00073, 3],
      [0.00196, 0],
      [0.00126, 0],
      [0.00152, 0],
      [0.00059, 3],
      [0.00177, 1],
      [-0.00037, 0],
      [0.00275, 0],
      [0.00081, 3],
      [0.00043, 3],
      [0.00032, 3],
      [0.00015, 3],
      [0.00116, 3],
      [0.00043, 3],
      [0.00141, 1],
      [0.00069, 3],
      [0.0003, 3]
    ]
  },
  "QA_lstPexMuscstrength[ThumbOppo]": {
    "red_x_points": [
      [0.00049, 2],
      [0.00018, 2],
      [-0.00993, 1],
      [-0.02002, 1],
      [-0.00803, 1],
      [-0.01293, 1],
      [-0.0012, 0],
      [0.00245, 0],
      [0.00059, 2],
      [-5e-5, 2],
      [-0.0025, 0],
      [0.00043, 2],
      [-0.00856, 1],
      [0.00396, 0],
      [0.00253, 0],
      [-0.00606, 1],
      [-0.00716, 1],
      [0.0006, 2],
      [0.00308, 0],
      [-0.00824, 1],
      [-3e-5, 2],
      [-0.01042, 1],
      [-0.00078, 2]
    ],
    "red_o_points": [],
    "y_categories": ["GREATER THAN OR EQUALS TO 3", "LESS THAN 3", "nan"],
    "blue_o_points": [],
    "blue_x_points": [
      [-0.00126, 1],
      [0.00074, 1],
      [0.00438, 0],
      [0.00721, 0],
      [0.00628, 0],
      [0.00845, 0],
      [0.00591, 0],
      [0.00883, 0],
      [0.00154, 2],
      [0.00142, 2],
      [0.00195, 2],
      [0.00752, 2],
      [0.00179, 2],
      [0.00363, 0],
      [0.0045, 0],
      [0.00559, 0],
      [0.00288, 2],
      [0.00143, 2],
      [0.00508, 0],
      [0.00251, 2],
      [0.00122, 2]
    ]
  },
  "QS_mulTransfSite[MeMc]": {
    "red_x_points": [
      [-0.00015, 1],
      [2e-5, 0],
      [3e-5, 0],
      [2e-5, 0],
      [2e-5, 0],
      [3e-5, 2],
      [-0.00015, 1],
      [2e-5, 0],
      [2e-5, 2],
      [1e-5, 2],
      [3e-5, 0],
      [-0.00033, 1],
      [3e-5, 2],
      [-0.00013, 0],
      [-0.00013, 2],
      [2e-5, 0],
      [-6e-5, 1],
      [3e-5, 0]
    ],
    "red_o_points": [],
    "y_categories": ["N", "NOT APPLICABLE", "nan"],
    "blue_o_points": [],
    "blue_x_points": [
      [3e-5, 2],
      [3e-5, 2],
      [4e-5, 0],
      [5e-5, 0],
      [4e-5, 0],
      [4e-5, 0],
      [3e-5, 0],
      [0.00027, 1],
      [3e-5, 0],
      [2e-5, 2],
      [2e-5, 2],
      [2e-5, 2],
      [2e-5, 2],
      [2e-5, 2],
      [1e-5, 2],
      [2e-5, 2]
    ]
  },
  "QS_mulGraftNerve[FI]": {
    "red_x_points": [
      [-0.00099, 1],
      [-0.00069, 0],
      [-9e-5, 0],
      [-6e-5, 0],
      [-0.00058, 0],
      [9e-5, 0],
      [-0.00012, 2],
      [-0.00169, 1],
      [0.00047, 2],
      [-0.0008, 0],
      [5e-5, 2],
      [-0.00083, 0],
      [-0.0, 2],
      [-5e-5, 0],
      [-0.00113, 1],
      [-4e-5, 2],
      [-0.00048, 0],
      [4e-5, 2],
      [-0.00042, 0],
      [-0.00075, 0],
      [-0.00105, 1],
      [0.00011, 0],
      [0.0, 2]
    ],
    "red_o_points": [],
    "y_categories": ["N", "NOT APPLICABLE", "nan"],
    "blue_o_points": [],
    "blue_x_points": [
      [0.00041, 2],
      [0.00034, 2],
      [0.00033, 0],
      [0.00067, 0],
      [0.00023, 2],
      [0.00044, 0],
      [0.00027, 0],
      [0.00011, 0],
      [0.00054, 2],
      [0.00216, 1],
      [-0.00019, 0],
      [0.0009, 0],
      [0.00048, 2],
      [0.00019, 2],
      [0.00032, 2],
      [0.00012, 2],
      [0.00045, 2],
      [0.0004, 2],
      [0.00028, 1],
      [0.00025, 2],
      [0.00032, 2]
    ]
  },
  "QS_mulGraftNerve[other]": {
    "red_x_points": [
      [-0.00418, 1],
      [-0.00261, 0],
      [-0.00089, 0],
      [0.0003, 0],
      [-0.00133, 0],
      [0.0005, 0],
      [-1e-5, 2],
      [-0.00431, 1],
      [0.00141, 2],
      [-0.00197, 0],
      [0.00042, 2],
      [-0.00207, 0],
      [0.00029, 2],
      [-0.00022, 0],
      [-0.00514, 1],
      [0.00011, 2],
      [-0.00187, 0],
      [0.00047, 2],
      [-0.00134, 0],
      [-0.00256, 0],
      [-0.00348, 1],
      [0.00024, 0],
      [0.00022, 2]
    ],
    "red_o_points": [],
    "y_categories": ["N", "NOT APPLICABLE", "nan"],
    "blue_o_points": [],
    "blue_x_points": [
      [0.00126, 2],
      [0.00064, 2],
      [0.00107, 0],
      [0.00124, 0],
      [0.00057, 2],
      [0.00197, 0],
      [0.00096, 0],
      [0.00072, 0],
      [0.00227, 2],
      [0.00586, 1],
      [-0.0009, 0],
      [0.00167, 0],
      [0.00215, 2],
      [0.00067, 2],
      [0.00073, 2],
      [0.00055, 2],
      [0.00238, 2],
      [0.00071, 2],
      [0.00094, 1],
      [0.00143, 2],
      [0.00113, 2]
    ]
  },
  "QS_mulTransfSite[AcSsAA]": {
    "red_x_points": [
      [-0.00795, 1],
      [-0.01506, 2],
      [-0.00229, 0],
      [-0.00107, 0],
      [-0.00909, 2],
      [0.00084, 0],
      [0.00024, 3],
      [-0.00924, 1],
      [0.005, 3],
      [-0.01669, 2],
      [0.00237, 3],
      [-0.00229, 0],
      [0.00177, 3],
      [-0.0066, 0],
      [-0.01157, 1],
      [0.0011, 3],
      [-0.00991, 2],
      [0.00291, 3],
      [-0.0029, 0],
      [-0.01249, 2],
      [-0.00857, 1],
      [8e-5, 0],
      [0.00238, 3]
    ],
    "red_o_points": [],
    "y_categories": ["N", "NOT APPLICABLE", "Y", "nan"],
    "blue_o_points": [],
    "blue_x_points": [
      [0.00462, 3],
      [0.00338, 3],
      [0.00452, 2],
      [0.00242, 0],
      [0.00291, 3],
      [0.00305, 0],
      [0.00949, 2],
      [0.00045, 0],
      [0.00697, 3],
      [0.0147, 1],
      [0.00596, 0],
      [0.00404, 0],
      [0.00651, 3],
      [0.0029, 3],
      [0.00313, 3],
      [0.00233, 3],
      [0.00666, 3],
      [0.0033, 3],
      [0.0039, 1],
      [0.00405, 3],
      [0.00372, 3]
    ]
  },
  "QS_mulGraftNerve[DS]": {
    "red_x_points": [
      [-8e-5, 0],
      [-8e-5, 0],
      [1e-5, 0],
      [3e-5, 2],
      [-0.00014, 1],
      [4e-5, 2],
      [1e-5, 0],
      [-8e-5, 0],
      [4e-5, 2],
      [-0.00014, 1],
      [-8e-5, 0],
      [-8e-5, 0],
      [-8e-5, 0],
      [4e-5, 2]
    ],
    "red_o_points": [],
    "y_categories": ["N", "NOT APPLICABLE", "nan"],
    "blue_o_points": [],
    "blue_x_points": [
      [3e-5, 2],
      [4e-5, 2],
      [1e-5, 0],
      [1e-5, 0],
      [4e-5, 2],
      [1e-5, 0],
      [1e-5, 0],
      [4e-5, 2],
      [0.00012, 1],
      [1e-5, 0],
      [4e-5, 2],
      [3e-5, 2],
      [3e-5, 2],
      [4e-5, 2],
      [3e-5, 2],
      [3e-5, 2],
      [3e-5, 2]
    ]
  },
  "QA_txtInjMedicatioListNer": {
    "red_x_points": [
      [-0.00654, 1],
      [-0.00647, 1],
      [-0.00565, 1],
      [-0.00462, 1],
      [-0.00708, 1],
      [-0.00018, 2],
      [-0.00603, 1],
      [0.00421, 0],
      [-0.00653, 2],
      [-0.0033, 2],
      [-0.00212, 2],
      [-0.00358, 2],
      [-0.00763, 1],
      [-0.00595, 1],
      [-0.00065, 2],
      [-0.00653, 1],
      [-0.00235, 2],
      [-0.0071, 1],
      [-0.00804, 1],
      [-0.00744, 1],
      [-0.00441, 1],
      [-0.00011, 2],
      [-0.00201, 2]
    ],
    "red_o_points": [],
    "y_categories": ["N", "Y", "nan"],
    "blue_o_points": [],
    "blue_x_points": [
      [0.02789, 0],
      [0.00154, 2],
      [0.01121, 0],
      [-0.00295, 1],
      [0.00092, 2],
      [0.00151, 2],
      [0.00158, 2],
      [-0.00401, 1],
      [-0.00286, 1],
      [-0.00486, 1],
      [0.0289, 0],
      [-0.00055, 2],
      [0.02089, 0],
      [-0.00358, 1],
      [0.00153, 2],
      [0.00051, 2],
      [-0.00324, 1],
      [0.01386, 0],
      [0.0166, 0],
      [-0.00481, 1],
      [-0.0, 2]
    ]
  },
  "QS_mulGraftNerve[Ax]": {
    "red_x_points": [
      [-0.00188, 1],
      [-0.00134, 0],
      [-0.00027, 0],
      [6e-5, 0],
      [-0.00071, 0],
      [0.00016, 0],
      [-0.0001, 2],
      [-0.00203, 1],
      [0.00063, 2],
      [-0.00071, 0],
      [6e-5, 2],
      [-0.00109, 0],
      [0.00015, 2],
      [0.00014, 0],
      [-0.00276, 1],
      [0.00015, 2],
      [-0.00043, 0],
      [0.00019, 2],
      [-0.00016, 0],
      [-0.00093, 0],
      [-0.00185, 1],
      [6e-5, 0],
      [0.00031, 2]
    ],
    "red_o_points": [],
    "y_categories": ["N", "NOT APPLICABLE", "nan"],
    "blue_o_points": [],
    "blue_x_points": [
      [0.00052, 2],
      [0.00039, 2],
      [0.0005, 0],
      [0.00057, 0],
      [0.00028, 2],
      [0.00093, 0],
      [0.00061, 0],
      [0.00065, 0],
      [0.00081, 2],
      [0.00223, 1],
      [-0.00038, 0],
      [0.00022, 0],
      [0.00101, 2],
      [0.0003, 2],
      [0.00053, 2],
      [0.00036, 2],
      [0.0011, 2],
      [0.00037, 2],
      [0.00023, 1],
      [0.00072, 2],
      [0.00039, 2]
    ]
  },
  "QA_lstPexMuscstrength[WristFlex]": {
    "red_x_points": [
      [-0.00053, 0],
      [-0.00296, 2],
      [-0.00792, 1],
      [0.00081, 0],
      [-0.00509, 1],
      [-0.01028, 1],
      [-0.00114, 0],
      [0.00023, 0],
      [-0.00149, 2],
      [-0.00299, 2],
      [-0.00097, 0],
      [-0.00189, 2],
      [-0.00602, 1],
      [0.0011, 0],
      [0.00082, 0],
      [-0.00258, 1],
      [-0.00589, 1],
      [-0.00412, 0],
      [0.00204, 0],
      [0.0016, 0],
      [-0.00145, 2],
      [-0.00746, 1],
      [-0.00466, 2]
    ],
    "red_o_points": [],
    "y_categories": ["GREATER THAN OR EQUALS TO 3", "LESS THAN 3", "nan"],
    "blue_o_points": [],
    "blue_x_points": [
      [0.00253, 1],
      [0.00568, 0],
      [0.00149, 0],
      [0.00472, 0],
      [0.00296, 0],
      [0.0058, 0],
      [0.00219, 0],
      [0.00395, 0],
      [0.00107, 2],
      [0.00069, 2],
      [0.00566, 0],
      [0.00592, 0],
      [0.00153, 2],
      [0.00083, 0],
      [0.00047, 0],
      [0.00134, 0],
      [0.00166, 2],
      [0.00303, 1],
      [0.00154, 0],
      [0.00676, 1],
      [0.00103, 2]
    ]
  },
  "QS_mulNeuromadSite[C5]": {
    "red_x_points": [
      [-0.00167, 1],
      [-0.00126, 0],
      [-0.00011, 0],
      [-4e-5, 0],
      [-0.00054, 0],
      [0.00021, 0],
      [-0.0, 2],
      [-0.00212, 1],
      [0.00067, 2],
      [-0.00057, 0],
      [-8e-5, 2],
      [-0.00091, 0],
      [0.00019, 2],
      [0.00011, 0],
      [-0.00322, 1],
      [0.00013, 2],
      [-0.00083, 0],
      [0.00014, 2],
      [-0.00023, 0],
      [-0.00081, 0],
      [-0.00178, 1],
      [0.00018, 0],
      [7e-5, 2]
    ],
    "red_o_points": [],
    "y_categories": ["N", "NOT APPLICABLE", "nan"],
    "blue_o_points": [],
    "blue_x_points": [
      [0.00061, 2],
      [0.00039, 2],
      [0.00056, 0],
      [0.00096, 0],
      [0.00023, 2],
      [0.00087, 0],
      [0.00056, 0],
      [0.00032, 0],
      [0.00093, 2],
      [0.00282, 1],
      [-0.00042, 0],
      [0.00107, 0],
      [0.00062, 2],
      [0.00019, 2],
      [0.00026, 2],
      [0.0001, 2],
      [0.00077, 2],
      [0.00043, 2],
      [0.00038, 1],
      [0.00038, 2],
      [0.00044, 2]
    ]
  },
  "QS_mulNeuromadSite[C7]": {
    "red_x_points": [
      [-0.00827, 1],
      [-0.00487, 0],
      [-0.00157, 0],
      [0.00021, 0],
      [-0.00298, 0],
      [0.00076, 0],
      [6e-5, 2],
      [-0.00966, 1],
      [0.00294, 2],
      [-0.0034, 0],
      [0.00099, 2],
      [-0.00402, 0],
      [0.00047, 2],
      [-0.00024, 0],
      [-0.01318, 1],
      [0.00038, 2],
      [-0.00338, 0],
      [0.00115, 2],
      [-0.00198, 0],
      [-0.00492, 0],
      [-0.00971, 1],
      [0.00072, 0],
      [0.00113, 2]
    ],
    "red_o_points": [],
    "y_categories": ["N", "NOT APPLICABLE", "nan"],
    "blue_o_points": [],
    "blue_x_points": [
      [0.00245, 2],
      [0.00168, 2],
      [0.00186, 0],
      [0.00407, 0],
      [0.00143, 2],
      [0.00374, 0],
      [0.00244, 0],
      [0.00173, 0],
      [0.00419, 2],
      [0.0122, 1],
      [-0.00248, 0],
      [0.00395, 0],
      [0.00374, 2],
      [0.00226, 2],
      [0.00267, 2],
      [0.00127, 2],
      [0.00373, 2],
      [0.00204, 2],
      [0.00139, 1],
      [0.00299, 2],
      [0.002, 2]
    ]
  },
  "QS_mulGraftNerve[TD]": {
    "red_x_points": [
      [-0.00097, 1],
      [-0.00065, 0],
      [-9e-5, 0],
      [0.00013, 0],
      [-0.00039, 0],
      [0.0, 0],
      [2e-5, 2],
      [-0.00087, 1],
      [0.00024, 2],
      [-0.00049, 0],
      [0.00012, 2],
      [-0.00059, 0],
      [2e-5, 2],
      [-0.00012, 0],
      [-0.00126, 1],
      [4e-5, 2],
      [-0.00018, 0],
      [4e-5, 2],
      [-0.00033, 0],
      [-0.00033, 0],
      [-0.00047, 1],
      [2e-5, 0],
      [0.00013, 2]
    ],
    "red_o_points": [],
    "y_categories": ["N", "NOT APPLICABLE", "nan"],
    "blue_o_points": [],
    "blue_x_points": [
      [0.00022, 2],
      [3e-5, 2],
      [0.0001, 0],
      [0.00028, 0],
      [0.00019, 2],
      [0.00045, 0],
      [0.00027, 0],
      [0.00013, 0],
      [0.0004, 2],
      [0.00126, 1],
      [-0.0001, 0],
      [0.00042, 0],
      [0.00052, 2],
      [0.00024, 2],
      [0.00013, 2],
      [0.00014, 2],
      [0.00034, 2],
      [0.00021, 2],
      [0.00035, 1],
      [0.00026, 2],
      [0.00016, 2]
    ]
  },
  "QA_intPexForearmSupin": {
    "red_x_points": [
      [-0.00041, 2],
      [-0.00658, 0],
      [-0.00088, 2],
      [-0.00057, 2],
      [-0.00051, 2],
      [-0.00046, 2],
      [-0.01901, 0],
      [-0.01259, 0],
      [-0.00074, 2],
      [-0.00043, 2],
      [-0.00092, 2],
      [-0.00011, 2],
      [-0.00143, 2],
      [0.00394, 1],
      [-0.00047, 2],
      [-0.01526, 0],
      [0.00105, 1],
      [-0.00075, 2],
      [-0.00105, 2],
      [-0.00071, 2],
      [0.00429, 1],
      [-0.00835, 0],
      [-0.00149, 2]
    ],
    "red_o_points": [],
    "y_categories": ["GREATER THAN OR EQUALS TO 80", "LESS THAN 80", "nan"],
    "blue_o_points": [],
    "blue_x_points": [
      [-0.00045, 2],
      [0.01369, 1],
      [0.00436, 1],
      [0.00915, 1],
      [0.00924, 1],
      [-0.0001, 2],
      [7e-5, 2],
      [0.00011, 2],
      [-0.00037, 2],
      [-7e-5, 2],
      [0.00107, 0],
      [-2e-5, 2],
      [-0.00031, 2],
      [0.00852, 1],
      [0.00747, 1],
      [-7e-5, 2],
      [-0.0004, 2],
      [-0.00015, 2],
      [3e-5, 2],
      [0.0117, 1],
      [-7e-5, 2]
    ]
  },
  "QS_mulGraftNerve[SS]": {
    "red_x_points": [
      [-0.00048, 1],
      [-0.00053, 0],
      [-0.00017, 0],
      [9e-5, 0],
      [-0.00054, 0],
      [-4e-5, 0],
      [-0.00014, 2],
      [-0.00038, 1],
      [0.00034, 2],
      [-0.0003, 0],
      [3e-5, 2],
      [-0.00047, 0],
      [3e-5, 2],
      [2e-5, 0],
      [-0.00041, 1],
      [-1e-5, 2],
      [-0.00024, 0],
      [8e-5, 2],
      [-0.00019, 0],
      [-0.00054, 0],
      [-0.00029, 1],
      [2e-5, 0],
      [-2e-5, 2]
    ],
    "red_o_points": [],
    "y_categories": ["N", "NOT APPLICABLE", "nan"],
    "blue_o_points": [],
    "blue_x_points": [
      [0.00023, 2],
      [-0.0, 2],
      [1e-5, 0],
      [0.00017, 0],
      [0.00016, 0],
      [0.0003, 0],
      [8e-5, 0],
      [0.00035, 2],
      [0.00135, 1],
      [-0.00032, 0],
      [0.00045, 0],
      [0.00045, 2],
      [3e-5, 2],
      [3e-5, 2],
      [0.00048, 2],
      [0.00015, 2],
      [0.00013, 1],
      [2e-5, 2],
      [6e-5, 2]
    ]
  },
  "QS_mulGraftNerve[MCF]": {
    "red_x_points": [
      [-0.0001, 1],
      [-4e-5, 0],
      [-4e-5, 0],
      [1e-5, 2],
      [-1e-5, 2],
      [-4e-5, 0],
      [-0.00029, 1],
      [-0.00015, 1]
    ],
    "red_o_points": [],
    "y_categories": ["N", "NOT APPLICABLE", "nan"],
    "blue_o_points": [],
    "blue_x_points": [
      [7e-5, 2],
      [4e-5, 2],
      [4e-5, 0],
      [9e-5, 0],
      [0.00011, 0],
      [0.00011, 1],
      [1e-5, 0],
      [0.0001, 0],
      [1e-5, 2],
      [-1e-5, 2],
      [-1e-5, 2],
      [5e-5, 2]
    ]
  },
  "QA_lstPexTouch[C5]": {
    "red_x_points": [
      [-0.00171, 0],
      [-0.00071, 2],
      [-0.00159, 1],
      [-0.00116, 1],
      [-0.00123, 2],
      [-0.00057, 1],
      [-0.0011, 1],
      [-0.00308, 1],
      [-0.0006, 2],
      [-0.00103, 2],
      [-0.00235, 1],
      [-0.00048, 2],
      [-0.00251, 1],
      [-0.00123, 1],
      [-0.00362, 1],
      [-0.00089, 1],
      [-0.00097, 2],
      [-0.00387, 1],
      [-0.00147, 1],
      [-0.00133, 2],
      [-0.00209, 1],
      [-0.00036, 1],
      [-0.00342, 1]
    ],
    "red_o_points": [],
    "y_categories": ["NORM", "NPV", "nan"],
    "blue_o_points": [],
    "blue_x_points": [
      [-0.00161, 1],
      [-0.0018, 1],
      [-0.00053, 1],
      [-0.0006, 1],
      [0.01382, 0],
      [-0.00071, 1],
      [-0.00049, 1],
      [-0.00051, 1],
      [0.00124, 2],
      [0.00309, 2],
      [0.0007, 2],
      [-0.00059, 1],
      [0.00164, 2],
      [-0.00106, 1],
      [0.00766, 0],
      [-0.00064, 1],
      [0.00126, 2],
      [0.00643, 0],
      [0.01157, 0],
      [-0.00073, 1],
      [-0.00077, 1]
    ]
  },
  "QS_mulLysisSite[Nerve]": {
    "red_x_points": [
      [-0.00673, 1],
      [-0.00148, 0],
      [-0.01112, 2],
      [-0.01925, 2],
      [-0.001, 0],
      [0.00171, 0],
      [0.00045, 3],
      [-0.00631, 1],
      [0.0015, 3],
      [-0.00092, 0],
      [0.00119, 3],
      [-0.00123, 0],
      [0.00127, 3],
      [0.00067, 0],
      [-0.00629, 1],
      [0.0006, 3],
      [-0.0008, 0],
      [0.00116, 3],
      [0.00085, 0],
      [-0.00126, 0],
      [-0.00744, 1],
      [0.00169, 0],
      [0.00114, 3]
    ],
    "red_o_points": [],
    "y_categories": ["N", "NOT APPLICABLE", "Y", "nan"],
    "blue_o_points": [],
    "blue_x_points": [
      [0.00234, 3],
      [0.00215, 3],
      [0.00199, 0],
      [0.00483, 0],
      [0.00233, 3],
      [0.00407, 0],
      [0.0025, 0],
      [0.00463, 0],
      [0.00207, 3],
      [0.00343, 1],
      [-0.00074, 0],
      [0.00446, 0],
      [0.00147, 3],
      [0.00196, 3],
      [0.00224, 3],
      [0.0018, 3],
      [0.00176, 3],
      [0.00212, 3],
      [0.0015, 1],
      [0.00316, 3],
      [0.00153, 3]
    ]
  },
  "QA_lstPexMuscstrength[ElbowExte]": {
    "red_x_points": [
      [-0.00362, 2],
      [-0.0052, 2],
      [-0.00402, 1],
      [-0.00328, 1],
      [-0.00539, 1],
      [-0.00359, 1],
      [-0.00231, 1],
      [0.00195, 0],
      [-0.00247, 2],
      [-0.00775, 2],
      [-0.00515, 1],
      [-0.00426, 2],
      [-0.00067, 1],
      [-0.00606, 1],
      [0.00087, 0],
      [-0.00217, 1],
      [-0.00447, 1],
      [-0.0041, 0],
      [-0.006, 1],
      [-0.00437, 2],
      [-0.00304, 2],
      [-0.00204, 1],
      [-0.00485, 2]
    ],
    "red_o_points": [],
    "y_categories": ["GREATER THAN OR EQUALS TO 3", "LESS THAN 3", "nan"],
    "blue_o_points": [],
    "blue_x_points": [
      [6e-5, 1],
      [-0.00028, 1],
      [0.00802, 0],
      [-0.00196, 1],
      [-0.00024, 1],
      [0.01385, 0],
      [0.01426, 0],
      [-0.00171, 1],
      [-7e-5, 2],
      [-0.00105, 2],
      [0.01847, 0],
      [0.00134, 1],
      [0.00069, 2],
      [0.00612, 0],
      [0.00449, 0],
      [0.00602, 0],
      [0.00066, 2],
      [0.00402, 0],
      [0.00537, 0],
      [0.00208, 1],
      [0.0018, 1]
    ]
  },
  "QA_lstPexMuscstrength[FingersAddu]": {
    "red_x_points": [
      [0.00019, 2],
      [9e-5, 2],
      [-0.02016, 1],
      [-0.0004, 2],
      [-0.017, 1],
      [-0.02174, 1],
      [0.00695, 0],
      [0.00633, 0],
      [0.0001, 2],
      [9e-5, 2],
      [0.00512, 0],
      [0.00032, 2],
      [-0.01954, 1],
      [0.00797, 0],
      [0.0067, 0],
      [-0.01771, 1],
      [-0.01508, 1],
      [0.00035, 2],
      [-0.00023, 2],
      [-0.01704, 1],
      [0.00024, 2],
      [-0.01727, 1],
      [-0.00171, 2]
    ],
    "red_o_points": [],
    "y_categories": ["GREATER THAN OR EQUALS TO 3", "LESS THAN 3", "nan"],
    "blue_o_points": [],
    "blue_x_points": [
      [0.01286, 0],
      [-0.00497, 1],
      [0.00784, 0],
      [0.01049, 0],
      [0.01128, 0],
      [0.01307, 0],
      [0.00182, 2],
      [0.01233, 0],
      [0.00107, 2],
      [0.00148, 2],
      [0.00145, 2],
      [0.00248, 2],
      [0.00148, 2],
      [0.00827, 0],
      [0.00816, 0],
      [0.00871, 0],
      [0.00196, 2],
      [0.00146, 2],
      [0.0103, 0],
      [0.00112, 2],
      [0.0008, 2]
    ]
  },
  "QA_equInjTbpiTime": {
    "red_x_points": [
      [-0.0127, 0],
      [-0.0104, 0],
      [0.00222, 3],
      [0.00238, 3],
      [-0.00915, 0],
      [-0.00911, 0],
      [-0.01006, 0],
      [-0.01058, 0],
      [0.0021, 3],
      [-0.01021, 0],
      [-0.01094, 0],
      [-0.01047, 0],
      [0.00099, 3],
      [0.00233, 3],
      [-0.01106, 0],
      [-0.00874, 0],
      [-0.01309, 2],
      [-0.02113, 2],
      [-0.01042, 0],
      [-0.0176, 2],
      [-0.01139, 0],
      [0.00195, 3],
      [0.01343, 1]
    ],
    "red_o_points": [],
    "y_categories": [
      "0 TO 6 MONTHS",
      "13 TO 24 MONTHS",
      "25 MONTHS OR MORE",
      "7 TO 12 MONTHS",
      "nan"
    ],
    "blue_o_points": [],
    "blue_x_points": [
      [-0.00765, 0],
      [0.02438, 1],
      [-0.00746, 0],
      [0.02483, 1],
      [0.00476, 3],
      [-0.00811, 0],
      [-0.00712, 0],
      [0.00491, 3],
      [-0.00701, 0],
      [-0.00234, 2],
      [0.02599, 1],
      [0.007, 3],
      [0.02403, 1],
      [0.00473, 3],
      [0.02142, 1],
      [0.02193, 1],
      [0.00713, 3],
      [0.02119, 1],
      [0.00861, 3],
      [0.00603, 3],
      [-0.0056, 0]
    ]
  },
  "QS_mulTransfSite[IMc]": {
    "red_x_points": [
      [-0.01255, 1],
      [-0.02101, 2],
      [0.00033, 0],
      [-0.02474, 2],
      [-0.00195, 0],
      [0.00497, 0],
      [0.00253, 3],
      [-0.01235, 1],
      [0.00653, 3],
      [-0.00171, 0],
      [0.00436, 3],
      [-0.01838, 2],
      [0.00356, 3],
      [0.00126, 0],
      [-0.01631, 1],
      [0.00256, 3],
      [-0.00254, 0],
      [0.00398, 3],
      [0.00053, 0],
      [-0.01778, 2],
      [-0.01516, 1],
      [-0.01192, 2],
      [0.00461, 3]
    ],
    "red_o_points": [],
    "y_categories": ["N", "NOT APPLICABLE", "Y", "nan"],
    "blue_o_points": [],
    "blue_x_points": [
      [0.00611, 3],
      [0.0048, 3],
      [0.004, 0],
      [0.00813, 0],
      [0.00436, 3],
      [0.00691, 0],
      [0.00505, 0],
      [0.00667, 0],
      [0.00871, 3],
      [0.00965, 1],
      [0.00092, 0],
      [0.00811, 0],
      [0.00793, 3],
      [0.00451, 3],
      [0.00489, 3],
      [0.00443, 3],
      [0.00855, 3],
      [0.005, 3],
      [0.00079, 1],
      [0.00608, 3],
      [0.00557, 3]
    ]
  },
  "QA_lstPexTouch[T1]": {
    "red_x_points": [
      [-0.00789, 1],
      [-0.00254, 2],
      [-0.00541, 1],
      [0.00549, 0],
      [-0.00283, 2],
      [-0.00661, 1],
      [0.00383, 0],
      [-0.00926, 1],
      [-0.00267, 2],
      [-0.00475, 2],
      [-0.00885, 1],
      [-0.00316, 2],
      [-0.00765, 1],
      [-0.01171, 1],
      [-0.00805, 1],
      [-0.00565, 1],
      [-0.00266, 2],
      [0.0007, 0],
      [-0.00838, 1],
      [-0.0034, 2],
      [-0.01059, 1],
      [-0.00488, 1],
      [-0.00735, 1]
    ],
    "red_o_points": [],
    "y_categories": ["NORM", "NPV", "nan"],
    "blue_o_points": [],
    "blue_x_points": [
      [-0.00479, 1],
      [-0.00448, 1],
      [0.01167, 0],
      [-0.00467, 1],
      [-0.00427, 1],
      [0.01702, 0],
      [0.01755, 0],
      [0.01449, 0],
      [0.00122, 2],
      [0.00178, 2],
      [-0.00112, 2],
      [-0.00438, 1],
      [0.00126, 2],
      [0.01071, 0],
      [0.00964, 0],
      [0.01082, 0],
      [0.00203, 2],
      [-0.00474, 1],
      [0.01586, 0],
      [0.01314, 0],
      [0.01552, 0]
    ]
  },
  "QA_lstPexArthre[Elbow]": {
    "red_x_points": [
      [-0.00021, 2],
      [-0.0011, 3],
      [-0.00123, 3],
      [0.00041, 2],
      [-0.00667, 0],
      [-0.00659, 1],
      [-0.00167, 2],
      [-0.00037, 2],
      [-0.00074, 3],
      [0.00069, 2],
      [-0.00174, 3],
      [-0.00085, 3],
      [-0.0015, 3],
      [0.00043, 2],
      [-0.00032, 2],
      [-0.00152, 2],
      [-0.00076, 3],
      [-0.00137, 3],
      [-0.00293, 3],
      [-0.00092, 3],
      [-0.00031, 3],
      [0.00029, 2],
      [-0.00163, 3]
    ],
    "red_o_points": [],
    "y_categories": ["NAIA", "NPV", "PV", "nan"],
    "blue_o_points": [],
    "blue_x_points": [
      [0.01314, 1],
      [-0.00088, 3],
      [0.00138, 2],
      [0.00156, 2],
      [-0.00029, 3],
      [0.00369, 2],
      [0.00169, 2],
      [0.00164, 2],
      [-0.00014, 3],
      [-0.00033, 3],
      [-0.00062, 3],
      [0.00393, 2],
      [-0.00029, 3],
      [0.00029, 2],
      [0.00047, 2],
      [0.0036, 1],
      [-0.00032, 3],
      [0.00066, 2],
      [-0.00018, 3],
      [0.00071, 2],
      [0.00092, 2]
    ]
  },
  "QS_mulTransfSite[AcMc]": {
    "red_x_points": [
      [-0.00739, 1],
      [-0.00544, 0],
      [-0.00256, 0],
      [-0.00515, 0],
      [-0.00337, 0],
      [-0.00059, 0],
      [0.00096, 3],
      [-0.00991, 1],
      [0.00299, 3],
      [-0.00378, 0],
      [0.00165, 3],
      [-0.00412, 0],
      [0.00167, 3],
      [-0.00349, 0],
      [-0.01083, 1],
      [0.00075, 3],
      [-0.00367, 0],
      [0.0025, 3],
      [-0.00344, 0],
      [-0.00464, 0],
      [-0.0091, 1],
      [-0.00114, 0],
      [0.00174, 3]
    ],
    "red_o_points": [],
    "y_categories": ["N", "NOT APPLICABLE", "Y", "nan"],
    "blue_o_points": [],
    "blue_x_points": [
      [0.00311, 3],
      [0.0024, 3],
      [1e-5, 0],
      [0.00133, 0],
      [0.00267, 3],
      [0.00179, 0],
      [0.00068, 0],
      [0.01774, 2],
      [0.00406, 3],
      [0.00753, 1],
      [-0.00284, 0],
      [0.00102, 0],
      [0.00311, 3],
      [0.00347, 3],
      [0.00302, 3],
      [0.00264, 3],
      [0.0038, 3],
      [0.00265, 3],
      [0.00155, 1],
      [0.0041, 3],
      [0.00249, 3]
    ]
  },
  "QS_mulTransfSite[Other]": {
    "red_x_points": [
      [-0.00396, 1],
      [-0.00209, 0],
      [-0.00046, 0],
      [0.00038, 0],
      [-0.00144, 0],
      [0.00069, 0],
      [-0.00054, 3],
      [-0.00784, 1],
      [0.00156, 3],
      [-0.00154, 0],
      [0.00103, 3],
      [-0.00217, 0],
      [0.0006, 3],
      [-0.02829, 2],
      [-0.00757, 1],
      [0.0004, 3],
      [-0.00163, 0],
      [0.00086, 3],
      [0.00028, 0],
      [-0.0021, 0],
      [-0.00535, 1],
      [0.00025, 0],
      [0.00047, 3]
    ],
    "red_o_points": [],
    "y_categories": ["N", "NOT APPLICABLE", "Y", "nan"],
    "blue_o_points": [],
    "blue_x_points": [
      [0.00215, 3],
      [0.00165, 3],
      [0.00423, 0],
      [0.004, 0],
      [0.00247, 3],
      [0.00328, 0],
      [0.00593, 0],
      [0.00404, 0],
      [0.00212, 3],
      [0.00601, 1],
      [-0.00134, 0],
      [0.0026, 0],
      [0.00195, 3],
      [0.00341, 3],
      [0.00317, 3],
      [0.00253, 3],
      [0.00253, 3],
      [0.00248, 3],
      [0.00076, 1],
      [0.00266, 3],
      [0.00185, 3]
    ]
  },
  "QA_yonInjBpsurg": {
    "red_x_points": [
      [-0.00644, 0],
      [0.00028, 1],
      [0.00032, 1],
      [0.00084, 1],
      [0.00011, 1],
      [0.00062, 1],
      [0.00043, 1],
      [-0.00864, 0],
      [0.00022, 1],
      [0.00049, 1],
      [0.00055, 1],
      [0.00025, 1],
      [0.00047, 1],
      [0.00119, 1],
      [-0.00848, 0],
      [0.00042, 1],
      [-0.00105, 1],
      [-0.0015, 1],
      [0.00046, 1],
      [-0.00076, 1],
      [-0.01075, 0],
      [0.00029, 1],
      [0.00063, 1]
    ],
    "red_o_points": [],
    "y_categories": ["N", "Y", "nan"],
    "blue_o_points": [],
    "blue_x_points": [
      [0.00167, 1],
      [0.00142, 1],
      [0.00171, 1],
      [0.00168, 1],
      [0.00089, 1],
      [0.00146, 1],
      [0.00218, 1],
      [0.00175, 1],
      [0.0009, 1],
      [0.00324, 0],
      [0.00031, 1],
      [0.00174, 1],
      [0.00058, 1],
      [0.00159, 1],
      [0.0019, 1],
      [0.00115, 1],
      [0.00026, 1],
      [0.00255, 1],
      [-0.0007, 0],
      [0.00222, 1],
      [0.00154, 1]
    ]
  },
  "QA_lstPexTouch[C8]": {
    "red_x_points": [
      [0.00625, 0],
      [-0.00329, 2],
      [-0.00676, 1],
      [-0.01141, 1],
      [-0.00236, 2],
      [-0.00656, 1],
      [-0.00814, 1],
      [-0.00793, 1],
      [-0.00201, 2],
      [-0.00321, 2],
      [-0.01015, 1],
      [-0.00231, 2],
      [-0.01046, 1],
      [0.00756, 0],
      [-0.00814, 1],
      [-0.00714, 1],
      [-0.00271, 2],
      [0.00565, 0],
      [-0.0067, 1],
      [-0.00288, 2],
      [-0.0118, 1],
      [-0.00668, 1],
      [-0.01132, 1]
    ],
    "red_o_points": [],
    "y_categories": ["NORM", "NPV", "nan"],
    "blue_o_points": [],
    "blue_x_points": [
      [-0.00721, 1],
      [-0.00767, 1],
      [0.00999, 0],
      [-0.00584, 1],
      [0.01433, 0],
      [-0.0052, 1],
      [0.01279, 0],
      [0.01388, 0],
      [0.0006, 2],
      [0.00111, 2],
      [-0.00049, 2],
      [-0.0053, 1],
      [0.0012, 2],
      [0.01073, 0],
      [0.01083, 0],
      [0.01311, 0],
      [0.00121, 2],
      [0.01069, 0],
      [0.01232, 0],
      [0.01667, 0],
      [0.01476, 0]
    ]
  },
  "QS_mulLysisNerve[Ssr]": {
    "red_x_points": [
      [-0.00493, 1],
      [-0.00104, 0],
      [-0.00855, 2],
      [-0.01809, 2],
      [-0.00061, 0],
      [0.00142, 0],
      [0.00065, 3],
      [-0.00501, 1],
      [0.00128, 3],
      [-0.00054, 0],
      [0.00154, 3],
      [-0.00081, 0],
      [0.00103, 3],
      [0.00057, 0],
      [-0.00559, 1],
      [0.00068, 3],
      [-0.00074, 0],
      [0.00122, 3],
      [0.00088, 0],
      [-0.0009, 0],
      [-0.00629, 1],
      [0.00147, 0],
      [0.00078, 3]
    ],
    "red_o_points": [],
    "y_categories": ["N", "NOT APPLICABLE", "Y", "nan"],
    "blue_o_points": [],
    "blue_x_points": [
      [0.00221, 3],
      [0.00174, 3],
      [0.00167, 0],
      [0.00393, 0],
      [0.00163, 3],
      [0.00344, 0],
      [0.002, 0],
      [0.00415, 0],
      [0.00135, 3],
      [0.00252, 1],
      [-0.00052, 0],
      [0.00374, 0],
      [0.00129, 3],
      [0.00192, 3],
      [0.00189, 3],
      [0.00154, 3],
      [0.0015, 3],
      [0.00145, 3],
      [0.00027, 1],
      [0.00265, 3],
      [0.00122, 3]
    ]
  },
  "QS_mulBpsurgeryType[Graft]": {
    "red_x_points": [
      [-0.00349, 1],
      [-0.00212, 0],
      [-0.0007, 0],
      [9e-5, 0],
      [-0.00126, 0],
      [0.0001, 0],
      [0.00036, 3],
      [-0.00357, 1],
      [0.00212, 3],
      [-0.01357, 2],
      [0.00077, 3],
      [-0.00191, 0],
      [0.00051, 3],
      [0.0002, 0],
      [-0.00457, 1],
      [0.00031, 3],
      [-0.00156, 0],
      [0.00085, 3],
      [-0.00068, 0],
      [-0.00204, 0],
      [-0.0023, 1],
      [-0.0001, 0],
      [0.00064, 3]
    ],
    "red_o_points": [],
    "y_categories": ["N", "NOT APPLICABLE", "Y", "nan"],
    "blue_o_points": [],
    "blue_x_points": [
      [0.00165, 3],
      [0.00076, 3],
      [0.00097, 0],
      [0.00144, 0],
      [0.00061, 3],
      [0.00175, 0],
      [0.0015, 0],
      [0.00113, 0],
      [0.00308, 3],
      [0.00525, 1],
      [-0.00099, 0],
      [0.00232, 0],
      [0.00258, 3],
      [0.00078, 3],
      [0.00124, 3],
      [0.00058, 3],
      [0.00267, 3],
      [0.00128, 3],
      [0.00033, 1],
      [0.00131, 3],
      [0.00169, 3]
    ]
  },
  "QA_lstPexTinel[TinelSign]": {
    "red_x_points": [
      [0.00123, 1],
      [-0.00019, 1],
      [-0.0095, 2],
      [0.00142, 1],
      [0.00082, 1],
      [0.00072, 1],
      [-0.01388, 2],
      [-0.01145, 2],
      [-0.00537, 1],
      [0.0005, 1],
      [-0.01657, 2],
      [-0.00774, 2],
      [-6e-5, 1],
      [-0.01509, 2],
      [0.0021, 1],
      [-0.01115, 2],
      [0.00054, 1],
      [-0.00082, 1],
      [-0.0119, 2],
      [-0.0086, 2],
      [0.00052, 1],
      [-0.00751, 2],
      [-0.0004, 1]
    ],
    "red_o_points": [],
    "y_categories": ["ABS", "NAIA", "PT", "nan"],
    "blue_o_points": [],
    "blue_x_points": [
      [0.00602, 1],
      [0.035, 0],
      [0.01677, 0],
      [-0.00814, 2],
      [0.00371, 1],
      [0.00465, 1],
      [-0.00644, 2],
      [0.00545, 1],
      [0.00294, 2],
      [0.00194, 1],
      [0.00434, 1],
      [0.00568, 1],
      [0.00116, 1],
      [0.02125, 0],
      [0.00411, 1],
      [0.0033, 1],
      [-2e-5, 2],
      [0.00245, 1],
      [0.00402, 1],
      [0.00186, 1],
      [0.00234, 1]
    ]
  },
  "QS_mulLysisRoot[C5]": {
    "red_x_points": [
      [-0.00498, 1],
      [-0.00125, 0],
      [-0.01104, 2],
      [0.00135, 0],
      [-0.00089, 0],
      [0.00256, 0],
      [0.00076, 3],
      [-0.00553, 1],
      [0.00132, 3],
      [-0.00092, 0],
      [0.00149, 3],
      [-0.00092, 0],
      [0.00142, 3],
      [0.00048, 0],
      [-0.00529, 1],
      [0.00087, 3],
      [-0.00116, 0],
      [0.00102, 3],
      [0.00038, 0],
      [-0.00105, 0],
      [-0.00527, 1],
      [-0.00904, 2],
      [0.00119, 3]
    ],
    "red_o_points": [],
    "y_categories": ["N", "NOT APPLICABLE", "Y", "nan"],
    "blue_o_points": [],
    "blue_x_points": [
      [0.0019, 3],
      [0.00142, 3],
      [0.00046, 0],
      [0.00352, 0],
      [0.00102, 3],
      [0.0027, 0],
      [0.00159, 0],
      [0.00175, 0],
      [0.00171, 3],
      [0.00377, 1],
      [-0.0004, 0],
      [0.00342, 0],
      [0.00128, 3],
      [0.00113, 3],
      [0.00094, 3],
      [0.00075, 3],
      [0.00219, 3],
      [0.00096, 3],
      [0.00161, 1],
      [0.00149, 3],
      [0.00129, 3]
    ]
  },
  "QS_mulNeuromadSite[C6]": {
    "red_x_points": [
      [-0.00412, 1],
      [-0.0032, 0],
      [-0.00113, 0],
      [-7e-5, 0],
      [-0.00185, 0],
      [0.00019, 0],
      [-0.00015, 2],
      [-0.00512, 1],
      [0.00167, 2],
      [-0.00291, 0],
      [0.0005, 2],
      [-0.00279, 0],
      [0.00053, 2],
      [-0.00027, 0],
      [-0.00738, 1],
      [0.00015, 2],
      [-0.00183, 0],
      [0.00049, 2],
      [-0.00063, 0],
      [-0.0032, 0],
      [-0.00412, 1],
      [0.00026, 0],
      [0.0006, 2]
    ],
    "red_o_points": [],
    "y_categories": ["N", "NOT APPLICABLE", "nan"],
    "blue_o_points": [],
    "blue_x_points": [
      [0.00149, 2],
      [0.00109, 2],
      [0.00121, 0],
      [0.00148, 0],
      [0.00091, 2],
      [0.00177, 0],
      [0.00167, 0],
      [0.00058, 0],
      [0.00247, 2],
      [0.00745, 1],
      [-0.00192, 0],
      [0.00185, 0],
      [0.00257, 2],
      [0.00116, 2],
      [0.00131, 2],
      [0.00088, 2],
      [0.00299, 2],
      [0.00155, 2],
      [0.00146, 1],
      [0.00156, 2],
      [0.00087, 2]
    ]
  },
  "QS_mulNeuromadSite[T1]": {
    "red_x_points": [
      [-0.00244, 1],
      [-0.00132, 0],
      [-0.00027, 0],
      [0.00035, 0],
      [-0.00084, 0],
      [0.00036, 0],
      [6e-5, 2],
      [-0.00249, 1],
      [0.00061, 2],
      [-0.00118, 0],
      [0.00015, 2],
      [-0.00094, 0],
      [8e-5, 2],
      [-0.00032, 0],
      [-0.00367, 1],
      [8e-5, 2],
      [-0.00117, 0],
      [0.00014, 2],
      [-0.00035, 0],
      [-0.0016, 0],
      [-0.00226, 1],
      [0.00034, 0],
      [0.00012, 2]
    ],
    "red_o_points": [],
    "y_categories": ["N", "NOT APPLICABLE", "nan"],
    "blue_o_points": [],
    "blue_x_points": [
      [0.00065, 2],
      [0.00026, 2],
      [0.00053, 0],
      [0.00112, 0],
      [0.00028, 2],
      [0.00135, 0],
      [0.00038, 0],
      [0.00066, 0],
      [0.00107, 2],
      [0.00413, 1],
      [-0.00044, 0],
      [0.00118, 0],
      [0.001, 2],
      [0.00049, 2],
      [0.00069, 2],
      [0.00025, 2],
      [0.00107, 2],
      [0.0005, 2],
      [0.00045, 1],
      [0.00047, 2],
      [0.00046, 2]
    ]
  },
  "QS_mulGraftNerve[LT]": {
    "red_x_points": [
      [-0.00037, 1],
      [-0.00013, 0],
      [-2e-5, 0],
      [0.00015, 0],
      [-0.00021, 0],
      [8e-5, 0],
      [0.0, 2],
      [-0.00031, 1],
      [0.00015, 2],
      [-0.00027, 0],
      [7e-5, 2],
      [-0.00023, 0],
      [2e-5, 2],
      [0.0, 0],
      [-0.00081, 1],
      [8e-5, 2],
      [-0.00014, 0],
      [9e-5, 2],
      [-3e-5, 0],
      [-0.00011, 0],
      [-0.00054, 1],
      [3e-5, 0],
      [5e-5, 2]
    ],
    "red_o_points": [],
    "y_categories": ["N", "NOT APPLICABLE", "nan"],
    "blue_o_points": [],
    "blue_x_points": [
      [0.00021, 2],
      [0.00011, 2],
      [4e-5, 0],
      [0.00031, 0],
      [4e-5, 2],
      [0.00022, 0],
      [-1e-5, 0],
      [3e-5, 0],
      [0.00019, 2],
      [0.00073, 1],
      [-6e-5, 0],
      [0.00016, 0],
      [0.00017, 2],
      [2e-5, 2],
      [6e-5, 2],
      [4e-5, 2],
      [4e-5, 2],
      [2e-5, 2],
      [4e-5, 2],
      [8e-5, 2]
    ]
  },
  "QA_lstPexMuscstrength[ShoulderAbduc]": {
    "red_x_points": [
      [-0.00072, 2],
      [0.00024, 1],
      [0.0001, 1],
      [0.00063, 1],
      [0.00017, 1],
      [0.0006, 1],
      [0.0006, 1],
      [-0.01403, 0],
      [-0.00032, 2],
      [-0.00055, 2],
      [-0.00322, 2],
      [-0.00037, 2],
      [0.00037, 1],
      [0.00131, 1],
      [-0.0199, 0],
      [0.00024, 1],
      [0.00025, 1],
      [0.00034, 1],
      [0.00075, 1],
      [0.00031, 1],
      [-0.00065, 2],
      [0.00031, 1],
      [-0.00075, 2]
    ],
    "red_o_points": [],
    "y_categories": ["GREATER THAN OR EQUALS TO 3", "LESS THAN 3", "nan"],
    "blue_o_points": [],
    "blue_x_points": [
      [0.00221, 1],
      [0.00218, 1],
      [0.00268, 1],
      [0.00268, 1],
      [0.00148, 1],
      [0.00309, 1],
      [0.00172, 1],
      [0.0012, 1],
      [0.00015, 2],
      [0.0007, 2],
      [0.00151, 1],
      [0.0004, 2],
      [0.00047, 2],
      [0.00268, 1],
      [0.00236, 1],
      [-0.00088, 2],
      [0.00017, 2],
      [0.0023, 1],
      [0.00564, 1],
      [0.0006, 1],
      [0.00094, 1]
    ]
  },
  "QS_mulNeuromadSite[C4]": {
    "red_x_points": [
      [-0.0061, 1],
      [-0.00387, 0],
      [-0.00146, 0],
      [0.00013, 0],
      [-0.00264, 0],
      [0.00037, 0],
      [0.00023, 2],
      [-0.00661, 1],
      [0.00248, 2],
      [-0.00281, 0],
      [0.0007, 2],
      [-0.00352, 0],
      [0.00073, 2],
      [-0.00027, 0],
      [-0.00868, 1],
      [0.00051, 2],
      [-0.00332, 0],
      [0.00068, 2],
      [-0.00168, 0],
      [-0.00462, 0],
      [-0.00622, 1],
      [0.00037, 0],
      [0.00096, 2]
    ],
    "red_o_points": [],
    "y_categories": ["N", "NOT APPLICABLE", "nan"],
    "blue_o_points": [],
    "blue_x_points": [
      [0.00197, 2],
      [0.00136, 2],
      [0.00157, 0],
      [0.00214, 0],
      [0.0009, 2],
      [0.00257, 0],
      [0.00113, 0],
      [0.00106, 0],
      [0.00315, 2],
      [0.00988, 1],
      [-0.00166, 0],
      [0.00182, 0],
      [0.00355, 2],
      [0.00146, 2],
      [0.00175, 2],
      [0.00093, 2],
      [0.00382, 2],
      [0.002, 2],
      [0.00154, 1],
      [0.00218, 2],
      [0.00151, 2]
    ]
  },
  "QA_lstPexMuscstrength[ShoulderExrot]": {
    "red_x_points": [
      [-0.00059, 2],
      [-0.00013, 2],
      [-0.01529, 0],
      [-0.00033, 2],
      [0.00354, 1],
      [-0.00056, 2],
      [0.0026, 1],
      [-0.01889, 0],
      [-0.00031, 2],
      [-0.00027, 2],
      [-0.00078, 2],
      [-0.00025, 2],
      [-0.00037, 2],
      [0.0034, 1],
      [-0.0244, 0],
      [0.00248, 1],
      [3e-5, 2],
      [0.00025, 2],
      [0.00437, 1],
      [-0.01609, 0],
      [-0.00062, 2],
      [0.00224, 1],
      [-0.00048, 2]
    ],
    "red_o_points": [],
    "y_categories": ["GREATER THAN OR EQUALS TO 3", "LESS THAN 3", "nan"],
    "blue_o_points": [],
    "blue_x_points": [
      [0.00775, 1],
      [0.00024, 2],
      [0.00521, 1],
      [0.0052, 1],
      [0.00561, 1],
      [0.00818, 1],
      [0.0052, 1],
      [0.0003, 2],
      [0.00022, 2],
      [0.0009, 2],
      [0.00071, 2],
      [0.00085, 2],
      [0.00089, 2],
      [0.0048, 1],
      [0.00491, 1],
      [0.00019, 2],
      [0.00052, 2],
      [0.00077, 2],
      [0.00797, 1],
      [0.00011, 2],
      [-0.0001, 2]
    ]
  },
  "QS_mulNeuromadSite[T2]": {
    "red_x_points": [
      [-0.00289, 1],
      [-0.00212, 0],
      [-0.00055, 0],
      [-0.00019, 0],
      [-0.00119, 0],
      [3e-5, 0],
      [-4e-5, 2],
      [-0.00389, 1],
      [0.00073, 2],
      [-0.00147, 0],
      [0.00034, 2],
      [-0.00199, 0],
      [0.00034, 2],
      [0.00014, 0],
      [-0.00606, 1],
      [0.00015, 2],
      [-0.00097, 0],
      [0.00066, 2],
      [-0.00099, 0],
      [-0.00197, 0],
      [-0.00252, 1],
      [8e-5, 0],
      [0.0004, 2]
    ],
    "red_o_points": [],
    "y_categories": ["N", "NOT APPLICABLE", "nan"],
    "blue_o_points": [],
    "blue_x_points": [
      [0.00164, 2],
      [0.00059, 2],
      [0.00102, 0],
      [0.00159, 0],
      [0.00057, 2],
      [0.00214, 0],
      [0.00065, 0],
      [0.00077, 0],
      [0.00172, 2],
      [0.00434, 1],
      [-0.00075, 0],
      [0.00132, 0],
      [0.00153, 2],
      [0.00092, 2],
      [0.00096, 2],
      [0.00055, 2],
      [0.00178, 2],
      [0.00071, 2],
      [0.00043, 1],
      [0.00081, 2],
      [0.0007, 2]
    ]
  },
  "QS_mulGraftNerve[MC]": {
    "red_x_points": [
      [-0.00034, 1],
      [-5e-5, 0],
      [6e-5, 0],
      [-3e-5, 0],
      [4e-5, 0],
      [-0.0, 2],
      [-0.00012, 1],
      [0.0, 2],
      [2e-5, 0],
      [-0.0, 2],
      [4e-5, 0],
      [-0.0005, 1],
      [-4e-5, 2],
      [-3e-5, 0],
      [2e-5, 2],
      [-5e-5, 0],
      [-0.0001, 1],
      [5e-5, 0],
      [-0.0, 2]
    ],
    "red_o_points": [],
    "y_categories": ["N", "NOT APPLICABLE", "nan"],
    "blue_o_points": [],
    "blue_x_points": [
      [0.00012, 2],
      [-0.0, 2],
      [0.00012, 0],
      [0.00014, 0],
      [0.00015, 0],
      [2e-5, 0],
      [0.00019, 1],
      [-8e-5, 0],
      [0.00014, 0],
      [2e-5, 2],
      [3e-5, 2],
      [2e-5, 2],
      [5e-5, 2],
      [-5e-5, 1],
      [5e-5, 2],
      [0.00013, 2]
    ]
  },
  "QA_lstPexKine[Elbow]": {
    "red_x_points": [
      [-0.00045, 1],
      [-0.00066, 2],
      [-0.00222, 2],
      [0.00118, 1],
      [-0.00144, 2],
      [-0.00762, 0],
      [-7e-5, 1],
      [0.0002, 1],
      [-0.00091, 2],
      [0.00086, 1],
      [-0.00172, 2],
      [-0.00125, 2],
      [-0.00238, 2],
      [0.00116, 1],
      [0.0001, 1],
      [-0.00275, 0],
      [-0.00158, 2],
      [-0.00197, 2],
      [-0.004, 2],
      [-0.00118, 2],
      [-0.00032, 2],
      [-0.00584, 0],
      [-0.00212, 2]
    ],
    "red_o_points": [],
    "y_categories": ["NPV", "PV", "nan"],
    "blue_o_points": [],
    "blue_x_points": [
      [0.00511, 0],
      [-0.00148, 2],
      [0.00138, 1],
      [0.0046, 1],
      [-0.00047, 2],
      [0.00424, 1],
      [0.00291, 1],
      [0.00354, 1],
      [-0.00046, 2],
      [-0.00017, 2],
      [-0.00061, 2],
      [0.00533, 1],
      [-0.0004, 2],
      [0.00092, 1],
      [0.00089, 1],
      [0.00351, 0],
      [-0.00045, 2],
      [0.00163, 1],
      [-2e-5, 2],
      [0.00296, 1],
      [0.00203, 1]
    ]
  },
  "QS_mulGraftLevel[Trunk]": {
    "red_x_points": [
      [-0.00748, 1],
      [-0.00459, 0],
      [-0.00121, 0],
      [0.00018, 0],
      [-0.00305, 0],
      [0.00039, 0],
      [0.00055, 3],
      [-0.00613, 1],
      [0.00405, 3],
      [-0.0183, 2],
      [0.00136, 3],
      [-0.0049, 0],
      [0.0006, 3],
      [0.00027, 0],
      [-0.00815, 1],
      [0.00055, 3],
      [-0.00385, 0],
      [0.00206, 3],
      [-0.00119, 0],
      [-0.00434, 0],
      [-0.00565, 1],
      [0.00049, 0],
      [0.00113, 3]
    ],
    "red_o_points": [],
    "y_categories": ["N", "NOT APPLICABLE", "Y", "nan"],
    "blue_o_points": [],
    "blue_x_points": [
      [0.00244, 3],
      [0.0019, 3],
      [0.00119, 0],
      [0.00226, 0],
      [0.00168, 3],
      [0.00278, 0],
      [0.0015, 0],
      [0.00121, 0],
      [0.00552, 3],
      [0.01138, 1],
      [-0.00156, 0],
      [0.00325, 0],
      [0.00508, 3],
      [0.00141, 3],
      [0.00171, 3],
      [0.00117, 3],
      [0.00616, 3],
      [0.0021, 3],
      [0.00118, 1],
      [0.00251, 3],
      [0.00234, 3]
    ]
  },
  "QS_mulGraftNerve[Ra]": {
    "red_x_points": [
      [-0.0001, 1],
      [-5e-5, 0],
      [-5e-5, 0],
      [0.0, 0],
      [-5e-5, 0],
      [2e-5, 2],
      [-5e-5, 0],
      [-4e-5, 2],
      [-4e-5, 0],
      [-2e-5, 2],
      [1e-5, 2],
      [-8e-5, 0],
      [-0.00015, 1]
    ],
    "red_o_points": [],
    "y_categories": ["N", "NOT APPLICABLE", "nan"],
    "blue_o_points": [],
    "blue_x_points": [
      [-4e-5, 2],
      [0.0, 0],
      [0.0, 0],
      [0.0, 0],
      [2e-5, 2],
      [0.0003, 1],
      [-7e-5, 0],
      [0.0, 0],
      [3e-5, 2],
      [5e-5, 2],
      [3e-5, 2],
      [5e-5, 2],
      [7e-5, 1],
      [5e-5, 2],
      [0.0001, 2]
    ]
  },
  "QS_mulTransfSite[Oberlin]": {
    "red_x_points": [
      [-0.01011, 1],
      [-0.02873, 0],
      [-0.02952, 0],
      [-0.03113, 0],
      [-0.02835, 0],
      [-0.0284, 0],
      [0.00818, 3],
      [-0.01186, 1],
      [0.00902, 3],
      [0.01081, 2],
      [0.0091, 3],
      [-0.02947, 0],
      [0.00823, 3],
      [0.01262, 2],
      [-0.01314, 1],
      [0.00801, 3],
      [-0.02704, 0],
      [0.00838, 3],
      [0.01201, 2],
      [-0.02943, 0],
      [-0.01077, 1],
      [-0.02786, 0],
      [0.00839, 3]
    ],
    "red_o_points": [],
    "y_categories": ["N", "NOT APPLICABLE", "Y", "nan"],
    "blue_o_points": [],
    "blue_x_points": [
      [0.01074, 3],
      [0.00955, 3],
      [0.01363, 2],
      [0.0149, 2],
      [0.00979, 3],
      [0.01537, 2],
      [0.01432, 2],
      [0.01446, 2],
      [0.01014, 3],
      [-0.00355, 1],
      [0.01392, 2],
      [0.01563, 2],
      [0.00975, 3],
      [0.00974, 3],
      [0.0095, 3],
      [0.00898, 3],
      [0.00994, 3],
      [0.00948, 3],
      [-0.00456, 1],
      [0.00953, 3],
      [0.00979, 3]
    ]
  },
  "QA_lstPexArthre[Index]": {
    "red_x_points": [
      [-0.00881, 0],
      [-0.00185, 2],
      [-0.00276, 2],
      [-0.00884, 0],
      [-0.00373, 0],
      [-0.00921, 0],
      [0.00035, 1],
      [0.00119, 1],
      [-0.00193, 2],
      [0.00357, 1],
      [-0.00255, 2],
      [-0.00148, 2],
      [-0.00273, 2],
      [0.00122, 1],
      [0.00126, 1],
      [-0.00456, 0],
      [-0.00074, 2],
      [-0.00275, 2],
      [-0.00509, 2],
      [-0.0015, 2],
      [-0.00255, 2],
      [-0.00529, 0],
      [-0.00315, 2]
    ],
    "red_o_points": [],
    "y_categories": ["NPV", "PV", "nan"],
    "blue_o_points": [],
    "blue_x_points": [
      [0.00311, 0],
      [-0.00138, 2],
      [0.0028, 1],
      [0.00731, 1],
      [-0.00028, 2],
      [0.00962, 1],
      [0.00568, 1],
      [5e-5, 0],
      [-0.00136, 2],
      [-0.00066, 2],
      [-0.00102, 2],
      [0.0123, 1],
      [-0.00077, 2],
      [0.00345, 1],
      [0.00264, 1],
      [0.0013, 0],
      [-0.00104, 2],
      [0.00487, 1],
      [0.00014, 2],
      [0.00894, 1],
      [0.00621, 1]
    ]
  },
  "QA_yonPreFracture": {
    "red_x_points": [
      [-0.02773, 1],
      [0.00153, 2],
      [0.00517, 0],
      [0.00162, 2],
      [0.00492, 0],
      [0.00581, 0],
      [-0.02522, 1],
      [0.00548, 0],
      [0.00105, 2],
      [-0.0299, 1],
      [-0.03079, 1],
      [-0.0267, 1],
      [0.00194, 2],
      [0.00524, 0],
      [0.00551, 0],
      [0.00466, 0],
      [0.00447, 0],
      [0.00704, 0],
      [-0.03083, 1],
      [0.0055, 0],
      [0.00149, 2],
      [-0.02136, 1],
      [0.00116, 2]
    ],
    "red_o_points": [],
    "y_categories": ["N", "Y", "nan"],
    "blue_o_points": [],
    "blue_x_points": [
      [0.00738, 0],
      [0.00397, 2],
      [0.00588, 0],
      [0.00687, 0],
      [0.00405, 2],
      [0.00791, 0],
      [0.00706, 0],
      [0.00479, 2],
      [0.00439, 2],
      [0.00788, 0],
      [0.00896, 0],
      [0.00913, 0],
      [0.00788, 0],
      [0.0058, 0],
      [0.00573, 0],
      [0.00375, 2],
      [0.00912, 0],
      [0.00717, 0],
      [0.00636, 0],
      [0.0027, 2],
      [0.00314, 2]
    ]
  },
  "QS_mulTransfSite[IAx]": {
    "red_x_points": [
      [-7e-5, 1],
      [-7e-5, 0],
      [-7e-5, 0],
      [7e-5, 2],
      [-7e-5, 0],
      [-7e-5, 0],
      [-7e-5, 2],
      [-0.00013, 0],
      [-7e-5, 2]
    ],
    "red_o_points": [],
    "y_categories": ["N", "NOT APPLICABLE", "nan"],
    "blue_o_points": [],
    "blue_x_points": [[0.00027, 1], [0.00013, 0], [7e-5, 2], [7e-5, 2]]
  },
  "QA_lstPexPalle[Clavicle]": {
    "red_x_points": [
      [-0.00099, 3],
      [-0.0007, 3],
      [-0.00131, 3],
      [0.00523, 2],
      [-0.00087, 3],
      [-0.00083, 3],
      [-0.01528, 0],
      [-0.01418, 0],
      [-0.00077, 3],
      [-0.00114, 3],
      [-0.00113, 3],
      [-0.00056, 3],
      [-0.00102, 3],
      [-0.0218, 0],
      [-0.00078, 3],
      [-0.01313, 0],
      [-0.00634, 1],
      [-0.00124, 3],
      [-0.00158, 3],
      [-0.00089, 3],
      [0.00752, 2],
      [-0.01246, 0],
      [-0.00071, 3]
    ],
    "red_o_points": [],
    "y_categories": ["HYPO", "NAIA", "PT", "nan"],
    "blue_o_points": [],
    "blue_x_points": [
      [-0.00034, 3],
      [-0.00019, 3],
      [0.01203, 2],
      [0.01724, 2],
      [-0.00064, 3],
      [-0.00094, 3],
      [0.01608, 2],
      [0.01206, 2],
      [-0.00066, 3],
      [-0.00049, 3],
      [-0.00076, 3],
      [-0.00044, 3],
      [-0.00052, 3],
      [-0.00704, 0],
      [0.01132, 2],
      [0.00694, 1],
      [-0.00055, 3],
      [0.01016, 2],
      [-0.00038, 3],
      [0.01244, 2],
      [-0.00037, 3]
    ]
  }
}
