{
  "QA_lstPexMuscstrength[ElbowFlex]": {
    "red_x_points": [
      [-0.00424, 1],
      [0.00018, 2],
      [-0.00156, 1],
      [-0.00157, 1],
      [0.0017, 0],
      [-0.0014, 1],
      [-0.00185, 1],
      [-0.00314, 1],
      [-0.00158, 1],
      [-0.00142, 1],
      [-0.00127, 1],
      [-0.00439, 1],
      [0.0004, 2],
      [0.00381, 2],
      [0.00023, 2],
      [-0.00367, 1],
      [0.00035, 2],
      [0.00051, 0],
      [-0.00357, 1],
      [-0.00347, 1],
      [-0.00367, 1],
      [-0.00135, 1],
      [0.00291, 2],
      [-0.00119, 0],
      [-0.00382, 1],
      [-0.0013, 1],
      [-0.00337, 1],
      [-0.00163, 1],
      [-0.00372, 1],
      [0.00022, 2],
      [-0.00136, 1]
    ],
    "red_o_points": [],
    "y_categories": ["GREATER THAN OR EQUALS TO 3", "LESS THAN 3", "nan"],
    "blue_o_points": [],
    "blue_x_points": [
      [0.00065, 2],
      [0.00478, 2],
      [0.00448, 0],
      [0.00012, 1],
      [0.00552, 2],
      [0.005, 0],
      [0.00531, 0]
    ]
  },
  "QS_mulLysisTrunk[Upper]": {
    "red_x_points": [
      [-0.00178, 3],
      [-0.00292, 0],
      [-0.00319, 0],
      [-0.00285, 0],
      [-0.0031, 0],
      [-0.0053, 2],
      [-0.00325, 0],
      [-0.00165, 3],
      [-0.00297, 0],
      [-0.00262, 0],
      [-0.00288, 0],
      [-0.00173, 3],
      [0.00859, 1],
      [-0.0017, 3],
      [-0.00296, 0],
      [-0.00193, 3],
      [-0.0051, 2],
      [-0.00274, 0],
      [-0.00196, 3],
      [-0.00194, 3],
      [-0.00163, 3],
      [-0.00299, 0],
      [-0.00178, 3],
      [-0.00186, 3],
      [-0.00168, 3],
      [-0.00321, 0],
      [-0.00163, 3],
      [-0.00321, 0],
      [-0.0017, 3],
      [0.00899, 1],
      [-0.00475, 2]
    ],
    "red_o_points": [],
    "y_categories": ["N", "NOT APPLICABLE", "Y", "nan"],
    "blue_o_points": [],
    "blue_x_points": [
      [0.01175, 1],
      [-0.00058, 3],
      [0.01003, 1],
      [-0.00159, 0],
      [-0.00072, 3],
      [0.00942, 1],
      [0.01025, 1]
    ]
  },
  "QS_mulBpsurgeryType[Transf]": {
    "red_x_points": [
      [-0.00014, 3],
      [-0.00018, 2],
      [-0.00065, 0],
      [-0.00018, 2],
      [-0.00014, 2],
      [-0.00021, 2],
      [-0.0002, 2],
      [-0.00014, 3],
      [-0.00023, 2],
      [-0.00015, 2],
      [-0.00018, 2],
      [-0.00012, 3],
      [0.00057, 1],
      [-0.00014, 3],
      [-0.00018, 2],
      [-0.0001, 3],
      [-0.00013, 2],
      [-0.00023, 2],
      [-0.00011, 3],
      [-0.00011, 3],
      [-0.00011, 3],
      [-0.00024, 2],
      [-6e-5, 3],
      [-0.0001, 3],
      [-0.00011, 3],
      [-0.00021, 2],
      [-5e-5, 3],
      [-0.00018, 2],
      [-6e-5, 3],
      [0.00046, 1],
      [-0.00021, 2]
    ],
    "red_o_points": [],
    "y_categories": ["N", "NOT APPLICABLE", "Y", "nan"],
    "blue_o_points": [],
    "blue_x_points": [
      [0.00061, 1],
      [-9e-5, 3],
      [0.0006, 1],
      [-0.00023, 2],
      [-3e-5, 3],
      [0.00079, 1],
      [0.0009, 1]
    ]
  },
  "QS_mulNeuromadSite[T1]": {
    "red_x_points": [
      [-0.00124, 2],
      [-0.00489, 0],
      [-0.0047, 0],
      [-0.0045, 0],
      [-0.0046, 0],
      [-0.0043, 0],
      [-0.00452, 0],
      [-0.00121, 2],
      [-0.00448, 0],
      [-0.00447, 0],
      [-0.00437, 0],
      [-0.00172, 2],
      [0.00608, 1],
      [-0.00142, 2],
      [-0.00424, 0],
      [-0.00156, 2],
      [-0.00424, 0],
      [-0.00437, 0],
      [-0.00103, 2],
      [-0.0013, 2],
      [-0.00098, 2],
      [-0.00385, 0],
      [-0.00126, 2],
      [-0.00136, 2],
      [-0.00145, 2],
      [-0.00413, 0],
      [-0.00107, 2],
      [-0.00447, 0],
      [-0.00104, 2],
      [0.00838, 1],
      [-0.00401, 0]
    ],
    "red_o_points": [],
    "y_categories": ["N", "NOT APPLICABLE", "nan"],
    "blue_o_points": [],
    "blue_x_points": [
      [0.01519, 1],
      [0.00022, 2],
      [0.0093, 1],
      [0.0008, 0],
      [-0.0002, 2],
      [0.00913, 1],
      [0.01161, 1]
    ]
  },
  "QS_mulNeuromadSite[T2]": {
    "red_x_points": [
      [-0.00219, 2],
      [-0.00658, 0],
      [-0.00715, 0],
      [-0.0066, 0],
      [-0.00724, 0],
      [-0.00654, 0],
      [-0.00656, 0],
      [-0.00204, 2],
      [-0.00676, 0],
      [-0.00668, 0],
      [-0.00686, 0],
      [-0.00226, 2],
      [0.01088, 1],
      [-0.00175, 2],
      [-0.00653, 0],
      [-0.00223, 2],
      [-0.00529, 0],
      [-0.00689, 0],
      [-0.00191, 2],
      [-0.00184, 2],
      [-0.00188, 2],
      [-0.00618, 0],
      [-0.00187, 2],
      [-0.00246, 2],
      [-0.00196, 2],
      [-0.00632, 0],
      [-0.00252, 2],
      [-0.00678, 0],
      [-0.00164, 2],
      [0.01079, 1],
      [-0.00627, 0]
    ],
    "red_o_points": [],
    "y_categories": ["N", "NOT APPLICABLE", "nan"],
    "blue_o_points": [],
    "blue_x_points": [
      [0.02471, 1],
      [-1e-5, 2],
      [0.01393, 1],
      [0.00073, 0],
      [-0.00023, 2],
      [0.01585, 1],
      [0.01515, 1]
    ]
  },
  "QA_mulInjOrthesisType[ShoulderSupport]": {
    "red_x_points": [
      [-0.01244, 0],
      [-0.01177, 0],
      [-0.01162, 0],
      [-0.01168, 0],
      [-0.01111, 0],
      [-0.01151, 0],
      [-0.01148, 0],
      [-0.0149, 2],
      [-0.01099, 0],
      [-0.01025, 0],
      [-0.01157, 0],
      [-0.013, 0],
      [0.03129, 1],
      [-0.01227, 0],
      [-0.0112, 0],
      [-0.01214, 0],
      [-0.01413, 2],
      [-0.01155, 0],
      [-0.01255, 0],
      [-0.01233, 0],
      [-0.01436, 2],
      [-0.01384, 3],
      [-0.01231, 0],
      [0.03373, 1],
      [-0.01301, 0],
      [-0.01127, 0],
      [-0.01317, 0],
      [-0.01078, 0],
      [-0.01483, 3],
      [-0.01929, 3],
      [-0.01185, 0]
    ],
    "red_o_points": [],
    "y_categories": ["N", "NOT APPLICABLE", "Y", "nan"],
    "blue_o_points": [],
    "blue_x_points": [
      [-0.00473, 0],
      [0.03498, 1],
      [0.03025, 1],
      [0.03648, 1],
      [0.0342, 1],
      [0.02956, 1],
      [0.03152, 1]
    ]
  },
  "QS_mulGraftTrunk[MiddleTrunk]": {
    "red_x_points": [
      [-1e-5, 2],
      [-1e-5, 0],
      [-1e-5, 0],
      [-1e-5, 0],
      [-1e-5, 2],
      [-1e-5, 0],
      [-1e-5, 0],
      [-1e-5, 2],
      [-1e-5, 0],
      [-1e-5, 2],
      [-1e-5, 0],
      [-1e-5, 2],
      [-1e-5, 2],
      [-1e-5, 2],
      [-1e-5, 2],
      [-1e-5, 0],
      [-1e-5, 0]
    ],
    "red_o_points": [],
    "y_categories": ["N", "NOT APPLICABLE", "nan"],
    "blue_o_points": [],
    "blue_x_points": [[0.00019, 1]]
  },
  "QS_mulGraftNerve[Ac]": {
    "red_x_points": [
      [-0.00029, 2],
      [-0.00112, 0],
      [-0.00128, 0],
      [-0.00101, 0],
      [-0.00109, 0],
      [-0.00101, 0],
      [-0.00098, 0],
      [-0.00031, 2],
      [-0.00117, 0],
      [-0.00135, 0],
      [-0.00085, 0],
      [-0.00036, 2],
      [0.00173, 1],
      [-0.00045, 2],
      [-0.00099, 0],
      [-0.00065, 2],
      [-0.00106, 0],
      [-0.00103, 0],
      [-0.00036, 2],
      [-0.00033, 2],
      [-0.00019, 2],
      [-0.00094, 0],
      [-0.00034, 2],
      [-0.0005, 2],
      [-0.00032, 2],
      [-0.00121, 0],
      [-0.00027, 2],
      [-0.00119, 0],
      [-0.00025, 2],
      [0.00182, 1],
      [-0.00114, 0]
    ],
    "red_o_points": [],
    "y_categories": ["N", "NOT APPLICABLE", "nan"],
    "blue_o_points": [],
    "blue_x_points": [
      [0.00455, 1],
      [0.00017, 2],
      [0.00238, 1],
      [5e-5, 0],
      [0.00015, 2],
      [0.00222, 1],
      [0.00252, 1]
    ]
  },
  "QS_mulNeuromadSite[C8]": {
    "red_x_points": [
      [-0.00129, 2],
      [-0.00394, 0],
      [-0.00447, 0],
      [-0.00382, 0],
      [-0.00375, 0],
      [-0.00359, 0],
      [-0.00445, 0],
      [-0.00155, 2],
      [-0.00418, 0],
      [-0.00384, 0],
      [-0.00399, 0],
      [-0.00144, 2],
      [0.00519, 1],
      [-0.0009, 2],
      [-0.0043, 0],
      [-0.00151, 2],
      [-0.00438, 0],
      [-0.00417, 0],
      [-0.00123, 2],
      [-0.00129, 2],
      [-0.00124, 2],
      [-0.00395, 0],
      [-0.00128, 2],
      [-0.0013, 2],
      [-0.00149, 2],
      [-0.00361, 0],
      [-0.00136, 2],
      [-0.00439, 0],
      [-0.00092, 2],
      [0.00848, 1],
      [-0.0039, 0]
    ],
    "red_o_points": [],
    "y_categories": ["N", "NOT APPLICABLE", "nan"],
    "blue_o_points": [],
    "blue_x_points": [
      [0.01421, 1],
      [7e-5, 2],
      [0.0093, 1],
      [0.00019, 0],
      [0.00014, 2],
      [0.00842, 1],
      [0.00945, 1]
    ]
  },
  "QS_mulGraftNerve[Ph]": {
    "red_x_points": [
      [-0.00018, 2],
      [-0.00082, 0],
      [-0.00087, 0],
      [-0.0009, 0],
      [-0.00095, 0],
      [-0.0007, 0],
      [-0.0008, 0],
      [-0.00034, 2],
      [-0.0009, 0],
      [-0.0007, 0],
      [-0.00089, 0],
      [-0.00024, 2],
      [0.00065, 1],
      [-0.00029, 2],
      [-0.00092, 0],
      [-0.0003, 2],
      [-0.00077, 0],
      [-0.00062, 0],
      [-0.00025, 2],
      [-0.00024, 2],
      [-0.00026, 2],
      [-0.00074, 0],
      [-0.00028, 2],
      [-0.00017, 2],
      [-0.00029, 2],
      [-0.00087, 0],
      [-0.00027, 2],
      [-0.00086, 0],
      [-0.00016, 2],
      [0.00154, 1],
      [-0.00073, 0]
    ],
    "red_o_points": [],
    "y_categories": ["N", "NOT APPLICABLE", "nan"],
    "blue_o_points": [],
    "blue_x_points": [
      [0.00267, 1],
      [-7e-5, 2],
      [0.00227, 1],
      [9e-5, 0],
      [6e-5, 2],
      [0.00189, 1],
      [0.00151, 1]
    ]
  },
  "QS_mulTransfSite[AcSsPA]": {
    "red_x_points": [
      [-0.00056, 3],
      [-0.00107, 0],
      [-0.00113, 0],
      [-0.00109, 0],
      [-0.00108, 0],
      [-0.00115, 0],
      [-0.00106, 0],
      [-0.00047, 3],
      [-0.001, 0],
      [-0.00125, 0],
      [-0.00089, 0],
      [-0.00065, 3],
      [0.00248, 1],
      [-0.00056, 3],
      [-0.00082, 0],
      [-0.00069, 3],
      [-0.0024, 2],
      [-0.00112, 0],
      [-0.00047, 3],
      [-0.00048, 3],
      [-0.00059, 3],
      [-0.00104, 0],
      [-0.00063, 3],
      [-0.00058, 3],
      [-0.00051, 3],
      [-0.00084, 0],
      [-0.00059, 3],
      [-0.00123, 0],
      [-0.00055, 3],
      [0.00306, 1],
      [-0.00103, 0]
    ],
    "red_o_points": [],
    "y_categories": ["N", "NOT APPLICABLE", "Y", "nan"],
    "blue_o_points": [],
    "blue_x_points": [
      [0.00469, 1],
      [-0.00036, 3],
      [0.0027, 1],
      [-0.0008, 0],
      [-0.00031, 3],
      [0.00387, 1],
      [0.00331, 1]
    ]
  },
  "QA_lstPexMuscstrength[ScapulaAbducSuprot]": {
    "red_x_points": [
      [-0.00027, 0],
      [5e-5, 2],
      [-0.00014, 1],
      [-0.00023, 1],
      [-5e-5, 0],
      [-0.00034, 1],
      [-0.00027, 1],
      [-0.00051, 1],
      [-0.00012, 0],
      [-0.00023, 0],
      [-0.00033, 1],
      [-0.00062, 1],
      [8e-5, 2],
      [0.00021, 2],
      [6e-5, 2],
      [0.00018, 2],
      [5e-5, 2],
      [-0.00016, 0],
      [-0.00033, 0],
      [-0.00046, 1],
      [-0.00022, 0],
      [-0.00015, 1],
      [0.00025, 2],
      [-0.00024, 0],
      [0.00023, 2],
      [-0.00049, 1],
      [-0.00056, 1],
      [-5e-5, 0],
      [0.00019, 2],
      [8e-5, 2],
      [-9e-5, 1]
    ],
    "red_o_points": [],
    "y_categories": ["GREATER THAN OR EQUALS TO 3", "LESS THAN 3", "nan"],
    "blue_o_points": [],
    "blue_x_points": [
      [7e-5, 2],
      [0.00066, 2],
      [0.00018, 0],
      [0.00096, 2],
      [0.00041, 2],
      [0.00014, 0],
      [6e-5, 2]
    ]
  },
  "participant_code": {
    "red_x_points": [
      [-0.01843, 1],
      [-0.01899, 2],
      [-0.01866, 3],
      [-0.01782, 4],
      [-0.01829, 5],
      [-0.01894, 6],
      [-0.01913, 7],
      [-0.01862, 8],
      [-0.01899, 9],
      [-0.01848, 10],
      [-0.01866, 11],
      [-0.01871, 12],
      [-0.01852, 14],
      [-0.01857, 16],
      [-0.01936, 17],
      [-0.01834, 19],
      [-0.01834, 20],
      [-0.01857, 22],
      [-0.01918, 23],
      [-0.01843, 25],
      [-0.0182, 26],
      [-0.0189, 27],
      [-0.01866, 28],
      [-0.01866, 29],
      [-0.01908, 30],
      [-0.01792, 32],
      [-0.01824, 33],
      [-0.01824, 34],
      [-0.01796, 35],
      [-0.01796, 36],
      [-0.01834, 37]
    ],
    "red_o_points": [],
    "y_categories": [
      "P16554",
      "P18297",
      "P19283",
      "P19287",
      "P23391",
      "P31645",
      "P31691",
      "P34778",
      "P35046",
      "P36328",
      "P43633",
      "P4544",
      "P46417",
      "P48965",
      "P53068",
      "P5497",
      "P59529",
      "P62483",
      "P64658",
      "P65202",
      "P66816",
      "P6751",
      "P7408",
      "P75566",
      "P76226",
      "P79971",
      "P82621",
      "P82990",
      "P84932",
      "P85825",
      "P86989",
      "P8770",
      "P87791",
      "P90550",
      "P93159",
      "P94969",
      "P96710",
      "P9744",
      "nan"
    ],
    "blue_o_points": [],
    "blue_x_points": [
      [0.05657, 0],
      [0.05473, 13],
      [0.05258, 15],
      [0.05335, 18],
      [0.05335, 21],
      [0.05427, 24],
      [0.05473, 31]
    ]
  },
  "QA_lstPexMuscstrength[ShoulderExrot]": {
    "red_x_points": [
      [-0.00193, 1],
      [0.00019, 2],
      [0.00197, 0],
      [-0.00169, 1],
      [-0.00178, 1],
      [-0.00146, 1],
      [0.00018, 2],
      [-0.00145, 1],
      [-0.00155, 1],
      [-0.00161, 1],
      [0.00029, 2],
      [-0.0016, 1],
      [-0.00065, 2],
      [0.00026, 2],
      [0.00017, 2],
      [0.00025, 2],
      [0.00024, 2],
      [-0.00179, 1],
      [-0.00187, 1],
      [-0.00152, 1],
      [-0.00152, 1],
      [0.00024, 2],
      [0.00017, 2],
      [0.0002, 2],
      [0.00017, 2],
      [-0.00147, 1],
      [0.00025, 2],
      [0.00126, 0],
      [0.00021, 2],
      [-0.00064, 2],
      [-0.00138, 1]
    ],
    "red_o_points": [],
    "y_categories": ["GREATER THAN OR EQUALS TO 3", "LESS THAN 3", "nan"],
    "blue_o_points": [],
    "blue_x_points": [
      [-0.0002, 2],
      [0.0003, 2],
      [0.00455, 0],
      [0.0007, 2],
      [0.00032, 2],
      [0.00385, 0],
      [0.00026, 1]
    ]
  },
  "QA_mulInjOrthesisType[ArmSling]": {
    "red_x_points": [
      [-0.01109, 2],
      [-0.00945, 2],
      [-0.011, 2],
      [-0.01084, 2],
      [-0.01029, 2],
      [-0.01052, 2],
      [-0.01065, 2],
      [-0.01109, 2],
      [-0.01098, 2],
      [-0.0104, 2],
      [-0.01051, 2],
      [-0.0105, 2],
      [0.02817, 1],
      [-0.01104, 2],
      [-0.01135, 2],
      [-0.01139, 2],
      [-0.01297, 0],
      [-0.01071, 2],
      [-0.01093, 2],
      [-0.01133, 2],
      [-0.0131, 0],
      [-0.01179, 3],
      [-0.01093, 2],
      [0.0316, 1],
      [-0.01111, 2],
      [-0.01058, 2],
      [-0.01131, 2],
      [-0.01048, 2],
      [-0.01239, 3],
      [-0.01812, 3],
      [-0.01079, 2]
    ],
    "red_o_points": [],
    "y_categories": ["N", "NOT APPLICABLE", "Y", "nan"],
    "blue_o_points": [],
    "blue_x_points": [
      [-0.00466, 2],
      [0.03082, 1],
      [0.0282, 1],
      [0.03433, 1],
      [0.03252, 1],
      [0.02601, 1],
      [0.02772, 1]
    ]
  },
  "QS_mulGraftNerve[Ul]": {
    "red_x_points": [
      [-4e-5, 2],
      [-0.00028, 0],
      [-0.00024, 0],
      [-0.00037, 0],
      [-0.00055, 0],
      [-0.00028, 0],
      [-0.00032, 0],
      [-9e-5, 2],
      [-0.00028, 0],
      [-0.00026, 0],
      [-0.00028, 0],
      [-7e-5, 2],
      [0.00014, 1],
      [-9e-5, 2],
      [-0.00014, 0],
      [-4e-5, 2],
      [-0.00026, 0],
      [-0.00052, 0],
      [-7e-5, 2],
      [-3e-5, 2],
      [-9e-5, 2],
      [-0.00031, 0],
      [-9e-5, 2],
      [-7e-5, 2],
      [-2e-5, 2],
      [-0.00018, 0],
      [-5e-5, 2],
      [-0.00023, 0],
      [-9e-5, 2],
      [0.00074, 1],
      [-0.00027, 0]
    ],
    "red_o_points": [],
    "y_categories": ["N", "NOT APPLICABLE", "nan"],
    "blue_o_points": [],
    "blue_x_points": [
      [0.00083, 1],
      [3e-5, 2],
      [0.00067, 1],
      [0.00012, 0],
      [-1e-5, 2],
      [0.0006, 1],
      [0.00072, 1]
    ]
  },
  "QS_mulGraftNerve[Ssr]": {
    "red_x_points": [
      [-2e-5, 2],
      [-5e-5, 0],
      [-5e-5, 0],
      [-0.00017, 0],
      [-5e-5, 0],
      [-5e-5, 0],
      [-5e-5, 0],
      [-2e-5, 2],
      [4e-5, 1],
      [7e-5, 2],
      [-0.00011, 0],
      [-5e-5, 0],
      [-0.00017, 0],
      [-2e-5, 2],
      [-2e-5, 2],
      [-5e-5, 0],
      [-2e-5, 2],
      [-0.00015, 2],
      [-5e-5, 0],
      [-2e-5, 2],
      [-5e-5, 0],
      [-2e-5, 2],
      [4e-5, 1],
      [-5e-5, 0]
    ],
    "red_o_points": [],
    "y_categories": ["N", "NOT APPLICABLE", "nan"],
    "blue_o_points": [],
    "blue_x_points": [
      [0.0001, 1],
      [7e-5, 2],
      [0.00018, 1],
      [-2e-5, 2],
      [0.00018, 1]
    ]
  },
  "QA_yonInjUnconscio": {
    "red_x_points": [
      [-0.00315, 1],
      [-0.00353, 1],
      [-0.00176, 2],
      [-0.00189, 2],
      [0.00619, 0],
      [-0.00386, 1],
      [-0.0024, 2],
      [-0.00376, 2],
      [-0.00223, 2],
      [-0.00178, 2],
      [-0.00314, 1],
      [-0.00381, 1],
      [-0.01993, 1],
      [-0.00511, 2],
      [-0.00175, 2],
      [-0.00473, 2],
      [-0.00309, 1],
      [0.00718, 0],
      [-0.00335, 1],
      [-0.00223, 1],
      [-0.00318, 1],
      [-0.0037, 1],
      [-0.00422, 2],
      [-0.00571, 1],
      [-0.00331, 2],
      [-0.00352, 1],
      [0.00796, 0],
      [-0.0029, 1],
      [-0.00464, 2],
      [-0.0005, 2],
      [-0.00359, 1]
    ],
    "red_o_points": [],
    "y_categories": ["N", "Y", "nan"],
    "blue_o_points": [],
    "blue_x_points": [
      [0.00103, 2],
      [-0.0001, 1],
      [0.01126, 0],
      [0.01761, 0],
      [0.01833, 0],
      [0.00222, 2],
      [0.00219, 2]
    ]
  },
  "QS_mulGraftNerve[MCA]": {
    "red_x_points": [
      [-1e-5, 2],
      [-4e-5, 0],
      [-6e-5, 0],
      [-6e-5, 0],
      [-6e-5, 0],
      [-4e-5, 0],
      [-6e-5, 0],
      [-1e-5, 2],
      [-4e-5, 0],
      [-4e-5, 0],
      [-3e-5, 0],
      [-3e-5, 2],
      [-1e-5, 1],
      [-2e-5, 2],
      [-6e-5, 0],
      [-3e-5, 2],
      [-1e-5, 0],
      [-2e-5, 2],
      [-1e-5, 2],
      [-2e-5, 2],
      [0.0, 2],
      [-2e-5, 2],
      [-6e-5, 0],
      [-3e-5, 2],
      [-6e-5, 0],
      [9e-5, 1],
      [-1e-5, 0]
    ],
    "red_o_points": [],
    "y_categories": ["N", "NOT APPLICABLE", "nan"],
    "blue_o_points": [],
    "blue_x_points": [
      [0.00038, 1],
      [-1e-5, 2],
      [7e-5, 0],
      [-1e-5, 2],
      [9e-5, 1]
    ]
  },
  "QA_lstPexInspectio[SurgicalScar]": {
    "red_x_points": [
      [0.00171, 1],
      [0.0009, 1],
      [0.00022, 0],
      [0.00066, 1],
      [-0.00442, 2],
      [-0.00034, 0],
      [0.00108, 1],
      [0.00179, 1],
      [0.00086, 1],
      [-0.00253, 2],
      [0.00112, 1],
      [-0.00243, 0],
      [-0.00227, 1],
      [-0.00564, 2],
      [0.00125, 1],
      [0.00196, 1],
      [-0.00126, 0],
      [-0.00394, 2],
      [-0.00475, 2],
      [-0.00457, 2],
      [0.00211, 1],
      [0.00092, 1],
      [-0.00533, 2],
      [-0.01221, 2],
      [0.00201, 1],
      [0.00093, 1],
      [-0.00547, 2],
      [-0.00199, 2],
      [0.00174, 1],
      [-0.00206, 1],
      [-0.00267, 2]
    ],
    "red_o_points": [],
    "y_categories": ["ABS", "NAIA", "PT", "nan"],
    "blue_o_points": [],
    "blue_x_points": [
      [-0.0006, 1],
      [0.00404, 1],
      [0.00553, 0],
      [0.00391, 1],
      [0.00571, 1],
      [4e-5, 1],
      [0.00671, 0]
    ]
  },
  "QA_intPexWristFlex": {
    "red_x_points": [[0.00062, 2], [-0.01668, 1]],
    "red_o_points": [],
    "y_categories": ["GREATER THAN OR EQUALS TO 60", "LESS THAN 60", "nan"],
    "blue_o_points": [],
    "blue_x_points": [[0.00157, 2], [0.00632, 0], [0.00131, 2], [0.00163, 2]]
  },
  "QS_mulGraftNerve[Me]": {
    "red_x_points": [
      [-0.00022, 2],
      [-0.00048, 0],
      [-0.00048, 0],
      [-0.00041, 0],
      [-0.00068, 0],
      [-0.00048, 0],
      [-0.00056, 0],
      [-0.00018, 2],
      [-0.00048, 0],
      [-0.00054, 0],
      [-0.0004, 0],
      [-0.0003, 2],
      [0.00081, 1],
      [-0.00025, 2],
      [-0.00053, 0],
      [-0.00032, 2],
      [-0.00038, 0],
      [-0.00054, 0],
      [-0.00039, 2],
      [-0.00031, 2],
      [-0.00031, 2],
      [-0.00037, 0],
      [-0.00013, 2],
      [-0.00068, 2],
      [-0.00033, 2],
      [-0.00044, 0],
      [-0.00032, 2],
      [-0.00044, 0],
      [-0.00029, 2],
      [0.00132, 1],
      [-0.00033, 0]
    ],
    "red_o_points": [],
    "y_categories": ["N", "NOT APPLICABLE", "nan"],
    "blue_o_points": [],
    "blue_x_points": [
      [0.00208, 1],
      [-1e-5, 2],
      [0.00113, 1],
      [4e-5, 0],
      [7e-5, 2],
      [0.00128, 1],
      [0.00114, 1]
    ]
  },
  "QS_mulLysisSite[Trunk]": {
    "red_x_points": [
      [-0.00167, 3],
      [-0.00289, 0],
      [-0.003, 0],
      [-0.00308, 0],
      [-0.00296, 0],
      [-0.00539, 2],
      [-0.00287, 0],
      [-0.00214, 3],
      [-0.00323, 0],
      [-0.00278, 0],
      [-0.00293, 0],
      [-0.00196, 3],
      [0.00803, 1],
      [-0.00152, 3],
      [-0.00336, 0],
      [-0.00193, 3],
      [-0.00563, 2],
      [-0.0032, 0],
      [-0.00196, 3],
      [-0.0016, 3],
      [-0.00176, 3],
      [-0.00286, 0],
      [-0.00206, 3],
      [-0.00163, 3],
      [-0.00173, 3],
      [-0.00297, 0],
      [-0.0018, 3],
      [-0.00318, 0],
      [-0.00151, 3],
      [0.00928, 1],
      [-0.00513, 2]
    ],
    "red_o_points": [],
    "y_categories": ["N", "NOT APPLICABLE", "Y", "nan"],
    "blue_o_points": [],
    "blue_x_points": [
      [0.012, 1],
      [-0.0005, 3],
      [0.00967, 1],
      [-0.00139, 0],
      [-0.00068, 3],
      [0.00916, 1],
      [0.01055, 1]
    ]
  },
  "QS_mulGraftTrunk[UpperTrunk]": {
    "red_x_points": [
      [-0.0007, 3],
      [-0.00137, 0],
      [-0.00136, 0],
      [-0.00142, 0],
      [-0.00137, 0],
      [-0.00138, 0],
      [-0.00119, 0],
      [-0.00079, 3],
      [-0.00135, 0],
      [-0.00126, 0],
      [-0.00147, 0],
      [-0.00086, 3],
      [0.00335, 1],
      [-0.00068, 3],
      [-0.00377, 2],
      [-0.00077, 3],
      [-0.00124, 0],
      [-0.0014, 0],
      [-0.00063, 3],
      [-0.00068, 3],
      [-0.00062, 3],
      [-0.00132, 0],
      [-0.00061, 3],
      [-0.00062, 3],
      [-0.00092, 3],
      [-0.00145, 0],
      [-0.00084, 3],
      [-0.00135, 0],
      [-0.00077, 3],
      [0.00347, 1],
      [-0.00145, 0]
    ],
    "red_o_points": [],
    "y_categories": ["N", "NOT APPLICABLE", "Y", "nan"],
    "blue_o_points": [],
    "blue_x_points": [
      [0.00539, 1],
      [-3e-5, 3],
      [0.00392, 1],
      [-8e-5, 0],
      [-0.00025, 3],
      [0.00427, 1],
      [0.00514, 1]
    ]
  },
  "QS_mulTransfSite[PhMc]": {
    "red_x_points": [
      [-0.00143, 3],
      [-0.00226, 0],
      [-0.00236, 0],
      [-0.00229, 0],
      [-0.00276, 0],
      [-0.00226, 0],
      [-0.00478, 2],
      [-0.00128, 3],
      [-0.0023, 0],
      [-0.00238, 0],
      [-0.00244, 0],
      [-0.00138, 3],
      [0.00861, 1],
      [-0.00117, 3],
      [-0.00252, 0],
      [-0.00138, 3],
      [-0.00224, 0],
      [-0.00247, 0],
      [-0.00146, 3],
      [-0.00119, 3],
      [-0.00151, 3],
      [-0.00459, 2],
      [-0.0012, 3],
      [-0.00126, 3],
      [-0.00126, 3],
      [-0.00254, 0],
      [-0.0011, 3],
      [-0.0025, 0],
      [-0.00151, 3],
      [0.00591, 1],
      [-0.00218, 0]
    ],
    "red_o_points": [],
    "y_categories": ["N", "NOT APPLICABLE", "Y", "nan"],
    "blue_o_points": [],
    "blue_x_points": [
      [0.00877, 1],
      [-0.00048, 3],
      [0.00738, 1],
      [-0.00179, 0],
      [-0.00059, 3],
      [0.0078, 1],
      [0.00792, 1]
    ]
  },
  "QA_mulInjTbpiCause[Motorcycle]": {
    "red_x_points": [
      [0.00129, 0],
      [-0.00094, 1],
      [-0.00184, 1],
      [-0.00124, 1],
      [-0.00145, 1],
      [-0.00103, 1],
      [-0.00137, 1],
      [-0.00093, 1],
      [-0.00132, 1],
      [-0.00129, 1],
      [-0.00106, 1],
      [-0.00072, 0],
      [-0.03575, 1],
      [-0.00129, 1],
      [-0.00159, 1],
      [-0.00121, 1],
      [-0.00119, 1],
      [-0.00109, 1],
      [0.00088, 0],
      [-0.0007, 1],
      [-0.00082, 1],
      [-0.00083, 1],
      [-0.0012, 1],
      [-0.00178, 1],
      [0.00107, 0],
      [-0.00098, 1],
      [-0.00061, 1],
      [-0.00132, 1],
      [-0.00094, 1],
      [-0.03233, 1],
      [-0.00094, 1]
    ],
    "red_o_points": [],
    "y_categories": ["N", "Y", "nan"],
    "blue_o_points": [],
    "blue_x_points": [
      [0.01615, 0],
      [-0.00024, 1],
      [0.01516, 0],
      [-0.00174, 1],
      [0.00148, 1],
      [0.01569, 0],
      [0.01497, 0]
    ]
  },
  "QS_mulLysisRoot[C6]": {
    "red_x_points": [
      [-0.00114, 3],
      [-0.00225, 0],
      [-0.00427, 2],
      [-0.002, 0],
      [-0.00213, 0],
      [-0.00224, 0],
      [-0.00221, 0],
      [-0.00123, 3],
      [-0.00222, 0],
      [-0.00182, 0],
      [-0.00198, 0],
      [-0.00116, 3],
      [0.00489, 1],
      [-0.00106, 3],
      [-0.00216, 0],
      [-0.00111, 3],
      [-0.00198, 0],
      [-0.00212, 0],
      [-0.00104, 3],
      [-0.00105, 3],
      [-0.00106, 3],
      [-0.00201, 0],
      [-0.00121, 3],
      [-0.00115, 3],
      [-0.00112, 3],
      [-0.00217, 0],
      [-0.00105, 3],
      [-0.00198, 0],
      [-0.00086, 3],
      [0.0053, 1],
      [-0.00306, 2]
    ],
    "red_o_points": [],
    "y_categories": ["N", "NOT APPLICABLE", "Y", "nan"],
    "blue_o_points": [],
    "blue_x_points": [
      [0.0082, 1],
      [-0.00035, 3],
      [0.00659, 1],
      [-0.00145, 0],
      [-0.00041, 3],
      [0.00672, 1],
      [0.00718, 1]
    ]
  },
  "QA_yonInjOrtsurg": {
    "red_x_points": [
      [-0.00471, 2],
      [-0.00021, 2],
      [-3e-5, 2],
      [-3e-5, 2],
      [0.00012, 2],
      [-1e-5, 2],
      [-0.00046, 1],
      [-0.00438, 2],
      [-7e-5, 0],
      [-0.00024, 1],
      [-0.00019, 1],
      [-0.00444, 2],
      [-0.0034, 0],
      [0.0007, 1],
      [-0.00046, 2],
      [-0.00486, 2],
      [-0.00011, 0],
      [4e-5, 2],
      [0.0042, 0],
      [0.00056, 1],
      [-0.00499, 2],
      [-0.00029, 1],
      [-0.00555, 2],
      [-0.00466, 2],
      [-0.00407, 2],
      [5e-5, 0],
      [-0.00068, 1],
      [1e-5, 0],
      [-0.00495, 2],
      [-0.00189, 1],
      [-0.00012, 1]
    ],
    "red_o_points": [],
    "y_categories": ["N", "Y", "nan"],
    "blue_o_points": [],
    "blue_x_points": [
      [0.00044, 2],
      [0.00649, 1],
      [0.00052, 2],
      [0.00041, 2],
      [0.01764, 0],
      [0.00066, 2],
      [0.00051, 2]
    ]
  },
  "QS_mulGraftLevel[Trunk]": {
    "red_x_points": [
      [-0.00045, 3],
      [-0.00083, 0],
      [-0.00077, 0],
      [-0.00078, 0],
      [-0.00076, 0],
      [-0.00083, 0],
      [-0.00092, 0],
      [-0.00042, 3],
      [-0.00082, 0],
      [-0.00079, 0],
      [-0.0007, 0],
      [-0.00033, 3],
      [0.00223, 1],
      [-0.00034, 3],
      [-0.00263, 2],
      [-0.00057, 3],
      [-0.00059, 0],
      [-0.00082, 0],
      [-0.00031, 3],
      [-0.00034, 3],
      [-0.00033, 3],
      [-0.00079, 0],
      [-0.00047, 3],
      [-0.00037, 3],
      [-0.00047, 3],
      [-0.00088, 0],
      [-0.00041, 3],
      [-0.00072, 0],
      [-0.00043, 3],
      [0.00166, 1],
      [-0.00071, 0]
    ],
    "red_o_points": [],
    "y_categories": ["N", "NOT APPLICABLE", "Y", "nan"],
    "blue_o_points": [],
    "blue_x_points": [
      [0.00322, 1],
      [-0.00016, 3],
      [0.00231, 1],
      [0.00012, 0],
      [-0.00012, 3],
      [0.0027, 1],
      [0.00269, 1]
    ]
  },
  "QS_mulGraftNerve[FI]": {
    "red_x_points": [
      [-0.0005, 2],
      [-0.00084, 0],
      [-0.00067, 0],
      [-0.00081, 0],
      [-0.00099, 0],
      [-0.00094, 0],
      [-0.00082, 0],
      [-0.00052, 2],
      [-0.00082, 0],
      [-0.00053, 0],
      [-0.00083, 0],
      [-0.00057, 2],
      [0.00171, 1],
      [-0.00047, 2],
      [-0.00072, 0],
      [-0.00054, 2],
      [-0.00091, 0],
      [-0.00104, 0],
      [-0.00042, 2],
      [-0.00036, 2],
      [-0.00044, 2],
      [-0.00062, 0],
      [-0.00046, 2],
      [-0.00048, 2],
      [-0.00048, 2],
      [-0.00072, 0],
      [-0.00025, 2],
      [-0.00085, 0],
      [-0.00027, 2],
      [0.00176, 1],
      [-0.00068, 0]
    ],
    "red_o_points": [],
    "y_categories": ["N", "NOT APPLICABLE", "nan"],
    "blue_o_points": [],
    "blue_x_points": [
      [0.00249, 1],
      [-2e-5, 2],
      [0.0025, 1],
      [2e-5, 0],
      [-5e-5, 2],
      [0.00232, 1],
      [0.00233, 1]
    ]
  },
  "QS_mulGraftNerve[other]": {
    "red_x_points": [
      [-0.00049, 2],
      [-0.0013, 0],
      [-0.0016, 0],
      [-0.00152, 0],
      [-0.00161, 0],
      [-0.0015, 0],
      [-0.00145, 0],
      [-0.0006, 2],
      [-0.0015, 0],
      [-0.00157, 0],
      [-0.00128, 0],
      [-0.00043, 2],
      [0.00171, 1],
      [-0.00052, 2],
      [-0.00139, 0],
      [-0.0005, 2],
      [-0.00149, 0],
      [-0.00134, 0],
      [-0.00031, 2],
      [-0.00037, 2],
      [-0.00055, 2],
      [-0.00121, 0],
      [-0.00042, 2],
      [-0.00043, 2],
      [-0.00041, 2],
      [-0.00135, 0],
      [-0.00046, 2],
      [-0.00126, 0],
      [-0.00023, 2],
      [0.00277, 1],
      [-0.00134, 0]
    ],
    "red_o_points": [],
    "y_categories": ["N", "NOT APPLICABLE", "nan"],
    "blue_o_points": [],
    "blue_x_points": [
      [0.00478, 1],
      [9e-5, 2],
      [0.00338, 1],
      [0.00026, 0],
      [0.00034, 2],
      [0.0033, 1],
      [0.0038, 1]
    ]
  },
  "QS_mulTransfSite[AcSsAA]": {
    "red_x_points": [
      [-0.00326, 3],
      [-0.00908, 2],
      [-0.00358, 0],
      [-0.00855, 2],
      [-0.00943, 2],
      [-0.00357, 0],
      [-0.00307, 0],
      [-0.00299, 3],
      [-0.00338, 0],
      [-0.00882, 2],
      [-0.00322, 0],
      [-0.00309, 3],
      [0.0129, 1],
      [-0.00294, 3],
      [-0.01001, 2],
      [-0.00325, 3],
      [-0.0032, 0],
      [-0.00351, 0],
      [-0.00324, 3],
      [-0.00333, 3],
      [-0.00322, 3],
      [-0.00848, 2],
      [-0.00287, 3],
      [-0.00297, 3],
      [-0.00312, 3],
      [-0.00344, 0],
      [-0.0032, 3],
      [-0.00843, 2],
      [-0.00267, 3],
      [0.01632, 1],
      [-0.00315, 0]
    ],
    "red_o_points": [],
    "y_categories": ["N", "NOT APPLICABLE", "Y", "nan"],
    "blue_o_points": [],
    "blue_x_points": [
      [0.02017, 1],
      [-0.00096, 3],
      [0.01629, 1],
      [-0.00088, 0],
      [-0.00108, 3],
      [0.01493, 1],
      [0.01694, 1]
    ]
  },
  "QS_mulGraftNerve[DS]": {
    "red_x_points": [
      [-3e-5, 2],
      [-3e-5, 0],
      [-3e-5, 0],
      [-3e-5, 0],
      [-3e-5, 0],
      [-3e-5, 0],
      [-3e-5, 2],
      [-3e-5, 0],
      [-3e-5, 0],
      [-3e-5, 2],
      [-3e-5, 0],
      [-3e-5, 2],
      [-3e-5, 0],
      [-3e-5, 0],
      [-3e-5, 2],
      [-3e-5, 2],
      [-3e-5, 2],
      [-3e-5, 2],
      [-3e-5, 2],
      [-3e-5, 2],
      [-3e-5, 0],
      [-3e-5, 2],
      [0.00012, 1]
    ],
    "red_o_points": [],
    "y_categories": ["N", "NOT APPLICABLE", "nan"],
    "blue_o_points": [],
    "blue_x_points": [[0.00012, 1], [0.00012, 1], [-3e-5, 0], [-3e-5, 2]]
  },
  "QS_mulGraftNerve[MP]": {
    "red_x_points": [
      [-5e-5, 0],
      [-5e-5, 0],
      [-5e-5, 0],
      [-0.0, 2],
      [-5e-5, 0],
      [-5e-5, 0],
      [-0.0, 2],
      [9e-5, 1],
      [-0.0, 2],
      [-5e-5, 0],
      [-0.0, 2],
      [-5e-5, 0],
      [-5e-5, 0],
      [-0.0, 2],
      [-0.0, 2],
      [-5e-5, 0],
      [-0.0, 2],
      [-0.0, 2],
      [-0.0, 2],
      [-5e-5, 0],
      [-0.0, 2],
      [-0.0, 2],
      [9e-5, 1]
    ],
    "red_o_points": [],
    "y_categories": ["N", "NOT APPLICABLE", "nan"],
    "blue_o_points": [],
    "blue_x_points": [[-0.0, 2], [9e-5, 1], [-0.0, 2], [9e-5, 1], [9e-5, 1]]
  },
  "QS_mulGraftNerve[Ax]": {
    "red_x_points": [
      [-0.00015, 2],
      [-0.00025, 0],
      [-0.00016, 0],
      [-0.00017, 0],
      [-0.00019, 0],
      [-0.00022, 0],
      [-0.00013, 0],
      [-7e-5, 2],
      [-0.00021, 0],
      [-0.00022, 0],
      [-0.00015, 0],
      [-0.00012, 2],
      [0.00032, 1],
      [-0.00022, 2],
      [-0.00013, 0],
      [-0.00016, 2],
      [-0.0001, 0],
      [-0.00021, 0],
      [-0.00011, 2],
      [-0.00014, 2],
      [-0.0001, 2],
      [-9e-5, 0],
      [-9e-5, 2],
      [-0.00011, 2],
      [-0.00015, 2],
      [-0.00022, 0],
      [-0.00015, 2],
      [-0.00016, 0],
      [-7e-5, 2],
      [0.00027, 1],
      [-0.00015, 0]
    ],
    "red_o_points": [],
    "y_categories": ["N", "NOT APPLICABLE", "nan"],
    "blue_o_points": [],
    "blue_x_points": [
      [0.00082, 1],
      [-7e-5, 2],
      [0.0005, 1],
      [4e-5, 0],
      [-1e-5, 2],
      [0.00038, 1],
      [0.00057, 1]
    ]
  },
  "QA_lstPexMuscstrength[WristFlex]": {
    "red_x_points": [
      [-0.00355, 1],
      [-0.00043, 2],
      [-0.00165, 1],
      [-0.00116, 1],
      [0.00028, 0],
      [0.00092, 0],
      [-0.00172, 1],
      [-0.0021, 0],
      [0.00078, 0],
      [0.00026, 0],
      [0.00031, 0],
      [-0.00207, 0],
      [-0.00101, 2],
      [0.00241, 2],
      [-2e-5, 2],
      [-0.00177, 0],
      [-5e-5, 2],
      [0.00042, 0],
      [-0.00176, 0],
      [-0.00299, 1],
      [-0.00208, 0],
      [-0.00114, 1],
      [0.00195, 2],
      [-0.01027, 1],
      [-0.00234, 0],
      [0.00048, 0],
      [-0.0027, 1],
      [0.00027, 0],
      [0.00258, 2],
      [-0.00015, 2],
      [-0.00112, 1]
    ],
    "red_o_points": [],
    "y_categories": ["GREATER THAN OR EQUALS TO 3", "LESS THAN 3", "nan"],
    "blue_o_points": [],
    "blue_x_points": [
      [0.00029, 0],
      [0.00397, 2],
      [0.0015, 0],
      [0.00295, 0],
      [0.00526, 2],
      [0.00146, 0],
      [0.00173, 0]
    ]
  },
  "QS_mulNeuromadSite[C5]": {
    "red_x_points": [
      [-0.00109, 2],
      [-0.003, 0],
      [-0.00335, 0],
      [-0.00348, 0],
      [-0.00356, 0],
      [-0.00343, 0],
      [-0.00388, 0],
      [-0.0014, 2],
      [-0.00364, 0],
      [-0.00368, 0],
      [-0.0032, 0],
      [-0.00113, 2],
      [0.0059, 1],
      [-0.00106, 2],
      [-0.00382, 0],
      [-0.0012, 2],
      [-0.00313, 0],
      [-0.00382, 0],
      [-0.00105, 2],
      [-0.00115, 2],
      [-0.00099, 2],
      [-0.00277, 0],
      [-0.00112, 2],
      [-0.0014, 2],
      [-0.00128, 2],
      [-0.00347, 0],
      [-0.00119, 2],
      [-0.00366, 0],
      [-0.00098, 2],
      [0.00741, 1],
      [-0.00336, 0]
    ],
    "red_o_points": [],
    "y_categories": ["N", "NOT APPLICABLE", "nan"],
    "blue_o_points": [],
    "blue_x_points": [
      [0.01158, 1],
      [-0.00011, 2],
      [0.00813, 1],
      [4e-5, 0],
      [-0.0, 2],
      [0.00812, 1],
      [0.00877, 1]
    ]
  },
  "QS_mulNeuromadSite[C7]": {
    "red_x_points": [
      [-0.00066, 2],
      [-0.00225, 0],
      [-0.00236, 0],
      [-0.00246, 0],
      [-0.00191, 0],
      [-0.00261, 0],
      [-0.00228, 0],
      [-0.00064, 2],
      [-0.00256, 0],
      [-0.00234, 0],
      [-0.00219, 0],
      [-0.00075, 2],
      [0.00288, 1],
      [-0.00075, 2],
      [-0.00232, 0],
      [-0.00069, 2],
      [-0.00217, 0],
      [-0.00238, 0],
      [-0.00055, 2],
      [-0.00065, 2],
      [-0.00048, 2],
      [-0.00226, 0],
      [-0.0008, 2],
      [-0.00059, 2],
      [-0.00082, 2],
      [-0.00221, 0],
      [-0.00063, 2],
      [-0.00218, 0],
      [-0.00048, 2],
      [0.0049, 1],
      [-0.00235, 0]
    ],
    "red_o_points": [],
    "y_categories": ["N", "NOT APPLICABLE", "nan"],
    "blue_o_points": [],
    "blue_x_points": [
      [0.00883, 1],
      [-0.0, 2],
      [0.00511, 1],
      [0.00017, 0],
      [8e-5, 2],
      [0.00463, 1],
      [0.00539, 1]
    ]
  },
  "QA_lstPexMuscstrength[WristExte]": {
    "red_x_points": [
      [-0.00289, 1],
      [-0.00045, 2],
      [-0.00179, 1],
      [-0.00181, 1],
      [0.00055, 0],
      [-0.00202, 1],
      [-0.0021, 1],
      [-0.00135, 0],
      [0.0014, 0],
      [0.00071, 0],
      [-0.00181, 1],
      [-0.00127, 0],
      [-0.00119, 2],
      [0.00142, 2],
      [-0.0003, 2],
      [-0.00065, 0],
      [-0.00013, 2],
      [0.00084, 0],
      [-0.0009, 0],
      [-0.00307, 1],
      [-0.00166, 0],
      [-0.00189, 1],
      [0.0012, 2],
      [-0.00104, 0],
      [-0.00303, 1],
      [0.00053, 0],
      [-0.00269, 1],
      [0.00057, 0],
      [0.00212, 2],
      [-0.00107, 2],
      [-0.00137, 1]
    ],
    "red_o_points": [],
    "y_categories": ["GREATER THAN OR EQUALS TO 3", "LESS THAN 3", "nan"],
    "blue_o_points": [],
    "blue_x_points": [
      [0.00129, 0],
      [0.00327, 2],
      [0.00061, 0],
      [0.00312, 0],
      [0.00419, 2],
      [0.00087, 1],
      [0.00067, 0]
    ]
  },
  "QA_lstPexMuscstrength[ElbowExte]": {
    "red_x_points": [
      [-0.00325, 1],
      [-1e-5, 2],
      [-0.0001, 1],
      [2e-5, 1],
      [-0.00108, 0],
      [0.00012, 1],
      [6e-5, 1],
      [-0.00309, 1],
      [-0.0012, 0],
      [-0.00081, 0],
      [9e-5, 1],
      [-0.00263, 1],
      [6e-5, 2],
      [0.00372, 2],
      [-0.00014, 2],
      [-0.00266, 1],
      [-4e-5, 2],
      [0.00024, 1],
      [-0.00245, 0],
      [-0.00226, 1],
      [-0.0032, 0],
      [6e-5, 1],
      [0.00319, 2],
      [-0.00244, 0],
      [-0.00356, 0],
      [0.00022, 1],
      [-0.00228, 1],
      [-0.00034, 2],
      [-0.0033, 1],
      [6e-5, 2]
    ],
    "red_o_points": [],
    "y_categories": ["GREATER THAN OR EQUALS TO 3", "LESS THAN 3", "nan"],
    "blue_o_points": [],
    "blue_x_points": [
      [0.00036, 2],
      [0.00767, 2],
      [3e-5, 0],
      [0.00159, 1],
      [0.00643, 2],
      [-3e-5, 0],
      [0.00013, 0]
    ]
  },
  "QS_mulGraftNerve[SS]": {
    "red_x_points": [
      [-1e-5, 2],
      [-6e-5, 0],
      [-6e-5, 0],
      [-6e-5, 0],
      [-5e-5, 0],
      [-6e-5, 0],
      [-1e-5, 0],
      [-2e-5, 2],
      [-1e-5, 0],
      [-5e-5, 0],
      [-5e-5, 0],
      [-1e-5, 2],
      [-0.00014, 1],
      [-5e-5, 2],
      [-5e-5, 0],
      [-5e-5, 2],
      [2e-5, 0],
      [-6e-5, 0],
      [-1e-5, 2],
      [-1e-5, 2],
      [-1e-5, 2],
      [-5e-5, 0],
      [-4e-5, 2],
      [-1e-5, 2],
      [-1e-5, 0],
      [-2e-5, 2],
      [-6e-5, 0],
      [-1e-5, 2],
      [2e-5, 1],
      [-1e-5, 0]
    ],
    "red_o_points": [],
    "y_categories": ["N", "NOT APPLICABLE", "nan"],
    "blue_o_points": [],
    "blue_x_points": [
      [0.00029, 1],
      [1e-5, 2],
      [0.0001, 1],
      [0.00011, 0],
      [3e-5, 2],
      [0.0001, 1],
      [0.0001, 1]
    ]
  },
  "QS_mulGraftNerve[MCF]": {
    "red_x_points": [
      [-5e-5, 2],
      [-0.00017, 0],
      [-0.00013, 0],
      [-0.00013, 0],
      [-9e-5, 0],
      [-8e-5, 0],
      [-8e-5, 0],
      [-4e-5, 2],
      [-0.00017, 0],
      [-0.00013, 0],
      [-0.00017, 0],
      [-3e-5, 2],
      [0.00022, 1],
      [-5e-5, 2],
      [-0.00013, 0],
      [-2e-5, 2],
      [-0.00013, 0],
      [-0.00013, 0],
      [-1e-5, 2],
      [-3e-5, 2],
      [-3e-5, 2],
      [-0.00014, 0],
      [-3e-5, 2],
      [-0.00011, 2],
      [-4e-5, 2],
      [-9e-5, 0],
      [-2e-5, 2],
      [-0.00017, 0],
      [-1e-5, 2],
      [0.0004, 1],
      [-0.00017, 0]
    ],
    "red_o_points": [],
    "y_categories": ["N", "NOT APPLICABLE", "nan"],
    "blue_o_points": [],
    "blue_x_points": [
      [0.00029, 1],
      [-4e-5, 2],
      [0.00019, 1],
      [0.0001, 0],
      [-0.0, 2],
      [0.0001, 1],
      [0.0003, 1]
    ]
  },
  "QS_mulNeuromadSite[C6]": {
    "red_x_points": [
      [-0.00061, 2],
      [-0.00216, 0],
      [-0.00212, 0],
      [-0.00215, 0],
      [-0.00177, 0],
      [-0.00167, 0],
      [-0.002, 0],
      [-0.0007, 2],
      [-0.00194, 0],
      [-0.00208, 0],
      [-0.00174, 0],
      [-0.00099, 2],
      [0.00255, 1],
      [-0.00045, 2],
      [-0.00196, 0],
      [-0.00098, 2],
      [-0.00195, 0],
      [-0.00175, 0],
      [-0.00089, 2],
      [-0.0007, 2],
      [-0.0007, 2],
      [-0.00192, 0],
      [-0.00062, 2],
      [-0.00078, 2],
      [-0.0008, 2],
      [-0.0018, 0],
      [-0.00063, 2],
      [-0.00185, 0],
      [-0.00043, 2],
      [0.00305, 1],
      [-0.00192, 0]
    ],
    "red_o_points": [],
    "y_categories": ["N", "NOT APPLICABLE", "nan"],
    "blue_o_points": [],
    "blue_x_points": [
      [0.0075, 1],
      [3e-5, 2],
      [0.00413, 1],
      [0.00043, 0],
      [0.0001, 2],
      [0.00455, 1],
      [0.00537, 1]
    ]
  },
  "QS_mulLysisSite[Nerve]": {
    "red_x_points": [
      [-0.00044, 3],
      [-0.00032, 0],
      [-0.00093, 2],
      [-0.00045, 0],
      [-0.00021, 0],
      [-0.00041, 0],
      [-0.00034, 0],
      [-0.0004, 3],
      [-0.00042, 0],
      [-0.00024, 0],
      [-0.0003, 0],
      [-0.00034, 3],
      [0.00143, 1],
      [-0.0004, 3],
      [-0.00017, 0],
      [-0.00033, 3],
      [-0.00037, 0],
      [-0.0004, 0],
      [-0.00037, 3],
      [-0.00036, 3],
      [-0.00031, 3],
      [-0.00041, 0],
      [-0.00029, 3],
      [-0.00035, 3],
      [-0.00032, 3],
      [-0.00034, 0],
      [-0.00031, 3],
      [-0.00035, 0],
      [-0.00028, 3],
      [0.00129, 1],
      [-0.00032, 0]
    ],
    "red_o_points": [],
    "y_categories": ["N", "NOT APPLICABLE", "Y", "nan"],
    "blue_o_points": [],
    "blue_x_points": [
      [0.001, 1],
      [-0.00015, 3],
      [0.00156, 1],
      [-0.00047, 0],
      [-0.00016, 3],
      [0.00135, 1],
      [0.00145, 1]
    ]
  },
  "QS_mulGraftNerve[TD]": {
    "red_x_points": [
      [-8e-5, 2],
      [-0.0001, 0],
      [-9e-5, 0],
      [-0.00011, 0],
      [-0.00025, 0],
      [-9e-5, 0],
      [-0.00014, 0],
      [-9e-5, 2],
      [-0.00014, 0],
      [-0.00013, 0],
      [-5e-5, 0],
      [-5e-5, 2],
      [0.00018, 1],
      [-8e-5, 2],
      [-0.00011, 0],
      [-9e-5, 2],
      [-9e-5, 0],
      [-0.00014, 0],
      [-9e-5, 2],
      [-6e-5, 2],
      [-7e-5, 2],
      [-6e-5, 0],
      [-8e-5, 2],
      [-0.00015, 2],
      [-6e-5, 2],
      [-0.00014, 0],
      [-8e-5, 2],
      [-6e-5, 0],
      [-1e-5, 2],
      [0.00031, 1],
      [-9e-5, 0]
    ],
    "red_o_points": [],
    "y_categories": ["N", "NOT APPLICABLE", "nan"],
    "blue_o_points": [],
    "blue_x_points": [
      [0.00065, 1],
      [-4e-5, 2],
      [0.00022, 1],
      [-4e-5, 0],
      [-4e-5, 2],
      [0.00044, 1],
      [0.00039, 1]
    ]
  },
  "QS_mulLysisRoot[C7]": {
    "red_x_points": [
      [-0.00029, 3],
      [-0.00071, 0],
      [-0.00164, 2],
      [-0.00075, 0],
      [-0.00066, 0],
      [-0.00077, 0],
      [-0.00062, 0],
      [-0.00031, 3],
      [-0.0007, 0],
      [-0.00072, 0],
      [-0.00072, 0],
      [-0.00036, 3],
      [0.00229, 1],
      [-0.00028, 3],
      [-0.00062, 0],
      [-0.00027, 3],
      [-0.00066, 0],
      [-0.00067, 0],
      [-0.0003, 3],
      [-0.00034, 3],
      [-0.00022, 3],
      [-0.00073, 0],
      [-0.0003, 3],
      [-0.00025, 3],
      [-0.00029, 3],
      [-0.00081, 0],
      [-0.00038, 3],
      [-0.00071, 0],
      [-0.00028, 3],
      [0.00164, 1],
      [-0.00064, 0]
    ],
    "red_o_points": [],
    "y_categories": ["N", "NOT APPLICABLE", "Y", "nan"],
    "blue_o_points": [],
    "blue_x_points": [
      [0.00235, 1],
      [-0.00029, 3],
      [0.00181, 1],
      [-0.00079, 0],
      [-9e-5, 3],
      [0.00225, 1],
      [0.00207, 1]
    ]
  },
  "QS_mulTransfSite[IMc]": {
    "red_x_points": [
      [-0.00202, 3],
      [-0.00603, 2],
      [-0.00384, 0],
      [-0.00362, 0],
      [-0.00394, 0],
      [-0.00338, 0],
      [-0.00364, 0],
      [-0.00244, 3],
      [-0.00389, 0],
      [-0.00351, 0],
      [-0.00332, 0],
      [-0.00221, 3],
      [0.00892, 1],
      [-0.0021, 3],
      [-0.00328, 0],
      [-0.00242, 3],
      [-0.00617, 2],
      [-0.00348, 0],
      [-0.00195, 3],
      [-0.00209, 3],
      [-0.00221, 3],
      [-0.00345, 0],
      [-0.00238, 3],
      [-0.00252, 3],
      [-0.00217, 3],
      [-0.00353, 0],
      [-0.00221, 3],
      [-0.00616, 2],
      [-0.00218, 3],
      [0.01059, 1],
      [-0.00593, 2]
    ],
    "red_o_points": [],
    "y_categories": ["N", "NOT APPLICABLE", "Y", "nan"],
    "blue_o_points": [],
    "blue_x_points": [
      [0.0155, 1],
      [-0.00075, 3],
      [0.01165, 1],
      [-0.0015, 0],
      [-0.00048, 3],
      [0.01231, 1],
      [0.01351, 1]
    ]
  },
  "QA_lstPexTouch[T1]": {
    "red_x_points": [
      [-0.00138, 1],
      [-0.00032, 2],
      [0.00066, 1],
      [-0.00034, 2],
      [-0.00198, 0],
      [0.00064, 1],
      [0.00083, 1],
      [-0.00196, 1],
      [-0.00222, 0],
      [-0.00084, 0],
      [-0.00155, 0],
      [-0.00228, 0],
      [-0.01256, 2],
      [0.00207, 2],
      [-0.00059, 2],
      [-0.00137, 1],
      [0.0, 2],
      [0.00081, 1],
      [-0.00184, 0],
      [-0.00117, 1],
      [-0.00227, 0],
      [-0.00036, 2],
      [0.00258, 2],
      [-0.00142, 1],
      [-0.00289, 0],
      [0.00069, 1],
      [-0.00284, 0],
      [-0.00034, 2],
      [-0.00257, 0],
      [0.00112, 1],
      [0.00025, 1]
    ],
    "red_o_points": [],
    "y_categories": ["NORM", "NPV", "nan"],
    "blue_o_points": [],
    "blue_x_points": [
      [0.00132, 1],
      [0.00423, 2],
      [0.00122, 1],
      [0.00249, 1],
      [0.00396, 2],
      [0.00113, 1],
      [0.00587, 0]
    ]
  },
  "QS_mulTransfSite[AcMc]": {
    "red_x_points": [
      [-0.00077, 3],
      [-0.00101, 0],
      [-0.00079, 0],
      [-0.00094, 0],
      [-0.00089, 0],
      [-0.00102, 0],
      [-0.0009, 0],
      [-0.00087, 3],
      [-0.00091, 0],
      [-0.00112, 0],
      [-0.00299, 2],
      [-0.00075, 3],
      [0.00293, 1],
      [-0.00086, 3],
      [-0.00074, 0],
      [-0.00081, 3],
      [-0.00111, 0],
      [-0.00093, 0],
      [-0.00078, 3],
      [-0.00087, 3],
      [-0.00096, 3],
      [-0.00103, 0],
      [-0.0009, 3],
      [-0.00094, 3],
      [-0.00092, 3],
      [-0.00099, 0],
      [-0.00092, 3],
      [-0.00082, 0],
      [-0.00098, 3],
      [0.00362, 1],
      [-0.00099, 0]
    ],
    "red_o_points": [],
    "y_categories": ["N", "NOT APPLICABLE", "Y", "nan"],
    "blue_o_points": [],
    "blue_x_points": [
      [0.00373, 1],
      [-0.00033, 3],
      [0.00427, 1],
      [-0.00081, 0],
      [-0.00032, 3],
      [0.00287, 1],
      [0.00417, 1]
    ]
  },
  "QS_mulTransfSite[Other]": {
    "red_x_points": [
      [-0.00065, 3],
      [-0.00084, 0],
      [-0.00079, 0],
      [-0.00078, 0],
      [-0.00063, 0],
      [-0.00067, 0],
      [-0.00071, 0],
      [-0.00089, 3],
      [-0.00072, 0],
      [-0.00074, 0],
      [-0.00079, 0],
      [-0.00084, 3],
      [0.00276, 1],
      [-0.00049, 3],
      [-0.00077, 0],
      [-0.00068, 3],
      [-0.00073, 0],
      [-0.0036, 2],
      [-0.00076, 3],
      [-0.0007, 3],
      [-0.00067, 3],
      [-0.00081, 0],
      [-0.0006, 3],
      [-0.00077, 3],
      [-0.00058, 3],
      [-0.00065, 0],
      [-0.00047, 3],
      [-0.00058, 0],
      [-0.00052, 3],
      [0.00233, 1],
      [-0.00068, 0]
    ],
    "red_o_points": [],
    "y_categories": ["N", "NOT APPLICABLE", "Y", "nan"],
    "blue_o_points": [],
    "blue_x_points": [
      [0.00314, 1],
      [-0.00032, 3],
      [0.0035, 1],
      [-0.00029, 0],
      [-0.00015, 3],
      [0.00289, 1],
      [0.00257, 1]
    ]
  },
  "QA_yonInjBpsurg": {
    "red_x_points": [
      [-0.00323, 1],
      [-0.00304, 1],
      [-0.00395, 1],
      [-0.0033, 1],
      [-0.00366, 1],
      [-0.00366, 1],
      [-0.00351, 1],
      [-0.00291, 1],
      [-0.0034, 1],
      [-0.00324, 1],
      [-0.00313, 1],
      [-0.00345, 1],
      [0.00646, 0],
      [-0.00305, 1],
      [-0.00342, 1],
      [-0.00348, 1],
      [-0.00304, 1],
      [-0.00317, 1],
      [-0.00358, 1],
      [-0.0034, 1],
      [-0.00265, 1],
      [-0.0028, 1],
      [-0.00307, 1],
      [-0.00425, 1],
      [-0.00389, 1],
      [-0.0032, 1],
      [-0.00331, 1],
      [-0.00328, 1],
      [-0.00332, 1],
      [0.00921, 0],
      [-0.0032, 1]
    ],
    "red_o_points": [],
    "y_categories": ["N", "Y", "nan"],
    "blue_o_points": [],
    "blue_x_points": [
      [0.01902, 0],
      [-0.00081, 1],
      [0.01066, 0],
      [-0.00247, 1],
      [-0.00072, 1],
      [0.01157, 0],
      [0.01402, 0]
    ]
  },
  "QA_equInjTbpiAge": {
    "red_x_points": [
      [-0.00116, 1],
      [-0.00021, 1],
      [0.00011, 1],
      [-8e-5, 0],
      [-0.00074, 0],
      [6e-5, 1],
      [-4e-5, 1],
      [0.00061, 0],
      [-0.00067, 0],
      [-0.00014, 0],
      [0.00011, 1],
      [0.00085, 0],
      [-0.01373, 1],
      [-0.00073, 1],
      [-0.00015, 1],
      [-0.0011, 1],
      [-0.00048, 0],
      [-0.00164, 0],
      [-0.00128, 1],
      [0.00062, 0],
      [-0.00092, 1],
      [-0.00015, 1],
      [-0.00097, 1],
      [-0.00285, 1],
      [0.00116, 0],
      [9e-5, 1],
      [-0.00165, 1],
      [-0.00013, 1],
      [-0.00091, 1],
      [-0.01234, 1],
      [-7e-5, 0]
    ],
    "red_o_points": [],
    "y_categories": ["GREATER THAN OR EQUALS TO 30", "LESS THAN 30", "nan"],
    "blue_o_points": [],
    "blue_x_points": [
      [-0.00422, 1],
      [-0.0013, 1],
      [0.00703, 0],
      [0.00044, 1],
      [0.00531, 0],
      [0.00822, 0],
      [0.00729, 0]
    ]
  },
  "QS_mulLysisNerve[Ssr]": {
    "red_x_points": [
      [-0.0002, 3],
      [-0.0003, 0],
      [-0.00094, 2],
      [-0.00035, 0],
      [-0.00028, 0],
      [-0.00027, 0],
      [-0.00029, 0],
      [-0.00022, 3],
      [-0.00033, 0],
      [-0.00031, 0],
      [-0.00019, 0],
      [-0.00032, 3],
      [0.00121, 1],
      [-0.00026, 3],
      [-0.00037, 0],
      [-0.00029, 3],
      [-0.00035, 0],
      [-0.00035, 0],
      [-0.00025, 3],
      [-0.00026, 3],
      [-0.00025, 3],
      [-0.00037, 0],
      [-0.00024, 3],
      [-0.00024, 3],
      [-0.00024, 3],
      [-0.00033, 0],
      [-0.00022, 3],
      [-0.00043, 0],
      [-0.00028, 3],
      [0.00142, 1],
      [-0.00037, 0]
    ],
    "red_o_points": [],
    "y_categories": ["N", "NOT APPLICABLE", "Y", "nan"],
    "blue_o_points": [],
    "blue_x_points": [
      [0.00168, 1],
      [-0.0002, 3],
      [0.001, 1],
      [-0.0004, 0],
      [-0.00018, 3],
      [0.00122, 1],
      [0.00075, 1]
    ]
  },
  "QS_mulBpsurgeryType[Graft]": {
    "red_x_points": [
      [-0.00027, 3],
      [-0.00044, 0],
      [-0.00025, 0],
      [-0.00035, 0],
      [-0.00041, 0],
      [-0.00029, 0],
      [-0.00043, 0],
      [-0.00035, 3],
      [-0.00046, 0],
      [-0.00031, 0],
      [-0.0004, 0],
      [-0.00025, 3],
      [0.00122, 1],
      [-0.0003, 3],
      [-0.00231, 2],
      [-0.00036, 3],
      [-0.00027, 0],
      [-0.00032, 0],
      [-0.00031, 3],
      [-0.00023, 3],
      [-0.00044, 3],
      [-0.00038, 0],
      [-0.00045, 3],
      [-0.00025, 3],
      [-0.0003, 3],
      [-0.00035, 0],
      [-0.00032, 3],
      [-0.00037, 0],
      [-0.00029, 3],
      [0.00159, 1],
      [-0.00029, 0]
    ],
    "red_o_points": [],
    "y_categories": ["N", "NOT APPLICABLE", "Y", "nan"],
    "blue_o_points": [],
    "blue_x_points": [
      [0.00171, 1],
      [-0.0, 3],
      [0.00078, 1],
      [0.00031, 0],
      [1e-5, 3],
      [0.00162, 1],
      [0.0013, 1]
    ]
  },
  "QS_mulLysisRoot[C5]": {
    "red_x_points": [
      [-0.00069, 3],
      [-0.00155, 0],
      [-0.00342, 2],
      [-0.00144, 0],
      [-0.00175, 0],
      [-0.00174, 0],
      [-0.00157, 0],
      [-0.00072, 3],
      [-0.00167, 0],
      [-0.00158, 0],
      [-0.00154, 0],
      [-0.00069, 3],
      [0.00416, 1],
      [-0.00073, 3],
      [-0.00163, 0],
      [-0.00085, 3],
      [-0.00166, 0],
      [-0.00187, 0],
      [-0.00072, 3],
      [-0.00071, 3],
      [-0.00068, 3],
      [-0.00163, 0],
      [-0.00069, 3],
      [-0.00071, 3],
      [-0.00072, 3],
      [-0.00162, 0],
      [-0.00062, 3],
      [-0.00151, 0],
      [-0.00067, 3],
      [0.00459, 1],
      [-0.0028, 2]
    ],
    "red_o_points": [],
    "y_categories": ["N", "NOT APPLICABLE", "Y", "nan"],
    "blue_o_points": [],
    "blue_x_points": [
      [0.00605, 1],
      [-0.00041, 3],
      [0.00531, 1],
      [-0.00101, 0],
      [-0.00029, 3],
      [0.00452, 1],
      [0.00538, 1]
    ]
  },
  "QS_mulLysisSite[Root]": {
    "red_x_points": [
      [-0.00065, 3],
      [-0.00076, 0],
      [-0.00196, 2],
      [-0.00078, 0],
      [-0.00077, 0],
      [-0.00079, 0],
      [-0.00071, 0],
      [-0.00058, 3],
      [-0.00081, 0],
      [-0.00067, 0],
      [-0.0007, 0],
      [-0.00066, 3],
      [0.00274, 1],
      [-0.00063, 3],
      [-0.00079, 0],
      [-0.0007, 3],
      [-0.00072, 0],
      [-0.00083, 0],
      [-0.00062, 3],
      [-0.00065, 3],
      [-0.0005, 3],
      [-0.00074, 0],
      [-0.0007, 3],
      [-0.00069, 3],
      [-0.00057, 3],
      [-0.00067, 0],
      [-0.0006, 3],
      [-0.00081, 0],
      [-0.00061, 3],
      [0.00319, 1],
      [-0.00176, 2]
    ],
    "red_o_points": [],
    "y_categories": ["N", "NOT APPLICABLE", "Y", "nan"],
    "blue_o_points": [],
    "blue_x_points": [
      [0.00336, 1],
      [-0.00034, 3],
      [0.00263, 1],
      [-0.00081, 0],
      [-0.00018, 3],
      [0.00318, 1],
      [0.00318, 1]
    ]
  },
  "QS_mulBpsurgeryType[Lysis]": {
    "red_x_points": [
      [-0.00257, 3],
      [-0.00409, 0],
      [-0.00777, 2],
      [-0.00441, 0],
      [-0.00444, 0],
      [-0.00803, 2],
      [-0.00476, 0],
      [-0.00247, 3],
      [-0.00451, 0],
      [-0.00405, 0],
      [-0.00427, 0],
      [-0.00284, 3],
      [0.01324, 1],
      [-0.00239, 3],
      [-0.00405, 0],
      [-0.00272, 3],
      [-0.00837, 2],
      [-0.00485, 0],
      [-0.00271, 3],
      [-0.00234, 3],
      [-0.0026, 3],
      [-0.00436, 0],
      [-0.0023, 3],
      [-0.00279, 3],
      [-0.0025, 3],
      [-0.00425, 0],
      [-0.00235, 3],
      [-0.00447, 0],
      [-0.00212, 3],
      [0.01283, 1],
      [-0.00681, 2]
    ],
    "red_o_points": [],
    "y_categories": ["N", "NOT APPLICABLE", "Y", "nan"],
    "blue_o_points": [],
    "blue_x_points": [
      [0.0173, 1],
      [-0.00083, 3],
      [0.01487, 1],
      [-0.0015, 0],
      [-0.00086, 3],
      [0.0144, 1],
      [0.01517, 1]
    ]
  },
  "QS_mulGraftNerve[LT]": {
    "red_x_points": [
      [-3e-5, 2],
      [-5e-5, 0],
      [-5e-5, 0],
      [-0.00017, 0],
      [-5e-5, 0],
      [-5e-5, 0],
      [-3e-5, 2],
      [-5e-5, 0],
      [-3e-5, 2],
      [0.0001, 1],
      [-3e-5, 2],
      [-5e-5, 0],
      [-0.00012, 0],
      [-3e-5, 2],
      [-3e-5, 2],
      [-5e-5, 0],
      [-3e-5, 2],
      [-3e-5, 2],
      [-3e-5, 2],
      [-3e-5, 2],
      [-5e-5, 0],
      [-3e-5, 2],
      [0.0001, 1],
      [-5e-5, 0]
    ],
    "red_o_points": [],
    "y_categories": ["N", "NOT APPLICABLE", "nan"],
    "blue_o_points": [],
    "blue_x_points": [[0.0001, 1], [0.0001, 1], [-3e-5, 2], [0.00018, 1]]
  },
  "QA_lstPexMuscstrength[ShoulderAbduc]": {
    "red_x_points": [
      [-0.00631, 1],
      [-0.00568, 1],
      [-0.00601, 1],
      [-0.00583, 1],
      [-0.00667, 1],
      [-0.00605, 1],
      [-0.00659, 1],
      [-0.00595, 1],
      [-0.006, 1],
      [-0.00562, 1],
      [-0.00633, 1],
      [-0.00615, 1],
      [0.00344, 2],
      [0.00537, 2],
      [0.00541, 2],
      [0.0055, 2],
      [0.00509, 2],
      [-0.00588, 1],
      [-0.00595, 1],
      [-0.00618, 1],
      [-0.00604, 1],
      [-0.00577, 1],
      [0.00493, 2],
      [-0.00767, 1],
      [-0.00599, 1],
      [-0.00558, 1],
      [-0.00614, 1],
      [-0.00565, 1],
      [-0.00593, 1],
      [0.00297, 2],
      [-0.00596, 1]
    ],
    "red_o_points": [],
    "y_categories": ["GREATER THAN OR EQUALS TO 3", "LESS THAN 3", "nan"],
    "blue_o_points": [],
    "blue_x_points": [
      [0.00435, 2],
      [0.0057, 2],
      [0.02486, 0],
      [0.00635, 2],
      [0.00592, 2],
      [0.02572, 0],
      [-0.00195, 1]
    ]
  },
  "QS_mulNeuromadSite[C4]": {
    "red_x_points": [
      [-0.00043, 2],
      [-0.00183, 0],
      [-0.00158, 0],
      [-0.00194, 0],
      [-0.00186, 0],
      [-0.00177, 0],
      [-0.00166, 0],
      [-0.00055, 2],
      [-0.00207, 0],
      [-0.00174, 0],
      [-0.00191, 0],
      [-0.00066, 2],
      [0.00278, 1],
      [-0.00071, 2],
      [-0.00168, 0],
      [-0.00067, 2],
      [-0.00147, 0],
      [-0.00166, 0],
      [-0.00061, 2],
      [-0.00044, 2],
      [-0.00036, 2],
      [-0.00153, 0],
      [-0.00067, 2],
      [-0.00062, 2],
      [-0.00081, 2],
      [-0.00148, 0],
      [-0.00066, 2],
      [-0.00181, 0],
      [-0.00045, 2],
      [0.00304, 1],
      [-0.00166, 0]
    ],
    "red_o_points": [],
    "y_categories": ["N", "NOT APPLICABLE", "nan"],
    "blue_o_points": [],
    "blue_x_points": [
      [0.00704, 1],
      [-7e-5, 2],
      [0.00429, 1],
      [0.00012, 0],
      [-0.00011, 2],
      [0.00365, 1],
      [0.0047, 1]
    ]
  },
  "QS_lstBpsurgSide": {
    "red_x_points": [
      [-0.00424, 3],
      [-0.00549, 0],
      [-0.00598, 0],
      [-0.00558, 0],
      [-0.01189, 2],
      [-0.00571, 0],
      [-0.00532, 0],
      [-0.00374, 3],
      [-0.00535, 0],
      [-0.01147, 2],
      [-0.01208, 2],
      [-0.00417, 3],
      [0.01974, 1],
      [-0.00439, 3],
      [-0.01264, 2],
      [-0.00466, 3],
      [-0.01269, 2],
      [-0.013, 2],
      [-0.00394, 3],
      [-0.00392, 3],
      [-0.00384, 3],
      [-0.00556, 0],
      [-0.00434, 3],
      [-0.00455, 3],
      [-0.00443, 3],
      [-0.01212, 2],
      [-0.00438, 3],
      [-0.01212, 2],
      [-0.00391, 3],
      [0.02197, 1],
      [-0.0058, 0]
    ],
    "red_o_points": [],
    "y_categories": ["L", "NOT APPLICABLE", "R", "nan"],
    "blue_o_points": [],
    "blue_x_points": [
      [0.03184, 1],
      [-0.00157, 3],
      [0.02368, 1],
      [0.00194, 0],
      [-0.00189, 3],
      [0.0213, 1],
      [0.02534, 1]
    ]
  },
  "QS_mulGraftNerve[IS]": {
    "red_x_points": [
      [-0.00011, 2],
      [-0.00027, 0],
      [-0.00036, 0],
      [-0.0002, 0],
      [-0.00017, 0],
      [-0.00016, 0],
      [-0.00015, 0],
      [-1e-5, 2],
      [-0.00021, 0],
      [-0.00014, 0],
      [-0.00022, 0],
      [-0.00011, 2],
      [0.00037, 1],
      [-0.0001, 2],
      [-0.0003, 0],
      [-6e-5, 2],
      [-0.00038, 0],
      [-0.00022, 0],
      [-0.0001, 2],
      [-0.00012, 2],
      [-1e-5, 2],
      [-0.00019, 0],
      [-0.00011, 2],
      [-8e-5, 2],
      [-6e-5, 2],
      [-0.00015, 0],
      [-4e-5, 2],
      [-0.00029, 0],
      [-9e-5, 2],
      [0.00028, 1],
      [-0.00021, 0]
    ],
    "red_o_points": [],
    "y_categories": ["N", "NOT APPLICABLE", "nan"],
    "blue_o_points": [],
    "blue_x_points": [
      [0.00093, 1],
      [1e-5, 2],
      [0.00042, 1],
      [5e-5, 0],
      [-0.0, 2],
      [0.00044, 1],
      [0.00054, 1]
    ]
  },
  "QS_mulGraftNerve[MC]": {
    "red_x_points": [
      [-1e-5, 2],
      [-0.00016, 0],
      [-0.0001, 0],
      [-0.00011, 0],
      [-0.00018, 0],
      [-0.00022, 0],
      [-0.00018, 0],
      [-2e-5, 2],
      [-0.00019, 0],
      [-0.00017, 0],
      [-0.00017, 0],
      [-2e-5, 2],
      [0.00018, 1],
      [-1e-5, 2],
      [-0.00015, 0],
      [-0.0, 2],
      [-0.00013, 0],
      [-0.00022, 0],
      [-6e-5, 2],
      [-5e-5, 2],
      [1e-5, 2],
      [-0.00013, 0],
      [-1e-5, 2],
      [-0.00014, 2],
      [-2e-5, 2],
      [-0.00016, 0],
      [-6e-5, 2],
      [-0.00017, 0],
      [-2e-5, 2],
      [0.00026, 1],
      [-0.00012, 0]
    ],
    "red_o_points": [],
    "y_categories": ["N", "NOT APPLICABLE", "nan"],
    "blue_o_points": [],
    "blue_x_points": [
      [0.00088, 1],
      [1e-5, 2],
      [0.00026, 1],
      [3e-5, 0],
      [1e-5, 2],
      [0.00026, 1],
      [0.00052, 1]
    ]
  },
  "QA_yonPreOrtsurg": {
    "red_x_points": [
      [-0.00478, 0],
      [-0.00026, 2],
      [8e-5, 0],
      [-0.00016, 0],
      [-6e-5, 0],
      [-2e-5, 0],
      [-0.0001, 0],
      [-0.00078, 2],
      [5e-5, 0],
      [-3e-5, 0],
      [-0.00031, 2],
      [0.00706, 1],
      [-0.00195, 0],
      [-0.00072, 2],
      [-0.00063, 0],
      [-0.00539, 0],
      [0.00021, 1],
      [1e-5, 0],
      [-0.00488, 0],
      [-0.00468, 0],
      [-0.00514, 0],
      [-0.00024, 0],
      [-0.00547, 0],
      [-0.00656, 0],
      [-0.00547, 0],
      [-0.00025, 2],
      [-0.0007, 2],
      [-0.0001, 0],
      [-0.00088, 2],
      [-0.00025, 2],
      [-3e-5, 1]
    ],
    "red_o_points": [],
    "y_categories": ["N", "Y", "nan"],
    "blue_o_points": [],
    "blue_x_points": [
      [-0.0001, 0],
      [0.00285, 2],
      [-0.00018, 0],
      [-0.00034, 0],
      [0.02294, 1],
      [-0.00025, 0],
      [-0.00017, 0]
    ]
  },
  "QS_mulGraftNerve[Ra]": {
    "red_x_points": [
      [-0.00015, 2],
      [-0.00047, 0],
      [-0.00042, 0],
      [-0.0003, 0],
      [-0.00035, 0],
      [-0.00037, 0],
      [-0.00037, 0],
      [-0.00016, 2],
      [-0.00036, 0],
      [-0.00037, 0],
      [-0.00028, 0],
      [-0.00014, 2],
      [0.00055, 1],
      [-4e-5, 2],
      [-0.00042, 0],
      [-0.00031, 2],
      [-0.0003, 0],
      [-0.00041, 0],
      [-0.00012, 2],
      [-9e-5, 2],
      [-0.00012, 2],
      [-0.00034, 0],
      [-0.00019, 2],
      [-0.00041, 2],
      [-0.00013, 2],
      [-0.00031, 0],
      [-0.00027, 2],
      [-0.00047, 0],
      [-0.00016, 2],
      [0.00073, 1],
      [-0.00041, 0]
    ],
    "red_o_points": [],
    "y_categories": ["N", "NOT APPLICABLE", "nan"],
    "blue_o_points": [],
    "blue_x_points": [
      [0.00154, 1],
      [-0.0, 2],
      [0.00072, 1],
      [0.00014, 0],
      [3e-5, 2],
      [0.0008, 1],
      [0.00088, 1]
    ]
  },
  "QS_mulTransfSite[Oberlin]": {
    "red_x_points": [
      [-0.00411, 3],
      [-0.01177, 0],
      [-0.01218, 0],
      [-0.01136, 0],
      [-0.00545, 2],
      [-0.00534, 2],
      [-0.01189, 0],
      [-0.00379, 3],
      [-0.006, 2],
      [-0.00575, 2],
      [-0.0058, 2],
      [-0.00368, 3],
      [0.02124, 1],
      [-0.00385, 3],
      [-0.00563, 2],
      [-0.00368, 3],
      [-0.01154, 0],
      [-0.00577, 2],
      [-0.00354, 3],
      [-0.00352, 3],
      [-0.00337, 3],
      [-0.01132, 0],
      [-0.00353, 3],
      [-0.00359, 3],
      [-0.00375, 3],
      [-0.00524, 2],
      [-0.00355, 3],
      [-0.01217, 0],
      [-0.00406, 3],
      [0.02024, 1],
      [-0.01079, 0]
    ],
    "red_o_points": [],
    "y_categories": ["N", "NOT APPLICABLE", "Y", "nan"],
    "blue_o_points": [],
    "blue_x_points": [
      [0.02733, 1],
      [-0.00099, 3],
      [0.02116, 1],
      [-2e-5, 2],
      [-0.00119, 3],
      [0.02173, 1],
      [0.02471, 1]
    ]
  },
  "QA_lstPexKine[Index]": {
    "red_x_points": [
      [-0.00159, 0],
      [-0.00038, 2],
      [-0.00053, 2],
      [-0.00039, 2],
      [4e-5, 1],
      [0.00019, 1],
      [-0.00119, 0],
      [0.00036, 2],
      [0.00029, 1],
      [3e-5, 1],
      [0.00015, 1],
      [-0.0006, 1],
      [-5e-5, 2],
      [0.00033, 2],
      [0.00024, 1],
      [0.00023, 2],
      [-8e-5, 2],
      [0.00021, 1],
      [-0.00066, 1],
      [-0.00107, 0],
      [-0.00041, 1],
      [-0.0005, 2],
      [0.00055, 2],
      [-0.0008, 1],
      [0.00025, 2],
      [-0.00015, 2],
      [-0.00083, 1],
      [-3e-5, 2],
      [-0.00047, 1],
      [-6e-5, 2],
      [-0.00044, 0]
    ],
    "red_o_points": [],
    "y_categories": ["NPV", "PV", "nan"],
    "blue_o_points": [],
    "blue_x_points": [
      [0.0001, 1],
      [0.00135, 2],
      [8e-5, 1],
      [0.00164, 1],
      [0.00061, 2],
      [0.00018, 1],
      [9e-5, 2]
    ]
  }
}
