{
  "QA_lstPexPain[C8]": {
    "red_x_points": [
      [0.00743, 0],
      [-0.00628, 2],
      [-0.00638, 2],
      [0.00586, 0],
      [-0.00587, 2],
      [-0.00762, 1],
      [-0.01223, 1],
      [-0.01264, 1],
      [-0.00772, 2],
      [-0.00773, 2],
      [-0.01026, 2],
      [-0.00565, 2],
      [-0.01252, 1],
      [0.00678, 0],
      [-0.01151, 1],
      [-0.00991, 1],
      [-0.00529, 2],
      [-0.00767, 2],
      [-0.01108, 2],
      [-0.00653, 2],
      [-0.0142, 1],
      [-0.00624, 1],
      [-0.01482, 1]
    ],
    "red_o_points": [],
    "y_categories": ["NORM", "NPV", "nan"],
    "blue_o_points": [],
    "blue_x_points": [
      [-0.00755, 1],
      [-0.00627, 1],
      [0.01241, 0],
      [0.00048, 1],
      [0.01832, 0],
      [0.01686, 0],
      [0.01619, 0],
      [0.01371, 0],
      [-0.00541, 2],
      [0.00045, 2],
      [-0.00442, 2],
      [-0.00084, 1],
      [-0.00444, 2],
      [0.01444, 0],
      [0.01421, 0],
      [0.01398, 0],
      [-0.00463, 2],
      [0.01424, 0],
      [0.01604, 0],
      [0.0222, 0],
      [0.0221, 0]
    ]
  },
  "QA_lstPexTouch[C6]": {
    "red_x_points": [
      [-0.00637, 1],
      [-0.00357, 2],
      [-0.00341, 1],
      [-0.00301, 1],
      [-0.00287, 2],
      [-0.00277, 1],
      [-0.00294, 1],
      [-0.00567, 1],
      [-0.00405, 2],
      [-0.00349, 2],
      [-0.00467, 1],
      [-0.00242, 2],
      [-0.004, 1],
      [-0.00565, 1],
      [-0.00598, 1],
      [-0.00294, 1],
      [-0.00215, 2],
      [-0.00611, 1],
      [-0.00303, 1],
      [-0.00334, 2],
      [-0.00495, 1],
      [-0.00231, 1],
      [-0.00479, 1]
    ],
    "red_o_points": [],
    "y_categories": ["NORM", "NPV", "nan"],
    "blue_o_points": [],
    "blue_x_points": [
      [-0.00392, 1],
      [-0.00334, 1],
      [0.01803, 0],
      [-0.00262, 1],
      [0.02976, 0],
      [-0.0025, 1],
      [-0.00245, 1],
      [-0.00288, 1],
      [-0.00106, 2],
      [0.00308, 2],
      [-0.00095, 2],
      [-0.00304, 1],
      [0.00037, 2],
      [-0.00282, 1],
      [-0.0026, 1],
      [0.02272, 0],
      [-0.00027, 2],
      [0.02011, 0],
      [0.03111, 0],
      [-0.00328, 1],
      [-0.00293, 1]
    ]
  },
  "QA_lstPexMuscstrength[FingersAddu]": {
    "red_x_points": [
      [-0.00024, 2],
      [-0.00018, 2],
      [-0.02177, 1],
      [-0.00141, 2],
      [-0.01996, 1],
      [-0.02258, 1],
      [0.00808, 0],
      [0.00653, 0],
      [-0.00061, 2],
      [-0.00011, 2],
      [0.00313, 0],
      [0.0002, 2],
      [-0.01987, 1],
      [0.00991, 0],
      [0.00703, 0],
      [-0.02065, 1],
      [-0.01675, 1],
      [0.00102, 2],
      [-0.00155, 2],
      [-0.01725, 1],
      [-0.00025, 2],
      [-0.01945, 1],
      [-0.00241, 2]
    ],
    "red_o_points": [],
    "y_categories": ["GREATER THAN OR EQUALS TO 3", "LESS THAN 3", "nan"],
    "blue_o_points": [],
    "blue_x_points": [
      [0.01813, 0],
      [-0.00251, 1],
      [0.00761, 0],
      [0.01223, 0],
      [0.01276, 0],
      [0.01364, 0],
      [0.00165, 2],
      [0.01439, 0],
      [0.00059, 2],
      [0.00197, 2],
      [0.00197, 2],
      [0.00274, 2],
      [0.00187, 2],
      [0.00856, 0],
      [0.0075, 0],
      [0.00809, 0],
      [0.00248, 2],
      [0.00169, 2],
      [0.01157, 0],
      [0.00165, 2],
      [0.00056, 2]
    ]
  },
  "QA_yonInjFracture": {
    "red_x_points": [
      [0.00521, 0],
      [-0.00622, 2],
      [0.00419, 0],
      [-0.00837, 2],
      [-0.01223, 1],
      [-0.01534, 1],
      [0.001, 0],
      [0.00284, 0],
      [-0.01836, 1],
      [-0.01425, 1],
      [0.00402, 0],
      [-0.01067, 1],
      [-0.01624, 1],
      [-0.00381, 0],
      [-0.01975, 1],
      [-0.0121, 1],
      [-0.0092, 1],
      [0.00306, 0],
      [0.00301, 0],
      [0.00538, 0],
      [-0.01263, 1],
      [-0.0084, 1],
      [-0.02553, 1]
    ],
    "red_o_points": [],
    "y_categories": ["N", "Y", "nan"],
    "blue_o_points": [],
    "blue_x_points": [
      [0.01482, 0],
      [0.01624, 0],
      [0.00211, 0],
      [0.00754, 0],
      [0.01169, 2],
      [0.00942, 0],
      [0.00864, 1],
      [0.00346, 1],
      [-0.00731, 1],
      [0.01104, 0],
      [0.01407, 0],
      [0.01511, 0],
      [0.01234, 0],
      [0.00263, 0],
      [0.00469, 0],
      [0.00569, 2],
      [0.01385, 0],
      [0.00639, 0],
      [0.00442, 0],
      [-0.00163, 1],
      [0.00917, 2]
    ]
  },
  "QA_lstPexMuscstrength[FingersFlex]": {
    "red_x_points": [
      [0.00278, 2],
      [0.0025, 2],
      [-0.03397, 1],
      [0.01057, 0],
      [-0.03531, 1],
      [-0.03479, 1],
      [-0.03925, 1],
      [0.01063, 0],
      [0.00311, 2],
      [0.00277, 2],
      [0.01117, 0],
      [0.00256, 2],
      [-0.03877, 1],
      [0.01028, 0],
      [0.01111, 0],
      [-0.03753, 1],
      [-0.03104, 1],
      [0.00329, 2],
      [0.01068, 0],
      [0.01004, 0],
      [0.0029, 2],
      [-0.03255, 1],
      [0.00224, 2]
    ],
    "red_o_points": [],
    "y_categories": ["GREATER THAN OR EQUALS TO 3", "LESS THAN 3", "nan"],
    "blue_o_points": [],
    "blue_x_points": [
      [0.01509, 0],
      [0.01437, 0],
      [0.01079, 0],
      [0.0122, 0],
      [0.0131, 0],
      [0.01246, 0],
      [0.0112, 0],
      [0.01188, 0],
      [0.00431, 2],
      [0.0039, 2],
      [0.00423, 2],
      [0.00469, 2],
      [0.0043, 2],
      [0.01223, 0],
      [0.01168, 0],
      [0.0113, 0],
      [0.00477, 2],
      [0.00391, 2],
      [0.01203, 0],
      [0.00413, 2],
      [0.00402, 2]
    ]
  },
  "QA_lstPexPalle[Elbow]": {
    "red_x_points": [
      [-0.00176, 4],
      [-0.00166, 4],
      [-0.00167, 4],
      [0.01262, 3],
      [-0.00183, 4],
      [-0.00149, 4],
      [-0.02312, 1],
      [-0.01661, 1],
      [-0.00181, 4],
      [-0.00191, 4],
      [-0.00207, 4],
      [-0.00147, 4],
      [-0.0015, 4],
      [-0.02319, 1],
      [-0.00146, 4],
      [-0.03093, 0],
      [-0.02358, 2],
      [-0.00216, 4],
      [-0.00261, 4],
      [-0.00169, 4],
      [0.01178, 3],
      [-0.02387, 0],
      [-0.00156, 4]
    ],
    "red_o_points": [],
    "y_categories": ["ABS", "HYPO", "NAIA", "PT", "nan"],
    "blue_o_points": [],
    "blue_x_points": [
      [-0.0004, 4],
      [-0.00147, 4],
      [0.0186, 3],
      [0.02246, 3],
      [-0.00101, 4],
      [-0.00096, 4],
      [-0.00773, 1],
      [0.02057, 3],
      [-0.00147, 4],
      [-0.00136, 4],
      [-0.00123, 4],
      [-0.00091, 4],
      [-0.00129, 4],
      [0.02234, 3],
      [0.02161, 3],
      [0.01846, 3],
      [-0.00149, 4],
      [0.01856, 3],
      [-0.00054, 4],
      [0.02218, 3],
      [-0.00138, 4]
    ]
  },
  "QA_lstPexMuscstrength[ScapulaAbducSuprot]": {
    "red_x_points": [
      [-0.00199, 2],
      [-0.00074, 2],
      [-0.00586, 1],
      [-0.00326, 2],
      [-0.00587, 1],
      [-0.00967, 1],
      [-0.01084, 1],
      [0.0041, 0],
      [-0.00117, 2],
      [-0.00108, 2],
      [-0.00541, 2],
      [-0.00035, 2],
      [-0.01056, 1],
      [-0.00577, 0],
      [0.00444, 0],
      [-0.01059, 1],
      [-0.00246, 1],
      [-0.00256, 2],
      [-0.00804, 1],
      [0.00137, 0],
      [-0.00184, 2],
      [-0.0029, 1],
      [-0.00728, 2]
    ],
    "red_o_points": [],
    "y_categories": ["GREATER THAN OR EQUALS TO 3", "LESS THAN 3", "nan"],
    "blue_o_points": [],
    "blue_x_points": [
      [0.0245, 0],
      [0.02247, 0],
      [0.0039, 0],
      [0.00016, 1],
      [-0.00071, 1],
      [0.01021, 0],
      [0.00631, 0],
      [0.00327, 1],
      [-0.00048, 2],
      [0.00071, 2],
      [0.00065, 2],
      [0.00262, 2],
      [0.00022, 2],
      [0.00579, 0],
      [0.00538, 0],
      [-0.00069, 2],
      [0.0004, 2],
      [0.00443, 0],
      [0.00139, 2],
      [-0.00109, 1],
      [-0.00107, 2]
    ]
  },
  "participant_code": {
    "red_x_points": [
      [-0.05031, 0],
      [-0.05352, 2],
      [-0.05216, 3],
      [-0.05313, 4],
      [-0.05167, 5],
      [-0.05225, 9],
      [-0.05478, 14],
      [-0.05196, 17],
      [-0.05264, 19],
      [-0.05041, 20],
      [-0.05313, 22],
      [-0.05361, 23],
      [-0.05254, 24],
      [-0.05293, 26],
      [-0.05167, 28],
      [-0.05303, 29],
      [-0.05468, 31],
      [-0.05216, 35],
      [-0.05274, 37],
      [-0.05313, 39],
      [-0.05148, 41],
      [-0.05235, 42],
      [-0.05177, 43]
    ],
    "red_o_points": [],
    "y_categories": [
      "P16554",
      "P18297",
      "P19283",
      "P19287",
      "P23172",
      "P23391",
      "P30595",
      "P31645",
      "P31691",
      "P34778",
      "P35046",
      "P36328",
      "P43633",
      "P4544",
      "P46417",
      "P48965",
      "P53068",
      "P5497",
      "P58556",
      "P59529",
      "P62483",
      "P64658",
      "P65202",
      "P66816",
      "P67052",
      "P6751",
      "P7408",
      "P75566",
      "P76226",
      "P79971",
      "P82621",
      "P82990",
      "P84549",
      "P84932",
      "P85825",
      "P86989",
      "P8770",
      "P87791",
      "P90550",
      "P93159",
      "P94969",
      "P96710",
      "P9744",
      "P98500",
      "nan"
    ],
    "blue_o_points": [],
    "blue_x_points": [
      [0.05821, 1],
      [0.05677, 6],
      [0.05738, 7],
      [0.05872, 8],
      [0.05934, 10],
      [0.05707, 11],
      [0.0581, 12],
      [0.05646, 13],
      [0.05769, 15],
      [0.05779, 16],
      [0.05728, 18],
      [0.05821, 21],
      [0.05666, 25],
      [0.05533, 27],
      [0.0581, 30],
      [0.05677, 32],
      [0.05666, 33],
      [0.05831, 34],
      [0.05646, 36],
      [0.05779, 38],
      [0.05893, 40]
    ]
  },
  "QA_lstPexMuscstrength[ShoulderExrot]": {
    "red_x_points": [
      [-0.0008, 2],
      [-9e-5, 2],
      [-0.01531, 0],
      [-0.00089, 2],
      [0.00301, 1],
      [-0.00065, 2],
      [0.00249, 1],
      [-0.02573, 0],
      [-0.00029, 2],
      [-0.00043, 2],
      [-0.00163, 2],
      [-0.00031, 2],
      [-0.00037, 2],
      [0.00422, 1],
      [-0.03166, 0],
      [0.00275, 1],
      [3e-5, 2],
      [0.00011, 2],
      [0.00461, 1],
      [-0.01797, 0],
      [-0.00068, 2],
      [0.00208, 1],
      [-0.00069, 2]
    ],
    "red_o_points": [],
    "y_categories": ["GREATER THAN OR EQUALS TO 3", "LESS THAN 3", "nan"],
    "blue_o_points": [],
    "blue_x_points": [
      [0.01034, 1],
      [0.00029, 2],
      [0.00567, 1],
      [0.00721, 1],
      [0.00728, 1],
      [0.01116, 1],
      [0.00573, 1],
      [0.00027, 2],
      [0.00043, 2],
      [0.00106, 2],
      [0.00107, 2],
      [0.00123, 2],
      [0.00087, 2],
      [0.0059, 1],
      [0.00637, 1],
      [-1e-5, 2],
      [0.00073, 2],
      [0.00109, 2],
      [0.01159, 1],
      [0.00012, 2],
      [-0.00021, 2]
    ]
  },
  "QA_mulInjOrthesisType[ArmSling]": {
    "red_x_points": [
      [-0.00798, 2],
      [-0.0098, 2],
      [-0.00389, 2],
      [-0.00282, 2],
      [-0.00604, 2],
      [-0.00302, 2],
      [-0.00183, 2],
      [-0.00455, 1],
      [-0.01139, 2],
      [-0.00884, 2],
      [-0.00576, 2],
      [-0.02378, 0],
      [-0.00724, 3],
      [-0.00191, 2],
      [-0.00242, 1],
      [-0.00165, 2],
      [-0.01444, 3],
      [-0.00937, 2],
      [-0.0051, 2],
      [-0.00669, 2],
      [-0.00766, 3],
      [-0.00127, 2],
      [-0.00578, 2]
    ],
    "red_o_points": [],
    "y_categories": ["N", "NOT APPLICABLE", "Y", "nan"],
    "blue_o_points": [],
    "blue_x_points": [
      [-0.00084, 2],
      [-0.00182, 2],
      [0.00055, 2],
      [0.0002, 2],
      [-0.00172, 2],
      [-0.00033, 2],
      [0.00043, 2],
      [-0.00041, 2],
      [0.04753, 1],
      [0.03467, 1],
      [-0.00736, 2],
      [0.02586, 1],
      [0.03527, 1],
      [-0.00054, 2],
      [0.00781, 0],
      [-0.00065, 2],
      [-0.00933, 2],
      [0.00994, 1],
      [0.0116, 1],
      [-0.00278, 2],
      [0.00515, 3]
    ]
  },
  "QA_mulInjOrthesisType[ShoulderSupport]": {
    "red_x_points": [
      [-0.00768, 0],
      [-0.00973, 0],
      [-0.00502, 0],
      [-0.02219, 2],
      [-0.00678, 0],
      [-0.00259, 0],
      [-0.00176, 0],
      [-0.00425, 1],
      [-0.01113, 0],
      [-0.00928, 0],
      [-0.00581, 0],
      [-0.01954, 2],
      [-0.01, 3],
      [-0.00327, 0],
      [-0.00534, 1],
      [-0.00195, 0],
      [-0.01449, 3],
      [-0.01109, 0],
      [-0.00507, 0],
      [-0.0072, 0],
      [-0.01033, 3],
      [-0.0015, 0],
      [-0.00689, 0]
    ],
    "red_o_points": [],
    "y_categories": ["N", "NOT APPLICABLE", "Y", "nan"],
    "blue_o_points": [],
    "blue_x_points": [
      [-0.00039, 0],
      [-0.00022, 0],
      [0.00077, 0],
      [0.00205, 0],
      [0.01429, 2],
      [0.00209, 0],
      [0.00097, 0],
      [0.00276, 0],
      [0.0461, 1],
      [0.03357, 1],
      [-0.00728, 0],
      [0.03097, 1],
      [0.03267, 1],
      [0.00018, 0],
      [0.00516, 2],
      [-0.00018, 0],
      [-0.00852, 0],
      [0.01149, 1],
      [0.01287, 1],
      [-0.00155, 0],
      [0.00507, 3]
    ]
  },
  "QA_lstPexPain[C6]": {
    "red_x_points": [
      [-0.00062, 1],
      [-0.00253, 2],
      [-0.00283, 2],
      [-0.00091, 1],
      [-0.00226, 2],
      [-0.00039, 1],
      [-0.00065, 1],
      [-0.00063, 1],
      [-0.00436, 2],
      [-0.00267, 2],
      [-0.00605, 2],
      [-0.00221, 2],
      [-0.00194, 1],
      [-0.00303, 1],
      [-0.00041, 1],
      [-0.00055, 1],
      [-0.00186, 2],
      [-0.00545, 2],
      [-0.00443, 2],
      [-0.00412, 2],
      [-0.00059, 1],
      [-0.00047, 1],
      [-0.00107, 1]
    ],
    "red_o_points": [],
    "y_categories": ["NORM", "NPV", "nan"],
    "blue_o_points": [],
    "blue_x_points": [
      [-0.00044, 1],
      [-8e-5, 1],
      [0.01016, 0],
      [-0.00027, 1],
      [0.01752, 0],
      [-8e-5, 1],
      [-0.00018, 1],
      [-0.00057, 1],
      [-0.00216, 2],
      [-0.00196, 2],
      [-0.00191, 2],
      [-0.00028, 1],
      [-0.00191, 2],
      [0.01273, 0],
      [-0.00056, 1],
      [0.0128, 0],
      [-0.00256, 2],
      [0.01125, 0],
      [-0.00041, 1],
      [-0.00068, 1],
      [-0.0004, 1]
    ]
  },
  "QA_lstPexArthre[Shoulder]": {
    "red_x_points": [
      [0.00655, 2],
      [-0.00212, 3],
      [-0.00516, 3],
      [0.00695, 2],
      [-0.01542, 0],
      [-0.02118, 1],
      [0.00802, 2],
      [0.0076, 2],
      [-0.00255, 3],
      [0.00584, 2],
      [-0.00459, 3],
      [-0.00157, 3],
      [-0.00492, 3],
      [-0.04302, 1],
      [0.00752, 2],
      [-0.02245, 1],
      [-0.00223, 3],
      [-0.00412, 3],
      [-0.00851, 3],
      [-0.00268, 3],
      [-0.00439, 3],
      [-0.01553, 1],
      [-0.00523, 3]
    ],
    "red_o_points": [],
    "y_categories": ["NAIA", "NPV", "PV", "nan"],
    "blue_o_points": [],
    "blue_x_points": [
      [0.01601, 2],
      [-0.00298, 3],
      [0.00957, 2],
      [0.01412, 2],
      [-0.00073, 3],
      [0.01343, 2],
      [0.01563, 2],
      [0.0125, 2],
      [-0.00167, 3],
      [-0.00128, 3],
      [-0.00124, 3],
      [0.01493, 2],
      [-0.00137, 3],
      [0.0096, 2],
      [0.00744, 2],
      [-0.00282, 1],
      [-0.00168, 3],
      [0.00724, 2],
      [-0.00019, 3],
      [0.00977, 2],
      [0.00692, 2]
    ]
  },
  "QS_mulGraftTrunk[UpperTrunk]": {
    "red_x_points": [
      [-0.00876, 1],
      [-0.00442, 0],
      [-0.00127, 0],
      [0.00091, 0],
      [-0.00307, 0],
      [0.00126, 0],
      [0.00014, 3],
      [-0.01091, 1],
      [0.00367, 3],
      [-0.02248, 2],
      [0.00114, 3],
      [-0.00331, 0],
      [0.0007, 3],
      [0.0002, 0],
      [-0.0138, 1],
      [0.00051, 3],
      [-0.00354, 0],
      [0.00116, 3],
      [-0.00083, 0],
      [-0.00567, 0],
      [-0.00668, 1],
      [0.0009, 0],
      [0.00061, 3]
    ],
    "red_o_points": [],
    "y_categories": ["N", "NOT APPLICABLE", "Y", "nan"],
    "blue_o_points": [],
    "blue_x_points": [
      [0.00283, 3],
      [0.00134, 3],
      [0.00254, 0],
      [0.00405, 0],
      [0.00115, 3],
      [0.00578, 0],
      [0.00368, 0],
      [0.00333, 0],
      [0.0052, 3],
      [0.01376, 1],
      [-0.00069, 0],
      [0.00614, 0],
      [0.00529, 3],
      [0.00199, 3],
      [0.00237, 3],
      [0.00112, 3],
      [0.00572, 3],
      [0.00184, 3],
      [0.0009, 1],
      [0.00281, 3],
      [0.00239, 3]
    ]
  },
  "QS_mulTransfSite[PhMc]": {
    "red_x_points": [
      [-0.00855, 1],
      [-0.00399, 0],
      [-0.00056, 0],
      [0.00164, 0],
      [-0.00227, 0],
      [-0.01323, 2],
      [0.00064, 3],
      [-0.01041, 1],
      [0.00305, 3],
      [-0.00263, 0],
      [0.00179, 3],
      [-0.00287, 0],
      [0.00113, 3],
      [0.0008, 0],
      [-0.01373, 1],
      [0.00123, 3],
      [-0.00855, 2],
      [0.00167, 3],
      [-0.00085, 0],
      [-0.00422, 0],
      [-0.0083, 1],
      [0.00259, 0],
      [0.00129, 3]
    ],
    "red_o_points": [],
    "y_categories": ["N", "NOT APPLICABLE", "Y", "nan"],
    "blue_o_points": [],
    "blue_x_points": [
      [0.00413, 3],
      [0.00258, 3],
      [0.00092, 0],
      [0.00572, 0],
      [0.00119, 3],
      [0.00447, 0],
      [0.00202, 0],
      [0.00201, 0],
      [0.00432, 3],
      [0.01165, 1],
      [-0.00196, 0],
      [0.0075, 0],
      [0.00425, 3],
      [0.00173, 3],
      [0.00195, 3],
      [0.00109, 3],
      [0.00458, 3],
      [0.0016, 3],
      [0.00139, 1],
      [0.0019, 3],
      [0.00131, 3]
    ]
  },
  "QS_mulGraftLevel[Trunk]": {
    "red_x_points": [
      [-0.008, 1],
      [-0.00359, 0],
      [-0.00159, 0],
      [0.00094, 0],
      [-0.00268, 0],
      [0.00127, 0],
      [0.00025, 3],
      [-0.01007, 1],
      [0.00271, 3],
      [-0.02009, 2],
      [0.00156, 3],
      [-0.00299, 0],
      [0.00033, 3],
      [-0.00012, 0],
      [-0.01061, 1],
      [0.00082, 3],
      [-0.00306, 0],
      [0.0009, 3],
      [-0.0003, 0],
      [-0.00448, 0],
      [-0.00646, 1],
      [0.00059, 0],
      [0.00036, 3]
    ],
    "red_o_points": [],
    "y_categories": ["N", "NOT APPLICABLE", "Y", "nan"],
    "blue_o_points": [],
    "blue_x_points": [
      [0.0028, 3],
      [0.00117, 3],
      [0.00229, 0],
      [0.00467, 0],
      [0.00117, 3],
      [0.00427, 0],
      [0.00339, 0],
      [0.00211, 0],
      [0.00459, 3],
      [0.01165, 1],
      [-0.0004, 0],
      [0.00647, 0],
      [0.00373, 3],
      [0.00181, 3],
      [0.00172, 3],
      [0.00096, 3],
      [0.00453, 3],
      [0.0017, 3],
      [0.00119, 1],
      [0.00245, 3],
      [0.00203, 3]
    ]
  },
  "QA_lstPexPain[C7]": {
    "red_x_points": [
      [-0.0099, 1],
      [-0.00912, 2],
      [-0.00859, 2],
      [-0.00963, 1],
      [-0.00868, 2],
      [-0.00639, 1],
      [-0.00842, 1],
      [-0.0106, 1],
      [-0.01032, 2],
      [-0.01096, 2],
      [-0.01182, 2],
      [-0.00867, 2],
      [-0.00885, 1],
      [0.01364, 0],
      [-0.01033, 1],
      [-0.00751, 1],
      [-0.00786, 2],
      [-0.01096, 2],
      [-0.01354, 2],
      [-0.0092, 2],
      [-0.01213, 1],
      [-0.00627, 1],
      [-0.01015, 1]
    ],
    "red_o_points": [],
    "y_categories": ["NORM", "NPV", "nan"],
    "blue_o_points": [],
    "blue_x_points": [
      [-0.0067, 1],
      [-0.00667, 1],
      [0.02277, 0],
      [-0.00306, 1],
      [0.02925, 0],
      [-0.00425, 1],
      [0.0255, 0],
      [0.02625, 0],
      [-0.0087, 2],
      [-0.00328, 2],
      [-0.00735, 2],
      [-0.00394, 1],
      [-0.00792, 2],
      [0.02449, 0],
      [0.02322, 0],
      [0.02517, 0],
      [-0.00705, 2],
      [0.02508, 0],
      [0.0303, 0],
      [-0.0083, 1],
      [0.03143, 0]
    ]
  },
  "QS_mulTransfSite[AcSsAA]": {
    "red_x_points": [
      [-0.01283, 1],
      [-0.01671, 2],
      [-0.00084, 0],
      [0.00032, 0],
      [-0.01302, 2],
      [0.00179, 0],
      [3e-5, 3],
      [-0.01705, 1],
      [0.00633, 3],
      [-0.01782, 2],
      [0.00236, 3],
      [-0.00168, 0],
      [0.0015, 3],
      [-0.0119, 0],
      [-0.0167, 1],
      [0.0009, 3],
      [-0.01254, 2],
      [0.00311, 3],
      [-0.0024, 0],
      [-0.01586, 2],
      [-0.01137, 1],
      [0.00082, 0],
      [0.00231, 3]
    ],
    "red_o_points": [],
    "y_categories": ["N", "NOT APPLICABLE", "Y", "nan"],
    "blue_o_points": [],
    "blue_x_points": [
      [0.00519, 3],
      [0.00354, 3],
      [0.00598, 2],
      [0.00405, 0],
      [0.0031, 3],
      [0.00475, 0],
      [0.01387, 2],
      [0.0005, 0],
      [0.00885, 3],
      [0.01966, 1],
      [0.00936, 0],
      [0.00706, 0],
      [0.00817, 3],
      [0.00427, 3],
      [0.00386, 3],
      [0.00263, 3],
      [0.0101, 3],
      [0.00361, 3],
      [0.00286, 1],
      [0.00584, 3],
      [0.00399, 3]
    ]
  },
  "QA_lstPexMuscstrength[WristFlex]": {
    "red_x_points": [
      [-0.00162, 0],
      [-0.00148, 2],
      [-0.01088, 1],
      [0.00074, 0],
      [-0.00689, 1],
      [-0.01167, 1],
      [-0.00291, 0],
      [-0.0009, 0],
      [-0.00212, 2],
      [-0.00295, 2],
      [-0.00042, 0],
      [-0.00173, 2],
      [-0.0092, 1],
      [0.00148, 0],
      [0.0009, 0],
      [-0.00354, 1],
      [-0.00533, 1],
      [-0.00296, 0],
      [0.00221, 0],
      [0.00079, 0],
      [-0.00316, 2],
      [-0.00896, 1],
      [-0.00765, 2]
    ],
    "red_o_points": [],
    "y_categories": ["GREATER THAN OR EQUALS TO 3", "LESS THAN 3", "nan"],
    "blue_o_points": [],
    "blue_x_points": [
      [0.00582, 1],
      [0.011, 0],
      [0.00124, 0],
      [0.00448, 0],
      [0.00408, 0],
      [0.00578, 0],
      [0.00329, 0],
      [0.00423, 0],
      [0.00111, 2],
      [0.00114, 2],
      [0.00376, 0],
      [0.00832, 0],
      [0.00198, 2],
      [0.00048, 0],
      [0.00055, 0],
      [0.00139, 0],
      [0.00301, 2],
      [0.00456, 1],
      [0.0016, 0],
      [0.00926, 1],
      [0.00118, 2]
    ]
  },
  "QS_mulNeuromadSite[C7]": {
    "red_x_points": [
      [-0.01124, 1],
      [-0.00562, 0],
      [-0.00168, 0],
      [0.00073, 0],
      [-0.00372, 0],
      [0.00131, 0],
      [-0.00045, 2],
      [-0.01219, 1],
      [0.00298, 2],
      [-0.00404, 0],
      [0.00137, 2],
      [-0.00509, 0],
      [0.0005, 2],
      [0.00075, 0],
      [-0.01482, 1],
      [6e-5, 2],
      [-0.00447, 0],
      [0.00072, 2],
      [-0.00231, 0],
      [-0.00687, 0],
      [-0.00745, 1],
      [0.00087, 0],
      [0.00089, 2]
    ],
    "red_o_points": [],
    "y_categories": ["N", "NOT APPLICABLE", "nan"],
    "blue_o_points": [],
    "blue_x_points": [
      [0.00331, 2],
      [0.00166, 2],
      [0.00184, 0],
      [0.00499, 0],
      [0.00103, 2],
      [0.00476, 0],
      [0.00271, 0],
      [0.00187, 0],
      [0.00457, 2],
      [0.01536, 1],
      [-0.00186, 0],
      [0.00586, 0],
      [0.00456, 2],
      [0.00244, 2],
      [0.00207, 2],
      [0.00082, 2],
      [0.00566, 2],
      [0.00223, 2],
      [0.00177, 1],
      [0.00245, 2],
      [0.00167, 2]
    ]
  },
  "QA_lstPexMuscstrength[ElbowExte]": {
    "red_x_points": [
      [-0.00577, 2],
      [-0.00387, 2],
      [-0.00445, 1],
      [-0.00246, 1],
      [-0.00858, 1],
      [-0.00263, 1],
      [-0.0039, 1],
      [-0.00071, 0],
      [-0.00296, 2],
      [-0.00964, 2],
      [-0.00491, 1],
      [-0.00261, 2],
      [-0.00022, 1],
      [-0.01225, 1],
      [-0.00138, 0],
      [-0.00241, 1],
      [-0.0054, 1],
      [-0.0061, 0],
      [-0.00777, 1],
      [-0.00405, 2],
      [-0.00189, 2],
      [-0.00182, 1],
      [-0.00533, 2]
    ],
    "red_o_points": [],
    "y_categories": ["GREATER THAN OR EQUALS TO 3", "LESS THAN 3", "nan"],
    "blue_o_points": [],
    "blue_x_points": [
      [2e-5, 1],
      [0.00086, 1],
      [0.00932, 0],
      [-0.00304, 1],
      [1e-5, 1],
      [0.01707, 0],
      [0.01673, 0],
      [-0.00196, 1],
      [0.00045, 2],
      [1e-5, 2],
      [0.02191, 0],
      [0.00149, 1],
      [0.00182, 2],
      [0.00745, 0],
      [0.00495, 0],
      [0.00794, 0],
      [0.0013, 2],
      [0.00405, 0],
      [0.00568, 0],
      [0.00369, 1],
      [0.00138, 1]
    ]
  },
  "QA_lstPexTinel[TinelSign]": {
    "red_x_points": [
      [0.00097, 1],
      [-0.00132, 1],
      [-0.00963, 2],
      [0.00192, 1],
      [0.00059, 1],
      [0.0015, 1],
      [-0.01658, 2],
      [-0.01674, 2],
      [-0.00581, 1],
      [-0.00111, 1],
      [-0.01931, 2],
      [-0.00621, 2],
      [-3e-5, 1],
      [-0.02099, 2],
      [0.00254, 1],
      [-0.01213, 2],
      [0.00058, 1],
      [-0.0027, 1],
      [-0.01464, 2],
      [-0.00996, 2],
      [-0.00015, 1],
      [-0.00812, 2],
      [-0.00272, 1]
    ],
    "red_o_points": [],
    "y_categories": ["ABS", "NAIA", "PT", "nan"],
    "blue_o_points": [],
    "blue_x_points": [
      [0.00919, 1],
      [0.04061, 0],
      [0.01958, 0],
      [-0.0099, 2],
      [0.00642, 1],
      [0.00606, 1],
      [-0.00905, 2],
      [0.00731, 1],
      [0.00724, 2],
      [0.00146, 1],
      [0.00431, 1],
      [0.00539, 1],
      [0.00096, 1],
      [0.02082, 0],
      [0.00547, 1],
      [0.00515, 1],
      [0.00353, 2],
      [0.00341, 1],
      [0.00717, 1],
      [0.00235, 1],
      [0.00257, 1]
    ]
  },
  "QA_lstPexArthre[Index]": {
    "red_x_points": [
      [-0.01106, 0],
      [-0.00227, 2],
      [-0.00343, 2],
      [-0.01073, 0],
      [-0.00423, 0],
      [-0.00917, 0],
      [-4e-5, 1],
      [0.00045, 1],
      [-0.00172, 2],
      [0.00359, 1],
      [-0.00313, 2],
      [-0.00175, 2],
      [-0.00293, 2],
      [-0.00131, 1],
      [0.00088, 1],
      [-0.00454, 0],
      [-0.00079, 2],
      [-0.00294, 2],
      [-0.00556, 2],
      [-0.00075, 2],
      [-0.00252, 2],
      [-0.00585, 0],
      [-0.00321, 2]
    ],
    "red_o_points": [],
    "y_categories": ["NPV", "PV", "nan"],
    "blue_o_points": [],
    "blue_x_points": [
      [0.00417, 0],
      [-0.00153, 2],
      [0.00244, 1],
      [0.00776, 1],
      [0.00048, 2],
      [0.00848, 1],
      [0.00548, 1],
      [0.00236, 0],
      [-0.00097, 2],
      [-0.00057, 2],
      [-0.00066, 2],
      [0.01622, 1],
      [-0.00055, 2],
      [0.00321, 1],
      [0.00249, 1],
      [0.00209, 0],
      [-0.00041, 2],
      [0.00451, 1],
      [0.0006, 2],
      [0.01028, 1],
      [0.00713, 1]
    ]
  },
  "QS_mulTransfSite[IMc]": {
    "red_x_points": [
      [-0.01561, 1],
      [-0.02351, 2],
      [0.0011, 0],
      [-0.02879, 2],
      [-0.00273, 0],
      [0.00586, 0],
      [0.00266, 3],
      [-0.01844, 1],
      [0.00757, 3],
      [-0.00186, 0],
      [0.00436, 3],
      [-0.02034, 2],
      [0.00333, 3],
      [0.00154, 0],
      [-0.02447, 1],
      [0.00323, 3],
      [-0.00332, 0],
      [0.00374, 3],
      [0.00246, 0],
      [-0.02416, 2],
      [-0.01508, 1],
      [-0.01429, 2],
      [0.00394, 3]
    ],
    "red_o_points": [],
    "y_categories": ["N", "NOT APPLICABLE", "Y", "nan"],
    "blue_o_points": [],
    "blue_x_points": [
      [0.00774, 3],
      [0.00651, 3],
      [0.00458, 0],
      [0.00939, 0],
      [0.00592, 3],
      [0.01034, 0],
      [0.0068, 0],
      [0.00876, 0],
      [0.01052, 3],
      [0.01466, 1],
      [0.00189, 0],
      [0.01057, 0],
      [0.00854, 3],
      [0.00585, 3],
      [0.00564, 3],
      [0.00484, 3],
      [0.01101, 3],
      [0.00492, 3],
      [0.00137, 1],
      [0.00697, 3],
      [0.00595, 3]
    ]
  },
  "QA_lstPexPain[T1]": {
    "red_x_points": [
      [-0.00776, 1],
      [-0.00369, 2],
      [-0.00516, 2],
      [0.0005, 0],
      [-0.00288, 2],
      [-0.00135, 1],
      [-0.00151, 0],
      [-0.00131, 0],
      [-0.00721, 2],
      [-0.00534, 2],
      [-0.00724, 2],
      [-0.003, 2],
      [-0.00857, 1],
      [-0.01804, 1],
      [-0.00362, 1],
      [-0.00293, 1],
      [-0.00267, 2],
      [-0.00948, 2],
      [-0.00884, 2],
      [-0.00303, 2],
      [-0.00995, 1],
      [-0.00165, 1],
      [-0.00847, 1]
    ],
    "red_o_points": [],
    "y_categories": ["NORM", "NPV", "nan"],
    "blue_o_points": [],
    "blue_x_points": [
      [0.00219, 1],
      [-0.00011, 1],
      [0.00671, 0],
      [0.00456, 1],
      [0.01579, 0],
      [0.00101, 1],
      [0.01485, 0],
      [0.01375, 0],
      [-0.00253, 2],
      [0.00169, 2],
      [-0.00217, 2],
      [0.00114, 1],
      [-0.00177, 2],
      [0.00793, 0],
      [0.00725, 0],
      [0.00937, 0],
      [-0.00234, 2],
      [-0.00541, 1],
      [0.01205, 0],
      [0.0207, 0],
      [0.01857, 0]
    ]
  },
  "QS_mulTransfSite[AcMc]": {
    "red_x_points": [
      [-0.01071, 1],
      [-0.00763, 0],
      [-0.0039, 0],
      [-0.0079, 0],
      [-0.0048, 0],
      [-0.00058, 0],
      [0.00106, 3],
      [-0.01399, 1],
      [0.00386, 3],
      [-0.0047, 0],
      [0.00114, 3],
      [-0.00496, 0],
      [0.0024, 3],
      [-0.00721, 0],
      [-0.01757, 1],
      [0.00168, 3],
      [-0.00463, 0],
      [0.0011, 3],
      [-0.00327, 0],
      [-0.0066, 0],
      [-0.01203, 1],
      [-0.00128, 0],
      [0.00167, 3]
    ],
    "red_o_points": [],
    "y_categories": ["N", "NOT APPLICABLE", "Y", "nan"],
    "blue_o_points": [],
    "blue_x_points": [
      [0.00476, 3],
      [0.00313, 3],
      [0.00137, 0],
      [0.00295, 0],
      [0.00381, 3],
      [0.00397, 0],
      [0.0009, 0],
      [0.02507, 2],
      [0.00501, 3],
      [0.01442, 1],
      [-0.00235, 0],
      [0.00374, 0],
      [0.00423, 3],
      [0.00418, 3],
      [0.00315, 3],
      [0.00233, 3],
      [0.00426, 3],
      [0.00185, 3],
      [0.00344, 1],
      [0.00563, 3],
      [0.00298, 3]
    ]
  },
  "QA_lstPexKine[Shoulder]": {
    "red_x_points": [
      [0.00129, 1],
      [-0.00063, 2],
      [-0.00261, 2],
      [0.00169, 1],
      [-0.00164, 2],
      [-0.01302, 0],
      [0.00149, 1],
      [0.00137, 1],
      [-0.00063, 2],
      [0.00147, 1],
      [-0.00123, 2],
      [-0.00034, 2],
      [-0.00172, 2],
      [-0.03371, 0],
      [0.00153, 1],
      [0.00139, 1],
      [-0.00127, 2],
      [-0.00236, 2],
      [-0.00561, 2],
      [-0.00152, 2],
      [-0.001, 2],
      [0.00141, 1],
      [-0.00198, 2]
    ],
    "red_o_points": [],
    "y_categories": ["NPV", "PV", "nan"],
    "blue_o_points": [],
    "blue_x_points": [
      [0.00417, 1],
      [-0.00067, 2],
      [0.00457, 1],
      [0.0073, 1],
      [5e-5, 2],
      [0.00784, 1],
      [0.00853, 1],
      [0.00633, 1],
      [-0.00017, 2],
      [-0.00028, 2],
      [-0.00117, 2],
      [0.00741, 1],
      [-0.00023, 2],
      [0.00413, 1],
      [0.00277, 1],
      [-0.00029, 0],
      [-0.00042, 2],
      [0.003, 1],
      [0.00029, 2],
      [0.00287, 1],
      [0.00161, 1]
    ]
  },
  "QA_yonInjBpsurg": {
    "red_x_points": [
      [-0.01044, 0],
      [-7e-5, 1],
      [0.00033, 1],
      [0.00184, 1],
      [-0.0001, 1],
      [0.00125, 1],
      [0.00134, 1],
      [-0.01362, 0],
      [-0.00011, 1],
      [0.00035, 1],
      [0.00064, 1],
      [8e-5, 1],
      [0.00098, 1],
      [0.00124, 1],
      [-0.01588, 0],
      [0.00094, 1],
      [-0.0015, 1],
      [-0.00157, 1],
      [0.00087, 1],
      [-0.00137, 1],
      [-0.01383, 0],
      [0.00082, 1],
      [0.00134, 1]
    ],
    "red_o_points": [],
    "y_categories": ["N", "Y", "nan"],
    "blue_o_points": [],
    "blue_x_points": [
      [0.00381, 1],
      [0.00195, 1],
      [0.00255, 1],
      [0.00305, 1],
      [0.00064, 1],
      [0.00367, 1],
      [0.00283, 1],
      [0.00264, 1],
      [0.00069, 1],
      [0.00731, 0],
      [0.00042, 1],
      [0.00294, 1],
      [0.00043, 1],
      [0.00232, 1],
      [0.00235, 1],
      [0.00146, 1],
      [-0.00019, 1],
      [0.00266, 1],
      [-0.00016, 0],
      [0.00328, 1],
      [0.00181, 1]
    ]
  },
  "QA_lstPexTouch[C8]": {
    "red_x_points": [
      [0.00868, 0],
      [-0.00485, 2],
      [-0.00946, 1],
      [-0.01577, 1],
      [-0.00346, 2],
      [-0.00875, 1],
      [-0.01285, 1],
      [-0.01421, 1],
      [-0.0048, 2],
      [-0.00563, 2],
      [-0.0134, 1],
      [-0.00387, 2],
      [-0.0155, 1],
      [0.00864, 0],
      [-0.01241, 1],
      [-0.01177, 1],
      [-0.00339, 2],
      [0.00915, 0],
      [-0.01105, 1],
      [-0.00526, 2],
      [-0.01754, 1],
      [-0.00897, 1],
      [-0.01683, 1]
    ],
    "red_o_points": [],
    "y_categories": ["NORM", "NPV", "nan"],
    "blue_o_points": [],
    "blue_x_points": [
      [-0.0108, 1],
      [-0.01163, 1],
      [0.01489, 0],
      [-0.00776, 1],
      [0.02192, 0],
      [-0.00756, 1],
      [0.01938, 0],
      [0.02173, 0],
      [-0.0002, 2],
      [0.00236, 2],
      [-0.00029, 2],
      [-0.00659, 1],
      [0.00069, 2],
      [0.01756, 0],
      [0.01713, 0],
      [0.01931, 0],
      [0.00159, 2],
      [0.01554, 0],
      [0.01848, 0],
      [0.02501, 0],
      [0.02252, 0]
    ]
  },
  "QA_lstPexTouch[C5]": {
    "red_x_points": [
      [-0.0039, 0],
      [-0.00065, 2],
      [-0.00176, 1],
      [-0.00088, 1],
      [-0.00086, 2],
      [-0.00015, 1],
      [-0.00098, 1],
      [-0.00308, 1],
      [-0.00102, 2],
      [-0.00081, 2],
      [-0.00242, 1],
      [-0.00059, 2],
      [-0.00242, 1],
      [-0.00162, 1],
      [-0.00277, 1],
      [-0.00073, 1],
      [-0.00037, 2],
      [-0.00388, 1],
      [-0.00172, 1],
      [-0.00109, 2],
      [-0.00184, 1],
      [-0.00024, 1],
      [-0.00245, 1]
    ],
    "red_o_points": [],
    "y_categories": ["NORM", "NPV", "nan"],
    "blue_o_points": [],
    "blue_x_points": [
      [-0.00097, 1],
      [-0.002, 1],
      [-0.00034, 1],
      [-0.00055, 1],
      [0.01467, 0],
      [-0.00027, 1],
      [0.00011, 1],
      [-0.00029, 1],
      [0.0013, 2],
      [0.00298, 2],
      [0.00066, 2],
      [-0.00049, 1],
      [0.00118, 2],
      [-0.00077, 1],
      [0.00526, 0],
      [-0.00047, 1],
      [0.00155, 2],
      [0.00458, 0],
      [0.01033, 0],
      [-0.0002, 1],
      [-2e-5, 1]
    ]
  },
  "QA_txtInjMedicatioListNer": {
    "red_x_points": [
      [-0.00771, 1],
      [-0.00553, 1],
      [-0.00605, 1],
      [-0.00495, 1],
      [-0.00744, 1],
      [-0.00122, 2],
      [-0.00902, 1],
      [0.00446, 0],
      [-0.00893, 2],
      [-0.00469, 2],
      [-0.00351, 2],
      [-0.00436, 2],
      [-0.00923, 1],
      [-0.00844, 1],
      [-0.00104, 2],
      [-0.00867, 1],
      [-0.00361, 2],
      [-0.00885, 1],
      [-0.00948, 1],
      [-0.0064, 1],
      [-0.0049, 1],
      [-0.00025, 2],
      [-0.00299, 2]
    ],
    "red_o_points": [],
    "y_categories": ["N", "Y", "nan"],
    "blue_o_points": [],
    "blue_x_points": [
      [0.03494, 0],
      [0.00103, 2],
      [0.01315, 0],
      [-0.00468, 1],
      [0.00186, 2],
      [0.00228, 2],
      [0.00272, 2],
      [-0.00445, 1],
      [-0.00252, 1],
      [-0.00386, 1],
      [0.03427, 0],
      [0.00016, 2],
      [0.02488, 0],
      [-0.00497, 1],
      [0.00213, 2],
      [0.00074, 2],
      [-0.00349, 1],
      [0.01443, 0],
      [0.01943, 0],
      [-0.00564, 1],
      [0.00039, 2]
    ]
  },
  "QS_mulNeuromadSite[C6]": {
    "red_x_points": [
      [-0.00443, 1],
      [-0.00264, 0],
      [-0.00067, 0],
      [0.00023, 0],
      [-0.00127, 0],
      [0.00039, 0],
      [6e-5, 2],
      [-0.00544, 1],
      [0.00108, 2],
      [-0.00181, 0],
      [0.00044, 2],
      [-0.00229, 0],
      [0.00022, 2],
      [-0.00013, 0],
      [-0.00661, 1],
      [5e-5, 2],
      [-0.00197, 0],
      [-9e-5, 2],
      [-0.00138, 0],
      [-0.00349, 0],
      [-0.00355, 1],
      [0.00049, 0],
      [0.00037, 2]
    ],
    "red_o_points": [],
    "y_categories": ["N", "NOT APPLICABLE", "nan"],
    "blue_o_points": [],
    "blue_x_points": [
      [0.00177, 2],
      [0.00097, 2],
      [0.00101, 0],
      [0.00147, 0],
      [0.00072, 2],
      [0.00248, 0],
      [0.00177, 0],
      [0.00083, 0],
      [0.00238, 2],
      [0.00817, 1],
      [-0.00119, 0],
      [0.00268, 0],
      [0.00189, 2],
      [0.00068, 2],
      [0.0009, 2],
      [0.00042, 2],
      [0.00228, 2],
      [0.00048, 2],
      [0.00116, 1],
      [0.00107, 2],
      [0.00052, 2]
    ]
  },
  "QA_yonPreFracture": {
    "red_x_points": [
      [-0.03648, 1],
      [0.0009, 2],
      [0.00578, 0],
      [0.00169, 2],
      [0.00627, 0],
      [0.00656, 0],
      [-0.0326, 1],
      [0.00639, 0],
      [0.00112, 2],
      [-0.03771, 1],
      [-0.03966, 1],
      [-0.0318, 1],
      [0.00191, 2],
      [0.00696, 0],
      [0.00722, 0],
      [0.00665, 0],
      [0.00548, 0],
      [0.00969, 0],
      [-0.03966, 1],
      [0.00668, 0],
      [0.00073, 2],
      [-0.02763, 1],
      [0.00101, 2]
    ],
    "red_o_points": [],
    "y_categories": ["N", "Y", "nan"],
    "blue_o_points": [],
    "blue_x_points": [
      [0.01064, 0],
      [0.00519, 2],
      [0.00799, 0],
      [0.00964, 0],
      [0.00504, 2],
      [0.01006, 0],
      [0.00927, 0],
      [0.00736, 2],
      [0.00389, 2],
      [0.01045, 0],
      [0.0121, 0],
      [0.01275, 0],
      [0.01072, 0],
      [0.00765, 0],
      [0.00744, 0],
      [0.00469, 2],
      [0.01191, 0],
      [0.00951, 0],
      [0.00748, 0],
      [0.00323, 2],
      [0.00349, 2]
    ]
  },
  "QA_lstPexTouch[C7]": {
    "red_x_points": [
      [-0.01571, 1],
      [-0.00452, 2],
      [-0.01072, 1],
      [-0.01377, 1],
      [-0.00405, 2],
      [-0.00986, 1],
      [-0.01306, 1],
      [-0.01401, 1],
      [-0.0044, 2],
      [-0.00544, 2],
      [-0.01643, 1],
      [-0.00402, 2],
      [-0.01545, 1],
      [0.01095, 0],
      [-0.01451, 1],
      [-0.01217, 1],
      [-0.0035, 2],
      [0.01071, 0],
      [-0.01138, 1],
      [-0.00447, 2],
      [-0.01716, 1],
      [-0.00949, 1],
      [-0.01735, 1]
    ],
    "red_o_points": [],
    "y_categories": ["NORM", "NPV", "nan"],
    "blue_o_points": [],
    "blue_x_points": [
      [-0.01128, 1],
      [-0.01209, 1],
      [0.02212, 0],
      [-0.00749, 1],
      [0.02696, 0],
      [-0.00777, 1],
      [0.02538, 0],
      [-0.00805, 1],
      [0.00016, 2],
      [0.00284, 2],
      [-0.00104, 2],
      [-0.00806, 1],
      [0.0018, 2],
      [0.02164, 0],
      [0.02058, 0],
      [0.02297, 0],
      [0.00239, 2],
      [0.02101, 0],
      [0.02867, 0],
      [0.02943, 0],
      [0.02965, 0]
    ]
  },
  "QA_lstPexMuscstrength[ShoulderAbduc]": {
    "red_x_points": [
      [-0.0011, 2],
      [0.00018, 1],
      [0.00025, 1],
      [0.00104, 1],
      [6e-5, 1],
      [0.0005, 1],
      [0.00113, 1],
      [-0.01904, 0],
      [-6e-5, 2],
      [-0.00042, 2],
      [-0.00444, 2],
      [-0.00016, 2],
      [0.00029, 1],
      [0.00141, 1],
      [-0.02486, 0],
      [0.00034, 1],
      [7e-5, 1],
      [0.00021, 1],
      [0.00115, 1],
      [0.00059, 1],
      [-0.00089, 2],
      [0.00031, 1],
      [-0.00059, 2]
    ],
    "red_o_points": [],
    "y_categories": ["GREATER THAN OR EQUALS TO 3", "LESS THAN 3", "nan"],
    "blue_o_points": [],
    "blue_x_points": [
      [0.0039, 1],
      [0.00266, 1],
      [0.00342, 1],
      [0.00357, 1],
      [0.00148, 1],
      [0.00506, 1],
      [0.00233, 1],
      [0.00179, 1],
      [0.00028, 2],
      [0.00142, 2],
      [0.00141, 1],
      [0.00183, 2],
      [0.00059, 2],
      [0.00279, 1],
      [0.00288, 1],
      [-0.00112, 2],
      [0.00072, 2],
      [0.00225, 1],
      [0.00534, 1],
      [0.00055, 1],
      [0.00085, 1]
    ]
  },
  "QA_lstPexMuscstrength[ThumbOppo]": {
    "red_x_points": [
      [0.00031, 2],
      [-0.00046, 2],
      [-0.01173, 1],
      [-0.02574, 1],
      [-0.00774, 1],
      [-0.01018, 1],
      [-0.00257, 0],
      [0.00116, 0],
      [0.00034, 2],
      [0.00034, 2],
      [-0.00493, 0],
      [0.00017, 2],
      [-0.00961, 1],
      [0.00369, 0],
      [0.00112, 0],
      [-0.00541, 1],
      [-0.00644, 1],
      [0.00034, 2],
      [0.00312, 0],
      [-0.00728, 1],
      [-0.00066, 2],
      [-0.01111, 1],
      [-0.00195, 2]
    ],
    "red_o_points": [],
    "y_categories": ["GREATER THAN OR EQUALS TO 3", "LESS THAN 3", "nan"],
    "blue_o_points": [],
    "blue_x_points": [
      [0.00331, 1],
      [0.00338, 1],
      [0.00387, 0],
      [0.00704, 0],
      [0.00881, 0],
      [0.00772, 0],
      [0.00564, 0],
      [0.01061, 0],
      [0.00136, 2],
      [0.0015, 2],
      [0.00202, 2],
      [0.00842, 2],
      [0.0016, 2],
      [0.00504, 0],
      [0.00414, 0],
      [0.00662, 0],
      [0.00313, 2],
      [0.00104, 2],
      [0.00582, 0],
      [0.00263, 2],
      [0.00156, 2]
    ]
  },
  "QA_lstPexTouch[T1]": {
    "red_x_points": [
      [-0.01012, 1],
      [-0.00208, 2],
      [-0.00529, 1],
      [0.00357, 0],
      [-0.00304, 2],
      [-0.0062, 1],
      [0.00133, 0],
      [-0.01183, 1],
      [-0.00214, 2],
      [-0.00525, 2],
      [-0.00982, 1],
      [-0.00178, 2],
      [-0.00728, 1],
      [-0.01644, 1],
      [-0.00971, 1],
      [-0.00602, 1],
      [-0.00218, 2],
      [-0.00015, 0],
      [-0.00867, 1],
      [-0.00289, 2],
      [-0.01081, 1],
      [-0.00426, 1],
      [-0.0082, 1]
    ],
    "red_o_points": [],
    "y_categories": ["NORM", "NPV", "nan"],
    "blue_o_points": [],
    "blue_x_points": [
      [-0.00485, 1],
      [-0.0048, 1],
      [0.01327, 0],
      [-0.00299, 1],
      [-0.004, 1],
      [0.01812, 0],
      [0.01814, 0],
      [0.01536, 0],
      [0.00181, 2],
      [0.00376, 2],
      [0.00039, 2],
      [-0.00399, 1],
      [0.00202, 2],
      [0.01095, 0],
      [0.01021, 0],
      [0.01098, 0],
      [0.00261, 2],
      [-0.00519, 1],
      [0.0174, 0],
      [0.01541, 0],
      [0.01466, 0]
    ]
  },
  "QA_equInjTbpiTime": {
    "red_x_points": [
      [-0.01564, 0],
      [-0.01338, 0],
      [0.0022, 3],
      [0.00196, 3],
      [-0.01097, 0],
      [-0.00994, 0],
      [-0.01142, 0],
      [-0.014, 0],
      [0.00151, 3],
      [-0.01428, 0],
      [-0.01425, 0],
      [-0.01251, 0],
      [0.00142, 3],
      [-0.0002, 3],
      [-0.01526, 0],
      [-0.01111, 0],
      [-0.01487, 2],
      [-0.03001, 2],
      [-0.01432, 0],
      [-0.02003, 2],
      [-0.01515, 0],
      [0.00166, 3],
      [0.01368, 1]
    ],
    "red_o_points": [],
    "y_categories": [
      "0 TO 6 MONTHS",
      "13 TO 24 MONTHS",
      "25 MONTHS OR MORE",
      "7 TO 12 MONTHS",
      "nan"
    ],
    "blue_o_points": [],
    "blue_x_points": [
      [-0.00971, 0],
      [0.03129, 1],
      [-0.0088, 0],
      [0.03263, 1],
      [0.00582, 3],
      [-0.00883, 0],
      [-0.00627, 0],
      [0.00588, 3],
      [-0.00914, 0],
      [-0.00065, 2],
      [0.03508, 1],
      [0.00808, 3],
      [0.03139, 1],
      [0.0057, 3],
      [0.02661, 1],
      [0.0259, 1],
      [0.00876, 3],
      [0.0247, 1],
      [0.01299, 3],
      [0.00828, 3],
      [-0.00483, 0]
    ]
  },
  "QA_lstPexKine[Elbow]": {
    "red_x_points": [
      [-2e-5, 1],
      [-0.00037, 2],
      [-0.00284, 2],
      [0.00107, 1],
      [-0.00137, 2],
      [-0.00854, 0],
      [-0.00101, 1],
      [-0.00028, 1],
      [-0.00029, 2],
      [0.00021, 1],
      [-0.00134, 2],
      [-0.00041, 2],
      [-0.00181, 2],
      [-0.00053, 1],
      [-0.00014, 1],
      [-0.003, 0],
      [-0.00072, 2],
      [-0.00113, 2],
      [-0.00349, 2],
      [-0.00062, 2],
      [-0.00047, 2],
      [-0.00581, 0],
      [-0.00145, 2]
    ],
    "red_o_points": [],
    "y_categories": ["NPV", "PV", "nan"],
    "blue_o_points": [],
    "blue_x_points": [
      [0.00725, 0],
      [-0.00073, 2],
      [0.00083, 1],
      [0.00405, 1],
      [-8e-5, 2],
      [0.00533, 1],
      [0.00179, 1],
      [0.00165, 1],
      [-0.00017, 2],
      [-0.00012, 2],
      [-0.00042, 2],
      [0.0067, 1],
      [-0.00016, 2],
      [0.00103, 1],
      [0.00047, 1],
      [0.00299, 0],
      [-0.00026, 2],
      [0.00065, 1],
      [0.0002, 2],
      [0.00228, 1],
      [0.00109, 1]
    ]
  },
  "QS_mulNeuromadSite[C4]": {
    "red_x_points": [
      [-0.0066, 1],
      [-0.00407, 0],
      [-0.00148, 0],
      [0.00084, 0],
      [-0.0022, 0],
      [0.00069, 0],
      [-0.00012, 2],
      [-0.00797, 1],
      [0.00188, 2],
      [-0.00244, 0],
      [0.0006, 2],
      [-0.00353, 0],
      [0.00039, 2],
      [0.00019, 0],
      [-0.01157, 1],
      [0.00029, 2],
      [-0.00265, 0],
      [0.00083, 2],
      [-0.00088, 0],
      [-0.00341, 0],
      [-0.00601, 1],
      [0.0006, 0],
      [0.00028, 2]
    ],
    "red_o_points": [],
    "y_categories": ["N", "NOT APPLICABLE", "nan"],
    "blue_o_points": [],
    "blue_x_points": [
      [0.00199, 2],
      [0.00117, 2],
      [0.00159, 0],
      [0.00286, 0],
      [0.0005, 2],
      [0.00343, 0],
      [0.00202, 0],
      [0.00155, 0],
      [0.00327, 2],
      [0.00938, 1],
      [-0.00107, 0],
      [0.00452, 0],
      [0.00304, 2],
      [0.00121, 2],
      [0.00133, 2],
      [0.00083, 2],
      [0.00317, 2],
      [0.00137, 2],
      [0.0016, 1],
      [0.00138, 2],
      [0.0012, 2]
    ]
  },
  "QS_mulTransfSite[Oberlin]": {
    "red_x_points": [
      [-0.01504, 1],
      [-0.04259, 0],
      [-0.04157, 0],
      [-0.04343, 0],
      [-0.04183, 0],
      [-0.04155, 0],
      [0.01114, 3],
      [-0.01655, 1],
      [0.01292, 3],
      [0.01603, 2],
      [0.01204, 3],
      [-0.03957, 0],
      [0.01222, 3],
      [0.01665, 2],
      [-0.01765, 1],
      [0.01124, 3],
      [-0.04012, 0],
      [0.01222, 3],
      [0.02025, 2],
      [-0.04411, 0],
      [-0.01679, 1],
      [-0.03782, 0],
      [0.01181, 3]
    ],
    "red_o_points": [],
    "y_categories": ["N", "NOT APPLICABLE", "Y", "nan"],
    "blue_o_points": [],
    "blue_x_points": [
      [0.01417, 3],
      [0.0129, 3],
      [0.02042, 2],
      [0.02352, 2],
      [0.01342, 3],
      [0.02505, 2],
      [0.02145, 2],
      [0.02173, 2],
      [0.01501, 3],
      [-0.0053, 1],
      [0.02044, 2],
      [0.02437, 2],
      [0.01385, 3],
      [0.01248, 3],
      [0.01173, 3],
      [0.01204, 3],
      [0.01465, 3],
      [0.01247, 3],
      [-0.00831, 1],
      [0.01345, 3],
      [0.01254, 3]
    ]
  },
  "QA_yonPexPain": {
    "red_x_points": [
      [-0.01436, 1],
      [-0.0164, 1],
      [-0.015, 1],
      [-0.01469, 1],
      [-0.01449, 1],
      [-0.01418, 1],
      [-0.01447, 1],
      [-0.01289, 1],
      [-0.01755, 1],
      [-0.01669, 1],
      [0.01883, 0],
      [-0.01579, 1],
      [-0.0142, 1],
      [-0.01608, 1],
      [0.01852, 0],
      [-0.01467, 1],
      [-0.01391, 1],
      [-0.01728, 1],
      [-0.01576, 1],
      [-0.01543, 1],
      [-0.01458, 1],
      [-0.01302, 1],
      [-0.01812, 1]
    ],
    "red_o_points": [],
    "y_categories": ["N", "Y", "nan"],
    "blue_o_points": [],
    "blue_x_points": [
      [-0.0136, 1],
      [0.03004, 0],
      [0.02438, 0],
      [0.02997, 0],
      [-0.01295, 1],
      [0.02876, 0],
      [-0.01346, 1],
      [-0.01328, 1],
      [-0.01536, 1],
      [0.03891, 2],
      [0.03313, 0],
      [-0.01519, 1],
      [0.02977, 0],
      [0.02498, 0],
      [0.02344, 0],
      [0.02415, 0],
      [0.04258, 2],
      [0.02656, 0],
      [-0.01169, 1],
      [-0.01528, 1],
      [0.03634, 2]
    ]
  },
  "QA_lstPexKine[Index]": {
    "red_x_points": [
      [-0.00029, 1],
      [-0.00047, 2],
      [-0.00357, 2],
      [0.00064, 1],
      [-0.00167, 2],
      [-0.00786, 0],
      [-0.00011, 1],
      [-0.00049, 1],
      [-0.00055, 2],
      [-2e-5, 1],
      [-0.00197, 2],
      [-0.00051, 2],
      [-0.00201, 2],
      [0.00094, 1],
      [0.00018, 1],
      [-0.00325, 0],
      [-0.00066, 2],
      [-0.00159, 2],
      [-0.00441, 2],
      [-0.00059, 2],
      [-0.00058, 2],
      [-0.00538, 0],
      [-0.00173, 2]
    ],
    "red_o_points": [],
    "y_categories": ["NPV", "PV", "nan"],
    "blue_o_points": [],
    "blue_x_points": [
      [0.00635, 0],
      [-0.00067, 2],
      [0.00107, 1],
      [0.00477, 1],
      [-0.0002, 2],
      [0.00476, 1],
      [0.00216, 1],
      [0.00265, 1],
      [-9e-5, 2],
      [-4e-5, 2],
      [-0.00056, 2],
      [0.00639, 1],
      [-0.00012, 2],
      [0.00099, 1],
      [0.00081, 1],
      [0.00327, 0],
      [-0.00015, 2],
      [0.00081, 1],
      [0.0001, 2],
      [0.00249, 1],
      [0.00119, 1]
    ]
  },
  "QA_lstPexPalle[Ulna]": {
    "red_x_points": [
      [-0.00111, 4],
      [-0.00116, 4],
      [-0.00124, 4],
      [-0.03573, 2],
      [-0.00104, 4],
      [-0.00099, 4],
      [-0.01479, 1],
      [0.00691, 3],
      [-0.00147, 4],
      [-0.00134, 4],
      [-0.00192, 4],
      [-0.00103, 4],
      [-0.00143, 4],
      [0.00582, 3],
      [-0.00079, 4],
      [-0.02466, 0],
      [-0.01826, 0],
      [-0.00199, 4],
      [-0.00217, 4],
      [-0.00124, 4],
      [0.0066, 3],
      [-0.01887, 0],
      [-0.00159, 4]
    ],
    "red_o_points": [],
    "y_categories": ["ABS", "HYPO", "NAIA", "PT", "nan"],
    "blue_o_points": [],
    "blue_x_points": [
      [-0.00029, 4],
      [-0.00135, 4],
      [0.00921, 3],
      [0.01449, 1],
      [-0.00077, 4],
      [-2e-5, 4],
      [0.01202, 3],
      [0.01526, 3],
      [-0.00132, 4],
      [-0.00091, 4],
      [-0.00097, 4],
      [0.00016, 4],
      [-0.00121, 4],
      [0.01436, 3],
      [0.01345, 3],
      [0.01429, 3],
      [-0.00123, 4],
      [0.01141, 3],
      [-0.0004, 4],
      [0.01817, 3],
      [-0.00085, 4]
    ]
  }
}
