{
  "QA_lstPexPain[C7]": {
    "red_x_points": [
      [-0.02123, 1],
      [-0.01585, 2],
      [-0.01709, 2],
      [-0.01723, 1],
      [-0.01509, 2],
      [-0.00958, 1],
      [-0.01482, 1],
      [-0.01875, 1],
      [-0.02049, 2],
      [-0.01923, 2],
      [-0.02825, 2],
      [-0.01326, 2],
      [-0.01791, 1],
      [0.02701, 0],
      [-0.01792, 1],
      [-0.01616, 1],
      [-0.01139, 2],
      [-0.02828, 2],
      [-0.03383, 2],
      [-0.02215, 2],
      [-0.02236, 1],
      [-0.00917, 1],
      [-0.02168, 1]
    ],
    "red_o_points": [],
    "y_categories": ["NORM", "NPV", "nan"],
    "blue_o_points": [],
    "blue_x_points": [
      [-0.01375, 1],
      [-0.01324, 1],
      [0.04112, 0],
      [-0.0019, 1],
      [0.05429, 0],
      [-0.00224, 1],
      [0.05035, 0],
      [0.05799, 0],
      [-0.0156, 2],
      [0.00311, 2],
      [-0.01107, 2],
      [-0.00039, 1],
      [-0.01071, 2],
      [0.03733, 0],
      [0.03648, 0],
      [0.0394, 0],
      [-0.01143, 2],
      [0.04174, 0],
      [0.05804, 0],
      [-0.01363, 1],
      [0.05884, 0]
    ]
  },
  "participant_code": {
    "red_x_points": [
      [-0.12704, 0],
      [-0.12442, 2],
      [-0.12403, 3],
      [-0.1248, 4],
      [-0.12509, 5],
      [-0.12451, 9],
      [-0.12179, 14],
      [-0.12529, 17],
      [-0.12238, 19],
      [-0.1249, 20],
      [-0.12344, 22],
      [-0.12344, 23],
      [-0.12529, 24],
      [-0.1249, 26],
      [-0.12568, 28],
      [-0.12325, 29],
      [-0.12587, 31],
      [-0.12228, 35],
      [-0.12354, 37],
      [-0.12607, 39],
      [-0.12208, 41],
      [-0.12364, 42],
      [-0.12636, 43]
    ],
    "red_o_points": [],
    "y_categories": [
      "P16554",
      "P18297",
      "P19283",
      "P19287",
      "P23172",
      "P23391",
      "P30595",
      "P31645",
      "P31691",
      "P34778",
      "P35046",
      "P36328",
      "P43633",
      "P4544",
      "P46417",
      "P48965",
      "P53068",
      "P5497",
      "P58556",
      "P59529",
      "P62483",
      "P64658",
      "P65202",
      "P66816",
      "P67052",
      "P6751",
      "P7408",
      "P75566",
      "P76226",
      "P79971",
      "P82621",
      "P82990",
      "P84549",
      "P84932",
      "P85825",
      "P86989",
      "P8770",
      "P87791",
      "P90550",
      "P93159",
      "P94969",
      "P96710",
      "P9744",
      "P98500",
      "nan"
    ],
    "blue_o_points": [],
    "blue_x_points": [
      [0.13821, 1],
      [0.13688, 6],
      [0.13821, 7],
      [0.1343, 8],
      [0.13502, 10],
      [0.13626, 11],
      [0.13472, 12],
      [0.1342, 13],
      [0.13595, 15],
      [0.13585, 16],
      [0.13574, 18],
      [0.13482, 21],
      [0.13893, 25],
      [0.13996, 27],
      [0.13646, 30],
      [0.13358, 32],
      [0.13718, 33],
      [0.13492, 34],
      [0.13893, 36],
      [0.13667, 38],
      [0.13328, 40]
    ]
  },
  "QA_yonPreFracture": {
    "red_x_points": [
      [-0.06111, 1],
      [-0.00076, 2],
      [0.0078, 0],
      [0.00444, 2],
      [0.00864, 0],
      [0.0082, 0],
      [-0.04523, 1],
      [0.01076, 0],
      [-0.00148, 2],
      [-0.07738, 1],
      [-0.08599, 1],
      [-0.05069, 1],
      [0.00204, 2],
      [0.01256, 0],
      [0.01207, 0],
      [0.00973, 0],
      [0.00771, 0],
      [0.0173, 0],
      [-0.0805, 1],
      [0.00828, 0],
      [-0.0016, 2],
      [-0.03761, 1],
      [-0.0008, 2]
    ],
    "red_o_points": [],
    "y_categories": ["N", "Y", "nan"],
    "blue_o_points": [],
    "blue_x_points": [
      [0.01698, 0],
      [0.01221, 2],
      [0.01688, 0],
      [0.01744, 0],
      [0.01079, 2],
      [0.01953, 0],
      [0.01587, 0],
      [0.02273, 2],
      [0.00572, 2],
      [0.02081, 0],
      [0.02566, 0],
      [0.02871, 0],
      [0.0231, 0],
      [0.01213, 0],
      [0.011, 0],
      [0.01069, 2],
      [0.02329, 0],
      [0.01862, 0],
      [0.01231, 0],
      [0.00365, 2],
      [0.00548, 2]
    ]
  },
  "QS_mulTransfSite[Oberlin]": {
    "red_x_points": [
      [-0.03273, 1],
      [-0.08357, 0],
      [-0.07801, 0],
      [-0.08672, 0],
      [-0.0775, 0],
      [-0.07145, 0],
      [0.02047, 3],
      [-0.03775, 1],
      [0.02674, 3],
      [0.02733, 2],
      [0.02151, 3],
      [-0.07766, 0],
      [0.02051, 3],
      [0.03123, 2],
      [-0.04945, 1],
      [0.02018, 3],
      [-0.07789, 0],
      [0.02094, 3],
      [0.0362, 2],
      [-0.08955, 0],
      [-0.03508, 1],
      [-0.07422, 0],
      [0.02128, 3]
    ],
    "red_o_points": [],
    "y_categories": ["N", "NOT APPLICABLE", "Y", "nan"],
    "blue_o_points": [],
    "blue_x_points": [
      [0.03054, 3],
      [0.02501, 3],
      [0.04058, 2],
      [0.04648, 2],
      [0.02795, 3],
      [0.05075, 2],
      [0.04045, 2],
      [0.04208, 2],
      [0.03457, 3],
      [0.00306, 1],
      [0.03981, 2],
      [0.05164, 2],
      [0.02869, 3],
      [0.02668, 3],
      [0.02464, 3],
      [0.02322, 3],
      [0.02927, 3],
      [0.02216, 3],
      [-0.01194, 1],
      [0.02505, 3],
      [0.02448, 3]
    ]
  },
  "QA_lstPexTouch[C7]": {
    "red_x_points": [
      [-0.02788, 1],
      [-0.00951, 2],
      [-0.01434, 1],
      [-0.01881, 1],
      [-0.00715, 2],
      [-0.01294, 1],
      [-0.02264, 1],
      [-0.02689, 1],
      [-0.00914, 2],
      [-0.01329, 2],
      [-0.0278, 1],
      [-0.00507, 2],
      [-0.02947, 1],
      [0.01853, 0],
      [-0.02581, 1],
      [-0.02391, 1],
      [-0.0035, 2],
      [0.01609, 0],
      [-0.01471, 1],
      [-0.01808, 2],
      [-0.03438, 1],
      [-0.0129, 1],
      [-0.0376, 1]
    ],
    "red_o_points": [],
    "y_categories": ["NORM", "NPV", "nan"],
    "blue_o_points": [],
    "blue_x_points": [
      [-0.02416, 1],
      [-0.02128, 1],
      [0.03984, 0],
      [-0.00976, 1],
      [0.04451, 0],
      [-0.01197, 1],
      [0.04265, 0],
      [-0.00974, 1],
      [0.00079, 2],
      [0.0134, 2],
      [4e-5, 2],
      [-0.01142, 1],
      [0.00586, 2],
      [0.03099, 0],
      [0.02839, 0],
      [0.03321, 0],
      [0.00616, 2],
      [0.02983, 0],
      [0.05525, 0],
      [0.06714, 0],
      [0.05144, 0]
    ]
  },
  "QA_yonPexPain": {
    "red_x_points": [
      [-0.02483, 1],
      [-0.02933, 1],
      [-0.02158, 1],
      [-0.02308, 1],
      [-0.0258, 1],
      [-0.02093, 1],
      [-0.02124, 1],
      [-0.02507, 1],
      [-0.03416, 1],
      [-0.0329, 1],
      [0.02553, 0],
      [-0.02802, 1],
      [-0.02274, 1],
      [-0.02679, 1],
      [0.0277, 0],
      [-0.02412, 1],
      [-0.02579, 1],
      [-0.03389, 1],
      [-0.02572, 1],
      [-0.0264, 1],
      [-0.02681, 1],
      [-0.01795, 1],
      [-0.03913, 1]
    ],
    "red_o_points": [],
    "y_categories": ["N", "Y", "nan"],
    "blue_o_points": [],
    "blue_x_points": [
      [-0.02553, 1],
      [0.055, 0],
      [0.04115, 0],
      [0.04872, 0],
      [-0.01871, 1],
      [0.04907, 0],
      [-0.02277, 1],
      [-0.02103, 1],
      [-0.03198, 1],
      [0.0775, 2],
      [0.06163, 0],
      [-0.02818, 1],
      [0.06209, 0],
      [0.0398, 0],
      [0.0378, 0],
      [0.03736, 0],
      [0.07818, 2],
      [0.04887, 0],
      [-0.01821, 1],
      [-0.02574, 1],
      [0.05802, 2]
    ]
  },
  "QA_lstPexMuscstrength[FingersFlex]": {
    "red_x_points": [
      [0.00413, 2],
      [0.00469, 2],
      [-0.06905, 1],
      [0.02118, 0],
      [-0.06865, 1],
      [-0.06401, 1],
      [-0.07842, 1],
      [0.02145, 0],
      [0.00669, 2],
      [0.00468, 2],
      [0.02216, 0],
      [0.00443, 2],
      [-0.08534, 1],
      [0.02223, 0],
      [0.02033, 0],
      [-0.0831, 1],
      [-0.06521, 1],
      [0.0074, 2],
      [0.02006, 0],
      [0.01437, 0],
      [0.00355, 2],
      [-0.06477, 1],
      [0.00398, 2]
    ],
    "red_o_points": [],
    "y_categories": ["GREATER THAN OR EQUALS TO 3", "LESS THAN 3", "nan"],
    "blue_o_points": [],
    "blue_x_points": [
      [0.03473, 0],
      [0.02937, 0],
      [0.01957, 0],
      [0.02166, 0],
      [0.03052, 0],
      [0.02327, 0],
      [0.02262, 0],
      [0.02428, 0],
      [0.00777, 2],
      [0.01044, 2],
      [0.0103, 2],
      [0.01315, 2],
      [0.01113, 2],
      [0.02658, 0],
      [0.02472, 0],
      [0.02474, 0],
      [0.01417, 2],
      [0.00881, 2],
      [0.02302, 0],
      [0.00977, 2],
      [0.00659, 2]
    ]
  },
  "QA_lstPexTouch[C8]": {
    "red_x_points": [
      [0.01224, 0],
      [-0.00942, 2],
      [-0.01874, 1],
      [-0.03345, 1],
      [-0.00695, 2],
      [-0.01175, 1],
      [-0.01857, 1],
      [-0.02209, 1],
      [-0.01012, 2],
      [-0.00961, 2],
      [-0.02447, 1],
      [-0.00429, 2],
      [-0.03214, 1],
      [0.02609, 0],
      [-0.02232, 1],
      [-0.02001, 1],
      [-0.00308, 2],
      [0.01174, 0],
      [-0.01794, 1],
      [-0.022, 2],
      [-0.02712, 1],
      [-0.01693, 1],
      [-0.03608, 1]
    ],
    "red_o_points": [],
    "y_categories": ["NORM", "NPV", "nan"],
    "blue_o_points": [],
    "blue_x_points": [
      [-0.02108, 1],
      [-0.02248, 1],
      [0.02926, 0],
      [-0.00995, 1],
      [0.04483, 0],
      [-0.0129, 1],
      [0.03452, 0],
      [0.04633, 0],
      [-0.00027, 2],
      [0.00715, 2],
      [0.00071, 2],
      [-0.01271, 1],
      [0.00507, 2],
      [0.0295, 0],
      [0.02292, 0],
      [0.03008, 0],
      [0.00501, 2],
      [0.01972, 0],
      [0.03622, 0],
      [0.0505, 0],
      [0.03456, 0]
    ]
  },
  "QA_equInjTbpiTime": {
    "red_x_points": [
      [-0.03205, 0],
      [-0.02328, 0],
      [0.00348, 3],
      [0.00149, 3],
      [-0.01915, 0],
      [-0.01429, 0],
      [-0.01434, 0],
      [-0.03029, 0],
      [0.00342, 3],
      [-0.02704, 0],
      [-0.02459, 0],
      [-0.02283, 0],
      [0.0026, 3],
      [0.00314, 3],
      [-0.03212, 0],
      [-0.01662, 0],
      [-0.02543, 2],
      [-0.07382, 2],
      [-0.02099, 0],
      [-0.04465, 2],
      [-0.03042, 0],
      [0.00401, 3],
      [0.01377, 1]
    ],
    "red_o_points": [],
    "y_categories": [
      "0 TO 6 MONTHS",
      "13 TO 24 MONTHS",
      "25 MONTHS OR MORE",
      "7 TO 12 MONTHS",
      "nan"
    ],
    "blue_o_points": [],
    "blue_x_points": [
      [-0.01785, 0],
      [0.05169, 1],
      [-0.01227, 0],
      [0.05859, 1],
      [0.01006, 3],
      [-0.01893, 0],
      [-0.00932, 0],
      [0.00887, 3],
      [-0.01682, 0],
      [0.0142, 2],
      [0.06524, 1],
      [0.02229, 3],
      [0.06203, 1],
      [0.01127, 3],
      [0.04689, 1],
      [0.043, 1],
      [0.017, 3],
      [0.04091, 1],
      [0.02974, 3],
      [0.01972, 3],
      [-0.00632, 0]
    ]
  }
}
