{
  "QA_lstPexMuscstrength[ElbowFlex]": {
    "red_x_points": [
      [-0.00369, 1],
      [0.0003, 2],
      [-0.00195, 1],
      [-0.00212, 1],
      [0.00122, 0],
      [-0.0019, 1],
      [-0.00177, 1],
      [-0.00399, 1],
      [-0.00207, 1],
      [-0.00206, 1],
      [-0.00164, 1],
      [-0.00368, 1],
      [0.0006, 2],
      [0.0027, 2],
      [0.00027, 2],
      [-0.00379, 1],
      [0.00033, 2],
      [0.00131, 0],
      [-0.00375, 1],
      [-0.00361, 1],
      [-0.00374, 1],
      [-0.00198, 1],
      [0.00294, 2],
      [0.00139, 0],
      [-0.00402, 1],
      [-0.00183, 1],
      [-0.00349, 1],
      [-0.00179, 1],
      [-0.00351, 1],
      [0.00039, 2],
      [-0.00175, 1]
    ],
    "red_o_points": [],
    "y_categories": ["GREATER THAN OR EQUALS TO 3", "LESS THAN 3", "nan"],
    "blue_o_points": [],
    "blue_x_points": [
      [0.00056, 2],
      [0.00429, 2],
      [0.00472, 0],
      [0.0008, 1],
      [0.00469, 2],
      [0.00605, 0],
      [0.00677, 0]
    ]
  },
  "QS_mulLysisTrunk[Upper]": {
    "red_x_points": [
      [-0.00203, 3],
      [-0.00318, 0],
      [-0.0035, 0],
      [-0.00331, 0],
      [-0.00293, 0],
      [-0.00663, 2],
      [-0.00329, 0],
      [-0.00187, 3],
      [-0.00302, 0],
      [-0.00294, 0],
      [-0.00353, 0],
      [-0.00172, 3],
      [0.00825, 1],
      [-0.0017, 3],
      [-0.00312, 0],
      [-0.00199, 3],
      [-0.00575, 2],
      [-0.00346, 0],
      [-0.0017, 3],
      [-0.00194, 3],
      [-0.00156, 3],
      [-0.00318, 0],
      [-0.00182, 3],
      [-0.00209, 3],
      [-0.00204, 3],
      [-0.00334, 0],
      [-0.00179, 3],
      [-0.00339, 0],
      [-0.0016, 3],
      [0.00877, 1],
      [-0.00544, 2]
    ],
    "red_o_points": [],
    "y_categories": ["N", "NOT APPLICABLE", "Y", "nan"],
    "blue_o_points": [],
    "blue_x_points": [
      [0.01367, 1],
      [-0.00063, 3],
      [0.01062, 1],
      [-0.00081, 0],
      [-0.00056, 3],
      [0.00967, 1],
      [0.01027, 1]
    ]
  },
  "QS_mulBpsurgeryType[Transf]": {
    "red_x_points": [
      [-0.00025, 3],
      [-0.00041, 2],
      [-0.00117, 0],
      [-0.00049, 2],
      [-0.00051, 2],
      [-0.00043, 2],
      [-0.00045, 2],
      [-0.00037, 3],
      [-0.00042, 2],
      [-0.00046, 2],
      [-0.00036, 2],
      [-0.00039, 3],
      [0.00139, 1],
      [-0.00033, 3],
      [-0.00035, 2],
      [-0.00049, 3],
      [-0.00037, 2],
      [-0.00036, 2],
      [-0.00032, 3],
      [-0.00041, 3],
      [-0.00031, 3],
      [-0.00037, 2],
      [-0.00043, 3],
      [-0.00037, 3],
      [-0.00029, 3],
      [-0.00049, 2],
      [-0.00031, 3],
      [-0.00034, 2],
      [-0.00028, 3],
      [0.00136, 1],
      [-0.00037, 2]
    ],
    "red_o_points": [],
    "y_categories": ["N", "NOT APPLICABLE", "Y", "nan"],
    "blue_o_points": [],
    "blue_x_points": [
      [0.00142, 1],
      [-0.00021, 3],
      [0.00131, 1],
      [-0.00052, 2],
      [-7e-5, 3],
      [0.00181, 1],
      [0.00185, 1]
    ]
  },
  "QS_mulNeuromadSite[T1]": {
    "red_x_points": [
      [-0.00123, 2],
      [-0.00414, 0],
      [-0.00473, 0],
      [-0.00425, 0],
      [-0.00447, 0],
      [-0.00406, 0],
      [-0.00403, 0],
      [-0.00151, 2],
      [-0.00465, 0],
      [-0.00446, 0],
      [-0.00442, 0],
      [-0.00143, 2],
      [0.00682, 1],
      [-0.00129, 2],
      [-0.00441, 0],
      [-0.00177, 2],
      [-0.00436, 0],
      [-0.0039, 0],
      [-0.00134, 2],
      [-0.0012, 2],
      [-0.00131, 2],
      [-0.00358, 0],
      [-0.00138, 2],
      [-0.00164, 2],
      [-0.00175, 2],
      [-0.00422, 0],
      [-0.00144, 2],
      [-0.00447, 0],
      [-0.00131, 2],
      [0.0086, 1],
      [-0.00395, 0]
    ],
    "red_o_points": [],
    "y_categories": ["N", "NOT APPLICABLE", "nan"],
    "blue_o_points": [],
    "blue_x_points": [
      [0.01401, 1],
      [-2e-5, 2],
      [0.00928, 1],
      [-0.00018, 0],
      [0.00046, 2],
      [0.01033, 1],
      [0.01032, 1]
    ]
  },
  "QS_mulNeuromadSite[T2]": {
    "red_x_points": [
      [-0.00157, 2],
      [-0.00495, 0],
      [-0.00568, 0],
      [-0.00447, 0],
      [-0.00517, 0],
      [-0.00422, 0],
      [-0.00441, 0],
      [-0.00154, 2],
      [-0.00465, 0],
      [-0.0047, 0],
      [-0.00456, 0],
      [-0.00184, 2],
      [0.00841, 1],
      [-0.00119, 2],
      [-0.00506, 0],
      [-0.00173, 2],
      [-0.00464, 0],
      [-0.00555, 0],
      [-0.00161, 2],
      [-0.00143, 2],
      [-0.00139, 2],
      [-0.00444, 0],
      [-0.00148, 2],
      [-0.00285, 2],
      [-0.00155, 2],
      [-0.00471, 0],
      [-0.00147, 2],
      [-0.00545, 0],
      [-0.00121, 2],
      [0.00862, 1],
      [-0.00429, 0]
    ],
    "red_o_points": [],
    "y_categories": ["N", "NOT APPLICABLE", "nan"],
    "blue_o_points": [],
    "blue_x_points": [
      [0.01522, 1],
      [0.00056, 2],
      [0.01225, 1],
      [5e-5, 0],
      [0.00067, 2],
      [0.01153, 1],
      [0.01271, 1]
    ]
  },
  "QA_yonInjUnconscio": {
    "red_x_points": [
      [-0.00299, 1],
      [-0.00401, 1],
      [-0.00162, 2],
      [-0.00163, 2],
      [0.00684, 0],
      [-0.00405, 1],
      [-0.00207, 2],
      [-0.00419, 2],
      [-0.00227, 2],
      [-0.00134, 2],
      [-0.00392, 1],
      [-0.00383, 1],
      [-0.02177, 1],
      [-0.00419, 2],
      [-0.00235, 2],
      [-0.00355, 2],
      [-0.0037, 1],
      [0.00768, 0],
      [-0.00328, 1],
      [-0.00281, 1],
      [-0.00281, 1],
      [-0.0033, 1],
      [-0.0039, 2],
      [-0.00592, 1],
      [-0.00329, 2],
      [-0.00408, 1],
      [0.0081, 0],
      [-0.00343, 1],
      [-0.00404, 2],
      [-0.00042, 2],
      [-0.0034, 1]
    ],
    "red_o_points": [],
    "y_categories": ["N", "Y", "nan"],
    "blue_o_points": [],
    "blue_x_points": [
      [0.00128, 2],
      [-0.0002, 1],
      [0.012, 0],
      [0.01759, 0],
      [0.01864, 0],
      [0.00197, 2],
      [0.00175, 2]
    ]
  },
  "QS_mulGraftRoot[T1]": {
    "red_x_points": [
      [-2e-5, 2],
      [-5e-5, 0],
      [-5e-5, 0],
      [-5e-5, 0],
      [-5e-5, 0],
      [-2e-5, 2],
      [-5e-5, 0],
      [-2e-5, 2],
      [0.00012, 1],
      [-2e-5, 2],
      [-5e-5, 0],
      [-2e-5, 2],
      [-5e-5, 0],
      [-5e-5, 0],
      [-2e-5, 2],
      [-2e-5, 2],
      [-2e-5, 2],
      [-5e-5, 0],
      [-2e-5, 2],
      [-2e-5, 2],
      [-5e-5, 0],
      [-2e-5, 2],
      [-2e-5, 2]
    ],
    "red_o_points": [],
    "y_categories": ["N", "NOT APPLICABLE", "nan"],
    "blue_o_points": [],
    "blue_x_points": [[-2e-5, 2], [0.00012, 1], [-2e-5, 2], [0.00012, 1]]
  },
  "QS_mulGraftTrunk[MiddleTrunk]": {
    "red_x_points": [
      [-1e-5, 2],
      [-1e-5, 0],
      [-1e-5, 0],
      [-1e-5, 0],
      [-1e-5, 0],
      [-1e-5, 0],
      [-1e-5, 0],
      [-1e-5, 0],
      [-1e-5, 0],
      [-1e-5, 2],
      [-1e-5, 0],
      [-1e-5, 2],
      [-1e-5, 0],
      [-1e-5, 2],
      [-1e-5, 2],
      [-1e-5, 2],
      [-1e-5, 2],
      [-1e-5, 2]
    ],
    "red_o_points": [],
    "y_categories": ["N", "NOT APPLICABLE", "nan"],
    "blue_o_points": [],
    "blue_x_points": [[0.00019, 1]]
  },
  "QS_mulGraftNerve[Ac]": {
    "red_x_points": [
      [-0.00042, 2],
      [-0.00127, 0],
      [-0.00106, 0],
      [-0.0011, 0],
      [-0.00112, 0],
      [-0.00103, 0],
      [-0.00116, 0],
      [-0.00028, 2],
      [-0.00102, 0],
      [-0.00099, 0],
      [-0.00095, 0],
      [-0.00038, 2],
      [0.00136, 1],
      [-0.00014, 2],
      [-0.00112, 0],
      [-0.00047, 2],
      [-0.0012, 0],
      [-0.00145, 0],
      [-0.00035, 2],
      [-0.00033, 2],
      [-0.0002, 2],
      [-0.00083, 0],
      [-0.00017, 2],
      [-0.00029, 2],
      [-0.00031, 2],
      [-0.00103, 0],
      [-0.0003, 2],
      [-0.00102, 0],
      [-0.00012, 2],
      [0.00162, 1],
      [-0.00088, 0]
    ],
    "red_o_points": [],
    "y_categories": ["N", "NOT APPLICABLE", "nan"],
    "blue_o_points": [],
    "blue_x_points": [
      [0.00365, 1],
      [0.0003, 2],
      [0.00247, 1],
      [-5e-5, 0],
      [0.00012, 2],
      [0.00246, 1],
      [0.00277, 1]
    ]
  },
  "QS_mulGraftNerve[Me]": {
    "red_x_points": [
      [-0.00032, 2],
      [-0.00063, 0],
      [-0.00053, 0],
      [-0.00057, 0],
      [-0.00068, 0],
      [-0.00061, 0],
      [-0.00062, 0],
      [-0.00019, 2],
      [-0.00064, 0],
      [-0.00067, 0],
      [-0.00064, 0],
      [-0.00029, 2],
      [0.00117, 1],
      [-0.00026, 2],
      [-0.00077, 0],
      [-0.00034, 2],
      [-0.0005, 0],
      [-0.00079, 0],
      [-0.00016, 2],
      [-0.00033, 2],
      [-0.00015, 2],
      [-0.00065, 0],
      [-0.00037, 2],
      [-0.00026, 2],
      [-0.00033, 2],
      [-0.0008, 0],
      [-0.00025, 2],
      [-0.00072, 0],
      [-0.00026, 2],
      [0.00092, 1],
      [-0.00069, 0]
    ],
    "red_o_points": [],
    "y_categories": ["N", "NOT APPLICABLE", "nan"],
    "blue_o_points": [],
    "blue_x_points": [
      [0.00309, 1],
      [-1e-5, 2],
      [0.00175, 1],
      [-5e-5, 0],
      [0.0, 2],
      [0.0014, 1],
      [0.00185, 1]
    ]
  },
  "QS_mulNeuromadSite[C8]": {
    "red_x_points": [
      [-0.00128, 2],
      [-0.00336, 0],
      [-0.00404, 0],
      [-0.00329, 0],
      [-0.00339, 0],
      [-0.00358, 0],
      [-0.00333, 0],
      [-0.0012, 2],
      [-0.00305, 0],
      [-0.0033, 0],
      [-0.00318, 0],
      [-0.00173, 2],
      [0.00619, 1],
      [-0.00127, 2],
      [-0.00347, 0],
      [-0.00143, 2],
      [-0.00354, 0],
      [-0.00315, 0],
      [-0.00134, 2],
      [-0.00111, 2],
      [-0.00135, 2],
      [-0.00296, 0],
      [-0.00131, 2],
      [-0.00104, 2],
      [-0.00168, 2],
      [-0.00306, 0],
      [-0.00114, 2],
      [-0.00299, 0],
      [-0.00105, 2],
      [0.00659, 1],
      [-0.00317, 0]
    ],
    "red_o_points": [],
    "y_categories": ["N", "NOT APPLICABLE", "nan"],
    "blue_o_points": [],
    "blue_x_points": [
      [0.01225, 1],
      [-6e-5, 2],
      [0.00785, 1],
      [-0.0005, 0],
      [-0.00022, 2],
      [0.00721, 1],
      [0.0101, 1]
    ]
  },
  "QS_mulGraftNerve[Ph]": {
    "red_x_points": [
      [-0.00046, 2],
      [-0.00112, 0],
      [-0.00128, 0],
      [-0.00103, 0],
      [-0.00128, 0],
      [-0.00099, 0],
      [-0.00112, 0],
      [-0.00016, 2],
      [-0.00114, 0],
      [-0.00119, 0],
      [-0.00119, 0],
      [-0.00028, 2],
      [0.00195, 1],
      [-0.00028, 2],
      [-0.00092, 0],
      [-0.00032, 2],
      [-0.00114, 0],
      [-0.00121, 0],
      [-0.00044, 2],
      [-0.00038, 2],
      [-0.00026, 2],
      [-0.00083, 0],
      [-0.0003, 2],
      [-0.00048, 2],
      [-0.00039, 2],
      [-0.00084, 0],
      [-0.00029, 2],
      [-0.00112, 0],
      [-0.00031, 2],
      [0.00214, 1],
      [-0.00106, 0]
    ],
    "red_o_points": [],
    "y_categories": ["N", "NOT APPLICABLE", "nan"],
    "blue_o_points": [],
    "blue_x_points": [
      [0.00334, 1],
      [2e-5, 2],
      [0.00312, 1],
      [-0.00019, 0],
      [-6e-5, 2],
      [0.00256, 1],
      [0.00254, 1]
    ]
  },
  "QS_mulTransfSite[AcSsPA]": {
    "red_x_points": [
      [-0.00069, 3],
      [-0.00135, 0],
      [-0.00129, 0],
      [-0.00136, 0],
      [-0.00135, 0],
      [-0.00137, 0],
      [-0.00145, 0],
      [-0.00084, 3],
      [-0.00131, 0],
      [-0.00145, 0],
      [-0.00116, 0],
      [-0.00067, 3],
      [0.00399, 1],
      [-0.00085, 3],
      [-0.00134, 0],
      [-0.00079, 3],
      [-0.00292, 2],
      [-0.00132, 0],
      [-0.00079, 3],
      [-0.00077, 3],
      [-0.0006, 3],
      [-0.00152, 0],
      [-0.00074, 3],
      [-0.0008, 3],
      [-0.00083, 3],
      [-0.00143, 0],
      [-0.00073, 3],
      [-0.00131, 0],
      [-0.00083, 3],
      [0.00365, 1],
      [-0.00122, 0]
    ],
    "red_o_points": [],
    "y_categories": ["N", "NOT APPLICABLE", "Y", "nan"],
    "blue_o_points": [],
    "blue_x_points": [
      [0.00522, 1],
      [-0.00035, 3],
      [0.00389, 1],
      [-0.0008, 0],
      [-0.00034, 3],
      [0.00416, 1],
      [0.00443, 1]
    ]
  },
  "QA_lstPexMuscstrength[ScapulaAbducSuprot]": {
    "red_x_points": [
      [-0.00052, 0],
      [0.00011, 2],
      [-0.00021, 1],
      [-0.00022, 1],
      [-7e-5, 0],
      [-0.00028, 1],
      [-0.00028, 1],
      [-0.00042, 1],
      [-0.00021, 0],
      [-0.00011, 0],
      [-0.00022, 1],
      [-0.00088, 1],
      [0.00011, 2],
      [0.00038, 2],
      [7e-5, 2],
      [0.00039, 2],
      [3e-5, 2],
      [-0.00024, 0],
      [-0.0002, 0],
      [-0.00051, 1],
      [-0.00045, 0],
      [-0.00023, 1],
      [0.00015, 2],
      [-0.00047, 0],
      [9e-5, 2],
      [-0.00045, 1],
      [-0.00067, 1],
      [-6e-5, 0],
      [0.00032, 2],
      [0.00013, 2],
      [-0.00015, 1]
    ],
    "red_o_points": [],
    "y_categories": ["GREATER THAN OR EQUALS TO 3", "LESS THAN 3", "nan"],
    "blue_o_points": [],
    "blue_x_points": [
      [0.00011, 2],
      [0.00074, 2],
      [9e-5, 0],
      [0.00101, 2],
      [0.00063, 2],
      [9e-5, 0],
      [7e-5, 2]
    ]
  },
  "participant_code": {
    "red_x_points": [
      [-0.01652, 1],
      [-0.01717, 2],
      [-0.01712, 3],
      [-0.01722, 4],
      [-0.0161, 5],
      [-0.0175, 6],
      [-0.0168, 7],
      [-0.01656, 8],
      [-0.01726, 9],
      [-0.01722, 10],
      [-0.01834, 11],
      [-0.0174, 12],
      [-0.01684, 14],
      [-0.01703, 16],
      [-0.01675, 17],
      [-0.01661, 19],
      [-0.01684, 20],
      [-0.01726, 22],
      [-0.01726, 23],
      [-0.01689, 25],
      [-0.01661, 26],
      [-0.0174, 27],
      [-0.0168, 28],
      [-0.01726, 29],
      [-0.01759, 30],
      [-0.01694, 32],
      [-0.01666, 33],
      [-0.01759, 34],
      [-0.01689, 35],
      [-0.01768, 36],
      [-0.01801, 37]
    ],
    "red_o_points": [],
    "y_categories": [
      "P16554",
      "P18297",
      "P19283",
      "P19287",
      "P23391",
      "P31645",
      "P31691",
      "P34778",
      "P35046",
      "P36328",
      "P43633",
      "P4544",
      "P46417",
      "P48965",
      "P53068",
      "P5497",
      "P59529",
      "P62483",
      "P64658",
      "P65202",
      "P66816",
      "P6751",
      "P7408",
      "P75566",
      "P76226",
      "P79971",
      "P82621",
      "P82990",
      "P84932",
      "P85825",
      "P86989",
      "P8770",
      "P87791",
      "P90550",
      "P93159",
      "P94969",
      "P96710",
      "P9744",
      "nan"
    ],
    "blue_o_points": [],
    "blue_x_points": [
      [0.0509, 0],
      [0.04936, 13],
      [0.05166, 15],
      [0.04829, 18],
      [0.05289, 21],
      [0.04921, 24],
      [0.0486, 31]
    ]
  },
  "QA_lstPexMuscstrength[ShoulderExrot]": {
    "red_x_points": [
      [-0.00194, 1],
      [0.00026, 2],
      [0.00175, 0],
      [-0.00182, 1],
      [-0.00207, 1],
      [-0.0016, 1],
      [0.00042, 2],
      [-0.00171, 1],
      [-0.00171, 1],
      [-0.00159, 1],
      [0.00037, 2],
      [-0.00174, 1],
      [6e-5, 2],
      [0.00045, 2],
      [0.00031, 2],
      [0.00063, 2],
      [0.00028, 2],
      [-0.00218, 1],
      [-0.00143, 1],
      [-0.00192, 1],
      [-0.00191, 1],
      [0.00026, 2],
      [0.00043, 2],
      [0.00038, 2],
      [0.00035, 2],
      [-0.00177, 1],
      [0.00046, 2],
      [0.00229, 0],
      [0.00042, 2],
      [-3e-5, 2],
      [-0.00154, 1]
    ],
    "red_o_points": [],
    "y_categories": ["GREATER THAN OR EQUALS TO 3", "LESS THAN 3", "nan"],
    "blue_o_points": [],
    "blue_x_points": [
      [0.00028, 2],
      [0.00045, 2],
      [0.00388, 0],
      [0.00084, 2],
      [0.0005, 2],
      [0.00311, 0],
      [7e-5, 1]
    ]
  },
  "QA_mulInjOrthesisType[ArmSling]": {
    "red_x_points": [
      [-0.01097, 2],
      [-0.01032, 2],
      [-0.00985, 2],
      [-0.0096, 2],
      [-0.00994, 2],
      [-0.01005, 2],
      [-0.01045, 2],
      [-0.01039, 2],
      [-0.01002, 2],
      [-0.00933, 2],
      [-0.00976, 2],
      [-0.01088, 2],
      [0.02786, 1],
      [-0.01048, 2],
      [-0.00971, 2],
      [-0.01101, 2],
      [-0.01174, 0],
      [-0.00993, 2],
      [-0.01024, 2],
      [-0.01035, 2],
      [-0.01214, 0],
      [-0.012, 3],
      [-0.01037, 2],
      [0.02876, 1],
      [-0.01109, 2],
      [-0.00998, 2],
      [-0.01053, 2],
      [-0.01032, 2],
      [-0.01246, 3],
      [-0.01685, 3],
      [-0.00933, 2]
    ],
    "red_o_points": [],
    "y_categories": ["N", "NOT APPLICABLE", "Y", "nan"],
    "blue_o_points": [],
    "blue_x_points": [
      [-0.00436, 2],
      [0.0281, 1],
      [0.02553, 1],
      [0.03365, 1],
      [0.02931, 1],
      [0.02515, 1],
      [0.02663, 1]
    ]
  },
  "QS_mulGraftNerve[Ul]": {
    "red_x_points": [
      [-0.00027, 2],
      [-0.00058, 0],
      [-0.00044, 0],
      [-0.00037, 0],
      [-0.00046, 0],
      [-0.0005, 0],
      [-0.00049, 0],
      [-0.00018, 2],
      [-0.00043, 0],
      [-0.00055, 0],
      [-0.00028, 0],
      [-0.00024, 2],
      [0.00045, 1],
      [-0.00012, 2],
      [-0.00054, 0],
      [-0.00025, 2],
      [-0.0005, 0],
      [-0.00051, 0],
      [-0.00031, 2],
      [-0.00027, 2],
      [-0.00025, 2],
      [-0.00045, 0],
      [-0.00021, 2],
      [-0.00019, 2],
      [-0.00038, 2],
      [-0.00041, 0],
      [-0.00022, 2],
      [-0.00042, 0],
      [-0.00016, 2],
      [0.00114, 1],
      [-0.00039, 0]
    ],
    "red_o_points": [],
    "y_categories": ["N", "NOT APPLICABLE", "nan"],
    "blue_o_points": [],
    "blue_x_points": [
      [0.00155, 1],
      [-7e-5, 2],
      [0.00142, 1],
      [0.0001, 0],
      [-7e-5, 2],
      [0.00125, 1],
      [0.00156, 1]
    ]
  },
  "QA_lstPexPain[C6]": {
    "red_x_points": [
      [-0.00047, 1],
      [-6e-5, 2],
      [1e-5, 2],
      [-3e-5, 2],
      [-0.00097, 0],
      [2e-5, 1],
      [4e-5, 1],
      [-0.00095, 0],
      [0.0001, 1],
      [0.00015, 1],
      [4e-5, 1],
      [-0.00016, 1],
      [-0.00069, 2],
      [0.00046, 2],
      [-0.00015, 2],
      [9e-5, 2],
      [-1e-5, 2],
      [0.0001, 1],
      [-0.00057, 0],
      [-0.00039, 1],
      [-0.00037, 1],
      [-2e-5, 2],
      [0.00018, 2],
      [-0.00591, 0],
      [0.00044, 2],
      [-0.00017, 2],
      [-0.00066, 1],
      [-9e-5, 2],
      [-0.00063, 1],
      [2e-5, 1]
    ],
    "red_o_points": [],
    "y_categories": ["NORM", "NPV", "nan"],
    "blue_o_points": [],
    "blue_x_points": [
      [0.00021, 1],
      [0.00091, 2],
      [0.00107, 1],
      [0.00155, 1],
      [0.00059, 2],
      [0.0011, 1],
      [0.0011, 1]
    ]
  },
  "QS_mulGraftLevel[Nerve]": {
    "red_x_points": [
      [-1e-5, 2],
      [-1e-5, 0],
      [-1e-5, 0],
      [-1e-5, 0],
      [-1e-5, 0],
      [-1e-5, 0],
      [-1e-5, 0],
      [-1e-5, 0],
      [-1e-5, 0],
      [-1e-5, 2],
      [-1e-5, 2],
      [-1e-5, 0],
      [-1e-5, 2],
      [-1e-5, 2],
      [-1e-5, 2],
      [-1e-5, 2],
      [-1e-5, 0],
      [-1e-5, 0]
    ],
    "red_o_points": [],
    "y_categories": ["N", "NOT APPLICABLE", "nan"],
    "blue_o_points": [],
    "blue_x_points": [[0.00019, 1]]
  },
  "QS_mulGraftNerve[MCA]": {
    "red_x_points": [
      [-7e-5, 2],
      [-0.00011, 0],
      [-0.00011, 0],
      [-8e-5, 0],
      [-8e-5, 0],
      [-0.00012, 0],
      [-0.00015, 0],
      [-0.0001, 2],
      [-0.00011, 0],
      [-0.00011, 0],
      [-6e-5, 0],
      [-7e-5, 2],
      [9e-5, 1],
      [-2e-5, 2],
      [-6e-5, 0],
      [-9e-5, 2],
      [-8e-5, 0],
      [-2e-5, 0],
      [-7e-5, 2],
      [-7e-5, 2],
      [-7e-5, 2],
      [-6e-5, 0],
      [-7e-5, 2],
      [-5e-5, 2],
      [-9e-5, 2],
      [-0.00012, 0],
      [-4e-5, 2],
      [-0.00012, 0],
      [-7e-5, 2],
      [0.00041, 1],
      [-0.00011, 0]
    ],
    "red_o_points": [],
    "y_categories": ["N", "NOT APPLICABLE", "nan"],
    "blue_o_points": [],
    "blue_x_points": [
      [0.00036, 1],
      [-5e-5, 2],
      [0.00021, 1],
      [-3e-5, 0],
      [-4e-5, 2],
      [0.00029, 1],
      [0.00047, 1]
    ]
  },
  "QA_lstPexInspectio[SurgicalScar]": {
    "red_x_points": [
      [0.00198, 1],
      [0.00106, 1],
      [0.00044, 0],
      [0.00117, 1],
      [-0.00463, 2],
      [0.00023, 0],
      [0.00122, 1],
      [0.00199, 1],
      [0.00096, 1],
      [-0.00325, 2],
      [0.00096, 1],
      [-0.00184, 0],
      [-0.00105, 1],
      [-0.00544, 2],
      [0.00113, 1],
      [0.00233, 1],
      [-0.00077, 0],
      [-0.00394, 2],
      [-0.00497, 2],
      [-0.00457, 2],
      [0.00171, 1],
      [0.00088, 1],
      [-0.00509, 2],
      [-0.01282, 2],
      [0.00214, 1],
      [0.00097, 1],
      [-0.00487, 2],
      [-0.00311, 2],
      [0.00182, 1],
      [-0.00062, 1],
      [-0.00298, 2]
    ],
    "red_o_points": [],
    "y_categories": ["ABS", "NAIA", "PT", "nan"],
    "blue_o_points": [],
    "blue_x_points": [
      [0.00024, 1],
      [0.00395, 1],
      [0.00555, 0],
      [0.0038, 1],
      [0.00502, 1],
      [0.00023, 1],
      [0.00559, 0]
    ]
  },
  "QA_intPexWristFlex": {
    "red_x_points": [[0.00066, 2], [-0.00017, 1], [-0.01681, 1]],
    "red_o_points": [],
    "y_categories": ["GREATER THAN OR EQUALS TO 60", "LESS THAN 60", "nan"],
    "blue_o_points": [],
    "blue_x_points": [
      [0.00144, 2],
      [0.00642, 0],
      [3e-5, 2],
      [3e-5, 2],
      [0.00155, 2],
      [0.00164, 2]
    ]
  },
  "QS_mulGraftTrunk[LowerTrunk]": {
    "red_x_points": [
      [-1e-5, 2],
      [-0.00014, 0],
      [-0.00014, 0],
      [-0.00014, 0],
      [-9e-5, 0],
      [-0.00014, 0],
      [-0.00014, 0],
      [-3e-5, 2],
      [-0.00014, 0],
      [-5e-5, 0],
      [-5e-5, 0],
      [-3e-5, 2],
      [0.00035, 1],
      [-3e-5, 2],
      [-5e-5, 0],
      [-3e-5, 2],
      [-5e-5, 0],
      [-5e-5, 0],
      [-3e-5, 2],
      [-3e-5, 2],
      [-3e-5, 2],
      [-0.00014, 0],
      [-1e-5, 2],
      [-1e-5, 2],
      [-1e-5, 2],
      [-9e-5, 0],
      [-3e-5, 2],
      [-9e-5, 0],
      [-3e-5, 2],
      [-0.00014, 0]
    ],
    "red_o_points": [],
    "y_categories": ["N", "NOT APPLICABLE", "nan"],
    "blue_o_points": [],
    "blue_x_points": [
      [0.00035, 1],
      [-3e-5, 2],
      [0.00012, 1],
      [-1e-5, 2],
      [0.00024, 1],
      [0.00035, 1]
    ]
  },
  "QS_mulBpsurgeryType[Lysis]": {
    "red_x_points": [
      [-0.00279, 3],
      [-0.00589, 0],
      [-0.0088, 2],
      [-0.00573, 0],
      [-0.00538, 0],
      [-0.00897, 2],
      [-0.00574, 0],
      [-0.00324, 3],
      [-0.00566, 0],
      [-0.00568, 0],
      [-0.00568, 0],
      [-0.00295, 3],
      [0.01426, 1],
      [-0.00249, 3],
      [-0.00577, 0],
      [-0.00295, 3],
      [-0.00848, 2],
      [-0.00571, 0],
      [-0.00267, 3],
      [-0.00304, 3],
      [-0.00269, 3],
      [-0.00566, 0],
      [-0.00296, 3],
      [-0.00275, 3],
      [-0.0029, 3],
      [-0.00509, 0],
      [-0.00255, 3],
      [-0.00557, 0],
      [-0.00297, 3],
      [0.01582, 1],
      [-0.00838, 2]
    ],
    "red_o_points": [],
    "y_categories": ["N", "NOT APPLICABLE", "Y", "nan"],
    "blue_o_points": [],
    "blue_x_points": [
      [0.02107, 1],
      [-0.00087, 3],
      [0.01637, 1],
      [-0.00225, 0],
      [-0.00122, 3],
      [0.01792, 1],
      [0.01767, 1]
    ]
  },
  "QS_mulLysisSite[Trunk]": {
    "red_x_points": [
      [-0.00157, 3],
      [-0.00275, 0],
      [-0.00307, 0],
      [-0.00298, 0],
      [-0.0029, 0],
      [-0.00519, 2],
      [-0.00322, 0],
      [-0.00178, 3],
      [-0.00306, 0],
      [-0.00291, 0],
      [-0.00306, 0],
      [-0.00165, 3],
      [0.00788, 1],
      [-0.0018, 3],
      [-0.00318, 0],
      [-0.00186, 3],
      [-0.00487, 2],
      [-0.00278, 0],
      [-0.00153, 3],
      [-0.00173, 3],
      [-0.00158, 3],
      [-0.00288, 0],
      [-0.0015, 3],
      [-0.00157, 3],
      [-0.00178, 3],
      [-0.00297, 0],
      [-0.00166, 3],
      [-0.00277, 0],
      [-0.00165, 3],
      [0.00812, 1],
      [-0.00434, 2]
    ],
    "red_o_points": [],
    "y_categories": ["N", "NOT APPLICABLE", "Y", "nan"],
    "blue_o_points": [],
    "blue_x_points": [
      [0.01264, 1],
      [-0.00052, 3],
      [0.00962, 1],
      [-0.00193, 0],
      [-0.00049, 3],
      [0.00844, 1],
      [0.01018, 1]
    ]
  },
  "QS_mulGraftTrunk[UpperTrunk]": {
    "red_x_points": [
      [-0.00072, 3],
      [-0.00152, 0],
      [-0.00144, 0],
      [-0.00173, 0],
      [-0.00181, 0],
      [-0.00154, 0],
      [-0.00163, 0],
      [-0.00064, 3],
      [-0.0015, 0],
      [-0.00168, 0],
      [-0.00163, 0],
      [-0.00078, 3],
      [0.00448, 1],
      [-0.00055, 3],
      [-0.00461, 2],
      [-0.00063, 3],
      [-0.00136, 0],
      [-0.00183, 0],
      [-0.00068, 3],
      [-0.00052, 3],
      [-0.00076, 3],
      [-0.00167, 0],
      [-0.00059, 3],
      [-0.00083, 3],
      [-0.00077, 3],
      [-0.00154, 0],
      [-0.00073, 3],
      [-0.00174, 0],
      [-0.00057, 3],
      [0.00425, 1],
      [-0.00159, 0]
    ],
    "red_o_points": [],
    "y_categories": ["N", "NOT APPLICABLE", "Y", "nan"],
    "blue_o_points": [],
    "blue_x_points": [
      [0.00473, 1],
      [-0.00011, 3],
      [0.00421, 1],
      [-0.0007, 0],
      [0.00017, 3],
      [0.005, 1],
      [0.00485, 1]
    ]
  },
  "QS_mulTransfSite[PhMc]": {
    "red_x_points": [
      [-0.00146, 3],
      [-0.00263, 0],
      [-0.0025, 0],
      [-0.00261, 0],
      [-0.00241, 0],
      [-0.00244, 0],
      [-0.00483, 2],
      [-0.00104, 3],
      [-0.00245, 0],
      [-0.00248, 0],
      [-0.00227, 0],
      [-0.00156, 3],
      [0.00654, 1],
      [-0.00153, 3],
      [-0.00243, 0],
      [-0.00153, 3],
      [-0.00251, 0],
      [-0.00277, 0],
      [-0.00131, 3],
      [-0.00129, 3],
      [-0.00132, 3],
      [-0.00423, 2],
      [-0.0012, 3],
      [-0.00187, 3],
      [-0.00157, 3],
      [-0.00246, 0],
      [-0.00127, 3],
      [-0.00251, 0],
      [-0.00114, 3],
      [0.00802, 1],
      [-0.00249, 0]
    ],
    "red_o_points": [],
    "y_categories": ["N", "NOT APPLICABLE", "Y", "nan"],
    "blue_o_points": [],
    "blue_x_points": [
      [0.00981, 1],
      [-0.0004, 3],
      [0.00829, 1],
      [-0.00178, 0],
      [-0.0007, 3],
      [0.00814, 1],
      [0.00701, 1]
    ]
  },
  "QA_mulInjTbpiCause[Motorcycle]": {
    "red_x_points": [
      [0.00086, 0],
      [-0.00101, 1],
      [-0.00134, 1],
      [-0.00107, 1],
      [-0.00106, 1],
      [-0.00105, 1],
      [-0.00115, 1],
      [-0.00111, 1],
      [-0.00115, 1],
      [-0.00114, 1],
      [-0.00102, 1],
      [-0.00041, 0],
      [-0.03439, 1],
      [-0.00116, 1],
      [-0.00114, 1],
      [-0.00119, 1],
      [-0.00106, 1],
      [-0.00106, 1],
      [0.00052, 0],
      [-0.00088, 1],
      [-0.00075, 1],
      [-0.00101, 1],
      [-0.00125, 1],
      [-0.00109, 1],
      [0.00171, 0],
      [-0.00082, 1],
      [-0.00076, 1],
      [-0.00103, 1],
      [-0.00083, 1],
      [-0.03165, 1],
      [-0.00088, 1]
    ],
    "red_o_points": [],
    "y_categories": ["N", "Y", "nan"],
    "blue_o_points": [],
    "blue_x_points": [
      [0.01644, 0],
      [-0.00014, 1],
      [0.01261, 0],
      [-0.00115, 1],
      [0.00098, 1],
      [0.01469, 0],
      [0.01431, 0]
    ]
  },
  "QS_mulLysisSite[Root]": {
    "red_x_points": [
      [-0.00077, 3],
      [-0.00069, 0],
      [-0.00171, 2],
      [-0.00065, 0],
      [-0.00069, 0],
      [-0.00052, 0],
      [-0.00073, 0],
      [-0.00064, 3],
      [-0.00074, 0],
      [-0.00072, 0],
      [-0.00056, 0],
      [-0.00067, 3],
      [0.00198, 1],
      [-0.00073, 3],
      [-0.00069, 0],
      [-0.00068, 3],
      [-0.00061, 0],
      [-0.00068, 0],
      [-0.00062, 3],
      [-0.00072, 3],
      [-0.00058, 3],
      [-0.00063, 0],
      [-0.00067, 3],
      [-0.00065, 3],
      [-0.00061, 3],
      [-0.00065, 0],
      [-0.00063, 3],
      [-0.00064, 0],
      [-0.00058, 3],
      [0.00337, 1],
      [-0.00178, 2]
    ],
    "red_o_points": [],
    "y_categories": ["N", "NOT APPLICABLE", "Y", "nan"],
    "blue_o_points": [],
    "blue_x_points": [
      [0.00347, 1],
      [-0.00034, 3],
      [0.00333, 1],
      [-0.00075, 0],
      [-0.00035, 3],
      [0.00258, 1],
      [0.00302, 1]
    ]
  },
  "QA_yonInjOrtsurg": {
    "red_x_points": [
      [-0.00382, 2],
      [-0.00033, 2],
      [1e-5, 2],
      [-7e-5, 2],
      [1e-5, 2],
      [-2e-5, 2],
      [-0.0001, 1],
      [-0.00407, 2],
      [-6e-5, 0],
      [-2e-5, 1],
      [0.0, 1],
      [-0.00438, 2],
      [-0.00377, 0],
      [0.00102, 1],
      [-4e-5, 2],
      [-0.00432, 2],
      [-3e-5, 0],
      [0.0, 2],
      [0.00347, 0],
      [0.00049, 1],
      [-0.00423, 2],
      [-0.00012, 1],
      [-0.00432, 2],
      [-0.00454, 2],
      [-0.00425, 2],
      [-9e-5, 0],
      [-0.00027, 1],
      [0.0, 0],
      [-0.0043, 2],
      [-0.00163, 1],
      [-1e-5, 1]
    ],
    "red_o_points": [],
    "y_categories": ["N", "Y", "nan"],
    "blue_o_points": [],
    "blue_x_points": [
      [0.0007, 2],
      [0.00548, 1],
      [0.00031, 2],
      [0.00034, 2],
      [0.01534, 0],
      [0.00078, 2],
      [0.00061, 2]
    ]
  },
  "QS_mulGraftLevel[Trunk]": {
    "red_x_points": [
      [-0.00028, 3],
      [-0.00086, 0],
      [-0.00064, 0],
      [-0.00063, 0],
      [-0.00063, 0],
      [-0.00085, 0],
      [-0.00072, 0],
      [-0.0004, 3],
      [-0.00077, 0],
      [-0.00071, 0],
      [-0.00071, 0],
      [-0.00036, 3],
      [0.00199, 1],
      [-0.00053, 3],
      [-0.0027, 2],
      [-0.00059, 3],
      [-0.00032, 0],
      [-0.00065, 0],
      [-0.00043, 3],
      [-0.00047, 3],
      [-0.00043, 3],
      [-0.00079, 0],
      [-0.00054, 3],
      [-0.00044, 3],
      [-0.00047, 3],
      [-0.00072, 0],
      [-0.00044, 3],
      [-0.00071, 0],
      [-0.00043, 3],
      [0.00239, 1],
      [-0.00057, 0]
    ],
    "red_o_points": [],
    "y_categories": ["N", "NOT APPLICABLE", "Y", "nan"],
    "blue_o_points": [],
    "blue_x_points": [
      [0.00236, 1],
      [-0.00025, 3],
      [0.00268, 1],
      [-5e-5, 0],
      [-0.00024, 3],
      [0.00231, 1],
      [0.00271, 1]
    ]
  },
  "QS_mulGraftNerve[FI]": {
    "red_x_points": [
      [-0.00043, 2],
      [-0.00112, 0],
      [-0.00105, 0],
      [-0.001, 0],
      [-0.00075, 0],
      [-0.00092, 0],
      [-0.00116, 0],
      [-0.00037, 2],
      [-0.00137, 0],
      [-0.00117, 0],
      [-0.00114, 0],
      [-0.00034, 2],
      [0.00184, 1],
      [-0.00016, 2],
      [-0.00113, 0],
      [-0.00049, 2],
      [-0.00108, 0],
      [-0.00104, 0],
      [-0.00048, 2],
      [-0.00036, 2],
      [-0.00044, 2],
      [-0.00097, 0],
      [-0.00026, 2],
      [-0.00041, 2],
      [-0.00043, 2],
      [-0.00111, 0],
      [-0.00039, 2],
      [-0.00109, 0],
      [-0.00024, 2],
      [0.00233, 1],
      [-0.00104, 0]
    ],
    "red_o_points": [],
    "y_categories": ["N", "NOT APPLICABLE", "nan"],
    "blue_o_points": [],
    "blue_x_points": [
      [0.00343, 1],
      [-6e-5, 2],
      [0.00273, 1],
      [-0.0001, 0],
      [-7e-5, 2],
      [0.0021, 1],
      [0.0025, 1]
    ]
  },
  "QS_mulGraftNerve[other]": {
    "red_x_points": [
      [-0.00059, 2],
      [-0.00204, 0],
      [-0.00237, 0],
      [-0.00201, 0],
      [-0.00207, 0],
      [-0.00242, 0],
      [-0.00236, 0],
      [-0.00062, 2],
      [-0.00211, 0],
      [-0.00208, 0],
      [-0.00226, 0],
      [-0.00097, 2],
      [0.00363, 1],
      [-0.00067, 2],
      [-0.00217, 0],
      [-0.00089, 2],
      [-0.00209, 0],
      [-0.00221, 0],
      [-0.00071, 2],
      [-0.0006, 2],
      [-0.00064, 2],
      [-0.00187, 0],
      [-0.00068, 2],
      [-0.00067, 2],
      [-0.00061, 2],
      [-0.00192, 0],
      [-0.00073, 2],
      [-0.00229, 0],
      [-0.00075, 2],
      [0.00348, 1],
      [-0.00203, 0]
    ],
    "red_o_points": [],
    "y_categories": ["N", "NOT APPLICABLE", "nan"],
    "blue_o_points": [],
    "blue_x_points": [
      [0.00778, 1],
      [-3e-5, 2],
      [0.00539, 1],
      [0.00027, 0],
      [-5e-5, 2],
      [0.0044, 1],
      [0.00565, 1]
    ]
  },
  "QS_mulTransfSite[AcSsAA]": {
    "red_x_points": [
      [-0.00314, 3],
      [-0.00814, 2],
      [-0.00366, 0],
      [-0.00844, 2],
      [-0.00889, 2],
      [-0.00387, 0],
      [-0.00394, 0],
      [-0.0027, 3],
      [-0.00371, 0],
      [-0.00854, 2],
      [-0.00388, 0],
      [-0.00311, 3],
      [0.0145, 1],
      [-0.00286, 3],
      [-0.00895, 2],
      [-0.00308, 3],
      [-0.00287, 0],
      [-0.00402, 0],
      [-0.00288, 3],
      [-0.00275, 3],
      [-0.00272, 3],
      [-0.00817, 2],
      [-0.0028, 3],
      [-0.00298, 3],
      [-0.00306, 3],
      [-0.00353, 0],
      [-0.00313, 3],
      [-0.00861, 2],
      [-0.00281, 3],
      [0.01471, 1],
      [-0.00372, 0]
    ],
    "red_o_points": [],
    "y_categories": ["N", "NOT APPLICABLE", "Y", "nan"],
    "blue_o_points": [],
    "blue_x_points": [
      [0.01985, 1],
      [-0.00144, 3],
      [0.01476, 1],
      [-0.00136, 0],
      [-0.00135, 3],
      [0.01738, 1],
      [0.01608, 1]
    ]
  },
  "QS_mulGraftNerve[Ax]": {
    "red_x_points": [
      [-0.00014, 2],
      [-0.00073, 0],
      [-0.00044, 0],
      [-0.00046, 0],
      [-0.00038, 0],
      [-0.00046, 0],
      [-0.00047, 0],
      [-0.00015, 2],
      [-0.00041, 0],
      [-0.00061, 0],
      [-0.00047, 0],
      [-0.00017, 2],
      [0.00056, 1],
      [-0.00012, 2],
      [-0.00063, 0],
      [-0.00011, 2],
      [-0.00052, 0],
      [-0.00027, 0],
      [-0.00012, 2],
      [-0.00014, 2],
      [-9e-5, 2],
      [-0.00049, 0],
      [-0.00014, 2],
      [-1e-5, 2],
      [-0.00012, 2],
      [-0.00037, 0],
      [-0.0001, 2],
      [-0.00032, 0],
      [-0.0001, 2],
      [0.00093, 1],
      [-0.00042, 0]
    ],
    "red_o_points": [],
    "y_categories": ["N", "NOT APPLICABLE", "nan"],
    "blue_o_points": [],
    "blue_x_points": [
      [0.00183, 1],
      [2e-5, 2],
      [0.00081, 1],
      [-2e-5, 0],
      [7e-5, 2],
      [0.00096, 1],
      [0.00127, 1]
    ]
  },
  "QA_lstPexMuscstrength[WristFlex]": {
    "red_x_points": [
      [-0.00256, 1],
      [2e-5, 2],
      [-0.00119, 1],
      [-0.00152, 1],
      [0.00032, 0],
      [0.00065, 0],
      [-0.00167, 1],
      [-0.00105, 0],
      [0.00057, 0],
      [0.00025, 0],
      [0.0004, 0],
      [-0.00111, 0],
      [-0.0007, 2],
      [0.00142, 2],
      [1e-5, 2],
      [-0.00105, 0],
      [0.00011, 2],
      [0.00042, 0],
      [-0.0009, 0],
      [-0.00242, 1],
      [-0.00094, 0],
      [-0.00137, 1],
      [0.00138, 2],
      [-0.00762, 1],
      [-0.001, 0],
      [0.00045, 0],
      [-0.00313, 1],
      [0.00035, 0],
      [0.00151, 2],
      [-3e-5, 2],
      [-0.00127, 1]
    ],
    "red_o_points": [],
    "y_categories": ["GREATER THAN OR EQUALS TO 3", "LESS THAN 3", "nan"],
    "blue_o_points": [],
    "blue_x_points": [
      [0.00036, 0],
      [0.00298, 2],
      [0.00135, 0],
      [0.00242, 0],
      [0.0034, 2],
      [0.00117, 0],
      [0.00124, 0]
    ]
  },
  "QS_mulNeuromadSite[C5]": {
    "red_x_points": [
      [-0.001, 2],
      [-0.00312, 0],
      [-0.00408, 0],
      [-0.00402, 0],
      [-0.00348, 0],
      [-0.00362, 0],
      [-0.00355, 0],
      [-0.00072, 2],
      [-0.00363, 0],
      [-0.0037, 0],
      [-0.00304, 0],
      [-0.00116, 2],
      [0.00549, 1],
      [-0.00105, 2],
      [-0.00366, 0],
      [-0.00133, 2],
      [-0.00374, 0],
      [-0.00402, 0],
      [-0.00116, 2],
      [-0.00096, 2],
      [-0.00083, 2],
      [-0.00314, 0],
      [-0.0006, 2],
      [-0.00117, 2],
      [-0.00109, 2],
      [-0.00365, 0],
      [-0.00118, 2],
      [-0.00344, 0],
      [-0.00062, 2],
      [0.00656, 1],
      [-0.00391, 0]
    ],
    "red_o_points": [],
    "y_categories": ["N", "NOT APPLICABLE", "nan"],
    "blue_o_points": [],
    "blue_x_points": [
      [0.01155, 1],
      [0.00026, 2],
      [0.00793, 1],
      [2e-5, 0],
      [0.00014, 2],
      [0.00868, 1],
      [0.0098, 1]
    ]
  },
  "QS_mulNeuromadSite[C7]": {
    "red_x_points": [
      [-0.00103, 2],
      [-0.00289, 0],
      [-0.00341, 0],
      [-0.00294, 0],
      [-0.00303, 0],
      [-0.00275, 0],
      [-0.00305, 0],
      [-0.00113, 2],
      [-0.00289, 0],
      [-0.00276, 0],
      [-0.00245, 0],
      [-0.00104, 2],
      [0.0045, 1],
      [-0.00116, 2],
      [-0.00298, 0],
      [-0.00153, 2],
      [-0.00277, 0],
      [-0.00267, 0],
      [-0.00109, 2],
      [-0.00097, 2],
      [-0.00098, 2],
      [-0.00223, 0],
      [-0.00098, 2],
      [-0.00142, 2],
      [-0.00095, 2],
      [-0.00293, 0],
      [-0.00096, 2],
      [-0.00302, 0],
      [-0.00075, 2],
      [0.00666, 1],
      [-0.00245, 0]
    ],
    "red_o_points": [],
    "y_categories": ["N", "NOT APPLICABLE", "nan"],
    "blue_o_points": [],
    "blue_x_points": [
      [0.0106, 1],
      [2e-5, 2],
      [0.00579, 1],
      [0.00027, 0],
      [-6e-5, 2],
      [0.00606, 1],
      [0.00762, 1]
    ]
  },
  "QA_lstPexMuscstrength[WristExte]": {
    "red_x_points": [
      [-0.00306, 1],
      [-0.00043, 2],
      [-0.00196, 1],
      [-0.00195, 1],
      [0.00064, 0],
      [-0.00191, 1],
      [-0.00241, 1],
      [-0.00253, 0],
      [0.00156, 0],
      [0.0006, 0],
      [-0.00182, 1],
      [-0.00092, 0],
      [-0.00135, 2],
      [0.00162, 2],
      [-3e-5, 2],
      [-0.00127, 0],
      [0.00011, 2],
      [0.00059, 0],
      [-0.0009, 0],
      [-0.00305, 1],
      [-0.00163, 0],
      [-0.00206, 1],
      [0.00127, 2],
      [-0.00096, 0],
      [-0.00374, 1],
      [0.00076, 0],
      [-0.00231, 1],
      [0.00053, 0],
      [0.00249, 2],
      [-0.00152, 2],
      [-0.00138, 1]
    ],
    "red_o_points": [],
    "y_categories": ["GREATER THAN OR EQUALS TO 3", "LESS THAN 3", "nan"],
    "blue_o_points": [],
    "blue_x_points": [
      [0.00108, 0],
      [0.00419, 2],
      [0.00073, 0],
      [0.00329, 0],
      [0.00493, 2],
      [0.00068, 1],
      [0.001, 0]
    ]
  },
  "QA_lstPexMuscstrength[ElbowExte]": {
    "red_x_points": [
      [-0.00303, 1],
      [-0.0, 2],
      [-0.00013, 1],
      [0.0, 1],
      [-0.00097, 0],
      [-0.00011, 1],
      [5e-5, 1],
      [-0.00317, 1],
      [-0.00112, 0],
      [-0.00025, 0],
      [5e-5, 1],
      [-0.00326, 1],
      [0.00011, 2],
      [0.00393, 2],
      [-0.00011, 2],
      [-0.00276, 1],
      [-9e-5, 2],
      [2e-5, 1],
      [-0.00232, 0],
      [-0.00283, 1],
      [-0.00322, 0],
      [0.0, 1],
      [0.00367, 2],
      [-0.00337, 0],
      [-0.00317, 0],
      [0.00019, 1],
      [-0.00256, 1],
      [-0.00023, 2],
      [-0.00279, 1],
      [3e-5, 2]
    ],
    "red_o_points": [],
    "y_categories": ["GREATER THAN OR EQUALS TO 3", "LESS THAN 3", "nan"],
    "blue_o_points": [],
    "blue_x_points": [
      [0.00011, 2],
      [0.00769, 2],
      [0.00022, 0],
      [0.00129, 1],
      [0.0075, 2],
      [9e-5, 0],
      [0.00031, 0]
    ]
  },
  "QA_intPexForearmSupin": {
    "red_x_points": [
      [0.00012, 2],
      [6e-5, 0],
      [1e-5, 2],
      [2e-5, 2],
      [-0.00035, 1],
      [-0.00022, 1],
      [3e-5, 2],
      [-0.00023, 1],
      [4e-5, 2],
      [6e-5, 2],
      [4e-5, 2],
      [-0.00013, 0],
      [0.00081, 2],
      [4e-5, 2],
      [5e-5, 2],
      [0.00011, 2],
      [4e-5, 2],
      [-0.00041, 1],
      [-0.0003, 1],
      [1e-5, 0],
      [-0.0003, 1],
      [6e-5, 2],
      [0.00011, 2],
      [2e-5, 2],
      [1e-5, 2],
      [-0.00034, 1],
      [4e-5, 2],
      [6e-5, 2],
      [-0.01363, 1],
      [2e-5, 0]
    ],
    "red_o_points": [],
    "y_categories": ["GREATER THAN OR EQUALS TO 80", "LESS THAN 80", "nan"],
    "blue_o_points": [],
    "blue_x_points": [
      [0.00135, 2],
      [0.0001, 2],
      [0.00564, 0],
      [0.00019, 2],
      [0.00022, 2],
      [0.00117, 2],
      [0.00144, 2]
    ]
  },
  "QS_mulGraftNerve[SS]": {
    "red_x_points": [
      [-0.00011, 2],
      [-0.00038, 0],
      [-0.00027, 0],
      [-0.00037, 0],
      [-0.00025, 0],
      [-0.00028, 0],
      [-0.00029, 0],
      [-8e-5, 2],
      [-0.00042, 0],
      [-0.00031, 0],
      [-0.00033, 0],
      [-0.00016, 2],
      [0.00066, 1],
      [-0.00013, 2],
      [-0.00031, 0],
      [-0.0001, 2],
      [-0.00037, 0],
      [-0.00038, 0],
      [-0.00013, 2],
      [-0.00012, 2],
      [-3e-5, 2],
      [-0.00034, 0],
      [-0.00014, 2],
      [-2e-5, 2],
      [-8e-5, 2],
      [-0.00029, 0],
      [-3e-5, 2],
      [-0.00022, 0],
      [-6e-5, 2],
      [0.00068, 1],
      [-0.00028, 0]
    ],
    "red_o_points": [],
    "y_categories": ["N", "NOT APPLICABLE", "nan"],
    "blue_o_points": [],
    "blue_x_points": [
      [0.00139, 1],
      [-3e-5, 2],
      [0.0006, 1],
      [-0.00011, 0],
      [0.0, 2],
      [0.00074, 1],
      [0.00107, 1]
    ]
  },
  "QS_mulGraftNerve[MCF]": {
    "red_x_points": [
      [-1e-5, 2],
      [-5e-5, 0],
      [-8e-5, 0],
      [-3e-5, 0],
      [-8e-5, 0],
      [-8e-5, 0],
      [-1e-5, 2],
      [-5e-5, 0],
      [-3e-5, 0],
      [0.00019, 1],
      [-8e-5, 0],
      [-1e-5, 2],
      [-8e-5, 0],
      [-8e-5, 0],
      [-1e-5, 2],
      [-1e-5, 2],
      [-1e-5, 2],
      [-8e-5, 0],
      [-1e-5, 2],
      [-1e-5, 2],
      [-1e-5, 2],
      [-8e-5, 0],
      [0.0, 2],
      [-8e-5, 0],
      [-1e-5, 2],
      [7e-5, 1],
      [-8e-5, 0]
    ],
    "red_o_points": [],
    "y_categories": ["N", "NOT APPLICABLE", "nan"],
    "blue_o_points": [],
    "blue_x_points": [
      [0.00019, 1],
      [-1e-5, 2],
      [0.00019, 1],
      [-3e-5, 0],
      [-1e-5, 2],
      [0.00012, 1]
    ]
  },
  "QS_mulNeuromadSite[C6]": {
    "red_x_points": [
      [-0.0003, 2],
      [-0.00175, 0],
      [-0.00231, 0],
      [-0.00187, 0],
      [-0.00188, 0],
      [-0.00198, 0],
      [-0.0018, 0],
      [-0.00073, 2],
      [-0.00179, 0],
      [-0.0019, 0],
      [-0.00193, 0],
      [-0.00079, 2],
      [0.00298, 1],
      [-0.00058, 2],
      [-0.00189, 0],
      [-0.00087, 2],
      [-0.00191, 0],
      [-0.00205, 0],
      [-0.00051, 2],
      [-0.00055, 2],
      [-0.0005, 2],
      [-0.00197, 0],
      [-0.0004, 2],
      [-0.00036, 2],
      [-0.00069, 2],
      [-0.0017, 0],
      [-0.00051, 2],
      [-0.00195, 0],
      [-0.00054, 2],
      [0.00385, 1],
      [-0.00189, 0]
    ],
    "red_o_points": [],
    "y_categories": ["N", "NOT APPLICABLE", "nan"],
    "blue_o_points": [],
    "blue_x_points": [
      [0.0071, 1],
      [0.0003, 2],
      [0.00426, 1],
      [9e-5, 0],
      [-0.00026, 2],
      [0.00428, 1],
      [0.00455, 1]
    ]
  },
  "QS_mulLysisSite[Nerve]": {
    "red_x_points": [
      [-0.00029, 3],
      [-0.00058, 0],
      [-0.00119, 2],
      [-0.00055, 0],
      [-0.00061, 0],
      [-0.00053, 0],
      [-0.00066, 0],
      [-0.00045, 3],
      [-0.00045, 0],
      [-0.00047, 0],
      [-0.0006, 0],
      [-0.00031, 3],
      [0.00147, 1],
      [-0.00028, 3],
      [-0.00051, 0],
      [-0.00032, 3],
      [-0.00055, 0],
      [-0.00059, 0],
      [-0.00037, 3],
      [-0.00026, 3],
      [-0.00035, 3],
      [-0.00056, 0],
      [-0.00038, 3],
      [-0.00035, 3],
      [-0.0003, 3],
      [-0.00059, 0],
      [-0.00038, 3],
      [-0.00059, 0],
      [-0.00036, 3],
      [0.00172, 1],
      [-0.00056, 0]
    ],
    "red_o_points": [],
    "y_categories": ["N", "NOT APPLICABLE", "Y", "nan"],
    "blue_o_points": [],
    "blue_x_points": [
      [0.00206, 1],
      [-0.00014, 3],
      [0.00203, 1],
      [-0.00054, 0],
      [-0.00019, 3],
      [0.0015, 1],
      [0.0021, 1]
    ]
  },
  "QS_mulGraftNerve[TD]": {
    "red_x_points": [
      [-9e-5, 2],
      [-0.00021, 0],
      [-0.00027, 0],
      [-0.00016, 0],
      [-0.00023, 0],
      [-0.00025, 0],
      [-0.00016, 0],
      [-0.00012, 2],
      [-0.00018, 0],
      [-0.00021, 0],
      [-0.00016, 0],
      [-0.00012, 2],
      [0.00037, 1],
      [-0.00012, 2],
      [-0.00021, 0],
      [-0.00013, 2],
      [-9e-5, 0],
      [-0.00023, 0],
      [-0.0001, 2],
      [-0.00012, 2],
      [-8e-5, 2],
      [-0.00019, 0],
      [-0.00017, 2],
      [-0.00019, 2],
      [-0.00014, 2],
      [-0.00027, 0],
      [-0.0001, 2],
      [-0.00027, 0],
      [-0.00013, 2],
      [0.00043, 1],
      [-0.00023, 0]
    ],
    "red_o_points": [],
    "y_categories": ["N", "NOT APPLICABLE", "nan"],
    "blue_o_points": [],
    "blue_x_points": [
      [0.00082, 1],
      [-3e-5, 2],
      [0.00056, 1],
      [0.00013, 0],
      [-5e-5, 2],
      [0.00056, 1],
      [0.00035, 1]
    ]
  },
  "QS_mulLysisRoot[C7]": {
    "red_x_points": [
      [-0.00017, 3],
      [-0.00062, 0],
      [-0.00163, 2],
      [-0.00053, 0],
      [-0.00054, 0],
      [-0.00047, 0],
      [-0.0007, 0],
      [-0.00027, 3],
      [-0.00059, 0],
      [-0.00055, 0],
      [-0.00053, 0],
      [-0.00031, 3],
      [0.00212, 1],
      [-0.00039, 3],
      [-0.00058, 0],
      [-0.00031, 3],
      [-0.00037, 0],
      [-0.00048, 0],
      [-0.00029, 3],
      [-0.00032, 3],
      [-0.00016, 3],
      [-0.00064, 0],
      [-0.00033, 3],
      [-0.00024, 3],
      [-0.00027, 3],
      [-0.00056, 0],
      [-0.00026, 3],
      [-0.00061, 0],
      [-0.00033, 3],
      [0.00195, 1],
      [-0.00055, 0]
    ],
    "red_o_points": [],
    "y_categories": ["N", "NOT APPLICABLE", "Y", "nan"],
    "blue_o_points": [],
    "blue_x_points": [
      [0.00172, 1],
      [-7e-5, 3],
      [0.00144, 1],
      [-0.00041, 0],
      [-9e-5, 3],
      [0.00144, 1],
      [0.00195, 1]
    ]
  },
  "QS_mulTransfSite[IMc]": {
    "red_x_points": [
      [-0.00273, 3],
      [-0.00782, 2],
      [-0.00508, 0],
      [-0.00485, 0],
      [-0.00527, 0],
      [-0.00451, 0],
      [-0.00528, 0],
      [-0.00247, 3],
      [-0.00488, 0],
      [-0.00462, 0],
      [-0.00495, 0],
      [-0.00287, 3],
      [0.01304, 1],
      [-0.00267, 3],
      [-0.00452, 0],
      [-0.00257, 3],
      [-0.00782, 2],
      [-0.00492, 0],
      [-0.00264, 3],
      [-0.00237, 3],
      [-0.0025, 3],
      [-0.00497, 0],
      [-0.0027, 3],
      [-0.00315, 3],
      [-0.00264, 3],
      [-0.00518, 0],
      [-0.00232, 3],
      [-0.00751, 2],
      [-0.00278, 3],
      [0.0137, 1],
      [-0.00773, 2]
    ],
    "red_o_points": [],
    "y_categories": ["N", "NOT APPLICABLE", "Y", "nan"],
    "blue_o_points": [],
    "blue_x_points": [
      [0.01939, 1],
      [-0.00125, 3],
      [0.01491, 1],
      [-0.00155, 0],
      [-0.00101, 3],
      [0.01465, 1],
      [0.01626, 1]
    ]
  },
  "QA_lstPexTouch[T1]": {
    "red_x_points": [
      [-0.00208, 1],
      [-0.0001, 2],
      [0.00053, 1],
      [-0.00032, 2],
      [-0.00202, 0],
      [0.00064, 1],
      [0.00077, 1],
      [-0.0024, 1],
      [-0.00234, 0],
      [-0.00106, 0],
      [-0.00138, 0],
      [-0.00319, 0],
      [-0.01017, 2],
      [0.00404, 2],
      [-0.00021, 2],
      [-0.00189, 1],
      [-0.0, 2],
      [0.00076, 1],
      [-0.00291, 0],
      [-0.00253, 1],
      [-0.00307, 0],
      [-0.00026, 2],
      [0.00326, 2],
      [-0.00149, 1],
      [-0.00351, 0],
      [0.00062, 1],
      [-0.00332, 0],
      [-0.00022, 2],
      [-0.00354, 0],
      [0.00057, 1],
      [0.00021, 1]
    ],
    "red_o_points": [],
    "y_categories": ["NORM", "NPV", "nan"],
    "blue_o_points": [],
    "blue_x_points": [
      [0.00079, 1],
      [0.0064, 2],
      [0.0008, 1],
      [0.00246, 1],
      [0.00664, 2],
      [0.0007, 1],
      [0.00529, 0]
    ]
  },
  "QA_mulInjOrthesisType[ShoulderSupport]": {
    "red_x_points": [
      [-0.01035, 0],
      [-0.00903, 0],
      [-0.00952, 0],
      [-0.0092, 0],
      [-0.00924, 0],
      [-0.00941, 0],
      [-0.00916, 0],
      [-0.01233, 2],
      [-0.00941, 0],
      [-0.00902, 0],
      [-0.00909, 0],
      [-0.01063, 0],
      [0.02407, 1],
      [-0.0102, 0],
      [-0.00942, 0],
      [-0.00994, 0],
      [-0.01161, 2],
      [-0.00914, 0],
      [-0.01058, 0],
      [-0.01004, 0],
      [-0.01191, 2],
      [-0.01134, 3],
      [-0.00966, 0],
      [0.02864, 1],
      [-0.01054, 0],
      [-0.00951, 0],
      [-0.01026, 0],
      [-0.00868, 0],
      [-0.01256, 3],
      [-0.01754, 3],
      [-0.00914, 0]
    ],
    "red_o_points": [],
    "y_categories": ["N", "NOT APPLICABLE", "Y", "nan"],
    "blue_o_points": [],
    "blue_x_points": [
      [-0.00386, 0],
      [0.02787, 1],
      [0.02487, 1],
      [0.03215, 1],
      [0.02892, 1],
      [0.02374, 1],
      [0.02485, 1]
    ]
  },
  "QS_mulTransfSite[AcMc]": {
    "red_x_points": [
      [-0.0003, 3],
      [-0.00059, 0],
      [-0.00056, 0],
      [-0.00058, 0],
      [-0.00054, 0],
      [-0.00061, 0],
      [-0.00069, 0],
      [-0.00041, 3],
      [-0.00063, 0],
      [-0.00045, 0],
      [-0.00177, 2],
      [-0.00046, 3],
      [0.00207, 1],
      [-0.00035, 3],
      [-0.00054, 0],
      [-0.00036, 3],
      [-0.00049, 0],
      [-0.0006, 0],
      [-0.00047, 3],
      [-0.00026, 3],
      [-0.00037, 3],
      [-0.00046, 0],
      [-0.00031, 3],
      [-0.00035, 3],
      [-0.00031, 3],
      [-0.00048, 0],
      [-0.00036, 3],
      [-0.00042, 0],
      [-0.00031, 3],
      [0.00167, 1],
      [-0.00062, 0]
    ],
    "red_o_points": [],
    "y_categories": ["N", "NOT APPLICABLE", "Y", "nan"],
    "blue_o_points": [],
    "blue_x_points": [
      [0.00249, 1],
      [-0.00018, 3],
      [0.00217, 1],
      [-0.00029, 0],
      [-0.00013, 3],
      [0.00167, 1],
      [0.00184, 1]
    ]
  },
  "QS_mulTransfSite[Other]": {
    "red_x_points": [
      [-0.00053, 3],
      [-0.00092, 0],
      [-0.00063, 0],
      [-0.00101, 0],
      [-0.0007, 0],
      [-0.00085, 0],
      [-0.00074, 0],
      [-0.0007, 3],
      [-0.00078, 0],
      [-0.00094, 0],
      [-0.00084, 0],
      [-0.00047, 3],
      [0.0027, 1],
      [-0.00056, 3],
      [-0.00072, 0],
      [-0.00058, 3],
      [-0.00105, 0],
      [-0.00366, 2],
      [-0.00075, 3],
      [-0.00057, 3],
      [-0.00077, 3],
      [-0.00085, 0],
      [-0.00064, 3],
      [-0.0005, 3],
      [-0.00061, 3],
      [-0.00088, 0],
      [-0.00053, 3],
      [-0.00086, 0],
      [-0.00053, 3],
      [0.00218, 1],
      [-0.00091, 0]
    ],
    "red_o_points": [],
    "y_categories": ["N", "NOT APPLICABLE", "Y", "nan"],
    "blue_o_points": [],
    "blue_x_points": [
      [0.00321, 1],
      [-6e-5, 3],
      [0.00319, 1],
      [-0.00033, 0],
      [-0.00017, 3],
      [0.00344, 1],
      [0.00299, 1]
    ]
  },
  "QA_yonInjBpsurg": {
    "red_x_points": [
      [-0.00329, 1],
      [-0.00278, 1],
      [-0.00376, 1],
      [-0.00325, 1],
      [-0.00401, 1],
      [-0.00367, 1],
      [-0.00355, 1],
      [-0.00336, 1],
      [-0.00369, 1],
      [-0.00354, 1],
      [-0.00331, 1],
      [-0.00408, 1],
      [0.00828, 0],
      [-0.00376, 1],
      [-0.00332, 1],
      [-0.00356, 1],
      [-0.00288, 1],
      [-0.00373, 1],
      [-0.0034, 1],
      [-0.00333, 1],
      [-0.00337, 1],
      [-0.00275, 1],
      [-0.00364, 1],
      [-0.00374, 1],
      [-0.00381, 1],
      [-0.00319, 1],
      [-0.00328, 1],
      [-0.00333, 1],
      [-0.00325, 1],
      [0.00977, 0],
      [-0.00318, 1]
    ],
    "red_o_points": [],
    "y_categories": ["N", "Y", "nan"],
    "blue_o_points": [],
    "blue_x_points": [
      [0.01798, 0],
      [-0.00066, 1],
      [0.01138, 0],
      [-0.00282, 1],
      [-0.00111, 1],
      [0.01236, 0],
      [0.01339, 0]
    ]
  },
  "QA_equInjTbpiAge": {
    "red_x_points": [
      [-0.00069, 1],
      [-0.00022, 1],
      [-6e-5, 1],
      [1e-5, 0],
      [-0.00094, 0],
      [7e-5, 1],
      [-9e-5, 1],
      [0.00071, 0],
      [-0.00078, 0],
      [-9e-5, 0],
      [3e-5, 1],
      [0.0005, 0],
      [-0.01519, 1],
      [-0.00084, 1],
      [-0.00019, 1],
      [-0.00109, 1],
      [0.00012, 0],
      [-0.00138, 0],
      [-0.00082, 1],
      [0.00036, 0],
      [-0.00064, 1],
      [-0.00012, 1],
      [-0.00102, 1],
      [-0.00229, 1],
      [0.00059, 0],
      [0.00012, 1],
      [-0.00158, 1],
      [0.0, 1],
      [-0.00062, 1],
      [-0.01168, 1],
      [3e-5, 0]
    ],
    "red_o_points": [],
    "y_categories": ["GREATER THAN OR EQUALS TO 30", "LESS THAN 30", "nan"],
    "blue_o_points": [],
    "blue_x_points": [
      [-0.00326, 1],
      [-0.00126, 1],
      [0.00665, 0],
      [0.00075, 1],
      [0.0056, 0],
      [0.00705, 0],
      [0.0073, 0]
    ]
  },
  "QS_mulLysisNerve[Ssr]": {
    "red_x_points": [
      [-0.00037, 3],
      [-0.00062, 0],
      [-0.00153, 2],
      [-0.00074, 0],
      [-0.00062, 0],
      [-0.00074, 0],
      [-0.00065, 0],
      [-0.00032, 3],
      [-0.00058, 0],
      [-0.00063, 0],
      [-0.00064, 0],
      [-0.00036, 3],
      [0.00209, 1],
      [-0.00022, 3],
      [-0.00066, 0],
      [-0.00037, 3],
      [-0.00065, 0],
      [-0.00079, 0],
      [-0.00027, 3],
      [-0.00027, 3],
      [-0.00031, 3],
      [-0.00071, 0],
      [-0.00038, 3],
      [-0.00039, 3],
      [-0.00033, 3],
      [-0.00057, 0],
      [-0.00029, 3],
      [-0.00065, 0],
      [-0.00034, 3],
      [0.00254, 1],
      [-0.00052, 0]
    ],
    "red_o_points": [],
    "y_categories": ["N", "NOT APPLICABLE", "Y", "nan"],
    "blue_o_points": [],
    "blue_x_points": [
      [0.00217, 1],
      [-0.00022, 3],
      [0.00191, 1],
      [-0.00068, 0],
      [-0.00018, 3],
      [0.00257, 1],
      [0.00181, 1]
    ]
  },
  "QS_mulBpsurgeryType[Graft]": {
    "red_x_points": [
      [-0.00019, 3],
      [-0.00025, 0],
      [-0.00033, 0],
      [-0.0003, 0],
      [-0.0003, 0],
      [-0.0002, 0],
      [-0.00028, 0],
      [-0.00019, 3],
      [-0.00023, 0],
      [-0.00029, 0],
      [-0.00032, 0],
      [-0.0002, 3],
      [0.00056, 1],
      [-0.00024, 3],
      [-0.0013, 2],
      [-0.00022, 3],
      [-0.0003, 0],
      [-0.00024, 0],
      [-0.00021, 3],
      [-0.00021, 3],
      [-0.00018, 3],
      [-0.00032, 0],
      [-0.00025, 3],
      [-0.00018, 3],
      [-0.00014, 3],
      [-0.00031, 0],
      [-0.00018, 3],
      [-0.00027, 0],
      [-0.0002, 3],
      [0.00095, 1],
      [-0.00033, 0]
    ],
    "red_o_points": [],
    "y_categories": ["N", "NOT APPLICABLE", "Y", "nan"],
    "blue_o_points": [],
    "blue_x_points": [
      [0.00075, 1],
      [-0.0001, 3],
      [0.00106, 1],
      [7e-5, 0],
      [-3e-5, 3],
      [0.00112, 1],
      [0.00141, 1]
    ]
  },
  "QS_mulLysisRoot[C5]": {
    "red_x_points": [
      [-0.00095, 3],
      [-0.00207, 0],
      [-0.00336, 2],
      [-0.00181, 0],
      [-0.00157, 0],
      [-0.0019, 0],
      [-0.00196, 0],
      [-0.00124, 3],
      [-0.00197, 0],
      [-0.00198, 0],
      [-0.00186, 0],
      [-0.00101, 3],
      [0.00536, 1],
      [-0.001, 3],
      [-0.00212, 0],
      [-0.00141, 3],
      [-0.00204, 0],
      [-0.00206, 0],
      [-0.00118, 3],
      [-0.00113, 3],
      [-0.0011, 3],
      [-0.00168, 0],
      [-0.00115, 3],
      [-0.00142, 3],
      [-0.00106, 3],
      [-0.00187, 0],
      [-0.00102, 3],
      [-0.00195, 0],
      [-0.00084, 3],
      [0.00558, 1],
      [-0.00321, 2]
    ],
    "red_o_points": [],
    "y_categories": ["N", "NOT APPLICABLE", "Y", "nan"],
    "blue_o_points": [],
    "blue_x_points": [
      [0.00731, 1],
      [-0.00039, 3],
      [0.00595, 1],
      [-0.00127, 0],
      [-0.00024, 3],
      [0.00571, 1],
      [0.00626, 1]
    ]
  },
  "QS_mulLysisRoot[C6]": {
    "red_x_points": [
      [-0.00112, 3],
      [-0.00205, 0],
      [-0.00366, 2],
      [-0.00183, 0],
      [-0.00183, 0],
      [-0.00167, 0],
      [-0.00198, 0],
      [-0.00113, 3],
      [-0.0018, 0],
      [-0.00169, 0],
      [-0.00177, 0],
      [-0.00119, 3],
      [0.00555, 1],
      [-0.00111, 3],
      [-0.00191, 0],
      [-0.00123, 3],
      [-0.00183, 0],
      [-0.00216, 0],
      [-0.00114, 3],
      [-0.00105, 3],
      [-0.00115, 3],
      [-0.00167, 0],
      [-0.00115, 3],
      [-0.00124, 3],
      [-0.00103, 3],
      [-0.00179, 0],
      [-0.00104, 3],
      [-0.00182, 0],
      [-0.00118, 3],
      [0.00674, 1],
      [-0.0032, 2]
    ],
    "red_o_points": [],
    "y_categories": ["N", "NOT APPLICABLE", "Y", "nan"],
    "blue_o_points": [],
    "blue_x_points": [
      [0.00758, 1],
      [-0.00047, 3],
      [0.00557, 1],
      [-0.0016, 0],
      [-0.00059, 3],
      [0.00605, 1],
      [0.00697, 1]
    ]
  },
  "QA_lstPexPalle[Clavicle]": {
    "red_x_points": [
      [2e-5, 3],
      [-0.0, 3],
      [4e-5, 3],
      [2e-5, 3],
      [-0.00047, 2],
      [-0.00029, 2],
      [4e-5, 3],
      [3e-5, 3],
      [8e-5, 3],
      [-0.00028, 2],
      [-0.00021, 2],
      [6e-5, 0],
      [0.00052, 3],
      [-0.0, 3],
      [6e-5, 3],
      [2e-5, 3],
      [2e-5, 3],
      [3e-5, 0],
      [6e-5, 0],
      [5e-5, 0],
      [-0.00023, 2],
      [-9e-5, 1],
      [2e-5, 3],
      [-0.00359, 2],
      [2e-5, 3],
      [3e-5, 3],
      [-0.00031, 2],
      [4e-5, 3],
      [2e-5, 3],
      [-0.01598, 2]
    ],
    "red_o_points": [],
    "y_categories": ["HYPO", "NAIA", "PT", "nan"],
    "blue_o_points": [],
    "blue_x_points": [
      [0.00152, 3],
      [0.00022, 3],
      [0.00749, 0],
      [0.00043, 3],
      [0.00023, 3],
      [0.00165, 3],
      [0.00165, 3]
    ]
  },
  "QS_mulGraftNerve[LT]": {
    "red_x_points": [
      [-7e-5, 2],
      [-0.00014, 0],
      [-9e-5, 0],
      [-8e-5, 0],
      [-8e-5, 0],
      [-0.0001, 0],
      [-7e-5, 0],
      [-5e-5, 2],
      [-9e-5, 0],
      [-0.00012, 0],
      [-9e-5, 0],
      [-2e-5, 2],
      [6e-5, 1],
      [-6e-5, 2],
      [-0.00012, 0],
      [-5e-5, 2],
      [-9e-5, 0],
      [-8e-5, 0],
      [-5e-5, 2],
      [-7e-5, 2],
      [-3e-5, 2],
      [-5e-5, 0],
      [-5e-5, 2],
      [-3e-5, 2],
      [-5e-5, 2],
      [-9e-5, 0],
      [-4e-5, 2],
      [-0.00011, 0],
      [-3e-5, 2],
      [0.0001, 1],
      [-0.0001, 0]
    ],
    "red_o_points": [],
    "y_categories": ["N", "NOT APPLICABLE", "nan"],
    "blue_o_points": [],
    "blue_x_points": [
      [0.00065, 1],
      [1e-5, 2],
      [0.00012, 1],
      [4e-5, 0],
      [1e-5, 2],
      [0.00022, 1]
    ]
  },
  "QA_lstPexMuscstrength[ShoulderAbduc]": {
    "red_x_points": [
      [-0.00521, 1],
      [-0.00523, 1],
      [-0.00522, 1],
      [-0.00512, 1],
      [-0.00539, 1],
      [-0.0052, 1],
      [-0.00585, 1],
      [-0.00547, 1],
      [-0.0049, 1],
      [-0.00549, 1],
      [-0.00534, 1],
      [-0.00508, 1],
      [0.00368, 2],
      [0.00445, 2],
      [0.00482, 2],
      [0.00463, 2],
      [0.00499, 2],
      [-0.00558, 1],
      [-0.00542, 1],
      [-0.00464, 1],
      [-0.00515, 1],
      [-0.00521, 1],
      [0.00468, 2],
      [-0.00681, 1],
      [-0.00586, 1],
      [-0.00507, 1],
      [-0.00584, 1],
      [-0.00517, 1],
      [-0.00503, 1],
      [0.00329, 2],
      [-0.00486, 1]
    ],
    "red_o_points": [],
    "y_categories": ["GREATER THAN OR EQUALS TO 3", "LESS THAN 3", "nan"],
    "blue_o_points": [],
    "blue_x_points": [
      [0.00404, 2],
      [0.00526, 2],
      [0.02028, 0],
      [0.00629, 2],
      [0.00509, 2],
      [0.02195, 0],
      [-0.00148, 1]
    ]
  },
  "QS_mulNeuromadSite[C4]": {
    "red_x_points": [
      [-0.00068, 2],
      [-0.0022, 0],
      [-0.00225, 0],
      [-0.00218, 0],
      [-0.00233, 0],
      [-0.00189, 0],
      [-0.00202, 0],
      [-0.0005, 2],
      [-0.00227, 0],
      [-0.00207, 0],
      [-0.00201, 0],
      [-0.00097, 2],
      [0.00368, 1],
      [-0.0006, 2],
      [-0.00208, 0],
      [-0.00071, 2],
      [-0.00231, 0],
      [-0.00225, 0],
      [-0.00087, 2],
      [-0.00058, 2],
      [-0.00066, 2],
      [-0.00181, 0],
      [-0.00065, 2],
      [-0.001, 2],
      [-0.00068, 2],
      [-0.00221, 0],
      [-0.00076, 2],
      [-0.00227, 0],
      [-0.0006, 2],
      [0.00398, 1],
      [-0.00198, 0]
    ],
    "red_o_points": [],
    "y_categories": ["N", "NOT APPLICABLE", "nan"],
    "blue_o_points": [],
    "blue_x_points": [
      [0.00648, 1],
      [-0.00033, 2],
      [0.00515, 1],
      [-0.00013, 0],
      [0.0001, 2],
      [0.00441, 1],
      [0.00572, 1]
    ]
  },
  "QS_lstBpsurgSide": {
    "red_x_points": [
      [-0.00381, 3],
      [-0.00623, 0],
      [-0.00621, 0],
      [-0.00634, 0],
      [-0.01095, 2],
      [-0.00589, 0],
      [-0.00571, 0],
      [-0.00382, 3],
      [-0.00577, 0],
      [-0.01081, 2],
      [-0.01113, 2],
      [-0.00391, 3],
      [0.01843, 1],
      [-0.00331, 3],
      [-0.0133, 2],
      [-0.00394, 3],
      [-0.01218, 2],
      [-0.012, 2],
      [-0.00379, 3],
      [-0.0039, 3],
      [-0.00343, 3],
      [-0.00567, 0],
      [-0.00372, 3],
      [-0.00403, 3],
      [-0.00381, 3],
      [-0.00971, 2],
      [-0.00401, 3],
      [-0.01127, 2],
      [-0.00334, 3],
      [0.01898, 1],
      [-0.00595, 0]
    ],
    "red_o_points": [],
    "y_categories": ["L", "NOT APPLICABLE", "R", "nan"],
    "blue_o_points": [],
    "blue_x_points": [
      [0.02764, 1],
      [-0.0009, 3],
      [0.02059, 1],
      [0.00162, 0],
      [-0.00098, 3],
      [0.02185, 1],
      [0.02433, 1]
    ]
  },
  "QS_mulGraftNerve[IS]": {
    "red_x_points": [
      [-0.00018, 2],
      [-0.00024, 0],
      [-0.00038, 0],
      [-0.00035, 0],
      [-0.00026, 0],
      [-0.0003, 0],
      [-0.0003, 0],
      [-0.00013, 2],
      [-0.00031, 0],
      [-0.00024, 0],
      [-0.00033, 0],
      [-9e-5, 2],
      [0.00037, 1],
      [-0.00017, 2],
      [-0.00032, 0],
      [-0.00019, 2],
      [-0.00026, 0],
      [-0.00025, 0],
      [-0.00011, 2],
      [-9e-5, 2],
      [-0.00011, 2],
      [-0.00025, 0],
      [-0.00016, 2],
      [-0.00016, 2],
      [-0.00013, 2],
      [-0.00027, 0],
      [-0.00012, 2],
      [-0.00044, 0],
      [-0.00014, 2],
      [0.00083, 1],
      [-0.00024, 0]
    ],
    "red_o_points": [],
    "y_categories": ["N", "NOT APPLICABLE", "nan"],
    "blue_o_points": [],
    "blue_x_points": [
      [0.00127, 1],
      [-5e-5, 2],
      [0.00063, 1],
      [-2e-5, 0],
      [-6e-5, 2],
      [0.00102, 1],
      [0.00089, 1]
    ]
  },
  "QS_mulGraftNerve[MC]": {
    "red_x_points": [
      [-0.0001, 2],
      [-0.00029, 0],
      [-0.00031, 0],
      [-0.00023, 0],
      [-0.00025, 0],
      [-0.00039, 0],
      [-0.00029, 0],
      [1e-5, 2],
      [-0.00034, 0],
      [-0.00018, 0],
      [-0.00024, 0],
      [-4e-5, 2],
      [0.00047, 1],
      [-5e-5, 2],
      [-0.00035, 0],
      [-0.00019, 2],
      [-0.00028, 0],
      [-0.00038, 0],
      [-4e-5, 2],
      [-4e-5, 2],
      [0.0, 2],
      [-0.00033, 0],
      [-7e-5, 2],
      [-8e-5, 2],
      [-5e-5, 2],
      [-0.00025, 0],
      [-2e-5, 2],
      [-0.00046, 0],
      [-2e-5, 2],
      [0.00027, 1],
      [-0.00038, 0]
    ],
    "red_o_points": [],
    "y_categories": ["N", "NOT APPLICABLE", "nan"],
    "blue_o_points": [],
    "blue_x_points": [
      [0.00094, 1],
      [2e-5, 2],
      [0.001, 1],
      [-2e-5, 0],
      [5e-5, 2],
      [0.00057, 1],
      [0.00076, 1]
    ]
  },
  "QA_yonPreOrtsurg": {
    "red_x_points": [
      [-0.00429, 0],
      [-0.00011, 2],
      [-3e-5, 0],
      [-0.00017, 0],
      [-0.00014, 0],
      [-2e-5, 0],
      [-7e-5, 0],
      [-0.00053, 2],
      [-9e-5, 0],
      [-6e-5, 0],
      [-0.0, 2],
      [0.00563, 1],
      [-0.00144, 0],
      [-0.00067, 2],
      [-0.00029, 0],
      [-0.00508, 0],
      [-0.00039, 1],
      [-0.0001, 0],
      [-0.00397, 0],
      [-0.00395, 0],
      [-0.00378, 0],
      [-6e-5, 0],
      [-0.00403, 0],
      [-0.00511, 0],
      [-0.00373, 0],
      [-0.0001, 2],
      [-0.00019, 2],
      [-6e-5, 0],
      [-0.00035, 2],
      [-0.00032, 2],
      [9e-5, 1]
    ],
    "red_o_points": [],
    "y_categories": ["N", "Y", "nan"],
    "blue_o_points": [],
    "blue_x_points": [
      [-9e-5, 0],
      [0.00246, 2],
      [-0.00011, 0],
      [-0.00033, 0],
      [0.01731, 1],
      [-0.00016, 0],
      [-0.00013, 0]
    ]
  },
  "QS_mulGraftNerve[Ra]": {
    "red_x_points": [
      [-0.00024, 2],
      [-0.00059, 0],
      [-0.00052, 0],
      [-0.00053, 0],
      [-0.0006, 0],
      [-0.00049, 0],
      [-0.00055, 0],
      [-0.00026, 2],
      [-0.00068, 0],
      [-0.00056, 0],
      [-0.00046, 0],
      [-0.00023, 2],
      [0.00105, 1],
      [-0.0003, 2],
      [-0.00071, 0],
      [-0.00027, 2],
      [-0.00056, 0],
      [-0.00047, 0],
      [-0.00026, 2],
      [-0.00017, 2],
      [-0.00019, 2],
      [-0.00057, 0],
      [-0.00029, 2],
      [-0.00019, 2],
      [-0.00025, 2],
      [-0.00047, 0],
      [-0.0002, 2],
      [-0.00037, 0],
      [-0.00021, 2],
      [0.00116, 1],
      [-0.00062, 0]
    ],
    "red_o_points": [],
    "y_categories": ["N", "NOT APPLICABLE", "nan"],
    "blue_o_points": [],
    "blue_x_points": [
      [0.00189, 1],
      [-0.00011, 2],
      [0.00148, 1],
      [-7e-5, 0],
      [-0.00013, 2],
      [0.00114, 1],
      [0.00167, 1]
    ]
  },
  "QS_mulTransfSite[Oberlin]": {
    "red_x_points": [
      [-0.00336, 3],
      [-0.00996, 0],
      [-0.01023, 0],
      [-0.00985, 0],
      [-0.00514, 2],
      [-0.00499, 2],
      [-0.00966, 0],
      [-0.00313, 3],
      [-0.00458, 2],
      [-0.00507, 2],
      [-0.00486, 2],
      [-0.00348, 3],
      [0.01716, 1],
      [-0.00299, 3],
      [-0.00448, 2],
      [-0.00345, 3],
      [-0.00944, 0],
      [-0.00492, 2],
      [-0.00303, 3],
      [-0.0034, 3],
      [-0.00317, 3],
      [-0.00959, 0],
      [-0.00347, 3],
      [-0.00298, 3],
      [-0.00324, 3],
      [-0.00472, 2],
      [-0.00315, 3],
      [-0.00961, 0],
      [-0.00289, 3],
      [0.01757, 1],
      [-0.00983, 0]
    ],
    "red_o_points": [],
    "y_categories": ["N", "NOT APPLICABLE", "Y", "nan"],
    "blue_o_points": [],
    "blue_x_points": [
      [0.02525, 1],
      [-0.00109, 3],
      [0.01743, 1],
      [-0.0002, 2],
      [-0.00109, 3],
      [0.01806, 1],
      [0.01944, 1]
    ]
  },
  "QS_mulGraftNerve[Ssr]": {
    "red_x_points": [
      [-1e-5, 2],
      [-1e-5, 0],
      [-1e-5, 0],
      [-1e-5, 0],
      [-1e-5, 0],
      [-1e-5, 0],
      [-1e-5, 2],
      [-1e-5, 2],
      [-1e-5, 0],
      [-1e-5, 2],
      [-1e-5, 0],
      [-1e-5, 2],
      [-1e-5, 2],
      [-1e-5, 0],
      [-1e-5, 2],
      [-1e-5, 0]
    ],
    "red_o_points": [],
    "y_categories": ["N", "NOT APPLICABLE", "nan"],
    "blue_o_points": [],
    "blue_x_points": [[0.00019, 1]]
  },
  "QA_lstPexKine[Index]": {
    "red_x_points": [
      [-0.00144, 0],
      [-0.0004, 2],
      [-0.00058, 2],
      [-0.00029, 2],
      [9e-5, 1],
      [0.00042, 1],
      [-0.00127, 0],
      [0.00023, 2],
      [0.00043, 1],
      [0.00014, 1],
      [0.00038, 1],
      [-0.00038, 1],
      [-0.0001, 2],
      [0.00013, 2],
      [0.00038, 1],
      [5e-5, 2],
      [-0.00015, 2],
      [0.0002, 1],
      [-0.00011, 1],
      [-0.00071, 0],
      [-0.00014, 1],
      [-0.00044, 2],
      [0.00026, 2],
      [-0.00027, 1],
      [5e-5, 2],
      [-0.00056, 2],
      [-0.00031, 1],
      [-0.00013, 2],
      [-0.00027, 1],
      [-0.00011, 2],
      [-0.00061, 0]
    ],
    "red_o_points": [],
    "y_categories": ["NPV", "PV", "nan"],
    "blue_o_points": [],
    "blue_x_points": [
      [0.00015, 1],
      [0.00032, 2],
      [0.00024, 1],
      [0.00146, 1],
      [0.00041, 2],
      [0.00027, 1],
      [-0.0, 2]
    ]
  }
}
