{
  "development": {
    "username": "test",
    "password": "test",
    "database": "database_development",
    "host": "authdb",
    "dialect": "postgres",
    "define": {
      "paranoid": true,
      "underscored": false,
      "timestamps": false
    }
  },
  "test": {
    "username": "test",
    "password": "test",
    "database": "database_test",
    "host": "authdb",
    "dialect": "postgres",
    "define": {
      "paranoid": true,
      "underscored": false,
      "timestamps": false
    }
  },
  "production": {
    "username": "test",
    "password": null,
    "database": "database_production",
    "host": "127.0.0.1",
    "dialect": "postgres",
    "define": {
      "paranoid": true,
      "underscored": false,
      "timestamps": false
    }
  }
}
