module moderation

go 1.19

require github.com/segmentio/kafka-go v0.4.47

require (
	github.com/klauspost/compress v1.16.7 // indirect
	github.com/pierrec/lz4/v4 v4.1.18 // indirect
	github.com/stretchr/testify v1.8.4 // indirect
)
