[gd_scene load_steps=3 format=2]

[ext_resource path="res://GreenShip.tscn" type="PackedScene" id=1]
[ext_resource path="res://SnowPlatform.tscn" type="PackedScene" id=2]

[node name="Node2D" type="Node2D"]
position = Vector2( 35.0779, 564.54 )

[node name="GreenShip" parent="." instance=ExtResource( 1 )]
position = Vector2( 28.2739, -475.542 )

[node name="Platform" type="Node2D" parent="."]

[node name="SnowPlatform" parent="Platform" instance=ExtResource( 2 )]

[node name="SnowPlatform2" parent="Platform" instance=ExtResource( 2 )]
position = Vector2( 69.9048, 0 )
