[gd_scene load_steps=6 format=2]

[ext_resource path="res://Assets/kenney_platformerpack/PNG/Backgrounds/colored_grass.png" type="Texture" id=1]
[ext_resource path="res://Scenes/Player.tscn" type="PackedScene" id=2]
[ext_resource path="res://Grass.tres" type="TileSet" id=3]
[ext_resource path="res://Scenes/Area Trigger.tscn" type="PackedScene" id=4]
[ext_resource path="res://Assets/Familiar Looking Rocket.png" type="Texture" id=5]

[node name="Level 1" type="Node2D"]

[node name="ParallaxBackground" type="ParallaxBackground" parent="."]

[node name="ParallaxLayer" type="ParallaxLayer" parent="ParallaxBackground"]
motion_scale = Vector2( 0.5, 0.5 )

[node name="Sprite2" type="Sprite" parent="ParallaxBackground/ParallaxLayer"]
position = Vector2( 2144.02, 268.006 )
texture = ExtResource( 1 )
region_enabled = true
region_rect = Rect2( 0, -1000, 5056, 1000 )

[node name="Player" parent="." instance=ExtResource( 2 )]
position = Vector2( 40.7235, 469.495 )
speed = 300

[node name="TileMap" type="TileMap" parent="."]
scale = Vector2( 0.5, 0.5 )
tile_set = ExtResource( 3 )
cell_size = Vector2( 128, 128 )
format = 1
tile_data = PoolIntArray( 131112, 0, 3, 131113, 0, 65543, 131114, 0, 65543, 131115, 0, 65543, 131116, 0, 4, 196641, 0, 65541, 196642, 0, 65543, 196643, 0, 65543, 196644, 0, 65543, 196645, 0, 65543, 196646, 0, 65543, 262176, 0, 65541, 262177, 0, 8, 262178, 0, 1, 262179, 0, 1, 262180, 0, 1, 262181, 0, 1, 262182, 0, 1, 327711, 0, 65541, 327712, 0, 8, 327713, 0, 1, 327714, 0, 1, 327715, 0, 1, 327716, 0, 1, 327717, 0, 1, 327718, 0, 1, 327748, 0, 65543, 327749, 0, 65543, 327750, 0, 65543, 327751, 0, 65543, 327752, 0, 65543, 458746, 0, 65543, 458747, 0, 65543, 458748, 0, 65543, 458749, 0, 65543, 458750, 0, 65543, 458751, 0, 65543, 393246, 0, 65541, 393247, 0, 8, 393248, 0, 1, 393249, 0, 1, 393250, 0, 1, 393251, 0, 1, 393252, 0, 1, 393253, 0, 1, 393254, 0, 1, 393284, 0, 1, 393285, 0, 1, 393286, 0, 1, 393287, 0, 1, 393288, 0, 1, 524282, 0, 1, 524283, 0, 1, 524284, 0, 1, 524285, 0, 1, 524286, 0, 1, 524287, 0, 1, 458766, 0, 65537, 458767, 0, 65539, 458781, 0, 65541, 458782, 0, 8, 458783, 0, 1, 458784, 0, 1, 458785, 0, 1, 458786, 0, 1, 458787, 0, 1, 458788, 0, 1, 458789, 0, 1, 458790, 0, 1, 458820, 0, 1, 458821, 0, 1, 458822, 0, 1, 458823, 0, 1, 458824, 0, 1, 589818, 0, 1, 589819, 0, 1, 589820, 0, 1, 589821, 0, 1, 589822, 0, 1, 589823, 0, 1, 524288, 0, 65543, 524289, 0, 65543, 524290, 0, 65543, 524291, 0, 65543, 524292, 0, 65543, 524293, 0, 65543, 524294, 0, 65543, 524295, 0, 65543, 524296, 0, 65543, 524297, 0, 65543, 524298, 0, 65543, 524299, 0, 65543, 524300, 0, 65543, 524305, 0, 65543, 524306, 0, 65543, 524307, 0, 65543, 524308, 0, 65543, 524309, 0, 65543, 524310, 0, 65543, 524311, 0, 65543, 524312, 0, 65543, 524313, 0, 65543, 524314, 0, 65543, 524315, 0, 65543, 524316, 0, 65543, 524317, 0, 8, 524318, 0, 1, 524319, 0, 1, 524320, 0, 1, 524321, 0, 1, 524322, 0, 1, 524323, 0, 1, 524324, 0, 1, 524325, 0, 1, 524326, 0, 1, 524334, 0, 65543, 524337, 0, 5, 524338, 0, 65543, 524339, 0, 6, 524347, 0, 65541, 524348, 0, 65543, 524349, 0, 65543, 524350, 0, 65543, 524351, 0, 65543, 524352, 0, 65543, 524353, 0, 65543, 524354, 0, 65543, 524355, 0, 65543, 524356, 0, 1, 524357, 0, 1, 524358, 0, 1, 524359, 0, 1, 524360, 0, 1, 655354, 0, 1, 655355, 0, 1, 655356, 0, 1, 655357, 0, 1, 655358, 0, 1, 655359, 0, 1, 589824, 0, 1, 589825, 0, 1, 589826, 0, 1, 589827, 0, 1, 589828, 0, 1, 589829, 0, 1, 589830, 0, 1, 589831, 0, 1, 589832, 0, 1, 589833, 0, 1, 589834, 0, 1, 589835, 0, 1, 589836, 0, 1, 589841, 0, 1, 589842, 0, 1, 589843, 0, 1, 589844, 0, 1, 589845, 0, 1, 589846, 0, 1, 589847, 0, 1, 589848, 0, 1, 589849, 0, 1, 589850, 0, 1, 589851, 0, 1, 589852, 0, 1, 589853, 0, 1, 589854, 0, 1, 589855, 0, 1, 589856, 0, 1, 589857, 0, 1, 589858, 0, 1, 589859, 0, 1, 589860, 0, 1, 589861, 0, 1, 589862, 0, 1, 589870, 0, 1, 589878, 0, 65543, 589879, 0, 65543, 589880, 0, 65543, 589881, 0, 65543, 589882, 0, 65543, 589883, 0, 8, 589884, 0, 1, 589885, 0, 1, 589886, 0, 1, 589887, 0, 1, 589888, 0, 1, 589889, 0, 1, 589890, 0, 1, 589891, 0, 1, 589892, 0, 1, 589893, 0, 1, 589894, 0, 1, 589895, 0, 1, 589896, 0, 1, 720890, 0, 1, 720891, 0, 1, 720892, 0, 1, 720893, 0, 1, 720894, 0, 1, 720895, 0, 1, 655360, 0, 1, 655361, 0, 1, 655362, 0, 1, 655363, 0, 1, 655364, 0, 1, 655365, 0, 1, 655366, 0, 1, 655367, 0, 1, 655368, 0, 1, 655369, 0, 1, 655370, 0, 1, 655371, 0, 1, 655372, 0, 1, 655377, 0, 1, 655378, 0, 1, 655379, 0, 1, 655380, 0, 1, 655381, 0, 1, 655382, 0, 1, 655383, 0, 1, 655384, 0, 1, 655385, 0, 1, 655386, 0, 1, 655387, 0, 1, 655388, 0, 1, 655389, 0, 1, 655390, 0, 1, 655391, 0, 1, 655392, 0, 1, 655393, 0, 1, 655394, 0, 1, 655395, 0, 1, 655396, 0, 1, 655397, 0, 1, 655398, 0, 1, 655406, 0, 1, 655414, 0, 1, 655415, 0, 1, 655416, 0, 1, 655417, 0, 1, 655418, 0, 1, 655419, 0, 1, 655420, 0, 1, 655421, 0, 1, 655422, 0, 1, 655423, 0, 1, 655424, 0, 1, 655425, 0, 1, 655426, 0, 1, 655427, 0, 1, 655428, 0, 1, 655429, 0, 1, 655430, 0, 1, 655431, 0, 1, 655432, 0, 1, 786426, 0, 1, 786427, 0, 1, 786428, 0, 1, 786429, 0, 1, 786430, 0, 1, 786431, 0, 1, 720896, 0, 1, 720897, 0, 1, 720898, 0, 1, 720899, 0, 1, 720900, 0, 1, 720901, 0, 1, 720902, 0, 1, 720903, 0, 1, 720904, 0, 1, 720905, 0, 1, 720906, 0, 1, 720907, 0, 1, 720908, 0, 1, 720913, 0, 1, 720914, 0, 1, 720915, 0, 1, 720916, 0, 1, 720917, 0, 1, 720918, 0, 1, 720919, 0, 1, 720920, 0, 1, 720921, 0, 1, 720922, 0, 1, 720923, 0, 1, 720924, 0, 1, 720925, 0, 1, 720926, 0, 1, 720927, 0, 1, 720928, 0, 1, 720929, 0, 1, 720930, 0, 1, 720931, 0, 1, 720932, 0, 1, 720933, 0, 1, 720934, 0, 1, 720942, 0, 1, 720950, 0, 1, 720951, 0, 1, 720952, 0, 1, 720953, 0, 1, 720954, 0, 1, 720955, 0, 1, 720956, 0, 1, 720957, 0, 1, 720958, 0, 1, 720959, 0, 1, 720960, 0, 1, 720961, 0, 1, 720962, 0, 1, 720963, 0, 1, 720964, 0, 1, 720965, 0, 1, 720966, 0, 1, 720967, 0, 1, 720968, 0, 1 )

[node name="Area Trigger" parent="TileMap" instance=ExtResource( 4 )]
position = Vector2( 3520.23, 1461.43 )
scale = Vector2( 518.581, -7.31648 )

[node name="Sprite" type="Sprite" parent="."]
position = Vector2( 4191.81, 272.191 )
texture = ExtResource( 5 )

[node name="Area Trigger" parent="." instance=ExtResource( 4 )]
position = Vector2( 4190.02, 306.452 )
scale = Vector2( 11.3349, -20.499 )
sceneName = "Level 2"
